##TITLE=AC1726_NAREH15012_9208142_ozFpGt1lUM
##JCAMPDX= 6.0         $$ Bruker NMR JCAMP-DX V2.0
##DATA TYPE= NMR SPECTRUM
##DATA CLASS= NTUPLES
##ORIGIN= BRUKER
##OWNER= Administrator
$$ 1.72 TOPSPIN		Version 2.1
$$ 2015-06-01 22:52:37.889 -0700  Administrator@X
$$ Compression mode = diff/dup
##.OBSERVE FREQUENCY= 400.02188249412
##.OBSERVE NUCLEUS= ^1H
##.ACQUISITION MODE= SIMULTANEOUS (DQD)
##.ACQUISITION SCHEME= undefined
##.AVERAGES= 8
##.DIGITISER RES= 22
##SPECTROMETER/DATA SYSTEM= spect
##.PULSE SEQUENCE= zg30
##.SOLVENT NAME= COFFEE_meoh
##.SHIFT REFERENCE= INTERNAL, COFFEE_meoh, 1, 14.98509
##AUDIT TRAIL= $$ (NUMBER, WHEN, WHO, WHERE, PROCESS, VERSION, WHAT)
$$ ##TITLE= Audit trail, TOPSPIN		Version 2.1
$$ ##JCAMPDX= 5.01
$$ ##ORIGIN= Bruker BioSpin GmbH
$$ ##OWNER= Administrator
$$ $$ E:\/data/COFFEE/nmr/AC1726_NAREH15012_9208142_ozFpGt1lUM/10/pdata/1/auditp.txt
$$ ##AUDIT TRAIL=  $$ (NUMBER, WHEN, WHO, WHERE, PROCESS, VERSION, WHAT)
(   1,<2015-06-01 22:52:30.764 -0700>,<Administrator>,<X>,<go>,<TOPSPIN 2.1>,
      <created by zg
	started at 2015-06-01 22:51:24.576 -0700,
	POWCHK enabled, PULCHK disabled,
       configuration hash MD5:
       21 0F 79 D6 B3 7B B4 F6 88 20 88 DB 03 48 BD 9F
       data hash MD5: 64K
       37 BD D9 DC 09 7D 58 19 D4 B6 BA 9A A9 CE 67 E7>)
(   2,<2015-06-01 22:52:33.842 -0700>,<Administrator>,<X>,<proc1d>,<TOPSPIN 2.1>,
      <Start of raw data processing
       efp LB = 0 FT_mod = 6 PKNL = 1 PHC0 = 0 PHC1 = 0 SI = 32K 
       data hash MD5: 32K
       D6 D5 DA CC 19 33 F8 AB AD 2B D2 F0 F7 11 1E 5E>)
(   3,<2015-06-01 22:52:34.123 -0700>,<Administrator>,<X>,<proc1d>,<TOPSPIN 2.1>,
      <pk PHC0 = 90.53284 PHC1 = 0 
       data hash MD5: 32K
       8E 08 A4 43 94 80 DB 23 0D 99 26 81 C8 0C E4 96>)
(   4,<2015-06-01 22:52:34.248 -0700>,<Administrator>,<X>,<proc1d>,<TOPSPIN 2.1>,
      <abs ABSG = 1 
       data hash MD5: 32K
       DD E5 EB 75 A2 35 EC D4 04 7E 74 FE 9C 24 39 95>)
(   5,<2015-06-01 22:52:34.311 -0700>,<Administrator>,<X>,<proc1d>,<TOPSPIN 2.1>,
      <abs ABSG = 2 
       data hash MD5: 32K
       44 36 C8 D0 F5 16 C9 1F BE 16 86 29 7B B9 24 4A>)
(   6,<2015-06-01 22:52:34.373 -0700>,<Administrator>,<X>,<proc1d>,<TOPSPIN 2.1>,
      <abs ABSG = 3 
       data hash MD5: 32K
       C9 FC 9E 81 C8 CB CA 8A 4D 5A CD 9E 4E 5C E8 23>)
(   7,<2015-06-01 22:52:34.436 -0700>,<Administrator>,<X>,<proc1d>,<TOPSPIN 2.1>,
      <abs ABSG = 4 
       data hash MD5: 32K
       44 BB 78 C1 37 48 E4 05 4C 07 96 6D 1C 78 26 18>)
(   8,<2015-06-01 22:52:34.498 -0700>,<Administrator>,<X>,<proc1d>,<TOPSPIN 2.1>,
      <abs ABSG = 5 
       data hash MD5: 32K
       DF 68 EF 63 8B A4 FF 9F 67 6C 48 C4 2A 87 B8 66>)
$$ ##END=
$$ 
$$ $$ hash MD5
$$ $$ 9E D0 9E D8 6C 0B 6D A4 BA 19 7F D7 8B 5B 7A 58
##$RELAX= 
##$RELAX= 
##$RELAX= 
##$RELAX= 
##$RELAX= 
##$RELAX= 
##$RELAX= 
$$ Bruker specific parameters
$$ --------------------------
##$DU= <E:\>
##$EXPNO= 10
##$NAME= <AC1726_NAREH15012_9208142_ozFpGt1lUM>
$$ [...]
150 150 150 150 150 150 150 150
##$TP07= 0
##$TPNAME0= <>
##$TPNAME1= <>
##$TPNAME2= <>
##$TPNAME3= <>
##$TPNAME4= <>
##$TPNAME5= <>
##$TPNAME6= <>
##$TPNAME7= <>
##$TPOAL= (0..7)
0.5 0.5 0.5 0.5 0.5 0.5 0.5 0.5
##$TPOFFS= (0..7)
0 0 0 0 0 0 0 0
##$TUNHIN= 0
##$TUNHOUT= 0
##$TUNXOUT= 0
##$USERA1= <user>
##$USERA2= <user>
##$USERA3= <user>
##$USERA4= <user>
##$USERA5= <user>
##$V9= 5
##$VALIST= <valist>
##$VCLIST= <CCCCCCCCCCCCCCC>
##$VD= 0
##$VDLIST= <DDDDDDDDDDDDDDD>
##$VPLIST= <PPPPPPPPPPPPPPP>
##$VTLIST= <TTTTTTTTTTTTTTT>
##$WBST= 2048
##$WBSW= 25
##$XGAIN= (0..3)
0 0 0 0
##$XL= 0
##$YL= 0
##$YMAX_a= 597840
##$YMIN_a= -512986
##$ZGOPTNS= <>
##$ZL1= 120
##$ZL2= 120
##$ZL3= 120
##$ZL4= 120
##$ABSF1= 14.98509
##$ABSF2= -5.573092
##$ABSG= 5
##$ABSL= 3
##$ALPHA= 0
##$AQORDER= 0
##$ASSFAC= 0
##$ASSFACI= 0
##$ASSFACX= 0
##$ASSWID= 0
##$AUNMP= <proc_prof1d_extract_pilot.lims>
##$AXLEFT= 0
##$AXNAME= <>
##$AXNUC= <1H>
##$AXRIGHT= 0
##$AXTYPE= 0
##$AXUNIT= <>
##$AZFE= 0.1
##$AZFW= 0.1
##$BCFW= 0
##$BC_mod= 0
##$BYTORDP= 0
##$COROFFS= 0
##$CY= 15
##$DATMOD= 1
##$DC= 0
##$DFILT= <>
##$DTYPP= 0
##$F1P= 0
##$F2P= 0
##$FCOR= 0.5
##$FTSIZE= 32768
##$FT_mod= 6
##$GAMMA= 0
##$GB= 0
##$INTBC= 1
##$INTSCL= 1
##$ISEN= 128
##$LB= 0
##$LEV0= 0
##$LPBIN= 0
##$MAXI= 10000
##$MC2= 0
##$MEAN= 0
##$ME_mod= 0
##$MI= 0
##$NCOEF= 0
##$NC_proc= -8
##$NLEV= 6
##$NOISF1= 0
##$NOISF2= 0
##$NSP= 0
##$NTH_PI= 0
##$NZP= 0
##$OFFSET= 14.98509
##$PC= 1
##$PHC0= 90.53284
##$PHC1= 0
##$PH_mod= 1
##$PKNL= yes
##$PPARMOD= 0
##$PPDIAG= 0
##$PPIPTYP= 0
##$PPMPNUM= 2147483647
##$PPRESOL= 1
##$PSCAL= 4
##$PSIGN= 0
##$PYNMP= <proc.py>
##$REVERSE= no
##$SF= 400.02
##$SI= 32768
##$SIGF1= 0
##$SIGF2= 0
##$SINO= 400
##$SIOLD= 32768
##$SPECTYP= <>
##$SREGLST= <1H.CDCl3>
##$SSB= 0
##$STSI= 32768
##$STSR= 0
##$SW_p= 8223.68421052631
##$SYMM= 0
##$S_DEV= 0
##$TDeff= 65536
##$TDoff= 0
##$TI= <>
##$TILT= no
##$TM1= 0
##$TM2= 0
##$TOPLEV= 0
##$USERP1= <user>
##$USERP2= <user>
##$USERP3= <user>
##$USERP4= <user>
##$USERP5= <user>
##$WDW= 1
##$XDIM= 32768
##$YMAX_p= 435126641
##$YMIN_p= -672836
##$CURPLOT= <Network HP LaserJet P1505>
##$CURPRIN= <$Network HP LaserJet P1505>
##$DFORMAT= <normdp>
##$LAYOUT= <+/1D_H.xwp>
##$LFORMAT= <normlp>
##$PFORMAT= <normpl>
##$SURQMSG= 1
$$ End of Bruker specific parameters
$$ ---------------------------------
##NTUPLES= NMR SPECTRUM
##VAR_NAME=  FREQUENCY,     SPECTRUM/REAL,   SPECTRUM/IMAG
##SYMBOL=    X,             R,               I
##VAR_TYPE=  INDEPENDENT,   DEPENDENT,       DEPENDENT
##VAR_FORM=  AFFN,          ASDF,            ASDF
##VAR_DIM=   32768,         32768,           32768
##UNITS=     HZ,            ARBITRARY UNITS, ARBITRARY UNITS
##FACTOR=    0.250966925370066, 1,           1
##FIRST=     8223.43324360094, 6848,         -158694
##LAST=      0,             21061,           -206367
##MIN=       0,             -672836,         0
##MAX=       8223.43324360094, 435126641,    0
$$ Real data points
##PAGE= N=1
##DATA TABLE= (X++(R..R)), XYDATA
$$ [...]
19564a73689M409L5767e9030F9481h0963A05612d7109m950j4769A81731a41926
$$ -173689 -169280 -133513 -59030 69481 -80963 105612 -47109 -52059 -66828 181731 -141926
19552I4117J87497b57968j249K8175H1131d0432K067C46857h2719c8859B87671
$$ 94117 281614 -257968 -259217 -231042 81131 -40432 -38365 346857 -82719 -38859 287671
19540D1646K00254b77868P8590b3184E8602M2040b250r8333C4831a07936A22405
$$ 41646 241900 -277868 -199278 -23184 58602 100642 -2250 -100583 34831 -107936 122405
19528G8170a46916A51159c9672j08332b1142m81493a47591j05445K8983M5423
$$ 78170 -146916 151159 -39672 -148004 -21142 -502635 -147591 -253036 -224053 -178630
19518a78630A80062k3422b42686A74908a84395h9417D028K38896p3752k0119F772
$$ -178630 180062 156640 -242686 174908 -184395 -89417 4028 242924 169172 149053 6772
19506B38139a07001j0326B07402D9954b29543d3399j95896J08540o2931K2394
$$ 238139 -107001 -117327 207402 49954 -229543 -43399 -239295 -130755 -193686 -171292
19496a71292e2641I8756P0520a61863e2278A62089Q954a8891B17303a99474f4018
$$ -171292 -52641 98756 169276 -161863 -52278 162089 171043 -18891 217303 -199474 -64018
19484A17407a4032H1464h285B58197A10219a60399N8251A38806R3112b84131m5445
$$ 117407 -14032 81464 -8285 258197 110219 -160399 -102148 138806 231918 -284131 -329576
19473c29576g8440A53003b20377D279a43295L3403B35256d94721C80706A84329
$$ -329576 -78440 153003 -220377 4279 -143295 -109892 235256 -494721 380706 184329
19462h5791B03991p5254c68393J27480C847a5949j35275j5396j25488A24630K36392
$$ -85791 203991 128737 -368393 -240913 3847 -15949 -151224 -166620 -292108 124630 361022
19451C61022J02139a0225c974j28990q1105B16498n8702l8816g5464C8727R6473
$$ 361022 463161 -10225 -3974 -132964 -214069 216498 157796 118980 -75464 38727 135200
19440A35200a44643G8861Q2006a36522A21226h6021K9794I4917k6840a05277M6174
$$ 135200 -144643 78861 160867 -136522 121226 -86021 -56227 94917 68077 -105277 -59103
19429e9103F0594b66021B9584b18080F760i9668j69045d5073C1511J07807o4828
$$ -59103 60594 -266021 29584 -218080 6760 -99668 -268713 -45073 31511 139318 74490
19418G4490a44624K7392o4070f6572H4277e08967a87595A50691f7848A85648a44836
$$ 74490 -144624 -117232 -181302 -66572 84277 -508967 -187595 150691 -67848 185648 -144836
19406a33160B29983h8014j61710O4038l4928b8586C3324d0543B04302N4678b83451
$$ -133160 229983 -88014 -249724 -185686 -220614 -28586 33324 -40543 204302 258980 -283451
19394A72048e6880k18162J21726A40612c17079A59322P7608j03092E8828a75866
$$ 172048 -56880 -275042 -153316 140612 -317079 159322 236930 133838 58828 -175866
19383b80097h0247a583k87225R051J9582r4868a49042e8023A77593C3231a36152
$$ -280097 -80247 -1583 -288808 -279757 -260175 -355043 -149042 -58023 177593 33231 -136152
19371g1242L4791f355j13696r428A27548b3593j66571P99K1644A04744c17181
$$ -71242 -36451 -6355 -120051 -129479 127548 -23593 -190164 -189365 -167721 104744 -317181
19359b05471A40840a61036e3098A36689b0625m0647F3990d2467m956C2781d6112
$$ -205471 140840 -161036 -53098 136689 -20625 -61272 63990 -42467 -47423 32781 -46112
19347c9301K95o3903B543a41353M7782C0192e474A36348f051D3507c40414a37736
$$ -39301 -39006 -102909 2543 -141353 -93571 30192 -5474 136348 -6051 43507 -340414 -137736
19334a03963F8729L8451A8658b18948P0896A35345B4475h732j35248M0562j05357
$$ -103963 68729 107180 18658 -218948 -148052 135345 24475 -8732 -143980 -103418 -208775
19323b08775g8755Q951j73818J03049K0169k50470h4687r7307g3247q3800K6223
$$ -208775 -78755 -69804 -243622 -140573 -120404 -370874 -84687 -181994 -73247 -157047 -130824
19312a30824F8993d09899A57539N7934G9194B7955a26949D814a05222B0561a78449
$$ -130824 68993 -409899 157539 215473 79194 27955 -126949 4814 -105222 20561 -178449
19300i2890M4300I8527R8376I7561g8761J2138B26184c15483d1442A11475b8952
$$ -92890 -48590 98527 196903 97561 -78761 -66623 226184 -315483 -41442 111475 -28952
19288I6175M1543c526j20585A05155F012a28681c172k96061G5049J28482J00651
$$ 96175 137718 -3526 -124111 105155 6012 -128681 -3172 -299233 75049 203531 304182
19277C04182C5863b17759F4056a13197A72039c29293h2822j68359B20008a55843
$$ 304182 35863 -217759 64056 -113197 172039 -329293 -82822 -251181 220008 -155843
19266a22178E8083k8489d66576i1125j11238A80868g3781r2246M42J1238M1463
$$ -122178 58083 29594 -466576 -91125 -202363 180868 -73781 -166027 -165585 -154347 -112884
19255a12884E1293b55413M4763h5319r6832f4659B1070a4895j87172D6124b54949
$$ -112884 51293 -255413 -210650 -85319 -182151 -64659 21070 -14895 -202067 46124 -254949
19243A1216b49600C7212L0257a48666P680a2488j22324d1916A40468J7927c0757
$$ 11216 -249600 37212 67469 -148666 -140986 -12488 -134812 -41916 140468 158395 -30757
19231b37219i2936B69209C4677b26830d81A45286O545B9254a79466K8129A1938
$$ -237219 -92936 269209 34677 -226830 -481 145286 151831 29254 -179466 -151337 11938
19219A77899p1869E2614d18007J75490G1876b63732C28051C4828c7661r3796J0496
$$ 177899 106030 52614 -418007 -242517 71876 -263732 328051 34828 -37661 -131457 -120961
19208a20961c2435D9585a75190N4163a429C18631e4845j78995n4796l32276g9905
$$ -120961 -32435 49585 -175190 -121027 -1429 318631 -54845 -233840 -288636 -620912 -79905
19196B4496b62374b7929C41205d715F1486a79255O6387C88915a42200F205J81461
$$ 24496 -262374 -27929 341205 -4715 61486 -179255 -112868 388915 -142200 6205 187666
19185A87666a8305C14461c63497J43886A43797e0696p0290j754G6813A0490c34041
$$ 187666 -18305 314461 -363497 -219611 143797 -50696 -120986 -122740 76813 10490 -334041
19173c3938l5918j39541A21324a16088G7803M2437b0311I9806m4349a30907j23984
$$ -33938 -69856 -209397 121324 -116088 77803 120240 -20311 99806 55457 -130907 -254891
19162b54891B52217b3599o0164l3117K430N1949n13521f8696B1957b71310D8995
$$ -254891 252217 -23599 -83763 -116880 -114450 -62501 -576022 -68696 21957 -271310 48995
19150B7609P7602A1389K97389j33326D5495J22716e1807k02422G3378c43304A10401
$$ 27609 105211 11389 308778 175452 45495 168211 -51807 -254229 73378 -343304 110401
19138a66427H3746b55825J06549a6000H2768J12223G7559b7923J1609q9431O941
$$ -166427 83746 -255825 -149276 -16000 82768 194991 77559 -27923 -16314 -105745 -98804
19127i8804p0645j09797n7172e7990A03480b8662l89443J64073P309b9889k5789
$$ -98804 -169449 -279246 -336418 -57990 103480 -28662 -418105 -254032 -246723 -29889 -55678
19116e5678o0937m088A63431J29670E1300h5245j59178O9416F4084b46142i0664
$$ -55678 -116615 -120703 163431 293101 51300 -85245 -244423 -175007 64084 -246142 -90664
19104c4420j90099A5302a47014k6473A3802a89239a4546I6007k2160b85660J27078
$$ -34420 -224519 15302 -147014 -173487 13802 -189239 -14546 96007 73847 -285660 -158582
19093a58582c141C9010b03395Q8618G6113b9960r8981j18719R0083E4171L7327
$$ -158582 -3141 39010 -203395 -114777 76113 -29960 -128941 -247660 -157577 54171 91498
19082I1498a79018f8004J0205k09440H8370c03860G7226q349b4370j1398A48789
$$ 91498 -179018 -68004 -57799 -267239 88370 -303860 77226 68877 -24370 -35768 148789
19070c4805B00562a69747k40002B15499D408c06330I973K54322j04388A2675a87883
$$ -34805 200562 -169747 -409749 215499 4408 -306330 9973 264295 159907 12675 -187883
19058h6977A78909G0385a51144H053d6418a6207l4837n7002K2369o9866m2212
$$ -86977 178909 70385 -151144 8053 -46418 -16207 -51044 -108046 -85677 -155543 -197755
19047a97755L785Q0153D087J47576B2886c2476L434m2039L0290m7895A15700J84483
$$ -197755 -193970 -113817 4087 151663 22886 -32476 -29042 -71081 -40791 -88686 115700 300183
19035C00183i2161B23071l0704K4993j2085r0250i9671B3462L15000E7888M8084
$$ 300183 -92161 223071 192367 217360 205275 115025 -99671 23462 338462 57888 105972
19024A05972k3791a66075C60330a6746B11442h3104A88229a18160F6663b7168
$$ 105972 82181 -166075 360330 -16746 211442 -83104 188229 -118160 66663 -27168
19013a1754D1078a25564l7263m5569E6468b5607p7608H031b26703D0509L7650
$$ -11754 41078 -125564 -162827 -208396 56468 -25607 -103215 8031 -226703 40509 78159
19002G8159a98411p5110d7703j39962m3133R5094j73667A71h2869j77155i8139
$$ 78159 -198411 -273521 -47703 -187665 -230798 -135704 -309371 171 -82869 -260024 -98139
18990c6820j33488G5894h4612j84251C6526e8241B494N06862b01468b391r0625
$$ -36820 -170308 75894 -84612 -268863 36526 -58241 2494 509356 -201468 -2391 -93016
18979i3016K450h654j41085L4256j1822c256B34227a90916f1106k64241a6775
$$ -93016 -90566 -8654 -149739 -115483 -127305 -3256 234227 -190916 -61106 -325347 -16775
18967B84092A06488C7056R6401o3778b38355K6713e6496D9859h5005j61767A14293
$$ 284092 106488 37056 133457 69679 -238355 -211642 -56496 49859 -85005 -246772 114293
18955d16741B437b58189a25071K2732p1734j33958A51401e0160j29515D8399c08783
$$ -416741 2437 -258189 -125071 -102339 -174073 -308031 151401 -50160 -179675 48399 -308783
18943e2140j65661j05029R6738E8323a57379j24457a30690r9598g6160r0892O9903
$$ -52140 -217801 -322830 -226092 58323 -157379 -281836 -130690 -230288 -76160 -167052 -97149
18932i7149m6542A49345E4157M0811l027J42240p6238K4117f3603j36652g7196
$$ -97149 -143691 149345 54157 94968 91941 234181 157943 182060 -63603 -200255 -77196
18920A04069e1100F5679K4963b39316k2267A97713a19196d0387o6663B32399g5957
$$ 104069 -51100 65679 90642 -239316 -261583 197713 -119196 -40387 -107050 232399 -75957
18908b13404A17791b13247e5971j13926A59941f5464h900A92191A6132a95888
$$ -213404 117791 -213247 -55971 -169897 159941 -65464 -8900 192191 16132 -195888
18897h1572j48880b3616j65540F925a72574P9591l0481j36330A8423N4200j3719
$$ -81572 -230452 -23616 -189156 6925 -172574 -92983 -123464 -259794 18423 72623 58904
18886E8904J04618b22540A47448a33456H662L61389C3420b81381e9909A46016
$$ 58904 163522 -222540 147448 -133456 8662 370051 33420 -281381 -59909 146016
18875e05459A37796h2880p5360L9878k8543A87283J06239F3900L0a81288d9891
$$ -505459 137796 -82880 -158240 -118362 -146905 187283 293522 63900 63930 -181288 -49891
18863a08188m0780m6156I3043b53975b9597H6038c936B47286a64060A0958Q7210
$$ -108188 -148968 -195124 93043 -253975 -29597 86038 -3936 247286 -164060 10958 98168
18852I8168R856d0720B25634o1238P4624a39790o6500C07406a44740B40810e5391
$$ 98168 108024 -40720 225634 164396 239020 -139790 -206290 307406 -144740 240810 -55391
18840B2020a43086I2492b49657B8642L67877B467R1044L501b28156f7193o6962
$$ 22020 -143086 92492 -249657 28642 396519 2467 93511 97012 -228156 -67193 -134155
18829a34155j13861E8841Q1770K18297h9902A53053c09553H5491K4892a57789
$$ -134155 -248016 58841 140611 358908 -89902 153053 -309553 85491 110383 -157789
18818D5489J88558G6038a19016k05892C42412j59972G5144a75807D53571A02245
$$ 45489 234047 76038 -119016 -324908 342412 182440 75144 -175807 453571 102245
18807B62533b51079h8128m9359A20249J44943a06290C59964d3949r2739K3723
$$ 262533 -251079 -88128 -137487 120249 265192 -106290 359964 -43949 -136688 -112965
18797a12965B2451e1103F1341c80765d2155A82038a74475k6953j76115a42659
$$ -112965 22451 -51103 61341 -380765 -42155 182038 -174475 -201428 -377543 -142659
18786c11566D5555K38289b59436n5035a01483G124c3392k47923J07602b4613j79731
$$ -311566 45555 283844 -259436 -314471 -101483 7124 -33392 -281315 -173713 -24613 -204344
18775b04344B51495a29966I7621R15J71391b72201c0873F2182a62653G1204a66567
$$ -204344 251495 -129966 97621 98536 269927 -272201 -30873 62182 -162653 71204 -166567
18763D9971c19417a24084j19530A59039H387J05410a10827n5482N2486e2108B65090
$$ 49971 -319417 -124084 -243614 159039 8387 113797 -110827 -166309 -113823 -52108 265090
18751H9441a24976a8210B46544d8908k42579A83389c740A1631b8799H937a77377
$$ 89441 -124976 -18210 246544 -48908 -291487 183389 -3740 11631 -28799 8937 -177377
18739A80381c9415A0174a70043M6749p1392K3404A16549a30727e927M7m6420p1279
$$ 180381 -39415 10174 -170043 -123294 -194686 -171282 116549 -130727 -5927 -5880 -52300 -123579
18727a23579O1143n9145d0615A62192n9892i6047j24470m9463D3305L6278a92197
$$ -123579 -62436 -121581 -40615 162192 102300 -96047 -220517 -269980 43305 79583 -192197
18715A9513M04046b55851h5010A14982a77211g3486j7970j11346j39109b0804
$$ 19513 423559 -255851 -85010 114982 -177211 -73486 -91456 -202802 -341911 -20804
18704c14258B1141d06302e1390j1908J8956l43418d3838A03537a42260A36981
$$ -314258 21141 -406302 -51390 -63298 -44342 -387760 -43838 103537 -142260 136981
18693h2671I7969A7850f3369D2467a05972A01607E0575h9832M4711p7910k3142
$$ -82671 97969 17850 -63369 42467 -105972 101607 50575 -89832 -45121 -123031 -146173
18682a46173C19043g412o1555A58626b86197J14591m0402l699F585i7542j13165
$$ -146173 319043 -7412 -68967 158626 -286197 -171606 -212008 -215707 6585 -97542 -210707
18671b10707p0201G3023K31796b23031b3326m8953A13074A0856K5920a17559M1689
$$ -210707 -280908 73023 304819 -223031 -23326 -72279 113074 10856 36776 -117559 -75870
18660g5870o8853O1548l337l7295j54760a35890b5453o6173g668C69990a27910
$$ -75870 -144723 -83175 -86512 -123807 -278567 -135890 -25453 -91626 -7668 369990 -127910
18648i8318C07705A06764F213c1866B65970c35696B99344d03227a6381j39485
$$ -98318 307705 106764 6213 -31866 265970 -335696 299344 -403227 -16381 -155866
18638a55866L6497d2199C7626b95647h5357J170j2121p4423D59057a745m4838
$$ -155866 -119369 -42199 37626 -295647 -85357 -84187 -96308 -170731 459057 -1745 -46583
18627d6583B95621b0139j71820B66801b21142n3173D5298b02035E7565L28540
$$ -46583 295621 -20139 -191959 266801 -221142 -274315 45298 -202035 57565 386105
18617C86105a35406j1169K2049j99105f0151a8336j9743k41766O1944d4483j15253
$$ 386105 -135406 -146575 -124526 -323631 -60151 -18336 -38079 -279845 -217901 -44483 -159736
18606a59736C57810a13354m7020e6581j04773f0710J2584j95269h2966j24256
$$ -159736 357810 -113354 -160374 -56581 -161354 -60710 -48126 -243395 -82966 -207222
18596b07222H5011b74973D3408b58413b2968C9312b25467B5098a54112N2696j68993
$$ -207222 85011 -274973 43408 -258413 -22968 39312 -225467 25098 -154112 -101416 -270409
18585b70409d3597k7531k6420C49396c24826j6599F8402a92455G8725a64827N9193
$$ -270409 -43597 -71128 -97548 349396 -324826 -341425 68402 -192455 78725 -164827 -105634
18574a05634o7512J4013B14128r2398k2399g7467Q510j63737i3041k0844j24437
$$ -105634 -173146 -159133 214128 121730 99331 -77467 -68957 -232694 -93041 -113885 -238322
18563b38322F3621c12697a34003A57033f2777l2333M5225k05674l9482L1918d0452
$$ -238322 63621 -312697 -134003 157033 -62777 -95110 -49885 -255559 -295041 -263123 -40452
18551b30471g9703l98057A32723O760R4870j4170a88573G9532A8592b87096C2102
$$ -230471 -79703 -477760 132723 139483 234353 220183 -188573 79532 18592 -287096 32102
18539i2271B47907A0693f9088j61064P0621P1409j68107L8767a03551l7301K4085
$$ -92271 247907 10693 -69088 -230152 -159531 -88122 -256229 -217462 -103551 -140852 -116767
18528a16767C252K02860o7679c02610A70616C715a68867L2509O7070j37848i0970
$$ -116767 3252 206112 138433 -302610 170616 3715 -168867 -136358 -69288 -207136 -90970
18516c7400j82045B13087d6860a2736j66056a3952p3365G5326M4334a8730A14977
$$ -37400 -219445 213087 -46860 -12736 -178792 -13952 -87317 75326 119660 -18730 114977
18504E8692k1025d3981l14646g3557j6726C5159J31576j2927a66360j99588N5873
$$ 58692 37667 -43981 -358627 -73557 -90283 35159 166735 153808 -166360 -365948 -310075
18493c10075A4008b68770a4766A16229a45312G4387g7454A18318i4812A67605
$$ -310075 14008 -268770 -14766 116229 -145312 74387 -77454 118318 -94812 167605
18482i1779G4186a3160l6462J6272E2617a60128O03d2088o0139j44800a01417
$$ -91779 74186 -13160 -49622 -33350 52617 -160128 -159525 -42088 -102227 -247027 -101417
18470A90269i8985a5958A676c4627j92654Q0871E6566J88915c22893d3986I4382
$$ 190269 -98985 -15958 1676 -34627 -227281 -146410 56566 245481 -322893 -43986 94382
18458A12588D7054c12888i0313r9678A65495a19545k411b1425L499r6817l09706
$$ 112588 47054 -312888 -90313 -189991 165495 -119545 -121956 -21425 -17926 -114743 -424449
18447d24449a35965D2112g5335A99912a09654k88173C60934C6035O5328D5476
$$ -424449 -135965 42112 -75335 199912 -109654 -397827 360934 36035 101363 45476
18436b44946C9945R1105B4642a13955F8128f1455J5809C00019j43668a43894A20392
$$ -244946 39945 131050 24642 -113955 68128 -61455 -45646 300019 156351 -143894 120392
18424B6520O8504a88103p5953A01570b59374A25890J10759a81448B2046P2936
$$ 26520 95024 -188103 -264056 101570 -259374 125890 236649 -181448 22046 94982
18414I4982d409n1804n6831r2301R6182F605L930a6700k51675A6767N00044H3584
$$ 94982 -4409 -56213 -113044 -205345 -109163 6605 10535 -16700 -268375 16767 516811 83584
18401a09214P112a6452l22093A17954a31024M8826c6152a4757C0808a4166j47790
$$ -109214 -102102 -16452 -338545 117954 -131024 -82198 -36152 -14757 30808 -14166 -161956
18390a61956H4789K09800D703a64389I6389d13315a01139B7943b05873B09629
$$ -161956 84789 294589 4703 -164389 96389 -413315 -101139 27943 -205873 209629
18379a47378L2234B9953i6850l54872D3664d47661A0401a07044A78541E8666J93764
$$ -147378 -115144 29953 -96850 -451722 43664 -447661 10401 -107044 178541 58666 252430
18368B52430B6593J76888q5873D9878a83839b7612k62631c3103p0701L4127J3715
$$ 252430 26593 203481 117608 49878 -183839 -27612 -290243 -33103 -103804 -69677 -55962
18357e5962l85521A15883h4303l1315A11696f2238H4500J55654c4618k00253J13514
$$ -55962 -441483 115883 -84303 -115618 111696 -62238 84500 240154 -34618 -234871 -121357
18346a21357M6487j00812h7635G1574h7539B07851f6696o7656c4162o5728j6905
$$ -121357 -74870 -175682 -87635 71574 -87539 207851 -66696 -134352 -34162 -99890 -116795
18335a16795j79653a27315A01002g1125l0247I6095B6825h807C2656C260a79397
$$ -116795 -296448 -127315 101002 -71125 -101372 96095 26825 -8807 32656 3260 -179397
18323A63820g8054q9300H4619g3325A90122p9035i0519K5678b5411n9003F5900
$$ 163820 -78054 -167354 84619 -73325 190122 111087 -90519 -64841 -25411 -84414 65900
18311F5798g2040I0022p447j4368K10602a49207N1684q0094C18857d79896H2445
$$ 65798 -72040 90022 82575 68207 278809 -149207 -97523 -177617 318857 -479896 82445
18299A54190d9977l0773I7467a73656M9083L1993D051a46668F2730b29604J05677
$$ 154190 -49977 -80750 97467 -173656 -124573 -92580 4051 -146668 62730 -229604 -123927
18288a23927B91256c45726f0468j91364F42229j91379F4162c25244a10951B05393
$$ -123927 291256 -345726 -60468 -251832 642229 450850 64162 -325244 -110951 205393
18277a537n0730G7257d4821j89601e5541G6574a5387C25335H7330k5837a68373
$$ -1537 -52267 77257 -44821 -234422 -55541 76574 -15387 325335 87330 61493 -168373
18265e0492J920B11521g8077A10775g6070D3654O0417j5745N934b8958q6423B5771
$$ -50492 -48572 211521 -78077 110775 -76070 43654 104071 88326 94260 -28958 -115381 25771
18252B01678a59084g2298j9994q1275e8007p576l04800a59948P6920j73811B72149
$$ 201678 -159084 -72298 -92292 -173567 -58007 -65583 -370383 -159948 -83028 -256839 272149
18240D5192o407Q2130m2789a14812j52044g0246K5376D2993a05913A17502J31845
$$ 45192 38785 120915 78126 -114812 -266856 -70246 -44870 42993 -105913 117502 249347
18229B49347a66476D164J27443a33620N9812J2817j02391A11633L8209p0357N1747
$$ 249347 -166476 4164 131607 -133620 -73808 -60991 -163382 111633 149842 79485 131232
18218A31232J49906b2923A45287a07820m296A62569a99377c4477G9105f7300O489
$$ 131232 281138 -22923 145287 -107820 -112116 162569 -199377 -34477 79105 -67300 -60811
18207f0811a5074I7851f5395A6857K06824F856K06250B9979C060d7683j89079
$$ -60811 -15074 97851 -65395 16857 223681 6856 213106 29979 3060 -47683 -236762
18196b36762A43624b42450C5535a38702j19538B10080i1187l2156j7961k1102
$$ -236762 143624 -242450 35535 -138702 -258240 210080 -91187 -123343 -141304 -162406
18186a62406A5261i3485o6917A74585d1082j43430P2755k33487B05971k3986B5095
$$ -162406 15261 -93485 -160402 174585 -41082 -184512 -111757 -345244 205971 181985 25095
18174i0129A74424c15990a03192L1363a280k74388f9222k947B42494A05058k0592
$$ -90129 174424 -315990 -103192 -71829 -1280 -275668 -69222 -72169 242494 105058 84466
18163H4466F254O605R6997c31301g1233F5188R3978C1784B795b4944j57041K2024
$$ 84466 6254 12859 109856 -331301 -71233 65188 159166 31784 2795 -24944 -181985 -159961
18151a59961A31848J3087g2002k8097d8725j23418A53825b6289j09862E401b57596
$$ -159961 131848 144935 -72002 -100099 -48725 -172143 153825 -26289 -136151 5401 -257596
18139A79823j2781f3787L0894E91165a73738j35363a7385j73959f3808D7852a3937
$$ 179823 167042 -63787 -32893 591165 -173738 -309101 -17385 -191344 -63808 47852 -13937
18127A5302a55462I09b91926i7143n9628f8423d594B65080I3682b20027i91c09
$$ 15302 -155462 909 -291926 -97143 -156771 -68423 -4594 265080 93682 -220027 -991 -309
18114b19223c0300l4316o4654D06649A43870m2399j5734h87A22941M9440a03520
$$ -219223 -30300 -64616 -129270 406649 143870 101471 85737 -887 122941 172381 -103520
18102c57295A23031i5069Q358j5031f140n9671I7509K01796c6310H2912a50459
$$ -357295 123031 -95069 -86711 -101742 -6140 -65811 97509 299305 -36310 82912 -150459
18090g2403j01622P8349k40775e3057E2430R4094a68398K9547f4874I4551b78
$$ -72403 -174025 -95676 -336451 -53057 52430 146524 -168398 -138851 -64874 94551 -278
18078f0304o068C560J56819a28999F9709L9913c56431d4961A65258M1634d70907
$$ -60304 -66372 3560 160379 -128999 69709 109622 -356431 -44961 165258 206892 -470907
18066b49405k109B3455a19794K9132D01378f6086A98253L7065A6824b71899f5944
$$ -249405 -251514 23455 -119794 -90662 401378 -66086 198253 235318 16824 -271899 -65944
18054a44734f6304A05947a27036A77456E2389a26581A63692k7217l2958a03539
$$ -144734 -66304 105947 -127036 177456 52389 -126581 163692 136475 103517 -103539
18043a58674j34214J01362k9364Q2945B23257b80549a28456e6377D2783J63858
$$ -158674 -292888 -191526 -220890 -137945 223257 -280549 -128456 -56377 42783 206641
18033B06641K52593A285M006c4094q8983A2392a51094O2638B46956e6082B61904
$$ 206641 459234 1285 5291 -34094 -123077 12392 -151094 -88456 246956 -56082 261904
18021H0323f3822A37048C0869c74258c7661l4363A36564B6508a99682C68435a33700
$$ 80323 -63822 137048 30869 -374258 -37661 -72024 136564 26508 -199682 368435 -133700
18009f6564A47289E8060b85394A25021N4095i2353j69177M8009B94983r3380a26622
$$ -66564 147289 58060 -285394 125021 179116 -92353 -261530 -213521 294983 201603 -126622
17997A39700J13280b8885k80182B00987I6168M6385b00044g2647A69621a77171
$$ 139700 252980 -28885 -309067 200987 96168 142553 -200044 -72647 169621 -177171
17986E8061b77420A92542J74711a43189j01317K6138B39243K20265d2038j01549
$$ 58061 -277420 192542 367253 -143189 -244506 -218368 239243 459508 -42038 -143587
17976a43587B86930c42547J66576I444N4387M1480b71396a23382A1787a18027
$$ -143587 286930 -342547 -175971 9444 63831 105311 -271396 -123382 11787 -118027
17965a3878K877B35448E9412J3206J3472R2718M7553I4645j2165b65061A21899
$$ -13878 -11001 235448 59412 72618 86090 178808 226361 94645 82480 -265061 121899
17953A05980a05119B6439K2170A7908J5133a8753r7440b7236k12043h8896D5297
$$ 105980 -105119 26439 48609 17908 33041 -18753 -116193 -27236 -239279 -88896 45297
17941B09695c9441A37002N4362a75490M7042G563b72577i4684l8387A02078J84849
$$ 209695 -39441 137002 191364 -175490 -128448 7563 -272577 -94684 -133071 102078 286927
17930B86927f375A18318c5687j74851j16519r1108F5317f7540r0537F4349K09758
$$ 286927 -6375 118318 -35687 -210538 -327057 -418165 65317 -67540 -158077 64349 274107
17919B74107c38256B98940I6831b55481G059L12756A30132c24778D62039d71805
$$ 274107 -338256 298940 96831 -255481 7059 319815 130132 -324778 462039 -471805
17908F9070A2039a17698A99400o1754ra89521K1631h412A67060b22161A35458
$$ 69070 12039 -117698 199400 137646 137637 -189521 -167890 -8412 167060 -222161 135458
17896a35645A11312C0636f0764A09928j5394e826B61230B327h1821p1999A02551
$$ -135645 111312 30636 -60764 109928 94534 -5826 261230 2327 -81821 -153820 102551
17884A18786K29732a43244A96649b11155B44391a60595L7202N3933l3199k04838
$$ 118786 348518 -143244 196649 -211155 244391 -160595 -123393 -69460 -102659 -307497
17874c07497d7437j3202j49466c8873k40691m661A44295C8663a78617O9902M1481
$$ -307497 -47437 -60639 -210105 -38873 -279564 -284225 144295 38663 -178617 -108715 -67234
17863f7234A17893c58863A14354a60518k03512C39655b7038j42547A13832j9377
$$ -67234 117893 -358863 114354 -160518 -364030 339655 -27038 -169585 113832 94455
17853I4455a06157k287b8808j40142A8746h625G7710J45014d3773o7936O725A55631
$$ 94455 -106157 -108444 -28808 -168950 18746 -8625 77710 222724 -43773 -111709 -104984 155631
17840H9999K93682A65154o13b08957A10980a74778f5480A41146O6329N7387a87227
$$ 89999 383681 165154 164541 -208957 110980 -174778 -65480 141146 207475 264862 -187227
17828c23976a44709b216C5933K56419a77940c2541I5925a4669l2023E6480a34991
$$ -323976 -144709 -2216 35933 292352 -177940 -32541 95925 -14669 -46692 56480 -134991
17816A32520b21668d7809A44146a25787e3639j07417g3776K0449j6252j71645
$$ 132520 -221668 -47809 144146 -125787 -53639 -161056 -73776 -53327 -69579 -241224
17806b41224Q7297c4548j01260J7409b2572A43357j8037a04967A07381m4864J66507
$$ -241224 -153927 -34548 -135808 -118399 -22572 143357 125320 -104967 107381 62517 229024
17795B29024a77056f015A5541J66827P0110b01299D69078C8272g4144D7565L3901
$$ 229024 -177056 -6015 15541 182368 252478 -201299 469078 38272 -74144 47565 81466
17784H1466a10029k12475J59533d4067j88102A60408m832a43660j5537K4935B62142
$$ 81466 -110029 -322504 -162971 -44067 -232169 160408 155576 -143660 -159197 -134262 262142
17772b2266B12387J57718j32346J66819a19144N5937b0018l2881d574k27206D9056
$$ -22266 212387 370105 237759 404578 -119144 -63207 -20018 -52899 -4574 -231780 49056
17760i7258p9842G4736a33049A07305A0157K79976a56881B03300H0560d8281B10842
$$ -97258 -177100 74736 -133049 107305 10157 290133 -156881 203300 80560 -48281 210842
17748f5035a2485C0281a4644j32663J8762B0141h738l18622g800B9362J2627m337
$$ -65035 -12485 30281 -14644 -147307 -128545 20141 -8738 -327360 -7800 29362 41989 37652
17736C7652a47709H4430i9661l32028a73502B88222F6832a82160j00828D5261
$$ 37652 -147709 84430 -99661 -431689 -173502 288222 66832 -182160 -282988 45261
17725B50703a27804q3626D8672c40185A32400B4437A340a25292E3354J61488E553
$$ 250703 -127804 -211430 48672 -340185 132400 24437 1340 -125292 53354 214842 5553
17713f3166B4677a20932a5004A02215a54314L1512K1983L0873E5242e7489H4551
$$ -63166 24677 -120932 -15004 102215 -154314 -122802 -100819 -69946 55242 -57489 84551
17701A12114i8004B03628K5748a16686a0843A2034J04317i8697I4899a81895A02491
$$ 112114 -98004 203628 229376 -116686 -10843 12034 116351 -98697 94899 -181895 102491
17689d5493F3537K45173c831B33297a33238M1723o8090J4544m08798A22852J45833
$$ -45493 63537 308710 -3831 233297 -133238 -91515 -159605 -145061 -553859 122852 268685
17678B68685e0782j36262G2983L6867a02198C23966C8638a97437b2682I6360a61472
$$ 268685 -50782 -187044 72983 109850 -102198 323966 38638 -197437 -22682 96360 -161472
17666A09677M4125A7606a29982M1407B72424b47452P126J15751I2284O1409b43803
$$ 109677 153802 17606 -129982 -88575 272424 -247452 -240326 -124575 92284 153693 -243803
17654c4313j42747A06510a60615K837A13651a79197A1819O1407B4099f8051B92615
$$ -34313 -177060 106510 -160615 -157778 113651 -179197 11819 73226 24099 -68051 292615
17642i0998b1956B4359j2143f88A76980Q1065a9066I3366C0580m508b06480C23633
$$ -90998 -21956 24359 12216 -688 176980 258045 -19066 93366 30580 26072 -206480 323633
17629B86230r7087E3495C124K7262b1034j09236E1254a31150C06762c11562F9943
$$ 286230 189143 53495 3124 30386 -21034 -130270 51254 -131150 306762 -311562 69943
17617A27732k6484D5263a13323H3225r796F911a29911p3290g4938B23865a31366
$$ 127732 101248 45263 -113323 83225 73429 6911 -129911 -203201 -74938 223865 -131366
17605b80849A13584b18630C9204J16453c9083j31209j50395J02226A4573b605
$$ -280849 113584 -218630 39204 155657 -39083 -170292 -320687 -218461 14573 -2605
17594F4635P5802i9633b1302O43p2788E7647J85086J03219n8855B2214c00257
$$ 64635 140437 -99633 -21302 -20659 -93447 57647 242733 345952 287097 22214 -300257
17582A25273K8220A3979J67308i2881I2658J79246a93962P2409A546K76785j08098
$$ 125273 153493 13979 181287 -92881 92658 271904 -193962 -121553 1546 278331 170233
17571A70233i2001B24180q0545b04579B03183F7795A5808K00110m0090N0827O2545
$$ 170233 -92001 224180 143635 -204579 203183 67795 15808 215918 175828 226655 289200
17560B89200F2046K07745O3547j41345F8538j5497J42641a10288n85b4486A14445
$$ 289200 62046 269791 333338 191993 68538 53041 195682 -110288 -110873 -24486 114445
17548a07086a1508k87123C1657L34771a58755e1295G07K44716m1831H0940b8848
$$ -107086 -11508 -298631 31657 366428 -158755 -51295 707 245423 203592 80940 -28848
17536A98922I8843j4520J99555A19493A4262c32194i3269G8162P3364a29174p4137
$$ 198922 98843 84323 283878 119493 14262 -332194 -93269 78162 151526 -129174 -203311
17525b03311d2833I6716a45845J9151A63797p9255F031R8861g0357A25725J002
$$ -203311 -42833 96716 -145845 -126694 163797 84542 6031 104892 -70357 125725 126727
17514A26727F1319I152R2905l5251r943k6987K6506L24127A90107o5564M7020
$$ 126727 61319 9152 102057 66806 56863 29876 56382 380509 190107 124543 171563
17503A71563q0540J25873b2055j11765D4360b8600A20097n5386M0871M4392J09515
$$ 171563 91023 216896 -22055 -133820 44360 -28600 120097 64711 105582 149974 259489
17492B59489O0603I1208J15420i8780j31309h6417B6224K42482a61788i501B02768
$$ 259489 320092 91208 206628 -98780 -230089 -86417 26224 268706 -161788 -9501 202768
17480A88669K06368a8752A63414G8216b9686A0096N7465J2634C1547A3335g7287
$$ 188669 395037 -18752 163414 78216 -29686 10096 67561 80195 31547 13335 -77287
17468b4024B09104a52937B78238J89058D6020J5684p07J2600l0950J04720C8894
$$ -24024 209104 -152937 278238 467296 46020 61704 60997 73597 42647 147367 38894
17456d8459B01808f5241B96322d8107D10783J642c5201h007A35687J61200p7924
$$ -48459 201808 -65241 296322 -48107 410783 412425 -35201 -8007 135687 296887 218963
17445B18963K4253r7948K95375E3282J57745K09792B04162H4936J29726a65216
$$ 218963 243216 145268 440643 53282 211027 420819 204162 84936 214662 -165216
17434C14707J52247j73373r2313K27176A88837a85177B50124O9404B5790K24238
$$ 314707 466954 293581 201268 428444 188837 -185177 250124 319528 25790 250028
17424B50028M8732e5523C28892o6197M1565L3394f3351B97330A19752K41435f7374
$$ 250028 298760 -55523 328892 262695 304260 337654 -63351 297330 119752 361187 -67374
17412B74355q8988K78972A33738J59511q2606r6321M6120c8165A96250q5256J19228
$$ 274355 185367 464339 133738 293249 210643 114322 160442 -38165 196250 110994 230222
17401B30222o6614J8663l4764j3412c0402A69017F5347a68945B40531A00688J04703
$$ 230222 163608 182271 147507 134095 -30402 169017 65347 -168945 240531 100688 205391
17390B05391p4706J00111n664m8913R1317O9486J06342A24750q919l5336R3707
$$ 205391 130685 230796 225132 176219 267536 337022 443364 124750 115831 80495 174202
17379A74202a38208O5393A96710J12831G1849J96641N705P3392j59583a84174
$$ 174202 -138208 -72815 196710 309541 71849 268490 274195 347587 188004 -184174
17368B3098A674K70200f5554A43718h4789B62817P3878A8678P9237l8873M20312
$$ 23098 1674 271874 -65554 143718 -84789 262817 336695 18678 97915 59042 479354
17357D79354j85707a17695B84504C8847K3292f2485d489B56519p9065M776J56737
$$ 479354 293647 -117695 284504 38847 62139 -62485 -4489 256519 177454 182230 338967
17346C38967A56989l0131A3337e942E56055g9653C51300I3429C3554J65541K24622
$$ 338967 156989 126858 13337 -5942 556055 -79653 351300 93429 33554 199095 423717
17335D23717j69958A13875m9317J30145n7931J10809m9230O0171N760q1034J75306
$$ 423717 253759 113875 64558 194703 136772 247581 198351 258522 264282 183248 358554
17324C58554r3258a74144A35485n8236J00663b12917b3551A33942c8556j23754
$$ 358554 265296 -174144 135485 77249 177912 -212917 -23551 133942 -38556 -162310
17314a62310D1634e9454C1734K8797a34511B30404J59450e1921C14484A42249
$$ -162310 41634 -59454 31734 60531 -134511 230404 389854 -51921 314484 142249
17303F4204N3138j6900L70996a06340C99628j5307D1023L1570i6217D24156A17983
$$ 64204 117342 100442 471438 -106340 399628 384321 41023 72593 -96217 424156 117983
17291a02490K0089C27903c8030A78862a62519A76437D3772J87129O9026B7107
$$ -102490 -82401 327903 -38030 178862 -162519 176437 43772 230901 299927 27107
17280D49153A49130b514A21120n4809b47878F8369R7362J10910e8259A59783C2435
$$ 449153 149130 -2514 121120 66311 -247878 68369 165731 276641 -58259 159783 32435
17268C03734b4976A62669K24919j4467i1995D49536J41845B94614a6222A06593
$$ 303734 -24976 162669 387588 373121 -91995 449536 591381 294614 -16222 106593
17257E17568j83288K04828A30915k1860M38483k62547A8232K03079B2525M26213
$$ 517568 334280 539108 130915 109055 547538 284991 18232 221311 22525 448738
17247D48738j28271H4182P4690J0592a25844E4960Q8071N5594i2678G9889e8216
$$ 448738 320467 84182 158872 169464 -125844 54960 143031 198625 -92678 79889 -58216
17235B62977o672M00115F7567N4028J00430K4569A17748P4373N138b2289A15987
$$ 262977 256305 656420 67567 121595 222025 246594 117748 192121 197259 -22289 115987
17223B84466Q8058A77988R8192N3276j39612l6197A4897J6024J14329j9002j9509
$$ 284466 372524 177988 276180 329456 189844 153647 14897 30921 145250 126248 106739
17212A06739O1679e922D23941A1609N25624A06439K42771A70119N988m8306b0844
$$ 106739 168418 -5922 423941 11609 537233 106439 349210 170119 176107 127801 -20844
17200D05023j73470a48567A9811n373L83797m4885N355j42578O8474A15032K70268
$$ 405023 231553 -148567 19811 14438 398235 353350 358705 216127 284601 115032 385300
17189C85300D8158K90812D7212M95955A84454O8006p5978J72160r6689J38923
$$ 385300 48158 338970 47212 543167 184454 252460 176482 348642 251953 390876
17179C90876M3068j87822o763F6518P8543E228O51281B18012R1753m1972n3346
$$ 390876 433944 246122 239359 66518 145061 5228 656509 218012 309765 267793 214447
17168B14447o7740J39470L84966j26925A39548L313K31415a78921D07775I3169
$$ 214447 146707 286177 671143 544218 139548 142861 374276 -178921 407775 93169
17157D67852j47645A44127J04092Q0813R366R9751j72803J08870A53330J22668
$$ 467852 320207 144127 248219 329032 338398 438149 265346 374216 153330 275998
17147B75998A23803J81939J02142A60463j1668J08809j04534L96183j53242j31543
$$ 275998 123803 305742 407884 160463 148795 257604 153070 549253 396011 264468
17137B64468J29267j58301L32202F0088K23400E4446M63968H9106J56311J01165
$$ 264468 393735 235434 567636 60088 283488 54446 518414 89106 245417 346582
17127C46582n6688p1733K75183N0520q3871A03548Q021A1564K78900o0544K73548
$$ 346582 289894 218161 493344 543864 459993 103548 111569 11564 290464 229920 503468
17116E03468j22883L6477J66884A86774J07581M5360K06096k28494a20432B17391
$$ 503468 380585 417062 583946 186774 294355 339715 545811 317317 -120432 217391
17105E10538j04213J51530B43753R6340K08897j30308J06013B57691L61657A48165
$$ 510538 406325 557855 243753 340093 548990 418682 524695 257691 619348 148165
17094B73793J97135Q2570B49163G9478M39315k41495P2880r7991J82791m0828
$$ 273793 470928 553498 249163 79478 518793 277298 350178 252187 434978 394150
17084C94150L6933j56945m8419N460o6935J15463j6213J44721J04997P3257n3561
$$ 394150 431083 274138 225719 231179 164244 279707 263494 408215 513212 586469 532908
17073E32908P9798k26870q188A86356M45596k25172J39683B03026L87111j55873
$$ 532908 612706 385836 377648 186356 631952 406780 546463 203026 590137 434264
17063D34264p5935J16844j92138J30997J99693j64236m8028q2477k9556K71349
$$ 434264 358329 475173 283035 414032 613725 449489 401461 318984 289428 560777
17053E60777m8361J65818A39307J84679O9721J19467j80899M05149j5573l59170
$$ 560777 512416 678234 139307 323986 393707 513174 332275 737424 721851 362681
17043C62681J45898r6682L49614l4584j49888K66497l74608J91963C08768P4198
$$ 362681 508579 411897 761511 726927 577039 843536 468928 660891 308768 382966
17033C82966L58888C10149N38902k89165M8404N9799J09716j44332J4083j15495
$$ 382966 741854 310149 849051 559886 608290 668089 777805 633473 647556 532061
17023E32061j96711O88746m62712J84524J95131k73100J8544J62176l03111J98581
$$ 532061 335350 1024096 561384 745908 941039 667939 686483 848659 545548 744129
17013G44129j32881J09921j50094J38967K09132r6663m2264J82765l19937r6079
$$ 744129 611248 721169 571075 710042 919174 822511 780247 963012 643075 546996
17003E46996K16337j63141k69199N83760j04817k24542J3080J32721k23242L33419
$$ 546996 763333 600192 330993 914753 809936 585394 598474 731195 507953 841372
16993H41372K01208k84085J79270k2072C77387N00528m34411M12798n2167J32311
$$ 841372 1042580 758495 937765 915693 377387 877915 443504 856302 804135 936446
16983I36446l06309M28083m36674J06312J65003K0848l21569K24127k06804L57086
$$ 936446 630137 1058220 621546 727858 892861 913709 592140 816267 609463 966549
16973I66549k83473J98073j51375L34782k67273J16626M8984K42120m48210P1220
$$ 966549 683076 881149 729774 1064556 797283 913909 962893 1205013 756803 828023
16963H28023J36869j94182M3036O0013J64612p4538l24729L44314M0520N3527
$$ 828023 964892 770710 813746 873759 1038371 963833 639104 983418 1023938 1077465
16953A077465P8301o0583J27083O2763l14783K72747P926l58157J58943j97383
$$ 1077465 1155766 1095183 1222266 1285029 970246 1242993 1250919 892762 1051705 854322
16943H54322L14017k72333O24757m28436K1069R3017J83430k70056j67036L15123
$$ 854322 1168339 896006 1520763 1092327 1113396 1206413 1389843 1119787 952751 1267874
16933A267874K35040j47801j82620o4993K31921m0943k98956K95999K777j09859
$$ 1267874 1502914 1355113 1172493 1107500 1339421 1298478 999522 1295521 1298298 1188439
16923A188439m7155q9344J15554K54684n9498O5695r7025J79421J89401l71459
$$ 1188439 1141284 1051940 1167494 1422178 1362680 1428375 1331350 1510771 1700172 1328713
16913A328713o9261K47032M780k03244J16487R5979K5279k73702j35826N50418
$$ 1328713 1259452 1506484 1511264 1308020 1424507 1520486 1545765 1272063 1136237 1686655
16903A686655q1428J94254j42902k29278L83481r1937k74293M69401j01496J50742
$$ 1686655 1605227 1799481 1656579 1427301 1810782 1718845 1444552 1913953 1812457 1963199
16893A963199Q968k52551L82709r5163R3093j36686K51492n33184l0104N86040
$$ 1963199 1972167 1719616 2102325 2007162 2100255 1963569 2215061 1681877 1651773 2237813
16883B237813J32743j80532j67982J95133K05736P2967j19966p545n913J61249
$$ 2237813 2370556 2190024 2022042 2217175 2422911 2495878 2375912 2368367 2362454 2523703
16873B523703J16940j32510N905j45168N04687n05169j7390L64975m08532M82532
$$ 2523703 2640643 2508133 2514038 2368870 2873557 2368388 2350998 2715973 2307441 2789973
16863B789973k51029J74196M8997J43867K06168m58982N61672k08959N5480k12306
$$ 2789973 2538944 2713140 2762137 2906004 3112172 2653190 3214862 3005903 3061383 2849077
16853B849077K24419p696O5615L59466l21227M44769N922k0641L0968J97762k18808
$$ 2849077 3073496 3065800 3131415 3490881 3169654 3614423 3620345 3599704 3630672 3828434 3609626
16842C609626O0303j17112l474L75605O257K93887j97556J36939K72958K0981
$$ 3609626 3669929 3552817 3549343 3924948 3931205 4225092 4027536 4164475 4437433 4458414
16832D458414J78225n91283N80834j16803J52054J88804P2297l21622k8023M14456
$$ 4458414 4636639 4045356 4626190 4509387 4661441 4850245 4922542 4600920 4572897 4987353
16822D987353N40468j43697k25769N68422k19175L81711l93556N97242j095K31048
$$ 4987353 5527821 5384124 5158355 5726777 5507602 5889313 5495757 6092999 6091904 6322952
16812F322952N225K93824O4422N5082L36400K20814l0076K56222K88242J15312
$$ 6322952 6328177 6622001 6686423 6741505 7077905 7298719 7268643 7524865 7813107 7928419
16802G928419K63944k24683N34841J94886K12016P8477M4138R7303Q57090k1452
$$ 7928419 8192363 7967680 8502521 8697407 8909423 8987900 9032038 9129341 9986431 9964979
16792I964979N09241l8935L76637l3633L94214O46635R2073K77064P93580N9968
$$ 9964979 10474220 10435285 10811922 10778289 11172503 11819138 11911211 12188275 12981855 13041823
16782A3041823M34093K51144O51296j8948R71154J96188P46081L60649Q48170
$$ 13041823 13475916 13727060 14378356 14359408 15330562 15526750 16272831 16633480 17481650
16773A7481650k00492Q09858Q59002O62292P50948P12040P29809R69101P77252
$$ 17481650 17281158 18091016 18950018 19612310 20363258 21075298 21805107 22774208 23551460
16764B3551460Q18832J086303J122240J078805J181587J101542J269734J043742
$$ 23551460 24370292 25456595 26578835 27657640 28839227 29940769 31210503 32254245
16756C2254245J560871J852116J589775K096058J589409J714458K239198K186304
$$ 32254245 33815116 35667232 37257007 39353065 40942474 42656932 44896130 47082434
16748D7082434K293562K657001K921675K686377K901291L353891L630452L487948
$$ 47082434 49375996 52032997 54954672 57641049 60542340 63896231 67526683 71014631
16740G1014631M031575M196875M574123M559265M942679N354960N437233N786048
$$ 71014631 75046206 79243081 83817204 88376469 93319148 98674108 104111341 109897389
16732A09897389N882182O213738N825084O181462O109937O225208N924914M969270
$$ 109897389 115779571 121993309 127818393 133999855 140109792 146335000 152259914 157229184
16724A57229184N178578M057455L308850K369546J406150M36365o35834j763657
$$ 157229184 162407762 166465217 169774067 172143613 173549763 173986128 173350294 171586637
16716A71586637l023119l381507m524357n050631n502086o067823o459837o321682
$$ 171586637 168563518 165182011 160657654 155607023 150104937 144037114 137577277 131255595
16708A31255595o404780o431493o042283o544402n468730n505807n524757n104740
$$ 131255595 124850815 118419322 112377039 105832637 100363907 94858100 89333343 84228603
16700H4228603m725271m191624m212734l893024m114551l325598l088282k962974
$$ 84228603 79503332 75311708 71098974 67205950 63091399 59765801 56677519 53714545
16692E3714545k411224k784045k527664k218412k268304k239721j667196j513951
$$ 53714545 51303321 48519276 45991612 43773200 41504896 39265175 37597979 36084028
16684C6084028j854833j709371j290220j014404j637411j103635j413071r32874
$$ 36084028 34229195 32519824 31229604 30215200 28577789 27474154 26061083 25128209
16676B5128209q13561p17421j283329p27033q85248r18327p13327l98302q23820
$$ 25128209 24314648 23597227 22313898 21586865 20701617 19783290 19069963 18671661 17847841
16667A7847841l10157q02607r62731o6703o05275l31234q71668k02310p40689
$$ 17847841 17537684 16735077 15772346 15705643 15100368 14769134 13897466 13695156 12954467
16658A2954467L2852n66420l38212n17487n5663n11523m53488J5148n74239L7325
$$ 12954467 12987319 12420899 12082687 11565200 11509537 10998014 10544526 10559674 9985435 10022760
16648A0022760o10248L8416k24353m67182l28014m07789j12720j52864k16714
$$ 10022760 9412512 9450928 9226575 8759393 8431379 8023590 7910870 7758006 7541292
16639G541292K21371l26786k85281n9296m29475L4586n58289K77962l14581K90577
$$ 7541292 7762663 7435877 7150596 7091300 6661825 6696411 6138122 6416084 6101503 6392080
16629F392080m86266K53709m68012J0520r1640k21946j73479Q0997k50785J2366
$$ 6392080 5905814 6159523 5691511 5702031 5610391 5388445 5214966 5295963 5045178 5057544
16619E057544j54582p296k74848l4625k0756l18007J22500j54970J97771k16224
$$ 5057544 4902962 4895666 4620818 4586193 4565437 4247430 4369930 4214960 4412731 4196507
16609D196507l96932K45237m98407j52306K24915p999n1997m00351Q4913m4698
$$ 4196507 3799575 4044812 3546405 3394099 3619014 3611015 3559018 3158667 3243580 3198882
16599C198882l7353J38108j2655J65599k88930j56699J92592j36798m15042P0239
$$ 3198882 3161529 3299637 3286982 3452581 3163651 3006952 3199544 3062746 2647704 2717943
16589B717943J00219l2527l4386J52015j22359k07649j31945K15789j71225J64567
$$ 2717943 2818162 2785635 2751249 2903264 2780905 2573256 2441311 2657100 2485875 2650442
16579B650442k46099m3831k6907j19791m1127M398j55080N1533j71650J54226
$$ 2650442 2404343 2360512 2333605 2213814 2172687 2177085 2022005 2073538 1901888 2056114
16569B056114P7246j70430L03539P4177l10199k3578j5472J00111k16742j56348
$$ 2056114 2133360 1962930 2266469 2340646 2030447 2006869 1991397 2091508 1874766 1718418
16559A718418L04842j46303Q4950k08096j64009l1018K75081n82771L65363j71786
$$ 1718418 2023260 1876957 1961907 1753811 1589802 1558784 1833865 1251094 1616457 1444671
16549A444671j40118N97016j52211O1704k44107k27366r7950M37001k68845K84328
$$ 1444671 1304553 1901569 1749358 1811062 1566955 1339589 1241639 1678640 1409795 1694123
16539A694123k75495k1132K31292m05916O9439L9807J75920r9201p9275k53147
$$ 1694123 1418628 1397496 1628788 1222872 1292311 1332118 1508038 1408837 1329562 1076415
16529A076415L6206L13110o5741l16811J21519j17282J58281j30255K46244j78324
$$ 1076415 1112621 1425731 1359990 1043179 1164698 1047416 1205697 1075442 1321686 1143362
16519A143362J98107k05084K5224j34430J63193l73783J45657k9017O3482J83096
$$ 1143362 1341469 1136385 1161609 1027179 1190372 816589 962246 933229 996711 1179807
16509A179807J6985l14527K75763l59210K68444J21708E59180L54038m9742q0408
$$ 1179807 1196792 882265 1158028 798818 1067262 1188970 559180 913218 863476 783068
16499G83068J42946j2430l1975j09493j73217O70790l46172p8368K60675n22050
$$ 783068 926014 913584 881609 772116 598899 1269689 923517 845149 1105824 583774
16489E83774L58950J18902k97630m842J72088k00785K32909j91620R3471J40538
$$ 583774 942724 1061626 763996 759154 931242 730457 963366 771746 865217 1005755
16479A005755j50317P7433l33707J09557K8777L0274C63317K22095K65942R8102
$$ 1005755 855438 932871 599164 708721 737498 767772 363317 585412 851354 949456
16469I49456k58885M0295m62J47118m1846p9448j01829J657K5665J37248B63169
$$ 949456 690571 730866 730404 877522 835676 756228 654399 656056 681721 818969 263169
16457F18108k9254L89302D59721q3878L0887K32014L41j12483j55127K10924J66822
$$ 618108 588854 978156 459721 375843 406730 638744 639085 526602 371475 582399 749221
16446G49221k47803J40526B03488N53492j44054k6218k71484l1433M02802k58909
$$ 749221 501418 641944 203488 756980 612926 586708 315224 283791 686593 427684
16436D27684J06064j05825M60872l37280k28218J86848J25492j47936j12382q4100
$$ 427684 533748 427923 888795 551515 323297 510145 635637 487701 375319 291219
16426B91219r5052L64594p8635N6139Q175o5131n8846q4204P7055j40034J02898
$$ 291219 196167 560761 482126 538265 546440 481309 422463 338259 415314 275280 378178
16415C78178O3474L63148j52295P3562j85107j24826K38259j87326R9815A28716
$$ 378178 441652 804800 652505 726067 540960 416134 654393 467067 566882 128716
16404H0697L49669M5119Q7350j30544J04383B47520M88003j41622A07320L73254
$$ 80697 430366 475485 562835 432291 536674 247520 735523 593901 107320 480574
16394D80574p1878J65620A31727M71080A06403L70097J02699P2030p7342B06177
$$ 480574 408696 574316 131727 602807 106403 476500 579199 651229 573887 206177
16383B2796M76593A54857K67725k05191K51104A87028L52653k06442A52570M08699
$$ 22796 499389 154857 422582 217391 468495 187028 539681 333239 152570 561269
16373E61269j64821o7957j5983J08904a153I5529m5468K87890j61067K22130A60734
$$ 561269 396448 328491 312508 421412 -1153 95529 50061 337951 176884 399014 160734
16361C22896n4595o8112K1832J47483o5011J45648o7289J41524j04950p1006H9067
$$ 322896 268301 200189 222021 369504 304493 450141 382852 524376 419426 348420 89067
16349E3968R0364L2080J44968j05470B4912L53237A80273c3646C58469A2497R3006
$$ 53968 144332 176412 321380 215910 24912 378149 180273 -33646 358469 12497 105503
16338A05503L58827j57363j49039J64612j9415C4440M05273j76812g2670B46636
$$ 105503 464330 306967 157928 322540 303125 34440 439713 262901 -72670 246636
16327a9327B75252J7424K89674D4716L17907l2672l247l4982P461P5776A55749
$$ -19327 275252 292676 582350 44716 362623 329951 326704 291722 299183 374959 155749
16315E81958j76467A83387K17416n6573A06106c6791C10488A29094J08768o3301
$$ 581958 405491 183387 400803 344230 106106 -36791 310488 129094 237862 174561
16305A74561J03112R0548n1987J67166A33151P8647R8277K01058B48163b87755
$$ 174561 277673 368221 316234 483400 133151 211798 310075 511133 248163 -287755
16294F5978M80613C1390M8742a3283k4709B60031H3622c4202B54296r884H3472
$$ 65978 546591 31390 80132 -13283 -37992 260031 83622 -34202 254296 244412 83472
16282A7338J77262d4310A83760K26703I372A232d0026E25459j92215A60014l1141
$$ 17338 194600 -44310 183760 410463 9372 1232 -40026 525459 333244 160014 128873
16271A28873a1735o5253J8826B73639N4923B9954a67812g811m8248H9592a0165
$$ 128873 -11735 -76988 -58162 273639 328562 29954 -167812 -7811 -56059 89592 -10165
16259c3097B01056a11418H2162K0910J22589B880J73438J71907j61612K13418
$$ -33097 201056 -111418 82162 103072 225661 2880 176318 348225 186613 400031
16249D00031L9228A37939E2148c569A75386k0424P9385l1954J83766a00076A26528
$$ 400031 439259 137939 52148 -3569 175386 154962 234347 202393 386159 -100076 126528
16237B49307c0352j92832a5010A48465L3933l5689k0885B8417M9439L8017J10407
$$ 249307 -30352 -223184 -15010 148465 182398 146709 125824 28417 77856 115873 226280
16226B26280G3105L1347b73035I3975l6062Q024N9257b4960p7225a8423E3492
$$ 226280 73105 104452 -273035 93975 57913 65937 125194 -24960 -102185 -18423 53492
16214D07532H8881N9310n2471K1385b10948I154Q6113a54748B11434O2671j04182
$$ 407532 88881 148191 95720 117105 -210948 9154 95267 -154748 211434 274105 169923
16203A69923p4836e807C51515a08897c0423j72522C282K37719F3172M4235K91147
$$ 169923 95087 -5807 351515 -108897 -30423 -202945 3282 241001 63172 107407 398554
16192C98554d4892C1619J20783E6316i5617B95396l949A05910Q0284C3862J46980
$$ 398554 -44892 31619 152402 56316 -95617 295396 291447 105910 186194 33862 180842
16181A80842g6182j07195B6778f7022a3393j30193A38752P6807l0961m6829b03410
$$ 180842 -76182 -183377 26778 -67022 -13393 -143586 138752 215559 184598 137769 -203410
16169a3598r785A4331M42486H9384J41254r8132n1803h7099A29454l7848B1669
$$ -13598 -23383 14331 456817 89384 230638 132506 80703 -87099 129454 91606 21669
16157a39737F75L9960f9197J6466A708J22609D0300L5850a1565B07775a02698
$$ -139737 675 40635 -69197 -52731 1708 124317 40300 76150 -11565 207775 -102698
16145A52804k1359b6594A89569e3800J9549O539A07779m995a76879A4641a65994
$$ 152804 131445 -26594 189569 -53800 -34251 -27712 107779 102784 -176879 14641 -165994
16133B4791J62945a78460e9546q592D63652b4452m2799H666b6141r247A57036
$$ 24791 187736 -178460 -59546 -68138 463652 -24452 -67251 8666 -26141 -35388 157036
16121g3547k1539A83487j7407J06063H5333b49585A26741b58859C83338j15480
$$ -73547 -95086 183487 166080 272143 85333 -249585 126741 -258859 383338 267858
16111B67858f0358D6948a88052D8054i9997e72n0458A0065e1516B89990a18154
$$ 267858 -60358 46948 -188052 48054 -99997 -572 -51030 10065 -51516 289990 -118154
16099B63324m9686G6709M8785K81885A2188d7160e440C224a10768C53539a61518
$$ 263324 213638 76709 125494 407379 12188 -47160 -5440 3224 -110768 353539 -161518
16087B07290N1592b90625d2839A66112H576K43972a37286A6530L38657g048j3340
$$ 207290 258882 -290625 -42839 166112 8576 252548 -137286 16530 355187 -7048 -20388
16076b0388A53711a56302C0965b43333b4094I5183L7165a56745B56999d6030D94947
$$ -20388 153711 -156302 30965 -243333 -24094 95183 132348 -156745 256999 -46030 494947
16064A09820b09846C07603A05663Q9829e8650A74730r860F1391a54501F5028R1422
$$ 109820 -209846 307603 105663 195492 -58650 174730 164870 61391 -154501 65028 156450
16053A56450B2688h0223B2064C779K02029b34818L0712h8574J7703q8110C88055
$$ 156450 22688 -80223 22064 3779 205808 -234818 -204106 -88574 -70871 -158981 388055
16041a34870A16464a1273l75972R1430A22830a4288A5496c27137e3568j18229
$$ -134870 116464 -11273 -387245 -295815 122830 -14288 15496 -327137 -53568 -171797
16031a71797A0992i4600K5187A73440g5603A93101a38321C6732b85951A00920
$$ -171797 10992 -94600 -69413 173440 -75603 193101 -138321 36732 -285951 100920
16020B69867a86145F5759o542c892r7161A40605B0764a04028A15585g4113j98338
$$ 269867 -186145 65759 59217 -3892 -101053 140605 20764 -104028 115585 -74113 -272451
16009b72451A69336C8232b75685d4310B57790d48021B7256a0286j24675q6733
$$ -272451 169336 38232 -275685 -44310 257790 -448021 27256 -10286 -134961 -221694
15999b21694b941F7569O8089K301a71702B95620b99644F3374B5828b11682j9860
$$ -221694 -2941 67569 135658 137959 -171702 295620 -299644 63374 25828 -211682 -231542
15988b31542b5005F2139J56050n3428J52759O4620n6293r4972M6873k8865j04731
$$ -231542 -25005 62139 218189 164761 317520 382140 325847 230875 277748 248883 144152
15977A44152Q4683F9860k9847b8411r1029B8685J10771B7536c78319C29662c6173
$$ 144152 228835 69860 40013 -28411 -119440 28685 139456 27536 -378319 329662 -36173
15965A46090n7858a6870A72375D1481a14187B30952i8290B0312f5376J9655D297
$$ 146090 88232 -16870 172375 41481 -114187 230952 -98290 20312 -65376 -45721 4297
15953a85419g7646B8516K6618M1018b4725A08687Q521e9102e664F7047P0222a00978
$$ -185419 -77646 28516 55134 96152 -24725 108687 117208 -59102 -5664 67047 137269 -100978
15940I9090i9665A08039b20051b2922j40784P2395j66557a2503A49810R018P8491
$$ 99090 -99665 108039 -220051 -22922 -163706 -91311 -257868 -12503 149810 158828 237319
15929B37319B7653J28588a75309q4852P8117c7953n6621A1337a60926F0224q666
$$ 237319 27653 156241 -175309 -260161 -182044 -37953 -94574 11337 -160926 60224 51558
15918E1558c04078B02196r0322D4118K72064H6022J2443D4503e5856A6628h373
$$ 51558 -304078 202196 111874 44118 316182 86022 98465 44503 -55856 16628 -8373
15906A0044d05793J90975C44520a55447J5236j44247C5348c57685B71695c3513
$$ 10044 -405793 -214818 344520 -155447 -140211 -284458 35348 -357685 271695 -33513
15895A05700i9594H2647j0666B0962c5613A4771b27641c7703B15072I5009R3431
$$ 105700 -99594 82647 71981 20962 -35613 14771 -227641 -37703 215072 95009 188440
15884A88440b46319A08662e8704j3545E7680R5002c987j37410B69305I4327D0047
$$ 188440 -246319 108662 -58704 -72249 57680 152682 -3987 -141397 269305 94327 40047
15872a79805q6818a33309c462r3990C58423a40241A92407l8988a29882J4942o2957
$$ -179805 -266623 -133309 -3462 -97452 358423 -140241 192407 153419 -129882 -114940 -177897
15861a77897A44137c48288N6427C2029g6791B0270b22426D92368a05637A15584
$$ -177897 144137 -348288 -291861 32029 -76791 20270 -222426 492368 -105637 115584
15850B65053D9325j571c46238d9150l22021A30418k6007J28772f9191B56325a49560
$$ 265053 49325 47754 -346238 -49150 -371171 130418 104411 233183 -69191 256325 -149560
15838b54097c7922B25280c36893A89655C5401J07844N6879a17644B5424L36137
$$ -254097 -37922 225280 -336893 189655 35401 143245 200124 -117644 25424 361561
15828C61561j79036a44260H9425l2288f2651B17044a9376A74166d0558m33372
$$ 361561 182525 -144260 89425 57137 -62651 217044 -19376 174166 -40558 -473930
15818d73930a77998D4946a22748E1475K833J01860G2391J74164a64559A74310
$$ -473930 -177998 44946 -122748 51475 54308 156168 72391 246555 -164559 174310
15807A4651K37332A164a49446H4243O8958M6915a3165j94752M3192r076g4463
$$ 14651 251983 1164 -149446 84243 153201 200116 -13165 -207917 -164725 -173801 -74463
15795a09023k72900B29748C1304g7563j16099Q2019A17874c6287B07028i5330
$$ -109023 -381923 229748 31304 -77563 -193662 -111643 117874 -36287 207028 -95330
15784H490e1590l4121Q704A96523d2285q6523E6606O9864a01656A13249j8716
$$ 8490 -51590 -85711 -77007 196523 -42285 -128808 56606 126470 -101656 113249 94533
15773I4533a37294r1937a05342B69364c20581H7491b52457J15955j55922C3098
$$ 94533 -137294 -229231 -105342 269364 -320581 87491 -252457 -136502 -292424 33098
15762B47679I3172J81262b73492E3957K02786j18810O9044a50346r4450r3029
$$ 247679 93172 274434 -273492 53957 256743 137933 206977 -150346 -244796 -337825
15752c37825J17303c9006p3690d9113j55174D59428a58530j8268D3876O6184a52925
$$ -337825 -220522 -39006 -112696 -49113 -204287 459428 -158530 -176798 43876 110060 -152925
15740c1257C84988c73400g6216B26157i587j06897o0218h2202l72941K04860f419
$$ -31257 384988 -373400 -76216 226157 -9587 -116484 -176702 -82202 -455143 -250283 -6419
15728A268J12262R5141d0315k5253k0798j34360i3355D5058m022P8247C0745K99808
$$ 1268 113530 208671 -40315 -65568 -86366 -220726 -93355 45058 41036 119283 30745 330553
15716C30553b2391I3632c73199i0966B6948N5807a03292j86186f3014q0888N7788
$$ 330553 -22391 93632 -373199 -90966 26948 82755 -103292 -289478 -63014 -143902 -86114
15705h6114I1378J24255e3425q0333A70861i9672M2024I292J57495p7634F800
$$ -86114 91378 215633 -53425 -133758 170861 -99672 -57648 9292 166787 89153 6800
15693A1408M50043A92704D0993a1374A59573P6717f4435k31558i7140k60998K0981
$$ 11408 461451 192704 40993 -11374 159573 236290 -64435 -295993 -97140 -358138 -337157
15682c37157a01464A64930f6316D8593L6028L0912J7810N2069E5346J49576D1153
$$ -337157 -101464 164930 -66316 48593 84621 115533 133343 185412 55346 204922 41153
15670b9022A7668c265I0994b03705d4661A62112g5199p1268B22105c04784A72456
$$ -29022 17668 -3265 90994 -203705 -44661 162112 -75199 -146467 222105 -304784 172456
15658a96911D4675a17124M3033G1292i8987j51036E1751f7421A01994c4655A80875
$$ -196911 44675 -117124 -74091 71292 -98987 -250023 51751 -67421 101994 -34655 180875
15646A84450R9720c5180m3191J5838C18348a9467A11157c66002g9562p250B428
$$ 184450 284170 -35180 -78371 -62533 318348 -19467 111157 -366002 -79562 -86812 2428
15634C54694a10910J7896q0922a8000O182j19790k44601c3046H0891a57293C88306
$$ 354694 -110910 -93014 -173936 -18000 -11818 -131608 -376209 -33046 80891 -157293 388306
15622a01273j04372a0085E9J74932a86970B53667N7997i6020J3145f925l30311
$$ -101273 -205645 -10085 59 174991 -186970 253667 311664 -96020 -82875 -6925 -337236
15611c37236i4816k22003D6131a29413n1378L0445A41164a81810B42380c5356
$$ -337236 -94816 -316819 46131 -129413 -180791 -150346 141164 -181810 242380 -35356
15600F4997a24525j71960B56959b6358j1227k1246A97168d6810F7643A3598a43247
$$ 64997 -124525 -296485 256959 -26358 -37585 -58831 197168 -46810 67643 13598 -143247
15588a00385B2067a20710M2729A0704b7154G4465p939J52165D2758a82140d4952
$$ -100385 22067 -120710 -77981 10704 -27154 74465 66526 218691 42758 -182140 -44952
15576i8131j87376i5363K3520j4850b5727n3174B26230b61200r9982a09157H1093
$$ -98131 -285507 -95363 -71843 -86693 -25727 -78901 226230 -261200 -361182 -109157 81093
15564B00814b20512A50984b74049I3972J81140B1983b9413a756q9184J3897o491
$$ 200814 -220512 150984 -274049 93972 275112 21983 -29413 -1756 -90940 -77043 -83534
15553h3534q1322H6107O3842b52561d0560j4822A08877f6350j97364B03805j5939
$$ -83534 -164856 86107 149949 -252561 -40560 -55382 108877 -66350 -263714 203805 187866
15542A87866H8501b16791P5144j2433L8768A00346l9888a24550G0054R368a31528
$$ 187866 88501 -216791 -141647 -154080 -115312 100346 60458 -124550 70054 79422 -131528
15530A14735a53231A58550a10957p9814k45485B24960C7041j0146R7061h4368
$$ 114735 -153231 158550 -110957 -190771 -436256 224960 37041 26895 123956 -84368
15519b92878B80669j35463b14850B79763D0944i2078A52331m1185L064a69254
$$ -292878 280669 145206 -214850 279763 40944 -92078 152331 111146 114210 -169254
15508c04862d1350j60376R1829M1i958j63363f1609k691A47018e4721k98639J24374
$$ -304862 -41350 -201726 -109897 -109856 -9958 -173321 -61609 -64300 147018 -54721 -353360 -228986
15496b28986C9765d6640j07977A05939g4291k56034C4102a16607A88309a9803
$$ -228986 39765 -46640 -154617 105939 -74291 -330325 34102 -116607 188309 -19803
15485b81783R3288m3939g374B35395H833K60201B4836L8330a35543k42325C156
$$ -281783 -188495 -232434 -7374 235395 8833 269034 24836 63166 -135543 -377868 3156
15473a39003G8364f7994l0371A42777G1014K36233b71538b4480l21298a05092
$$ -139003 78364 -67994 -98365 142777 71014 307247 -271538 -24480 -345778 -105092
15462A26407J49458p2206J644D5350j236L75841A22424K4224J5092n6637N0501
$$ 126407 275865 203659 205303 45350 44114 419955 122424 146648 161740 105103 155604
15451A55604d4094C6961A4222K63936b48589D55797j16041e2175D6288i0675j12574
$$ 155604 -44094 36961 14222 278158 -248589 455797 339756 -52175 46288 -90675 -203249
15440b03249A88835d7870G2917R8539J1047a02624j88994C9620K73306p3738d3359
$$ -203249 188835 -47870 72917 171456 182503 -102624 -291618 39620 312926 239188 -43359
15428a46472I7881b67042I9782J99846e6134q3519a5710l71661A39071N3301p3874
$$ -146472 97881 -267042 99782 299628 -56134 -139653 -15710 -387371 139071 192372 118498
15417A18498c79499i9247o1279A93650p3392d8658B69378b52070b5763r5566C0024
$$ 118498 -379499 -99247 -160526 193650 120258 -48658 269378 -252070 -25763 -121329 30024
15405A49279a40998J3834j24500a05621n5865N983i024B4764b72405R5050A6961
$$ 149279 -140998 -127164 -251664 -105621 -161486 -155503 -9024 24764 -272405 -177355 16961
15393H2619a24717N2561B20524i5103a1099l01258a51177B8795a30464B37003
$$ 82619 -124717 -72156 220524 -95103 -11099 -312357 -151177 28795 -130464 237003
15382B33501b9081k3873j05728B34830c0323H8928N3027c47828A37415c22065
$$ 233501 -29081 -52954 -158682 234830 -30323 88928 141955 -347828 137415 -322065
15371c06691A27883a13476A52952c05937A31036a93286R5103p9357A13850a59468
$$ -306691 127883 -113476 152952 -305937 131036 -193286 -98183 -177540 113850 -159468
15360a44277b2343k77445a3036D6305J98473r7964o2475b9880j05369A68318e3316
$$ -144277 -22343 -299788 -13036 46305 244778 146814 84339 -29880 -135249 168318 -53316
15348a496j66428H3494C0554a58361A33211g2246A09771a11398l9635L1833B22916
$$ -1496 -167924 83494 30554 -158361 133211 -72246 109771 -111398 -151033 -119200 222916
15336B08160J7375E2320J8999j7122h8035G5581J29391r1035b69348d2401k07404
$$ 208160 225535 52320 71319 54197 -88035 75581 204972 113937 -269348 -42401 -249805
15325b49805a762D1071F52b7557C03966a4290A14767G685R2122l0774K71632a34245
$$ -249805 -1762 41071 652 -27557 303966 -14290 114767 7685 99807 69033 340665 -134245
15312D01916j94244i4870k27360a38922A50693b90930A7610N2394M19208A55391
$$ 401916 207672 -94870 -322230 -138922 150693 -290930 17610 70004 489212 155391
15301a94289R4938A98778B6997L1055A8576d4620j33001d3873j00261C40180f2936
$$ -194289 -99351 198778 26997 58052 18576 -44620 -177621 -43873 -144134 340180 -62936
15289f6535j23716A14944a5301H3964b2592j3274B10108D5826b35216E3068k3820
$$ -66535 -190251 114944 -15301 83964 -22592 -35866 210108 45826 -235216 53068 29248
15278B9248a47573R292e6230F588b65424C31871I4532f456k0642k6780k0546A76625
$$ 29248 -147573 -138281 -56230 6588 -265424 331871 94532 -6456 -27098 -53878 -74424 176625
15265B64939E5204a52765A35107d5508a8056A38312b31258A68932l0035a6731
$$ 264939 55204 -152765 135107 -45508 -18056 138312 -231258 168932 138897 -16731
15254c3402k12216A06464n1202e9613C14232K28459P6729O0338J73160C23851
$$ -33402 -245618 106464 55262 -59613 314232 542691 619420 679758 852918 323851
15243A74931n355a35220J0953B38427n0854a11666l0546I3341F855b55849A3026
$$ 174931 169576 -135220 -124267 238427 187573 -111666 -142212 93341 6855 -255849 13026
15231E7128M6041a09525c0127A07129i457I0335J7077f4176A36108A5420L01447
$$ 57128 103169 -109525 -30127 107129 -9457 90335 107412 -64176 136108 15420 316867
15220C16867b75241A42342P7949H3625K10921g9506H5994a06619b807n0233C33158
$$ 316867 -275241 142342 220291 83625 294546 -79506 85994 -106619 -2807 -53040 333158
15208b7754C18363A17943L4687h6458A70164J37119A05091D8364a17207A76514
$$ -27754 318363 117943 152630 -86458 170164 307283 105091 48364 -117207 176514
15197a97827B51855a6155A19746h7345A30887J37767n6503I1076K95972a28272
$$ -197827 251855 -16155 119746 -87345 130887 268654 212151 91076 387048 -128272
15186A40867f0654J5642C9546a94190A09588K80624A61870j1840J40059l1222
$$ 140867 -60654 -45012 39546 -194190 109588 390212 161870 150030 290089 258867
15176B58867e176B13751k0689i5983B1935L8915J14974k4627F9574L78123a021
$$ 258867 -5176 213751 193062 -95983 21935 60850 175824 151197 69574 447697 -1021
15164A32723F3882Q2682E9470B9292K77250a28138H9911A2482J89634e1910A1117
$$ 132723 63882 146564 59470 29292 306542 -128138 89911 12482 202116 -51910 11117
15152A47775g2599G2086J83279D392a19345K5711B21658a66909G3671b72876B3383
$$ 147775 -72599 72086 255365 4392 -119345 -93634 221658 -166909 73671 -272876 23383
15140f1034A86614O7055a12965k572C4981M20617b9222o0611a259j38805A18992
$$ -61034 186614 253669 -112965 -115537 34981 455598 -29222 -89833 -1259 -140064 118992
15128A75478H6986N3379A7105L3034K62369j35620J91023c463B30572K20843k11111
$$ 175478 86986 140365 17105 50139 312508 176888 367911 -3463 230572 451415 240304
15117B40304m3430d4913l9869A74257K1405b19G9922J90170J37062a68639B88706
$$ 240304 196874 -44913 -84782 174257 195662 -219 79922 270092 407154 -168639 288706
15105F652O6313O3159J00529j15017k6580J50832J38732A77930H6756O5449b1011
$$ 6652 72965 136124 236653 121636 95056 245888 384620 177930 86756 152205 -21011
15093A03876D9918d8017l24195A26046j7340J92198j17281A8381J57164J71535
$$ 103876 49918 -48017 -372212 126046 108706 300904 183623 18381 175545 347080
15083C47080j41872b16989C03900A46457a01568C12960A50421D2622l512O3704
$$ 347080 205208 -216989 303900 146457 -101568 312960 150421 42622 39110 102814
15073A02814Ab2323C43440B0593J24043l1769c53981f5766A54893K09859A45560
$$ 102814 1 -22323 343440 20593 144636 112867 -353981 -65766 154893 364752 145560
15061A17010e8781A42323Q7921q067d9799q2357D4370K24710L00499B21196H0685
$$ 117010 -58781 142323 230244 222177 -49799 -132156 44370 269080 569579 221196 80685
15049A81674O472F4731e8900E30411k16341l1214e3652B5133a24787H5746J05394
$$ 181674 188146 64731 -58900 530411 314070 282856 -53652 25133 -124787 85746 191140
15038A91140p5483b36018C93759A21492J08099L8289m7289J62310F0846a1894
$$ 191140 115657 -236018 393759 121492 229591 267880 220591 382901 60846 -11894
15027A82392n9112K26890A69104k1778c3837A65485J04418K6939A25583K22806
$$ 182392 123280 350170 169104 147326 -33837 165485 269903 296842 125583 348389
15017C48389j16685H108b3408A69858k1320J90246R8697A15562k9877L64086d5685
$$ 348389 231704 8108 -23408 169858 148538 338784 437481 115562 85685 449771 -45685
15005I1849N56482E5211J84916L6325B8193K88689A17033K7426J1126F4779a07311
$$ 91849 648331 55211 240127 276452 28193 316882 117033 144459 155585 64779 -107311
14993B22352j752H5023K9986B6013K85635j6639l0231k8127P5677i118A68062
$$ 222352 220600 85023 115009 26013 311648 295009 264778 236651 312328 -9118 168062
14981I6743L45383d4503b2176B41640H6070M7605E4522j0369c8519k3932B55691
$$ 96743 442126 -44503 -22176 241640 86070 133675 54522 44153 -38519 -62451 255691
14969C93637O2759H5745l6698J65631a49448D52220r6200r8347m8323J7019A09501
$$ 393637 456396 85745 49047 214678 -149448 452220 356020 257673 209350 226369 109501
14957A72209l3803M1817K22048A98253J97312A22450e1915A87551L50365k68395
$$ 172209 138406 180223 402271 198253 395565 122450 -51915 187551 537916 269521
14947B69521o9241N8225A9304J05863L33161j77282J825A14285J25724J20473
$$ 269521 200280 258505 19304 125167 458328 281046 282871 114285 240009 360482
14937C60482j07866D0086J78281L5016Q0666p4058P6760A11270n1345Q8124F6828
$$ 360482 252616 40086 218367 253383 334049 259991 336751 111270 59925 148049 66828
14925D69705B29173K44086A94254K63792B21920J61399E6525K81035K01903A0790
$$ 469705 229173 473259 194254 458046 221920 383319 56525 337560 539463 10790
14914I3046Q2493J07489Q9228O5338j40443D2914K74042k1911J91778q4716N8319
$$ 93046 175539 283028 372256 437594 297151 42914 316956 295045 486823 402107 460426
14903D60426k2705F7771i7942C51850k0584R1429J92354A84542O2047L27857B86856
$$ 460426 437721 67771 -97942 351850 331266 422695 615049 184542 246589 574446 286856
14891B53536Q1681j32081h10C77768A63905k3305K81317j32429J12360A45909
$$ 253536 335217 203136 -810 377768 163905 140600 421917 289488 401848 145909
14880F20564G2184K15542M72231A93947H8015L79706A43264J81272J20152K1763
$$ 620564 72184 287726 759957 193947 88015 467721 143264 324536 444688 466451
14870D66451E2291J00136J13189J7298J1900J3862p4106j07115J85615J77333
$$ 466451 52291 152427 265616 282914 294814 308676 234570 127455 313070 490403
14860D90403B39947J02505J54661j64849K52095A57394J92667J36438j15687j58525
$$ 490403 239947 342452 497113 332264 584359 157394 350061 486499 370812 212287
14850B12287L29936k26684I3646M00031J34843k63374J64248K74021A75236L69999
$$ 212287 542223 315539 93646 493677 628520 365146 529394 803415 175236 545235
14840E45235J52897A10931O90506l51485n0222p7997l9343m5679J86783J345l0510
$$ 545235 698132 110931 801437 449952 399730 321733 282390 236711 423494 424839 394329
14829C94329N1117d135B88938K05081n7879j26929K74668o8387k50684l6518M9300
$$ 394329 445446 -4135 288938 494019 436140 309211 583879 515492 264808 228290 277590
14818B77590J50482K05197K3887A15129K82405O6998J17318K9353k08833M8966
$$ 277590 428072 633269 657156 115129 397534 464532 581850 611203 402370 451336
14808D51336K85554A11886M33843J35075l16207J94473n9881j87589O4789K19693
$$ 451336 736890 111886 545729 680804 364597 559070 499189 311600 376389 596082
14798E96082j54498J14913m0287P4011j07174P8542l0526J83310B40240M27206
$$ 596082 441584 556497 516210 590221 483047 561589 531063 714373 240240 667446
14788F67446k17645j5837n7435K67694J44801B19328J71490j43125M59482k03045
$$ 667446 449801 433964 376529 644223 789024 219328 390818 247693 707175 504130
14778E04130k9891K74252m078l66253K13147j92155q599K35981k60845N02631
$$ 504130 474239 748491 744413 378160 591307 399152 390553 626534 365689 868320
14768H68320k00972l25329K21243M5277C02306K73410K47828q9924J58047l09966
$$ 868320 667348 342019 563262 608539 302306 575716 823544 733620 891667 581701
14758E81701k50862L33309M7283J43398B72342N02052r3249j98603L93368k22785
$$ 581701 330839 664148 711431 854829 272342 774394 681145 482542 875910 653125
14748F53125K8004J36236l51275L16900j85257L90463C44708L81335j18358R5056
$$ 653125 681129 817365 466090 782990 597733 988196 344708 726043 607685 702741
14738G02741k78126M40547k79393j03227J35595j24668n0694K87943q4645p6374
$$ 702741 424615 865162 585769 482542 618137 493469 442775 730718 646073 569699
14728E69699m6361K45188l13719L10603P1233o0669j89342q9392K80009L5212
$$ 569699 523338 768526 454807 765410 836643 775974 586632 497240 777249 812461
14718H12461j1539j45996K89282k30390L1201j71786L35163q314J28589C14890
$$ 812461 800922 654926 944208 713818 745019 573233 908396 900082 1028671 314890
14707H22597j84355K65646J17756l76477K91009k76456L60367k16545l4349k9406
$$ 822597 638242 903888 1021644 645167 936176 659720 1020087 803542 769193 739787
14697G39787L44968j84869j26874l1602J41874M2943L36935l72514k13655L44189
$$ 739787 1084755 899886 773012 741410 883284 926227 1263162 890648 676993 1021182
14687A021182j9829k08730P2810j13747K41478j81524K27201j13742l4519j44340
$$ 1021182 1001353 792623 865433 751686 993164 811640 1038841 925099 890580 746240
14677G46240M47353j36850L36611n43532J14352k77357J03766J39988P4730o2676
$$ 746240 1193593 1056743 1393354 849822 964174 686817 790583 930571 1005301 942625
14667I42625L069o2194P8541j06464L42978m07370K11619L0615j14474p3020J97142
$$ 942625 945694 883500 962041 855577 1198555 791185 1002804 1033419 918945 845925 1043067
14656A043067L80535l87389r6488O0993j88026j4611M08102n014L6160n02244
$$ 1043067 1423602 1036213 939725 1000718 812692 798081 1206183 1201169 1237329 735085
14646G35085N32217J66344m11494J16318o1643N6799k09019J37843K48518l06404
$$ 735085 1267302 1433646 1022152 1138470 1076827 1133626 924607 1062450 1310968 1004564
14636A004564J61823m7180O1437J39383j74102n1225K81826l60285K4560N4682
$$ 1004564 1166387 1119207 1180644 1320027 1145925 1094700 1376526 1016241 1040801 1095483
14626A095483J43347P4335r0309J86163k22734L13551o7076o1541J54680j19771
$$ 1095483 1238830 1313165 1222856 1409019 1186285 1499836 1432760 1371219 1525899 1406128
14616A406128L06911m91443K63185j00597k2084N5795j09794K03382k97141M7180
$$ 1406128 1713039 1221596 1484781 1384184 1362100 1417895 1308101 1511483 1214342 1261522
14606A261522L61336r2156j25223l3360l30991N96223j13581J39893l20529j831
$$ 1261522 1622858 1530702 1405479 1372119 1041128 1637351 1523770 1663663 1343134 1341303
14596A341303J70109l42540N68456k33036L52108k29297J16877R009j40986J04238
$$ 1341303 1511412 1168872 1737328 1504292 1856400 1627103 1743980 1752989 1612003 1716241
14586A716241r8073K00768n1362J67965n3887L9314l84352M49499j53672L62374
$$ 1716241 1618168 1818936 1767574 1935539 1881652 1920966 1536614 1986113 1832441 2194815
14576B194815k24273K98989r9985o0756M34773p33539L70571K2838j3017L8340
$$ 2194815 1970542 2269531 2169546 2108790 2543563 1810024 2180595 2203433 2190416 2228756
14566B228756K09659n6378J89268m8626j83437Q0988M13784j46489P4071K11317
$$ 2228756 2438415 2382037 2571305 2522679 2339242 2420230 2834014 2687525 2761596 2972913
14556B972913L28981l97053P44956L34782L42722P69831M95010K033388M462671
$$ 2972913 3301894 2904841 3649797 3984579 4327301 5097132 5592142 7625530 12088201
14547A2088201R099533K0136157k067003A5430411F688990l056516j206829n44172
$$ 12088201 21187734 41323891 39256888 15430411 6688990 3632474 2425645 1881473
14539A881473K04431q2066j37346k02362j49352J18633J73966K00449N391j55507
$$ 1881473 2085904 2003838 1866492 1664130 1514778 1633411 1807377 2007826 2013217 1857710
14529A857710n7683K90652O6338q2890L9572m0866K71392l30268M50682P3437
$$ 1857710 1800027 2090679 2157017 2074127 2113699 2072833 2344225 2013957 2464639 2538076
14519B538076j55686l59126N79734k48134L3140K04833L0145J73984l47593L00383
$$ 2538076 2382390 2023264 2602998 2354864 2388004 2592837 2622982 2796966 2449373 2749756
14509B749756q3626j73532j7188J69482J32417J3301K4915k7573j01006K79149
$$ 2749756 2666130 2492598 2475410 2644892 2777309 2790610 2815525 2787952 2686946 2966095
14499B966095o028j48131K08116l4244K67309k45914j63685K39648K79261j39179
$$ 2966095 2960067 2811936 3020052 2985808 3253117 3007203 2843518 3083166 3362427 3223248
14489C223248K82822k41934k12632N71892M3217q7164m0892K11704J8748j76237
$$ 3223248 3506070 3264136 3051504 3623396 3666613 3579449 3538557 3750261 3769009 3592772
14479C592772J00835J27616j29798K13294m0974L51108l86220n7012M78173l88993
$$ 3592772 3693607 3821223 3691425 3904719 3863745 4214853 3828633 3771621 4249794 3860801
14469C860801R6109O1251K23971n9316p5535J78877Q2852k53360L99914R3434
$$ 3860801 3956910 4018161 4242132 4182816 4107281 4286158 4369010 4115650 4515564 4608998
14459D608998P6125j44526J85733J34476k70558j12251P34981m18172K25096J93631
$$ 4608998 4685123 4540597 4726330 4860806 4590248 4477997 5212978 4794806 5019902 5213533
14449E213533j86236M22141k82339q7495J77789K15340M7199n0123K85297J98630
$$ 5213533 5027297 5449438 5167099 5079604 5257393 5472733 5519932 5469809 5755106 5953736
14439E953736o8642L12425K789k10592J78229l16693O86401P9590j14288K90802
$$ 5953736 5885094 6197519 6200308 5989716 6167945 5851252 6537653 6617243 6502955 6793757
14429F793757m2534J72162k09861K542M6779J16117K16914P265K25997K28206
$$ 6793757 6751223 6923385 6713524 6716066 6762845 6878962 7095876 7103141 7329138 7557344
14419G557344K22187k53274N41702p5520L94378k50404p4785O08905n2767l8013
$$ 7557344 7779531 7526257 8067959 7992439 8386817 8136413 8061628 8670533 8617766 8579753
14409H579753K054M03698p0954O67540k53722L05338k96523Q41600k33970m9392
$$ 8579753 8581807 8985505 8914551 9582091 9328369 9633707 9337184 10178784 9944814 9895422
14399I895422M72976N6833K79930J41199J54190K71827j28016N44514Q3724J80841
$$ 9895422 10368398 10425231 10705161 10846360 11000550 11272377 11144361 11688875 11772599 11953440
14389A1953440R444K60630K1950L65049O600N42916N59822J2472K40865O0215
$$ 11953440 11962884 12223514 12245464 12610513 12617113 13160029 13719851 13732323 13973188 14033403
14379A4033403K14815O51944O3101J99661M05056K86991L44546O01311K63986
$$ 14033403 14248218 14900162 14963263 15162924 15567980 15854971 16199517 16800828 17064814
14370A7064814K63286O38226l89922N69098N15589j18155Q28739L53025M51992
$$ 17064814 17328100 17966326 17576404 18145502 18661091 18542936 19371675 19724700 20176692
14361B0176692O02707J63043O46934N88599M03998J26970J037357J56119R77167
$$ 20176692 20779399 20942442 21589376 22177975 22581973 22708943 23746300 23902419 24879586
14352B4879586M27357N17849N30608N94309R76856O39282Q75140M75500R38815
$$ 24879586 25306943 25824792 26355400 26949709 27926565 28565847 29440987 29916487 30855302
14343C0855302R82530L83318R12901J378567R73007R12216Q53141R02595J249643
$$ 30855302 31837832 32221150 33134051 34512618 35485625 36397841 37250982 38153577 39403220
14334C9403220J194936Q59505J675228Q91796J645596J327662J731088J502085
$$ 39403220 40598156 41457661 43132889 44024685 45670281 46997943 48729031 50231116
14326E0231116J524075K046245J451517K103959J871468K264475J881335K634370
$$ 50231116 51755191 53801436 55252953 57356912 59228380 61492855 63374190 66008560
14318F6008560K534746K140618K807208K866167K706054L319689L318637L097508
$$ 66008560 68543306 70683924 73491132 76357299 79063353 82383042 85701679 88799187
14310H8799187M292733L792903M398733L950581M697027M972517N456891N080844
$$ 88799187 93091920 96884823 101283556 105234137 109931164 114903681 120360572 125441416
14302A25441416N719439O384476O449481O997507P241531P997043Q205902Q441639
$$ 125441416 131160855 137545331 143994812 150992319 158233850 166230893 174436795 182878434
14294A82878434Q663427R932909J0143304J0369300J0884309J1015287J1796326
$$ 182878434 191541861 201474770 211618074 221987374 232871683 243886970 255683296
14287B55683296J2630994J2439807J3055426J3367485J3778292J3591140J3629818
$$ 255683296 268314290 280754097 293809523 307177008 320955300 334546440 348176258
14280C48176258J3408373J3308237J2729659J1761790J0635530R242680P753022
$$ 348176258 361584631 374892868 387622527 399384317 410019847 419262527 427015549
14273D27015549N588896J575675O28378L18143q04691n449566l476862o056116
$$ 427015549 432604445 434180120 434808498 435126641 434321950 428872384 425395522 419339406
14265D19339406q964691j1052082j2493303j3571737j4134268j4573542j4907300
$$ 419339406 410374715 399322633 386829330 373257593 359123325 344549783 329642483
14258C29642483j4934026j4185359j4180688j3884645j3436271j2799074j2150645
$$ 329642483 314708457 300523098 286342410 272457765 259021494 246222420 234071775
14251B34071775j1902159j0766328j0760918r740664r641533r077279p972966
$$ 234071775 222169616 211403288 200642370 190901706 181260173 172182894 164209928
14244A64209928p742236p510450o788285o780524n986784o031804m992370n336605
$$ 164209928 156467692 148957242 142168957 135388433 129401649 123369845 118377475 113040870
14236A13040870m799692n000703m065058l890122l867496l490559l759655l164667
$$ 113040870 108241178 103240475 99175417 95285295 91417799 87927240 84167585 81002918
14228H1002918l385870k801799k716097k484875k803946k579421k182243j964544
$$ 81002918 77617048 74815249 72099152 69614277 66810331 64230910 62048667 60084123
14220F0084123j982633j907163j758635j981227j848613j410055j800160j288212
$$ 60084123 58101490 56194327 54435692 52454465 50605852 49195797 47395637 46107425
14212D6107425j390496j250006j573324j170360q62311p27852j309326j072140
$$ 46107425 44716929 43466923 41893599 40723239 39860928 39133076 37823750 36751610
14204C6751610j416258p53207j186760q59432n59319p14819p22591j036561j023655
$$ 36751610 35335352 34582145 33395385 32535953 31976634 31261815 30539224 29502663 28479008
14195B8479008j66418r78353o02990q08414p29273j29473r28931k50139r42535
$$ 28479008 28312590 27334237 26731247 25922833 25193560 25064087 24135156 23885017 22942482
14186B2942482j91727o73209n71245j62568l98045o51507o55473m19616k40063
$$ 22942482 22750755 22077546 21506301 21343733 20945688 20294181 19638708 19219092 18979029
14177A8979029j76345m83351m08215o89683L2142m77807r4672m92119l87946l94589
$$ 18979029 18802684 18319333 17911118 17221435 17253577 16775770 16681098 16188979 15801033 15406444
14167A5406444l30503m0079m43705k35802l28094k75475m99706k32720j18659
$$ 15406444 15075941 15035862 14592157 14356355 14028261 13752786 13253080 13020360 12901701
14158A2901701L37717k50399n34625k86451j06297j79390k28181l12449k8813
$$ 12901701 13239418 12989019 12454394 12167943 12061646 11882256 11654075 11341626 11312813
14149A1312813k53227k10320k93969q0406L47004n46754j04401l91838M8532L8629
$$ 11312813 11059586 10849266 10555297 10474891 10821895 10275141 10170740 9778902 9827434 9866063
14139I866063j81724l94693j83615Q1806k35217J96708m13803j97576j95764J23325
$$ 9866063 9684339 9289646 9106031 9187837 8952620 9149328 8735525 8537949 8342185 8465510
14129H465510j23165l61669q3963j55036K45145j74600k51292K27135k63097j35732
$$ 8465510 8342345 7980676 7896713 7741677 7986822 7812222 7560930 7788065 7524968 7389236
14119G389236j69691k75847N1602N4486n52270M21057J8799l16550j16255l73947
$$ 7389236 7219545 6943698 6995300 7049786 6497516 6918573 6937372 6620822 6504567 6130620
14109F130620J48548M2248n5809R4366l05284n9562p577j87350K04476k40450
$$ 6130620 6279168 6321416 6265607 6359973 6054689 5995127 5987550 5800200 6004676 5764226
14099E764226k44911K51086n07675J18186r152j36595J87630j72770l35410K60174
$$ 5764226 5519315 5770401 5262726 5380912 5371760 5235165 5422795 5250025 4914615 5174789
14089E174789k85179J14436J56245j74686j57231O4416q6611k21030j89971J44371
$$ 5174789 4889610 5004046 5160291 4985605 4828374 4892790 4806179 4585149 4395178 4539549
14079D539549n6799K42783j64662j25635m11403L11588k42411R9612O7054l14968
$$ 4539549 4482750 4725533 4560871 4435236 4023833 4335421 4093010 4192622 4259676 3944708
14069C944708p5017r91O1772J74205l40876R5580L16449m13050J37602P7442K4413
$$ 3944708 3869691 3868700 3930472 4104677 3763801 3859381 4175830 3762780 3900382 3977824 4002237
14058D002237l49986Q4960K4243J59069j45043j80666J18998j84856l60652O6096
$$ 4002237 3652251 3737211 3761454 3920523 3775480 3594814 3713812 3528956 3168304 3234400
14048C234400K70542k6546k2708j70166J36322l70609R5604l26517N6876R4554
$$ 3234400 3504942 3478396 3455688 3285522 3421844 3051235 3146839 2820322 2877198 2971752
14038B971752R1206j69854p2634J62553j63640K22153n5276J01168j33027m04882
$$ 2971752 3062958 2893104 2820470 2983023 2819383 3041536 2986260 3087428 2954401 2549519
14028B549519J74131K17601l1399L866l20921j81490K70216k58449J92854k6516
$$ 2549519 2723650 2941251 2909852 2913718 2592797 2411307 2681523 2423074 2615928 2589412
14018B589412J29320q0058k81075j0154j88558M91035j03909k06597k52608j25052
$$ 2589412 2718732 2638674 2357599 2347445 2158887 2649922 2546013 2339416 2086808 1961756
14008A961756n5948J22522j79080K55579L3727M8498K69047k51189k33233M14295
$$ 1961756 1905808 2028330 1849250 2104829 2138556 2187054 2456101 2204912 1971679 2385974
13998B385974k15180K7242l81006L06649J5036j32367J9451N32825M23733J011698
$$ 2385974 2170794 2198036 1817030 2123679 2138715 2006348 2025799 2558624 2982357 3994055
13988C994055K717383P500873J9445078Q909867k1123749r950088m697865j776664
$$ 3994055 6711438 14212311 33657389 42567256 21443507 11493419 6795554 5018890
13980E018890q04424n07296n56521k521j95377j71627j33424P6630o2128j00245
$$ 5018890 4214466 3707170 3150649 3148128 2952751 2781124 2647700 2724330 2662202 2561957
13970B561957Q4476k39191p445j31316k596J21896m14029J55980l9079r6176j26970
$$ 2561957 2646433 2407242 2399797 2268481 2265885 2387781 1973752 2129732 2090653 1994477 1867507
13959A867507K86012n50416O77185m36404K09372l6864k69959R7203o1230J85912
$$ 1867507 2153519 1603103 2280288 1843884 2053256 2016392 1746433 1843636 1782406 1968318
13949A968318n54219K96497J46962q4763L23226o21382M09479k7051r5088J09812
$$ 1968318 1414099 1710596 1857558 1772795 2096021 1474639 1884118 1857067 1761979 1871791
13939A871791k63957n7931q8287J52680L7708j09007p665j34791J90544l2376
$$ 1871791 1607834 1549903 1461616 1614296 1652004 1542997 1535332 1400541 1591085 1558709
13929A558709j32847J23351k58335K76429Q7735K65434o35146R4883O4380j18823
$$ 1558709 1425862 1549213 1290878 1567307 1655042 1920476 1285330 1380213 1444593 1325770
13919A325770Q7561l3575j73391K42017L61555m64464k11189M67989j55757J73981
$$ 1325770 1413331 1379756 1206365 1448382 1809937 1345473 1134284 1602273 1446516 1620497
13909A620497p0138l79482r0608M02908k54486K22312k40556j00486J09790K28728
$$ 1620497 1550359 1170877 1080269 1483177 1228691 1451003 1210447 1109961 1219751 1448479
13899A448479l72540M37325k77619M39635n03438J28544p2445m4443K7274K49521
$$ 1448479 1075939 1513264 1235645 1675280 1171842 1300386 1227941 1183498 1210772 1460293
13889A460293k17662K6583j28682k47885L6998M16037m08789M26526k54053o8402
$$ 1460293 1242631 1269214 1140532 892647 929645 1345682 936893 1363419 1109366 1040964
13879A040964l7759M16355k58327l99047J54027N30041l35970l0899J40539m20995
$$ 1040964 1003205 1419560 1161233 762186 916213 1446254 1110284 1079385 1219924 798929
13869G98929K77023K57742p3020k82659o7453p0689Q3449M541J52999O9361l23990
$$ 798929 1075952 1333694 1260674 978015 910562 839873 923322 927863 1080862 1150223 826233
13858H26233J33876M438k20013n4168L20411m4238j47725J52093r2757L72172
$$ 826233 960109 964547 744534 690366 1010777 966539 818814 970907 878150 1250322
13848A250322l67303m0437J79681J55602k94837k1039J05023j12926q690j99122
$$ 1250322 883019 842582 1022263 1177865 883028 861989 967012 854086 845396 646274
13838F46274K25530n3460k0731K9201M63392n04007L1013J16935m1206j43570
$$ 646274 871804 818344 797613 826814 1290206 786199 817212 934147 892941 749371
13828G49371J23012r2964N2341K6523k07061K27075l7003q88j34708K69720k24203
$$ 749371 872383 779419 831760 858283 651222 878297 841294 840406 705698 975418 751215
13817G51215n9798q0655J99604L3220q6621O5885j65952J2716j41747K6321J06881
$$ 751215 691417 610762 810366 843586 756965 822850 656898 669614 527867 554188 661069
13806F61069J87582r9935p5435k3311K71541n8731k11661O02508D35859N18008
$$ 661069 848651 748716 673281 649970 921511 862780 651119 1253627 435859 953867
13796I53867l04669Q9741j56259P0819J16660P8341j0916l60174J48625j1342
$$ 953867 649198 738939 582680 653499 770159 848500 837584 477410 626035 614693
13786F14693J26745j83908j47546J87274j87213N05535m40235L18884B41403J43795
$$ 614693 741438 557530 409984 597258 410045 915580 475345 794229 241403 385198
13776C85198J33171K57310j0215p2821M6277J09628C05012J72746l8658O1846
$$ 385198 518369 775679 765464 692643 738920 848548 305012 477758 439100 500946
13766E00946K12109J8788l1803l19599K56365r3875j80726K61187j64523L77064
$$ 500946 713055 731843 700040 380441 636806 542931 362205 623392 458869 835933
13756H35933C65434K03822j66380J22046J77789p4781p8045j41559J22458P1632
$$ 835933 365434 569256 402876 524922 702711 627930 549885 408326 530784 602416
13746F02416j86375K3039J54247M0847M3014C02854L01415j97908J13049B59314
$$ 602416 416041 439080 593327 634174 677188 302854 604269 406361 519410 259314
13735F30254j6376C01817N34076l13569K38971l47362K25639m0198l4315p0673
$$ 630254 613878 301817 835893 522324 761295 413933 639572 599374 565059 494386
13725D94386p2765M8274L73684k95081J87169j94499J33233j21257k07045n9162
$$ 494386 421621 469895 843579 548498 735667 541168 674401 553144 346099 286937
13715B86937L44400j54425m655K4320j26037K86695J53682k2075m2461q3058j02969
$$ 286937 631337 476912 472257 496577 370540 657235 810917 788842 746381 663323 560354
13704E60354q311J00601l00267J35595K00649k83798p02q945n6861J11437l051
$$ 560354 552043 652644 352377 487972 688621 404823 404121 395176 338315 449752 446701
13693D46701k13572J25325J75924j72973J81709N9305j50777j2669K2277J92756
$$ 446701 233129 358454 534378 361405 543114 602419 451642 438973 461250 654006
13683F54006j10495B50643J65014R3975j94376K29786B09653K16789m2099L5070
$$ 654006 543511 250643 415657 509632 315256 545042 209653 426442 384343 419413
13673D19413k02439K25720J02619j17374k09746K04349A60005L91012B45031J23168
$$ 419413 216974 442694 545313 427939 218193 422542 160005 551017 245031 368199
13663C68199J13159l814P2420k68224c6051C20681K29103B32622j6551N14234
$$ 368199 481358 477544 549964 281740 -36051 320681 549784 232622 216071 730305
13653G30305j06964o6881N1825J14013k97582A15625J66098G5173L29594j34280
$$ 730305 623341 556460 608285 722298 424716 115625 281723 75173 404767 270487
13643B70487L38972k69773D0579J4193L06852K858K33296q8399l9474j46819A14209
$$ 270487 609459 339686 40579 54772 361624 364482 597778 509379 469905 323086 114209
13631C94117A27057M44793R4475B95108J61112A69342K14302J43746m4412A81785
$$ 394117 127057 571850 666325 295108 456220 169342 383644 527390 482978 181785
13620B84393q4218g9742A59217K73347J21908r982j49705A81395K65544K63711
$$ 284393 200175 -79742 159217 432564 554472 544490 394785 181395 446939 710650
13610G10650C19973K22481R1525k38134m8405L58132B65907L51537B70147j03430
$$ 710650 319973 542454 633979 395845 347440 705572 265907 617444 270147 166717
13600A66717E0821L95771j21405j37240J25761J94382B16946H6790K03341K6794
$$ 166717 50821 446592 325187 187947 313708 508090 216946 86790 290131 316925
13590C16925J7893P8458J8461n138q131k01449K90424A14191M16425l4628J12714
$$ 316925 334818 413276 431737 426599 418468 217019 507443 114191 530616 495988 608702
13579F08702B47289J03885j53709L42252A24085p579K66954p591j42067J74825
$$ 608702 247289 351174 197465 539717 124085 116506 383460 375869 233802 408627
13569D08627n0220Q3685A64819J41156j21196j9882P6021B2740K01860K14237
$$ 408627 358407 442092 164819 305975 184779 164897 240918 22740 224600 438837
13559D38837J90127A22123g1874B90645J97643B28433K74927F8170J04869J25644
$$ 438837 628964 122123 -71874 290645 488288 228433 503360 68170 173039 298683
13549B98683R3305j77594J30872J11098j93379M68166e3561A23947K74347A93886
$$ 298683 391988 214394 345266 456364 262985 731151 -53561 123947 398294 193886
13538B53199P9024j12154j4302b54502E18425F1084M28308k32656L9249A20834
$$ 253199 332223 220069 205767 -254502 518425 61084 489392 256736 295985 120834
13527B21177L52828A55978L39612A9197L56564A4031J48668M1419R1841F4456
$$ 221177 574005 155978 495590 19197 375761 14031 162699 204118 295959 64456
13516C49419j40790o6348L47319m5773J02453j65379d4062C57156j08124G422
$$ 349419 208629 142281 489600 443827 546280 380901 -44062 357156 249032 7422
13505A31698K97208A25475K26907Q4168A69925J28359K89966K797B30479q5704
$$ 131698 428906 125475 352382 436550 169925 298284 588250 591047 230479 144775
13495A44775O5620L8468o5783J72504I5328e3999H0176N6507O226l709J08074
$$ 144775 210395 248863 183080 355584 95328 -53999 80176 136683 142909 139200 247274
13484B47274F1618L6940i32C22944J98084k03635J35156E8161J46424J47954j71410
$$ 247274 61618 98558 -932 322944 521028 317393 452549 58161 204585 352539 181129
13473A81129Q9920c9282A25942O7633K9653k0008H4682K6953R511K63088A67414
$$ 181129 271049 -39282 125942 193575 223228 203220 84682 111635 121146 384234 167414
13461A97944K532K54033j03343m4808B119K26784d8601G9977J97992A15134l5526
$$ 197944 200476 454509 351166 306358 2119 228903 -48601 79977 277969 115134 79608
13450G9608N60604D4012f9106D40738A19867J79690A34981j737K09920I8855L0698
$$ 79608 640212 44012 -69106 440738 119867 299557 134981 133244 343164 98855 129553
13439A29553c5587C07861j38850n846L48945k28187i7361A60348P9156a8863B24482
$$ 129553 -35587 307861 169011 163165 512110 283923 -97361 160348 239504 -18863 224482
13427f849E4382J1322K14578q6435F9688K29476i8928B20126P7384k1718O409
$$ -6849 54382 65704 280282 193847 69688 299164 -98928 220126 297510 275792 282201
13416B82201J66451H4517N7752J63423J45911d7675A42675C800M06327L043A56392
$$ 282201 448652 84517 142269 305692 451603 -47675 142675 3800 410127 413170 156392
13404A82004m5818K06264h189E02859k27849L13242I8414b36569A87031H0947
$$ 182004 136186 342450 -8189 502859 275010 588252 98414 -236569 187031 80947
13393B10531M9318j18967R5489L61351H8377J56631j14082L1444G509K75708F9358
$$ 210531 259849 140882 236371 597722 88377 245008 130926 162370 7509 283217 69358
13381H3003a67307A75386J57034l3744J03846j90087F566K42487n88J41972q9662
$$ 83003 -167307 175386 332420 298676 402522 212435 6566 249053 248465 390437 300775
13370C00775B4141L91467j89478J97205J22220B56922R0028R9283m3675P8761
$$ 300775 24141 415608 226130 423335 545555 256922 346950 446233 402558 481319
13360D81319j30155B289g7396B53136j4549F8647J45754q09k8043L38604A79481
$$ 481319 351164 2289 -77396 253136 238587 68647 214401 213592 185549 524153 179481
13348D8780L9852M8577C1153J30611L58041A41894J33945m0363l549J41221a90422
$$ 48780 88632 137209 31153 161764 519805 141894 275839 235476 231927 373148 -190422
13336B09412r4964K7903K3117M8696J88009c36107I7363L37293j73493O3396A0997
$$ 209412 114448 142351 165468 214164 402173 -336107 97363 434656 261163 324559 10997
13324C10584N5613j74595K01931F0455O3657D4234Q8553A1431M23440G0339R2720
$$ 310584 366197 191602 393533 60455 124112 44234 132787 11431 434871 70339 163059
13313A63059D640L00251b787B28826a8258D54879G5348J65898r4676J1411J51780
$$ 163059 4640 304891 -2787 228826 -18258 454879 75348 241246 146570 157981 309761
13302C09761A19494B8959O94L84104j45018M5247F9059a19777C38178A01681l6335
$$ 309761 119494 28959 29653 413757 268739 313986 69059 -119777 338178 101681 65346
13291F5346L2731l0716a02617A43407C4570A3100J9828M34331b19327C7381a78962
$$ 65346 98077 67361 -102617 143407 34570 13100 32928 467259 -219327 37381 -178962
13279A83744c7114C31507a61281C9812f8456q1795l3840P1925A43720K8622f111
$$ 183744 -37114 331507 -161281 39812 -68456 -150251 -184091 -112166 143720 172342 -6111
13267D54890j92429E2284K58153j18978p4415C3931J72828q1998K23277j14661
$$ 454890 262461 52284 310437 191459 117044 33931 206759 124761 348038 233377
13257B33377J215C0084J19724R3746P3967j34350J47284p8033H1400D721K13257
$$ 233377 234592 30084 149808 243554 317521 183171 330455 252422 81400 4721 217978
13246B17978f496E3564J0190R9989J83855E3439A8597K5170J51500j373D9592
$$ 217978 -6496 53564 63754 163743 347598 53439 18597 43767 195267 193894 49592
13234A28924N3634K15481p3219a60385B70162H1341D0363M5163K1775K36395e9132
$$ 128924 182558 398039 324820 -160385 270162 81341 40363 85526 107301 343696 -59132
13222E2084K10041a17604A54021C8593b67598C39514A5072J51202j4884D0659
$$ 52084 262125 -117604 154021 38593 -267598 339514 15072 166274 151390 40659
13211a33991a3542E7502M2922M2878M98544a39936A12511L9249i6895Q1B75209
$$ -133991 -13542 57502 100424 143302 641846 -139936 112511 151760 -96895 -96814 275209
13199I8873a60393C27322A7013m059c6726E0003N8565A1191a90685B72250n4165
$$ 98873 -160393 327322 17013 12954 -36726 50003 108568 11191 -190685 272250 218085
13188B18085k0040i7481B12195h2148m034j62155A46176D5502J00264h6301A47188
$$ 218085 198045 -97481 212195 -82148 -86182 -248337 146176 45502 145766 -86301 147188
13176e4678A98387H2849a10957C8380j4580M6157J35894r8711K0491n1459e8338
$$ -54678 198387 82849 -110957 38380 23800 69957 205851 107140 127631 76172 -58338
13164A81982a09158A97140i1033B80759E8371J04557J37987d9104C8262O5148
$$ 181982 -109158 197140 -91033 280759 58371 162928 300915 -49104 38262 103410
13154A03410O0769b5926A74033n4810j7615b40509c1567o6559C4186M6357c959
$$ 103410 164179 -25926 174033 119223 101608 -240509 -31567 -98126 34186 80543 -3959
13142A09769a5996C31537r7152b01863e6625A37171m6575J12134a92074a6232
$$ 109769 -15996 331537 234385 -201863 -56625 137171 90596 202730 -192074 -16232
13131C46643A35111J67657P8206A67377J52167I369h1481l7953k51243a2183C06535
$$ 346643 135111 302768 380974 167377 319544 9369 -81481 -119434 -370677 -12183 306535
13119D8734a41804n7389B65352j4265j13642J84541r1247E2473P9622n3109j7497
$$ 48734 -141804 -199193 265352 251087 137445 321986 230739 52473 132095 78986 61489
13108F1489M6285M7346a52981P4364k976D00861j69571e581j02593H9627b22119
$$ 61489 107774 155120 -152981 -78617 -81593 400861 231290 -5581 -108174 89627 -222119
13096C8700O4383k1933R7792c6980j651A18194a89201C90168j28682E0580a38208
$$ 38700 103083 81150 178942 -36980 -38631 118194 -189201 390168 261486 50580 -138208
13084h143A81833J93874a27302c7942j16237f1056B01892j00713f4867B39522
$$ -8143 181833 375707 -127302 -37942 -154179 -61056 201892 101179 -64867 239522
13073c4707A2069N0291R5063m4974i3491G7672b11955B85250a66961A74416k8756
$$ -34707 12069 62360 157423 112449 -93491 77672 -211955 285250 -166961 174416 145660
13062A45660f5801C53608J40270a81198C37215E8010d1146E34932a84920A47839
$$ 145660 -65801 353608 493878 -181198 337215 58010 -41146 534932 -184920 147839
13051G8719k459a49905h677B9810J32775n6009c03011E5157b687A95095R743H3902
$$ 78719 76260 -149905 -8677 29810 162585 106576 -303011 55157 -2687 195095 204838 83902
13038A66K17555o7333J35360j39217J30982A0941c3364B64785j12461K32763j75239
$$ 166 217721 150388 285748 146531 277513 10941 -33364 264785 152324 385087 209848
13027B09848J28668K9033F1086a59969M8038A8664c448j50858B46515a68935h675
$$ 209848 338516 367549 61086 -159969 -111931 18664 -3448 -154306 246515 -168935 -8675
13015G5750J69580p0892J76499I3235h6734B13041r5411f0323A72410q0099j4912
$$ 75750 245330 174438 350937 93235 -86734 213041 117630 -60323 172410 92311 77399
13004G7399b95374B57785f4798A42436J5191J81488i028j84115c4756Q4D72339
$$ 77399 -295374 257785 -64798 142436 157627 339115 -9028 -193143 -34756 -34672 472339
12992H506N7822C394i5740A48225K71317c03356P2277A66982c09227C21423j04173
$$ 8506 66328 3394 -95740 148225 419542 -303356 -231079 166982 -309227 321423 217250
12981B17250c8545A21960g3799r1583E4550B6673J48604R1127A06427J72307C4398
$$ 217250 -38545 121960 -73799 -165382 54550 26673 175277 266404 106427 278734 34398
12969A51976F8650a36664N4920D23990I9130b19432J04740B63520C6614N036c1909
$$ 151976 68650 -136664 -81744 423990 99130 -219432 -114692 263520 36614 41650 -31909
12957g0259D51427a82546g312A57014J7717c6614A60384a49584q073C10878c0843
$$ -70259 451427 -182546 -7312 157014 174731 -36614 160384 -149584 -157657 310878 -30843
12945b7421r1238A5881J34630b53340c0621n9578p0508l0211B6640P2065e6493
$$ -27421 -118659 15881 150511 -253340 -30621 -90199 -160707 -190918 26640 98705 -56493
12933A71062b73737D7933a34824G9768J28628I8581A7156d0054B43342j00489
$$ 171062 -273737 47933 -134824 79768 208396 98581 17156 -40054 243342 142853
12923A42853A6105a06020B7765d7686A78992a37095a6044D00125a73380A60629
$$ 142853 16105 -106020 27765 -47686 178992 -137095 -16044 400125 -173380 160629
12912A27407a41090B05082b10498B0430K92980A11099N7106k5386a19709K5132
$$ 127407 -141090 205082 -210498 20430 313410 111099 168205 142819 -119709 -94577
12902i4577A66754o1296a06434B4549a1685H1037A8158h4777A81033F9966i6677
$$ -94577 166754 105458 -106434 24549 -11685 81037 18158 -84777 181033 69966 -96677
12890A36970a34548A62972o6782k8226e994k63718A23033O9696a04116a2858o9796
$$ 136970 -134548 162972 96190 67964 -5994 -269712 123033 192729 -104116 -12858 -82654
12879h2654A4268R0564D7761B1029i733j03170j60705D9229N956J42662b6547
$$ -82654 14268 104832 47761 21029 -9733 -112903 -273608 49229 55185 197847 -26547
12867i0157F5270a20772A78764a7378j64380C853b5328j14418C85639A0586J07082
$$ -90157 65270 -120772 178764 -17378 -181758 3853 -25328 -139746 385639 10586 117668
12856A17668a32111A06203L6192a06045A01913M5266m1070K59932h7489l7590
$$ 117668 -132111 106203 142395 -106045 101913 147179 106109 366041 -87489 -125079
12846a25079I6105a16900e1583B10960j02151b5047n1200m6637n7198Q3558B32118
$$ -125079 96105 -116900 -51583 210960 108809 -25047 -76247 -122884 -180082 -96524 232118
12834B81335j09383q3287b3886B72314a36952B6591K34322o8918o7133D5599E694
$$ 281335 171952 88665 -23886 272314 -136952 26591 260913 191995 124862 45599 5694
12822C04441h2380K0617j32533h3072p8854L7804p7129N4683A50840n9275b11512
$$ 304441 -82380 -61763 -194296 -83072 -161926 -124122 -201251 -146568 150840 91565 -211512
12810b52089A17929c70968e2026E1034A21a24410B73958d2447j65490A62625P9310
$$ -252089 117929 -370968 -52026 51034 121 -124410 273958 -42447 -207937 162625 241935
12799B41935a72800k03436l786i28C16105e4187j39054E1019h7652J792M330h921
$$ 241935 -172800 -376236 -380022 -928 316105 -54187 -193241 51019 -87652 -85860 -81530 -8921
12786A29318C1350A577b24866j711e4880k94462f104p401A87283C72K5214A699
$$ 129318 31350 1577 -224866 -226577 -54880 -349342 -6104 -13505 187283 372 25586 1699
12773b7658A51618l4063D6285J0913a64577A6900d07377G2963B3623a59050B5366
$$ -27658 151618 117555 46285 57198 -164577 16900 -407377 72963 23623 -159050 25366
12761B7100J52313p226f2175B04496F2724e4852p0734A09361J98533b36780b1375
$$ 27100 179413 172187 -62175 204496 62724 -54852 -125586 109361 307894 -236780 -21375
12749c7704I3602J27430b55501D44300f8744C8781K07115k0384b6431k83028H1974
$$ -37704 93602 221032 -255501 444300 -68744 38781 245896 225512 -26431 -309459 81974
12737B14544f4031G3345h6600j0888C3569N3505c6318D47279c34245f709C50464
$$ 214544 -64031 73345 -86600 -97488 33569 87074 -36318 447279 -334245 -6709 350464
12725b0363B3068J55828j1690d18788B56476K6967o4751e5013A5613K18184h6639
$$ -20363 23068 178896 167206 -418788 256476 283443 218692 -55013 15613 233797 -86639
12713h8003F3107B8109M11356e864m6946C19300r0186r7585L61857B27022I9585
$$ -88003 63107 28109 439465 -5864 -52810 319300 229114 131529 493386 227022 99585
12701C09702j0760A13711K12703G607b59648g8340A51526L23e4863B00105a71659
$$ 309702 298942 113711 326414 7607 -259648 -78340 151526 151849 -54863 200105 -171659
12689B39717o2283n664c24342B04379c8537j78695Q0361I5546M6572J36449k0304
$$ 239717 177434 171770 -324342 204379 -38537 -217232 -136871 95546 142118 278567 258263
12678B58263J70149n8647A54790b5395C95340A35005n1961M2120N1819p5283d9668
$$ 258263 428412 369765 154790 -25395 395340 135005 83044 125164 176983 101700 -49668
12666f203k2238l0324A08326a93252H6936J23077C776J56685a52786b8710A60097
$$ -6203 -28441 -58765 108326 -193252 86936 210013 3776 160461 -152786 -28710 160097
12654a6118B74886j6425F1525b8408A41554l5260c55025B07583f679k8271n5709
$$ -16118 274886 258461 61525 -28408 141554 106294 -355025 207583 -6679 -34950 -90659
12643i0659G8695L55372a6447D545L8700L8522h8245b4791D7136L53417L2505
$$ -90659 78695 434067 -16447 4545 43245 81767 -88245 -24791 47136 400553 433058
12632D33058a05539A43049R5147o6518M4085C7420M68692C0151A4636J56592M6618
$$ 433058 -105539 143049 238196 171678 215763 37420 506112 30151 14636 171228 217846
12621B17846J0030D7323P3446g4621E7783j1335f7081J5905A41866b0044A2944
$$ 217846 227876 47323 120769 -74621 57783 46448 -67081 -51176 141866 -20044 12944
12609a60314B26155G142a58563a1475A1758K69925h0809B6292b63687D2996J37173
$$ -160314 226155 7142 -158563 -11475 11758 281683 -80809 26292 -263687 42996 180169
12598A80169m4679L1270a08652B33701h4305n4028f6922B44390r3216j6273c38003
$$ 180169 135490 166760 -108652 233701 -84305 -138333 -66922 244390 151174 134901 -338003
12586c7741r1194j4374d7408p5794j47419B27403A02295g2768r7172b148A95699
$$ -37741 -128935 -143309 -47408 -123202 -270621 227403 102295 -72768 -169940 -2148 195699
12574B04742m6170J5127J11700B2104b1957A63928g513l2293B02703F6692i9035
$$ 204742 158572 173699 285399 22104 -21957 163928 -7513 -39806 202703 66692 -99035
12562a83833h9093j3000j60557C30321E3265a56421B40978J80932i9576B56570
$$ -183833 -89093 -102093 -262650 330321 53265 -156421 240978 421910 -99576 256570
12551A73142O7936a96075B88415j837j40308B9565M0643o025a47738H1690b65021
$$ 173142 241078 -196075 288415 286578 146270 29565 70208 64183 -147738 81690 -265021
12539B2081J40462C7874O0140K7346d5396A52491B102O6450a89561A07840j1662
$$ 22081 162543 37874 98014 125360 -45396 152491 2102 68552 -189561 107840 96178
12528I6178h683r7093C31566a91980B72983B8023J62498K05227A73335c10599
$$ 96178 -8683 -105776 331566 -191980 272983 28023 190521 395748 173335 -310599
12517a78230B53390b67462A84566b8217j09722G9702J40636a44185f1851k1502
$$ -178230 253390 -267462 184566 -28217 -137939 79702 220338 -144185 -61851 -83353
12507h3353B80513d9228B7368M9037L28821a28518J8083j16461A23701A6511f7866
$$ -83353 280513 -49228 27368 76405 405226 -128518 -110435 -226896 123701 16511 -67866
12495g5667A48441b62966A58426a05502D7804M7771b5411j25448A1629J47240
$$ -75667 148441 -262966 158426 -105502 47804 95575 -25411 -150859 11629 158869
12485A58869R8305j18126a09709G2566L00121j85403p8685a64961c5071j5782
$$ 158869 257174 139048 -109709 72566 372687 187284 108599 -164961 -35071 -50853
12475e0853j53712a5357C34790b98622a00173A05687c14451A16557a75382d635
$$ -50853 -204565 -15357 334790 -298622 -100173 105687 -314451 116557 -175382 -4635
12464a42162D1855j8793b3348A60726l4749b67324E1036j5509b68012A35777e7794
$$ -142162 41855 23062 -23348 160726 125977 -267324 51036 35527 -268012 135777 -57794
12452C7227f5390B86559a12081r3105H287J62442a43182G631L96294P5267c24600
$$ 37227 -65390 286559 -112081 -205186 8287 170729 -143182 7631 403925 479192 -324600
12440a87611q1242H4802B5054b30308C45807r2005b8550j59547A12874d8760n1539
$$ -187611 -268853 84802 25054 -230308 345807 253802 -28550 -188097 112874 -48760 -100299
12429a00299j83981k4831J51019O4197A49747b37419k8061Q2725I2637b848j56905
$$ -100299 -284280 -309111 -158092 -93895 149747 -237419 -265480 -182755 92637 -2848 -159753
12418a59753a8062j20576k28038B39764i8608j11181I4327k7225L0518a30303
$$ -159753 -18062 -138638 -366676 239764 -98608 -209789 94327 67102 97620 -130303
12407e036E2590a35081p755m4711E6062k5453d9418E5259c9872O911k50288A20315
$$ -5036 52590 -135081 -142836 -187547 56062 30609 -49418 55259 -39872 -32961 -283249 120315
12394B04928b07632c4341k06320A89136c52983B37659j09971A4196f9396G3933
$$ 204928 -207632 -34341 -240661 189136 -352983 237659 127688 14196 -69396 73933
12383I342N2178b43076a3047j15218A27676B9957f6859J1540n5557A00673a34745
$$ 9342 61520 -243076 -13047 -128265 127676 29957 -66859 -55319 -110876 100673 -134745
12371A17759n1788P8118l5773D651J51584a41618C9244K3961a75787C221J37712
$$ 117759 65971 144089 108316 4651 156235 -141618 39244 63205 -175787 3221 140933
12360A40933a16912A29357a01351J2319J0361j2794A59565l2043l2349J60461
$$ 140933 -116912 129357 -101351 -89032 -78671 -91465 159565 127522 95173 255634
12350B55634l1452F8435J01941a78576A98454i0117A05166a22640A29338k5250
$$ 255634 224182 68435 170376 -178576 198454 -90117 105166 -122640 129338 104088
12340A04088l6141J58810I4611C5115J59734h2606K592H415Q8789C882K21707
$$ 104088 67947 226757 94611 35115 194849 -82606 -80014 8415 97204 3882 225589
12329B25589E6980M9748h7008j52116a14671G0885J42644J14131A5453B632R7059
$$ 225589 56980 106728 -87008 -239124 -114671 70885 213529 327660 15453 2632 99691
12318I9691b90174B3413i879p0299p1569e1816H0219O2278m4555Q0776K59404
$$ 99691 -290174 23413 -9879 -80178 -151747 -51816 80219 142497 97942 178718 438122
12307D38122j16662F144R9798a58166C8267j7306a3306D26884F7643c0748I2385
$$ 438122 321460 6144 105942 -158166 38267 20961 -13306 426884 67643 -30748 92385
12295b90644A36329a02084d0916A17560Q2581q8647i3750A22783a74201P1434
$$ -290644 136329 -102084 -40916 117560 200141 111494 -93750 122783 -174201 -102767
12285a02767q7628C19556i5218j16364A21462L2566D3104b73823O4226A3580J795
$$ -102767 -190395 319556 -95218 -211582 121462 154028 43104 -273823 -209597 13580 15375
12274A5375K95608D0949J12615o1623J2062m6239J64695m9329b69084A48455P7946
$$ 15375 310983 40949 153564 91941 104003 57764 222459 173130 -269084 148455 226401
12263B26401A06568c79805A11621L5849a47569A37278b0173A76200K71951A55426
$$ 226401 106568 -379805 111621 147470 -147569 137278 -20173 176200 448151 155426
12252G4395i6118A40793A4326b540A23458J92540f5577B52086B4413K34839C5169
$$ 74395 -96118 140793 14326 -2540 123458 315998 -65577 252086 24413 259252 35169
12240A18724e0499L849j14389e1369B71398J1861k9336K36610j86208g1073A50084
$$ 118724 -50499 -46650 -161039 -51369 271398 283259 253923 490533 304325 -71073 150084
12228e852C27132N4622e4935D15871p9246F0158a34043E50708g4836D45295I084
$$ -5852 327132 381754 -54935 415871 336625 60158 -134043 550708 -74836 445295 9084
12216A49252B3467R2536O8296o8403K21413D126h8602C2513L8146J55639l9299
$$ 149252 23467 116003 184299 115896 337309 4126 -88602 32513 70659 226298 186999
12205A86999d594l7066I3360P3701M0585J48865a2732C56794K01805k09313l8320
$$ 186999 -4594 -41660 93360 167061 207646 356511 -12732 356794 558599 349286 310966
12194C10966j30457J86753a5710A07413D6069M07708k03748b4180A85764A0243
$$ 310966 180509 367262 -15710 107413 46069 453777 250029 -24180 185764 10243
12183A41259E1168a51032A54684C8131L96903j85761k1762o1620J96948j40549
$$ 141259 51168 -151032 154684 38131 435034 249273 227511 165891 362839 222290
12173B22290D9674L91862h2520B01739d8503r6316G1468A2340M410N9237a1978
$$ 222290 49674 441536 -82520 201739 -48503 -144819 71468 12340 16750 75987 -11978
12161f6088B36347J52031A61586j8899a37286A4447b34609B58102D9884a96245
$$ -66088 236347 388378 161586 142687 -137286 14447 -234609 258102 49884 -196245
12150a3292n7037B5K6673K48424b58660B54946c42571a20509A19617a73910A15766
$$ -13292 -70329 25 26698 275122 -258660 254946 -342571 -120509 119617 -173910 115766
12138e6149b979A34061a67777B9814J90698c6142p6129L7730C54881d7563H4951
$$ -56149 -2979 134061 -167777 29814 220512 -36142 -112271 -74541 354881 -47563 84951
12126A50016f1997j17064A24457a93688k41191A47359d7728C38933p7066b13233
$$ 150016 -61997 -179061 124457 -193688 -434879 147359 -47728 338933 261867 -213233
12115a60765Q004k4770l2885B49117a75610d2672a977j57271g2152c5685A56456
$$ -160765 -152761 -177531 -210416 249117 -175610 -42672 -1977 -159248 -72152 -35685 156456
12103b3107A71649e9281k0997G6569L7248a77688A42142D6484a4895A24424l1069
$$ -23107 171649 -59281 -80278 76569 113817 -177688 142142 46484 -14895 124424 93355
12092I3355a9488B42795j6687E7176J02686a87234O7991r448O2423F880b73739
$$ 93355 -19488 242795 226108 57176 159862 -187234 -119243 -128691 -66268 6880 -273739
12080F0977J3341a93264C2070R3934b5633o1999r1468e5478B68099D6616b1726
$$ 60977 74318 -193264 32070 126004 -25633 -87632 -179100 -55478 268099 46616 -21726
12068D17449l4755J219564F06124m2005B40785j0452D522J31621c8722G7953a09618
$$ 417449 382694 1602258 606124 564119 240785 230333 4522 136143 -38722 77953 -109618
12056a16907A46234c77035e6026A13059a66799f2566f85E6856J81346r7291O6235
$$ -116907 146234 -377035 -56026 113059 -166799 -62566 -685 56856 238202 140911 207146
12045B07146b6545C873a94216A36997b72585a24593A34795E8592d1226E0076N077
$$ 207146 -26545 3873 -194216 136997 -272585 -124593 134795 58592 -41226 50076 55153
12034E5153Q363J44819a17911A88024I803f98k846j17290j2699O0219k32067a35061
$$ 55153 63516 208335 -117911 188024 9803 -698 -3544 -120834 -133533 -73314 -305381 -135061
12021c06369A22385d9572B70635A404d0689B67363E3986J97026a7250j01C43049
$$ -306369 122385 -49572 270635 1404 -40689 267363 53986 251012 -17250 -17351 343049
12009G4970J30201q7362e8816k01239i6862k77656a21592A20045a32512B31528
$$ 74970 205171 117809 -58816 -260055 -96862 -374518 -121592 120045 -132512 231528
11998a96430J8879E4672J41258c2683j6575K1886l99825P0203C38635A21887b20067
$$ -196430 -177551 54672 195930 -32683 -49258 -27372 -427197 -356994 338635 121887 -220067
11986b41989B47526H6069f0103k43919N9707i9252F0096B7786O7323a59144A56812
$$ -241989 247526 86069 -60103 -304022 -244315 -99252 60096 27786 95109 -159144 156812
11974h7293G890i8226j5020o6082M5268C33494j29510a55684G7171a97361C14881
$$ -87293 7890 -98226 -113246 -179328 -134060 333494 203984 -155684 77171 -197361 314881
11962c2918k49806E7730e426j22240I2853J09433a20345A88097b17859F6071R8453
$$ -32918 -282724 57730 -5426 -127666 92853 202286 -120345 188097 -217859 66071 164524
11951A64524b6158j85779I5083L354c92661g5847A90736a11078j63198a06925
$$ 164524 -26158 -211937 95083 98437 -392661 -75847 190736 -111078 -274276 -106925
11940C1244J654d7000D3804g2990A20458c6801q6724A11200j8595m4889A9666
$$ 31244 32898 -47000 43804 -72990 120458 -36801 -123525 111200 92605 47716 19666
11928C24359b38980F5490J1071C6881J54101L3431a98870o4728A96956g2599q0628
$$ 324359 -238980 65490 76561 36881 190982 224413 -198870 -263598 196956 -72599 -153227
11917a53227F4693B6938b17177L8474A02118a96514J1580k3310R7669F0366Q401
$$ -153227 64693 26938 -217177 -178703 102118 -196514 -184934 -208244 -110575 60366 68767
11906F8767a2996G2858J3786a95969b3439c098j42732d2020j03667e7112q1133
$$ 68767 -12996 72858 86644 -195969 -23439 -3098 -145830 -42020 -145687 -57112 -138245
11895a38245a7571p3609H7499K6735f8828D22963B533J0746L73480e1436B7132
$$ -138245 -17571 -91180 87499 114234 -68828 422963 2533 13279 386759 -51436 27132
11883A16528k5029g8576j66394J0942C99941b23956A47506A589a06988A38938
$$ 116528 91499 -78576 -244970 -234028 399941 -223956 147506 1589 -106988 138938
11872c9601o3140B93230j46046n8079Q6104b63053C08885e6376j14948D6749d50811
$$ -39601 -102741 293230 147184 89105 175209 -263053 308885 -56376 -171324 46749 -450811
11860c43565A58335A1066a3331D9443N9515K46878a19191b8952A10680b1043r1374
$$ -343565 158335 11066 -13331 49443 108958 355836 -119191 -28952 110680 -21043 -112417
11849a12417j25917g1738k8136j32215G9557J79628E4811a77708B46872C1507
$$ -112417 -238334 -71738 -99874 -232089 79557 259185 54811 -177708 246872 31507
11838a44362A48241j8146a48137A5303a9623A771e5388m2282a6225j17190j06499
$$ -144362 148241 130095 -148137 15303 -19623 1771 -55388 -97670 -16225 -133415 -239914
11827b39914A42723n8601k4771M4979a64673B61353I0323i9452A76013H0138L3603
$$ -239914 142723 84122 59351 104330 -164673 261353 90323 -99452 176013 80138 113741
11816A13741a46051G3303K17483o1140b21357a07674L873I106G73J38607g6888
$$ 113741 -146051 73303 290786 229646 -221357 -107674 -103801 9106 773 139380 -76888
11804a45726I491d25692a57305A25259E3106j741a9649B5333J15703l8497D6243
$$ -145726 9491 -425692 -157305 125259 53106 51365 -19649 25333 141036 102539 46243
11792D22245b369l61409E6789a35631D2250M3408a58162I0257L54294A79412i5083
$$ 422245 -2369 -363778 56789 -135631 42250 85658 -158162 90257 444551 179412 -95083
11780e5057B9818J50947L471F3951C1907K8746j4243J06681b37909M6540A27072
$$ -55057 29818 180765 184236 63951 31907 60653 46410 153091 -237909 -191369 127072
11768a78773P0657c1148j39877F7535J11288P8968D3524g3671B90915g2349l9490
$$ -178773 -108116 -31148 -171025 67535 178823 257791 43524 -73671 290915 -72349 -111839
11757a11839j0331N6323A34084a02992J5302a9551B0616b20583A17246a57416
$$ -111839 -122170 -65847 134084 -102992 -87690 -19551 20616 -220583 117246 -157416
11746c00518O3247f3523k5448C5792b69275J08606M0639M7777A8541J46294D2778
$$ -300518 -237271 -63523 -88971 35792 -269275 -160669 -120030 -72253 18541 164835 42778
11734a54072B18903O1279a84115a1698D8312c85018f9434K2976A09549c61407
$$ -154072 218903 280182 -184115 -11698 48312 -385018 -69434 -46458 109549 -361407
11723h7290q6803B43361I8733J05740C825L56981A46478b92639R8388d2620A47065
$$ -87290 -174093 243361 98733 204473 3825 360806 146478 -292639 -194251 -42620 147065
11711A06967L5696n3389A5253J55121o4731a20735C3923P3638k6951j8654J74585
$$ 106967 142663 89274 15253 170374 105643 -120735 33923 107561 80610 61956 236541
11700B36541a13430c697j13742B94694a3399C7437b4854r9822B5919J20089J77325
$$ 236541 -113430 -3697 -117439 294694 -13399 37437 -24854 -124676 25919 146008 323333
11689C23333a16177c6965C05356D6J5411J58170E72b85642A52580J2225N8420
$$ 323333 -116177 -36965 305356 46 15457 173627 572 -285642 152580 164805 223225
11678B23225p5186O9649G4674b2883B17420K1100L22329H258e9573j00495I7353
$$ 223225 148039 217688 74674 -22883 217420 238520 560849 8258 -59573 -160068 97353
11666a83779B06306M2301a8089B0580a6113k40078R7816P1316K5640K0825B43802
$$ -183779 206306 248607 -18089 20580 -16113 -256191 -158375 -87059 -61419 -40594 243802
11654g6140A31137H294O6337b2506D3286J81768a76504H0992N4372c9183j26026
$$ -76140 131137 8294 74631 -22506 43286 225054 -176504 80992 135364 -39183 -165209
11643a65209n034A43646b90381f2751B75439C6072a50902A67682n1769J47301
$$ -165209 -170243 143646 -290381 -62751 275439 36072 -150902 167682 115913 263214
11633B63214D1472L751L9480M1531P616a22162e6957D7529q986J83527m8779a31982
$$ 263214 41472 45223 84703 126234 133850 -122162 -56957 47529 38543 222070 173291 -131982
11620C14986r2602B4825K57877d9345a554n667B8152P2101A3939M6345J93077
$$ 314986 222384 24825 282702 -49345 -1554 -7221 28152 100253 13939 60284 253361
11609B53361A7613k076Q3376i5802c655I4354b8621o5170r9676C0278N7567c2827
$$ 253361 17613 15537 98913 -95802 -3655 94354 -28621 -93791 -193467 30278 87845 -32827
11596E07197I2455i1270A84088b949j61829A03338K40657m745a5389A91612p7484
$$ 507197 92455 -91270 184088 -2949 -164778 103338 343995 339250 -15389 191612 114128
11585A14128j0566m8400J85381j10490J61451j41332n1292b5354j5103C49375
$$ 114128 103562 55162 240543 130053 291504 150172 98880 -25354 -40457 349375
11574h452A72031A6141K40983C3785g1108E2439a40136A12227D7814f6938j45803
$$ -8452 172031 16141 257124 33785 -71108 52439 -140136 112227 47814 -66938 -212741
11563b12741D20467G6003K50050B7342J07002K2099c8395E7293K81031a02188
$$ -212741 420467 76003 326053 27342 134344 156443 -38395 57293 338324 -102188
11552d2957G828J66301F0697J78522J28117a62689f1404F4272i3133A11747J68769
$$ -42957 7828 174129 60697 239219 367336 -162689 -61404 64272 -93133 111747 280516
11541B80516K5050j11790a79661A88246K78445B01834a53540C85784g825r2892
$$ 280516 305566 193776 -179661 188246 466691 201834 -153540 385784 -7825 -100717
11531a00717G5390a35828E2656L2421L17446a07883N0312D9276e1711B2772K78828
$$ -100717 75390 -135828 52656 85077 402523 -107883 -57571 49276 -51711 22772 301600
11520C01600a17644j18314B86381p8659c0012A19598K75625b66935B0404J82015
$$ 301600 -117644 -235958 286381 207722 -30012 119598 395223 -266935 20404 202419
11510B02419c313A27763C5728P6150J95081J29205a29855A37735m1118c6729C60101
$$ 202419 -3313 127763 35728 111878 306959 436164 -129855 137735 96617 -36729 360101
11498A04395K58979a87137B29918B8983K51389o5116a11243M0114B89418a06758
$$ 104395 363374 -187137 229918 28983 280372 215256 -111243 -71129 289418 -106758
11487B56231a63707A1272K80045j31508L6293M4196a1993B77647H1998J88494
$$ 256231 -163707 11272 291317 159809 196102 240298 -11993 277647 81998 270492
11477B70492I0570J64837K71841j89709j03750H946M57500j93131n3898K0530
$$ 270492 90570 255407 527248 337539 233789 8946 466446 273315 219417 239947
11467B39947b109k11711A4934k769K49300m5232J7859e8392E4461a33434B11914
$$ 239947 -2109 -213820 14934 12165 261465 216233 234092 -58392 54461 -133434 211914
11455A87514a39218A14487B4490c26940a06548A41453K15557j04553m0561F4994
$$ 187514 -139218 114487 24490 -326940 -106548 141453 357010 252457 211896 64994
11444H180N1813d953A40479o4234h9985A25972M15054a00952A54922a57686a9569
$$ 8180 59993 -4953 140479 76245 -89985 125972 541026 -100952 154922 -157686 -19569
11432C56711i0324F5328B2944h2613a3407B82200b87406E9933f4649A31203F3080
$$ 356711 -90324 65328 22944 -82613 -13407 282200 -287406 59933 -64649 131203 63080
11420B4339c95503c9562H3755K17868j38143h3539C00167b03517D00998b18416
$$ 24339 -395503 -39562 83755 301623 163480 -83539 300167 -203517 400998 -218416
11409a07616H80J45538m8809J51916a50914B73467n8578h9064B97565j41502h0978
$$ -107616 880 146418 97609 249525 -150914 273467 214889 -89064 297565 156063 -80978
11397C3301f4511A13249c03586C9512c9810C39258C9660K3540b37712B62081b08083
$$ 33301 -64511 113249 -303586 39512 -39810 339258 39660 63200 -237712 262081 -208083
11385A22514c391A70612N4327c5086k4146I4886a93214B10711a62574C2160J00614
$$ 122514 -3391 170612 224939 -35086 -59232 94886 -193214 210711 -162574 32160 132774
11374A32774n4192O2331A6769J4501P9295a80781B6658c58398a10867A37645O3620
$$ 132774 78582 140913 16769 31270 110565 -180781 26658 -358398 -110867 137645 201265
11363B01265a4671j31191L5941C7452a80432b5168A8514e589j00990j41395B58044
$$ 201265 -14671 -145862 -109921 37452 -180432 -25168 18514 -5589 -106579 -247974 258044
11351g1428b5320D6710K83423a50086A25256m1883f5568A31350c39506E1447P792
$$ -71428 -25320 46710 330133 -150086 125256 83373 -65568 131350 -339506 51447 59239
11340E9239i5246G6658d0515k8858D5880a48160B91448A33370C7992a72307f2894
$$ 59239 -95246 76658 -40515 -69373 45880 -148160 291448 133370 37992 -172307 -62894
11328H271c2206C4291a08795l469M213J4486k5712L9690C05273a09012D89143
$$ 8271 -32206 34291 -108795 -112264 -108051 -93565 -119277 -79587 305273 -109012 489143
11316b54664G0323P977f8925A7087K57048a28751E16b2886A93531a22175l45805
$$ -254664 70323 78300 -68925 17087 274135 -128751 516 -22886 193531 -122175 -467980
11305d67980a9646j71856A30197b55470I773K32104l3747K3135G9456j2727d37305
$$ -467980 -19646 -191502 130197 -255470 9773 241877 208130 231265 79456 66729 -437305
11293a16662K6469A42662a16028k02389G438A016P436J78982a87307A10225m1299
$$ -116662 -90193 142662 -116028 -318417 7438 1016 8452 187434 -187307 110225 68926
11282F8926a32097C6578e4426A0117a90985B6030K02636c37570J19968A66772
$$ 68926 -132097 36578 -54426 10117 -190985 26030 228666 -337570 -217602 166772
11271c0733k12223g7713j37990A64O6515K10389j24056a07218J5889l307j78026
$$ -30733 -242956 -77713 -215703 164 66679 277068 153012 -107218 -91329 -94636 -272662
11260b72662C4346N8991c3573j55593K2656G3963l4177a68326k5454B2410J5539
$$ -272662 34346 93337 -33573 -189166 -166510 73963 39786 -168326 -193780 22410 37949
11249C7949j2551b1907A07692L62676F0544b10550N3214A7451c0317j380E1191
$$ 37949 25398 -21907 107692 470368 60544 -210550 -157336 17451 -30317 -31697 51191
11237a27047g639k95766c0997j44305J1990A90186D2873b25508F1347J83836f5547
$$ -127047 -7639 -303405 -30997 -175302 -163312 190186 42873 -225508 61347 245183 -65547
11225A25108B3892c40784a52020L4733c8106k9852C0791h1203j63753n2049J24144
$$ 125108 23892 -340784 -152020 -117287 -38106 -67958 30791 -81203 -244956 -297005 -172861
11214a72861E1927a00047D311J91909J2192f8060A19781a27798J7203j37711a7347
$$ -172861 51927 -100047 4311 196220 208412 -68060 119781 -127798 -110595 -248306 -17347
11202B60180j09745b6327n9493E5365a09264d4630F0107b24835B97398h3120A05500
$$ 260180 150435 -26327 -85820 55365 -109264 -44630 60107 -224835 297398 -83120 105500
11190C39636c53749a68227b8776k1460K301B64805d54857a35860k53664a53620
$$ 339636 -353749 -168227 -28776 -50236 -47935 264805 -454857 -135860 -389524 -153620
11179A39035K6540b17889B91824A29299b07736B03728H6551b97753G6022J31913
$$ 139035 165575 -217889 291824 129299 -207736 203728 86551 -297753 76022 207935
11169B07935J97253a32621A44556o5105J8685A2433b99995f169A96524O1247E5480
$$ 207935 405188 -132621 144556 79451 98136 12433 -299995 -6169 196524 257771 55480
11157H1384P7985E5930b0643C0320a06054A47063a92245J2847k68979K19203A02517
$$ 81384 159369 55930 -20643 30320 -106054 147063 -192245 -179398 -448377 -229174 102517
11145b40187A75906N6401c42245C0478R4987c2330j43156d2567B49980f8954p6437
$$ -240187 175906 232307 -342245 30478 125465 -32330 -175486 -42567 249980 -68954 -145391
11134a45391c3427D4434a18592A15324n2898O049b71691A46048J11160d9496G800
$$ -145391 -33427 44434 -118592 115324 62426 68475 -271691 146048 257208 -49496 7800
11122A93201O7933I2067b0075O158I8717a01622F0201b79488A1413J07387b49237
$$ 193201 261134 92067 -20075 -13917 98717 -101622 60201 -279488 11413 118800 -249237
11110D1111c6632J1301A58908p0201M68926i302B00013L53904j50066k1261j49987
$$ 41111 -36632 -25331 158908 88707 557633 -9302 200013 553917 403851 382590 232603
11099B32603q4893M9252L61538k78347N1857A51932c5903o0626A96262K93500
$$ 232603 147710 196962 558500 280153 332010 151932 -35903 -96529 196262 489762
11089D89762K00537C16908a1625A24181J49798P3704B0887J98064J62884A46758
$$ 489762 690299 316908 -11625 124181 273979 347683 20887 218951 381835 146758
11078F06086g6368B85042K38681B32392F9748K80517k6085j08076M43160l20780
$$ 606086 -76368 285042 523723 232392 69748 350265 324180 216104 659264 338484
11068C38484K3994j3290J70534K4103L50371m32488j25612J76393N07716l21373
$$ 338484 362478 349188 519722 543825 894196 461708 336096 512489 1020205 698832
11058F98832k30650K59530j34755p5323Q3783K45227k3652r4292k6476j69479
$$ 698832 468182 727712 592957 517634 601417 846644 822992 728700 702224 532745
11048E32745O98277n52129L18842j38858j0790j90557K21681k92665Q8728K26357
$$ 532745 1231022 678893 997735 858877 848087 657530 879211 586546 675274 901631
11038I01631l94007j9726K53318L07j03775K33522J52235r7710k66820B84072
$$ 901631 507624 487898 741216 741523 637748 871270 1023505 925795 658975 284072
11027G64810M7685k6547Q3870r1468O0052j889o5021J17223k91749J0206J89671
$$ 764810 812495 785948 869818 778350 838402 836513 771492 888715 596966 607172 796843
11016G96843C19952K87374J63319l12614K01850k40511M67675o5093l03605K89061
$$ 796843 319952 607326 770645 458031 659881 419370 887045 821952 518347 807408
11006H07408j84007J3188J77276k3936j62012K59554o3354L0201L5483l49652
$$ 807408 623401 636589 813865 789929 627917 887471 824117 854318 889801 540149
10996E40149L25285l2435l52455K04081n1738K05122K43872l49701q3108J81961
$$ 540149 865434 832999 480544 684625 632887 838009 1081881 732180 649072 831033
10986H31033K47382l37774M40517l10965J77128L08301J62990j79614M08761J45221
$$ 831033 1078415 740641 1181158 870193 1047321 1355622 1518612 1338998 1747759 1892980
10976A892980L3148K17881K57847L94181K01036k04535L07560j08441J48797m82486
$$ 1892980 1926128 2144009 2401856 2796037 2997073 2792538 3100098 2991657 3140454 2657968
10966B657968J41764l69487k67659k47054j11330K83545o7118Q2841K86637K61
$$ 2657968 2799732 2430245 2162586 1915532 1804202 2087747 2020629 2103470 2390107 2390368
10956B390368r9088k59459J25751j20918j00768k38585m43474j3864j37983m89163
$$ 2390368 2291280 2031821 2157572 2036654 1935886 1697301 1253827 1239963 1101980 612817
10946F12817j0005r5272k16590L6858k2447J84209k33689E1520J72303M23095
$$ 612817 602812 507540 290950 327808 305361 489570 255881 51520 223823 646918
10936F46918C0029K59603G3406j0874K26823j31979k6268P8500J22080a49780
$$ 646918 30029 289632 73406 62532 289355 157376 131108 209608 331688 -149780
10925f3102k29493C91871e9364j033C46535b98272H1179A4472a09784B46645j20124
$$ -63102 -292595 391871 -59364 -60397 346535 -298272 81179 14472 -109784 246645 126521
10914A26521a69155j02960a21218A7322J79215l401d63845A41838b4153A22798
$$ 126521 -169155 -272115 -121218 17322 196537 193136 -463845 141838 -24153 122798
10903a39317B91342J62788H606a4432A61559D8282J20289A2672b27300D6021O19
$$ -139317 291342 454130 8606 -14432 161559 48282 168571 12672 -227300 46021 46640
10892D6640i9914C53627A68790a1409E2272J91452c20123f7390K6825p939E569
$$ 46640 -99914 353627 168790 -11409 52272 243724 -320123 -67390 -40565 -48504 5569
10880A18977l8280a16280M1152m00414a39502O148j48233i2462C14221A8024a15326
$$ 118977 80697 -116280 -75128 -475542 -139502 -133354 -281587 -92462 314221 18024 -115326
10868d7348G1685a27860C1688K0371K35159A327e6478B08863B7211c56209J08863
$$ -47348 71685 -127860 31688 52059 287218 1327 -56478 208863 27211 -356209 -247346
10857b47346M6949B48760a62833Q683a8206j70200I4558i7065r6080d9837I1804
$$ -247346 -200397 248760 -162833 -154150 -18206 -188406 94558 -97065 -193145 -49837 91804
10845b2770B45705D5158R5130Q83f771j75834P8830A66223B1624a5844H0989d57021
$$ -22770 245705 45158 140288 141171 -6771 -182605 -103775 166223 21624 -15844 80989 -457021
10832A82014q6750a68867e2161N650l15578D7876a60262A18453h0990A3839J93000
$$ 182014 95264 -168867 -52161 -46511 -362089 47876 -160262 118453 -80990 13839 206839
10821B06839f6047p5499A17881C155J04351b61642P6750b7813q138E9369e0008
$$ 206839 -66047 -141546 117881 3155 107506 -261642 -184892 -27813 -35951 59369 -50008
10809a26759j61958a20464m9105E3574h7825E2119c88371I2065j2641h5776L9211
$$ -126759 -288717 -120464 -169569 53574 -87825 52119 -388371 92065 79424 -85776 -46565
10798d6565G5947i6490A42671a62766E837J18290e4790D1666a92606b796j14681
$$ -46565 75947 -96490 142671 -162766 5837 124127 -54790 41666 -192606 -2796 -117477
10787a17477d5639A93687a32074k1392A28860d3034A78435b08533Q6727A10248
$$ -117477 -45639 193687 -132074 -153466 128860 -43034 178435 -208533 -121806 110248
10776a72986j2681a4514E9619K01681g1922m9210M5946j88871B48817a38479F4559
$$ -172986 -185667 -14514 59619 261300 -71922 -121132 -75186 -264057 248817 -138479 64559
10764A42276o4923b9373C6879J64755b3855l8118j8011p2352c1503A72654b9651
$$ 142276 77353 -29373 36879 201634 -23855 -61973 -79984 -152336 -31503 172654 -29651
10752a27010e0992I9184A9148M24805b12329C3820p355L61778j75244a75417A0598
$$ -127010 -50992 99184 19148 443953 -212329 33820 26465 388243 212999 -175417 10598
10740C695i9036k24427J54626N5907j05782i7287j13539A15406a21754g708G3703
$$ 3695 -99036 -323463 -168837 -112930 -218712 -97287 -210826 115406 -121754 -7708 73703
10728B78157a43406G6923J83004F0109K76328h6158l8471b2728j96855K0140Q0489
$$ 278157 -143406 76923 259927 60109 336437 -86158 -124629 -22728 -219583 -199443 -118954
10717a18954B32539b44517c9103C39868G0248d03318F061a3018j99457a03479
$$ -118954 232539 -244517 -39103 339868 70248 -403318 6061 -13018 -212475 -103479
10706b16374B0688K9925b16097D4646b104m15295a27447B40527A08485b69952
$$ -216374 20688 50613 -216097 44646 -2104 -417399 -127447 240527 108485 -269952
10695F5503d075m2290m0738E4185a33985B48096d9352A37710c32022A18231J88849
$$ 65503 -4075 -46365 -87103 54185 -133985 248096 -49352 137710 -332022 118231 307080
10684C07080a18630A0627P8506a53138K4224k90622A52831b64498P9352m9082
$$ 307080 -118630 10627 89133 -153138 -128914 -419536 152831 -264498 -185146 -234228
10674b34228a16322m1359B60841a29818d1195k7831A42663a22418k00903d3645
$$ -234228 -116322 -157681 260841 -129818 -41195 -69026 142663 -122418 -323321 -43645
10663a28783m3665j23103a92G4883b35714J06859r1720R6770n6349K825B40635
$$ -128783 -172448 -295551 -192 74883 -235714 -128855 -220575 -123805 -180154 -177329 240635
10651A12278j7335A5322c6630f500H9353a56510A99775b9455k21788f9106A46897
$$ 112278 94943 15322 -36630 -6500 89353 -156510 199775 -29455 -251243 -69106 146897
10639i3421A229d12062E7347b36894F987b40943c9090q8541r5458j4934i0269
$$ -93421 1229 -412062 57347 -236894 6987 -240943 -39090 -127631 -223089 -238023 -90269
10627A40638m652a83112F3048J32386d3761j71446j62332B6393l634b4448n1426
$$ 140638 135986 -183112 63048 195434 -43761 -215207 -377539 26393 22759 -24448 -75874
10616g5874o9124o0758j89280p2497f1956l8236j11012h9881j72626a18399K6292
$$ -75874 -144998 -205756 -395036 -467533 -61956 -100192 -211204 -89881 -262507 -118399 -92107
10605i2107b6785o4207E1578h4542A27024E177b6781C4182J81414f0549H2732
$$ -92107 -26785 -90992 51578 -84542 127024 5177 -26781 34182 215596 -60549 82732
10593i14A74671b33836D6957a1171j93722i2953D0180K76249d6506j05024e067
$$ -914 174671 -233836 46957 -11171 -204893 -92953 40180 316429 -46506 -151530 -5067
10581b02734B8643Q3332O8717p9218D0786L4695f6283k28647A73380a85950A78700
$$ -202734 28643 111975 180692 101474 40786 75481 -66283 -294930 173380 -185950 178700
10569g6785k5973B37913a633k59716d5525A49163a53109B85733E9572d39901B13446
$$ -76785 -102758 237913 -1633 -261349 -45525 149163 -153109 285733 59572 -439901 213446
10557E9201J98089e780k73606A2677K77469A18475a22407d4348A46785a75898
$$ 59201 257290 -5780 -279386 12677 290146 118475 -122407 -44348 146785 -175898
10546C9254a82699B9745b28944N0897j06138d2835B15614a15744c9773p9518c2859
$$ 39254 -182699 29745 -228944 -178047 -284185 -42835 215614 -115744 -39773 -119291 -32859
10534B50400A03197A8506c52619A29079i4905B79366E2872j5716a1545j07056
$$ 250400 103197 18506 -352619 129079 -94905 279366 52872 37156 -11545 -118601
10524a18601A86171J53179a90306g5679b1940m8144a9866A38928k3590B7043M62613
$$ -118601 186171 339350 -190306 -75679 -21940 -70084 -19866 138928 115338 27043 489656
10513D89656b24487o3344A61438n9172a35355I5723J22433i920A09371m0272L501
$$ 489656 -224487 -287831 161438 102266 -135355 95723 218156 -9920 109371 69099 72600
10502G2600M9592a11032B4799a7617A969R351J61551e896A50228L383b44861A11718
$$ 72600 122192 -111032 24799 -17617 1969 11320 172871 -5896 150228 153611 -244861 111718
10489C4452L2299N253L18614j50757c0919B87835K89982J80641P4095k11918r1080
$$ 34452 66751 72004 390618 239861 -30919 287835 577817 758458 832553 620635 529555
10478E29555j07704A84024q8669C395Q4685L6695i9307C01427k2408j04720J36116
$$ 529555 421851 184024 95355 3395 88080 124775 -99307 301427 279019 174299 310415
10467C10415D2909A4886J11890a61926f3890E0804K59247a4235l28822B86954
$$ 310415 42909 14886 126776 -161926 -63890 50804 310051 -14235 -343057 286954
10456C692M4100N7083a71938B74908Q678b72943C9668L5514J92593i5779H6440
$$ 3692 47792 104875 -171938 274908 283586 -272943 39668 75182 267775 -95779 86440
10444C6643B858a06264c3580n0952p9239A4187c2096F8949c8767A6413J25220
$$ 36643 2858 -106264 -33580 -84532 -163771 14187 -32096 68949 -38767 16413 141633
10433A41633K4363f1616A49714b19363D9835b63343a6411k07786F8439i2689j77985
$$ 141633 165996 -61616 149714 -219363 49835 -263343 -16411 -224197 68439 -92689 -270674
10422b70674A27209a19794B0495J00767l8985c08303A52822J1478J7060a71782
$$ -270674 127209 -119794 20495 121262 82277 -308303 152822 164300 181360 -171782
10411B49331j17308B13b31978G6959a85016P9119G4638J11909C5863q633i9594
$$ 249331 132023 213 -231978 76959 -185016 -105897 74638 186547 35863 27230 -99594
10399b938D1622c19917j16981c4191A08591b13227D1284K21397A00998R8999P5081
$$ -2938 41622 -319917 -436898 -34191 108591 -213227 41284 262681 100998 199997 275078
10388B75078J91339j39722C2045O570J38209b96390A63792k5962D571J82662a3212
$$ 275078 466417 326695 32045 38615 176824 -296390 163792 137830 4571 187233 -13212
10376H037Q10328B74083i7567B51761K95027A70048l4474l5376J70125q146K81508
$$ 8037 818365 274083 -97567 251761 546788 170048 135574 100198 270323 262177 543685
10365E43685B68933L07155j65903q0429J57572A91681L19629k33719j20618K35232
$$ 543685 268933 576088 410185 329756 487328 191681 511310 277591 156973 392205
10355C92205j82468r5944L17152L5677j48402L74917J1906C01242J06512K25971
$$ 392205 209737 113793 430945 466622 318220 693137 705043 301242 407754 633725
10345F33725B76141J75150J6073j76517B6545K22483G4775K2001O84608B48594
$$ 633725 276141 451291 467364 290847 26545 249028 74775 96776 781384 248594
10334F3533J30799r1138h6372A85123p3599a38478B61599A28993K1700k088a95832
$$ 63533 194332 103194 -86372 185123 111524 -138478 261599 128993 150693 148605 -195832
10322C9023N0203K03588k8125J28648f0889a6853I5457h7962C95214D4485J533
$$ 39023 89226 292814 264689 393337 -60889 -16853 95457 -87962 395214 44485 46018
10311D6018J4522K50899G8497b3949A78730b8044A38979O1379f6128A24925A4418
$$ 46018 60540 311439 78497 -23949 178730 -28044 138979 200358 -66128 124925 14418
10299A20713g1700j69094B5737K03608I9486b22781H2045M0069C9136m444J139
$$ 120713 -71700 -240794 25737 229345 99486 -222781 82045 122114 39136 34692 35831
10288C5831c74730a08960E4239K60244K9399c75307B05291c8762k94473J46749
$$ 35831 -374730 -108960 54239 314483 343882 -375307 205291 -38762 -333235 -186486
10278a86486A25872b02551A7424a4478B8237Q2727a20573j40070H6025b3300A66680
$$ -186486 125872 -202551 17424 -14478 28237 110964 -120573 -260643 86025 -23300 166680
10266d7650A32376f5535j27293A91923j9443B7741K57023J13451L72780A92768
$$ -47650 132376 -65535 -192828 191923 172480 27741 284764 398215 770995 192768
10255a3079C23830D2188J11621d9343m8620G6914K00111I4514N468a20766D7941
$$ -13079 323830 42188 153809 -49343 -97963 76914 277025 94514 99982 -120766 47941
10243b81868j5858B21412i2721D46076B1092b44663M0082j228g2576A44653A4726
$$ -281868 -297726 221412 -92721 446076 21092 -244663 -204581 -205809 -72576 144653 14726
10231h5170b1523q1697j10077K6063c1393n850C8860F166b89610G0801P3889g4649
$$ -85170 -21523 -103220 -213297 -187234 -31393 -37243 38860 6166 -289610 70801 144690 -74649
10218a77462j70280a40981O3785J6008D0479L8604a38450A06513i3544l6168c1311
$$ -177462 -347742 -140981 -77196 -61188 40479 79083 -138450 106513 -93544 -129712 -31311
10206a42334e9737j6301A47356b5793B42010c60273h2660C9820K641K8894a63845
$$ -142334 -59737 -76038 147356 -25793 242010 -360273 -82660 39820 42461 71355 -163845
10194h0093r3889k33016B4125J4366a50535d2386A43188h5320A09352a00988d8196
$$ -80093 -173982 -406998 24125 38491 -150535 -42386 143188 -85320 109352 -100988 -48196
10182a52908e5116q1502C0116i2013r0318E5775h3648j24455Q926O2450G9368
$$ -152908 -55116 -136618 30116 -92013 -182331 55775 -83648 -208103 -199177 -136727 79368
10170b23275R0600b9766e864k45663q7771a29203A67992c22364A94758g743C6160
$$ -223275 -132675 -29766 -5864 -251527 -339298 -129203 167992 -322364 194758 -7743 36160
10158b6376k8087C0419b94487A8077O4359b95943i431n3351b2128l23344B1669
$$ -26376 -54463 30419 -294487 18077 82436 -295943 -9431 -62782 -22128 -345472 21669
10146b0110A06281m1234a02801j6552C3508i6303L6462K9168j97646A18999a30379
$$ -20110 106281 65047 -102801 -119353 33508 -96303 -59841 -30673 -228319 118999 -130379
10134g9895r7489D44362a77148q81b0174j26012m58109B1714J26333b28639C3583
$$ -79895 -177384 444362 -177148 -178029 -20174 -146186 -604295 21714 148047 -228639 33583
10122C82043b23040j41544A39365d71387A7703a03833N0202A83140P4388C9840
$$ 382043 -223040 -364584 139365 -471387 17703 -103833 -53631 183140 257528 39840
10111a34223A5728c98100A1907f385C3581M67237H6448b06247A19316b56689f386
$$ -134223 15728 -398100 11907 -6385 33581 500818 86448 -206247 119316 -256689 -6386
10099G1635J27284I901a28565j27068J05218A0501h2596B34961A1645P1305d0425
$$ 71635 198919 9901 -128565 -255633 -150415 10501 -82596 234961 11645 82950 -40425
10087i9754H9491a8838g370l9257j41599j06542Q4436A51932a43697d2758A23600
$$ -99754 89491 -18838 -7370 -46627 -188226 -294768 -210332 151932 -143697 -42758 123600
10075A69327b03571A38836b19475A99068F1342a21651K0331k75737g0275j86930
$$ 169327 -203571 138836 -219475 199068 61342 -121651 -101320 -377057 -70275 -257205
10065b57205a15030j81914A13093i9539k3782m9971K8298M63a7006j29445n6372
$$ -257205 -115030 -296944 113093 -99539 -123321 -173292 -144994 -144531 -17006 -146451 -202823
10054b02823L5674j74217b9486j13575r8328f929m861j72256g1529L3926C4349
$$ -202823 -167149 -341366 -29486 -143061 -241389 -6929 -11790 -184046 -71529 -37603 34349
10042A08753d1881F4162a17196j8914c4420r5507q8472i4695A17544h5165B34877
$$ 108753 -41881 64162 -117196 -136110 -34420 -129927 -218399 -94695 117544 -85165 234877
10030b97362A79245n4738e5085A74463o188a73358M1698A69302n97a95673r2804
$$ -297362 179245 124507 -55085 174463 168275 -173358 -131660 169302 168705 -195673 -288477
10019b88477d1615D16223g141p5134n6340j42444i1773j36890h6386c7849n2701
$$ -288477 -41615 416223 -7141 -82275 -138615 -281059 -91773 -228663 -86386 -37849 -90550
10008i0550d4468A67071F205J4367M2564a10044H805M7781b43873L6772B23427
$$ -90550 -44468 167071 6205 20572 63136 -110044 8805 56586 -243873 -207101 223427
9996i0494L8556g984l4601B16312d8687A41225J44295a31942A20822b69336N4398
$$ -90494 -51938 -7984 -42585 216312 -48687 141225 285520 -131942 120822 -269336 -214938
9985b14938A57225o0287c17245g9028a7783A8247Q0094J949b57691A15898c38641
$$ -214938 157225 96938 -317245 -79028 -17783 18247 98341 100290 -257691 115898 -338641
9973H9547B5403a01644o9748A8607R1768a10518b4216A55834J1337b77488J28982
$$ 89547 25403 -101644 -171392 18607 110375 -110518 -24216 155834 167171 -277488 -148506
9962a48506j47601A47513F4083b23863K1719P6914n8732G264J90917b06736B22171
$$ -148506 -296107 147513 64083 -223863 -202144 -125230 -183962 7264 198181 -206736 222171
9950F7823a40303A8143f5508K156M506B17596a09805B239Q1480B2618a27734J3673
$$ 67823 -140303 18143 -65508 -63352 -58846 217596 -109805 2239 83719 22618 -127734 -114061
9938a14061M4574a2149D9356c39213e8806a6980I1357d12237J83443H4247b11412
$$ -114061 -69487 -12149 49356 -339213 -58806 -16980 91357 -412237 -228794 84247 -211412
9926B7317O6098b27925C3465a21947d4994C5318b91337f9727e337A57808e2783
$$ 27317 93415 -227925 33465 -121947 -44994 35318 -291337 -69727 -5337 157808 -52783
9914B51695a24790B18930a7913j9763m90748C8637N799b67462J12618D91209A62173
$$ 251695 -124790 218930 -17913 -37676 -528424 38637 44436 -267462 -154844 491209 162173
9902a9015k88660e2766k06688i3001A39251F1874a36545G7039a40803c2830k96528
$$ -19015 -307675 -52766 -259454 -93001 139251 61874 -136545 77039 -140803 -32830 -329358
9891c29358a9024j24179j0371G1575b40496l6714C33189c7195k96398d6596m9299
$$ -329358 -19024 -143203 -153574 71575 -240496 -277210 333189 -37195 -333593 -46596 -95895
9880i5895I6238a55370e8216k11157B6144K06757F4751C0408a28892A20215a28927
$$ -95895 96238 -155370 -58216 -269373 26144 232901 64751 30408 -128892 120215 -128927
9868d0569l07395a71927a749j4643k34019o19g3454k2775B64294C8818N7645a81786
$$ -40569 -347964 -171927 -1749 -16392 -250411 -251030 -73454 -96229 264294 38818 96463 -181786
9855a44450G8019J02919b94395J07257l1642R8936A54019a01628b1348j15674
$$ -144450 78019 180938 -294395 -187138 -218780 -119844 154019 -101628 -21348 -137022
9845a37022q0773A5175a76021l6591A1572d6023K0125D9557c05132a06724k45293
$$ -137022 -217795 15175 -176021 -212612 11572 -46023 -25898 49557 -305132 -106724 -352017
9834c52017D0801b41070g6042c2337j21166C1990b89143F2342O2543J41528a85752
$$ -352017 40801 -241070 -76042 -32337 -153503 31990 -289143 62342 124885 266413 -185752
9822B6058h4298A86976c32526Q7776B61760n3109a03270B3424a15393J3706B17256
$$ 26058 -84298 186976 -332526 -244750 261760 208651 -103270 23424 -115393 -101687 217256
9810b68671R5139A8813a65889B42292c15159A15710F491d15279a90426r9256h0507
$$ -268671 -173532 18813 -165889 242292 -315159 115710 6491 -415279 -190426 -289682 -80507
9798a3660k59945P8719M4526m3023k70934D4044A9112b27134g9116j04143Q7069
$$ -13660 -273605 -194886 -150360 -193383 -464317 44044 19112 -227134 -79116 -183259 -96190
9787i6190A6106a39802H5771E538J1443a75535j65702p5144e6527a3903j20624
$$ -96190 16106 -139802 85771 5538 16981 -175535 -341237 -416381 -56527 -13903 -134527
9776a34527A6799a40129B57529o7206a58636B1756J70283i0057k06904a4954n5794
$$ -134527 16799 -140129 257529 190323 -158636 21756 192039 -90057 -296961 -14954 -70748
9765g0748C37231i7187k46063f8677k09117A1651d4596k72490g7050r3803b1020
$$ -70748 337231 -97187 -343250 -68677 -277794 11651 -44596 -317086 -77050 -170853 -21020
9753c1764o2611H687R0292m0468G256e5035k36213H354J5148c0611H1311b61958
$$ -31764 -94375 8687 98979 58511 7256 -55035 -291248 8354 23502 -30611 81311 -261958
9740A32021K1353a62461k29719a7050j22578q2219B38901d3256B30333o5316a39793
$$ 132021 153374 -162461 -392180 -17050 -139628 -221847 238901 -43256 230333 165017 -139793
9728i510D16975a26611j35412B712O6004d41886B5534a98454b8478q0044H8285
$$ -9510 416975 -126611 -262023 2712 68716 -441886 25534 -198454 -28478 -108522 88285
9716A31843a47074B4454J40508a99424o738p542d1442A54515a05670L4058H9479
$$ 131843 -147074 24454 164962 -199424 -206162 -213704 -41442 154515 -105670 -71612 89479
9704C74378I6599b35865o8958J18232c3618j42653d4741j88126R9615A63425a18481
$$ 374378 96599 -235865 -304823 -186591 -33618 -176271 -44741 -232867 -133252 163425 -118481
9692b71366j05705e1479A17393k6151a12167k2948K6692J207j84348Q6636a3307
$$ -271366 -377071 -51479 117393 91242 -112167 -135115 -108423 -107216 -291564 -204928 -13307
9680A88177k0549c2120j15724B4714b66241F671Q6672a98439m5127b3865H2794
$$ 188177 167628 -32120 -147844 24714 -266241 6671 93343 -198439 -243566 -23865 82794
9668a85704c1216A79981f7468k5648L39m83842a78642b7909k80876a47541I2044
$$ -185704 -31216 179981 -67468 -93116 -92777 -576619 -178642 -27909 -308785 -147541 92044
9656a00339A13883a95728d3283j5701k38157A6358N243a17449j94554c3819l4576
$$ -100339 113883 -195728 -43283 -58984 -297141 16358 21601 -117449 -312003 -33819 -68395
9645f8395E737K73548A33059l0263b22288a3020c705l58512b6009j83140H1879
$$ -68395 5737 279285 133059 102796 -222288 -13020 -3705 -362217 -26009 -209149 81879
9633a74175p2671B9671a32944Q415l80A5961e4497A14995i5589A59310b66438
$$ -174175 -246846 29671 -132944 -124529 -124909 15961 -54497 114995 -95589 159310 -266438
9621a57697A56099a83604F703a85786d2725r8895A09441a11270E1293a43693o8930
$$ -157697 156099 -183604 6703 -185786 -42725 -141620 109441 -111270 51293 -143693 -212623
9610b12623e1990B9042J75651a07757F6014i3796A09809A9933f9833j25495A0771
$$ -212623 -51990 29042 204693 -107757 66014 -93796 109809 19933 -69833 -195328 10771
9598b68223B33772c41062J63768r4928M3118M6645g8890k20543c2088k60877c9910
$$ -268223 233772 -341062 -177294 -272222 -229104 -182459 -78890 -299433 -32088 -292965 -39910
9586B18246G5710c05123a32725A89744G1515O2385a60983m9783A59512J22681
$$ 218246 75710 -305123 -132725 189744 71515 133900 -160983 -210766 159512 282193
9576B82193c0270I812a64894m9961a03372k8875n1786K1762A42601c28210A42449
$$ 282193 -30270 9812 -164894 -214855 -103372 -132247 -184033 -162271 142601 -328210 142449
9564A5347a04481J0267j5117B6399b31549d3787E9272a62923m65655a9771j95628
$$ 15347 -104481 -94214 -109331 26399 -231549 -43787 59272 -162923 -628578 -19771 -215399
9553b15399A31498a73414g7386B3236f1366B41846i2665J119n5048C242h1j99580
$$ -215399 131498 -173414 -77386 23236 -61366 241846 -92665 -91546 -146594 3242 -81 -199661
9541a99661b0974l64267a0714A33075A2513f9370k53242A98737c81693A01281
$$ -199661 -20974 -385241 -10714 133075 12513 -69370 -322612 198737 -381693 101281
9530A95500E6052g915A53740a72277C41277b62865h7838B37487e0658q3791e8127
$$ 195500 56052 -7915 153740 -172277 341277 -262865 -87838 237487 -50658 -134449 -58127
9518B8912a13804M905j85134h6917r200j83937Q8467P9944d4768K1393A3115c2907
$$ 28912 -113804 -108899 -294033 -86917 -96117 -280054 -191587 -111643 -44768 -23375 13115 -32907
9505b61557l6613h8604r7271j59835b5852B29112h3868O167j08014j18486H5631
$$ -261557 -298170 -88604 -185875 -345710 -25852 229112 -83868 -77701 -185715 -304201 85631
9493d14465J78040D5772m630A4044O69i3765a6492j38971M1899j5540q0406L1642
$$ -414465 -236425 45772 41142 14044 14713 -93765 -16492 -155463 -113564 -129104 -209510 -177868
9481a77868Q7973L8738n0089F5318h0602A76385b66124B6880a60681A78181f6646
$$ -177868 -89895 -51157 -101246 65318 -80602 176385 -266124 26880 -160681 178181 -66646
9469b64500d7938B56927a26769e8511B3735b51304e3119H1984L4281b82175R6185
$$ -264500 -47938 256927 -126769 -58511 23735 -251304 -53119 81984 116265 -282175 -185990
9458a85990f6769C04855H0066A2237c17302j1515g5149B4752A0628a43241k02516
$$ -185990 -66769 304855 80066 12237 -317302 -328817 -75149 24752 10628 -143241 -345757
9447c45757J42241A5518i5236k46651b1946B55769D781d0612j55793G7975d7676
$$ -345757 -203516 15518 -95236 -341887 -21946 255769 4781 -40612 -196405 77975 -47676
9435d8489k2603L5158r5380l5150j07320d7190H7336c80013C0699a2008k24204
$$ -48489 -71092 -35934 -131314 -166464 -273784 -47190 87336 -380013 30699 -12008 -236212
9424b36212F5a43142m6359C94713b1951l5290j61617j5926k7506c2734C6773J2427
$$ -236212 65 -143142 -189501 394713 -21951 -57241 -218858 -234784 -262290 -32734 36773 49200
9412D9200h7920A2206K32795o3321d7152A20382f4672A37797c20832a40649B69655
$$ 49200 -87920 12206 245001 181680 -47152 120382 -64672 137797 -320832 -140649 269655
9400b62416a06465f503o9860l5131j95671A01395a63700N2398r1839h0921H9075
$$ -262416 -106465 -6503 -76363 -111494 -307165 101395 -163700 -111302 -203141 -80921 89075
9388d22373M6866J35193a05265o754G012J37018d7823B3887R5978b1698m7182
$$ -422373 -375507 -240314 -105265 -112019 7012 144030 -47823 23887 119865 -21698 -68880
9377f8880E2775b43007L5594A24388g6101k56705h8049M0798j86532A45175E4949
$$ -68880 52775 -243007 -207413 124388 -76101 -332806 -88049 -47251 -233783 145175 54949
9365A18276K76445a89198m8175P6816O7413A7073f3621j38838M7552H267J08600
$$ 118276 394721 -189198 -237373 -160557 -93144 17073 -63621 -202459 -154907 8267 116867
9354A16867h3865B1060a82651A15878a03756a6055r7002N0699F3659B4129J14786
$$ 116867 -83865 21060 -182651 115878 -103756 -16055 -113057 -62358 63659 24129 138915
9343A38915A6560K94226a98909h7146j02816i0018o3437A94908a13239c2521C5140
$$ 138915 16560 310786 -198909 -87146 -189962 -90018 -153455 194908 -113239 -32521 35140
9331H666b1423j46587e4657D0370g9258k8790h402B08909a63571F4362c89024
$$ 8666 -21423 -168010 -54657 40370 -79258 -108048 -8402 208909 -163571 64362 -389024
9319H3602d6869C4872a61813p0968H7143a5270j07280E7533Q775a28188B35272
$$ 83602 -46869 34872 -161813 -232781 87143 -15270 -122550 57533 66308 -128188 235272
9307e5598A67764c29351J54768k9699n1963A89326b33598h5859k876A54990k9667
$$ -55598 167764 -329351 -174583 -204282 -256245 189326 -233598 -85859 -88735 154990 125323
9296A25323E8695J18291c8639j13495C2027J55543c54696E349J3017a35764j08227
$$ 125323 58695 176986 -38639 -152134 32027 187570 -354696 5349 18366 -135764 -243991
9285b43991J14068a9973r1660q634A02485R5126b75845a25408A4561c8169B61047
$$ -243991 -129923 -19973 -111633 -120267 102485 197611 -275845 -125408 14561 -38169 261047
9273b17588B42363a71218A70186B1802J39471f3259b1181A39910o8315a8999n5596
$$ -217588 242363 -171218 170186 21802 161273 -63259 -21181 139910 71595 -18999 -74595
9262g4595B39772b07008j2887F8018O1625J7904K21032e1441o6409o3004M9880
$$ -74595 239772 -207008 -219895 68018 129643 147547 368579 -51441 -117850 -180854 -130974
9251a30974L2069j36668A34707k2609B3597K03799a98190B75768a99379j29131
$$ -130974 -98905 -235573 134707 112098 23597 227396 -198190 275768 -199379 -328510
9241c28510J18194E5228G563J50193h1743n1552I1903D1410j7100f0442A93998
$$ -328510 -210316 55228 7563 157756 -81743 -133295 91903 41410 24310 -60442 193998
9229C03804D6293a58150l2851N6882j16707A03059c2359j6972j39649k3222B12424
$$ 303804 46293 -158150 -191001 -134119 -250826 103059 -32359 -49331 -188980 -212202 212424
9217g7267F72J6972b89987q8378a1534l81334h3851j33036j17709B1670b34525
$$ -77267 672 17644 -289987 -378365 -11534 -392868 -83851 -216887 -334596 21670 -234525
9205a62103F4827J58905g7730I3448C9349b06355a1822l31761M3575A4180b1071
$$ -162103 64827 223732 -77730 93448 39349 -206355 -11822 -343583 -300008 14180 -21071
9193a50738m7240A05160k2934b85495J21802b6572m23496B97906i7928A2194a1508
$$ -150738 -197978 105160 82226 -285495 -163693 -26572 -450068 297906 -97928 12194 -11508
9181A22839B7754b27108r7258h2502A85765a46459c9005j70024J0611L4037k10448
$$ 122839 27754 -227108 -324366 -82502 185765 -146459 -39005 -209029 -198418 -164381 -374829
9170c74829F1999J27719a98369c0766A61953F1891a57771J0221c0829A57639c7917
$$ -374829 61999 189718 -198369 -30766 161953 61891 -157771 -147550 -30829 157639 -37917
9158a87012b9658E0736J25050E5749c12209B98975a17345r0833d4039r4174p2492
$$ -187012 -29658 50736 175786 55749 -312209 298975 -117345 -208178 -44039 -138213 -210705
9147b10705E5056a06741l8603o8745c6399D7828b5692A90425b9080B10543b52764
$$ -210705 55056 -106741 -145344 -214089 -36399 47828 -25692 190425 -29080 210543 -252764
9135A08474b01797k4116c3378j85527c1343j30857e5952j13488A74626g4848c0833
$$ 108474 -201797 -225913 -33378 -218905 -31343 -162200 -55952 -169440 174626 -74848 -30833
9123a64686A71021b62068m9335B38293b63861A5480c02231j53L5D1859i4722m874
$$ -164686 171021 -262068 -311403 238293 -263861 15480 -302231 -302384 -302349 41859 -94722 -99596
9111i9596d5122m3500G8815a14992C28797a43366o5389h7230D4146J16847p8648
$$ -99596 -45122 -88622 78815 -114992 328797 -143366 -208755 -87230 44146 160993 82345
9100H2345g3510j6906I0619I271h9282j80908Q1784M0898H4618d227l0722j82440
$$ 82345 -73510 -90416 90619 9271 -89282 -270190 -188406 -147508 84618 -4227 -34949 -217389
9088b17389d6668r9559k22324A0082O8873g6380j32229j20189a3285k51555H7062
$$ -217389 -46668 -146227 -368551 10082 78955 -76380 -208609 -328798 -13285 -264840 87062
9076b5734j23815A203a52714p8869C6500g1680A78165e4846k55076O7637e4059
$$ -25734 -149549 1203 -152714 -231583 36500 -71680 178165 -54846 -309922 -242285 -54059
9064c97791J71763A0502a3170j3771l5756A1059i888j21795F409O6180b11345
$$ -397791 -226028 10502 -13170 -26941 -62697 11059 -9888 -131683 6409 72589 -211345
9052F5699a94438j0143I6943a30773F7790a26825M0920q1856H8270c17495f865
$$ 65699 -194438 -204581 96943 -130773 67790 -126825 -85905 -167761 88270 -317495 -6865
9040I9736A183f9035A43408D029a12953L9631m7765A59367i0k58231b1075j93486
$$ 99736 1183 -69035 143408 4029 -112953 -73322 -121087 159367 -90 -258321 -21075 -214561
9028b14561A46742D4119K8968j6847b01323K7149A10616J2460K88353h5287c2179
$$ -214561 146742 44119 73087 56240 -201323 -174174 110616 123076 411429 -85287 -32179
9016a21646q7869j20897G4423a12431k6265a1989l6341B87426a27881A8743L37720
$$ -121646 -209515 -330412 74423 -112431 -138696 -11989 -48330 287426 -127881 18743 356463
9005C56463g5903l1870p8975f9333p3476k43092e9268B84679g3229E9390K02755
$$ 356463 -75903 -107773 -186748 -69333 -142809 -385901 -59268 284679 -73229 59390 262145
8994B62145b27474J13447A62804b01005d8330j28259I0292a27182j58001a4981
$$ 262145 -227474 -114027 162804 -201005 -48330 -176589 90292 -127182 -285183 -14981
8983a46228p2414R4376A83233G8213c41737f303j97545h7270I0985d19812R7542
$$ -146228 -218642 -124266 183233 78213 -341737 -6303 -203848 -87270 90985 -419812 -322270
8972c22270c5780n0246k45606j0605J67758A83813c0039k57024E5780J06420b32869
$$ -322270 -35780 -86026 -331632 -342237 -174479 183813 -30039 -287063 55780 162200 -232869
8960A58290e9254k33133J22950g9508K2602B71340j19114b89595a20673B7118
$$ 158290 -59254 -292387 -169437 -79508 -56906 271340 152226 -289595 -120673 27118
8949h8135m8543E1533k2435Q8636j4265K23932A4846N2626b72789D413d7567o2397
$$ -88135 -136678 51533 29098 117734 103469 327401 14846 67472 -272789 4413 -47567 -109964
8937a09964a396D6508a04147D5475g0187J6388A74996K87902A9616K69053I0432
$$ -109964 -1396 46508 -104147 45475 -70187 -53799 174996 462898 19616 288669 90432
8925D9304e1664B9597K75822J100619n97392B6880b8337j34723A23200e5079B10006
$$ 49304 -51664 29597 305419 1406038 808646 26880 -28337 -163060 123200 -55079 210006
8913B36748a32194A29117a27829A10914F746O094B346f7861k76742A45029b88380
$$ 236748 -132194 129117 -127829 110914 6746 12840 2346 -67861 -344603 145029 -288380
8901a14681r8910f3281G7413a81883B14953b9747j40000L4352j85865a1084D00916
$$ -114681 -213591 -63281 77413 -181883 214953 -29747 -169747 -135395 -321260 -11084 400916
8889A16926a084k23808f2471j20533F7242M9685i5929A39831a89030m3601J9065
$$ 116926 -1084 -224892 -62471 -183004 67242 116927 -95929 139831 -189030 -232631 -213566
8878b13566I541g0575A04495c62292i6984I5428c80601b9282B30046d4101B40575
$$ -213566 9541 -70575 104495 -362292 -96984 95428 -380601 -29282 230046 -44101 240575
8866a78565e4190j95352O1812N242G983J32140h0355A04200M6873b90326D5720
$$ -178565 -54190 -249542 -187730 -182488 7983 140123 -80355 104200 151073 -290326 45720
8854a08662H558c27036a14511A71509b77671i2136c3416C4991J99735k3828a59284
$$ -108662 8558 -327036 -114511 171509 -277671 -92136 -33416 34991 234726 210898 -159284
8842a1360I1422E978c34986J01748a13983k52734c3140l3243l17643f9762A42789
$$ -11360 91422 5978 -334986 -233238 -113983 -366717 -33140 -66383 -384026 -69762 142789
$$ [...]
##END NTUPLES=NMR SPECTRUM
##END=
