##TITLE=AC1726_NAREH15012_9208142_ozFpGt1lUM
##JCAMPDX= 6.0         $$ Bruker NMR JCAMP-DX V2.0
##DATA TYPE= NMR SPECTRUM
##DATA CLASS= NTUPLES
##ORIGIN= BRUKER
##OWNER= Administrator
$$ 1.72 TOPSPIN		Version 2.1
$$ 2015-06-01 23:05:41.076 -0700  Administrator@X
$$ Compression mode = diff/dup
##.OBSERVE FREQUENCY= 400.02188249412
##.OBSERVE NUCLEUS= ^1H
##.ACQUISITION MODE= SIMULTANEOUS (DQD)
##.ACQUISITION SCHEME= undefined
##.AVERAGES= 64
##.DIGITISER RES= 22
##SPECTROMETER/DATA SYSTEM= spect
##.PULSE SEQUENCE= noesygpps1d.comp
##.SOLVENT NAME= COFFEE_meoh
##.SHIFT REFERENCE= INTERNAL, COFFEE_meoh, 1, 14.96079
##AUDIT TRAIL= $$ (NUMBER, WHEN, WHO, WHERE, PROCESS, VERSION, WHAT)
$$ ##TITLE= Audit trail, TOPSPIN		Version 2.1
$$ ##JCAMPDX= 5.01
$$ ##ORIGIN= Bruker BioSpin GmbH
$$ ##OWNER= Administrator
$$ $$ E:\/data/COFFEE/nmr/AC1726_NAREH15012_9208142_ozFpGt1lUM/12/pdata/1/auditp.txt
$$ ##AUDIT TRAIL=  $$ (NUMBER, WHEN, WHO, WHERE, PROCESS, VERSION, WHAT)
(   1,<2015-06-01 23:05:35.920 -0700>,<Administrator>,<X>,<go>,<TOPSPIN 2.1>,
      <created by zg
	started at 2015-06-01 22:54:06.092 -0700,
	POWCHK enabled, PULCHK disabled,
       configuration hash MD5:
       21 0F 79 D6 B3 7B B4 F6 88 20 88 DB 03 48 BD 9F
       data hash MD5: 64K
       46 D7 5D 2E C7 E6 7D 6A 58 3E 00 82 C4 52 2E 62>)
(   2,<2015-06-01 23:05:39.030 -0700>,<Administrator>,<X>,<proc1d>,<TOPSPIN 2.1>,
      <Start of raw data processing
       efp LB = 0.3 FT_mod = 6 PKNL = 1 PHC0 = 0 PHC1 = 0 SI = 128K 
       data hash MD5: 128K
       95 F5 14 58 20 60 EA D2 3E 5B F4 A5 44 07 35 AE>)
(   3,<2015-06-01 23:05:39.889 -0700>,<Administrator>,<X>,<proc1d>,<TOPSPIN 2.1>,
      <pk PHC0 = -87.14905 PHC1 = 0 
       data hash MD5: 128K
       B2 61 1A 39 F7 4A 33 85 A0 67 B4 B3 8C C1 CF B1>)
(   4,<2015-06-01 23:05:40.264 -0700>,<Administrator>,<X>,<proc1d>,<TOPSPIN 2.1>,
      <abs ABSG = 1 
       data hash MD5: 128K
       0E 31 95 D0 3A 3F 6E C1 14 A0 09 B3 F9 92 3A E9>)
(   5,<2015-06-01 23:05:40.389 -0700>,<Administrator>,<X>,<proc1d>,<TOPSPIN 2.1>,
      <abs ABSG = 2 
       data hash MD5: 128K
       3E 23 AE D9 E7 C7 9C 9A 07 A9 ED 7A 5C 03 77 5D>)
(   6,<2015-06-01 23:05:40.467 -0700>,<Administrator>,<X>,<proc1d>,<TOPSPIN 2.1>,
      <abs ABSG = 3 
       data hash MD5: 128K
       72 0F 23 F7 3B 67 2F BD 53 31 2A D6 A5 81 A7 87>)
(   7,<2015-06-01 23:05:40.545 -0700>,<Administrator>,<X>,<proc1d>,<TOPSPIN 2.1>,
      <abs ABSG = 4 
       data hash MD5: 128K
       C9 CD 64 65 C9 E9 F5 76 08 69 D5 D9 B8 09 93 43>)
(   8,<2015-06-01 23:05:40.639 -0700>,<Administrator>,<X>,<proc1d>,<TOPSPIN 2.1>,
      <abs ABSG = 5 
       data hash MD5: 128K
       C9 E5 79 C3 42 B7 0F 66 76 9C 0A 85 7A 5E B9 72>)
$$ ##END=
$$ 
$$ $$ hash MD5
$$ $$ 1C 93 3A FF 81 34 FF EF D7 CE 3B AC 78 B2 73 CD
##$RELAX= 
##$RELAX= 
##$RELAX= 
##$RELAX= 
##$RELAX= 
##$RELAX= 
##$RELAX= 
##$RELAX= 
$$ Bruker specific parameters
$$ --------------------------
##$DU= <E:\>
##$EXPNO= 12
$$ [...]
##$TP07= 0
##$TPNAME0= <>
##$TPNAME1= <>
##$TPNAME2= <>
##$TPNAME3= <>
##$TPNAME4= <>
##$TPNAME5= <>
##$TPNAME6= <>
##$TPNAME7= <>
##$TPOAL= (0..7)
0.5 0.5 0.5 0.5 0.5 0.5 0.5 0.5
##$TPOFFS= (0..7)
0 0 0 0 0 0 0 0
##$TUNHIN= 0
##$TUNHOUT= 0
##$TUNXOUT= 0
##$USERA1= <user>
##$USERA2= <user>
##$USERA3= <user>
##$USERA4= <user>
##$USERA5= <user>
##$V9= 5
##$VALIST= <valist>
##$VCLIST= <CCCCCCCCCCCCCCC>
##$VD= 0
##$VDLIST= <DDDDDDDDDDDDDDD>
##$VPLIST= <PPPPPPPPPPPPPPP>
##$VTLIST= <TTTTTTTTTTTTTTT>
##$WBST= 2048
##$WBSW= 25
##$XGAIN= (0..3)
0 0 0 0
##$XL= 0
##$YL= 0
##$YMAX_a= 6825995
##$YMIN_a= -13089731
##$ZGOPTNS= <>
##$ZL1= 120
##$ZL2= 120
##$ZL3= 120
##$ZL4= 120
##$ABSF1= 14.96079
##$ABSF2= -5.597392
##$ABSG= 5
##$ABSL= 3
##$ALPHA= 0
##$AQORDER= 0
##$ASSFAC= 0
##$ASSFACI= 0
##$ASSFACX= 0
##$ASSWID= 0
##$AUNMP= <proc_prof1d_extract.lims>
##$AXLEFT= 0
##$AXNAME= <>
##$AXNUC= <1H>
##$AXRIGHT= 0
##$AXTYPE= 0
##$AXUNIT= <>
##$AZFE= 0.1
##$AZFW= 0.1
##$BCFW= 0
##$BC_mod= 0
##$BYTORDP= 0
##$COROFFS= 0
##$CY= 15
##$DATMOD= 1
##$DC= 0
##$DFILT= <>
##$DTYPP= 0
##$F1P= 0
##$F2P= 0
##$FCOR= 0.5
##$FTSIZE= 131072
##$FT_mod= 6
##$GAMMA= 0
##$GB= 0
##$INTBC= 1
##$INTSCL= 1
##$ISEN= 128
##$LB= 0.3
##$LEV0= 0
##$LPBIN= 0
##$MAXI= 10000
##$MC2= 0
##$MEAN= 0
##$ME_mod= 0
##$MI= 0
##$NCOEF= 0
##$NC_proc= -2
##$NLEV= 6
##$NOISF1= 0
##$NOISF2= 0
##$NSP= 0
##$NTH_PI= 0
##$NZP= 0
##$OFFSET= 14.96079
##$PC= 1
##$PHC0= -87.14905
##$PHC1= 0
##$PH_mod= 1
##$PKNL= yes
##$PPARMOD= 0
##$PPDIAG= 0
##$PPIPTYP= 0
##$PPMPNUM= 2147483647
##$PPRESOL= 1
##$PSCAL= 4
##$PSIGN= 0
##$PYNMP= <proc.py>
##$REVERSE= no
##$SF= 400.020009721533
##$SI= 131072
##$SIGF1= 0
##$SIGF2= 0
##$SINO= 400
##$SIOLD= 131072
##$SPECTYP= <>
##$SREGLST= <1H.CDCl3>
##$SSB= 0
##$STSI= 131072
##$STSR= 0
##$SW_p= 8223.68421052631
##$SYMM= 0
##$S_DEV= 0
##$TDeff= 65536
##$TDoff= 0
##$TI= <>
##$TILT= no
##$TM1= 0
##$TM2= 0
##$TOPLEV= 0
##$USERP1= <user>
##$USERP2= <user>
##$USERP3= <user>
##$USERP4= <user>
##$USERP5= <user>
##$WDW= 1
##$XDIM= 131072
##$YMAX_p= 399233978
##$YMIN_p= -10667
##$CURPLOT= <Network HP LaserJet P1505>
##$CURPRIN= <$Network HP LaserJet P1505>
##$DFORMAT= <normdp>
##$LAYOUT= <+/1D_H.xwp>
##$LFORMAT= <normlp>
##$PFORMAT= <normpl>
##$SURQMSG= 1
$$ End of Bruker specific parameters
$$ ---------------------------------
##NTUPLES= NMR SPECTRUM
##VAR_NAME=  FREQUENCY,     SPECTRUM/REAL,   SPECTRUM/IMAG
##SYMBOL=    X,             R,               I
##VAR_TYPE=  INDEPENDENT,   DEPENDENT,       DEPENDENT
##VAR_FORM=  AFFN,          ASDF,            ASDF
##VAR_DIM=   131072,        131072,          131072
##UNITS=     HZ,            ARBITRARY UNITS, ARBITRARY UNITS
##FACTOR=    0.0627417313425164, 1,          1
##FIRST=     8223.62146879497, 3039,         -63156
##LAST=      0,             4579,            -63848
##MIN=       0,             -10667,          0
##MAX=       8223.62146879497, 399233978,    0
$$ Real data points
##PAGE= N=1
##DATA TABLE= (X++(R..R)), XYDATA
$$ [...]
$$ plain form
61606 416263 410019 403569 396437 388724 381330 375285 370950 367735 364578 360865 356938 353565 351030 349040
61592 349040 347368 346110 345260 344458 343329 341753 339777 337597 335712 334603 334072 333236 331444 328940 326474
61577 326474 324483 322867 321380 320067 319279 319232 319481 319088 317638 315867 314901 314993 315503 315941 316413 317034 317623
61560 317623 318170 319068 320606 322603 324660 326380 327333 327375 327160 327743 329411 331397 332954 334159 335392 336629
61544 336629 337689 338736 340030 341509 343017 344718 346952 349794 352925 355706 357332 357386 356459 355846 356366
61529 356366 357749 359199 360089 359965 358561 356210 353762 351684 349677 347451 345333 343620 341881 339537 336829
61514 336829 334593 333306 332829 332898 333309 333767 334046 334313 334923 335901 336919 337726 338360 338996 339720 340352 340444 339673
61496 339673 338339 337165 336518 336181 335951 335951 336138 336033 335374 334589 334215 334219 334276 334359 334625 335055 335597 336343 337219 337852
$$ packed form
61606D16263o244o450p132p713p394o045m335l215l157l713l927l373k535j990
61592C49040j672j258q50q02j129j576j976k180j885j109n31q36j792k504k466
61577C26474j991j616j487j313p88m7K49l93j450j771r66R2N10M38M72O21N89
61560C17623N47Q98J538J997K057J720R53M2k15N83J668J986J557J205J233J237
61544C36629J060J047J294J479J508J701K234K842L131K781J626N4r27o13N20
61529C56366J383J450Q90j24j404k351k448k078k007k226k118j713j739k344k708
61514C36829k236j287m77O9M11M58K79K67O10R78J018Q07O34O36P24O32R2p71
61496C39673j334j174o47l37k30%J87j05o59p85l74MN7Q3K66M30N42P46Q76O33
$$ plain form
61476 337852 338142 338557 339428 340377 340914 341183 341575 342046 342419 342983 344083 345405 346378 347026 347679 348053 347476 346003
61458 346003 344551 343877 344046 344927 346453 348284 349861 351029 352115 353291 354380 355341 356366 357349 357938 358317
61442 358317 359349 361582 364627 367850 371151 374612 377866 380449 382566 384918 387788 390774 393452 395823
61428 395823 397962 399605 400468 400826 401426 402753 404567 406285 407641 408850 410330 412494 415608 419403 422815
61413 422815 424579 424368 423077 421800 420715 419182 416700 413539 410516 408298 406814 405283 403056 400421
61399 400421 398293 397093 396363 395613 394940 394492 393909 392804 391461 390514 390253 390690 391960 394028 396248 397905
61383 397905 399107 400577 402644 404978 407223 409246 410825 411832 412826 414793 418000 421646 424889 427687
61369 427687 430300 432478 433733 434130 434281 434558 434803 434813 434776 435070 435915 437422 439812 443260 447589 452487 458185
$$ packed form
61476C37852K90M15Q71R49N37K69L92M71L73N64J100J322R73O48O53L74n77j473
61458C46003j452o74J69Q81J526J831J577J168J086J176J089R61J025R83N89L79
61442C58317J032K233L045L223L301L461L254K583K117K352K870K986K678K371
61428C95823K139J643Q63L58O00J327J814J718J356J209J480K164L114L795L412
61413D22815J764k11j291j277j085j533k482l161l023k218j484j531k227k635
61399D00421k128j200p30p50o73m48n83j105j343r47k61M37J270K068K220J657
61383C97905J202J470K067K334K245K023J579J007R94J967L207L646L243K798
61369D27687K613K178J255L97J51K77K45J0l7K94Q45J507K390L448M329M898N698
$$ plain form
61352 458185 465552 475166 486459 498140 509289 519620 528868 536576 542584 547104 550212 551896 552803
61339 552803 554176 556548 559131 561045 562505 564099 565428 565430 563858 561502 558943 555903 551989 547418 542740
61324 542740 538287 534151 530470 527558 525882 525824 527230 529331 531384 533312 535551 538521 542577 548084 555038
61309 555038 562893 571368 581256 593813 609341 626783 644575 661279 675526 686177 692838 695842
61297 695842 695630 692558 687302 680890 674102 667129 659918 652516 645045 637639 630457 623528 616680 609897
61283 609897 603565 598035 593222 589074 586154 585097 585699 587200 589384 592624 596892 601465 605774 609822
61269 609822 613644 617052 620125 623320 626856 630562 634533 639324 645343 652670 661599 672495 684625 695950
61255 695950 704795 711238 716261 720008 721708 721096 719047 716605 713915 710376 705600 699947 694134 688475
$$ packed form
61352D58185P367R614J1293J1681J1149J0331R248P708O008M520L108J684R07
61339E52803J373K372K583J914J460J594J329Kj572k356k559l040l914m571m678
61324E42740m453m136l681k912j676n8J406K101K053J928K239K970M056N507O954
61309E55038P855Q475R888J2557J5528J7442J7792J6704J4247J0651O661L004
61297F95842k12l072n256o412o788o973p211p402p471p406p182o929o848o783
61283F09897o332n530m813m148k920j057O02J501K184L240M268M573M309M048
61269F09822L822L408L073L195L536L706L971M791O019P327Q929J0896J2130J1325
61255F95950Q845O443N023L747J700o12k049k442k690l539m776n653n813n659
$$ plain form
61241 688475 682710 676644 670749 665823 662084 658924 655556 651659 647474 643609 640775 639389 639302 640109 641623
61226 641623 643820 646510 649466 652768 656562 660587 664447 668220 672284 676619 680934 685425 690681 696788
61212 696788 703211 709621 716016 721864 726040 728108 729006 730055 731827 734376 737888 742561 748320 755217
61198 755217 763750 774410 787286 802460 820262 840589 862321 883804 903595 920456 933240 941438
61186 941438 945668 947152 946928 945709 943999 941798 938530 933753 927655 920508 912073 902069 890856 879071
61172 879071 866878 854111 840918 827667 814415 800947 787247 773489 759769 746265 733445
61161 733445 721587 710248 698729 687039 675976 666320 658307 651803 646676 643021 641308 642108 645447
61148 645447 650596 656640 662806 667871 669880 667257 660161 650159 638698 626387 613615 601158 589994
$$ packed form
61241F88475n765o066n895m926l739l160l368l897m185l865k834j386q7Q07J514
61226F41623K197K690K956L302L794M025L860L773M064M335M315M491N256O107
61212F96788O423O410O395N848M176K068Q98J049J772K549L512M673N759O897
61198G55217Q533J0660J2876J5174J7802K0327K1732K1483J9791J6861J2784Q198
61186I41438M230J484k24j219j710k201l268m777o098p147q435j0004j1213j1785
61172H79071j2193j2767j3193j3251j3252j3468j3700j3758j3720j3504j2820
61161G33445j1858j1339j1519j1690j1063r656q013o504n127l655j713Q00L339
61148F45447N149O044O166N065K009k623p096j0002j1461j2311j2772j2457j1164
$$ plain form
61135 589994 580957 574585 570887 569255 568997 570025 572693 577060 582711 589306 596923 605803 616082 627826
61121 627826 641100 656012 672810 691705 712342 733734 755164 776913 799666 823392 847365
61110 847365 871107 894587 917470 938920 958391 976095 992404 1007139 1019658 1029260 1035262 1036968
61098 1036968 1033882 1025907 1013389 997132 978193 957265 934282 909095 882520 856126 830830 806256
61086 806256 781787 757725 734935 713773 693970 675448 658625 643786 630576 618385 606990
61075 606990 596602 587363 579063 571407 564417 558367 553409 549450 546472 544732 544436 545344 546913 548782
61061 548782 550924 553378 556073 558972 562191 565921 570366 575816 582641 591054 600828 611350 622041 632858
61047 632858 644381 657294 671783 687566 704425 722468 741776 762155 783393 805427 828011
$$ packed form
61135E89994r037o372l698j632k58J028K668M367N651O595P617Q880J0279J1744
61121F27826J3274J4912J6798J8895K0637K1392K1430K1749K2753K3726K3973
61110H47365K3742K3480K2883K1450J9471J7704J6309J4735J2519R602O002J706
61098A036968l086p975j2518j6257j8939k0928k2983k5187k6575k6394k5296k4574
61086H06256k4469k4062k2790k1162j9803j8522j6823j4839j3210j2191j1395
61075F06990j0388r239q300p656o990o050m958l959k978j740k96R08J569J869
61061E48782K142K454K695K899L219L730M445N450O825Q413R774J0522J0691J0817
61047F32858J1523J2913J4489J5783J6859J8043J9308K0379K1238K2034K2584
$$ plain form
61036 828011 850543 872660 894838 917936 942242 967368 992992 1019124 1045537 1071537 1096674
61025 1096674 1121309 1146209 1171901 1198954 1228656 1262802 1302668 1348499 1400051 1457253 1520336
61014 1520336 1590086 1668614 1759736 1868217 1999036 2157901 2351968 2588966 2875943 3220453
61004 3220453 3633575 4130845 4730577 5453360 6320817 7342157 8484077 9645576 10672209
60995 10672209 11417050 11809945 11884674 11751743 11548639 11401246 11398272 11564205 11836142 12072304
60985 12072304 12106302 11821081 11195638 10299434 9249195 8161588 7124082 6186526 5366603
60976 5366603 4661816 4061370 3552901 3124076 2763076 2460023 2207428 1998494 1825714
60967 1825714 1681739 1560724 1457891 1368633 1289284 1218398 1156008 1101568 1053477 1010464 972417
$$ packed form
61036H28011K2532K2117K2178K3098K4306K5126K5624K6132K6413K6000K5137
61025A096674K4635K4900K5692K7053K9702L4146L9866M5831N1552N7202O3083
61014A520336O9750P8528R1122J08481J30819J58865J94067K36998K86977L44510
61004C220453M13122M97270N99732P22783Q67457J021340J141920J161499J026633
60995A0672209P44841L92895P4729j32931k03104j47393k974J65933K71937K36162
60985A2072304L3998k85221o25443q96204j050239j087607j037506r37556q19923
60976E366603p04787o00446n08469m28825l61000l03053k52595k08934j72780
60967A825714j43975j21015j02833q9258p9349p0886o2390n4440m8091m3013l8047
$$ plain form
60956 972417 939612 911883 888636 868905 851278 834514 818501 803972 791041 778703 766113
60945 766113 753678 742379 732511 723669 715675 708819 703140 697930 692129 685120 677034 668367 659444 650346
60931 650346 641296 632786 625151 618267 611876 605966 600452 594775 588362 581466 575042 569724 565359 561611
60917 561611 558531 556298 554792 553620 552314 550390 547628 544589 542583 542722 545024 548533 552172 555345
60903 555345 557955 560184 562264 564279 566084 567444 568338 569113 570333 572435 575534 579506 584156 589238 594456
60888 594456 599738 605410 611722 618172 623754 628081 631874 636075 640818 645653 650453 655698 662069 670099
60874 670099 680006 691436 703569 715850 728494 741963 756285 771292 787280 804886 824505 846232
60862 846232 870006 895232 920522 944616 967477 989744 1011198 1030603 1047127 1061122 1073227
$$ packed form
60956I72417l2805k7729k3247j9731j7627j6764j6013j4529j2931j2338j2590
60945G66113j2435j1299r868q842p994o856n679n210n801p009q086q667q923r098
60931F50346r050q510p635o884o391n910n514n677o413o896o424n318m365l748
60917E61611l080k233j506j172j306j924k762l039k006J39K302L509L639L173
60903E55345K610K229K080K015J805J360Q94P75J220K102L099L972M650N082N218
60888E94456N282N672O312O450N582M327L793M201M743M835M800N245O371Q030
60874F70099R907J1430J2133J2281J2644J3469J4322J5007J5988J7606J9619K1727
60862H46232K3774K5226K5290K4094K2861K2267K1454J9405J6524J3995J2105
$$ plain form
60851 1073227 1083415 1091236 1096284 1098004 1095543 1088325 1076564 1060989 1042353 1021330 998535 974389
60839 974389 949236 923543 897608 871122 843701 815932 789190 764225 740739 718688 699011
60828 699011 682303 667461 652702 637594 623184 610252 598427 587155 576665 567465 559388 551692
60816 551692 543965 536564 530079 524587 519548 514432 509328 504785 501139 498234 495862 494130 493157 492643 492078
60801 492078 491306 490597 490166 489923 489738 489732 490054 490465 490381 489445 487964 486552 485366 483910 481739 479149 476896
60784 476896 475340 474087 472459 470090 467111 463981 461133 458581 455942 452985 450000 447335 444753 441701
60770 441701 438215 435074 432961 431906 431642 432029 432855 433657 434113 434384 434762 435175 435335 435146 434596 433395 431136
60753 431136 427931 424598 422038 420530 419762 419373 419279 419524 420160 421442 423774 427006 429905 430975 429935 427891
$$ packed form
60851A073227J0188P821N048J720k461p218j1761j5575j8636k1023k2795k4146
60839I74389k5153k5693k5935k6486k7421k7769k6742k4965k3486k2051j9677
60828F99011j6708j4842j4759j5108j4410j2932j1825j1272j0490r200q077p696
60816E51692p727p401o485n492n039n116n104m543l646k905k372j732r73n14n65
60801D92078p72p09m31k43j85oL22M11q4r36j481j412j186j456k171k590k253
60784D76896j556j253j628k369k979l130k848k552k639k957k985k665k582l052
60770D41701l486l141k113j055k64L87Q26Q02M56K71L78M13J60j89n50j201k259
60753D31136l205l333k560j508p68l89r4K45O36J282K332L232K899J070j040k044
$$ plain form
60737 427891 425846 423677 420955 418060 415716 413925 412261 410969 410692 411109 410852 409162 406834 405111 404228
60722 404228 403451 402052 399774 396695 393118 389481 386135 383308 381244 380005 379119 377894 376192 374453 372889
60707 372889 371235 369448 368024 367272 366806 366127 365213 364172 362831 361168 359726 359050 359006 359179 359625 360696
60691 360696 362321 364036 365644 367353 369246 371017 372274 372896 373117 373454 374449 376257 378606 381318 384638
60676 384638 388793 393498 398236 402937 407959 413447 419040 424291 429151 433897 438608 442820 445752 446956
60662 446956 446667 445501 444028 442803 442470 443297 444719 445905 446807 448092 450036 452112 453879 455575 457528
60647 457528 459551 461350 462977 464430 465262 465012 463670 461293 457654 452811 447606 442969 438986 435184 431509
60632 431509 428413 426158 424615 423686 423418 423676 424096 424419 424609 424782 425244 426344 427968 429386 430000 430025 430120
$$ packed form
60737D27891k045k169k722k895k344j791j664j292k77M17k57j690k328j723q83
60722D04228p77j399k278l079l577l637l346k827k064j239q86j225j702j739j564
60707C72889j654j787j424p52m66o79r14j041j341j663j442o76m4J73M46J071
60691C60696J625J715J608J709J893J771J257O22K21L37R95J808K349K712L320
60676C84638M155M705M738M701N022N488N593N251M860M746M711M212K932J204
60662D46956k89j166j473j225l33Q27J422J186R02J285J944K076J767J696J953
60647D57528K023J799J627J453Q32k50j342k377l639m843n205m637l983l802l675
60632D31509l096k255j543r29k68K58M20L23J90J73M62J100J624J418O14K5R5
$$ plain form
60615 430120 430587 431360 432492 434084 435873 437407 438589 439580 440270 440321 439742 438982 438461 438378 438939 440325 442353
60598 442353 444468 446189 447350 448040 448560 449373 450789 452731 454995 457537 460242 462649 464306 465216 465557
60583 465557 465126 463594 461281 459161 457977 457686 457823 458139 458842 460376 462988 466405 470118 474145 479197
60568 479197 485797 493563 501824 510606 520399 531036 541390 550220 556912 561417 563981 565024 564923 563824
60554 563824 561885 559622 557711 556593 556566 558047 561210 565555 570355 575481 581350 588197 595930 604546 614052
60539 614052 624030 633962 643998 654747 666183 677415 687636 696619 704108 709556 712848 714677 715783
60526 715783 716267 716037 715382 714648 713857 713100 712858 713381 714144 714504 714679 715513 717466 720289 723491 726522 728604
60509 728604 729054 727956 726141 724457 723446 723726 726143 731246 738918 748784 760769 775037 791598 810301
$$ packed form
60615D30120M67P73J132J592J789J534J182R91O90N1n79p60n21q3N61J386K028
60598D42353K115J721J161O90N20Q13J416J942K264K542K705K407J657R10L41
60583D65557m31j532k313k120j184k91J37L16P03J534K612L417L713M027N052
60568D79197O600P766Q261Q782R793J0637J0354Q830O692M505K564J043j01j099
60554E63824j939k263j911j118k7J481L163M345M800N126N869O847P733Q616R506
60539F14052R978R932J0036J0749J1436J1232J0221Q983P489N448L292J829J106
60526G15783M84k30o55p34p91p57k42N23P63L60J75Q34J953K823L202L031K082
60509G28604M50j098j815j684j011K80K417N103P672R866J1985J4268J6561J8703
$$ plain form
60495 810301 831095 854013 878808 904766 930865 955973 978841 998096 1012382 1020510 1021563 1015112
60483 1015112 1001505 981828 957355 929090 897952 865234 832555 801281 772138 745308 720636
60472 720636 697808 676705 657636 640905 626124 612496 599883 589088 580649 573884 567630 561536
60460 561536 555991 550984 545851 540216 534578 529709 525817 522509 519230 515610 511676 507923 504942 502837
60446 502837 501158 499509 497997 496990 496628 496704 496915 497152 497615 498601 500050 501365 501908 501664 501209 501053 501277
60429 501277 501829 502817 504275 505839 506913 507192 506979 506996 507879 509746 512158 514505 516449 518071 519766 521993
60413 521993 524934 528208 530998 532680 533300 533369 533302 533292 533646 534921 537459 540767 543535 544593 543972 542908
60397 542908 542640 543405 544771 546583 548998 551801 554485 557131 560423 564542 568773 572618 576522 580921 585254
$$ packed form
60495H10301K0794K2918K4795K5958K6099K5108K2868J9255J4286Q128J053o451
60483A015112j3607j9677k4473k8265l1138l2718l2679l1274k9143k6830k4672
60472G20636k2828k1103j9069j6731j4781j3628j2613j0795q439o765o254o094
60460E61536n545n007n133n635n638m869l892l308l279l620l934l753k981k105
60446E02837j679j649j512j007l62P6K11K37M63R86J449J315N43k44m55j56K24
60429E01277N52R88J458J564J074K79k13J7Q83J867K412K347J944J622J695K227
60413E21993K941L274K790J682O20O9o7j0L54J275K538L308K768J058o21j064
60397E42908k68P65J366J812K415K803K684K646L292M119M231L845L904M399M333
$$ plain form
60382 585254 588729 591607 594861 598888 603373 608200 613609 619482 625262 630645 635733 640563 645135 649894
60368 649894 655442 661686 667937 673873 679703 685245 689639 692280 693423 693637 693278 692835 693161 694819 697593
60353 697593 701046 705291 710843 717995 726592 736222 746371 756566 766579 776299 785352 793095 799061
60340 799061 803158 805449 806133 805761 804997 803937 802026 798762 794182 788609 782447 776338 770940 766263 761710
60325 761710 757050 752845 749524 746545 743073 739162 735674 733131 731173 729128 726719 724197 722141 721178
60311 721178 721596 723132 725341 728270 732581 738867 747025 756514 767205 779606 793915 809020 822886
60298 822886 834050 842188 847002 847212 841404 829685 813799 795666 776455 757058 738609 722023
60286 722023 707471 694689 683583 674235 666500 659863 653602 647078 640112 633134 626746 621056 615644
$$ packed form
60382E85254L475K878L254M027M485M827N409N873N780N383N088M830M572M759
60368F49894N548O244O251N936N830N542M394K641J143K14l59m43L26J658K774
60353F97593L453M245N552P152Q597R630J0149J0195J0013R720R053P743N966
60340G99061M097K291O84l72p64j060j911l264m580n573o162o109n398m677m553
60325G61710m660m205l321k979l472l911l488k543j958k045k409k522k056r63
60311G21178M18J536K209K929M311O286Q158R489J0691J2401J4309J5105J3866
60298H22886J1164Q138M814K10n808j1719j5886j8133j9211j9397j8449j6586
60286G22023j4552j2782j1106r348p735o637o261o524o966o978o388n690n412
$$ plain form
60273 615644 610127 604438 598557 592348 585776 579055 572573 566877 562552 559682 557468 554900 551834 549020
60259 549020 547121 546259 546465 547801 549773 551310 551829 551933 552679 554425 556637 558490 559395 559222 558354 557322
60243 557322 556266 554919 553179 551387 549981 549219 549275 550169 551486 552591 553278 553901 554852 556339 558631 561904
60227 561904 565739 569372 572649 576133 580070 583918 587186 590097 593095 596333 600063 604837 610778 617169
60213 617169 623362 629642 636616 644224 651933 659508 666928 673864 679979 685552 691160 696822 702011 706475
60199 706475 710552 714638 718708 722307 724775 725683 725386 724940 725078 725375 724774 722834 720123 717490 715260 713075
60183 713075 710282 706545 702221 697963 693884 689469 684501 679647 675715 672666 669787 666625 663385 660620
60169 660620 658877 658423 658839 659039 658110 656187 654260 653172 652988 653159 653119 652789 652637 653110 654024 654838 655515 656606
$$ packed form
60273F15644n517n689n881o209o572o721o482n696m325k870k214k568l066k814
60259E49020j899q62K06J336J972J537N19J04P46J746K212J853R05j73q68j032
60243E57322j056j347j740j792j406p62N6Q94J317J105O87O23R51J487K292L273
60227E61904L835L633L277L484L937L848L268K911K998L238L730M774N941O391
60213F17169O193O280O974P608P709P575P420O936O115N573N608N662N189M464
60199G06475M077M086M070L599K468R08k97m46J38K97o01j940k711k633k230k185
60183G13075k793l737m324m258m079m415m968m854l932l049k879l162l240k765
60169F60620j743m54M16K00r29j923j927j088j84J71m0l30j52M73R14Q14O77J091
$$ plain form
60151 656606 658392 660539 662828 665548 668766 671807 674058 675821 677815 680253 682985 686171 690123 694781
60137 694781 700000 706109 713509 721871 730348 738489 746334 753707 759999 764663 767457 768201 766783 763444
60123 763444 758769 753391 747895 742754 738090 733771 730055 727709 726977 726845 726009 724349 722745 721624 720474
60108 720474 718772 716649 714397 711884 708719 704730 700140 695459 691156 687187 683031 678457 674049 670634
60094 670634 668483 667468 667678 669287 672033 675402 679168 683199 687010 690188 693175 696841 701290 705726
60080 705726 709569 713062 716704 720649 724643 727927 729114 726897 721211 713276 704400 695062 685144 674451
60066 674451 662941 650998 639589 629628 621099 613334 606127 599926 594857 590377 586140 582455 579571
60053 579571 577251 575536 575193 576730 579466 582251 584820 587810 591719 596490 601963 608066 614481 620644
$$ packed form
60151F56606J786K147K289K720L218L041K251J763J994K438K732L186L952M658
60137F94781N219O109P400Q362Q477Q141P845P373O292M664K794P44j418l339
60123G63444m675n378n496n141m664m319l716k346p32j32q36j660j604j121j150
60108G20474j702k123k252k513l165l989m590m681m303l969m156m574m408l415
60094F70634k151j015K10J609K746L369L766M031L811L178K987L666M449M436
60080G05726L843L493L642L945L994L284J187k217n686p935q876r338r918j0693
60066F74451j1510j1943j1409r961q529p765p207o201n069m480m237l685k884
60053E79571k320j715l43J537K736K785K569K990L909M771N473O103O415O163
$$ plain form
60039 620644 626190 631067 635190 638345 640539 642115 643324 643992 643763 642503 640309 637206 633038 627647 621052
60024 621052 613427 605054 596324 587648 579208 570862 562457 554250 546858 540771 535986 532131 528774 525695
60010 525695 523028 521118 520037 519315 518420 517441 516860 516616 515930 514263 512002 509980 508722 508433 509250 511088
59994 511088 513539 516317 519560 523420 527683 532108 536788 541790 546796 551488 555953 560276 564091 567003
59980 567003 569132 570748 571635 571335 569795 567383 564531 561747 559550 557924 556288 554556 553668 554398 556213
59965 556213 558192 560587 564406 569797 576047 583017 591265 600594 609585 616952 622431 626157 628164 628853
59951 628853 628949 628456 626478 622742 618579 615670 614248 613116 611129 608134 604676 601255 597815 593771 588661
59936 588661 582783 576921 571537 566645 562473 559575 558122 557653 557780 558624 560296 562504 564982 567846 571163
$$ packed form
60039F20644N546M877M123L155K194J576J209O68k29j260k194l103m168n391o595
60024F21052p625q373q730q676q440q346q405q207p392o087m785l855l357l079
60010E25695k667j910j081p22q95r79n81k44o86j667k261k022j258k89Q17J838
59994E11088K451K778L243L860M263M425M680N002N006M692M465M323L815K912
59980E67003K129J616Q87l00j540k412k852k784k197j626j636j732q88P30J815
59965E56213J979K395L819N391O250O970Q248R329Q991P367N479L726K007O89
59951F28853R6m93j978l736m163k909j422j132j987k995l458l421l440m044n110
59936E88661n878n862n384m892m172k898j453m69J27Q44J672K208K478K864L317
$$ plain form
59921 571163 574595 577838 581111 584926 589649 595454 602354 610052 618141 626736 636558 648109 660973 674138
59907 674138 686735 698345 708862 718198 725884 730962 732643 731174 727606 722718 716669 709765 702901
59894 702901 696908 691951 687938 685047 683490 683082 683393 684114 685078 686219 687706 689815 692547 695711 699433
59879 699433 704144 709900 716197 722552 728748 734336 738565 741244 743096 744814 746193 746674 746321 745711 745117
59864 745117 744323 743071 741242 738666 735153 730686 725458 719784 714147 709118 705023 701798 699252 697324
59850 697324 696119 695885 696923 699074 701354 702618 702676 702281 701954 701513 700963 700988 701960 702949 702383 699397 694073
59833 694073 686839 678406 670093 663428 659111 656691 655256 654144 653019 651664 649957 647892 645458 642471
59819 642471 638616 633776 628396 623333 619177 615888 613302 611714 611440 612031 612577 612897 613755 615615 617797
$$ packed form
59921E71163L432L243L273L815M723N805O900P698Q089Q595R822J1551J2864J3165
59907F74138J2597J1610J0517R336P686N078J681j469l568m888o049o904o864
59894G02901n993m957m013k891j557m08L11P21R64J141J487K109K732L164L722
59879F99433M711N756O297O355O196N588M229K679J852J718J379M81l53o10n94
59864G45117p94j252j829k576l513m467n228n674n637n029m095l225k546j928
59850F97324j205k34J038K151K280J264N8l95l27m41n50K5R72R89n66k986n324
59833F94073p234q433q313o665m317k420j435j112j125j355j707k065k434k987
59819F42471l855m840n380n063m156l289k586j588k74N91N46L20Q58J860K182
$$ plain form
59804 617797 619289 620019 620798 622195 623849 624895 624798 623714 622094 620024 617202 613618 609889 606537 603327
59789 603327 599888 596788 595202 595505 596887 598449 600008 601666 603302 604820 606405 608165 609912 611420
59775 611420 612596 613403 614107 615541 618491 622719 627281 631798 636639 641804 646598 650722 654794 659399 664463
59760 664463 669992 676527 684289 692617 700957 709764 719757 730864 742548 754657 767321 780433 793843
59747 793843 807651 821756 835501 848255 859971 870773 880492 889000 896385 902341 906091 907546 907897
59734 907897 908296 908530 907740 905939 903994 902557 901883 902336 904140 906731 909122 910786 911668 911617 910550 908980
59718 908980 907684 906962 906769 907301 908772 910788 912642 914175 915864 918223 921537 925884 930879 935712 940026
59703 940026 944485 949849 955804 961439 966598 971934 977760 983679 989441 995389 1001874 1008712 1015283 1020716
$$ packed form
59804F17797J492P30P79J397J654J046r7j084j620k070k822l584l729l352l210
59789F03327l439l100j586L03J382J562J559J658J636J518J585J760J747J508
59775F11420J176Q07P04J434K950M228M562M517M841N165M794M124M072M605N064
59760F64463N529O535P762Q328Q340Q807R993J1107J1684J2109J2664J3112J3410
59747G93843J3808J4105J3745J2754J1716J0802R719Q508P385N956L750J455L51
59734I07897L99K34p90j801j945j437o74M53J804K591K391J664Q82n1j067j570
59718I08980j296p22j93N32J471K016J854J533J689K359L314M347M995M833M314
59703I40026M459N364N955N635N159N336N826N919N762N948O485O838O571N433
$$ plain form
59689 1020716 1023952 1024194 1021596 1017312 1012795 1009026 1006146 1003526 1000421 996766 993102 989563 985387 979766
59675 979766 972739 964867 956514 947906 939367 930968 922356 913454 904890 897182 890020 882974 876370 870742
59661 870742 865954 861669 858228 856123 854963 853909 852893 852534 853089 854341 856239 858713 861058 862439 862833
59646 862833 862462 860558 855827 848158 838778 828640 817778 806420 795591 786125 778007 771097 765697
59633 765697 761883 759067 756766 755283 755077 755831 756547 756334 754920 752649 750074 747270 743607 738641 733082
59618 733082 728195 724126 719469 712728 703762 693729 684150 676205 670337 666177 663027 660554 658817 657777
59604 657777 657244 657178 657507 657688 656999 655342 653278 651345 649806 648941 648901 649319 649759 650511 652205 654574 656442
59587 656442 657167 657338 657726 658292 658601 658570 658174 656919 654188 649958 644802 639326 633864 628554 623432 618538
$$ packed form
59689A020716L236K42k598m284m517l769k880k620l105l655l664l539m176n621
59675I79766p027p872q353q608q539q399q612q902q564p708p162p046o604n628
59661H70742m788m285l441k105j160j054j016l59N55J252J898K474K345J381L94
59646H62833l71j904m731p669r380j0138j0862j1358j0829r466q118o910n400
59633G65697l814k816k301j483k06P54P16k13j414k271k575k804l663m966n559
59618G33082m887m069m657o741q966j0033r579p945n868m160l150k473j737j040
59604F57777n33o6L29J81o89j657k064j933j539q65m0M18M40P52J694K369J868
59587F56442P25J71L88N66L09l1l96j255k731m230n156n476n462n310n122m894
$$ plain form
59571 618538 613978 609813 605882 601974 598197 594967 592584 590927 589508 587718 585214 582266 579562 577502
59557 577502 575927 574709 574157 574478 575282 576080 576880 577849 578842 579917 581832 585233 589646 594115 598636 604206
59541 604206 611559 620644 631270 643606 658083 675259 695271 716478 735028 746937 750835 748268
59529 748268 741801 733908 727098 723281 722486 723219 724400 726023 727928 729356 730154 731203 732931 734308 733946
59514 733946 731376 726728 720104 712063 703987 697111 691516 686632 682300 678811 676307 674610 673441 672561
59500 672561 672017 672373 674179 677097 680128 682909 686083 690147 694650 698961 703230 708094 713918 720637 727827
59485 727827 734579 739879 743672 747142 751512 756832 762180 766717 770284 773351 776697 780907 785949 791341
59471 791341 796573 801033 803799 804187 802436 799279 794919 789225 782763 776706 771650 767437 764232 762721
$$ packed form
59571F18538m560m165l931l908l777l230k383j657j419j790k504k948k704k060
59557E77502j575j218n52L21Q04P98Q00R69R93J075J915L401M413M469M521N570
59541F04206P353R085J0626J2336J4477J7176K0012K1207J8550J1909L898k567
59529G48268o467p893o810l817p95P33J181J623J905J428P98J049J728J377l62
59514G33946k570m648o624q041q076o876n595m884m332l489k504j697j169q80
59500F72561n44L56J806K918L031K781L174M064M503M311M269M864N824O719P190
59485G27827O752N300L793L470M370N320N348M537L567L067L346M210N042N392
59471G91341N232M460K766L88j751l157m360n694o462o057n056m213l205j511
$$ plain form
59457 762721 763060 764690 767559 772396 779201 786468 792667 797835 803087 809195 816139 823359 829766 834037
59443 834037 835460 834122 830069 823012 813275 802312 791721 782311 774420 768383 764140 761090 758815 757359
59429 757359 756369 754791 751990 748483 745023 741762 738902 737431 738404 742026 748071 756580 767527 780343
59415 780343 794434 809738 826430 844829 865920 890603 917156 940133 953164 953111 941387 922266
59403 922266 900828 881567 867207 858509 855832 860485 873431 892514 911783 923958 923837 910364
59391 910364 886619 857913 829102 803049 780919 762824 747783 734194 721413 710404 702077 695649
59379 695649 689676 684166 680446 679100 679159 679435 679727 680551 682479 685873 690671 696181 701489 706155 710334
59364 710334 714449 719100 724946 732118 739963 747849 756051 765344 776004 787776 800603 814755 830272
$$ packed form
59457G62721L39J630K869M837O805P267O199N168N252O108O944P220O407M271
59443H34037J423j338m053p057r737j0963j0591r410p891o037m243l050k275j456
59429G57359r90j578k801l507l460l261k860j471R73L622O045Q509J0947J2816
59415G80343J4091J5304J6692J8399K1091K4683K6553K2977J3031n3j1724j9121
59403I22266k1438j9261j4360q698k677M653J2946J9083J9269J2175j21j3473
59391I10364k3745k8706k8811k6053k2130j8095j5041j3589j2781j1009q327o428
59379F95649n973n510l720j346N9K76K92Q24J928L394M798N510N308M666M179
59364G10334M115M651N846P172P845P886Q202R293J0660J1772J2827J4152J5517
$$ plain form
59351 830272 846815 864080 882020 900721 920230 940352 960440 979748 998155 1016030 1033097
59340 1033097 1048097 1060005 1068910 1075177 1078457 1078344 1075374 1070383 1063261 1053274 1040443 1025716 1009898
59327 1009898 993244 976037 958768 941693 924855 908650 893778 880583 868808 858031 848019
59316 848019 838815 830778 824364 819523 815587 812065 809257 807787 807956 809889 813778 819480 826357 833944
59302 833944 842159 850154 855669 856459 852144 843978 833251 820788 807639 795129 784148 774965 767567
59289 767567 761576 756125 750612 745465 741501 738736 736544 734838 734312 735604 738820 743857 750565 758668
59275 758668 768017 778799 791121 804676 819258 835108 852115 869152 884993 899433 912698 924108
59263 924108 932312 936657 937400 934793 928893 920212 909664 897791 884798 871198 857640 844135 830344
$$ packed form
59351H30272J6543J7265J7940J8701J9509K0122K0088J9308J8407J7875J7067
59340A033097J5000J1908Q905O267L280j13k970m991p122r987j2831j4727j5818
59327A009898j6654j7207j7269j7075j6838j6205j4872j3195j1775j0777j0012
59316H48019r204q037o414m841l936l522k808j470J69J933L889N702O877P587
59302H33944Q215P995N515P90m315q166j0727j2463j3149j2510j0981r183p398
59289G67567n991n451n513n147l964k765k192j706n26J292L216N037O708Q103
59275G58668R349J0782J2322J3555J4582J5850J7007J7037J5841J4440J3265J1410
59263I24108Q204M345P43k607n900q681j0548j1873j2993j3600j3558j3505j3791
$$ plain form
59250 830344 816639 804101 793387 784316 776555 770009 764450 759472 754961 751100 747951 745549 744258
59237 744258 744475 746086 748659 751822 754821 756190 754864 751432 747392 743301 738577 732887 726570 719638
59223 719638 711532 702272 692989 684932 678552 673681 669906 666570 663199 660222 658665 658900 660208 661674
59209 661674 662964 664176 665559 667539 670370 673643 676691 679606 683199 687831 692828 697263 700740 703258
59195 703258 704834 705581 705861 706173 707071 709074 712305 716305 720560 725003 729628 733938 737404 740287 743367
59180 743367 746902 750376 753211 755242 756619 757764 759262 761316 763476 765366 767345 769957 773139 776620
59166 776620 780698 785836 791834 798111 804474 810795 816274 819978 821903 822690 822534 821209 818832 815607 811076
59151 811076 804726 797209 789945 783560 777575 771483 765168 758492 751538 745106 739874 735225 729979 724148
$$ packed form
59250H30344j3705j2538j0714r071p761o546n559m978m511l861l149k402j291
59237G44258K17J611K573L163K999J369j326l432m040m091m724n690o317o932
59223G19638q106r260r283q057o380m871l775l336l371k977j557K35J308J466
59209F61674J290J212J383J980K831L273L048K915L593M632M997M435L477K518
59195G03258J576P47K80L12Q98K003L231M000M255M443M625M310L466K883L080
59180G43367L535L474K835K031J377J145J498K054K160J890J979K612L182L481
59166G76620M078N138N998O277O363O321N479L704J925P87j56j325k377l225m531
59151H11076o350p517p264o385n985o092o315o676o954o432n232m649n246n831
$$ plain form
59137 724148 718779 714184 709720 705354 702025 700180 699208 698675 698975 700439 702974 706900 712979 721134 730190
59122 730190 739358 749127 760384 773592 789048 806789 825757 844110 860974 877101 893372 909522
59110 909522 924691 938284 949786 958600 964700 968752 971190 971836 970786 968890 966879 964618 961523 957116
59096 957116 951053 943387 935060 927374 920744 914734 909395 905599 903745 903057 902529 901773 900667 898937 896349
59081 896349 892560 886760 878409 868420 858560 849502 840499 831078 821857 813423 805710 798864 793431 789179
59067 789179 784988 780449 776364 773072 769567 765029 760005 755186 750168 744393 738365 732886 727882 722933
59053 722933 718364 714918 712799 711636 710860 709769 707963 706142 705588 706372 707055 706617 705629 704896 704197 703222
59037 703222 702635 703091 704097 704901 705811 707601 710302 713578 717794 723752 731858 742298 755503 771572
$$ packed form
59137G24148n369m595m464m366l329j845r72n33L00J464K535L926O079Q155R056
59122G30190R168R769J1257J3208J5456J7741J8968J8353J6864J6127J6271J6150
59110I09522J5169J3593J1502Q814O100M052K438O46j050j896k011k261l095m407
59096I57116o063p666q327p686o630o010n339l796j854o88n28p56j106j730k588
59081H96349l789n800q351r989r860r058r003r421r221q434p713o846n433m252
59067G89179m191m539m085l292l505m538n024m819n018n775o028n479n004m949
59053G22933m569l446k119j163p76j091j806j821n54P84O83m38r88p33o99r75
59037G03222n87M56J006Q04R10J790K701L276M216N958Q106J0440J3205J6069
$$ plain form
59023 771572 789763 809273 830058 852118 874481 895598 914291 929717 940988 947472 949037 945609
59011 945609 937231 925096 911650 898924 887420 877138 868713 862684 858588 855827 854826 856296 859889
58998 859889 864500 869427 874433 879186 883433 887232 890322 891862 891482 889923 887858 884835 880254 874677
58984 874677 869090 863553 857677 852032 847899 845880 845668 846956 849663 853511 858255 864232 871926 881121
58970 881121 891103 901573 912885 925560 939915 955788 972234 987972 1002461 1016036 1028705 1039530
58958 1039530 1047539 1052354 1053430 1049764 1041129 1028703 1013599 995660 974665 951889 929298 907768
58946 907768 887196 867810 850197 834336 819726 806380 794935 785892 779292 774784 771524 768453
58934 768453 765270 762641 761014 759916 758918 758379 758516 758587 757894 756799 755815 754414 751665 747481 742421 736956
$$ packed form
59023G71572J8191J9510K0785K2060K2363K1117J8693J5426J1271O484J565l428
59011I45609q378j2135j3446j2726j1504j0282q425o029m096k761j001J470L593
58998H59889M611M927N006M753M247L799L090J540l80j559k065l023m581n577
58984H74677n587n537n876n645m133k019k12J288K707L848M744N977P694R195
58970H81121R982J0470J1312J2675J4355J5873J6446J5738J4489J3575J2669J0825
58958A039530Q009M815J076l666q635j2426j5104j7939k0995k2776k2591k1530
58946I07768k0572j9386j7613j5861j4610j3346j1445r043o600m508l260l071
58934G68453l183k629j627j098r98n39J37P1o93j095r84j401k749m184n060n465
$$ plain form
58918 736956 731738 727771 725387 723751 722212 721299 721553 722413 723322 724962 728190 732722 738141 745181 754499
58903 754499 765117 775814 787318 801264 817440 833867 849383 864384 879140 893121 906211
58892 906211 919130 932479 946518 961998 979990 1000761 1023627 1047649 1071422 1092588 1109057
58881 1109057 1120808 1129356 1135529 1138844 1138805 1135419 1128468 1117655 1103656 1087883 1071080 1053266 1035040
58868 1035040 1017704 1001865 987023 972851 959864 948552 938675 929665 921021 912255 903175 894254
58856 894254 886052 878397 870806 863484 857020 851349 845942 840899 836897 834088 831859 829481 826156 820721
58842 820721 812406 801855 790477 778856 766667 753960 741497 729795 718738 708208 698365 689378
58830 689378 681524 675332 670976 667819 665262 663633 663469 664408 665777 667788 671161 675906 681465 687662 694530
$$ packed form
58918G36956n218l967k384j636j539r13K54Q60R09J640L228M532N419P040R318
58903G54499J0618J0697J1504J3946J6176J6427J5516J5001J4756J3981J3090
58892I06211J2919J3349J4039J5480J7992K0771K2866K4022K3773K1166J6469
58881A109057J1751Q548O173L315l9l386o951j0813j3999j5773j6803j7814j8226
58868A035040j7336j5839j4842j4172j2987j1312r877r010q644q766r080q921
58856H94254q202p655p591p322o464n671n407n043m002k809k229k378l325n435
58842H20721q315j0551j1378j1621j2189j2707j2463j1702j1057j0530r843q987
58830F89378p854o192m356l157k557j629j64R39J369K011L373M745N559O197O868
$$ plain form
58815 694530 701660 708740 716244 724412 732024 737396 740291 741710 742254 741876 740806 739356 737199 734121 731071
58800 731071 729116 727775 725800 723166 720689 718067 714112 708835 703649 699431 695925 693113 691614 691565 692471
58785 692471 694308 697476 701710 706369 711647 718055 724837 730522 734987 739237 743146 745277 745196 744088 742514
58770 742514 739311 733477 725706 717264 708578 699637 690750 682268 674435 667883 663397 660884 659519 659002
58756 659002 659652 661193 662690 663914 665582 667943 670208 671685 672499 673037 673686 675185 678176 682379 687168
58741 687168 692842 700156 708788 717673 726708 736667 747387 757614 766805 775614 784318 792100 798145 802226
58727 802226 804114 803691 801709 799110 795622 790372 783763 777220 771186 765079 759128 754439 751164 748543
58713 748543 746864 747340 749662 751735 752415 752527 752532 751133 747147 741031 733646 725013 715093 704339 692668
$$ packed form
58815F94530P130P080P504Q168P612N372K895J419N44l78j070j450k157l078l050
58800G31071j955j341j975k634k477k622l955n277n186m218l506k812j499m9R06
58785F92471J837L168M234M659N278O408O782N685M465M250L909K131q1j108j574
58770G42514l203n834p771q442q686q941q887q482p833o552m486k513j365n17
58756F59002O50J541J497J224J668K361K265J477Q14N38O49J499K991M203M789
58741F87168N674P314Q632Q885R035R959J0720J0227R191Q809Q704P782O045M081
58727H02226J888m23j982k599l488n250o609o543o034o107n951m689l275k621
58713G48543j679M76K322K073O80J12Nj399l986o116p385q633r920j0754j1671
$$ plain form
58698 692668 679231 663983 648201 632936 618288 604611 592864 583200 574743 567301 561697 557865
58686 557865 554301 550129 546037 542478 538632 533983 529295 525140 521036 516914 513891 512624 512277 512004 512054
58671 512054 512648 513304 514204 516724 521637 528092 535207 543331 552874 563248 573730 583941 592694 597918
58657 597918 598737 596400 592469 587449 581786 576466 571713 566570 560618 554702 549314 543966 538841 535173
58643 535173 533032 530641 527050 523699 522186 522241 523133 525212 528599 532025 534568 537108 540599 544209 546524
58628 546524 547350 547129 545942 544327 543606 544169 544820 545004 546082 549106 552992 556389 559851 564573 570382 576549
58612 576549 583207 590409 597018 602077 606086 609561 611730 612198 612445 613957 616088 617490 618424 619920 621737
58597 621737 622882 623285 623386 623026 622249 622230 623926 626682 629620 633501 639811 648898 660293 673827 689100
$$ packed form
58698F92668j3437j5248j5782j5265j4648j3677j1747r664q457p442n604l832
58686E57865l564m172m092l559l846m649m688m155m104m122l023j267l47k73N0
58671E12054N94O56R00K520M913O455P115Q124R543J0374J0482J0211Q753N224
58657E97918Q19k337l931n020n663n320m753n143n952n916n388n348n125l668
58643E35173k141k391l591l351j513N5Q92K079L387L426K543K540L491L610K315
58628E46524Q26k21j187j615p21N63O51J84J078L024L886L397L462M722N809O167
58612E76549O658P202O609N059M009L475K169M68K47J512K131J402R34J496J817
58597F21737J145M03J01l60p77j9J696K756K938L881O310R087J1395J3534J5273
$$ plain form
58582 689100 704823 719966 734639 748788 761219 771030 778703 784606 787886 788223 787217 786603 786478 786715
58568 786715 788613 793520 801225 811305 824610 841733 861438 882345 904712 928712 952387 973363
58556 973363 991274 1006488 1017758 1023422 1024011 1021532 1017014 1010695 1003750 997715 992737 988020 983278 978186
58542 978186 971303 961277 948357 933268 915625 895019 872652 850274 828440 807256 787625 770201
58530 770201 754349 739723 727568 718782 712138 706150 701322 698674 697509 696664 696530 697743 699211 699677
58516 699677 699942 701328 703066 703422 702403 701243 700205 698836 697272 695440 692305 687829 684156 682851 682560
58501 682560 681572 680815 681728 683021 682497 680657 679463 678886 677772 676932 678184 681170 684203 687399 691987 697354
58485 697354 701998 706765 713966 723734 734270 745334 758484 774061 790734 807810 825265 841596
$$ packed form
58582F89100J5723J5143J4673J4149J2431R811P673N903L280L37j006o14j25K37
58568G86715J898M907P705J0080J3305J7123J9705K0907K2367K4000K3675K0976
58556I73363J7911J5214J1270N664N89k479m518o319o945o035m978m717m742n092
58542I78186o883j0026j2920j5089j7643k0606k2367k2378k1834k1184j9631j7424
58530G70201j5852j4626j2155q786o644n988m828k648j165q45j34J213J468M66
58516F99677K65J386J738L56j019j160j038j369j564j832l135m476l673j305k91
58501F82560r88p57R13J293n24j840j194n77j114q40J252K986L033L196M588N367
58485F97354M644M767P201R768J0536J1064J3150J5577J6673J7076J7455J6331
$$ plain form
58473 841596 854272 862332 866451 866798 863008 855712 845970 833955 820320 807772 798782 792732 787826
58460 787826 784627 784885 788180 792871 799335 809017 821100 833395 845763 859259 872500 882275 887331
58447 887331 888459 885515 877802 866894 855670 844815 833458 822607 814379 808266 801892 795341 791199
58434 791199 790398 791481 793880 798376 804373 810257 816567 825439 836834 848663 860471 873463 886861
58421 886861 897897 905578 910958 913629 911696 905533 897910 889945 880371 869119 858094 847964 837585
58408 837585 827033 817847 809935 801641 793202 786786 782798 779493 776437 774932 774870 774731 774878 777274 781783
58393 781783 786317 790694 796511 803141 807918 810571 813467 817150 819816 821536 824692 829576 833844 837012
58379 837012 841260 846954 851647 854498 857536 861617 865220 868239 872822 879408 885951 892032 899654 909123
$$ packed form
58473H41596J2676Q060M119L47l790p296r742j2015j3635j2548q990o050m906
58460G87826l199K58L295M691O464R682J2083J2295J2368J3496J3241R775N056
58447H87331J128k944p713j0908j1224j0855j1357j0851q228o113o374o551m142
58434G91199q01J083K399M496N997N884O310Q872J1395J1829J1808J2992J3398
58421H86861J1036P681N380K671j933o163p623p965r574j1252j1025j0130j0379
58408H37585j0552r186p912q294q439o416l988l305l056j505o2j39J47K396M509
58393G81783M534M377N817O630M777K653K896L683K666J720L156M884M268L168
58379H37012M248N694M693K851L038M081L603L019M583O586O543O081P622R469
$$ plain form
58365 909123 918356 927221 938183 951618 964831 976869 989875 1004459 1018117 1029572 1040267 1050228
58353 1050228 1056898 1059627 1061112 1062954 1063952 1063981 1065064 1067352 1068584 1068946 1071826 1078318 1085646 1092519 1101208
58338 1101208 1112719 1124819 1136727 1150889 1168141 1185879 1202985 1221745 1242731 1262458 1278339
58327 1278339 1291523 1302913 1311007 1315626 1319200 1322484 1323662 1323250 1324819 1329102 1332638 1334138 1336805 1342389
58313 1342389 1348549 1354320 1362438 1373775 1385107 1395015 1406385 1420471 1434194 1446127 1459407 1475817
58301 1475817 1492632 1508164 1524677 1542905 1559613 1573652 1588597 1606357 1624072 1640336 1658273
58290 1658273 1679283 1700108 1719445 1741011 1766554 1792290 1815871 1840386 1867775 1894921 1920125
58279 1920125 1946755 1976619 2006498 2035147 2066831 2103954 2143275 2183350 2228300 2280022 2334293
$$ packed form
58365I09123R233Q865J0962J3435J3213J2038J3006J4584J3658J1455J0695R961
58353A050228O670K729J485J842R98K9J083K288J232L62K880O492P328O873Q689
58338A101208J1511J2100J1908J4162J7252J7738J7106J8760K0986J9727J5881
58327A278339J3184J1390Q094M619L574L284J178m12J569M283L536J500K667N584
58313A342389O160N771Q118J1337J1332R908J1370J4086J3723J1933J3280J6410
58301A475817J6815J5532J6513J8228J6708J4039J4945J7760J7715J6264J7937
58290A658273K1010K0825J9337K1566K5543K5736K3581K4515K7389K7146K5204
58279A920125K6630K9864K9879K8649L1684L7123L9321M0075M4950N1722N4271
$$ plain form
58268 2334293 2388870 2447556 2511814 2576647 2639623 2705537 2777036 2849270 2919160 2991020 3067190
58257 3067190 3142077 3211687 3280184 3350912 3420188 3486440 3555955 3632760 3712363 3792295 3878707
58246 3878707 3975331 4076481 4178760 4288937 4412003 4542442 4675948 4818416 4974244 5137418
58236 5137418 5303924 5481046 5674234 5877062 6084918 6305922 6546937 6801877 7065958
58227 7065958 7348015 7655877 7983453 8325977 8693942 9097685 9532753 9995353 10496909
58218 10496909 11047570 11641470 12275158 12963856 13722105 14546859 15439032 16422372 17520223
58209 17520223 18734479 20070323 21559868 23237408 25116831 27222602 29618829 32379847
58201 32379847 35564183 39255599 43602222 48781755 54969372 62386117 71333989 82129595
$$ packed form
58268B334293N4577N8686O4258O4833O2976O5914P1499P2234O9890P1860P6170
58257C067190P4887O9610O8497P0728O9276O6252O9515P6805P9603P9932Q6412
58246C878707R6624J01150J02279J10177J23066J30439J33506J42468J55828J63174
58236E137418J66506J77122J93188K02828K07856K21004K41015K54940K64081
58227G065958K82057L07862L27576L42524L67965M03743M35068M62600N01556
58218A0496909N50661N93900O33688O88698P58249Q24754Q92173R83340J097851
58209A7520223J214256J335844J489545J677540J879423K105771K396227K761018
58201C2379847L184336L691416M346623N179533O187617P416745Q947872J0795606
$$ plain form
58193 82129595 95063186 110507141 129020679 151274389 177941932 209681618 246783695
58186 246783695 288034596 329459006 364518751 386421221 391114597 378779323 353060400
58179 353060400 319116743 281894879 245167559 211224495 181050279 154805383 132287275
58172 132287275 113151274 96976550 83340002 71881397 62286053 54244688 47476487
58165 47476487 41768612 36954952 32875340 29386503 26390450 23816764 21589840 19638861
58157 19638861 17922483 16415343 15082115 13887620 12818499 11870866 11026959 10264292
58149 10264292 9576352 8963722 8414543 7912407 7454035 7041123 6663531 6307662 5973304
58140 5973304 5666197 5381855 5111997 4858972 4628701 4416545 4214418 4024729 3853397
$$ packed form
58193H2129595J2933591J5443955J8513538K2253710K6667543L1739686L7102077
58186B46783695M1250901M1424410L5059745K1902470M693376j2335274k5718923
58179C53060400l3943657l7221864l6727320l3943064l0174216k6244896k2518108
58172A32287275j9136001j6174724j3636548j1458605r595344q041365o768201
58165D7476487n707875m813660m079612l488837k996053k573686k226924j950979
58157A9638861j716378j507140j333228j194495j069121r47633q43907p62667
58149A0264292o87940o12630n49179n02136m58372m12912l77592l55869l34358
58140E973304l07107k84342k69858k53025k30271k12156k02127j89689j71332
$$ plain form
58131 3853397 3695965 3544336 3400665 3271126 3152087 3035634 2923113 2820338 2724717 2629756
58121 2629756 2537448 2453931 2377255 2301195 2227045 2160113 2098403 2035987 1974189 1918612 1868236
58110 1868236 1817794 1767998 1723349 1682454 1640109 1596607 1556053 1517987 1479269 1441564 1408483
58099 1408483 1377971 1345752 1313587 1286027 1261778 1236400 1210790 1188846 1169298 1147953 1125771
58088 1125771 1106811 1090337 1072633 1054449 1039079 1025176 1008945 991414 976171 961872 944396
58077 944396 924671 907056 891585 874894 857309 842023 828612 814137 799280 786846 775673
58066 775673 762563 748772 738050 729760 720531 711246 705595 702843 698713 692524 687015 681975 674598
58053 674598 665513 658095 652263 645005 636560 630121 625871 621173 616170 613362 612002 608729 603530 599444
$$ packed form
58131C853397j57432j51629j43671j29539j19039j16453j12521j02775r5621r4961
58121B629756r2308q3517p6676p6060p4150o6932o1710o2416o1798n5577n0376
58110A868236n0442m9796m4649m0895m2345m3502m0554l8066l8718l7705l3081
58099A408483l0512l2219l2165k7560k4249k5378k5610k1944j9548k1345k2182
58088A125771j8960j6474j7704j8184j5370j3903j6231j7531j5243j4299j7476
58077I44396j9725j7615j5471j6691j7585j5286j3411j4475j4857j2434j1173
58066G75673j3110j3791j0722q290r229r285n651k752m130o189n509n040p377
58053F74598r085p418n832p258q445o439m250m698n003k808j360l273n199m086
$$ plain form
58039 599444 596600 592092 585613 579707 574525 567741 559678 553239 548618 543025 535694 528318 520716 511099
58025 511099 500521 492130 485996 479514 472774 468533 466808 464427 460224 456004 452266 447607 442573 439462
58011 439462 438061 435933 433001 431458 431143 429602 426856 425545 426148 426502 426224 427162 429219 430260 430397 431970
57995 431970 434968 436899 437498 439121 442094 444178 445097 447119 450586 453234 454606 456787 460122 462511 463687
57980 463687 465850 469265 471448 471647 471978 473254 473895 473893 475632 479556 483010 484522 485359 485823 484062 479826
57964 479826 475464 471834 467017 460383 454182 449670 445400 440766 437564 436444 435288 432733 429980 427711
57950 427711 424641 420670 418012 417550 417310 416243 416273 418859 422793 427211 433675 443127 453639 463294 472872
57935 472872 483738 495433 507082 518964 531000 541776 550465 557648 563075 564988 562809 558129 551828
$$ packed form
58039E99444k844m508o479n906n182o784q063o439m621n593p331p376p602r617
58025E11099j0578q391o134o482o740m241j725k381m203m220l738m659n034l111
58011D39462j401k128k932j543l15j541k746j311O03L54k78R38K057J041J37J573
57995D31970K998J931N99J623K973K084R19K022L467K648J372K181L335K389J176
57980D63687K163L415K183J99L31J276O41kJ739L924L454J512Q37M64j761m236
57964D79826m362l630m817o634o201m512m270m634l202j120j156k555k753k269
57950D27711l070l971k658m62k40j067L0K586L934M418O464R452J0512R655R578
57935D72872J0866J1695J1649J1882J2036J0776Q689P183N427J913k179m680o301
$$ plain form
57922 551828 542747 530511 517097 504127 490949 476819 462741 449735 437484 426019 416567 409433
57910 409433 403163 396999 392051 389004 386922 385326 385061 385947 385932 383891 381061 378604 376118 373595 372385
57895 372385 372911 373823 374648 376841 380949 385267 388733 392610 397713 402486 405595 408124 411315 414216 415374
57880 415374 415019 413807 411248 407030 402251 397802 393126 387828 382755 378259 373314 367654 362849 359981
57866 359981 358139 356461 355582 355787 355864 355305 355582 357695 360556 363323 367187 373130 379917 386193 392647 400171
57850 400171 407634 413436 417711 421151 423214 423424 423010 423333 423837 423252 421684 419935 417882 415055 411838
57835 411838 408845 406147 404075 403489 404294 405183 405808 407524 410963 414745 417797 420962 424925 428519 430819
57820 430819 433138 437157 442504 447814 452555 456190 457077 454081 448048 440242 430702 419545 408260 398004
$$ packed form
57922E51828r081j2236j3414j2970j3178j4130j4078j3006j2251j1465r452p134
57910D09433o270o164m948l047k082j596k65Q86j5k041k830k457k486k523j210
57895C72385N26R12Q25K193M108M318L466L877N103M773L109K529L191K901J158
57880D15374l55j212k559m218m779m449m676n298n073m496m945n660m805k868
57866C59981j842j678q79K05P7n59K77K113K861K767L864N943O787O276O454P524
57850D00171P463N802M275L440K063K10m14L23N04n85j568j749k053k827l217
57835D11838k993k698k072n86Q05Q89O25J716L439L782L052L165L963L594K300
57820D30819K319M019N347N310M741L635Q87k996o033p806r540j1157j1285j0256
$$ plain form
57806 398004 388094 377823 368303 360762 354491 348252 342392 337828 334188 330686 327642 325496 323515 321142
57792 321142 319377 319246 320098 320945 322168 324353 326790 328797 331184 334770 338809 342603 347201 353698 361191
57777 361191 368414 375989 385014 394595 402933 409819 415984 420926 423530 424095 423727 422370 419288 414818 409857
57762 409857 404311 397727 390789 384526 378745 372815 367214 362705 358871 355113 352179 350968 350640 349695 348240
57747 348240 347478 347650 348098 348631 349239 349254 348329 347426 347258 346784 344900 342550 341235 340512 339092 337541 337623 339440
57729 339440 341362 342456 343085 343471 343549 343910 345120 346399 346652 346409 347085 348697 349949 350183 349642 348317 346225
57712 346225 344364 343698 343493 342238 339771 337013 334212 331140 328413 326730 325298 322825 319708 317456 316325
57697 316325 315393 314616 314921 316373 318034 319543 321185 322584 323004 322834 323164 324073 324861 325838 328280 332759
$$ packed form
57806C98004r910j0271r520p541o271o239n860m564l640l502l044k146j981k373
57792C21142j765j31Q52Q47J223K185K437K007K387L586M039L794M598O497P493
57777C61191P223P575R025R581Q338O886O165M942K604N65l68j357l082m470m961
57762D09857n546o584o938o263n781n930n601m509l834l758k934j211l28r45j455
57747C48240p62J72M48N33O08J5r25r03j68m74j884k350j315p23j420j551Q2J817
57729C39440J922J094O29L86P8L61J210J279K53k43O76J612J252K34n41j325k092
57712C46225j861o66k05j255k467k758k801l072k727j683j432k473l117k252j131
57697C16325r32p77L05J452J661J509J642J399M20j70L30R09P88R77K442M479
$$ plain form
57681 332759 338935 346801 356647 368141 381071 396847 417811 445320 479893 522762 575605 639125
57669 639125 713789 801908 906990 1029993 1165887 1302248 1419885 1497209 1518898 1483199
57659 1483199 1401309 1290344 1167109 1045384 934140 836423 751342 677840 615813 564460
57649 564460 521894 486687 458219 435489 417152 402626 391539 382320 373173 364339 357554 353241
57637 353241 350055 347101 344693 342854 341050 339579 339357 339991 339930 338815 337896 337748 337284 335499 332632 329200
57621 329200 325351 321546 318435 315760 312688 309376 306818 305095 303289 301183 299488 298335 297086 295718
57607 295718 294830 294289 293494 292907 293520 294807 295072 293836 292055 290036 287295 284520 283288 283391 282692 280209
57591 280209 277165 274358 270817 266010 261258 257797 255239 252969 251320 250365 249248 247729 246739 246469 245586
$$ packed form
57681C32759O176P866R846J1494J2930J5776K0964K7509L4573M2869N2843O3520
57669F39125P4664Q8119J05082J23003J35894J36361J17637P7324K1689l5699
57659A483199q1890j10965j23235j21725j11244r7717q5081p3502o2027n1353
57649E64460m2566l5207k8468k2730j8337j4526j1087r219r147q834o785m313
57637C53241l186k954k408j839j804j471k22O34o1j115r19j48m64j785k867l432
57621C29200l849l805l111k675l072l312k558j723j806k106j695j153j249j368
57607B95718q88n41p95n87O13J287K65j236j781k019k741k775j232J03o99k483
57591B80209l044k807l541m807m752l461k558k270j649r55j117j519r90k70q83
$$ plain form
57576 245586 243378 240982 239333 237565 234707 231432 228752 226331 223445 220451 217987 215780 213462 211628
57562 211628 210895 210856 210947 211384 212245 212664 212096 211495 212109 213822 215670 217312 219039 221042 223509 226811 230728
57545 230728 234078 235838 236208 236102 236212 236988 238714 241068 243215 244698 245612 245817 244955 243435 242296 241769
57529 241769 241125 240199 239776 240101 240429 240627 241821 244637 248022 250625 252273 253399 254170 254964 256670 259633
57513 259633 263072 266093 268461 270071 270795 271260 272470 274201 275079 274781 274692 275740 277069 277704 277975 278245
57497 278245 277649 275328 271804 268052 264260 260535 257672 256097 255029 253754 252746 252526 252420 251553 250182
57482 250182 249005 248037 247153 246828 247295 247801 247690 247448 247731 248245 248494 248791 249579 250580 251493 252670 254207
57465 254207 255248 255155 254486 254000 253651 253455 254261 256490 259004 260361 260556 260507 260658 261070 262086 263862 265838
$$ packed form
57576B45586k208k396j649j768k858l275k680k421k886k994k464k207k318j834
57562B11628p33l9R1M37Q61M19n68o01O14J713J848J642J727K003K467L302L917
57545B30728L350J760L70j06J10P76J726K354K147J483R14K05q62j520j139n27
57529B41769o44r26m23L25L28J98J194K816L385K603J648J126P71P94J706K963
57513B59633L439L021K368J610P24M65J210J731Q78k98q9J048J329O35K71K70
57497B78245n96k321l524l752l792l725k863j575j068j275j008k20j06q67j371
57482B50182j177r68q84l25M67N06j11k42K83N14K49K97P88J001R13J177J537
57465B54207J041r3o69m86l49j96Q06K229K514J357J95m9J51M12J016J776J976
$$ plain form
57448 265838 267529 269156 270851 272157 273035 274291 276177 277681 278190 278697 280296 282632 284919 287328 290120
57433 290120 292490 293671 294312 295457 297016 298459 300109 302428 304890 306866 308806 311243 313521 314834
57419 314834 315715 317115 318845 320302 321874 324148 326490 327951 328886 330232 331900 333383 335187 338061 341374
57404 341374 343856 345423 346769 347781 347970 347976 348979 351040 353536 356708 361136 366150 370516 374375 378774
57389 378774 383547 387452 390283 393140 396626 400415 404586 409738 415646 421304 426437 431555 436481 440343
57375 440343 443156 445975 449208 452135 454317 456201 458045 459508 460630 462148 464509 467474 470854 474742
57361 474742 478928 483005 487048 491379 495799 500076 504912 511296 519012 526986 535018 543889 553712 563442
57347 563442 572181 579922 586920 593403 599997 607393 615410 623229 630558 637694 644671 651373 658298 666020
$$ packed form
57448B65838J691J627J695J306Q78J256J886J504N09N07J599K336K287K409K792
57433B90120K370J181O41J145J559J443J650K319K462J976J940K437K278J313
57419C14834Q81J400J730J457J572K274K342J461R35J346J668J483J804K874L313
57404C41374K482J567J346J012J89OJ003K061K496L172M428N014M366L859M399
57389C78774M773L905K831K857L486L789M171N152N908N658N133N118M926L862
57375D40343K813K819L233K927K182J884J844J463J122J518K361K965L380L888
57361D74742M186M077M043M331M420M277M836O384P716P974Q032Q871R823R730
57347E63442Q739P741O998O483O594P396Q017P819P329P136O977O702O925P722
$$ plain form
57333 666020 674033 681339 688118 695521 703814 712032 719651 727374 735981 745449 755415 765536 775266 784245
57319 784245 793052 802666 813171 823816 834219 844512 854543 864133 873940 884800 896267 907170
57307 907170 917607 928968 941783 954983 967654 980180 993207 1006628 1020147 1033874 1047933
57296 1047933 1062263 1077042 1092497 1108198 1123503 1138700 1154704 1171577 1188478 1205127 1222055
57285 1222055 1239259 1255964 1272127 1288965 1307479 1327398 1347969 1368852 1389944 1411213 1433019
57274 1433019 1455743 1478999 1502170 1525725 1550815 1577455 1604377 1630984 1658113 1686441 1715379
57263 1715379 1744106 1772657 1801425 1830544 1860244 1890835 1921910 1952474 1982318 2012361 2043225
57252 2043225 2074471 2105621 2136993 2169058 2201842 2235380 2269842 2304898 2339934 2375250 2411966
$$ packed form
57333F66020Q013P306O779P403Q293Q218P619P723Q607R468R966J0121R730Q979
57319G84245Q807R614J0505J0645J0403J0293J0031R590R807J0860J1467J0903
57307I07170J0437J1361J2815J3200J2671J2526J3027J3421J3519J3727J4059
57296A047933J4330J4779J5455J5701J5305J5197J6004J6873J6901J6649J6928
57285A222055J7204J6705J6163J6838J8514J9919K0571K0883K1092K1269K1806
57274A433019K2724K3256K3171K3555K5090K6640K6922K6607K7129K8328K8938
57263A715379K8727K8551K8768K9119K9700L0591L1075L0564K9844L0043L0864
57252B043225L1246L1150L1372L2065L2784L3538L4462L5056L5036L5316L6716
$$ plain form
57241 2411966 2450313 2489051 2527064 2564496 2601816 2638884 2675621 2712547 2749803 2786482 2821799
57230 2821799 2856346 2891461 2927775 2964936 3002327 3039701 3077496 3116769 3158280 3201561 3245550
57219 3245550 3290128 3336150 3383908 3432612 3481681 3531460 3582196 3633221 3683618 3732964 3781100
57208 3781100 3828020 3874318 3920901 3967937 4014846 4061466 4108217 4154943 4200685 4245024 4288560
57197 4288560 4331709 4374137 4415859 4457757 4500459 4543722 4587478 4632308 4678188 4723867 4768424
57186 4768424 4812669 4858176 4905569 4954375 5003851 5053315 5102322 5151245 5201308 5253655 5308773
57175 5308773 5366812 5427639 5490457 5554361 5619461 5686546 5755533 5825361 5895365 5965113 6032484
57164 6032484 6093791 6146927 6193308 6235839 6276141 6314547 6351323 6386433 6418975 6448128 6474162
$$ packed form
57241B411966L8347L8738L8013L7432L7320L7068L6737L6926L7256L6679L5317
57230B821799L4547L5115L6314L7161L7391L7374L7795L9273M1511M3281M3989
57219C245550M4578M6022M7758M8704M9069M9779N0736N1025N0397M9346M8136
57208C781100M6920M6298M6583M7036M6909M6620M6751M6726M5742M4339M3536
57197D288560M3149M2428M1722M1898M2702M3263M3756M4830M5880M5679M4557
57186D768424M4245M5507M7393M8806M9476M9464M9007M8923N0063N2347N5118
57175E308773N8039O0827O2818O3904O5100O7085O8987O9828P0004O9748O7371
57164F032484O1307N3136M6381M2531M0302L8406L6776L5110L2542K9153K6034
$$ plain form
57153 6474162 6497628 6518212 6535188 6548247 6557032 6560592 6558163 6549872 6535986 6516203 6490459 6459726
57141 6459726 6425311 6388207 6349848 6312661 6278937 6249828 6226073 6208781 6198519 6194385 6194751 6198217
57129 6198217 6203059 6206738 6207058 6203276 6195417 6183498 6168496 6153239 6141174 6134687 6135337 6144684 6163629
57116 6163629 6191566 6227491 6271615 6325007 6388318 6462158 6548526 6650843 6772852 6918286 7091333
57105 7091333 7296611 7539127 7825226 8163602 8565274 9044013 9618809 10316467 11171404
57096 11171404 12223129 13514462 15091319 17002159 19295570 22016516 25202729 28882411
57088 28882411 33072922 37777923 42980365 48632135 54643934 60878235 67147136 73218127
57080 73218127 78828711 83704541 87575478 90194659 91371133 91012070 89150922 85941058
$$ packed form
57153F474162K3466K0584J6976J3059Q785L560k429q291j3886j9783k5744l0733
57141F459726l4415l7104l8359l7187l3724k9109k3755j7292j0262m134L66L466
57129F198217M842L679L20l782p859j1919j5002j5257j2065o487O50R347J8945
57116F163629K7937L5925M4124N3392O3311P3840Q6368J02317J22009J45434J73047
57105G091333K05278K42516K86099L38376M01672M78739N74796O97658Q54937
57096A1171404J051725J291333J576857J910840K293411K720946L186213L679682
57088B8882411M190511M705001N202442N651770O011799O234301O268901O070991
57080G3218127N610584M875830L870937K619181J176474l59063j861148l209864
$$ plain form
57072 85941058 81619407 76461822 70746115 64726242 58618038 52597040 46803774 41348106
57064 41348106 36309607 31737690 27654275 24057600 20926266 18224701 15909545 13934474
57056 13934474 12253066 10821496 9600999 8558335 7664696 6895377 6230258 5653245 5150782
57047 5150782 4711274 4325353 3985367 3684440 3416757 3178359 2966493 2778117 2609839
57038 2609839 2459218 2325183 2207200 2104711 2017280 1944671 1886862 1843964 1814690 1793600
57028 1793600 1770625 1735231 1681777 1611025 1527808 1438537 1349710 1266177 1189850 1120595 1058167
57017 1058167 1002563 953178 909021 869561 834359 802258 772135 744104 718776 695756 674127
57006 674127 653942 635723 618774 601566 583764 566441 550245 534744 519604 505061 491069
$$ packed form
57072H5941058m321651n157585n715707o019873o108204o020998n793266n455668
57064D1348106n038499m571917m083415l596675l131334k701565k315156j975071
57056A3934474j681408j431570j220497j042664q93639p69319o65119n77013n02463
57047E150782m39508l85921l39986l00927k67683k38398k11866j88376j68278
57038B609839j50621j34035j17983j02489q7431p2609n7809m2898k9274k1090
57028A793600k2975l5394n3454p0752q3217q9271q8827q3533p6327o9255o2428
57017A058167n5604m9385m4157l9460l5202l2101l0123k8031k5328k3020k1629
57006F74127k0185j8219j6949j7208j7802j7323j6196j5501j5140j4543j3992
$$ plain form
56995 491069 477290 464107 452543 443016 435162 428884 424588 422393 422194 424473 430072 439153 451163
56982 451163 465277 479638 490636 494610 490475 479716 464255 445689 426114 407658 390935 375449
56970 375449 361609 350795 343353 338235 334884 333868 335339 338576 343634 351876 364234 380353 399966
56957 399966 423420 449718 475190 495114 506031 506192 495336 475257 449848 423376 398680 377039
56945 377039 358809 343644 330854 320250 312258 307115 304651 305077 309200 317556 330094 346892 368423
56932 368423 394770 425180 458209 491232 519650 537929 542373 532862 512204 484608 454456 424965
56920 424965 397234 370994 346311 323809 303589 285180 268664 254633 242936 232673 223622 216433
56908 216433 211155 206815 202777 199297 196395 193457 190469 188473 188164 189001 190127 191251 192290 193256 194913
$$ packed form
56995D91069j3779j3183j1564r527p854o278m296k195j99K279N599R081J2010
56982D51163J4114J4361J0998L974m135j0759j5461j8566j9575j8456j6723j5486
56970C75449j3840j0814p442n118l351j016J471L237N058Q242J2358J6119J9613
56957C99966K3454K6298K5472J9924J0917J61j0856k0079k5409k6472k4696k1641
56945C77039j8230j5165j2790j0604p992n143k464M26M123Q356J2538J6798K1531
56932C68423K6347L0410L3029L3023K8418J8279M444r511k0658k7596l0152k9491
56920D24965k7731k6240k4683k2502k0220j8409j6516j4031j1697j0263r051p189
56908B16433n278m340m038l480k902k938k988j996l09Q37J126J124J039R66J657
$$ plain form
56893 194913 198436 203921 210268 217016 225294 236550 251328 269604 290904 313299 333254 347456
56881 347456 354432 354388 348551 339050 328302 317758 307792 298918 292090 287633 285094 284471 286437 291059
56867 291059 297694 306645 319563 337547 360152 387065 419403 458183 502084 547254 588332 619286
56855 619286 634922 633316 616782 590111 558356 526087 496998 472936 453798 438957 428193 421264
56843 421264 417889 418774 425486 438772 458123 483483 516145 557397 607620 667163 735913 810088
56831 810088 880283 934440 963195 962878 935512 887571 827808 764287 702648 646541 598226 558133
56819 558133 525162 498536 478655 465699 458751 457206 461888 473786 492763 518561 552036 594103
56807 594103 643871 698100 751088 794445 819070 819766 798056 759931 711814 659109 606533 557419
$$ packed form
56893A94913L523N485O347O748Q278J1256J4778J8276K1300K2395J9955J4202
56881C47456O976m4n837r501j0748j0544r966q874o828m457k539o23J966M622
56867B91059O635Q951J2918J7984K2605K6913L2338L8780M3901M5170M1078L0954
56855F19286J5636j606j6534k6671l1755l2269k9089k4062j9138j4841j0764o929
56843D21264l375Q85O712J3286J9351K5360L2662M1252N0223N9543O8750P4175
56831H10088P0195N4157K8755l17k7366m7941n9763o3521o1639n6107m8315m0093
56819E58133l2971k6626j9881j2956o948j545M682J1898J8977K5798L3475M2067
56807E94103M9768N4229N2988M3357K4625O96k1710l8125m8117n2705n2576m9114
$$ plain form
56795 557419 513033 473886 441075 415219 395057 378757 366167 358444 356067 358557 365653 377386
56783 377386 393384 413362 437749 466283 495903 521105 536606 539388 529185 508248 480409 449259
56771 449259 417115 385791 357259 332625 311368 292656 276643 263464 251938 240726 230096
56760 230096 221152 213864 207292 201326 196697 193426 190579 187526 184385 181294 178291 175802 174375 173880
56746 173880 173651 173225 172467 171383 170405 170307 171240 172417 173277 174173 175311 176055 176103 176283 177141 177813 177512 177128
56728 177128 177977 179794 181440 182804 184520 186424 187858 189050 190731 192804 194724 196762 199519 202670
56714 202670 205553 208512 212235 216185 219206 221338 223624 226498 229720 233471 237915 242071 244777 246583
56700 246583 249055 252335 255092 256784 258243 259803 260585 260144 259372 259186 259412 259397 258813 257452 255082 251865
$$ packed form
56795E57419m4386l9147l2811k5856k0162j6300j2590p723k377K490P096J1733
56783C77386J5998J9978K4387K8534K9620K5202J5501K782j0203k0937k7839l1150
56771D49259l2144l1324k8532k4634k1257j8712j6013j3179j1526j1212j0630
56760B30096q944p288o572n966m629l271k847l053l141l091l003k489j427m95
56746A73880k29m26p58j084r78r8R33J177Q60Q96J138P44M8J80Q58O72l01l84
56728A77128Q49J817J646J364J716J904J434J192J681K073J920K038K757L151
56714B02670K883K959L723L950L021K132K286K874L222L751M444M156K706J806
56700B46583K472L280K757J692J459J560P82m41p72j86K26j5n84j361k370l217
$$ plain form
56684 251865 248348 244902 241657 238780 236222 233473 230271 227140 224506 221879 218798 215895 213949 212487
56670 212487 210591 208515 207115 206184 204821 203152 202153 201945 201676 201004 200384 199967 199444 198903 198693 198677 198729 199545
56652 199545 201696 204307 206108 207339 209052 210939 211679 211286 211272 212321 213503 214066 214427 215084 215920 216869
56636 216869 218041 218978 219020 218540 218652 219650 220847 221773 222272 221703 219589 216951 215385 214799 213617 211256 208691
56619 208691 206535 204265 201643 199240 197154 194790 192274 190605 189994 189544 188910 188809 189484 190165 190543 191313
56603 191313 192711 193905 194403 194809 195652 196617 197428 198287 199060 199204 198825 198654 198706 198229 197250 196812 197327 198045
56585 198045 198494 199078 199844 200069 199601 199325 199794 200585 201420 202652 204256 205630 206805 208558 210919 212904
56569 212904 214213 215859 218582 221916 225362 229242 233840 238914 244590 251651 260447 270425 280917 291148
$$ packed form
56684B51865l517l446l245k877k558k749l202l131k634k627l081k903j946j462
56670B12487j896k076j400r31j363j669r99k08k69o72o20m17n23n41k10j6N2Q16
56652A99545K151K611J801J231J713J887P40l93j4J049J182N63L61O57Q36R49
56636B16869J172R37M2m80J12R98J197R26M99n69k114k638j566n86j182k361k565
56619B08691k156k270k622k403k086k364k516j669o11m50o34j01O75O81L78P70
56603A91313J398J194M98M06Q43R65Q11Q59P73J44l79j71N2m77r79m38N15P18
56585A98045M49N84P66K25m68k76M69P91Q35J232J604J374J175J753K361J985
56569B12904J309J646K723L334L446L880M598N074N676P061Q796R978J0492J0231
$$ plain form
56555 291148 299394 303720 304051 302252 299830 296908 293687 291170 289738 288436 286377 283649 280419 276468
56541 276468 272098 268163 264738 261101 257325 254397 252388 250151 247333 244963 243509 242072 240230 238922
56527 238922 238617 238282 237110 235814 235254 235186 235198 235436 235597 234698 232689 230809 229490 227556 224434 221471 219875
56510 219875 218902 217380 215592 214368 213562 212786 212501 213094 213824 213774 212968 211718 209996 208240 207524 207980 208361
56493 208361 208021 207949 208818 209543 209011 207880 207354 207356 207252 207252 207775 208398 208666 209009 209809 210546 210918 211656 213129 214225
56473 214225 213859 212614 211754 211587 211859 212708 214121 215357 215996 216669 217820 218777 218942 218786 218763 218438 217710 217583
56455 217583 218636 219871 220183 219849 219490 218867 217807 217123 217387 217977 218403 219353 221272 223188 224156 224611 225103
56438 225103 225023 223849 222361 221292 220110 218444 217326 217570 218223 218139 217854 218383 219382 220052 220655 221636 222450
$$ packed form
56555B91148Q246M326L31j799k422k922l221k517j432j302k059k728l230l951
56541B76468m370l935l425l637l776k928k009k237k818k370j454j437j842j308
56527B38922l05l35j172j296n60o8J2K38J61q99k009j880j319j934l122k963j596
56510B19875r73j522j788j224q06p76k85N93P30n0q06j250j722j756p16M56L81
56493B08361l40p2Q69P25n32j131n26Kj04%N23O23K68L43Q00P37L72P38J473J096
56473B14225l66j245q60j67K72Q49J413J236O39O73J151R57J65j56k3l25p28j27
56455B17583J053J235L12l34l59o23j060o84K64N90M26R50J919J916R68M55M92
56438B25103q0j174j488j069j182j666j118K44O53q4k85N29R99O70O03R81Q14
$$ plain form
56421 222450 222766 223570 225561 227728 229126 230672 233413 236354 237946 238573 239549 240699 240955 240502 240391 240695
56405 240695 240840 240993 241464 241585 240927 240703 242173 244506 246104 247243 249447 252874 256209 258637 260235 260918
56389 260918 260628 260058 259792 259406 258728 258896 260562 262179 261914 260322 259303 259321 259643 260401 262288 264803 266785
56372 266785 268197 269610 270572 270381 269832 270327 271717 272824 273467 274236 274981 275377 276289 278615 281407 283036
56356 283036 283604 284326 285250 285630 285960 287424 289690 291253 291707 291836 291840 291350 290872 291377 292696 293931 295078
56339 295078 296691 298480 299885 301375 303522 305486 306209 306431 307731 310187 312772 315322 318312 321449 324328
56324 324328 327672 332066 336338 339134 341146 343740 346375 347616 347749 348068 348419 347837 346794 346446 346483 346133
56308 346133 346388 348614 351797 353975 355675 359073 364318 369636 374672 380696 387660 393899 398739 402772
$$ packed form
56421B22450L16Q04J991K167J398J546K741K941J592O27R76J150K56m53j11L04
56405B40695J45J53M71J21o58k24J470K333J598J139K204L427L335K428J598O83
56389B60918k90n70k66l86o78J68J666J617k65j592j019J8L22P58J887K515J982
56372B66785J412J413R62j91n49M95J390J107O43P69P45L96R12K326K792J629
56356B83036N68P22R24L80L30J464K266J563M54J29Mm90m78N05J319J235J147
56339B95078J613J789J405J490K147J964P23K22J300K456K585K550K990L137K879
56324C24328L344M394M272K796K012K594K635J241J33L19L51n82j043l48L7l50
56308C46133K55K226L183K178J700L398N245N318N036O024O964O239M840M033
$$ plain form
56294 402772 405728 406727 406515 406849 407847 408520 409524 412503 416978 420820 423792 427653 432775 437658 441996
56279 441996 447266 453927 460782 467514 475229 484168 493389 502935 513813 525758 537535 549471 562985
56266 562985 577735 592066 606325 622737 641877 662321 684015 708914 737786 769424 803503
56255 803503 841391 883719 930118 981767 1041131 1108575 1182215 1261719 1349214 1445749 1549854
56244 1549854 1660339 1777401 1899957 2024766 2149194 2272132 2391280 2502317 2601766 2688068
56234 2688068 2759029 2811020 2841873 2852148 2842724 2813655 2766123 2702975 2626538 2538346 2441459
56223 2441459 2340208 2236960 2131811 2025942 1922246 1822079 1724589 1630135 1541203 1458974
56213 1458974 1382104 1309957 1243890 1184153 1128627 1076010 1027436 983709 943761 907051 874601
$$ packed form
56294D02772K956R99k12L34R98O73J004K979M475L842K972L861N122M883M338
56279D41996N270O661O855O732P715Q939R221R546J0878J1945J1777J1936J3514
56266E62985J4750J4331J4259J6412J9140K0444K1694K4899K8872L1638L4079
56255H03503L7888M2328M6399N1649N9364O7444P3640P9504Q7495R6535J04105
56244A549854J10485J17062J22556J24809J24428J22938J19148J11037R9449Q6302
56234B688068P0961N1991L0853J0275r424k9069m7532o3148p6437q8192r6887
56223B441459j01251j03248j05149j05869j03696j00167r7490r4454q8932q2229
56213A458974p6870p2147o6067n9737n5526n2617m8574m3727l9948l6710l2450
$$ plain form
56202 874601 846345 820263 795389 773016 753792 736434 720347 706603 695202 684362 673699
56191 673699 665117 659276 654157 648422 643237 639472 636101 632688 630420 629303 627371 624050 621342 620272
56177 620272 619259 617416 616331 617047 618319 619464 621982 626743 632425 638157 644817 652451 659510 665953
56163 665953 673924 684059 694412 704364 716063 730475 745582 760163 775835 793671 812440 832069
56151 832069 855222 883433 915104 949312 988212 1033809 1085955 1145520 1215982 1299784 1396617
56140 1396617 1507117 1634278 1778783 1936257 2100921 2267958 2430332 2578038 2704106
56131 2704106 2808583 2894867 2966175 3027587 3086253 3145290 3200264 3244321 3273582 3285816 3279024
56120 3279024 3255184 3221447 3183702 3141513 3091392 3030626 2954940 2857390 2734462 2590682 2434291
$$ packed form
56202H74601k8256k6082k4874k2373j9224j7358j6087j3744j1401j0840j0663
56191F73699q582n841n119n735n185l765l371l413k268j117j932l321k708j070
56177F20272j013j843j085P16J272J145K518M761N682N732O660P634P059O443
56163F65953P971J0135J0353R952J1699J4412J5107J4581J5672J7836J8769J9629
56151H32069K3153K8211L1671L4208L8900M5597N2146N9565P0462Q3802R6833
56140A396617J10500J27161J44505J57474J64664J67037J62374J47706J26068
56131B704106J04477Q6284P1308O1412N8666N9037N4974M4057K9261J2234o792
56120C279024k3840l3737l7745m2189n0121o0766p5686r7550j22928j43780j56391
$$ plain form
56109 2434291 2271852 2109834 1956708 1818862 1697186 1590835 1500894 1427255 1365979 1313553
56099 1313553 1270329 1236522 1208843 1184623 1165276 1151968 1141830 1132228 1124714 1120914 1118604 1115874
56087 1115874 1115000 1117947 1122068 1124528 1127006 1131845 1137630 1142847 1149673 1159608 1169572 1177023 1184828 1196360
56073 1196360 1209904 1222653 1236070 1252378 1269906 1286859 1305523 1327824 1350882 1371960 1393405
56062 1393405 1417644 1441810 1462678 1482388 1503782 1524613 1541908 1557509 1573655 1587857 1597998
56051 1597998 1607725 1620795 1634935 1647286 1660652 1677927 1695711 1710443 1725632 1745783 1768270
56040 1768270 1788698 1809245 1834008 1861122 1887421 1915980 1950894 1989388 2027341 2067748 2115224
56029 2115224 2166919 2217540 2268669 2324362 2382309 2438305 2494728 2555553 2617856 2677413 2737649
$$ packed form
56109B434291j62439j62018j53126j37846j21676j06351q9941p3639o1276n2426
56099A313553m3224l3807k7679k4220j9347j3308j0138r602p514l800k310k730
56087A115874q74K947M121K460K478M839N785N217O826R935R964P451P805J1532
56073A196360J3544J2749J3417J6308J7528J6953J8664K2301K3058K1078K1445
56062A393405K4239K4166K0868J9710K1394K0831J7295J5601J6146J4202J0141
56051A597998R727J3070J4140J2351J3366J7275J7784J4732J5189K0151K2487
56040A768270K0428K0547K4763K7114K6299K8559L4914L8494L7953M0407M7476
56029B115224N1695N0621N1129N5693N7947N5996N6423O0825O2303N9557O0236
$$ plain form
56018 2737649 2803606 2872334 2939102 3007630 3083884 3165109 3245680 3328450 3419313 3515874 3612779
56007 3612779 3712786 3821068 3934260 4047140 4164424 4293530 4431507 4571888 4718333
55998 4718333 4878022 5047772 5220709 5400489 5594382 5798833 6007085 6224476 6460335
55989 6460335 6711607 6971195 7245371 7545287 7868496 8207471 8569117 8966376 9397947
55980 9397947 9856757 10350625 10892964 11481350 12108383 12785238 13530113 14342929 15218343
55971 15218343 16174396 17239716 18422571 19724061 21171905 22807823 24653284 26726104
55963 26726104 29081059 31795588 34930897 38556497 42804029 47850988 53872052 61068059
55955 61068059 69723545 80164153 92684357 107619031 125481764 146940556 172689660
$$ packed form
56018B737649O5957O8728O6768O8528P6254Q1225Q0571Q2770R0863R6561R6905
56007C612779J00007J08282J13192J12880J17284J29106J37977J40381J46445
55998D718333J59689J69750J72937J79780J93893K04451K08252K17391K35859
55989F460335K51272K59588K74176K99916L23209L38975L61646L97259M31571
55980I397947M58810M93868N42339N88386O27033O76855P44875Q12816Q75414
55971A5218343R56053J065320J182855J301490J447844J635918J845461K072820
55963B6726104K354955K714529L135309L625600M247532N046959O021064P196007
55955F1068059Q655486J0440608J2520204J4934674J7862733K1458792K5749104
$$ plain form
55948 172689660 203428263 239670645 280799449 323647840 362126925 389047881 399233978
55941 399233978 391634452 369116448 336650597 299419052 261644791 226108275 194176933
55934 194176933 166218287 142109474 121541176 104110702 89387161 76990370 66596488
55927 66596488 57890537 50571260 44399440 39195816 34795183 31041833 27822598 25062189
55919 25062189 22685158 20613744 18797507 17210454 15819210 14582108 13476189 12495841
55911 12495841 11625420 10838637 10123046 9479893 8900453 8365683 7868400 7413574 6997181
55902 6997181 6605757 6236510 5897679 5588879 5299843 5028391 4781177 4556484 4343847
55893 4343847 4141279 3956203 3788884 3630942 3480790 3344946 3223147 3106867 2993341
$$ packed form
55948A72689660L0738603L6242382M1128804M2848391L8479085K6920956J0186097
55941C99233978p599526k2518004l2465851l7231545l7774261l5536516l1931342
55934A94176933k7958646k4108813k0568298j7430474j4723541j2396791j0393882
55927F6596488q705951p319277o171820n203624m400633l753350l219235k760409
55919B5062189k377031k071414j816237j587053j391244j237102j105919r80348
55911A2495841q70421p86783p15591o43153n79440n34770m97283m54826m16393
55902F997181l91424l69247l38831l08800k89036k71452k47214k24693k12637
55893D343847k02568j85076j67319j57942j50152j35844j21799j16280j13526
$$ plain form
55884 2993341 2887099 2787075 2686120 2584157 2488510 2400411 2314021 2229377 2153345 2086652
55874 2086652 2022390 1958521 1899932 1846893 1793287 1737766 1685578 1637919 1590247 1542329 1499298
55863 1499298 1461523 1423909 1386483 1355106 1330193 1305016 1277112 1251353 1229659 1207414 1182516
55852 1182516 1158792 1137801 1115734 1090872 1066149 1042250 1015972 987307 960513 936486 911608
55841 911608 885691 863320 845647 828448 810090 793991 781291 768451 754092 741223 730721
55830 730721 719433 706648 695806 687880 679559 669796 661763 656506 650881 643504 636643 630620 622525
55817 622525 612129 603066 596594 590119 583245 579082 577965 576138 572526 570800 572876 576218 579389 584396
55803 584396 591656 598374 603912 611171 620674 628808 633752 637574 640576 639320 632551 623602 614630 603729
$$ packed form
55884B993341j06242j00024j00955j01963r5647q8099q6390q4644p6032o6693
55874B086652o4262o3869n8589n3039n3606n5521n2188m7659m7672m7918m3031
55863A499298l7775l7614l7426l1377k4913k5177k7904k5759k1694k2245k4898
55852A182516k3724k0991k2067k4862k4723k3899k6278k8665k6794k4027k4878
55841I11608k5917k2371j7673j7199j8358j6099j2700j2840j4359j2869j0502
55830G30721j1288j2785j0842p926q321r763q033n257n625p377o861o023q095
55817F22525j0396r063o472o475o874m163j117j827l612j726K076L342L171N007
55803E84396P260O718N538P259R503Q134M944L822L002j256o769q949q972j0901
$$ plain form
55789 603729 590019 576347 564543 553007 541331 532328 526998 522182 515432 507626 498790 486470 470725
55776 470725 455909 444906 435969 427580 421684 419502 418719 417655 418089 421232 424878 427109 428987 431127
55762 431127 431478 428893 425163 421221 415114 405943 396022 386955 377434 366998 357840 350640 342694 332724
55748 332724 323485 316989 311145 303960 297182 292740 289148 284549 280075 277127 274374 270357 266209 263050
55734 263050 259586 254926 251020 249624 249499 248998 248708 249174 248843 246690 244169 242293 239598 235266 231285
55719 231285 229116 227148 223964 221186 220336 219769 217591 215085 214318 214677 214566 214408 215230 216354 216998 218229
55703 218229 220865 223381 224166 223929 223761 222908 220617 218079 216380 214593 211990 210022 209936 210597 210814 211670
55687 211670 214332 217705 220512 223676 228369 233736 238673 243899 250134 256341 261887 268220 276134 283481
$$ packed form
55789F03729j3710j3672j1804j1536j1676r003n330m816o750p806q836j2320j5745
55776D70725j4816j1003q937q389n896k182p83j064M34L143L646K231J878K140
55762D31127L51k585l730l942o107r171r921r067r521j0436r158p200p946r970
55748C32724r239o496n844p185o778m442l592m599m474k948k753m017m148l159
55734B63050l464m660l906j396j25n01k90M66l31k153k521j876k695m332l981
55719B31285k169j968l184k778q50n67k178k506p67L59j11j58Q22J124O44J231
55703B18229K636K516P85k37j68q53k291k538j699j787k603j968q6O61K17Q56
55687B11670K662L373K807L164M693N367M937N226O235O207N546O333P914P347
$$ plain form
55673 283481 288009 290460 292592 294212 294615 294912 296262 297537 297276 296382 296522 297490 298486 300245 303389 306254
55657 306254 306893 305944 305165 304483 302798 300411 298316 296171 293017 288962 284390 278729 271727 264551 257986
55642 257986 251108 243408 236399 231183 226226 219666 212203 205646 200237 195464 191830 189646 187591 184617
55628 184617 181733 179961 178285 175796 174009 174504 175904 175765 174116 172641 171707 170687 169971 170082 169861 167935
55612 167935 164989 162405 159811 156312 152946 151362 150984 149917 147875 145979 144453 142763 141290 140703 140354
55597 140354 139266 137985 137555 137535 136908 136019 135737 135615 134831 133951 133883 134038 133441 132637 132626 133038 133289 134303 137007
55578 137007 140220 142229 143429 145324 147988 150618 153492 157103 160454 162490 164284 167489 171565 174788
55564 174788 177023 179173 180799 180715 179206 177384 175123 171875 168646 166773 165586 163616 161285 160005 159484
$$ packed form
55673B83481M528K451K132J620M03K97J350J275k61q94J40R68R96J759L144K865
55657C06254O39r49p79o82j685k387k095k145l154m055m572n661p002p176o565
55642B57986o878p700p009n216m957o560p463o557n409m773l634k184k055k974
55628A84617k884j772j676k489j787M95J400j39j649j475r34j020p16J11k21j926
55612A67935k946k584k594l499l366j584l78j067k042j896j526j690j473n87l49
55597A40354j088j281m30k0o27q89k82j22p84q80o8J55n97q04j1M12K51J014K704
55578A37007L213K009J200J895K664K630K874L611L351K036J794L205M076L223
55564A74788K235K150J626q4j509j822k261l248l229j873j187j970k331j280n21
$$ plain form
55549 159484 158512 157619 158324 160364 162325 164433 167973 172381 175709 177750 180068 183075 185653 187582 189779
55534 189779 192092 193322 193564 194266 195821 197172 197732 197626 196233 192747 188023 183669 179475 174055 167770
55519 167770 162503 158616 154673 150293 146681 144036 141026 137313 134202 132147 129912 126964 124537 123517
55505 123517 123155 122618 122066 121463 120030 117620 115187 113343 111802 110649 110640 111783 113060 113965 115020 116413
55489 116413 117471 117764 117554 116970 115904 114735 113989 113357 112322 111417 111459 111919 111668 111026 111260 112360 113207
55472 113207 113793 115178 117212 118413 118330 118065 118172 117983 117401 117399 118145 118377 117291 115514 113784 112126 110724
55455 110724 110097 109968 109381 108255 107517 107510 107725 108117 109085 110019 109618 107932 106422 105714 105006 103988 103553 104096
55437 104096 104778 105022 105246 105677 105950 106342 107780 110110 111856 112288 112283 112677 113162 113318 113348 113223 112442 111128
$$ packed form
55549A59484r72q93P05K040J961K108L540M408L328K041K318L007K578J929K197
55534A89779K313J230K42P02J555J351N60j06j393l486m724m354m194n420o285
55519A67770n267l887l943m380l612k645l010l713l111k055k235k948k427j020
55505A23517l62n37n52o03j433k410k433j844j541j153rJ143J277R05J055J393
55489A16413J058K93k10n84j066j169p46o32j035r05M2M60k51o42K34J100Q47
55472A13207N86J385K034J201q3k65J07j89n82kP46K32j086j777j730j658j402
55455A10724o27j29n87j126p38pK15L92R68R34m01j686j510p08p08j018m35N43
55437A04096O82K44K24M31K73L92J438K330J746M32nL94M85J56L0j25p81j314
$$ plain form
55419 111128 110145 109769 109462 109199 109649 110797 111849 112779 114463 116927 118948 119760 119756 119266 118173 117038 116896
55402 116896 117496 117290 115649 113603 112004 110649 109618 109686 110733 111427 111238 111205 111958 112616 112500 112461 113434 114933
55384 114933 115951 116301 116290 116039 115740 115630 115280 114003 112251 111314 111321 110993 109802 108857 109090 110033 110988 111942
55366 111942 112659 112315 110810 109125 107722 105912 103403 101056 99476 98305 97536 97984 99620 100918 100805
55351 100805 99954 99344 98887 98278 97836 97637 97151 96590 97196 99285 101372 102237 102469 102984 103419 103173 102768 102832
55333 102832 102843 102148 101291 101149 101575 101959 102297 102791 103185 103413 104054 105334 106523 107032 107189 107270 106880 106068 105840
55314 105840 106645 107446 107227 106317 105351 104121 102510 101419 101541 102217 102576 102929 103917 105223 106279 107317 108576
55297 108576 109288 108698 107446 106789 107022 107642 108428 109397 110274 110959 111932 113421 114803 115572 116167 117030 117624 117264
$$ packed form
55419A11128r83l76l07k63M50J148J052R30J684K464K021Q12mm90j093j135j42
55402A16896O00k06j641k046j599j355j031O8J047O94j89l3P53O58j16l9R73J499
55384A14933J018L50j1k51k99j10l50j277j752r37Pl28j191r45K33R43R55R54
55366A11942P17l44j505j685j403j810k509k347j580j171p69M48J636J298j13
55351A00805q51o10m57o09m42j99m86n61O06K089K087Q65K32N15M35k46m05O4
55333A02832J1o95q57j42M26L84L38M94L94K28O41J280J189N09J57Q1l90q12k28
55314A05840Q05Q01k19r10r66j230j611j091J22O76L59L53R88J306J056J038J259
55297A08576P12n90j252o57K33O20P86R69Q77O85R73J489J382P69N95Q63N94l60
$$ plain form
55279 117264 116210 115186 114478 114192 114577 115330 115421 114346 112782 111417 110130 108958 108646 109301 109732 109185 108685
55262 108685 109525 111395 113150 114456 115519 116113 116136 116310 117085 117641 117164 116297 116089 116266 115882 114993 114327 113862
55244 113862 113064 112102 111569 111330 110789 109943 109157 108310 107171 106208 106034 106497 107117 107937 109034 109842 109848 109396 108937
55225 108937 108181 106916 105858 105637 105734 105503 105428 106175 107191 107581 107659 108243 109062 109341 109405 110122 111169 111425 110866
55206 110866 110569 110910 111183 111019 110853 110960 111160 111490 112096 112496 112082 111303 111254 112041 112650 112504 112137 112160 112540
55187 112540 113096 113876 114781 115410 115524 115215 114661 114065 113724 113734 113837 113831 113789 113592 112856 111696 110864 110622 110339 109788
55167 109788 109885 111261 113074 114292 115235 116599 117767 117589 116347 115464 115544 116012 116430 116831 116926 116246 115097
55150 115097 114313 114084 113954 113775 113686 113436 112748 112151 112411 113381 114376 115359 116656 117892 118400 118412 118612 118799 118316
$$ packed form
55279A17264j054j024p08k86L85P53R1j075j564j365j287j172l12O55M31n47n00
55262A08685Q40J870J755J306J063N94K3J74P75N56m77q67k08J77l84q89o66m65
55244A13862p98r62n33k39n41q46p86q47j139r63j74M63O20Q20J097Q08Om52m59
55225A08937p56j265j058k21R7k31p5P47J016L90P8N84Q19K79O4P17J047K56n59
55206A10866k97L41K73j64j66J07K00L30O06M00m14p79m9P87O09j46l67K3L80
55187A12540N56P80R05O29J14l09n54n96l41J0J03om2j97p36j160q32k42k83n51
55167A09788R7J376J813J218R43J364J168j78j242q83Q0M68M18M01R5o80j149
55150A15097p84k29j30j79q9k50o88n97K60R70R95R83J297J236N08J2K00J87m83
$$ plain form
55131 118316 117587 117761 118834 119576 119485 119413 119937 120404 120098 119303 118708 118539 118672 118913 118905 118372 117599 117073 116673 115976
55111 115976 115255 115319 116294 117373 117905 117992 118012 118275 119142 120745 122541 123901 125042 126566 128209 128978 128586
55094 128586 127812 127324 127019 126719 126612 126733 126689 126227 125582 125026 124528 123979 123391 122873 122659 122992 123635 123845 123320
55075 123320 122806 123197 124404 125656 126471 126724 126320 125591 125452 126270 127108 127040 126645 127037 127958 128200 127608 127237
55057 127237 127576 128009 128125 128252 128437 128127 127255 126623 126796 127382 127725 127623 127147 126433 125817 125593 125588 125493 125435 125655
55037 125655 125855 125673 125536 126160 127411 128534 129289 129912 130189 129679 128731 128177 127997 127336 125885 124235 122812
55020 122812 121464 120223 119544 119596 120111 120917 121903 122611 122710 122676 123094 123603 123611 123704 124984 127179 128823 129398 129930
55001 129930 131266 133085 134893 136695 138321 139261 139611 140193 141353 142573 143478 144269 144985 145336 145454 145729
$$ packed form
55131A18316p29J74J073P42r1p2N24M67l06p95n95j69J33K41qn33p73n26m00o97
55111A15976p21O4R75J079N32Q7K0K63Q67J603J796J360J141J524J643P69l92
55094A28586p74m88l05l00j07J21m4m62o45n56m98n49n88n18k14L33O43K10n25
55075A23320n14L91J207J252Q15K53m04p29j39Q18Q38o8l95L92R21K42n92l71
55057A27237L39M33J16J27J85l10q72o32J73N86L43j02m76p14o16k24nr5n8K20
55037A25655K00j82j37O24J251J123P55O23K77n10r48n54j80o61j451j650j423
55020A22812j348j241o79N2N15Q06R86P08R9l4M18N09QR3J280K195J644N75N32
55001A29930J336J819J808J802J626R40L50N82J160J220R05P91P16L51J18K75
$$ plain form
54985 145729 145801 144899 143367 142595 143087 143807 143864 143614 143560 143339 142522 141492 140827 140521 140277 139955 139408 138627 138210
54966 138210 138832 140099 140900 141090 141776 143651 146096 148204 149626 150116 149426 148127 147437 147751 148235 148244 148103
54949 148103 148132 148044 147735 147552 147336 146352 144703 143567 143525 143850 144060 144823 146485 148066 148785 149467 151268 153954
54931 153954 156616 159287 162601 166496 170404 174408 179166 184985 191793 199715 208965 219511 231410 244973
54917 244973 259857 274360 286396 294922 299901 301326 298989 293013 284026 272836 260278 247188 234270
54904 234270 222133 211486 202825 195890 189916 184516 179833 175901 172577 170023 168393 167045 165130 163108
54890 163108 162507 163838 165879 167504 169178 172004 176243 181454 187298 193584 200197 207448 215856 225248
54876 225248 234928 244871 255689 267047 277297 285151 290461 292861 291151 284982 275877 265528 254184
$$ packed form
54985A45729P2r02j532p72M92P20N7k50n4k21q17j030o65l06k44l22n47p81m17
54966A38210O22J267Q01J90O86J875K445K108J422M90o90j299o90L14M84Rj41
54949A48103K9q8l09j83k16r84j649j136m2L25K10P63J662J581P19O82J801K686
54931A53954K662K671L314L895L908M004M758N819O808P922R250J0546J1899J3563
54917B44973J4884J4503J2036Q526M979J425k337n976q987j1190j2558j3090j2918
54904B34270j2137j0647q661o935n974n400m683l932l324k554j630j348j915k022
54890A63108o01J331K041J625J674K826M239N211N844O286O613P251Q408R392
54876B25248R680R943J0818J1358J0250P854N310K400j710o169r105j0349j1344
$$ plain form
54863 254184 241787 229474 218594 209049 200004 191591 184603 179001 173936 168996 164423 160456 157283
54850 157283 155221 154087 152889 150927 148678 146833 145144 143110 141184 140149 139783 139210 138266 137541 137339
54835 137339 137462 137792 138274 138629 138740 138936 139273 139048 137810 136281 135425 135119 134608 133814 133249 133077 133190 133745
54817 133745 134682 135129 134351 132990 132336 132652 133192 133658 134562 136212 138266 140339 142241 143643 144215 144103 143733
54800 143733 143276 142842 142899 143819 145264 146657 147949 149272 150184 150064 149054 147938 147262 147162 147754 148986 150369
54783 150369 151466 152407 153391 154166 154643 155529 157483 160032 162252 164257 167140 171590 177365 184004 191298
54768 191298 199195 207890 217935 229733 243040 257298 271937 285816 297036 304165 307250 306919 303072
54755 303072 295431 284850 272932 260576 247884 235278 223586 213091 203468 194751 187517 182078
$$ packed form
54863B54184j2397j2313j0880r545r045q413o988n602n065m940m573l967l173
54850A57283k062j134j198j962k249j845j689k034j926j035l66n73r44p25k02
54835A37339J23L30M82L55J11J96L37k25j238j529q56l06n11p94n65j72J13N55
54817A33745R37M47p78j361o54L16N40M66R04J650K054K073J902J402N72j12l70
54800A43733m57m34N7R20J445J393J292J323R12j20j010j116o76j00N92J232J383
54783A50369J097R41R84P75M77Q86J954K549K220K005K883M450N775O639P294
54768A91298P897Q695J0045J1798J3307J4258J4639J3879J1220P129L085l31l847
54755C03072p641j0581j1918j2356j2692j2606j1692j0495r623q717p234n439
$$ plain form
54743 182078 178152 175334 173261 171464 169720 168413 167931 167952 167934 167970 168456 169334 170474 172442 175897 180502
54727 180502 185422 190705 197167 205030 213723 223055 233554 245403 257757 269281 278811 285545 289228
54714 289228 290149 288455 283633 275260 264113 251909 240110 229387 219794 210827 201767 192778 185211
54701 185211 180001 176320 172768 169378 167199 166294 165498 164073 162327 160550 158576 156580 155183 154483 153801
54686 153801 152568 150790 148619 146301 144467 143637 143482 143263 142871 142589 142235 141519 140969 141301 142082 142252 141825
54669 141825 141675 141764 141066 139451 138098 137678 137533 137146 136999 137360 137504 136940 136353 136494 137053 137438 137895 139005
54651 139005 140688 142336 143441 143554 142266 139860 137497 136210 136075 136706 138011 140000 142274 144201 145332
54636 145332 145523 145050 144654 144920 145472 145370 144421 143405 142909 142713 142566 142703 143199 143516 143207 142521 141904 141409
$$ packed form
54743A82078l926k818k073j797j744j307m82K1j8L6M86Q78J140J968L455M605
54727A80502M920N283O462P863Q693R332J0499J1849J2354J1524R530O734L683
54714B89228R21j694m822q373j1147j2204j1799j0723r593q967r060q989p567
54701A85211n210l681l552l390k179r05p96j425j746j777j974j996j397p00o82
54686A53801j233j778k171k318j834q30j55k19l92k82l54p16n50L32P81J70m27
54669A41825j50Q9o98j615j353m20j45l87j47L61J44n64n87J41N59L85M57J110
54651A39005J683J648J105J13j288k406k363j287j35O31J305J989K274J927J131
54636A45332J91m73l96K66N52j02r49j016m96j96j47J37M96L17l09o86o17m95
$$ plain form
54618 141409 140922 140483 140110 139774 139765 140563 142098 143681 144798 145445 145577 144984 143950 143282 143294 143374 142933 142222 141887
54599 141887 142199 143045 144179 145198 145731 145889 146092 146341 146191 145595 145200 145628 146869 148435 149593 149608 148454
54582 148454 147243 147105 147715 147793 147036 146427 146480 146439 145651 144617 144106 144176 144645 145563 146561 146692 145750 145020 145855
54563 145855 148036 150245 151612 152161 152235 152195 152316 152413 151937 150843 149877 149528 149341 148809 148316 148487 149122 149571
54545 149571 149776 150212 150991 151756 152271 152595 152846 153299 154549 156953 159953 162372 163407 163157 162281 161416 160801
54528 160801 160267 159568 158688 157709 156565 155320 154475 154464 154932 155151 155132 155566 156599 157494 157718 157566 157415 157142
54510 157142 156626 156102 155578 154666 153435 152658 152691 152815 152317 151650 151827 153145 155124 157275 159266 160663 161142
54493 161142 160866 160278 159649 159100 158771 158747 159054 159777 160804 161564 161604 161439 161991 163139 163781 163560 163455 164146 164894
$$ packed form
54618A41409m87m39l73l36rP98J535J583J117O47J32n93j034o68J2Q0m41p11l35
54599A41887L12Q46J134J019N33J58K03K49j50n96l95M28J241J566J158J5j154
54582A48454j211j38O10P8p57o09N3m1p88j034n11P0M69R18R98J31r42p30Q35
54563A45855K181K209J367N49P4m0J21R7m76j094r66l49j87n32m93J71O35M49
54545A49571K05M36P79P65N15L24K51M53J250K404L000K419J035k50q76q65o15
54528A60801n34o99q80r79j144j245q45j1M68K19j9M34J033Q95K24j52j51k73
54510A57142n16n24n24r12j231p77L3J24m98o67J77J318J979K151J991J397M79
54493A61142k76n88o29n49l29k4L07P23J027P60M0j65N52J148O42k21j05O91P48
$$ plain form
54474 164894 164821 164408 164785 166143 167780 169204 170376 171205 171637 172009 172684 173502 174068 174273 174159 173680 173001 172566
54456 172566 172428 172015 171047 170133 169894 170055 170007 169772 169702 169633 169078 168010 166919 166229 166045 166199 166219 165683 164832
54437 164832 164323 164146 163537 162321 161479 161758 162529 162769 162435 162103 161881 161552 161281 161321 161504 161755 162535 163960
54419 163960 165107 165166 164818 165386 166930 168194 168258 167365 166282 165705 166205 167923 170272 172423 173938 174607 174219
54402 174219 173149 172573 173259 174551 175322 175458 175564 175790 175982 176556 178014 179828 180915 181124 181245 181686 182158
54385 182158 182514 182834 182791 182001 181010 180788 181222 181178 180190 178981 178149 177474 176826 176664 177121 177528 177448 177437 178247 179887
54365 179887 181979 184418 187106 189520 191116 191958 192494 192927 193117 193013 192907 193297 194470 196076 197277 197571
54349 197571 197363 197426 197983 198766 199758 201309 203465 205724 207603 209189 211033 213677 217120 220564 222992 224270
$$ packed form
54474A64894p3m13L77J358J637J424J172Q29M32L72O75Q18N66K05j14m79o79m35
54456A72566j38m13r68r14k39J61m8k35p0o9n55j068j091o90j84J54K0n36q51
54437A64832n09j77o09j216q42K79P71K40l34l32k22l29k71M0J83K51P80J425
54419A63960J147N9l48N68J544J264O4q93j083n77N00J718K349K151J515O69l88
54402A74219j070n76O86J292P71J36J06K26J92N74J458J814J087K09J21M41M72
54385A82158L56L20m3p90r91k22M34m4r88j209q32o75o48j62M57M07q0j1Q10J640
54365A79887K092K439K688K414J596Q42N36M33J90j04j06L90J173J606J201K94
54349A97571k08O3N57P83R92J551K156K259J879J586J844K644L443L444K428J278
$$ plain form
54333 224270 225230 226242 226296 224227 220506 216923 214656 213399 212240 210476 207629 203627 199249 195702 193498
54318 193498 192181 191173 190307 189557 188913 188626 188975 189657 189984 189692 189051 188218 187164 186232 186024 186595 187391 188101
54300 188101 188893 189659 189772 188883 187413 186006 184946 184337 184338 184991 186165 187725 189386 190502 190561 189926 189482
54283 189482 189537 189679 189656 189641 189531 188851 187648 186724 186617 186949 187131 187136 187203 187335 187506 187898 188563 189263 189914 190744
54263 190744 191754 192476 192636 192614 192915 193559 194336 195243 196294 197191 197603 197609 197578 197782 198277 198968 199634 200094 200443
54244 200443 200895 201337 201361 200744 199578 197933 195839 193652 191936 190794 189771 188551 187368 186600 186390 186762
54228 186762 187569 188199 187905 186725 185593 185255 185554 186019 186545 187070 187145 186475 185563 185192 185461 185826 185923 185793 185447
54209 185447 184787 184107 184079 184949 186054 186514 186239 185970 186328 187158 187891 188229 188218 187879 187225 186607 186509 186838 186871 186238
$$ packed form
54333B24270R60J012N4k069l721l583k267j257j159j764k847m002m378l547k204
54318A93498j317j008q66p50o44k87L49O82L27k92o41q33j054r32k08N71P96P10
54300A88101P92P66J13q89j470j407j060o09JO53J174J560J661J116N9o35m44
54283A89482N5J42k3j5j10o80j203r24j07L32J82NO7J32J71L92O65P00O51Q30
54263A90744J010P22J60k2L01O44P77R07J051Q97M12Ol1K04M95O91O66M60L49
54244B00443M52M42K4o17j166j645k094k187j716j142j023j220j183p68k10L72
54228A86762Q07O30k94j180j132l38K99M65N26N25P5o70r12l71K69L65R7j30l46
54209A85447o60o80k8Q70J105M60k75k69L58Q30P33L38j1l39o54o18r8L29L3o33
$$ plain form
54189 186238 185571 185767 186866 188041 188552 188313 187710 187223 187118 187209 187012 186386 185776 185573 185543 185215 184555 183844 183198
54170 183198 182618 182221 182005 181707 181361 181612 182893 184632 185892 186554 187174 188002 188832 189581 190261 190599 190401 190069
54152 190069 189945 189439 187819 185685 184578 185005 185903 186215 186004 185769 185615 185523 185674 186119 186717 187576 188912 190350
54134 190350 191163 191335 191566 192021 192031 191419 191196 192319 194484 196669 198271 199149 199179 198411 197370 196734 196936 198169
54116 198169 200308 202645 204267 204980 205314 205510 205160 204104 202926 202187 201849 201831 202417 203621 204757 205196 205052
54099 205052 204688 204093 203225 202474 202285 202662 203402 204419 205495 206237 206599 206958 207434 207706 207823 208471 210033 212033
54081 212033 213997 216131 218611 220888 222427 223591 225065 226833 228383 229596 230714 231767 232610 233277 233742
54066 233742 233657 232883 232038 231949 232764 234009 235316 236620 237946 239476 241614 244524 247808 251055 254558 259114
$$ packed form
54189A86238o67J96J099J175N11k39o03m87j05R1j97o26o10k03l0l28o60p11o46
54170A83198n80l97k16k98l46K51J281J739J260O62O20Q28Q30P49O80L38j98l32
54152A90069j24n06j620k134j107M27Q98L12k11k35j54r2J51M45N98Q59J336J438
54134A90350Q13J72K31M55J0o12k23J123K165K185J602Q78L0p68j041o36K02J233
54116A98169K139K337J622P13L34J96l50j056j178p39l38j8N86J204J136M39j44
54099B05052l64n95q68p51j89L77P40J017J076P42L62L59M76K72J17O48J562K000
54081B12033J964K134K480K277J539J164J474J768J550J213J118J053Q43O67M65
54066B33742q5p74q45q9Q15J245J307J304J326J530K138K910L284L247L503M556
$$ plain form
54050 259114 265253 272961 281995 292338 304476 319259 337018 356635 375859 392639 405773 414444
54038 414444 418121 417286 413517 408355 402671 397350 393634 392142 392227 392928 393933 395114 395892 395884 395552 395482 395515
54021 395515 395267 394910 394675 394137 392751 390559 387627 383381 377433 370496 363538 356432 348475 339849 331503
54006 331503 323846 316512 309303 302410 295927 289997 285175 281709 278736 275249 271672 269371 268694 268636 268373
53991 268373 267885 266982 265105 262545 260581 259782 259189 257936 256695 256564 257188 257130 255827 254202 253278 252978 252535
53974 252535 251565 250358 249393 248931 249040 249713 250727 251625 252093 252333 252771 253394 253742 253638 253457 253539 253755 253989
53956 253989 254588 255908 257732 259592 261394 263327 265444 267787 270690 274433 278709 282838 286460 289740
53942 289740 293054 296701 300710 304757 308655 313077 319235 327479 336765 345938 354926 364197 373801 383765
$$ packed form
54050B59114O139P708R034J0343J2138J4783J7759J9617J9224J6780J3134Q671
54038D14444L677q35l769n162n684n321l716j492Q5P01J005J181P78ql32p0L3
54021C95515k48l57k35n38j386k192k932m246n948o937o958p106p957q626q346
54006C31503p657p334p209o893o483n930m822l466k973l487l577k301o77n8k63
53991B68373m88r03j877k560j964p99n93j253j241j31O24n8j303j625r24l00m43
53974B52535r70j207r65m62J09O73J014Q98M68K40M38O23L48j04j81Q2K16K34
53956B53989N99J320J824J860J802J933K117K343K903L743M276M129L622L280
53942B89740L314L647M009M047L898M422O158Q244R286R173Q988R271R604R964
$$ plain form
53928 383765 394708 406989 419589 430899 440497 449198 457505 464935 470941 475649 479627 483628 488521
53915 488521 494741 501747 508685 515490 522674 530112 536862 542151 545767 547486 547021 544756 541766 538844
53901 538844 536044 533226 530387 527396 524080 520749 518036 516120 514713 513810 513720 514137 513846 511505 506216
53886 506216 497386 484912 469730 453481 437375 421863 407444 394869 384267 374795 365618 356714
53874 356714 348489 341154 334710 328970 323367 317328 311073 305377 300404 295463 290205 285261 281300 278211
53860 278211 275628 273562 271927 270143 267903 265783 264409 263435 262055 260166 258332 256812 255350 253863
53846 253863 252729 252307 252595 253375 254361 255183 255492 255195 254464 253605 252972 252853 253288 254062 254902 255578 255874 255746
53828 255746 255528 255636 256025 256232 256084 255989 256502 257919 260285 263304 266120 267841 268609 269678 272043 275365
$$ packed form
53928C83765J0943J2281J2600J1310R598Q701Q307P430O006M708L978M001M893
53915D88521O220P006O938O805P184P438O750N289L616J719m65k265k990k922
53901E38844k800k818k839k991l316l331k713j916j407r03r0M17k91k341n289
53886E06216q830j2474j5182j6249j6106j5512j4419j2575j0602r472r177q904
53874C56714q225p335o444n740n603o039o255n696m973m941n258m944l961l089
53860B78211k583k066j635j784k240k120j374r74j380j889j834j520j462j487
53846B53863j134m22K88P80R86Q22L09k97p31q59o33j19M35P74Q40O76K96j28
53828B55746k18J08L89K07j48r5N13J417K366L019K816J721P68J069K365L322
$$ plain form
53812 275365 278660 281679 285074 289431 294708 300598 306906 313426 319807 325849 331810 338192 345178 352460
53798 352460 359721 367049 374511 381421 386611 389725 391765 393967 396540 399009 401338 403949 406793 409139
53784 409139 410300 409999 408058 404395 399343 393391 386547 378586 369914 361465 353618 345925 338078 330466
53770 330466 323498 317032 310766 304704 299000 293844 289642 286728 284685 282563 279957 277283 274855 272448
53756 272448 270001 267920 266289 264572 262519 260590 258960 256964 254271 251904 251189 252076 253252 253575 252768
53741 252768 251156 249484 248695 249111 249992 250444 250512 250767 251187 251266 251044 251220 252236 253885 255819 257835 259652
53724 259652 261024 262136 263410 264882 266257 267527 269043 270882 272653 274028 275050 275849 276494 277164 278027
53709 278027 278852 279174 279093 279485 281113 283728 286374 288461 290248 292265 294505 296478 298108 300286 304148
$$ packed form
53812B75365L295L019L395M357N277N890O308O520O381O042N961O382O986P282
53798C52460P261P328P462O910N190L114K040K202K573K469K329K611K844K346
53784D09139J161l01j941l663n052n952o844p961q672q449p847p693p847p612
53770C30466o968o466o266o062n704n156m202k914k043k122k606k674k428k407
53756B72448k447k081j631j717k053j929j630j996k693k367p15Q87J176L23q07
53741B52768j612j672p89M16Q81M52O8K55M20P9k22J76J016J649J934K016J817
53724B59652J372J112J274J472J375J270J516J839J771J375J022P99O45O70Q63
53709B78027Q25L22q1L92J628K615K646K087J787K017K240J973J630K178L862
$$ plain form
53694 304148 309712 315574 320182 323194 325407 327601 329845 331736 332875 333077 332524 331850 331805 332584 333605 334158
53678 334158 334244 334561 335535 336631 336942 336433 336117 336742 337742 337952 337064 335800 334829 334232 334022 334424 335334 336091
53660 336091 336147 335593 334792 333911 333002 332076 330887 329156 327263 326153 326210 326754 327040 327125 327327 327444 327214 327053
53642 327053 327552 328596 329676 330796 332308 334108 335798 337503 339611 341676 342497 341632 340231 339957 341422
53627 341422 343873 346043 347161 347499 348119 349881 352603 355429 357931 360456 363379 366597 369971 373744 378149
53612 378149 382870 387357 391524 395770 400327 404880 408945 412494 416022 419986 424308 428516 432301 435700
53598 435700 438659 440732 441512 441311 441093 441648 442980 444471 445532 446070 446499 447383 449020 451343 454210 457702
53582 457702 461950 466613 470695 473090 473495 472650 471473 470004 467497 463608 459014 454562 450247 445633 440999
$$ packed form
53694C04148N564N862M608L012K213K194K244J891J139K02n53o74m5P79J021N53
53678C34158Q6L17R74J096L11n09l16O25J000K10q88j264r71n97k10M02R10P57
53660C36091N6n54q01q81r09r26j189j731j893j110N7N44K86Q5K02J17k30j61
53642C27053M99J044J080J120J512J800J690J705K108K065Q21q65j401k74J465
53627C41422K451K170J118L38O20J762K722K826K502K525K923L218L374L773M405
53612C78149M721M487M167M246M557M553M065L549L528L964M322M208L785L399
53598D35700K959K073P80k01k18N55J332J491J061N38M29Q84J637K323K867L492
53582D57702M248M663M082K395M05q45j177j469k507l889m594m452m315m614m634
$$ plain form
53567 440999 437288 434864 433017 430943 428676 426830 425976 426490 428497 431557 434777 437547 439819 441534 442407
53552 442407 442654 443273 444987 447280 449081 450068 450696 451264 451675 452011 452706 454101 456256 459182 462824 466850
53536 466850 470876 474925 479396 484593 490552 497188 504334 511819 519824 528975 539677 551474 563443
53523 563443 575095 586637 598584 611515 625875 641481 657381 672767 687940 703933 721336
53512 721336 740079 760248 782324 806492 832248 858913 886084 913471 940764 967800 994468
53501 994468 1020364 1045036 1068711 1092262 1116125 1139654 1161901 1182714 1202767 1222749 1242877
53490 1242877 1263083 1283324 1303695 1324343 1345276 1366193 1386656 1406493 1425966 1445494 1465317
53479 1465317 1485421 1505590 1525470 1544620 1562553 1578686 1592417 1603498 1612327 1619524 1625147 1628525
$$ packed form
53567D40999l711k424j847k074k267j846q54N14K007L060L220K770K272J715Q73
53552D42407K47O19J714K293J801R87O28N68M11L36O95J395K155K926L642M026
53536D66850M026M049M471N197N959O636P146P485Q005R151J0702J1797J1969
53523E63443J1652J1542J1947J2931J4360J5606J5900J5386J5173J5993J7403
53512G21336J8743K0169K2076K4168K5756K6665K7171K7387K7293K7036K6668
53501I94468K5896K4672K3675K3551K3863K3529K2247K0813K0053J9982K0128
53490A242877K0206K0241K0371K0648K0933K0917K0463J9837J9473J9528J9823
53479A465317K0104K0169J9880J9150J7933J6133J3731J1081Q829P197N623L378
$$ plain form
53467 1628525 1628969 1626388 1621084 1613215 1602801 1590289 1576767 1563482 1551150 1539755 1528841 1517749
53455 1517749 1505599 1491444 1474775 1455895 1435670 1414971 1394480 1374684 1355599 1336524 1316630
53444 1316630 1295989 1275725 1257037 1240409 1225862 1213567 1203937 1197341 1193833 1192758 1192534 1191375 1188662
53431 1188662 1185347 1182758 1181413 1181232 1182382 1185260 1189928 1196053 1203296 1211414 1220279 1230192 1241889 1255775
53417 1255775 1271393 1288039 1305596 1324248 1343698 1363385 1383405 1404597 1427691 1452853 1479955
53406 1479955 1508808 1539128 1570778 1604067 1639456 1677045 1716780 1758989 1804155 1852157 1902269
53395 1902269 1953926 2007022 2061430 2116821 2173062 2230318 2288506 2347000 2405024 2462093 2517998
53384 2517998 2572613 2625728 2676816 2725079 2770063 2812199 2852298 2890476 2925903 2957630 2985334
$$ packed form
53467A628525M44k581n304p869j0414j2512j3522j3285j2332j1395j0914j1092
53455A517749j2150j4155j6669j8880k0225k0699k0491j9796j9085j9075j9894
53444A316630k0641k0264j8688j6628j4547j2295r630o596l508j075k24j159k713
53431A188662l315k589j345j81J150K878M668O125P243Q118Q865R913J1697J3886
53417A255775J5618J6646J7557J8652J9450J9687K0020K1192K3094K5162K7102
53406A479955K8853L0320L1650L3289L5389L7589L9735M2209M5166M8002N0112
53395A902269N1657N3096N4408N5391N6241N7256N8188N8494N8024N7069N5905
53384B517998N4615N3115N1088M8263M4984M2136M0099L8178L5427L1727K7704
$$ plain form
53373 2985334 3009260 3029779 3047038 3060708 3069978 3073857 3071363 3061313 3042475 3014544 2978866 2937660
53361 2937660 2892629 2844675 2794602 2743280 2691122 2638161 2584841 2532214 2481266 2432554 2386531
53350 2386531 2343550 2303314 2264820 2227071 2189476 2151535 2112672 2072666 2031921 1991227 1951555
53339 1951555 1913971 1879172 1847024 1816992 1789049 1763652 1740931 1720646 1702958 1688400 1676717
53328 1676717 1666472 1656168 1645111 1632817 1618344 1600972 1581151 1560184 1539148 1518456 1498150
53317 1498150 1478163 1458576 1439949 1423171 1408697 1396236 1385424 1376339 1368994 1362768 1356890 1351219
53305 1351219 1346095 1341712 1338166 1335913 1335590 1337437 1341299 1347178 1355319 1365810 1378487 1393263 1410189
53292 1410189 1429193 1450095 1472935 1497873 1524582 1551941 1578575 1603679 1627334 1650118 1672440
$$ packed form
53373B985334K3926K0519J7259J3670R270L879k494j0050j8838k7931l5678m1206
53361B937660m5031m7954n0073n1322n2158n2961n3320n2627n0948m8712m6023
53350B386531m2981m0236l8494l7749l7595l7941l8863m0006m0745m0694l9672
53339A951555l7584l4799l2148l0032k7943k5397k2721k0285j7688j4558j1683
53328A676717j0245j0304j1057j2294j4473j7372j9821k0967k1036k0692k0306
53317A498150j9987j9587j8627j6778j4474j2461j0812r085p345o226n878n671
53305A351219n124m383l546k253l23J847L862N879Q141J0491J2677J4776J6926
53292A410189J9004K0902K2840K4938K6709K7359K6634K5104K3655K2784K2322
$$ plain form
53281 1672440 1694114 1714424 1732623 1748385 1761776 1772757 1780869 1785567 1786861 1785368 1781550 1775127
53269 1775127 1765583 1753047 1738152 1721003 1700998 1678002 1653051 1627334 1600987 1573562 1545320
53258 1545320 1517220 1489745 1462536 1435208 1407839 1380652 1353893 1328155 1304097 1281619 1259847
53247 1259847 1238084 1216221 1194140 1171481 1148292 1125249 1102857 1080971 1059455 1038699 1019061
53236 1019061 1000357 982431 965809 951176 938473 927008 916302 906391 897425 889313 881638 873681
53224 873681 864694 854351 842785 830108 816124 800661 783798 765652 746328 726222 705975 685921
53212 685921 666092 646985 629754 615149 602712 591425 580764 570643 560767 550678 540222 529365
53200 529365 517752 505021 491523 478199 465664 453794 442250 430999 420233 410001 400136 390584
$$ packed form
53281A672440K1674K0310J8199J5762J3391J0981Q112M698J294j493l818o423
53269A775127r544j2536j4895j7149k0005k2996k4951k5717k6347k7425k8242
53258A545320k8100k7475k7209k7328k7369k7187k6759k5738k4058k2478k1772
53247A259847k1763k1863k2081k2659k3189k3043k2392k1886k1516k0756j9638
53236A019061j8704j7926j6622j4633j2703j1465j0706r911q966q112p675p957
53224H73681q987j0343j1566j2677j3984j5463j6863j8146j9324k0106k0247k0054
53212F85921j9829j9107j7231j4605j2437j1287j0661j0121r876j0089j0456j0857
53200E29365j1613j2731j3498j3324j2535j1870j1544j1251j0766j0232r865r552
$$ plain form
53188 390584 381773 374511 369290 365631 362427 358978 355375 351808 348000 343678 339270 335746 333826 333482
53174 333482 333952 334131 333282 331629 330048 329062 328465 327975 327684 327587 327265 326437 325351 324148 322375 319748 317002
53157 317002 315226 314473 313729 312228 310213 308371 307049 306182 305586 305093 304583 304026 303446 302902 302523 302393 302331
53140 302331 302007 301423 300968 300861 300862 300710 300441 299992 299021 297552 296386 296257 296845 297184 296892 296460 296468 297011 297903
53121 297903 298909 299717 300030 299799 299230 298630 298383 298759 299450 299632 298900 297913 297607 297959 298093 297476 296437 295477
53103 295477 294574 293414 291960 290621 289993 290349 291253 291773 291391 290612 290412 291155 292251 292750 292060 290295 288247
53086 288247 286831 286301 286186 286189 286728 288179 290064 291606 292798 294155 295573 296265 295901 295089 294497 294179 294029
53069 294029 294302 295238 296584 297869 298881 299546 299651 299157 298672 299153 300949 303329 305138 305895 306127 306633 307633
$$ packed form
53188C90584q811p262n221l659l204l449l603l567l808m322m408l524j920l44
53174C33482M70J79q49j653j581r86n97m90k91r7l22q28j086j203j773k627k746
53157C17002j776p53p44j501k015j842j322q67n96m93n10n57n80n44l79j30o2
53140C02331l24n84m55j07Jj52k69m49r71j469j166j29N88L39k92m32QN43Q92
53121B97903J006Q08L13k31n69o00k47L76O91J82p32r87l06L52J34o17j039r60
53103B95477r03j160j454j339o28L56R04N20l82p79k00P43J096M99o90j765k048
53086B88247j416n30j15LN39J451J885J542J192J357J418O92l64q12n92l18j50
53069B94029K73R36J346J285J012O65J05m94m85M81J796K380J809P57K32N06J000
$$ plain form
53052 307633 308861 310237 311995 314058 315802 316728 316994 316974 316638 315777 314627 313778 313573 313932 314646 315497 316187
53035 316187 316533 316679 316861 317060 317122 317051 316960 316984 317461 318797 320803 322629 323882 325370 328004 331332 334008
53018 334008 335539 336586 337609 338323 338746 339730 341808 344310 346327 348075 350525 353970 357642 360686 362903
53003 362903 364459 365427 365913 366436 367803 370406 373683 376417 377745 377875 377730 378014 378826 380103 382053 384954
52987 384954 388633 392301 394990 396279 396673 397186 398451 400334 402441 404660 407003 409279 411377 413646 416507
52972 416507 419711 422483 424462 426125 428188 430863 433843 436692 439144 441236 443266 445492 447843 449983
52958 449983 451612 452574 452794 452301 451255 449745 447728 445365 443282 442184 442252 443039 443812 443862 442840 441161
52942 441161 439834 439506 439846 440155 440219 440131 439655 438479 436936 435779 435232 434866 434414 434052 433849 433579 433263 433259 433624
$$ packed form
53052C07633J228J376J758K063J744R26K66k0l36q61j150q49k05L59P14Q51O90
53035C16187L46J46J82J99O2p1r1K4M77J336K006J826J253J488K634L328K676
53018C34008J531J047J023P14M23R84K078K502K017J748K450L445L672L044K217
53003C62903J556R68M86N23J367K603L277K734J328J30j45K84Q12J277J950K901
52987C84954L679L668K689J289L94N13J265J883K107K219K343K276K098K269K861
52972D16507L204K772J979J663K063K675K980K849K452K092K030K226K351K140
52958D49983J629R62K20m93j046j510k017k363k083j098O8P87P73N0j022j679
52942D41161j327l28L40L09O4q8m76j176j543j157n47l66m52l62k03k70l16mL65
$$ plain form
52923 433624 433891 433746 433443 433370 433645 434349 435628 437249 438423 438488 437575 436347 435280 434395 433497 432459 431360
52906 431360 430438 429825 429380 428914 428443 427984 427313 426317 425378 424921 424684 424008 422843 421859 421508 421578 421795 422193 422722
52887 422722 423138 423603 424730 426562 428044 428043 426529 424334 422122 420095 418443 417407 416911 416571 416082 415382
52871 415382 414513 413618 413054 413199 414103 415423 416710 417696 418371 418862 419223 419345 419155 418743 418118 416930 414812
52854 414812 411989 409176 406759 404382 401479 397918 393950 389826 385699 381783 378314 375332 372513 369304
52840 369304 365394 361145 357378 354529 352301 350343 348874 348161 347743 346983 346227 346572 348300 350280 351149 350532
52824 350532 348855 346669 344531 342929 341813 340534 338713 336799 335416 334518 333660 332839 332547 333108 334373
52809 334373 336049 338012 340254 342661 344813 345992 345540 343336 339871 335910 332149 328979 326222 323238
$$ packed form
52923D33624K67j45l03p3K75P04J279J621J174O5r13j228j067q85q98j038j099
52906D31360r22o13m45m66m71m59o71r96r39m57k37o76j165r84l51P0K17L98N29
52887D22722M16M65J127J832J482jj514k195k212k027j652j036m96l40m89p00
52871D15382q69q95n64J45R04J320J287R86O75M91L61J22j90m12o25j188k118
52854D14812k823k813k417k377k903l561l968m124m127l916l469k982k819l209
52840C69304l910m249l767k849k228j958j469p13m18p60p56L45J728J980Q69o17
52824C50532j677k186k138j602j116j279j821j914j383q98q58q21k92N61J265
52809C34373J676J963K242K407K152J179m52k204l465l961l761l170k757k984
$$ plain form
52795 323238 319663 315976 312912 310527 308409 306622 305636 305340 305025 304622 305022 306737 309031 310957 312539
52780 312539 314255 315927 316917 317088 316859 316590 316505 316899 317759 318423 318265 317574 317087 316800 315925 314087 311904 310186
52762 310186 309078 308212 307306 306311 305159 303726 302154 301096 301403 303317 306011 308190 309191 309248 308802 308070
52746 308070 307409 307506 308764 310818 312977 314848 316343 317563 319022 321498 325067 328673 331221 332862 334635
52731 334635 337165 340358 344161 348794 354027 358855 362174 363547 363300 362223 361179 360613 360299 359776 359037
52716 359037 358453 358095 357514 356326 354685 353036 351625 350410 349252 348024 346646 345199 344024 343629 344388
52701 344388 346259 348810 351575 354403 357354 360275 362735 364477 365832 367556 370192 373539 376655 378551
52687 378551 379084 379052 379236 379570 379579 379316 379252 379356 379017 377909 376312 374512 372646 371315 371381 372657 373550 372711
$$ packed form
52795C23238l575l687l064k385k118j787r86k96l15m03M00J715K294J926J582
52780C12539J716J672R90J71k29k69q5L94Q60O64j58o91m87k87q75j838k183j718
52762C10186j108q66r06r95j152j433j572j058L07J914K694K179J001N7m46p32
52746C08070o61R7J258K054K159J871J495J220J459K476L569L606K548J641J773
52731C34635K530L193L803M633N233M828L319J373k47j077j044n66l14n23p39
52716C59037n84l58n81j188j641j649j411j215j158j228j378j447j175l95P59
52701C44388J871K551K765K828K951K921K460J742J355J724K636L347L116J896
52687C78551N33l2J84L34Rk63o4J04l39j108j597j800j866j331O6J276Q93q39
$$ plain form
52669 372711 370518 368367 367045 366466 366444 366855 367298 367452 367676 368560 369979 371253 372248 373765 376803 381855
52653 381855 388741 396471 403268 407474 408789 408302 407187 405688 403390 400088 396158 392317 389158 386798
52639 386798 384901 383056 381146 379370 378101 377730 378292 379074 379014 377782 376198 375294 375312 375922 376950 378304
52623 378304 379524 380078 380009 379782 379558 379188 378805 378862 379495 380390 381365 382652 384388 386199 387629 388855 390682
52606 390682 393676 397402 400761 403269 405677 408896 412559 415324 416688 417662 419360 421627 423497 424405 424430
52591 424430 424000 423851 424688 426232 427170 426698 425572 424911 424673 424208 423695 423806 424348 424468 424094 423972 424252 424170
52573 424170 423277 421999 420787 419663 418763 418423 418481 418328 417836 417390 416860 415530 413366 411317 409918 408520
52557 408520 406499 404323 402702 401420 399813 397862 395953 393941 391251 387753 383903 380086 376396 373013
$$ packed form
52669C72711k193k151j322n79k2M11M43J54K24Q84J419J274R95J517L038N052
52653C81855O886P730O797M206J315m87j115j499k298l302l930l841l159k360
52639C86798j897j845j910j776j269l71N62P82o0j232j584r04J8O10J028J354
52623C78304J220N54o9k27k24l70l83N7O33Q95R75J287J736J811J430J226J827
52606C90682K994L726L359K508K408L219L663K765J364R74J698K267J870R08K5
52591D24430m30j49Q37J544R38m72j126o61k38m65n13J11N42J20l74j22K80q2
52573D24170q93j278j212j124r00l40N8j53m92m46n30j330k164k049j399j398
52557D08520k021k176j621j282j607j951j909k012k690l498l850l817l690l383
$$ plain form
52543 373013 370296 368427 367214 366286 365357 364342 363334 362393 361396 360333 359663 359969 361156 362440 363238 363686
52527 363686 364128 364553 364769 364759 364600 364399 364500 365361 366922 368510 369711 371030 373283 376586 380217 383274
52511 383274 385215 386127 386855 388653 392142 396526 400079 401440 400426 397834 394717 391730 388881 385774 382122
52496 382122 378019 373762 369623 365830 362649 360340 359089 358897 359409 359980 360129 359874 359479 359037 358638 358707 359666
52479 359666 361275 362810 363977 365218 367027 369375 371942 374472 376706 378340 379264 379625 379586 379263 378900 378732
52463 378732 378651 378398 378106 378184 378623 378869 378474 377369 375419 372335 368291 364040 360065 356093 351806 347575
52447 347575 344013 341182 338668 336192 333710 331144 328505 326199 324814 324575 325152 325899 326160 325509 323951
52432 323951 321832 319526 317295 315403 314105 313433 313245 313479 314104 314848 315356 315716 316446 317848 319700 321672
$$ packed form
52543C73013k717j869j213r28r29j015j008r41r97j063o70L06J187J284P98M48
52527C63686M42M25K16j0j59k01J01Q61J561J588J201J319K253L303L631L057
52511C83274J941R12P28J798L489M384L553J361j014k592l117k987k849l107l652
52496C82122m103m257m139l793l181k309j251j92N12N71J49k55l95m42l99O9R59
52479C59666J609J535J167J241J809K348K567K530K234J634R24L61l9l23l63j68
52463C78732q1k53k92P8M39K46l95j105j950l084m044m251l975l972m287m231
52447C47575l562k831k514k476k482k566k639k306j385k39N77P47K61o51j558
52432C23951k119k306k231j892j298o72j88K34O25P44N08L60P30J402J852J972
$$ plain form
52416 321672 323684 325777 327996 330504 333500 336970 340909 345705 351854 359322 367789 377408 388447 399937
52402 399937 409524 415184 416598 414609 410098 403861 396818 389566 382109 374571 367753 362438 358594 355780
52388 355780 353892 352916 352400 351926 351741 352298 353453 354815 356523 358878 361442 363435 364984 367162 370663
52373 370663 375200 380331 386109 392605 399385 405948 412226 418248 423542 427348 429406 430264 430760 431296 431732
52358 431732 431955 432351 433452 435179 436881 438290 439991 442622 445984 449376 452604 456116 460294 465107 470448
52343 470448 476309 482549 488927 495546 502972 511753 521993 533443 545864 559242 573782 589706 606986
52330 606986 625416 645033 666294 689597 714826 741629 770020 800311 832461 865824 899549
52319 899549 932994 965710 997313 1027547 1056439 1084342 1111829 1139393 1167032 1194182 1220133
$$ packed form
52416C21672K012K093K219K508K996L470L939M796O149P468Q467R619J1039J1490
52402C99937R587N660J414j989m511o237p043p252p457p538o818n315l844k814
52388C55780j888r76n16m74j85N57J155J362J708K355K564J993J549K178L501
52373C70663M537N131N778O496O780O563O278O022N294L806K058Q58M96N36M36
52358D31732K23L96J101J727J702J409J701K631L362L392L228L512M178M813N341
52343D70448N861O240O378O619P426Q781J0240J1450J2421J3378J4540J5924J7280
52330F06986J8430J9617K1261K3303K5229K6803K8391L0291L2150L3363L3725
52319H99549L3445L2716L1603L0234K8892K7903K7487K7564K7639K7150K5951
$$ plain form
52308 1220133 1244490 1267213 1288382 1308010 1325947 1341786 1355060 1365709 1374184 1380933 1385988 1389240
52296 1389240 1390816 1390807 1388754 1383834 1375601 1364320 1350636 1335254 1318974 1302720 1287273 1273066 1260328
52283 1260328 1249369 1240634 1234505 1231154 1230667 1233277 1239240 1248256 1259206 1270848 1282911 1296263 1311942
52270 1311942 1330263 1350880 1373259 1396795 1420688 1444117 1466554 1487838 1508002 1527068 1544874
52259 1544874 1561050 1575308 1587762 1598688 1608004 1615338 1620704 1624670 1627548 1628676 1626802 1621026 1611233
52246 1611233 1597820 1581288 1562016 1540262 1516364 1490922 1464653 1438136 1411823 1386162 1361355
52235 1361355 1337146 1313353 1290524 1269524 1250387 1232156 1214077 1196439 1180081 1165621 1153399
52224 1153399 1143615 1136095 1130302 1125844 1122665 1120578 1119161 1118364 1118649 1120208 1122585 1125444 1129100 1133861
$$ packed form
52308A220133K4357K2723K1169J9628J7937J5839J3274J0649Q475O749N055L252
52296A389240J576rk053m920q233j1281j3684j5382j6280j6254j5447j4207j2738
52283A260328j0959q735o129l351m87K610N963R016J0950J1642J2063J3352J5679
52270A311942J8321K0617K2379K3536K3893K3429K2437K1284K0164J9066J7806
52259A544874J6176J4258J2454J0926R316P334N366L966K878J128j874n776r793
52246A611233j3413j6532j9272k1754k3898k5442k6269k6517k6313k5661k4807
52235A361355k4209k3793k2829k1000j9137j8231j8079j7638j6358j4460j2222
52224A153399r784p520n793m458l179k087j417p97K85J559K377K859L656M761
$$ plain form
52210 1133861 1139363 1145049 1150825 1156700 1162238 1166956 1170963 1174692 1178262 1181541 1184536 1187415 1190451 1194185
52196 1194185 1199101 1204786 1210044 1214309 1218361 1223084 1228180 1232735 1236394 1239213 1240920 1241183 1240134 1237819
52182 1237819 1233595 1226997 1218761 1210034 1200940 1190995 1180632 1171167 1163295 1156631 1150802 1145973 1142219 1139269
52168 1139269 1137057 1135826 1135575 1136125 1137706 1140796 1145352 1150891 1157278 1164628 1172442 1179683 1185764 1190781
52154 1190781 1194768 1197624 1199759 1201952 1204443 1207019 1209971 1213943 1218653 1222897 1226239 1229718 1234428 1240326
52140 1240326 1246935 1254277 1262355 1270570 1278629 1287515 1298706 1312656 1328754 1346576 1366477 1388981
52128 1388981 1414194 1441965 1472292 1505406 1541497 1580310 1621013 1662636 1704649 1746902 1789017
52117 1789017 1830120 1869249 1905758 1939333 1969863 1997287 2021349 2041619 2057963 2070792 2080428
$$ packed form
52210A133861N502N686N776N875N538M718M007L729L570L279K995K879L036L734
52196A194185M916N685N258M265M052M723N096M555L659K819J707K63j049k315
52182A237819m224o598q236q727r094r945j0363r465p872o664n829m829l754k950
52168A139269k212j231k51N50J581L090M556N539O387P350P814P241O081N017
52154A190781L987K856K135K193K491K576K952L972M710M244L342L479M710N898
52140A240326O609P342Q078Q215Q059Q886J1191J3950J6098J7822J9901K2504
52128A388981K5213K7771L0327L3114L6091L8813M0703M1623M2013M2253M2115
52117A789017M1103L9129L6509L3575L0530K7424K4062K0270J6344J2829R636
$$ plain form
52106 2080428 2086543 2088784 2087742 2084604 2079915 2073391 2064907 2054871 2043529 2030644 2016073 2000033 1982573
52093 1982573 1963362 1942182 1919094 1894064 1867120 1839098 1811623 1786151 1763509 1744351 1729237
52082 1729237 1718064 1710211 1705535 1704563 1707483 1713718 1722778 1734756 1749650 1767031 1786731 1808973 1833375
52069 1833375 1858700 1884255 1910668 1938508 1966837 1993981 2019172 2042576 2064190 2083667 2101005
52058 2101005 2116534 2130179 2141294 2149196 2153481 2153976 2150743 2143993 2133778 2120082 2103261 2083773
52046 2083773 2061226 2034488 2003254 1968822 1932705 1895276 1856591 1817822 1780619 1745399 1711441
52035 1711441 1678550 1647531 1618937 1592387 1567456 1544445 1523869 1505766 1489861 1476020 1464201
52024 1464201 1454188 1445521 1437532 1429466 1420957 1412395 1404537 1397683 1391487 1385480 1379476 1373459 1367416 1361313
$$ packed form
52106B080428O115K241j042l138m689o524q484j0036j1342j2885j4571j6040j7460
52093A982573j9211k1180k3088k5030k6944k8022k7475k5472k2642j9158j5114
52082A729237j1173p853m676r72K920O235R060J1978J4894J7381J9700K2242K4402
52069A833375K5325K5555K6413K7840K8329K7144K5191K3404K1614J9477J7338
52058B101005J5529J3645J1115P902M285M95l233o750j0215j3696j6821j9488
52046B083773k2547k6738l1234l4432l6117l7429l8685l8769l7203l5220l3958
52035A711441l2891l1019k8594k6550k4931k3011k0576j8103j5905j3841j1819
52024A464201j0013q667p989q066q509q562p858o854o196o007o004o017o043o103
$$ plain form
52010 1361313 1354929 1347546 1338036 1325443 1309545 1290880 1270198 1247774 1223336 1196908 1169597 1143032
51998 1143032 1117934 1093754 1069834 1046359 1023865 1002516 982412 963993 947427 931945 916493
51987 916493 900776 885097 869510 853922 838733 824522 811149 797895 784487 771209 757972
51976 757972 744198 729847 715851 703175 692025 682340 674506 669054 666026 665075 665966 668573 672570
51963 672570 677467 682867 688381 693392 697172 699301 699774 698670 695909 691399 685321 678103 670117 661623
51949 661623 653115 645534 639810 636206 634374 634089 635604 639177 644663 651811 660612 671000 682487 694539
51935 694539 707130 720385 733631 745193 753377 757520 757988 755336 749657 740757 728756 714271 698013
51922 698013 680546 662657 645558 630121 616042 602410 589114 577033 566722 557735 549615 542808
$$ packed form
52010A361313o384p383r510j2593j5898j8665k0682k2424k4438k6428k7311k6565
51998A143032k5098k4180k3920k3475k2494k1349k0104j8419j6566j5482j5452
51987I16493j5717j5679j5587j5588j5189j4211j3373j3254j3408j3278j3237
51976G57972j3774j4351j3996j2676j1150r685p834n452l028r51Q91K607L997
51963F72570M897N400N514N011L780K129M73j104k761m510o078p218p986q494
51949F61623q508p581n724l604j832k85J515L573N486P148Q801J0388J1487J2052
51935F94539J2591J3255J3246J1562Q184M143M68k652n679q900j2001j4485j6258
51922F98013j7467j7889j7099j5437j4079j3632j3296j2081j0311q987q120o807
$$ plain form
51910 542808 538038 535366 534537 535755 539334 544842 551351 558402 566130 574585 583591 593181 603514 614233
51896 614233 624409 633288 640787 647305 653389 659417 665059 668914 669072 664236 654428 640934 625927 611746
51882 611746 599819 590233 582582 577041 574165 573992 576054 580186 586520 594563 602938 610302 616028 619832
51868 619832 621296 620144 616583 611057 603953 595763 587259 579159 571812 565386 560163 556394 554009 552715
51854 552715 552342 552949 554547 556772 558897 560271 560697 560222 558560 555138 549958 544030 538508 533632 528962
51839 528962 524430 520494 517288 514311 511268 508745 507693 508516 510916 514353 518331 522309 525616 527580
51825 527580 527744 526141 523361 520249 517338 514544 511504 508240 505494 504227 504705 506217 507900 509634 511791
51810 511791 514265 516363 517747 518845 520048 521052 521363 520938 519899 518157 515885 513939 513073 512982 512747 511967
$$ packed form
51910E42808m770k672q29J218L579N508O509P051P728Q455R006R590J0333J0719
51896F14233J0176Q879P499O518O084O028N642L855J58m836r808j3494j5007j4181
51882F11746j1927r586p651n541k876j73K062M132O334Q043Q375P364N726L804
51868F19832J464j152l561n526p104q190q504q100p347o426n223l769k385j294
51854E52715l73O07J598K225K125J374M26m75j662l422n180n928n522m876m670
51839E28962m532l936l206k977l043k523j052Q23K400L437L978L978L307J964
51825E27580J64j603k780l112k911k794l040l264k746j267M78J512J683J734K157
51810E11791K474K098J384J098J203J004L11m25j039j742k272j946q66r1k35p80
$$ plain form
51794 511967 510830 509293 506996 503916 500463 496945 493574 490920 489557 489219 488968 488364 487787 487471 486919 485624
51778 485624 483797 482028 480612 479552 478874 478733 479510 481951 486790 494022 502832 512448 522686 533493
51764 533493 544303 554136 562111 567750 571064 572489 572420 570671 566640 560147 551860 542783 533690 525156
51750 525156 517764 511882 507428 504049 501495 499729 498828 498907 500039 502257 505712 510757 517758 526929 538531
51735 538531 552879 569634 587112 602834 614922 622838 627052 628610 629150 630708 634966 642523 652559
51722 652559 662783 669911 671084 665421 654265 640060 625344 612487 603265 597924 594799 591306 585421
51709 585421 576452 564995 552491 540566 530389 522512 517178 514496 514258 515757 517838 519157 518737 516629
51695 516629 513871 511567 510272 510447 512759 517085 521665 524275 524168 522012 518177 512329 504828 497239 490957
$$ packed form
51794E11967j137j537k297l080l453l518l371k654j363l38k51o04n77l16n52j295
51778D85624j827j769j416j060o78j41P77K441M839P232Q810R616J0238J0807
51764E33493J0810R833P975N639L314J425o9j749m031o493q287r077r093q534
51750E25156p392n882m454l379k554j766r01P9J132K218L455N045P001R171J1602
51735E38531J4348J6755J7478J5722J2088P916M214J558N40J558M258P557J0036
51722F52559J0224P128J173n663j1156j4205j4716j2857r222n341l125l493n885
51709E85421q969j1457j2504j1925j0177p877n334k682k38J499K081J319m20k108
51695E16629k758k304j295J75K312M326M580K610j07k156l835n848p501p589o282
$$ plain form
51680 490957 486293 483343 482651 484307 487344 490906 495275 500929 507314 513565 519991 527891 538220 551365
51666 551365 567875 588163 611251 634518 654903 669847 677288 675862 665789 649301 629797 610548
51654 610548 593984 581591 573967 570907 571585 574767 578997 582651 583947 581281 574119 563605 551822
51641 551822 540223 529092 518454 508782 500449 493197 486675 481067 476637 473172 470525 469241 469799 471499
51627 471499 472924 473505 473850 474585 475624 476638 477523 478178 478410 478248 477852 476999 475262 472886 470837 469624
51611 469624 468629 467029 464902 462876 461128 459426 458007 457657 458795 461017 463841 467492 472614 479455 487769
51596 487769 497476 508914 522187 536352 549498 559577 565156 565712 561684 554401 545631 536922 529302
51583 529302 523483 519977 518821 519502 521488 524795 529869 537054 546429 557960 571393 585928 600496
$$ packed form
51680D90957m664k950o92J656L037L562M369N654O385O251O426P900J0329J3145
51666E51365J6510K0288K3088K3267K0385J4944P441j426j0073j6488j9504j9249
51654F10548j6564j2393p624l060O78L182M230L654J296k666p162j0514j1783
51641E51822j1599j1131j0638r672q333p252o522n608m430l465k647j284N58J700
51627D71499J425N81L45P35J039J014Q85O55K32j62l96q53j737k376k049j213
51611D69624r95j600k127k026j748j702j419l50J138K222K824L651N122O841Q314
51596D87769R707J1438J3273J4165J3146J0079N579N56m028p283q770q709p620
51583E29302n819l506j156O81J986L307N074P185R375J1531J3433J4535J4568
$$ plain form
51570 600496 614668 629116 644893 662333 680842 699533 717680 734623 749955 764259 779340
51559 779340 797174 818653 843705 872289 904327 938212 970098 995473 1011504 1017766 1015116 1004460
51547 1004460 986446 961748 931352 896683 859396 820971 782649 745782 711772 681415 654692
51536 654692 631585 612539 597567 585357 574149 563381 553755 545840 539360 533774 528723 523803 518690
51523 518690 513681 509481 506275 503529 500731 497681 494118 489874 485487 481778 478700 475538 472385 470318
51509 470318 469689 469353 468229 466649 465398 464357 463096 462054 462056 463100 464634 466699 469801 473832 478006
51494 478006 481887 485755 490033 494890 500277 505698 510137 512787 513781 513705 512649 510386 507197 503648 499581
51479 499581 494184 487314 480021 473466 467762 462189 456178 449784 443427 437475 432068 427233 423044 419513
$$ packed form
51570F00496J4172J4448J5777J7440J8509J8691J8147J6943J5332J4304J5081
51559G79340J7834K1479K5052K8584L2038L3885L1886K5375J6031O262k650j0656
51547A004460j8014k4698l0396l4669l7287l8425l8322l6867l4010l0357k6723
51536F54692k3107j9046j4972j2210j1208j0768r626p915o480n586n051m920n113
51523E18690n009m200l206k746k798l050l563m244m387l709l078l162l153k067
51509D70318o29l36j124j580j251j041j261j042KJ044J534K065L102M031M174
51494D78006L881L868M278M857N387N421M439K650R94p6j056k263l189l549m067
51479D99581n397o870p293o555n704n573o011o394o357n952n407m835m189l531
$$ plain form
51465 419513 416345 413121 409836 407002 405057 404009 403730 404093 404625 404588 403914 403560 404411 406311 408681 411628
51449 411628 415688 420788 426369 432397 439559 448412 459030 471495 486024 502224 518515 532557 542283
51436 542283 546847 546995 544552 541388 538853 537918 538967 540983 541629 538950 532871 524648 515397 505793 496598
51421 496598 488400 480964 473715 466818 461029 456523 452654 448990 445903 444071 443874 445222 447436 449488
51407 449488 450961 452638 455471 459153 462516 465176 467861 471071 474344 477100 479457 481950 485095 489371
51393 489371 495032 501740 508975 516842 525893 536129 546990 558457 571443 586991 605862 628986
51381 628986 657253 690353 726587 764471 804134 846783 893136 942369 991761 1036969 1073486
51370 1073486 1098636 1112124 1114722 1107077 1089966 1064807 1033173 996195 954852 910397 864109 817018
$$ packed form
51465D19513l168l224l285k834j945j048k79L63N32l7o74l54Q51J900K370K947
51449D11628M060N100N581O028P162Q853J0618J2465J4529J6200J6291J4042R726
51436E42283M564J48k443l164k535r35J049K016O46k679o079q223r251r604r195
51421D96598q198p436p249o897n789m506l869l664l087j832j97J348K214K052
51407D49488J473J677K833L682L363K660K685L210L273K756K357K493L145M276
51393D89371N661O708P235P867R051J0236J0861J1467J2986J5548J8871K3124
51381F28986K8267L3100L6234L7884L9663M2649M6353M9233M9392M5208L6517
51370A073486K5150J3488K598p645j7111k5159l1634l6978m1343m4455m6288m7091
$$ plain form
51358 817018 770271 725398 683847 646541 614056 586698 564191 545787 530950 519386 510255 502186
51346 502186 494536 487902 482805 478559 474137 469551 465499 462064 458687 455236 452215 449805 447425 444472
51332 444472 441119 438204 436517 436205 436677 437118 437177 437051 436908 436586 435955 435158 434215 432799 430727 428375 426247
51315 426247 424426 422710 420973 419131 417169 415543 415130 416224 417862 418601 417885 416376 415149 414924 415840
51300 415840 417526 419422 421169 422667 423747 424215 424275 424473 425033 425820 427118 429735 433858 438449 442404 445815
51284 445815 449444 453452 457369 460914 464017 466318 467462 467766 467809 467432 465978 463512 461041 459299 457942
51269 457942 456167 453726 451161 449398 449191 450588 452840 455033 456704 457673 457582 456145 453703 450972 448342
51254 448342 445892 443925 442833 442455 442226 441986 442041 442378 442530 442394 442560 443488 444903 446225 447124 447398 446854
$$ packed form
51358H17018m6747m4873m1551l7306l2485k7358k2507j8404j4837j1564r131q069
51346E02186p650o634n097m246m422m586m052l435l377l451l021k410k380k953
51332D44472l353k915j687l12M72M41N9j26j43l22o31p97r43j416k072k352k128
51315D26247j821j716j737j842j962j626m13J094J638P39p16j509j227k25R16
51300D15840J686J896J747J498J080M68O0J98N60P87J298K617M123M591L955L411
51284D45815L629M008L917L545L103K301J144L04M3l77j454k466k471j742j357
51269D57942j775k441k565j763k07J397K252K193J671R69r1j437k442k731k630
51254D48342k450j967j092l78k29k40N5L37J52j36J66R28J415J322Q99K74n44
$$ plain form
51237 446854 445649 444330 443250 442346 441723 441875 442907 444061 444622 444939 445913 447668 449337 450131 450078 449645 449144
51220 449144 448696 448383 448223 448138 448123 448251 448433 448331 447650 446463 445180 444339 444442 445846 448530 451947 455215
51203 455215 457649 459243 460638 462492 464772 466766 467905 468458 469147 470199 471155 471717 472332 473485 474757
51188 474757 475148 474342 473028 471858 470741 469479 468478 468132 467885 466743 464662 462679 461507 460730 459696
51173 459696 458587 458068 458249 458574 458618 458534 458751 459616 461382 464225 468102 472696 477549 482233 486435 489951
51157 489951 492643 494491 495758 496924 498206 499191 499303 498647 497999 497877 498017 497951 497690 497512 497397 497081 496489
51140 496489 495773 495106 494729 495101 496643 499386 503059 507423 512267 517224 521893 526120 529952 533363 536214
51125 536214 538449 540137 541334 541971 541826 540592 538247 535451 533248 532175 531869 531750 531728 531970 532287 532277 531906
$$ packed form
51237D46854j205j319j080r04o23J52J032J154N61L17R74J755J669P94n3m33n01
51220D49144m48l13j60q5j5J28J82j02o81j187j283q41J03J404K684L417L268
51203D55215K434J594J395J854K280J994J139N53O89J052R56N62O15J153J272
51188D74757L91q06j314j170j117j262j001l46k47j142k081j983j172p77j034
51173D59696j109n19J81L25M4q4K17Q65J766K843L877M594M853M684M202L516
51157D89951K692J848J267J166J282R85J12o56o48j22J40o6k61j78j15l16n92
51140D96489p16o67l77L72J542K743L673M364M844M957M669M227L832L411K851
51125E36214K235J688J197O37j45j234k345k796k203j073l06j19k2K42L17j0l71
$$ plain form
51108 531906 531581 531676 532311 533533 535367 537737 540567 543858 547393 550590 553048 555111 557468 560289 563186
51093 563186 565974 568973 572388 575798 578471 579961 580284 579763 578836 577830 576781 575565 574192 572793 571316
51078 571316 569450 566945 563936 560970 558811 558092 558883 560569 562350 563924 565601 567833 570781 574309 578238
51063 578238 582688 588312 596121 606916 620870 637505 655662 673307 688029 698498 705488 711182
51051 711182 717657 726385 738605 754969 774485 794637 813146 829377 843659 855710 864189 867603
51039 867603 865318 858062 847992 838112 830771 826124 821978 815279 803934 787676 767796 746339 725299
51026 725299 706130 689633 676112 665540 657658 652159 648905 647893 648919 651403 654776 659031 664641
51013 664641 671776 679832 687906 695608 703195 711084 719482 728408 737722 747172 756728 766908 778448 791623
$$ packed form
51108E31906l25R5O35J222J834K370K830L291L535L197K458K063K357K821K897
51093E63186K788K999L415L410K673J490L23n21r27j006j049j216j373j399j477
51078E71316j866k505l009k966k159p19P91J686J781J574J677K232K948L528L929
51063E78238M450N624P809J0795J3954J6635J8157J7645J4722J0469O990N694
51051G11182O475Q728J2220J6364J9516K0152J8509J6231J4282J2051Q479L414
51039H67603k285p256j0070r880p341m647m146o699j1345j6258j9880k1457k1040
51026G25299j9169j6497j3521j0572p882n499l254j012J026K484L373M255N610
51013F64641P135Q056Q074P702P587P889Q398Q926R314R450R556J0180J1540J3175
$$ plain form
50999 791623 806202 822010 839131 857477 876617 896125 915596 934182 950736 964854 977274
50988 977274 988881 999763 1009740 1019312 1029399 1040430 1052378 1065488 1080146 1096065 1112377 1128758
50976 1128758 1145903 1164666 1185363 1208332 1234847 1266902 1306124 1353119 1407773 1469884 1539337
50965 1539337 1615833 1698811 1787865 1883061 1984423 2091016 2200864 2311951 2422933 2532582
50955 2532582 2638883 2739053 2830253 2910043 2976492 3028471 3065962 3089815 3101185 3101188 3090832 3071053
50943 3071053 3043044 3008606 2969598 2926680 2879151 2826617 2770486 2713356 2657315 2603417 2552213
50932 2552213 2503776 2457325 2411721 2366364 2320945 2274562 2226004 2174956 2122033 2067515 2010896
50921 2010896 1951912 1891238 1829880 1768633 1708397 1650288 1595035 1542785 1493798 1448694 1407724
$$ packed form
50999G91623J4579J5808J7121J8346J9140J9508J9471J8586J6554J4118J2420
50988I77274J1607J0882R977R572J0087J1031J1948J3110J4658J5919J6312J6381
50976A128758J7145J8763K0697K2969K6515L2055L9222M6995N4654O2111O9453
50965A539337P6496Q2978Q9054R5196J01362J06593J09848J11087J10982J09649
50955B532582J06301J00170R1200P9790O6449N1979L7491K3853J1370Lj0356j9779
50943C071053k8009l4438l9008m2918m7529n2534n6131n7130n6041n3898n1204
50932B552213m8437m6451m5604m5357m5419m6383m8558n1048n2923n4518n6619
50921B010896n8984o0674o1358o1247o0236n8109n5253n2250m8987m5104m0970
$$ plain form
50910 1407724 1370395 1336194 1305115 1277165 1251955 1229195 1208996 1191299 1175522 1161198 1148438
50899 1148438 1137300 1127272 1117890 1109390 1102184 1096150 1090983 1086840 1084030 1082463 1081963 1082758 1085029 1088262
50885 1088262 1091743 1095480 1100057 1105795 1112677 1120871 1130575 1141388 1152595 1164150 1176763 1190892 1206240
50872 1206240 1222447 1239804 1258972 1280267 1303408 1327791 1353047 1379634 1408929 1442381 1480545
50861 1480545 1523251 1570650 1623646 1683185 1749691 1823521 1905712 1997919 2101832 2218857 2350166
50850 2350166 2496586 2658390 2835369 3027107 3232972 3451754 3681509 3919936 4164891
50841 4164891 4414315 4665533 4914560 5155974 5383276 5589358 5767074 5910184 6014458
50832 6014458 6078231 6102126 6088299 6039765 5960040 5853140 5723971 5578742 5424725 5269336
$$ packed form
50910A407724l7329l4201l1079k7950k5210k2760k0199j7697j5777j4324j2760
50899A148438j1138j0028r382q500p206o034n167m143k810j567n00P95K271L233
50885A088262L481L737M577N738O882Q194R704J0813J1207J1555J2613J4129J5348
50872A206240J6207J7357J9168K1295K3141K4383K5256K6587K9295L3452L8164
50861A480545M2706M7399N2996N9539O6506P3830Q2191R2207J03913J17025J31309
50850B350166J46420J61804J76979J91738K05865K18782K29755K38427K44955
50841D164891K49424K51218K49027K41414K27302K06082J77716J43110J04274
50832F014458O3773K3895j3827m8534p9725j06900j29169j45229j54017j55389
$$ plain form
50822 5269336 5119118 4979150 4852750 4741285 4644305 4560040 4485820 4418068 4352351 4284042
50812 4284042 4209381 4126113 4033198 3930063 3816242 3691791 3557805 3416269 3269309 3118945
50802 3118945 2967667 2818708 2675234 2539420 2412712 2296610 2192357 2099877 2017942 1945768
50792 1945768 1883813 1832576 1791240 1758119 1732051 1712626 1699260 1690779 1685981 1683971 1683724 1683776 1682807
50779 1682807 1680423 1677004 1672658 1666572 1657690 1646058 1633086 1620215 1607569 1594318 1580022 1564876
50767 1564876 1548666 1530417 1509547 1486764 1463237 1439362 1414948 1390327 1366576 1344724 1325314
50756 1325314 1308715 1295258 1284891 1277115 1271537 1268346 1268168 1271568 1278719 1289381 1303185 1320076 1340504
50743 1340504 1365071 1394052 1427412 1465357 1508763 1559023 1617351 1684161 1759198 1842379 1934306
$$ packed form
50822E269336j50218j39968j26400j11465r6980q4265p4220o7752o5717o8309
50812D284042p4661q3268r2915j03135j13821j24451j33986j41536j46960j50364
50802C118945j51278j48959j43474j35814j26708j16102j04253r2480q1935p2174
50792A945768o1955n1237m1336l3121k6068j9425j3366q481m798k010k47N2r69
50779A682807k384l419m346o086q882j1632j2972j2871j2646j3251j4296j5146
50767A564876j6210j8249k0870k2783k3527k3875k4414k4621k3751k1852j9410
50756A325314j6599j3457j0367p776n578l191j78L400P151J0662J3804J6891K0428
50743A340504K4567K8981L3360L7945M3406N0260N8328O6810P5037Q3181R1927
$$ plain form
50732 1934306 2035635 2146076 2264515 2390009 2522005 2659331 2799638 2940274 3079202
50723 3079202 3214655 3344446 3466282 3578305 3678519 3763724 3829641 3872082 3887799 3874807
50713 3874807 3833139 3765689 3677798 3575727 3465592 3353281 3244175 3142302 3050010 2968674
50703 2968674 2899297 2842221 2796629 2760674 2731896 2707389 2683976 2658595 2628526 2591330 2545024
50692 2545024 2488604 2422329 2347537 2266491 2182304 2098274 2016741 1938743 1864954 1796539 1734816
50681 1734816 1680539 1634074 1595996 1566856 1546406 1533675 1528005 1529644 1539122 1556311 1580265 1609737
50669 1609737 1643636 1681083 1721097 1762112 1801844 1838024 1869478 1896312 1918973 1937518 1952080
50658 1952080 1963550 1973160 1981466 1988335 1993885 1998743 2003174 2006653 2008789 2010207 2012026 2014870 2019026 2025285
$$ packed form
50732A934306J01329J10441J18439J25494J31996J37326J40307J40636J38928
50723C079202J35453J29791J21836J12023J00214Q5205O5917M2441J5717j2992
50713C874807m1668o7450q7891j02071j10135j12311j09106j01873r2292q1336
50703B968674o9377n7076m5592l5955k8778k4507k3413k5381l0069l7196m6306
50692B545024n6420o6275p4792q1046q4187q4030q1533p7998p3789o8415o1723
50681A734816n4277m6465l8078k9140k0450j2731n670J639R478J7189K3954K9472
50669A609737L3899L7447M0014M1015L9732L6180L1454K6834K2661J8545J4562
50658A952080J1470R610Q306O869N550M858M431L479K136J418J819K844M156O259
$$ plain form
50644 2025285 2034868 2048532 2066360 2088518 2115593 2148006 2185537 2227682 2274046 2324111 2376946
50633 2376946 2431345 2486033 2539614 2590742 2638773 2684263 2728669 2773198 2817013 2855589 2880994
50622 2880994 2885303 2865149 2823429 2766930 2702959 2637959 2577521 2525710 2484021 2451731 2427526
50611 2427526 2410532 2400052 2395137 2394744 2397961 2403808 2410856 2417073 2419916 2416672 2404934 2382918 2349599
50598 2349599 2305006 2250533 2188517 2121143 2049986 1976659 1903268 1831681 1762783 1697052 1635603
50587 1635603 1579937 1530746 1487522 1449371 1415784 1386663 1362075 1341973 1325773 1312242 1300183
50576 1300183 1289162 1279293 1270556 1262818 1256258 1251098 1247048 1243642 1241124 1240312 1241612 1244867 1250325 1258903
50562 1258903 1271152 1286605 1304594 1325219 1349010 1376054 1405983 1438652 1474291 1513009 1554307
$$ packed form
50644B025285R583J3664J7828K2158K7075L2413L7531M2145M6364N0065N2835
50633B376946N4399N4688N3581N1128M8031M5490M4406M4529M3815L8576K5405
50622B880994M309k0154m1720n6499o3971o5000o0438n1811m1689l2290k4205
50611B427526j6994j0480m915l93L217N847P048O217K843l244j1738k2016l3319
50598B349599m4593n4473o2016o7374p1157p3327p3391p1587o8898o5731o1449
50587A635603n5666m9191m3224l8151l3587k9121k4588k0102j6200j3531j2059
50576A300183j1021r869q737p738o560n160m050l406k518q12J300L255N458Q578
50562A258903J2249J5453J7989K0625K3791K7044K9929L2669L5639L8718M1298
$$ plain form
50551 1554307 1597032 1639683 1680977 1720303 1757592 1792729 1825338 1855199 1882610 1908272 1933147
50540 1933147 1958594 1986306 2017782 2053930 2095143 2141414 2192236 2246745 2304335 2365026 2429231
50529 2429231 2497533 2570944 2650930 2738758 2834865 2939029 3050692 3168635 3290622 3414081
50519 3414081 3537276 3659273 3778549 3892014 3995652 4085867 4159957 4215734 4251352 4265672
50509 4265672 4258449 4229975 4180806 4112052 4025783 3924989 3813337 3695205 3575657 3459792
50499 3459792 3351848 3255040 3172077 3105338 3056333 3025330 3011685 3014307 3031698 3061855 3102235
50488 3102235 3149350 3198151 3242286 3275538 3292985 3290829 3265956 3216680 3143988 3051538 2944251
50477 2944251 2826969 2703890 2578442 2453356 2331052 2213821 2103314 2000028 1903828 1814935
$$ packed form
50551A554307M2725M2651M1294L9326L7289L5137L2609K9861K7411K5662K4875
50540A933147K5447K7712L1476L6148M1213M6271N0822N4509N7590O0691O4205
50529B429231O8302P3411P9986Q7828R6107J04164J11663J17943J21987J23459
50519C414081J23195J21997J19276J13465J03638R0215P4090N5777L5618J4320
50509D265672p223k8474m9169o8754q6269j00794j11652j18132j19548j15865
50499C459792j07944r6808q2963o6739m9005l1003j3645K622J7391L0157M0380
50488C102235M7115M8801M4135L3252J7447k156k4873m9276p2692r2450j07287
50477B944251j17282j23079j25448j25086j22304j17231j10507j03286r6200q8893
$$ plain form
50467 1814935 1733985 1661163 1595794 1536905 1483840 1436363 1394581 1358773 1328901 1304213 1283725
50456 1283725 1267032 1254236 1245067 1238645 1234228 1231793 1231715 1234288 1239622 1247599 1257771 1269691 1283448
50443 1283448 1299529 1317983 1337980 1358190 1377203 1393599 1406239 1414847 1420098 1422996 1424431 1425339
50431 1425339 1426759 1429449 1433662 1439417 1446700 1455413 1465522 1477349 1491260 1507011 1523895 1541758
50419 1541758 1561462 1584179 1610671 1641399 1676758 1716821 1761174 1809328 1861026 1916029 1973997
50408 1973997 2034738 2098046 2162959 2227634 2290341 2350308 2407316 2460902 2510323 2554922 2594026
50397 2594026 2626614 2651427 2667267 2672940 2667130 2648619 2616615 2570982 2512668 2444109 2368772 2289939
50385 2289939 2210126 2131670 2057182 1989001 1928659 1877253 1835825 1804890 1784114 1773049 1771835
$$ packed form
50467A814935q0950p2822o5369n8889n3065m7477m1782l5808k9872k4688k0488
50456A283725j6693j2796r169o422m417k435p8K573N334P977J0172J1920J3757
50443A283448J6081J8454J9997K0210J9013J6396J2640Q608N251K898J435R08
50431A425339J420K690M213N755P283Q713J0109J1827J3911J5751J6884J7863
50419A541758J9704K2717K6492L0728L5359M0063M4353M8154N1698N5003N7968
50408A973997O0741O3308O4913O4675O2707N9967N7008N3586M9421M4599L9104
50397B594026L2588K4813J5840N673n810j8511l2004m5633n8314o8559p5337p8833
50385B289939p9813p8456p4488o8181o0342n1406m1428l0935k0776j1065j214
$$ plain form
50374 1771835 1780458 1797600 1820802 1847620 1875965 1903415 1926854 1943072 1949647 1945507 1931039 1907510
50362 1907510 1875998 1837068 1791716 1742195 1691176 1640200 1589376 1538398 1487224 1435998 1385105
50351 1385105 1335475 1288281 1244224 1203530 1166599 1133989 1105595 1080448 1057683 1037357 1020113
50340 1020113 1006384 996167 989223 985139 983362 983379 984803 987294 990632 994917 1000401 1007027 1014444 1022589
50326 1022589 1031987 1043318 1056924 1072881 1091278 1112119 1134979 1158720 1181280 1199723 1211093
50315 1211093 1213910 1209003 1198778 1185782 1172034 1159239 1148762 1141024 1135325 1130787 1127501 1126420 1128056
50302 1128056 1131580 1135466 1138854 1142049 1145791 1150393 1155676 1161452 1167764 1174693 1182130 1189739 1197067 1203687
50288 1203687 1209418 1214508 1219604 1225314 1231774 1238915 1247573 1260129 1279030 1303791 1329514 1349117 1357520
$$ packed form
50374A771835Q623J7142K3202K6818K8345K7450K3439J6218O575m140j4468k3529
50362A907510l1512l8930m5352m9521n1019n0976n0824n0978n1174n1226n0893
50351A385105m9630m7194m4057m0694l6931l2610k8394k5147k2765k0326j7244
50340A020113j3729j0217o944m084j777J7J424K491L338M285N484O626P417Q145
50326A022589R398J1331J3606J5957J8397K0841K2860K3741K2560J8443J1370
50315A211093K817m907j0225j2996j3748j2795j0477p738n699m538l286j081J636
50302A128056L524L886L388L195L742M602N283N776O312O929P437P609P328O620
50288A203687N731N090N096N710O460P141Q658J2556J8901K4761K5723J9603Q403
$$ plain form
50275 1357520 1353937 1340834 1321639 1299499 1277108 1256598 1239352 1225967 1216275 1209398 1204194 1200008
50263 1200008 1196903 1195253 1195408 1197719 1202309 1208629 1215801 1223666 1232914 1243769 1255096 1265403 1274308
50250 1274308 1282458 1290325 1297722 1304219 1309233 1311811 1311170 1307753 1303329 1299837 1298439 1299637 1303725 1310841
50236 1310841 1320941 1334011 1350181 1369597 1392369 1418672 1448553 1481425 1515815 1549706 1581100
50225 1581100 1608489 1631240 1649798 1665380 1679361 1692872 1706757 1721501 1736788 1751069 1761653
50214 1761653 1765479 1760234 1745060 1720466 1687747 1648701 1605648 1561211 1517737 1476989 1440247 1408259
50202 1408259 1380956 1357708 1338046 1321684 1307449 1292642 1274114 1249932 1219921 1185164 1147637
50191 1147637 1109986 1074725 1043158 1015232 990296 967754 947141 928083 910361 893892 878756
$$ packed form
50275A357520l583j3103j9195k2140k2391k0510j7246j3385r692o877n204m186
50263A200008l105j650J55K311M590O320P172P865R248J0855J1327J0307Q905
50250A274308Q150P867P397O497N014K578o41l417m424l492j398J198M088P116
50236A310841J0100J3070J6170J9416K2772K6303K9881L2872L4390L3891L1394
50225A581100K7389K2751J8558J5582J3981J3511J3885J4744J5287J4281J0584
50214A761653L826n245j5174k4594l2719l9046m3053m4437m3474m0748l6742l1988
50202A408259k7303k3248j9662j6362j4235j4807j8528k4182l0011l4757l7527
50191A147637l7651l5261l1567k7926k4936k2542k0613j9058j7722j6469j5136
$$ plain form
50180 878756 865239 853464 842782 832048 820959 810667 802422 795975 790079 784230 779007 774791 771181
50167 771181 767827 764930 762561 760335 758225 757062 757619 759597 761979 764107 766013 768070 770840 775109
50153 775109 781610 790627 801923 814859 828433 841514 853331 863683 872589 879991 885975 890924 895073
50140 895073 898053 899229 898532 896837 895571 896060 899060 904597 912188 921387 932157 944670 958770 973822
50126 973822 989248 1005197 1022609 1042583 1065844 1092889 1124361 1160841 1202336 1248530 1299822
50115 1299822 1357634 1423224 1496262 1574746 1655893 1736841 1815064 1889010 1958539 2024422 2087511
50104 2087511 2148751 2209593 2271483 2334480 2396550 2454056 2502483 2537019 2553604 2550358 2528110
50093 2528110 2489467 2437501 2375107 2304906 2229257 2150328 2070145 1990396 1912343 1837173 1766336
$$ packed form
50180H78756j3517j1775j0682j0734j1089j0292q245o447n896n849n223m216l610
50167G71181l354k897k369k226k110j163N57J978K382K128J906K057K770M269
50153G75109O501R017J1296J2936J3574J3081J1817J0352Q906P402N984M949M149
50140H95073K980J176o97j695j266M89L000N537P591R199J0770J2513J4100J5052
50126I73822J5426J5949J7412J9974K3261K7045L1472L6480M1495M6194N1292
50115A299822N7812O5590P3038P8484Q1147Q0948P8223P3946O9529O5883O3089
50104B087511O1240O0842O1890O2997O2070N7506M8427L4536J6585l246k2248
50093B528110l8643n1966o2394p0201p5649p8929q0183p9749p8053p5170p0837
$$ plain form
50082 1766336 1701132 1642130 1589404 1543091 1503010 1467808 1435357 1404284 1374518 1346196 1318807
50071 1318807 1291885 1265871 1241701 1219829 1200057 1181945 1164954 1148497 1132282 1116494 1101404
50060 1101404 1087073 1073520 1060705 1048134 1035021 1021350 1008324 997276 988495 981588 976493 973392
50048 973392 971871 971040 970583 971086 973183 976884 981882 988049 995384 1003717 1012661 1021727 1030420 1038447 1045938
50033 1045938 1053317 1060849 1068354 1075297 1081078 1085405 1088527 1090948 1092650 1092781 1090438 1085765 1079915 1073930
50019 1073930 1068101 1062564 1057960 1054869 1052649 1049365 1043209 1033940 1022941 1012158 1003126 996682 992994
50006 992994 991683 992229 994574 999297 1007218 1019022 1035324 1056773 1083797 1116474 1154812 1198804 1247845
49993 1247845 1300325 1354243 1408121 1460924 1511282 1557342 1597444 1630647 1656806 1676756 1692443
$$ packed form
50082A766336o5204n9002n2726m6313m0081l5202l2451l1073k9766k8322k7389
50071A318807k6922k6014k4170k1872j9772j8112j6991j6457j6215j5788j5090
50060A101404j4331j3553j2815j2571j3113j3671j3026j1048q781o907n095l101
50048I73392j521q31m57N03K097L701M998O167P335Q333Q944R066Q693Q027P491
50033A045938P379P532P505O943N781M327L122K421J702J31k343m673n850n985
50019A073930n829n537m604l091k220l284o156r269j0999j0783r032o444l688
50006I92994j311N46K345M723P921J1804J6302K1449K7024L2677L8338M3992M9041
49993A247845N2480N3918N3878N2803N0358M6060M0102L3203K6159J9950J5687
$$ plain form
49982 1692443 1706175 1719363 1732060 1743361 1751486 1753366 1745135 1723893 1689029 1641892 1584756 1520384
49970 1520384 1451961 1382692 1315308 1251946 1194089 1142326 1096510 1056373 1021749 992133 966612
49959 966612 944644 926416 912008 900662 891479 884532 880574 879771 881283 884065 887485 891056 894120
49946 894120 896072 896706 896178 894746 892601 889803 886280 881872 876358 869404 860696 850183 838024 824185
$$ packed form
49982A692443J3732J3188J2697J1301Q125J880q231k1242l4864m7137n7136o4372
49970A520384o8423o9269o7384o3362n7857n1763m5816m0137l4624k9616k5521
49959I66612k1968j8228j4408j1346r183o947l958q03J512K782L420L571L064
49946H94120J952O34n28j432k145k798l523m408n514o954q708j0513j2159j3839
$$ [...]
##END NTUPLES=NMR SPECTRUM
##END=
