##TITLE=AC1727_3474_9208054_ibkSnlMSrY
##JCAMPDX= 6.0         $$ Bruker NMR JCAMP-DX V2.0
##DATA TYPE= NMR SPECTRUM
##DATA CLASS= NTUPLES
##ORIGIN= BRUKER
##OWNER= Administrator
$$ 1.72 TOPSPIN		Version 2.1
$$ 2015-06-01 17:58:51.405 -0700  Administrator@X
$$ Compression mode = diff/dup
##.OBSERVE FREQUENCY= 400.02188249412
##.OBSERVE NUCLEUS= ^1H
##.ACQUISITION MODE= SIMULTANEOUS (DQD)
##.ACQUISITION SCHEME= undefined
##.AVERAGES= 8
##.DIGITISER RES= 22
##SPECTROMETER/DATA SYSTEM= spect
##.PULSE SEQUENCE= zg30
##.SOLVENT NAME= COFFEE_meoh
##.SHIFT REFERENCE= INTERNAL, COFFEE_meoh, 1, 14.98509
##AUDIT TRAIL= $$ (NUMBER, WHEN, WHO, WHERE, PROCESS, VERSION, WHAT)
$$ ##TITLE= Audit trail, TOPSPIN		Version 2.1
$$ ##JCAMPDX= 5.01
$$ ##ORIGIN= Bruker BioSpin GmbH
$$ ##OWNER= Administrator
$$ $$ E:\/data/COFFEE/nmr/AC1727_3474_9208054_ibkSnlMSrY/10/pdata/1/auditp.txt
$$ ##AUDIT TRAIL=  $$ (NUMBER, WHEN, WHO, WHERE, PROCESS, VERSION, WHAT)
(   1,<2015-06-01 17:58:44.358 -0700>,<Administrator>,<X>,<go>,<TOPSPIN 2.1>,
      <created by zg
	started at 2015-06-01 17:57:38.451 -0700,
	POWCHK enabled, PULCHK disabled,
       configuration hash MD5:
       21 0F 79 D6 B3 7B B4 F6 88 20 88 DB 03 48 BD 9F
       data hash MD5: 64K
       84 0D 3E 16 47 6B 41 60 B0 67 74 3A 1D F7 90 53>)
(   2,<2015-06-01 17:58:47.420 -0700>,<Administrator>,<X>,<proc1d>,<TOPSPIN 2.1>,
      <Start of raw data processing
       efp LB = 0 FT_mod = 6 PKNL = 1 PHC0 = 0 PHC1 = 0 SI = 32K 
       data hash MD5: 32K
       96 42 DD 54 6D F0 48 C1 78 E9 1E A9 27 5D 4A 34>)
(   3,<2015-06-01 17:58:47.701 -0700>,<Administrator>,<X>,<proc1d>,<TOPSPIN 2.1>,
      <pk PHC0 = 91.40076 PHC1 = 0 
       data hash MD5: 32K
       3B 02 CB 91 E8 2B 67 84 38 F1 17 87 E6 86 02 91>)
(   4,<2015-06-01 17:58:47.811 -0700>,<Administrator>,<X>,<proc1d>,<TOPSPIN 2.1>,
      <abs ABSG = 1 
       data hash MD5: 32K
       F8 F4 2F 0D 73 AC 73 42 66 7A E9 B1 7C 35 42 C0>)
(   5,<2015-06-01 17:58:47.858 -0700>,<Administrator>,<X>,<proc1d>,<TOPSPIN 2.1>,
      <abs ABSG = 2 
       data hash MD5: 32K
       E6 3E 43 59 BB 9D 21 9E 58 1E 1D 20 DF C1 80 0A>)
(   6,<2015-06-01 17:58:47.936 -0700>,<Administrator>,<X>,<proc1d>,<TOPSPIN 2.1>,
      <abs ABSG = 3 
       data hash MD5: 32K
       54 16 CA 61 AE BC F5 4B 85 E3 5E EB B7 DF C1 AC>)
(   7,<2015-06-01 17:58:47.983 -0700>,<Administrator>,<X>,<proc1d>,<TOPSPIN 2.1>,
      <abs ABSG = 4 
       data hash MD5: 32K
       F2 52 AA 95 6A 2F 22 73 94 CD 0C FE 23 7E 66 78>)
(   8,<2015-06-01 17:58:48.045 -0700>,<Administrator>,<X>,<proc1d>,<TOPSPIN 2.1>,
      <abs ABSG = 5 
       data hash MD5: 32K
       52 46 34 12 A3 F0 EC D4 44 19 96 B8 57 5A 18 68>)
$$ ##END=
$$ 
$$ $$ hash MD5
$$ $$ 40 B4 A2 DE DB 24 78 25 58 B5 90 BB 11 56 06 FC
##$RELAX= 
##$RELAX= 
##$RELAX= 
##$RELAX= 
##$RELAX= 
##$RELAX= 
##$RELAX= 
$$ Bruker specific parameters
$$ --------------------------
##$DU= <E:\>
##$EXPNO= 10
##$NAME= <AC1727_3474_9208054_ibkSnlMSrY>
##$PROCNO= 1
$$ [...]
##$TP= (0..7)
150 150 150 150 150 150 150 150
##$TP07= 0
##$TPNAME0= <>
##$TPNAME1= <>
##$TPNAME2= <>
##$TPNAME3= <>
##$TPNAME4= <>
##$TPNAME5= <>
##$TPNAME6= <>
##$TPNAME7= <>
##$TPOAL= (0..7)
0.5 0.5 0.5 0.5 0.5 0.5 0.5 0.5
##$TPOFFS= (0..7)
0 0 0 0 0 0 0 0
##$TUNHIN= 0
##$TUNHOUT= 0
##$TUNXOUT= 0
##$USERA1= <user>
##$USERA2= <user>
##$USERA3= <user>
##$USERA4= <user>
##$USERA5= <user>
##$V9= 5
##$VALIST= <valist>
##$VCLIST= <CCCCCCCCCCCCCCC>
##$VD= 0
##$VDLIST= <DDDDDDDDDDDDDDD>
##$VPLIST= <PPPPPPPPPPPPPPP>
##$VTLIST= <TTTTTTTTTTTTTTT>
##$WBST= 2048
##$WBSW= 25
##$XGAIN= (0..3)
0 0 0 0
##$XL= 0
##$YL= 0
##$YMAX_a= 557441
##$YMIN_a= -479683
##$ZGOPTNS= <>
##$ZL1= 120
##$ZL2= 120
##$ZL3= 120
##$ZL4= 120
##$ABSF1= 14.98509
##$ABSF2= -5.573092
##$ABSG= 5
##$ABSL= 3
##$ALPHA= 0
##$AQORDER= 0
##$ASSFAC= 0
##$ASSFACI= 0
##$ASSFACX= 0
##$ASSWID= 0
##$AUNMP= <proc_prof1d_extract_pilot.lims>
##$AXLEFT= 0
##$AXNAME= <>
##$AXNUC= <1H>
##$AXRIGHT= 0
##$AXTYPE= 0
##$AXUNIT= <>
##$AZFE= 0.1
##$AZFW= 0.1
##$BCFW= 0
##$BC_mod= 0
##$BYTORDP= 0
##$COROFFS= 0
##$CY= 15
##$DATMOD= 1
##$DC= 0
##$DFILT= <>
##$DTYPP= 0
##$F1P= 0
##$F2P= 0
##$FCOR= 0.5
##$FTSIZE= 32768
##$FT_mod= 6
##$GAMMA= 0
##$GB= 0
##$INTBC= 1
##$INTSCL= 1
##$ISEN= 128
##$LB= 0
##$LEV0= 0
##$LPBIN= 0
##$MAXI= 10000
##$MC2= 0
##$MEAN= 0
##$ME_mod= 0
##$MI= 0
##$NCOEF= 0
##$NC_proc= -8
##$NLEV= 6
##$NOISF1= 0
##$NOISF2= 0
##$NSP= 0
##$NTH_PI= 0
##$NZP= 0
##$OFFSET= 14.98509
##$PC= 1
##$PHC0= 91.40076
##$PHC1= 0
##$PH_mod= 1
##$PKNL= yes
##$PPARMOD= 0
##$PPDIAG= 0
##$PPIPTYP= 0
##$PPMPNUM= 2147483647
##$PPRESOL= 1
##$PSCAL= 4
##$PSIGN= 0
##$PYNMP= <proc.py>
##$REVERSE= no
##$SF= 400.02
##$SI= 32768
##$SIGF1= 0
##$SIGF2= 0
##$SINO= 400
##$SIOLD= 32768
##$SPECTYP= <>
##$SREGLST= <1H.CDCl3>
##$SSB= 0
##$STSI= 32768
##$STSR= 0
##$SW_p= 8223.68421052631
##$SYMM= 0
##$S_DEV= 0
##$TDeff= 65536
##$TDoff= 0
##$TI= <>
##$TILT= no
##$TM1= 0
##$TM2= 0
##$TOPLEV= 0
##$USERP1= <user>
##$USERP2= <user>
##$USERP3= <user>
##$USERP4= <user>
##$USERP5= <user>
##$WDW= 1
##$XDIM= 32768
##$YMAX_p= 437747826
##$YMIN_p= -670481
##$CURPLOT= <Network HP LaserJet P1505>
##$CURPRIN= <$Network HP LaserJet P1505>
##$DFORMAT= <normdp>
##$LAYOUT= <+/1D_H.xwp>
##$LFORMAT= <normlp>
##$PFORMAT= <normpl>
##$SURQMSG= 1
$$ End of Bruker specific parameters
$$ ---------------------------------
##NTUPLES= NMR SPECTRUM
##VAR_NAME=  FREQUENCY,     SPECTRUM/REAL,   SPECTRUM/IMAG
##SYMBOL=    X,             R,               I
##VAR_TYPE=  INDEPENDENT,   DEPENDENT,       DEPENDENT
##VAR_FORM=  AFFN,          ASDF,            ASDF
##VAR_DIM=   32768,         32768,           32768
##UNITS=     HZ,            ARBITRARY UNITS, ARBITRARY UNITS
##FACTOR=    0.250966925370066, 1,           1
##FIRST=     8223.43324360094, 24369,        2883
##LAST=      0,             70807,           -150100
##MIN=       0,             -670481,         0
##MAX=       8223.43324360094, 437747826,    0
$$ Real data points
##PAGE= N=1
##DATA TABLE= (X++(R..R)), XYDATA
$$ [...]
$$ plain form
19609 -12740 225226 -382766 422633 355513 90232 102994 64379 60493 -1780 -107867 -125170
19598 -125170 -129890 -27489 15700 -513385 -260312 91076 32114 -117019 -76127 261203 -69393
19586 5247 -136822 83672 -61922 -106383 186674 -192019 -40094 78701 221744 -49705 161343
19574 57251 -70661 -25449 118257 98836 -263370 88965 -38417 127163 -163071 -117158 -18955
19562 123875 -204762 -107565 137722 72551 75648 -71972 -199459 -52628 -61231 -67611 -204331
19551 -204331 -295534 130729 44859 227217 -101559 -184553 -25007 53070 -1436 -284876 50298
19539 -266545 84466 197564 -20162 -233785 60888 25976 29116 285635 -208625 -112336 14849
19527 86911 -163702 9158 6882 -469928 103646 -50998 -135685 56835 3829 -30554 -41002 -66252
$$ packed form
19609a2740B25226c82766D22633o7120I0232J2762l8615l886a780j06087j7303
19598a25170m720b7489A5700e13385K53073I1076C2114a17019M0892B61203f9393
19586E247a36822H3672f1922m4461A86674a92019d0094G8701J43043d9705A61343
19574E7251g0661b5449A18257j9421b63370H8965c8417A27163a63071M5913a8955
19562A23875b04762R7197A37722o5171L097g1972j27487e2628q603o380j36720
19551b04331r1203A30729D4859J82358a01559q2994b5007E3070a436k83440E0298
19539b66545H4466J13098b0162k13623F0888B5976L140K56519b08625R6289A4849
19527H6911a63702I158k276d69928A03646e0998q4687E6835C829c0554j0448k5250
$$ plain form
19515 -66252 -116792 -236179 -101987 343629 -28035 47645 -112472 -85859 43393 -302096 -95729
19503 -88914 -179192 -48224 -68882 -101217 -19589 -86861 55052 -49752 229743 -3625 -103726
19492 -103726 -36230 217649 169798 -445314 -270031 33336 -138542 -137266 -114480 -146548 230900
19480 -192011 86714 -116167 -160533 -279102 88282 -281300 6325 -323270 -335684 -67005 141245
19468 98224 67842 15818 -176435 -128042 -148624 2270 68996 -478509 -304661 255066 -150754
19456 -362804 -40665 -155813 -5962 254939 99746 194564 106192 -108974 -68420 167508 28555
19444 -139228 103241 80021 170564 -251643 92425 -89455 73109 -92430 -230353 48285 -159472
19432 95691 -64302 -246890 -108209 209782 -184411 -76046 71658 -78482 40448 72633 13665
$$ packed form
19515f6252n0540j19387a01987C43629b8035D7645a12472K6613D3393c02096i5729
19503h8914r0278d8224k0658l2335a9589o7272E5052d9752B29743c625j00101
19492a03726c6230B17649m7851d45314J75283C3336a38542J276K2786l2068B30900
19480a92011H6714a16167m4366j18569H8282b81300F325c23270j2414f7005A41245
19468I8224l0382A5818a76435M8393k0582B270O6726d78509J73848B55066a50754
19456c62804d0665j15148e962B54939I9746R4818q8372a08974M0554A67508B8555
19444a39228A03241k3220R0543b51643I2425h9455G3109i2430j37923D8285a59472
19432I5691f4302j82588a08209B09782a84411g6046G1658g8482D0448L2185A3665
$$ plain form
19420 -21342 48178 -10336 -47439 -31375 -125606 7346 -228220 211556 -433593 50886 -120954
19408 -205978 44869 64355 -119740 143620 -207736 156848 -61855 45069 -47507 36951 -21795
19396 -52632 69006 -517129 220277 -91775 -191468 -26356 124008 -204137 -230256 -154883 -171137
19385 -171137 230082 245478 -13387 -82779 154182 -184887 -108970 -148253 960 -72668 8889
19373 95201 -91685 -504622 83299 176713 -67619 32409 93372 11260 -218358 -218712 -173302 -86290
19360 -50309 30609 339048 -256348 -244573 -24203 51156 -184336 -320951 158143 -286443
19349 -220934 -53870 85093 42808 290109 -135276 -259148 184745 -270504 -282589 -390939
19339 -390939 -150159 71323 -171934 -129883 100351 188430 -91104 -98289 -45481 81670 -98336
$$ packed form
19420b1342D8178a0336l7103J6064r4231G346b28220B11556d33593E0886a20954
19408b05978D4869J9486a19740A43620b07736A56848f1855D5069d7507C6951b1795
19396e2632F9006e17129B20277i1775r9693b6356A24008b04137k6119P5373j6254
19385a71137B30082J5396a3387o9392A54182a84887P5917l9283I60g2668H889
19373I5201i1685m12937H3299R3414f7619C2409O0963A1260b18358l54M5410h6290
19360e0309C0609L08439b56348J1775b4203E1156a84336j36615A58143b86443
19349b20934e3870H5093m2285K47301a35276j23872A84745b70504j2085j08350
19339c90939a50159G1323a71934M2051A00351Q8079i1104p185d5481H1670i8336
$$ plain form
19327 -75728 -7733 138544 -136500 -152886 -72388 -18233 177480 30498 141015 37958 -213704
19315 230146 -264329 -245098 -402332 -36974 -46702 -279126 -63648 -47576 20847 160264 -327094
19303 55804 -188132 -121421 -144414 103345 28520 45715 -226015 -69349 -246385 -5654 -168459
19292 -168459 -147863 -135590 -220124 -127939 -200247 152713 -129701 -244565 149973 -49153 45584
19280 57835 -6803 250013 -144491 -439261 122061 -155935 956 29480 -377210 -180549 29051
19268 120191 -46429 -345108 10849 -49579 -115154 30823 -243237 -15442 113352 -122142 -41683
19256 -139460 33708 -22146 -2118 -297786 -133985 -46810 -350624 -84779 -184283 15522 -229450
19244 -401497 226252 48403 -418939 -66295 236158 134021 -19577 84061 61420 -73801 20526
$$ packed form
19327g5728g733A38544a36500j6386g2388a8233A77480C0498J10517C7958b13704
19315B30146b64329J9231j57234c6974r728k32424f3648J6072B0847J39417c27094
19303E5804a88132O6711k2993A03345B8520J7195b26015f9349j77036e654j62805
19292a68459K0596J2273q4534R2185p2308A52713a29701j14864A49973d9153D5584
19280E7835f803B50013a44491k94770A22061a55935I56K8524c77210a80549B9051
19268A20191d6429k98679A0849d9579o5575C0823b43237a5442A13352a22142d1683
19256a39460C3708b2146b118k95668a33985d6810l03814h4779r9504A5522b29450
19244d01497B26252D8403d18939f6295B36158j02137a9577H4061k2641g3801B0526
$$ plain form
19232 182817 -109024 187396 8847 -225516 79845 -17615 -364331 371437 -119446 -31737
19221 -37322 -162034 -173072 -401934 -42166 -30908 -228086 -3446 -42549 -62678 24109 -78432
19209 -156821 -314543 128462 -228000 -134694 -103642 -81908 -187250 -191877 -63722 51488 -108392
19197 -16277 -155975 -48339 -87610 71159 -14285 101191 43229 -123281 -264429 -64678 -70780
19186 -70780 155009 -69818 -113378 297029 -33236 32228 -84801 -238922 -87652 243877 237863
19175 237863 -177952 -79357 44211 -11485 -50445 137380 -190249 -16059 -159950 -48806 -12086
19163 -269336 -242954 -30508 -236543 152217 -221802 -71488 -233390 -73278 -234278 -458820
19153 -458820 -105204 165520 -163899 182042 128962 -191167 162610 -267972 164560 -284929
$$ packed form
19232A82817a09024A87396H847b25516G9845a7615l46716C71437a19446c1737
19221c7322j24712j1038k28862d2166J1258j97178c446l9103k0129B4109g8432
19209a56821j57722A28462b28000R3306L1052K1734j05342m627f3722E1488a08392
19197a6277j39698d8339l9271G1159a4285A01191D3229a23281j41148f4678o102
19186g0780A55009f9818m3560B97029c3236C2228h4801j54121h7652B43877o014
19175B37863a77952g9357D4211a1485l8960A37380a90249a6059j43891d8806a2086
19163b69336K6382c0508k06035A52217b21802g1488j61902g3278j61000k24542
19153d58820a05204A65520a63899A82042n3080a91167A62610b67972A64560b84929
$$ plain form
19142 -141568 -273015 -85703 -169 -286286 104069 -235430 -160796 -36334 -159578 213991 -102478
19130 99661 21255 185060 140247 -169177 -56813 -324403 20368 155957 -334028 -214321
19120 -214321 -87949 -109297 183760 349061 -216161 -262508 -230228 -189681 -215160 -231532 38176
19108 -234699 -99964 98244 -188799 38021 161793 241669 -204621 82073 220001 -69695 144114
19096 -156684 -85993 -106099 56294 -304211 122671 -156229 -243201 -331988 -155988 51348 177666
19085 177666 -110455 -304612 88410 71824 -103807 -69500 -180645 70348 -311143 -94927
19074 -45126 -140742 -9888 -59575 62861 302695 -101585 -17291 -71 -189269 -424617 -64377 -123122
19062 -123122 136831 -212466 202494 196773 -47725 135093 -372774 186183 297846 -54458
$$ packed form
19142a41568j31447h5703a69k86117A04069b35430P4634c6334j23244B13991a02478
19130I9661B1255J63805m4813a69177e6813k67590B0368J35589c34028J19707
19120b14321h7949k1348A83760J65301b16161m6347L2280M0547k5479j6372C8176
19108b34699i9964I8244a88799C8021J23772P9876b04621H2073J37928f9695A44114
19096a56684P0691k0106E6294c04211A22671a56229q6972q8787a55988E1348J26318
19085A77666a10455j94157H8410j6586a03807L4307j11145G0348c11143i4927
19074d5126r5616i888m9687F2861K39834a01585a7291g1j89198k35348f4377n8745
19062a23122A36831b12466B02494n721d7725A35093c72774A86183J11663e4458
$$ plain form
19051 -238790 -393676 -192128 13334 -219488 -138480 -226931 -44122 -204863 259615 -44904
19040 4175 39470 -239968 151 -70428 -8690 -76938 126950 -177970 92494 94432 217876 83127
19027 57985 295723 78658 -154796 -18031 71478 -114736 -106665 113116 -61474 18516 22752
19016 22752 146768 80029 -482261 -199246 -75222 53647 356998 -192777 -156413 286849
19005 -97295 3161 -154609 109805 -141118 285162 63660 117706 -123987 -22265 80285 -181136
18993 -173526 -184537 -158405 -336789 -302724 109364 144644 -155010 176476 -179530 -172999 34922
18981 -26789 140998 -238226 -24246 133613 -288836 163129 -22954 -88801 65904 -26528 6219
18969 -264858 180444 -100565 -20621 -45783 -93350 40969 -9787 -204478 120455 -307942 -260453
$$ packed form
19051b38790j54886a92128A3334b19488Q1008q8451d4122j60741B59615d4904
19040D175L5295b39968A51g0428h690o8248A26950a77970I2494J938J23444H3127
19027E7985K37738G8658a54796a8031G1478a14736Q071A13116f1474A8516M236
19016B2752J24016o6739d82261a99246g5222E3647L03351a92777L6364B86849
19005i7295C161a54609A09805a41118B85162F3660N4046a23987b2265H0285a81136
18993a73526j1011K6132j78384L4065A09364L5280a55010A76476a79530O531C4922
18981b6789A40998b38226b4246A33613b88836A63129b2954o5847F5904b6528F219
18969b64858A80444a00565b0621k5162m7567D0969i787j94691A20455c07942M7489
$$ plain form
18958 -260453 -82104 -84263 65866 151700 -65366 -277628 -194392 -236533 -93284 125522 -243695
18946 -237847 -228188 -240104 94552 -120122 98044 -52280 -235437 -176023 149101 -165042 183964
18934 -68645 -189198 -343605 114896 -104660 121562 220843 -142782 84066 23883 -131638
18923 -459350 5234 114364 -33895 -33026 -27909 57528 101796 114722 -203138 255828 17971 -198556
18910 9527 -253656 -229404 -206463 -132866 -270334 239744 -111558 47632 -52250 2838 -217915
18898 -235552 -16591 37752 264084 -439300 -337436 -77465 -118051 -210842 -375085 -25059 118344
18886 110874 -111727 -207758 116704 11624 -10878 23000 53277 -29600 177526 -48275 -194080
18875 -194080 292476 -8475 -145737 -272919 -474968 79744 -58592 -301337 163191 -172791
$$ packed form
18958b60453h2104k159F5866Q5834f5366k12262Q3236m2141i3284A25522b43695
18946b37847R659j1916I4552a20122I8044e2280j83157N9414A49101a65042A83964
18934f8645j20553j54407A14896a04660A21562R9281a42782H4066B3883a31638
18923d59350E234J09130c3895Q69N117E7528M4268J2926b03138B55828A7971a98556
18910I527b53656K4252K2941P3597j37468B39744a11558D7632e2250B838b17915
18898b35552a6591C7752K26332d39300J01864g7465m0586r2791j64243b5059A18344
18886A10874a11727r6031A16704A1624a0878B3000L0277b9600A77526d8275j45805
18875a94080B92476h475j37262j27182k02049G9744e8592k42745A63191a72791
$$ plain form
18864 -172398 -78400 -55919 -366210 52693 -3445 29503 -7695 92419 -429035 -26000 -177559
18853 -177559 -205472 -223430 -15420 203487 37379 -27266 -119851 -267406 -71928 -68831 137738
18841 -102618 -16452 -69073 116268 135060 -336869 271022 100974 -195235 8811 17637 -268505
18829 244421 41173 -353968 -130626 43452 55892 522289 137508 -46263 -75128 129260
18818 -51592 -11513 71647 -228234 216402 -165162 409276 54796 60219 -37947 10020 -37854
18806 -177393 -201744 17603 44497 -154726 10568 215916 132534 -4794 47771 152164 -216409
18794 -358963 71637 87210 -2659 -205941 -109963 -126730 -60421 179119 18104 14572 -149080
18782 120263 -259975 -45542 -284096 352513 -118624 -353042 -26432 -23230 -47440 178569
$$ packed form
18864a72398g8400K2481l10291E2693c445B9503g695I2419d29035b6000j51559
18853a77559k7913j7958a5420B03487C7379b7266r2585j47555g1928L097A37738
18841a02618a6452n2621A16268J8792c36869B71022A00974a95235H811Q826b68505
18829B44421D1173c53968a30626D3452J2440M66397A37508d6263k8865A29260
18818e1592a1513G1647b28234B16402a65162D09276E4796N423c7947A0020c7854
18806a77393k4351A7603K6894a54726A0568K05348q3382d794D7771J04393b16409
18794c58963G1637J5573b659k03282R5978j6767f0421A79119A8104l532a49080
18782A20263b59975d5542k38554C52513a18624k34418b6432L202k4210A78569
$$ plain form
18771 -60247 -88292 -140443 59097 77966 116302 116420 40072 41036 9374 -48908 -213586 -170525
18759 -170525 193711 -173111 7871 34083 -211554 62316 -114618 113503 -229993 36829
18748 -275096 -138591 -280869 -37525 -110729 -114498 108445 -168820 11187 104533 -132235 -68927
18737 -68927 -130540 -42492 15121 -105401 -423737 -266046 -258777 -151512 137063 -117723 317192
18725 -28874 60954 14327 -19242 54604 139354 66759 -9163 358189 -48382 62236 -147569
18713 -147267 -89698 -33657 -272793 275518 -197725 -298955 -492095 42654 -225820 -70614
18702 73884 -197095 -318838 -275805 -259855 74000 -158504 -49808 263451 -297745 -355951 -44414
18690 -131232 -207208 -2742 -132331 -37763 -102432 80790 -281816 -189353 136245 -47405 150259
$$ packed form
18771f0247k8045n2151E9097J8869L8336J18D0072R64I374d8908j64678M3061
18759a70525A93711a73111G871K6212b11554F2316a14618A13503b29993C6829
18748b75096J36505j42278c7525p3204l769A08445a68820A1187R3346a32235O3308
18737f8927o1613d2492A5121a05401l18336J57691P269J07265A37063a17723C17192
18725b8874F0954A4327a9242E4604Q4750F6759i163C58189d8382F2236a47569
18713a47267N7569c3657k39136B75518a97725j01230j93140D2654b25820g0614
18702G3884a97095j21743M3033J5950G4000a58504d9808B63451b97745n8206d4414
18690a31232p5976b742j29589c7763o4669H0790b81816R2463A36245d7405A50259
$$ plain form
18678 64459 128461 62292 217044 16335 -75368 -6915 5994 -20110 -261320 -307248 -177297
18667 -177297 -102021 22982 -124242 -190430 241956 -245431 -30862 137701 -87660 -278047
18657 -278047 -189243 231275 -70616 -159135 -218055 -119738 93626 19872 206538 -177015 -229712
18646 -229712 -334547 -39708 -126466 -83686 233087 1010 -341952 171650 133366 39161 105258
18635 105258 290004 -61590 -536 -41506 -171313 -171634 -112307 -128322 217514 -25023 79290 193775
18623 193775 -36432 239725 -228802 -296734 -174522 -193787 -183589 106691 186214 125790 -84699
18611 -87324 60541 40330 -255395 -252721 -177513 121443 -180415 235853 125023 -205601 248407
18599 27006 50096 -112504 -57176 145162 -238316 235922 -63873 -146795 167250 -192069
$$ packed form
18678F4459O4002F2292J54752A6335g5368f915E994b0110k41210m5928J29951
18667a77297P5276B2982a24242o6188B41956b45431c0862A37701h7660j90387
18657b78047Q8804B31275g0616q8519n8920R8317I3626A9872J86666a77015n2697
18646b29712j04835c9708q6758M2780B33087A010c41952A71650l8284C9161O6097
18635A05258J84746f1590e36m0970j29807l21N9327j6015B17514b5023G9290J14485
18623A93775c6432B39725b28802o7932J22212j9265J0198A06691P9523o0424h4699
18611h7324F0541k0211b55395K674P5208A21443a80415B35853j10830b05601B48407
18599B7006K3090a12504N5328A45162b38316B35922f3873q2922A67250a92069
$$ plain form
18588 -53188 -127109 -99923 9088 101771 19732 -66662 -232223 -60905 -265014 -342969 -189048
18577 -189048 109154 -310623 115309 69560 126 -52374 230563 5603 273146 -211875 -207563
18566 -207563 -32664 -240862 372739 24266 -192259 -132606 50755 -151311 -44370 100908
18555 66899 93907 205936 107951 9809 -287701 -204192 -48213 114939 -116217 -278816 -40319
18543 -184655 -13965 -223342 -180876 -141921 -55779 -249570 -130976 -300414 -125191 -197447
18533 -197447 -288234 172558 200715 -65417 189070 49152 144297 72322 -73885 39948 -6332
18521 -252568 11586 -223712 -126334 -103849 21062 78791 -157665 198187 -185612 -129862 31875
18509 10255 -237517 26442 -172760 -244937 -83642 87637 -359336 -74731 -76769 81442 100078
$$ packed form
18588e3188p3921K7186I088R2683A9732f6662j65561f0905k04109p7955J53921
18577a89048A09154c10623A15309m5749A26e2374B30563E603K67543b11875M312
18566b07563c2664k08198C72739B4266a92259N9653E0755a51311d4370A00908
18555F6899K7008J12029r7985I809b87701Q3509d8213A14939a16217j62599d0319
18543a84655a3965k09377M2466L8955e5779j93791J18594j69438a25191p2256
18533a97447r0787A72558K8157f5417A89070D9152R5145p1975g3885C9948f332
18521b52568A1586b23712R7378K2485B1062N7729a57665A98187a85612N5750C1875
18509A0255b37517B6442a72760p2177h3642H7637c59336g4731k038H1442J8636
$$ plain form
18498 100078 5525 67666 26669 -254584 -23251 200947 -187050 -5308 -173329 172498 -142761
18486 -27775 -46509 129593 -137977 -171198 69406 -159349 -286971 -306657 -48433 177907 46682
18474 -140593 -340691 -16115 -360783 -241672 871 -150165 61419 -295529 -53407 -95466 -113902
18463 -113902 24281 16136 -95792 -46642 190871 -149943 84075 83180 112217 41401 145346
18452 145346 -291610 37462 227641 -275570 128438 -97325 -86331 -167698 204681 16301
18441 -23261 -236742 -164103 -358062 -36970 -315690 -87677 49832 78846 -35127 -105571 -206555
18430 -206555 -223633 66610 -137385 -36962 -10836 -364976 -49157 413230 21230 -252898 -71984
18418 928 -265264 141577 -170958 -70475 164223 -142230 -243942 -116842 32686 22768 -9944
$$ packed form
18498A00078E525O2141B6669b54584b3251B00947a87050e308j68021A72498a42761
18486b7775j8734A29593a37977l3221F9406a59349j27622j9686d8433A77907D6682
18474a40593k00098a6115l44668J19111H71a50165F1419b95529e3407m2059j8436
18463a13902B4281q145i5792d6642A90871a49943H4075q95K9037D1401J03945
18452A45346b91610C7462J90179b75570A28438i7325J0994q1367B04681A6301
18441b3261k13481P2639j93959c6970k78720h7677D9832K9014c5127p0444j00984
18430b06555j7078F6610a37385c6962a0836l54140d9157D13230B1230b52898g1984
18418I28b65264A41577a70958g0475A64223a42230j01712a16842C2686r918i944
$$ plain form
18406 -93243 -18006 -203117 94755 -146872 -40697 308398 -57402 -130074 -203649 134868 97713
18395 97713 -286936 -90725 59676 -54124 3417 113718 -114968 34033 66528 139995 261777
18384 261777 -222740 -85054 -66919 55198 13634 -31581 150346 -317132 -37055 192797 177802
18373 177802 -330870 77951 129621 -57949 105561 26573 -122587 173260 20196 213619
18363 213619 -87249 89685 -348881 91169 -272982 -59968 -113067 313186 -57851 368199 94011
18351 -12896 36870 -33878 -288408 -152926 -98331 -193237 -34990 -103197 122999 -59351 220682
18339 133320 -368962 -54093 311868 -10012 -151093 293585 -245398 -205810 -245794 73751
18328 -88656 -202654 142375 -58455 114566 -293063 13431 -165124 82155 -8377 -308140 -341343
$$ packed form
18406i3243a8006j85111I4755a46872d0697C08398e7402p2672p3575A34868l7155
18395I7713b86936i0725E9676e4124C417J10301a14968C4033L2495P3467J21782
18384B61777b22740h5054J8135E5198A3634c1581A50346c17132c7055A92797j4995
18373A77802c30870G7951N1670e7949A05561B6573a22587A73260B0196J93423
18363B13619h7249H9685c48881I1169b72982e9968n3099C13186e7851C68199I4011
18351a2896C6870c3878k54530J35482N4595r4906c4990o8207A22999e9351B20682
18339A33320c68962e4093C11868a0012j41081B93585b45398L9588l9984G3751
18328h8656j13998A42375e8455A14566b93063A3431a65124H2155h377k99763l3203
$$ plain form
18317 -341343 -173182 -206870 -42111 -251071 -49241 -117502 -206936 310108 19478 24287 -232198
18305 -146310 138661 424 61246 -92869 -6648 -139565 -174713 155848 -358218 123064 117406
18294 117406 284669 -24702 -181161 365178 12193 18392 -68447 -63356 53156 -237169 -116865
18282 148563 -149428 68466 -283614 86507 -131709 -330649 -71823 -178793 -310904 -214441
18272 -214441 153880 231218 143502 -111906 -16596 -234787 -123095 133918 4151 -131139
18261 -4784 70709 -345726 66024 -130146 -156208 78438 -29017 -7427 133806 66074 60796 -62415
18248 64932 -207556 21217 -220605 34358 -167304 -108158 235180 725 -330542 -203219 137505
18236 52796 51785 96290 -90014 126766 -277626 -123147 -59393 -111997 -4510 -129392 203423
$$ packed form
18317c41343J68161l3688d2111k08960d9241o8261q9434C10108A9478M809b32198
18305a46310A38661D24O0822i2869f648j32917l5148A55848c58218A23064n658
18294A17406J67263b4702j56459C65178A2193O199f8447N091E3156b37169a16865
18282A48563a49428F8466b83614H6507a31709j98940g1823j06970j32111R6463
18272b14441A53880P7338q7716a11906a6596k18191J11692A33918D151a31139
18261d784G0709c45726F6024a30146k6062G8438b9017g427A33806F6074n278f2415
18248F4932b07556B1217b20605C4358a67304N9146B35180G25c30542J27323A37505
18236E2796j011M4505i0014A26766b77626a23147e9393n2604d510j24882B03423
$$ plain form
18224 84788 290931 -167102 -180538 -24897 -152038 -60452 45087 158968 101551 -331373 -52218
18212 -82096 46314 -153779 7550 -319491 -313933 -104355 266056 29534 -100516 108463 -379
18200 -39765 520 -65905 14809 -81827 -295281 -14556 70387 249332 -315684 -92928 176893
18188 181854 -73713 221702 39681 -118402 305836 -40973 -226091 -189915 -296056 191816
18177 105255 -238431 95282 -33982 -138730 -172221 -166135 -8245 -240728 -208399 -87685 -95947
18166 -95947 267059 421081 71746 -130645 -195764 -86096 -91192 134534 13889 9647 72221
18155 72221 -56685 -102510 -158521 62710 -53158 11964 255976 -61827 -268341 11064 280039
18144 280039 39790 87624 -347260 236798 166231 235916 55935 -437903 -305172 -98852 -7727
$$ packed form
18224H4788K06143a67102j3436b4897j27141f0452D5087J13881n7417c31373e2218
18212h2096D6314a53779G550c19491N558a04355B66056B9534a00516A08463c79
18200c9765E20f5905A4809h1827k13454a4556G0387J78945c15684i2928A76893
18188A81854g3713B21702C9681a18402C05836d0973j85118L6176j06141A91816
18177A05255b38431I5282c3982j04748l3491O086h245k32483L2329h7685q262
18166i5947B67059J54022G1746a30645o5119h6096n096A34534A3889m242O2574
18155G2221e6685m5825n6011F2710e3158A1964K44012f1827k06514A1064K68975
18144B80039C9790M7834c47260B36798p0567O9685E5935d37903J32731i8852g727
$$ plain form
18132 -362371 583 -88163 -130459 72755 636 -85585 -396959 7894 -181580 211222 58383 -304783
18119 -32753 96863 107979 -94578 112966 125782 160573 -127044 -192459 -215944 -58168 -232377
18108 -232377 -96071 18407 155184 -497619 -27596 -152778 -139148 -373440 -261476 219622
18097 396564 -61668 -172100 -102928 15704 -141202 153017 -132724 -148820 -203195 136605
18086 19154 -60137 -78195 106648 27591 -66419 -250862 -225395 270452 -12719 -109393 -811
18074 -23478 89744 -181615 136846 -339854 -149509 -219130 -11061 9814 -378753 32711 -121225
18062 -107131 73335 2231 74604 -44800 -50923 -122023 141526 96437 -447704 -215513 55280
18050 -292951 50711 -13395 131463 -183003 -48914 -218464 224682 -338319 -43636 11286
$$ packed form
18132c62371E83h8163m2296G2755F36h5585l11374G894a81580B11222E8383c04783
18119c2753I6863J1116i4578A12966J2816L4791a27044o5415k3485e8168j74209
18108b32377i6071A8407J36777d97619b7596j25182J3630k34292J11964B19622
18097C96564f1668j10432O9172A5704a41202A53017a32724j6096n4375A36605
18086A9154f0137j8058A06648B7591f6419j84443K5467B70452a2719r6674h11
18074b3478H9744a81615A36846c39854a49509o9621a1061I814c78753C2711a21225
18062a07131G3335B231P2373d4800o123p1100A41526m5089d47704b15513E5280
18050b92951E0711a3395A31463a83003d8914j69550B24682c38319d3636A1286
$$ plain form
18039 135159 -17480 -285766 -35173 78092 103154 -187201 -97665 11353 44349 319816 -244183
18027 14225 69726 100142 262811 146722 -198521 14259 -132375 -157197 90738 -63956 -375692
18016 -375692 333933 31531 -369778 53603 -9386 -116561 105993 -194728 -73408 131010
18005 141422 163669 -344811 -29997 110811 114940 -87866 -120373 -174207 -242680 -176470 -81245
17993 -82300 -72204 -894 97269 -62832 -13396 129685 239177 -231782 105370 -77223 79849
17981 -39310 -189442 64667 -365841 -13526 -12848 92624 -94038 -1543 -351053 -35381 -186482
17970 -186482 -16135 -64036 180975 -25520 128460 117680 159345 -161036 73054 -18148 165263
17958 -218793 126781 -288837 29780 -265166 -123713 25843 -14595 -188016 94728 -211738
$$ packed form
18039A35159a7480k68286c5173G8092K5062a87201Q9536A1353L2996K75467b44183
18027A4225N5501L0416J62669j16089a98521A4259a32375k4822I0738f3956l11736
18016c75692C33933C1531c69778E3603i386j07175A05993a94728g3408A31010
18005A41422K2247c44811b9997A10811M129h7866l2507n3834o8473O6210h1245
17993h2300J0096h94I7269f2832a3396A29685J09492b31782A05370g7223G9849
17981c9310j50132F4667c65841a3526O78I2624i4038a543l49510c5381j51101
17970a86482a6135m7901A80975b5520A28460j0780M1665a61036G3054a8148A65263
17958b18793A26781b88837B9780b65166a23713B5843a4595j73421I4728b11738
$$ plain form
17947 103064 14080 -93907 -231313 -109803 114281 77248 293483 29536 107205 -320709
17936 81037 71800 -129094 7785 216973 -270407 -191310 -127533 167445 -151686 269357 257647
17925 257647 -183108 -56602 -96624 -90380 -274354 -76925 -101211 -105024 171498 -53632 -184040
17914 -184040 -185243 -38448 2593 -228826 181820 -339624 61227 -192930 -7663 311756 -208621
17902 50988 -134742 -232821 83087 5135 31385 154824 -57663 -240195 -3957 8914 16037 -47568
17889 164360 208566 126072 -40928 -25242 54718 19616 -22028 149715 93976 64024 178759
17878 178759 90497 -118591 -125041 -348425 -17825 -200698 -133101 126340 79878 150321 -32434
17866 142545 -96608 -71226 8291 40112 115206 -277966 129357 143424 293858 -147970 -69063
$$ packed form
17947A03064A4080i3907j37406a09803A14281l7033K16235B9536P7669c20709
17936H1037r237a29094G785K09188b70407P9097O3777A67445a51686B69357j1710
17925B57647a83108e6602m0022O244j83974g6925k4286l813A71498e3632j30408
17914a84040j203c8448B593b28826A81820c39624F1227a92930g663C11756b08621
17902E0988a34742r8079H3087E135K6250J23439e7663j82532c957H914P123d7568
17889A64360M4206q2494d0928J5686E4718A9616b2028A49715n5739k9952J14735
17878A78759q8262a18591o450k23384a7825j82873O7597A26340m6462P0443c2434
17866A42545i6608K5382H291L1821P5094b77966A29357J4067J50434a47970f9063
$$ plain form
17854 153348 -123853 -81032 -174044 -105918 -254528 -83069 270880 -434213 -54612 200641
17843 -22456 139806 -332714 101826 -94690 127050 -76524 -18940 -32471 -10349 -47331 2367
17831 -181412 -76214 -136105 -265665 211453 -419531 -113326 5783 235770 47972 2707 -188480
17819 -260335 220987 -212172 -64279 179678 -59654 -177052 167930 -91991 62269 173721
17809 173721 241297 175991 -95539 -9481 -18084 -103237 16414 61565 -284985 95764 -101840
17797 -33518 141070 96274 -232068 -48587 61194 76562 -141964 -28115 113878 430627 -168508
17785 38093 -114958 147050 -58304 -199391 73596 311083 26443 65583 207169 19486 258976
17774 258976 8313 -104546 30935 -31575 -35182 -295026 -46736 42503 -72979 -227168 50912
$$ packed form
17854A53348a23853M2821r3012O8126j48610h3069B70880d34213e4612B00641
17843b2456A39806c32714A01826i4690A27050g6524a8940j3531a0349l6982B367
17831a81412g6214n9891j29560B11453d19531a13326E783K29987D7972B707a88480
17819b60335B20987b12172f4279A79678e9654j17398A67930i1991F2269J11452
17809A73721O7576o5306i5539i481q603q5153A6414M5151b84985I5764a01840
17797c3518A41070m4796b32068d8587F1194J5368a41964b8115A13878L16749a68508
17785C8093a14958A47050e8304j41087G3596K37487B6443L9140J41586A9486K39490
17774B58976H313a04546C0935c1575l607k59844d6736D2503g2979j54189E0912
$$ plain form
17762 -133185 -409013 -37403 49135 124993 92895 -128565 -119822 293477 119708 56413 165692
17751 165692 219095 264501 151425 -23627 -97834 -250025 -208421 -10043 111891 -197492 125568
17739 -138170 65040 5028 -116205 -13472 -503964 79252 3715 -89120 -13434 -65872 125225
17727 28366 -273286 -120472 -113321 -3263 77613 -145073 176799 -148309 -85457 32832 -136311
17715 -273565 -184860 10374 35317 -190069 -106520 -30847 93797 697 -288919 -164868 177445
17703 239561 -119131 120979 -255463 50683 78385 9249 188663 -1504 143095 4452 53277
17692 53277 -99651 316249 -33360 201478 -341656 -168410 123664 -201852 61429 -46684
17681 150226 265800 219163 -169757 158710 22654 57586 -254580 -93230 110239 109806 287403
$$ packed form
17762a33185k75828c7403D9135P5858l2098a28565Q743B93477A19708E6413J09279
17751A65692N3403M5406j13076b3627p4207j52191M1604a0043A11891a97492A25568
17739a38170F5040E028a16205a3472m90492G9252C715h9120a3434n2438A25225
17727B8366b73286a20472P151c263G7613a45073A76799a48309O2852C2832a36311
17715b73565Q8705A0374K4943a90069Q3549c0847I3797F97b88919J24051A77445
17703B39561a19131A20979b55463E0683K7702I249J79414a504A43095D452M8825
17692E3277i9651C16249c3360B01478c41656a68410A23664b01852F1429d6684
17681A50226J15574m6637a69757A58710B2654L4932b54580i3230A10239m33J77597
$$ plain form
17670 287403 -34823 -33909 96492 123723 104927 207203 47234 -308055 104548 -152821 52145
17658 -12506 145857 -12821 -213678 89314 122758 184460 87875 -22982 -108653 287454 -446406
17646 17288 -46937 101370 -107472 -4520 404839 273557 -48540 -7497 95192 -101063 -8695
17634 -55796 116970 -29838 30151 128443 145702 -207247 360585 19445 -123749 261538 173254
17623 173254 -56359 -119617 44367 -118557 167951 27689 -34361 -34146 -188181 49966 165007
17612 165007 -177889 110114 -291878 321644 -8016 -102797 -154335 98135 32227 211138 -21105
17600 73492 -9263 49160 -31560 -171938 38356 191325 187459 -73755 -84430 -195347 57872
17588 172288 -173856 125751 -151647 -143772 279906 -27501 129115 -104633 39946 -50515
$$ packed form
17670B87403c4823R14I6492K7231j8796J02276D7234c08055A04548a52821E2145
17658a2506A45857a2821k00857H9314L3444O1702H7875b2982q5671B87454d46406
17646A7288d6937A01370a07472d520D04839j31282d8540g497I5192a01063h695
17634e5796A16970b9838C0151R8292J7259b07247C60585A9445a23749B61538q8284
17623A73254e6359o3258D4367a18557A67951B7689c4361K15j54035D9966J15041
17612A65007a77889A10114b91878C21644h016r4781n1538I8135C2227J78911b1105
17600G3492i263D9160c1560j40378C8356J52969l866g3755j0675j10917E7872
17588A72288a73856A25751a51647P875B79906b7501A29115a04633C9946e0515
$$ plain form
17577 -18248 -70126 108115 -91999 -135465 144414 -190783 -156104 -111743 53428 389842 3518
17565 143 -214575 -155055 131319 21352 -150671 16591 175955 -14827 -169194 -12439 40492
17553 137171 78215 -92365 209609 -124053 110335 -241019 144793 215332 -6011 -60675 -113166
17542 -113166 315140 11300 95471 15613 110061 -192998 -52179 202184 32510 208779 -10173
17530 -146000 31626 -234687 -10898 89910 311443 -249546 56668 -845 155182 38160 -138222
17518 -125710 199343 324460 -49185 222647 231234 126629 1307 -136637 -316372 -111290
17507 -42071 -143842 -68199 -113070 -27507 -74839 316477 293875 12215 -165874 -61725 -413615
17496 -413615 82242 155825 308020 56768 131338 135762 -174704 195360 243889 156502 444832
$$ packed form
17577a8248n1878A08115i1999m3466A44414a90783L4679M4361E3428L36414C518
17565A43b14575N9520A31319B1352a50671A6591J59364a4827j54367a2439D0492
17553A37171n8956i2365B09609a24053A10335b41019A44793P0539f011n4664n2491
17542a13166C15140A1300Q4171A5613R4448a92998e2179B02184C2510J76269a0173
17530a46000C1626b34687a0898H9910K21533b49546E6668h45A55182C8160a38222
17518a25710A99343J25117d9185B22647Q587j04605A307a36637j79735a11290
17507d2071j01771f8199m4871b7507m7332C16477k2602A2215a65874f1725l51890
17496d13615H2242P3583J52195E6768P4570M424a74704A95360M8529q7387K88330
$$ plain form
17485 444832 -48025 -57293 135153 7949 7695 368393 287796 6508 135828 -123935 118388
17473 375768 164248 -3077 156752 -24329 82401 -201552 280309 273166 263332 50841 -163376
17461 7055 -9004 45761 107673 -4765 95502 11389 180871 202055 -29414 63272 349159 -32594
17448 293685 108549 191298 477871 264129 398099 216230 29881 92588 161727 298946
17438 298946 213022 -43639 247159 95250 167025 -83863 73218 391147 198251 182385 117143
17427 117143 106433 -87669 175489 203194 239717 58689 -112066 218891 157808 316839 104061
17415 324660 -39537 218623 94374 205294 209624 186594 -164655 20766 65384 -24095 40049
17403 80422 340273 -195360 339340 117945 94674 72366 426612 86280 -153900 8958 496101
$$ packed form
17485D44832d8025r268A35153G949k54L60698q0597F508J29320a23935A18388
17473C75768A64248c077A56752b4329H2401b01552B80309p143r834E0841a63376
17461G055i004D5761O1912d765I5502A1389J69482K1184b9414F3272K85887c2594
17448B93685A08549Q2749K86573k13742J33970j81869B9881O2707O9139J37219
17438B98946q5924d3639B47159I5250P1775h3863G3218L17929j92896j5866o5242
17427A17143j0710h7669A75489K7705L6523E8689a12066B18891o1083J59031A04061
17415C24660c9537B18623I4374J10920M330k3030a64655B0766M4618b4095D0049
17403H0422K59851a95360C39340A17945k3271k2308L54246H6280a53900H958M87143
$$ plain form
17392 496101 316866 118697 521016 257879 183697 209258 382827 110266 587672 22975
17381 222279 118524 169587 -135855 -59941 264022 48244 -102936 49319 71628 44056 18298
17369 214148 109747 286664 310288 -150729 278642 -328094 -214000 234020 342679 441387
17359 441387 -1924 37071 323733 168027 167621 223492 -32934 205088 363289 302261 123388
17347 323392 496717 148409 -21397 398863 287615 318240 154739 -86016 62594 -57737
17336 50281 36309 -43801 111066 -46887 -89395 217374 194813 120135 141060 220066 122524
17325 122524 -224187 138340 296954 -43847 190642 -167250 448841 -3796 229418 -65146
17314 -42 190577 30684 148056 153705 -61106 9223 39183 233035 -95494 224981 103001 115355
$$ packed form
17392D96101j79235A18697M02319B57879p4182K5561J73569A10266M77406B2975
17381B22279j03755N1063a35855e9941B64022D8244a02936D9319K2309k7572A8298
17369B14148j04401J76917K3624a50729B78642c28094J14094B34020J08659R8708
17359D41387a924C7071K86662j55706m06N5871c2934B05088J58201o1028A23388
17347C23392J73325A48409b1397C98863j11248L0625A54739h6016F2594e7737
17336E0281j3972d3801A11066d6887m2508B17374k2561p4678K0925P9006r7542
17325A22524b24187A38340J58614d3847A90642a67250D48841c796B29418f5146
17314d2A90577C0684J17372N649f1106I223K9960J93852i5494B24981A03001J2354
$$ plain form
17302 115355 186327 231583 270816 -92512 -122582 -167005 70396 495373 114223 159936 95046
17291 95046 330291 550727 241383 273584 190438 -82619 125886 190181 148672 89783 -228124
17279 142742 214708 285640 -59465 187226 68884 312774 21437 97075 88398 -122096 97639
17267 68805 171075 170041 144497 266298 94692 -27127 177684 186160 187438 18433 170484
17256 170484 315755 80484 175052 224565 -75062 114894 299479 118025 121498 1473 170745
17245 170745 120034 198505 93344 58527 33783 114027 123138 131412 309532 275408 340106 91247
17232 292489 277068 249098 169080 -189658 302741 180561 115925 -167444 -35504 161608
17221 232048 5517 348685 138893 -142016 221549 92998 85348 -99574 469639 178541 363454
$$ packed form
17302A15355P0972M5256L9233i2512l0070m4423G0396M24977A14223M5713o4890
17291I5046K35245K20436B41383L2201q3146h2619A25886O4295m1509n8889b28124
17279A42742P1966P0932e9465A87226F8884K43890B1437P5638q677a22096I7639
17267F8805J02270j034k5544J21801I4692b7127A77684Q476J278A8433J52051
17256A70484J45271H0484R4568M9513g5062A14894J84585A18025L473A473J69272
17245A70745n0711P8471I3344l4817k4744Q0244R111Q274J78120l4124O4698I1247
17232B92489j5421k7970q0018a89658C02741j22180o4636a67444c5504A61608
17221B32048E517L43168A38893a42016B21549I2998p650i9574D69639A78541J84913
$$ plain form
17210 363454 165320 241060 78179 178344 -30189 429139 44543 249137 459428 236282
17200 236282 228452 164513 633852 149206 169369 150320 166326 372683 127942 274611 408544
17189 408544 366240 315831 444342 472944 150134 422743 204131 448995 102215 310133
17179 310133 202631 396972 -4482 251143 265616 160838 301954 449772 140176 233589
17169 233589 -128667 433404 -127335 84796 -104941 200721 55404 752572 151702 315795
17159 315795 297587 237752 214371 19951 264594 179902 389006 250006 314560 107694 247331
17148 247331 -19232 146650 617999 186291 -34710 536421 156688 309365 184393 396425
17138 396425 452024 419491 269084 327107 117396 103114 138002 347288 445539 514673 -212841
$$ packed form
17210C63454A65320P5740G8179J00165c0189D29139D4543K04594K10291k23146
17200B36282p830o3939M69339A49206K0163j9049J6006K06357A27942J46669J33933
17189D08544m2304n0409J28511K8602A50134K72609B04131K44864A02215K07918
17179C10133j07502J94341d482B51143J4473j04778J41116J47818A40176R3413
17169B33589a28667D33404a27335H4796a04941B00721E5404O97168A51702J64093
17159C15795j8208n9835k3381A9951K44643q4692K09104j39000O4554A07694J39637
17148B47331a9232A46650M71349A86291c4710E36421A56688J52677j24972K12032
17138C96425N5599l2533j50407N8023A17396j4282L4888K09286R8251O9134b12841
$$ plain form
17126 251186 148499 406621 182242 270505 105857 193570 387660 244077 298798 351909
17116 351909 246415 310641 465923 340220 690029 333727 41643 331481 457972 158794
17105 338148 201686 -961 491233 498923 264909 99515 337270 276138 244498 251393 529119
17094 529119 481812 303109 406329 481481 930484 159515 297130 548890 621162 552117
17084 552117 390215 602178 151087 266503 72839 83799 731027 447018 334309 600478
17074 600478 154595 558185 334237 242396 541861 268186 462742 519374 672158 344164
17064 344164 320774 240985 504777 514655 295327 470476 342014 561054 400473 144971
17053 422179 365133 500163 471170 433596 340900 647361 434051 629719 374338 637410
$$ packed form
17126B51186j02687K58122A82242Q8263A05857Q7713J94090j43583N4721N3111
17116C51909j05494O4226J55282j25703L49809C33727D1643K89838J26491A58794
17105C38148j36462i61D91233P690k34014I9515K37755o1132l1640O895K77726
17094E29119m7307j78703J03220P5152M49003A59515J37615K51760P2272o9045
17084E52117j61902K11963A51087J15416G2839J0960O47228k84009j12709K66169
17074F00478A54595M03590k23948r1841K99465B68186J94556N6632J52784l27994
17064C44164k3390p9789K63792R878k19328J75149j28462K19040j60581A44971
17053D22179n7046J35030k8993l7574r2696L06461k13310J95668k55381K63072
$$ plain form
17043 637410 298236 459287 766575 470216 473757 540579 611750 326826 452871 740333
17033 740333 500423 398535 238770 385776 378890 660766 496041 670137 281957 1022201
17023 1022201 760668 396429 768024 769572 493202 652167 669289 327256 765288 789269
17013 789269 479317 384859 707504 738466 832836 501818 739754 584794 412248 627180
17003 627180 691210 509667 790543 285644 316595 767655 809617 811083 718816 654530 544285
16992 544285 539889 871830 882109 633000 903817 703979 682774 783577 712355 730122 576899
16981 576899 508777 767728 896506 899561 744003 970069 758063 634432 982260 755257
16971 755257 759276 823954 921303 1061406 925860 933267 1097402 791021 823075 980866 1003931
$$ packed form
17043F37410B98236J61051L07288k96359L541O6822P1171k84924J26045K87462
17033G40333k39910j01888j59765J47006o886K81876j64725J74096B81957P40244
17023A022201k61533l64239L71595J548k76370J58965J7122C27256M38032K3981
17013G89269l09952r4458L22645L0962R4370l31018K37936j54960j72546K14932
17003F27180O4030j81543K80876B85644L0951M51060M1962J466r2267o4286j10245
16992E44285m396L31941J0279k49109K70817j99838k1205J00803p1222J7767j53223
16981E76899o8122K58951J28778L055j55558K26066k12006j23631L47828k27003
16971G55257M019O4678R7349J40103j35546P407J64135l06381L2054J57791K3065
$$ plain form
16960 1003931 939931 654574 984544 749384 1198210 1080203 1056229 801651 923838 1027733
16950 1027733 981732 903535 816409 1170989 1157712 1087448 999030 954636 1184699 1053033 1029109
16939 1029109 1173921 1076248 978479 968355 1262290 1192599 1044047 984920 1240700 1062765
16929 1062765 1357022 1213472 1125811 1074056 1333061 1395996 1468676 1286705 1169403 1265577
16919 1265577 1322527 1358469 1452506 1528987 1267579 1332542 1396740 1301409 1380081 1468844 1635439
16908 1635439 1597666 1576767 1883285 1390881 1694534 1334789 1798099 1866899 1852634 1791334
16898 1791334 1795722 1726054 1719310 1874266 1611675 1879378 1662104 1575022 1561554 1879732 1821880
16887 1821880 1818802 2085597 1943892 1887793 2023283 2083059 2275315 2130017 2033745 2025031 2115889
$$ packed form
16960A003931o4000k85357L29970k35160M48826j18007k3974k54578J22187J03895
16950A027733m6001p8197q7126L54580j3277p0264q8418m4394K30063j31666k3924
16939A029109J44812r7673r7769j0124K93935o9691j48552n9127K55780j77935
16929A062765K94257j43550q7661n1755K59005O2935P2680j81971j17302R6174
16919A265577N6950L5942R4037P6481k61408O4963O4198r5331P8672Q8763J66595
16908A635439l7773k0899L06518m92404L03653l59745M63310O8800j4265o1300
16898A791334M388o9668o744J54956k62591K67703k17274q7082j3468L18178n7852
16887A821880l078K66795j41705n6099J35490N9776J92256j45298r6272q714R0858
$$ plain form
16876 2115889 1978417 2498633 2467145 2227766 2280595 2258223 2201704 2551960 2267811 2338279
16866 2338279 2536898 2418578 2017801 2741056 2822157 2710134 2526811 2684123 2743428 2615546
16856 2615546 2697057 2734744 3167437 2815189 2620697 2801323 2935631 2899093 2956755 2880630
16846 2880630 2985007 3280056 3442214 3487804 3420132 3372331 3522500 3477700 3240775 3838159
16836 3838159 3778124 3731068 3713185 4106359 4233810 3878348 4110486 3910900 3973253 4242989
16826 4242989 4223170 4634064 4589857 4603404 4593957 4994000 4806280 5114601 5028377 5152907
16816 5152907 5291677 5414858 5540302 5362126 5804851 5766989 5865552 6205674 6461660 6223398
16806 6223398 6489889 6654717 6611201 6772704 7272334 6955551 7199148 7684609 7559164 7967301
$$ packed form
16876B115889j37472N20216l1488k39379N2829k2372n6519L50256k84149P0468
16866B338279J98619j18320m00777P23255Q1101j12023j83323J57312N9305j27882
16856B615546Q1511L7687M32693l52248j94492J80626J34308l6538N7662p6125
16846B880630J04377K95049J62158M5590o7672m7801J50169m4800k36925N97384
16836C838159o0035m7056j7883L93174J27451l55462K32138j99586O2353K69736
16826D242989j9819M10894m4207J3547r447M00043j87720L08321q6224J24530
16816E152907J38770J23181J25444j78176M42725l7862R8563L40122K55986k38262
16806F223398K66491J64828m3516J61503M99630l16783K43597M85461j25445M08137
$$ plain form
16796 7967301 8202144 8164721 8280851 8506204 8899771 9196403 9299376 9601206 9568123 10086095
16786 10086095 9893076 10529363 11205692 11163361 11693178 11795718 12406764 12309041 13145178 13504195
16776 13504195 13764997 14269078 14503069 14922986 15437737 15794476 16485609 17041420 17271551
16767 17271551 18133251 18865942 19683202 20435258 20932577 21970081 22583724 23446576 24464076
16758 24464076 25438844 26700149 27688012 29103615 29919199 31556484 32958792 34423525
16750 34423525 36009586 37922875 39482956 41563592 43653791 45983100 48323422 50536598
16742 50536598 53407766 56455208 59624294 62554188 66149482 70089332 73794209 78312567
16734 78312567 82764016 87219249 92468341 97825332 103135288 109032545 114505896 120408553
$$ packed form
16796G967301K34843l7423J16130K25353L93567K96632J02973L01830l3083N17972
16786A0086095j93019O36287O76329m2331N29817J02540O11046r7723Q36137L59017
16776A3504195K60802N04081K33991M19917N14751L56739O91133N55811K30131
16767A7271551Q61700P32691Q17260P52056M97319J037504O13643Q62852J017500
16758B4464076R74768J261305R87863J415603Q15584J637285J402308J464733
16750C4423525J586061J913289J560081K080636K090199K329309K340322K213176
16742E0536598K871168L047442L169086K929894L595294L939850L704877M518358
16734G8312567M451449M455233N249092N356991N309956N897257N473351N902657
$$ plain form
16726 120408553 126482438 132316310 137856115 143542568 148782558 152996913 156953727 160030135
16718 160030135 162569078 163525763 163798719 162983266 161585328 158924822 155186808 151076662
16710 151076662 146241832 141134533 135351495 129522825 123219899 117527554 111319013 105441183
16702 105441183 99795060 94389161 89530351 84459800 79442389 74995073 71090316 67051358
16694 67051358 63304624 59925179 56737493 53592842 50512386 48304028 45724824 43610546
16686 43610546 41430742 39155475 37338658 35118924 33788401 32384303 30834081 29527838
16678 29527838 28329847 27051644 25820172 24452414 23852369 22582244 21603501 20863300
16670 20863300 20212252 19383569 18726707 17934660 17521606 17036243 16011586 15516909 14909313
$$ packed form
16726A20408553O073885N833872N539805N686453N239990M214355L956814L076408
16718A60030135K538943R56685K72956q15453j397938k660506l738014m110146
16710A51076662m834830n107299n783038n828670o302926n692345o208541n877830
16702A05441183n646123n405899m858810n070551n017411m447316l904757m038958
16694F7051358l746734l379445l187686l144651l080456k208358k579204k114278
16686D3610546k179804k275267j816817k219734j330523j404098j550222j306243
16678B9527838j197991j278203j231472j367758o00045j270125r78743p40201
16670B0863300o51048q28683o56862p92047m13054m85363j024657m94677o07596
$$ plain form
16661 14909313 14640948 14101919 13795549 13349875 12515910 12313721 11983366 11665616 11203838
16652 11203838 10776985 10416634 10072084 10264569 9765581 9406096 9206442 8900564 8667393
16643 8667393 8597332 8049883 8086112 7543812 7488558 7304765 7191505 7227344 6442842 6548484
16633 6548484 6578826 6218651 6005070 6072089 5942242 5717078 5477229 5502200 5185957 5353981
16623 5353981 5087750 4941965 4804444 4843349 4871819 4615556 4513675 4314982 4575459 4138691
16613 4138691 4410134 3795801 3811170 3968271 3892602 3829425 3372614 3711433 3582144 3452486
16603 3452486 3655540 3075012 3045994 3162149 3184572 3401435 3056634 3356890 3192037 2604667
16593 2604667 2734024 2757038 2818549 2926170 2729389 2729959 2692848 2695991 2605714 2444832 2557055
$$ packed form
16661A4909313k68365n39029l06370m45674q33965k02189l30355l17750m61778
16652A1203838m26853l60351l44550J92485m98988l59485j99654l05878k33171
16643H667393p0061n47449L6229n42300n5254j83793j13260L5839p84502J05642
16633F548484L0342l60175k13581O7019j29847k25164k39849K4971l16243J68024
16623E353981k66231j45785j37521L8905K8470k56263j01881j98693K60477m36768
16613D138691K71443o14333J5369J57101p5669o3177m56811L38819j29289j29658
16603C452486K03054n80528k9018J16155K2423K16863l44801L00256j64853n87370
16593B604667J29357K3014O1511J07621j96781N70l7111L143r0277j60882J12223
$$ plain form
16582 2557055 2373882 2520374 2069659 2157873 2292070 2221910 2146645 1823775 2064535 2087019
16572 2087019 1939889 2028608 1945886 2132818 1574965 2023513 1938746 1780933 1766813 1452734
16562 1452734 1616142 1555635 1819264 1746158 1405670 1611159 1764234 1622537 1723581 1150335
16552 1150335 1470084 1406694 1593946 1570839 1513016 1192873 1492268 1437188 1101825 998592
16542 998592 1105718 1047977 1328289 1468489 1455095 1211624 1219614 1231568 1018719 1491767
16532 1491767 935795 1478950 995954 1031097 1058994 1203984 890312 1186161 1117916 1244389
16522 1244389 1163202 918559 1003825 599609 902314 1154355 858599 1119650 614086 852008
16512 852008 920646 726060 846733 879369 941254 561504 751292 1036163 923373 1104413
$$ packed form
16582B557055j83173J46492m50715Q8214J34197p0160p5265l22870K40760K2484
16572B087019j47130Q8719q2722J86932n57853M48548q4767j57813j4120l14079
16562A452734J63408o0507K63629p3106l40488K05489J53075j41697J01044n73246
16552A150335L19749o3390J87252k3107n7823l20143K99395n5080l35363j03233
16542I98592J07126n7741K80312J40200j3394k43471P990J1954k12849M73048
16532A491767n55972N43155m82996L5143K7897J44990l13672K95849o8245J26473
16522A244389q1187k44643Q5266m04216L02705K52041k95756K61051n05564K37922
16512H52008O8638j94586J20673L2636O1885l79750J89788K84871j12790J81040
$$ plain form
16502 1104413 712936 907455 692443 780418 491879 867268 547008 838227 708293 569591
16492 569591 562241 491417 661573 883753 689199 473460 1025853 794806 614032 840961
16482 840961 620145 166392 506379 938018 570853 617249 762775 920509 812956 496647
16472 496647 342378 842624 542483 508096 603208 806694 431796 642909 368284 383880
16462 383880 323751 741845 411759 53969 640800 816543 400667 522058 379579 563601
16452 563601 480110 542911 239528 429279 542678 685921 426560 243129 653829 486414
16442 486414 821094 25818 203569 436574 509992 529723 100120 123000 88632 312966
16432 312966 556237 395012 491327 243463 352376 400166 551254 439514 470581 120754
$$ packed form
16502A104413l91477J94519k15012Q7975k88539L75389l20260K91219j29934j38702
16492E69591p350p0824J70156K22180j94554k15739N52393k31047j80774K26929
16482H40961k20816A66392L39987M31639l67165M6396J45526J57734j07553l16309
16472D96647j54269N00246l00141l4387R5112K03486l74898K11113k74625J5596
16462C83880o0129M18094l30086E3969N86831J75743D00667J21391j42479J84022
16452E63601q3491O2801B39528J89751J13399J43243k59361j83431M10700j67415
16442D86414L34680B5818J77751K33005P3418J9731A00120K2880l4368K24334
16432C12966K43271j61225R6315B43463J08913M7790J51088j11740L1067A20754
$$ plain form
16421 262359 541302 133510 643027 450642 304744 756201 199544 307753 454807 -228307
16410 559624 229426 694849 164735 23107 285544 109441 455119 507340 500627 429579
16400 429579 231386 560177 431313 260567 -128486 583174 509683 352247 387041 5353
16389 492991 623893 538873 298372 18293 445240 -7364 590493 475273 136093 308390
16379 308390 264692 248617 190347 295676 307504 217272 90321 242181 -230085 3300 131823
16368 131823 430706 207242 511534 166521 136726 244776 333818 330827 -92212 182936
16357 277492 71532 317012 171857 118323 228959 52553 189925 175139 230734 144183 352005
16346 352005 277648 216056 178804 141938 96055 231878 246790 171242 308335 398075 353618
$$ packed form
16421B62359K78943A33510N09517j92385j45898M51457A99544J08209J47054b28307
16410E59624B29426M65423A64735B3107K62437A09441L45678N2221o713p1048
16400D29579j98193L28791j28864j70746a28486E83174p3491j57436L4794E353
16389D92991J30902q5020k40501A8293M26947g364E90493j15220A36093J72297
16379C08390m3698j6075n8270J05329J1828r0232I0321J51860b30085C300J28523
16368A31823K98883B07242L04292A66521k9795J08050Q9042k991i2212A82936
16357B77492G1532K45480j45155n3534J10636E2553J37372j4786N5595q6551K07822
16346C52005p4357o1592l7252l6866m5883J35823J4912p5548J37093Q9740m4457
$$ plain form
16335 353618 313248 85137 214608 108181 -100095 384870 233854 109900 524437 124271
16324 -73495 215962 455173 39737 332226 297126 -35978 47584 119973 113648 240871 -250204
16312 236123 402879 73851 131627 -32118 111825 84866 133413 277319 288001 431922 91609
16300 353365 6390 220428 -85576 -319760 137602 125680 70533 194245 20232 -2988 -28396
16289 -28396 -11117 175807 76343 -203428 251104 -28605 -85854 310279 402040 -248147 -24598
16277 12102 577128 258862 218258 84816 -47304 139100 -96641 -19912 -293437 99060 141008
16266 141008 438041 121893 -22631 20004 316397 33435 81799 421916 -189209 -258489
16256 -258489 -2507 93893 25721 184718 159093 23942 -59997 -118826 -36349 -97003 28603
$$ packed form
16335C53618m0370H5137J29471j06427a00095C84870j51016A09900M14537A24271
16324g3495B15962K39211C9737K92489l5100c5978D7584P2389o325J27223b50204
16312B36123J66756G3851N7776c2118A11825k6959M8547J43906J0682J43921I1609
16300C53365F390K14038h5576k34184A37602j1922n5147J23712B0232b988k5408
16289b8396a1117A75807G6343b03428B51104b8605n7249C10279R1761b48147b4598
16277A2102N65026B58862m0604H4816d7304A39100i6641a9912k73525I9060M1948
16266A41008K97033A21893b2631B0004K96393C3435M8364L40117a89209o9280
16256b58489b507I3893B5721J58997k5625B3942e9997n8829c6349o0654B8603
$$ plain form
16244 103339 19844 -82616 125198 55787 -84970 244384 206769 -259023 108577 322082
16234 322082 61938 90247 288996 71745 32437 289049 37722 293437 -153726 56204 219267
16223 219267 -168930 -139139 341722 -8838 218987 -267425 -71921 -102121 202517 164562 46792
16211 111058 107390 4837 -142466 71377 266387 -307717 -4642 162791 -100771 5512 -179757
16199 244139 96293 -10524 111660 -123791 162641 128950 -26948 -9825 77343 18647 -74397
16187 74419 -33154 167527 -28369 314553 80792 161170 381232 259924 -9024 75509 -1529
16175 -186969 -39004 234409 -72097 277209 -152068 153364 42041 252725 69941 326614
16165 326614 329477 186962 -150564 -41320 147200 29998 113966 181392 -164742 226732 -54786
$$ packed form
16244A03339A9844h2616A25198E5787h4970B44384l7615b59023A08577K13505
16234C22082F1938K8309J98749G1745C2437K56612C7722K55715a53726E6204J63063
16223B19267a68930K9791C41722h838B18987b67425g1921l0200B02517l7955D6792
16211A11058l668D837a42466G1377J95010c07717d642A62791a00771E512a79757
16199B44139I6293a0524A11660a23791A62641l3691b6948i825G7343A8647g4397
16187G4419c3154A67527b8369C14553H0792Q0378K20062j21308i024G5509a529
16175a86969c9004B34409g2097B77209a52068A53364D2041K10684F9941K56673
16165C26614K863j42515a50564d1320A47200B9998Q3968O7426a64742B26732e4786
$$ plain form
16153 94029 -43516 4721 -26025 346825 -202035 -10354 153580 54168 131356 135216 -101590
16141 -320861 -43365 -409079 201316 182543 -450686 200399 14895 99224 -216571 205816
16130 -98712 -180948 83406 -114458 297150 73008 -315798 241419 -154151 15857 -180967
16119 60817 -241730 -713 126513 -116319 -230708 54095 339139 -100759 93493 -115032 -187433
16108 -187433 47252 -121147 -108052 65679 -36218 63341 329348 187075 175634 225693 -31251
16096 -5030 216772 -51612 -367068 160435 16365 194054 275444 -386758 59221 -25574 -176932
16085 -176932 89244 -85228 -28230 -67105 98018 287191 -26996 110534 -119318 -12170 18911
16073 367597 11785 99265 -209883 520068 -152375 406545 -83122 42990 149941 -91547
$$ packed form
16153I4029d3516D721b6025C46825b02035a0354A53580E4168P7188L860a01590
16141c20861d3365l65714B01316j8773d50686B00399A4895Q4329b16571B05816
16130i8712q2236H3406a14458B97150G3008c15798B41419a54151A5857a80967
16119F0817b41730g13A26513a16319j14389E4095K85044a00759I3493a15032p2401
16108a87433D7252a21147J3095F5679c6218F3341K66007j42273j1441N0059c1251
16096e030B16772e1612l15456A60435A6365J77689Q1390c86758E9221b5574j51358
16085a76932H9244h5228b8230l8875I8018J89173b6996A10534a19318a2170A8911
16073C67597A1785Q7480b09883E20068a52375D06545h3122D2990J06951i1547
$$ plain form
16062 -343237 -124313 -242161 -132780 -13627 1435 290327 -154190 83578 132975 -39303 -102078
16051 -102078 -152734 49646 -26776 -134249 -27424 49058 161282 43423 -72694 255708 324714
16040 324714 -203924 -186921 -331353 -2538 -313358 62131 84324 -11483 -404067 -225607 -77926
16028 -330537 143238 92623 156011 -31755 182190 71365 -323688 -100640 93051 -84906 -47913
16017 -47913 146227 60444 270302 -28355 229700 140861 49230 568 166310 -184403 246606
16005 -47224 27296 -131399 -126016 6992 57358 -51984 -225031 69069 42990 16595 -191351
15993 -250104 31613 17786 54250 -264633 -71465 -97173 176051 -4353 130315 69736 170541
15982 170541 179475 282823 137403 13422 88960 194769 165119 142026 24434 -142081 272054
$$ packed form
16062c43237a24313j17848J09381a3627A435K88892a54190H3578M9397c9303o2775
16051a02078n0656D9646b6776j07473b7424D9058J12224D3423g2694B55708O9006
16040C24714b03924J7003j44432b538l10820F2131K2193a1483l92584J78460g7926
16028c30537A43238n0615O3388c1755A82190G1365c23688a00640I3051h4906L6993
16017d7913A46227F0444K09858b8355B29700q8839D9230E68J65742a84403B46606
16005d7224B7296a31399N383F992N0366e1984j73047F9069k6079A6595a91351
15993b50104C1613j3827L6464b64633g1465k5708A76051d353A30315o0579J00805
15982A70541Q934J03348A37403A3422P5538J05809k9650k3093B4434a42081B72054
$$ plain form
15970 -103529 207343 -164731 125835 45629 -264606 58591 134142 -72204 -250546 -70170
15959 130310 115961 -18054 280973 15236 -110744 34990 168547 126383 -304254 114153
15948 298378 -132307 157806 101396 -196268 -282184 182349 -58581 -110418 -58544 -244144
15938 -244144 -75411 168985 81868 120722 -422409 122896 -70775 -118679 -120721 -23423 -362695
15927 -362695 -166997 -82241 -150922 -79756 -148606 128513 66620 -68553 -318310 66702 -303796
15915 -219075 -72616 105120 18105 405527 -452445 39560 -136588 -94032 -340764 9196 -166941
15903 427786 92317 -56797 130575 -340344 56150 -380300 33468 -81317 -318286 -212950
15893 -212950 12259 238811 205233 -327305 105182 5924 -42795 -69353 -110016 -89918 33061
$$ packed form
15970a03529B07343a64731A25835D5629b64606E8591P5551g2204j78342g0170
15959A30310j4349a8054B80973A5236a10744C4990J33557m2164c04254A14153
15948B98378a32307A57806n6410a96268q5916A82349e8581n1837N1874j85600
15938b44144g5411A68985H1868L8854d22409A22896g0775m7904k042b3423l39272
15927c62695a66997h2241o8681P1166o8850A28513o1893f8553k49757F6702c03796
15915b19075g2616A05120A8105L87422d52445C9560a36588M2556k46732I196a66941
15903D27786I2317e6797A30575c40344E6150c80300C3468h1317k36969J05336
15893b12950A2259K26552l3578c27305A05182E924d2795k6558m0663K0098C3061
$$ plain form
15881 30684 -103462 -187827 -636491 200394 -118567 66576 -74090 -268117 -91928 -3753 97731
15869 112693 -135140 4032 -22512 -435634 -106114 -3336 -80837 -247243 219069 -17399 -178855
15858 -178855 -460628 322699 -7935 -60913 -76814 50905 130338 -152024 121092 -172418 3345
15846 -266071 15342 -11835 -82159 -113843 -316087 119678 27177 153990 -31019 186125 90261
15834 -225273 167695 27151 104753 -198745 -56403 4262 -146148 -142436 -2823 103350 -60779
15822 -22078 53273 -161526 8044 -20263 -458402 -20647 36468 -105588 -57111 46386 -156662
15810 -231841 114455 -357276 18771 -39484 -44369 16938 -79206 19311 67942 15716 -39486
15798 -63140 35996 139176 -396406 51564 -212763 228403 -24990 59476 -219130 131205
$$ packed form
15881C0684a03462q4365m48664B00394a18567F6576g4090j94027i1928c753I7731
15869A12693a35140D032b2512m13122a06114c336p7501j66406B19069a7399j61456
15858a78855k81773C22699g935n2978j5901E0905P9433a52024A21092a72418C345
15846b66071A5342a1835p0324l1684k02244A19678B7177J26813c1019A86125I0261
15834b25273A67695B7151P7602a98745e6403D262a46148L712b823A03350f0779
15822b2078E3273a61526H044b0263m38139b0647C6468a05588M8477D6386a56662
15810b31841A14455c57276A8771c9484m885A6938g9206A9311M8631A5716c9486
15798f3140C5996J03180c96406E1564b12763B28403b4990E9476b19130A31205
$$ plain form
15787 -149855 -275357 454927 -161721 137558 15250 -315481 -177760 -65697 -36177 153763
15776 165286 -223302 -258342 -184735 319977 -70056 -67207 139266 31235 -143367 278060 -102638
15764 221049 89970 -162546 193821 -203047 -241321 117256 84997 73827 117016 109056 132277
15753 132277 581 -41382 -308857 -110926 370226 -331687 65366 102724 124140 -101206 183319
15741 -79561 93349 -115855 -174579 73045 130121 -91233 63915 93041 197732 -217020 -55028
15729 -365123 -58801 -225573 -299327 92379 20945 -82748 -175084 -48721 67675 151874 -104856
15717 108442 -160136 -144157 -186756 -99530 151425 145947 42634 -142925 -580327 -114565 472053
15705 -57514 -285298 75731 -314590 -45220 -42971 -223616 -450397 54874 -39053 -98992 -189894
$$ packed form
15787a49855j25502D54927a61721A37558A5250c15481J37721f5697K9520A53763
15776A65286b23302l5040P3607C19977g0056K849A39266C1235a43367B78060a02638
15764B21049H9970a62546A93821b03047l8274A17256l2259j1170M3189p960K3221
15753A32277E81d1382k67475a10926C70226c31687F5366L7358K1416a01206A83319
15741g9561I3349a15855n8724G3045N7076i1233F3915K9126J04691b17020e5028
15729c65123e8801j66772p3754I2379B0945h2748r2336d8721F7675Q4199a04856
15717A08442a60136J5979m2599Q7226A51425n478D2634a42925m37402a14565D72053
15705e7514k27784G5731c14590d5220K249j80645k26781E4874c9053n9939r0902
$$ plain form
15694 -189894 301285 2804 -11628 91150 239734 163403 112490 278887 40085 200358 -10016
15682 -41999 -302017 -79385 229954 -265152 294777 54884 90260 -131235 -320424 -226824
15672 -226824 225543 -67523 37799 5037 222990 -67519 -133288 -266403 -372600 141687 12084
15660 52109 63173 406901 169340 -121901 -62899 -258175 -168806 -141498 162705 -50866 -467869
15649 -467869 -85824 14683 31479 -172608 -62634 37185 108071 -101232 211316 224785 130012
15638 130012 68663 -211682 -335889 -124183 150949 -294771 32325 -136515 227269 -216587
15627 5073 18371 111714 -68711 161442 192812 394584 164421 302285 -68716 -132750 59805
15615 -19631 273898 197957 73001 -126117 -52736 -207929 -28836 16947 -354494 -207347 35729
$$ packed form
15694a89894C01285B804a1628I1150J48584p6331n0913J66397D0085J60273a0016
15682d1999k60018g9385B29954b65152B94777E4884L5376a31235j89189R3600
15672b26824B25543f7523C7799E037K17953f7519o5769j33115j06197A41687A2084
15660E2109J1064L43728A69340a21901N9002j95276Q9369K7308A62705e0866m17003
15649d67869h5824A4683J6796a72608f2634C7185P0886a01232B11316J3469r4773
15638A30012o1349b11682j24207a24183A50949b94771C2325a36515B27269b16587
15627E073J3298R3343f8711A61442L1370K01772A64421J37864f8716o4034E9805
15615a9631B73898p5941G3001a26117e2736j55193b8836A6947c54494J47147C5729
$$ plain form
15603 143049 -182574 35124 -407245 -86089 59021 256347 -149994 169731 117687 103586
15593 103586 187921 -227232 15381 291045 68926 -77300 185688 172193 57104 -107505 132746
15581 -23323 -130938 -143349 90872 -181335 265361 28144 188025 13556 219595 73212 -187106
15569 -92155 102292 18792 29749 11823 -148247 19824 263208 -227809 -176214 117376 -80337
15557 -193486 -420221 -20819 -273351 -6578 64626 -165473 115930 70124 66857 -204286 -85219
15545 -21300 52357 -102206 -258782 -144954 -80145 -90830 34621 51920 42795 -164124 -58665
15533 -121724 -424763 30479 -85700 -25833 -194258 259325 -214804 348341 -217471 173254
15522 -88866 -153065 193032 -21823 62528 -7889 61863 40451 115720 238217 5884 56613 -127147
$$ packed form
15603A43049a82574C5124d07245h6089E9021J97326a49994A69731n2044j4101
15593A03586Q4335b27232A5381K75664F8926g7300A85688j3495E7104a07505A32746
15581b3323j07615j2411I0872a81335B65361B8144J59881A3556K06039G3212a87106
15569i2155A02292A8792J0957A1823a48247A9824K43384b27809N1595A17376h0337
15557a93486k26735b0819k52532f578F4626a65473A15930m5806l267b04286h5219
15545b1300E2357a02206j56576J13828O4809j0685C4621J7299r125a64124e8665
15533a21724l03039C0479h5700b5833j68425B59325b14804C48341b17471A73254
15522h8866o4199A93032b1823F2528g889F1863k1412P5269J22497E884N0729a27147
$$ plain form
15509 -156290 113927 274797 -227839 1139 277951 -40028 -156780 41858 22955 231225
15499 231225 124308 138720 -204416 247378 102527 56014 -50332 67855 1546 253540 -215842
15487 -9397 -189387 59526 -185821 304365 -171065 227287 -183601 -71094 -142939 86234 -64516
15475 -30261 -130234 -55371 -99403 -174092 69418 -120917 -224216 82303 -130254 -101711 303960
15463 65961 -193028 390906 57741 -126051 291429 -3783 -156940 -74213 287826 61947 175356
15452 175356 -16669 135495 290396 209301 -72490 -228564 -242798 -163300 -61355 21086 33724
15441 33724 -195227 -42862 -180140 -231693 -173586 -51977 174199 -128753 365397 30185 9339
15429 35252 45101 77200 -112921 -145501 63357 228221 29521 -14997 -394909 50314 -203601
$$ packed form
15509a56290A13927J60870b27839A139K76812d0028j16752D1858j8903K08270
15499B31225j06917J4412b04416B47378A02527m6513e0332F7855A546K51994b15842
15487i397j79990E9526a85821C04365a71065B27287a83601g1094p1845H6234f4516
15475c0261r9973e5371m4032p4689F9418a20917j03299H2303a30254K8543C03960
15463F5961a93028C90906E7741a26051B91429c783j53157g4213B87826F1947J13409
15452A75356a6669A35495J54901q1095g2490j56074j4234P9498f1355B1086J2638
15441C3724a95227d2862j37278n1553N8107e1977A74199a28753C65397C0185I339
15429C5252R849L2099a12921l2580F3357J64864B9521a4997l79912E0314b03601
$$ plain form
15417 217608 -364474 -57074 -332741 -94015 68666 254752 241434 51196 142435 78558 33133
15405 63517 -164341 -263042 239002 93317 -166306 7097 -83591 187504 242059 -25239 56132
15393 30246 -44564 -210389 -207245 399688 103819 -108984 23550 -114045 59717 125024 109921
15382 109921 -85091 -174701 -77279 32692 -149935 151453 -164758 -159858 35958 -1148 50298
15370 -270304 -101729 223656 -101176 17549 159228 60661 -168947 105705 -26006 -172855
15360 -172855 15961 108637 -264473 -39937 -81681 233731 90856 41641 21108 273236 -77755
15348 -222304 -94162 -182462 22882 88741 215355 -93199 -33384 48639 33626 -192827 452776
15336 159259 -285095 173617 226661 209440 -26817 -185261 161687 141752 -109069 -50284
$$ packed form
15417B17608c64474e7074k75667i4015F8666J86086j3318E1196R1239o3877C3133
15405F3517a64341r8701B39002I3317a66306G097h3591A87504N4555b5239E6132
15393C0246d4564j65825L144C99688A03819a08984B3550a14045E9717O5307j5103
15382A09921h5091q9610g7279C2692a49935A51453a64758M900C5958a148E0298
15370b70304a01729B23656a01176A7549J41679F0661a68947A05705b6006j46849
15360a72855A5961R2676b64473c9937m1744B33731I0856D1641k0533K52128g7755
15348b22304i4162q8300B2882O5859J26614i3199c3384D8639j5013a92827D52776
15336A59259b85095A73617N3044j7221b6817j58444A61687j9935a09069e0284
$$ plain form
15325 -15736 -117884 -241480 71673 55526 196120 12152 127305 62897 -223048 -106447
15314 -69125 416320 -84483 -66083 160377 93984 9095 84188 86184 108794 82686 -103813
15302 -110802 -93841 80406 -159518 1263 23532 191724 -62894 -114408 324752 -257596 197845
15290 -149081 44142 47588 -8695 54937 138503 99250 331187 5660 -10421 -205591 168366
15278 328313 181964 68944 4507 -284423 171491 170046 -105695 151710 41028 -322527 -20442
15266 75509 9633 -106864 -9570 262869 80117 -283622 -19511 45170 -40615 -277178 -69278
15254 60023 152253 98523 15405 144724 103287 -189377 238802 638487 1396084 989135
15244 989135 1033295 1283081 69310 90189 72751 203177 -108559 350836 -87140 18297 37443
$$ packed form
15325a5736j02148j23596G1673j6147J40594A2152J15153F2897b23048a06447
15314f9125D16320h4483J8400A60377o6393I095P5093J996K2610k6108a03813
15302a10802J6961H0406a59518A263K2269J68192f2894n1514C24752b57596A97845
15290a49081D4142L446h695E4937Q3566l9253K31937E660a0421j95170A68366
15278C28313j46349F8944D507b84423A71491j445a05695A51710D1028c22527b0442
15266G5509I633a06864i570B62869H0117b83622a9511D5170d0615k36563f9278
15254F0023R2230n3730A5405J29319m1437a89377B38802L99685P57597m06949
15244I89135M4160K49786F9310K0879j7438J30426a08559C50836h7140A8297J9146
$$ plain form
15233 37443 97768 16768 451444 -214437 492503 -192543 -24958 -110369 -109643 -71287 191248
15221 21893 -48174 207095 -42473 -234073 76098 119661 107769 199776 259081 -163078 -8319
15209 195041 21305 122912 7332 341845 84884 111680 -22624 77206 20043 -60109 157064
15197 344030 -358659 -132994 333103 -111606 27169 167394 38825 188241 -186295 -52230
15186 -58181 -54932 159468 -383741 -60291 138319 -19667 79308 64927 -142098 -69056 27552
15174 360713 112957 35455 152411 28580 53226 -486379 277524 -232582 -245310 -36928
15163 -61865 237835 384453 205012 159446 -62656 207065 -179032 -15352 243807 -123671
15152 -127691 -3125 70338 71515 316008 -117099 82130 -312276 -330499 -65603 160157 270285
$$ packed form
15233C7443O0325A6768M34676b14437D92503a92543b4958q5411P26L8356A91248
15221B1893d8174B07095d2473j91600G6098M3563j1892R2007N9305a63078h319
15209A95041B1305J01607G332L34513H4884K6796b2624G7206B0043f0109A57064
15197C44030c58659a32994C33103a11606B7169J40225C8825J49416a86295e2230
15186e8181L249A59468c83741f0291A38319a9667G9308j4381a42098f9056B7552
15174C60713A12957C5455J16956B8580K4646d86379B77524b32582j2728c6928
15163f1865B37835J46618j79441m5566f2656B07065a79032a5352B43807a23671
15152a27691c125G0338J177K44493a17099H2130c12276j8223f5603A60157J10128
$$ plain form
15141 270285 42518 220879 48094 490784 166301 -54176 171793 -71559 185659 345290
15131 345290 -198792 -189269 -39711 -6692 151828 -114087 -4513 72652 197834 109149 -13918
15119 -148411 -28269 64995 -55609 234049 233153 133061 15231 -44245 -33217 155373 204691
15108 204691 -58224 68740 -122760 196564 -11759 273764 65352 113888 -176013 -27617 -74915
15097 -74915 407525 252706 127683 151389 91429 416381 13176 27082 -19862 -35217 -38174
15086 -38174 52445 267170 -220164 -98844 -21801 -252692 347423 122360 49642 -195208
15075 -120442 236562 -306930 120792 127033 241715 214243 -77839 211118 -179543 285840
15064 360111 -323507 164402 178478 -69510 299014 271492 257446 -45830 261964 133214
$$ packed form
15141B70285D2518J78361D8094M42690A66301e4176A71793g1559A85659J59631
15131C45290a98792R523c9711f692A51828a14087d513G2652J25182q8685a3918
15119a48411b8269F4995e5609B34049q96j00092A5231d4245J1028A55373M9318
15108B04691e8224F8740a22760A96564a1759B73764F5352M8536a76013b7617m7298
15097g4915D07525j54819j25023K3706n9960L24952A3176J3906a9862j5355k957
15086c8174E2445K14725b20164i8844b1801k30891C47423A22360D9642a95208
15075a20442B36562c06930A20792O241J14682k7472g7839B11118a79543B85840
15064C60111c23507A64402J4076f9510B99014k7522j4046d5830B61964j28750
$$ plain form
15054 133214 215912 21900 227126 16734 309019 54722 49128 -47413 265974 -53370 228403
15042 179267 121081 259418 255164 319700 153716 -29939 -101974 -149027 21844 450418 136051
15030 103710 340837 222837 522160 26728 248756 -168256 -22547 5614 -69414 313839
15019 88511 -38668 171257 -27963 -8795 -112812 100753 -266372 11806 240906 105942 116517
15008 116517 442753 210514 -1411 199151 136443 38530 263973 270009 -37674 262921 372154
14997 372154 201672 -242265 156878 252073 172129 -64424 12226 293318 188242 449413
14987 449413 69486 227096 80962 122499 -326580 352398 189338 218812 616009 -37202
14976 340031 26411 305003 143611 120362 101030 378577 -96956 100617 -70040 388039
$$ packed form
15054A33214Q2698B1900K05226A6734K92285E4722n594d7413B65974e3370B28403
15042A79267n8186J38337m254O4536A53716b9939p2035m7053B1844M28574A36051
15030A03710K37127j18000K99323B6728K22028a68256b2547E614f9414C13839
15019H8511c8668A71257b7963h795j04017A00753b66372A1806K29100A05942J0575
15008A16517L26236B10514a411A99151o2708C8530K25443O036c7674B62921J09233
14997C72154j70482b42265A56878R5195p9944f4424A2226K81092j05076K61171
14987D49413F9486J57610H0962M1537c26580C52398j63060K9474L97197c7202
14976C40031B6411K78592A43611k3249j9332K77547i6956A00617g0040C88039
$$ plain form
14965 46801 221 459847 418570 -9642 81060 163632 23288 45939 43298 300375 46453 -67777
14952 319490 -9443 -215716 212680 89355 230663 272184 400259 -29956 506441 33957 369516
14941 369516 167387 330988 287285 98453 -190583 252043 42841 349350 -237215 758933
14930 161418 1498 47142 249481 -41631 206698 73358 265396 448006 -166541 197062
14919 58454 291259 443725 46115 397138 349123 61079 130054 4184 143198 109570 53507
14907 173111 99369 434756 158597 -4167 160343 196528 335154 324839 -42185 227961 490125
14896 490125 133058 406559 204312 348886 403193 128576 136696 208197 -70231 459549
14885 -1173 428407 188091 22691 217508 410719 186260 53260 381923 301850 231517 67444
$$ packed form
14965D6801B21M59626m1277i642H1060Q2572B3288K2651k641K57077D6453f7777
14952C19490i443k06273B12680H9355J41308M1521J28075b9956E06441C3957L35559
14941C69516A67387J63601m3703I8453a90583B52043D2841L06509b37215G58933
14930A61418A498M5644K02339d1631B06698G3358J92038J82610a66541A97062
14919E8454K32805J52466D6115L51023m8015F1079O8975D184J39014l3628E3507
14907A73111p3742L35387A58597d167A60343L6185J38626j0315d2185B27961K62164
14896D90125A33058K73501k02247J44574N4307A28576Q120P1501g0231D59549
14885a173D28407A88091B2691J94817J93211A86260E3260L28663q0073p0333F7444
$$ plain form
14873 311061 233811 164401 343030 135554 170084 10790 325886 208274 245313 114365
14862 168718 731880 70615 207753 382668 219536 477452 516086 340691 536243 25166
14851 644632 608202 292096 212053 733689 442105 291382 202118 333518 357359 216239
14841 216239 453380 416124 194010 250023 481000 305808 308993 189742 260488 300524 263737
14830 263737 237981 506698 396023 469803 506696 217252 453830 392189 714847 490392
14820 490392 311509 303602 572727 431361 258917 398606 133124 353402 537453 475367
14810 475367 383722 425901 141062 687053 460358 617950 339827 784624 394949 583133
14800 583133 302171 609733 301613 11836 198796 629683 587801 244477 484277 351669
$$ packed form
14873C11061p7250o9410J78629A35554L4530A0790L15096j17612L7039A14365
14862A68718N63162G0615J37138J74915j63132K57916L8634j75395J95552B5166
14851F44632l6430B92096q0043N21636k91584j50723q9264J31400K3841j41120
14841B16239K37141l7256A94010N6013K30977j75192L185j19251P0746M0036l6787
14830B63737k5756K68717j10675P3780L6893B17252K36578o1641L22658k24455
14820D90392j78883p907K69125j41366j72444J39689A33124K20278J84051o2086
14810D75367r1645M2179A41062N45991k26695J57592k78123M44797l89675J88184
14800E83133k80962L07562C01613A1836J86960M30887m1882B44477K39800j32608
$$ plain form
14790 351669 584121 325542 305072 308639 560073 238836 238524 626187 241240 156795 501208
14779 501208 292698 395325 321659 401440 436427 599709 410098 449978 574424 360760
14769 360760 259456 280469 133646 249208 746860 601824 431244 595073 370455 515553
14759 515553 167831 225099 145671 500091 277647 397393 340095 580556 43186 758748
14749 758748 442571 221475 561440 424137 465535 597113 534344 229343 459724 561990
14739 561990 770708 331402 700837 398289 414181 466979 510375 758922 492058 617806
14729 617806 282936 451489 896740 442654 510058 608164 631043 839423 746106 493714
14719 493714 862083 663806 636737 263554 940776 715442 512172 719240 749676 823676
$$ packed form
14790C51669K32452k58579k0470L567K51434B38836l12L87663B41240q4445L44413
14779E01208k08510J02627p3666P9781L4987J63282j89611L9880J24446k13664
14769C60760j01304K1013A33646J15562M97652j45036j70580J63829k24618J45098
14759E15553A67831N7268p9428L54420k22444J19746n7298K40461D3186P15562
14749G58748l16177k21096L39965j37303M1398J31578o2769B29343K30381J02266
14739E61990K08718C31402L69435l02548J5892N2798M3396K48547k66864J25748
14729F17806B82936J68553M45251D42654O7404R8106K2879K08380r3317k52392
14719D93714L68369j98277k7069B63554O77222k25334k03270K07068L0436P4000
$$ plain form
14709 823676 659324 354186 519131 413326 671726 1017484 717394 775601 851518 760197
14699 760197 409387 438368 474514 726816 587126 461074 1103537 521755 716437 882488
14689 882488 670964 646411 732662 507064 556766 487677 512689 830811 639276 898272
14679 898272 710945 592365 1008737 698195 842415 616202 889628 558661 917867 980909
14669 980909 778784 814798 803951 1034872 570068 545709 740974 758403 622118 856684
14659 856684 845753 692728 1039138 930771 816226 1231505 1085167 883662 1284834 916255
14649 916255 581961 692161 771067 711926 946321 1067826 806700 946933 772605 906079
14639 906079 1141229 795890 923983 1092272 976524 1106029 1064223 846801 552934 901613
$$ packed form
14709H23676j64352l05138J64945j05805K58400L45758l00090N8207P5917r1321
14699G60197l50810K8981L6146K52302j39690j26052O42463E21755J94682J66051
14689H82488k11524k4553Q6251k25598M9702o9089K5012L18122j91535K58996
14679H98272j87327j18580M16372l10542J44220k26213K73426l30967L59206O3042
14669I80909k02125L6014j0847K30921m64804k4359J95265J7429j36285K34566
14659H56684j0931j53025L46410j08367j14545M15279j46338k01505M01172l68579
14649I16255l34294J10200P8906n9141K34395J21505k61126J40233j74328J33474
14639I06079K35150l45339J28093J68289j15748J29505m1806k17422k93867L48679
$$ plain form
14629 901613 995021 839910 969941 1187132 1072779 1186560 1192871 1127057 1178245 1449921
14619 1449921 903058 1274578 1107644 1118650 1019311 865291 1180614 1037643 1125321 1064038
14609 1064038 688319 887157 1258525 1140657 1238387 1157216 1353498 1277056 1311726 1168988
14599 1168988 1115591 1414928 1346703 982452 1006928 1194253 1492714 1167155 1198099 1021488
14589 1021488 1563157 1245144 1318360 1661559 1465610 1399806 1340609 1652229 1376552 1549591
14579 1549591 1400447 1492365 1880881 1774996 1583856 2047773 1542117 1537688 1691225 2008170
14569 2008170 1783816 1709573 1852186 1922379 1731681 2086879 2076147 2020158 1954759 1781016
14559 1781016 1987320 2340030 2168575 2140619 2693814 2615720 3062299 3431213 3967116 4869401
$$ packed form
14629I01613R3408j55111J30031K17191j14353J13781O311o5814N1188K71676
14619A449921n46863L71520j66934J1006r9339j54020L15323j42971Q7678o1283
14609A064038l75719J98838L71368j17868R7730q1171J96282p6442L4670j42738
14599A168988n3397K99337o8225l64251K4476J87325K98461l25559L0944j76611
14589A021488N41669l18013P3216L43199j95949o5804n9197L11620k75677J73039
14579A549591j49144R1918L88516j05885j91140M63917n05656m429J53537L16945
14569B008170k24354p4243J42613P0193j90698L55198j0732n5989o5399j73743
14559A781016K06304L52710j71455k7956N53195p8094M46579L68914N35903R02285
$$ plain form
14549 4869401 6428226 10232687 19229003 39608668 39413748 13757187 7508092 5111796
14541 5111796 2581564 2323834 1728177 1269849 1364810 1616413 1574334 1330657 1403609 1408989
14531 1408989 1679931 1722552 1503416 1806044 1854398 1416420 1800755 1723080 1863251 1912277
14521 1912277 1928165 1791460 2254421 2052524 1937214 1666889 1759515 2219493 2306169 2313832
14511 2313832 2037694 2577649 1977471 2184635 2292695 2184200 2259091 2560255 2068148 2399339
14501 2399339 2371894 2845865 2400314 2415443 2069741 2761741 2521760 2598513 2693146 2680524
14491 2680524 2351637 2744771 2814372 2527097 2752563 3027269 2677950 2900591 2779661 2977340
14481 2977340 2931349 2985109 2912563 3335352 3136390 3079155 3098260 3309605 3169519 3060650
$$ packed form
14549D869401J558825L804461Q996316K0379665j94920A3757187o249095k396296
14541E111796k530232k57730n95657m58328R4961K51603m2079k43677P2952N380
14531A408989K70942M2621k19136L02628M8354m37978L84335p7675J40171M9026
14521A912277J5888j36705M62961k01897j15310k70325R2626M59978Q6676P663
14511B313832k76138N39955o00178K07164J08060j08495P4891L01164m92107L31191
14501B399339k7445M73971m45551J5129l45702O92000k39981P6753R4633j2622
14491B680524l28887L93134O9601k87275K25466K74706l49319K22641j20930J97679
14481B977340m5991N3760p2546M22789j98962n7235J9105K11345j40086j08869
$$ plain form
14471 3060650 3524569 3092655 3225819 3387651 3352712 3662782 3694850 3687362 3484035 3916157
14461 3916157 3780909 3870295 3777035 3616535 3870770 4239101 4021560 3982203 4285517 3980672
14451 3980672 4070235 4240002 4193264 4289300 4200156 4509706 4323464 4657050 4497660 4499435
14441 4499435 4926479 4485758 4878116 4983625 4938425 5142575 5316244 4856516 5188211 5416084
14431 5416084 5271172 5540739 5463878 5758378 5598361 5821104 6100792 5875166 6108252 5825272
14421 5825272 6219942 6359148 6447227 6504014 6449782 6366220 6887715 6849478 6444182 6908440
14411 6908440 6823557 7132485 7381848 7471609 7421180 7566681 7738085 7626720 7995661 8013375
14401 8013375 8059134 8559349 8597215 8606713 8961070 8642092 8952862 8977714 9367857 9251824
$$ packed form
14471C060650M63919m31914J33164J61832l4939L10070L2068p488k03327M32122
14461C916157j35248Q9386r3260j60500K54235L68331k17541l9357L03314l04845
14451C980672Q9563J69767m6738R6036q9144L09550j86242L33586j59390J775
14441D499435M27044m40721L92358J05509m5200K04150J73669m59728L31695K27873
14431E416084j44912K69567p6861K94500j60017K22743K79688k25626K33086k82980
14421E825272L94670J39206Q8079N6787n4232q3562N21495l8237m05296M64258
14411F908440q4883L08928K49363Q9761n0429J45501J71404j11365L68941J7714
14401H013375M5759N00215L7866R498L54357l18978L10770K4852L90143j16033
$$ plain form
14391 9251824 9967700 9798993 10040611 10288025 10240948 10794633 10756257 11028299 11171765 11376324
14381 11376324 11549569 11605171 12100823 12051299 12561371 12739689 12855143 13139252 13438602 13635350
14371 13635350 14013960 14142451 14536261 14416458 14952806 15308484 15631062 16204858 16401674
14362 16401674 16692864 17232971 17571553 17829324 18237856 18702339 18931673 19484022 20271847
14353 20271847 20461528 21126859 21406966 21787861 22580476 23314550 23510154 24252406 24796013
14344 24796013 25508214 26447481 26390094 27739451 28436122 29054213 30185627 30805882 31779999
14335 31779999 32707588 33700231 34450167 35846789 36420981 38122694 39146427 40325793 41668747
14326 41668747 43102706 44696121 45943006 47697262 49505411 51284674 52804864 54881736
$$ packed form
14391I251824P15876j68707K41618K47414m7077N53685l8376K72042J43466K04559
14381A1376324J73245N5602M95652m9524N10072J78318J15454K84109K99350J96748
14371A3635350L78610J28491L93810j19803N36348L55678L22578N73796J96816
14362A6401674K91190N40107L38582K57771M08532M64483K29334N52349P87825
14353B0271847J89681O65331K80107L80895P92615P34074J95604P42252N43607
14344B4796013P12201R39267n7387J349357O96671O18091J131414O20255R74117
14335C1779999R27589R92643P49936J396622N74192J701713J023733J179366J342954
14326D1668747J433959J593415J246885J754256J808149J779263J520190K076872
$$ plain form
14318 54881736 56870977 59303328 61418772 63602775 66333686 69149152 71870696 75238920
14310 75238920 78006436 82001310 85280365 89047702 93504007 97682641 102658455 107707715
14302 107707715 112486322 118383359 124121599 130538065 137409160 144540123 152798031 160663831
14294 160663831 169679941 179123484 189116165 199449799 210690560 222084611 234644026
14287 234644026 247768560 261140298 275587377 290449242 305897417 321348641 337070376
14280 337070376 352836788 368241964 383505620 397665213 410819920 422291112 429886445
14273 429886445 434280751 435051907 435366953 437019808 437747826 431198671 426464266 420394959
14265 420394959 410177966 397765714 384248261 370553218 355618659 339211678 323186631
$$ packed form
14318E4881736J989241K432351K115444K184003K730911K815466K721544L368224
14310G5238920K767516L994874L279055L767337M456305M178634M975814N049260
14302A07707715M778607N897037N738240O416466O871095P130963Q257908P865800
14294A60663831R016110R443543R992681J0333634J1240761J1394051J2559415
14287B34644026J3124534J3371738J4447079J4861865J5448175J5451224J5721735
14280C37070376J5766412J5405176J5263656J4159593J3154707J1471192P595333
14273D29886445M394306P71156L15046J652855P28018o549155m734405o069307
14265D20394959j0216993j2412252j3517453j3695043j4934559j6406981j6025047
$$ plain form
14258 323186631 307166346 291314155 276265103 261568276 247336854 235147140 222433632
14251 222433632 210708573 199159284 188482456 178467940 169100694 160447065 152610156
14244 152610156 144878037 137634225 130839944 124279505 118219326 112596139 108202363 103249725
14236 103249725 98419618 93708086 89655780 85982235 82309903 79697859 76092514 72640611
14228 72640611 69900305 67268272 64584675 62511408 60018906 57719078 55634464 54004587
14220 54004587 51636292 50308746 48067184 46412186 44883524 43334403 42704001 41125209
14212 41125209 39841367 38471043 37243734 36429114 35510809 34790548 33590486 32684100 31713627
14203 31713627 30655455 29405445 28924097 28707296 27457049 26598227 26219051 25383480 24908902
$$ packed form
14258C23186631j6020285j5852191j5049052j4696827j4231422j2189714j2713508
14251B22433632j1725059j1549289j0676828j0014516r367246q653629p836909
14244A52610156p732119p243812o794281o560439o060179n623187m393776m952638
14236A03249725m830107m711532m052306l673545l672332k612044l605345l451903
14228G2640611k740306k632033k683597k073267k492502k299828k084614j629877
14220E4004587k368295j327546k241562j654998j528662j549121o30402j578792
14212D1125209j283842j370324j227309q14620r18305p20261j200062r06386r70473
14203C1713627j058172j250010m81348k16801j250247q58822l79176q35571m74578
$$ plain form
14194 24908902 24718172 23908605 23115328 22254088 22024764 21194358 20670355 20265276 19937263
14185 19937263 19546546 19083300 18656946 18101239 17664909 17269866 16917074 16721706 16297929
14176 16297929 15757946 15645429 15361410 15294710 14495315 14383416 14448079 13863279 13915115 13189039
14166 13189039 12938194 12738393 12590381 12486604 12344409 12045633 12059751 11582973 11486661 11384492
14156 11384492 11038822 10846317 10603751 10338633 10272981 9877473 9889282 9513699 9280082 9460447
14146 9460447 9577764 9046665 9236902 9107805 8575594 8600595 8605321 8321222 8145983 8071281
14136 8071281 8290047 7899227 7693262 7710458 7466567 7786204 7309538 7298589 7398650 6915227
14126 6915227 6797736 6977013 7096708 6608657 6632411 6448207 6398360 6295723 6398623 6175971
$$ packed form
14194B4908902j90730q09567p93277q61240k29324q30406n24003m05079l28013
14185A9937263l90717m63246m26354n55707m36330l95043l52792j95368m23777
14176A6297929n39983j12517k84019o6700p99395j11899O4663n84800N1836p26076
14166A3189039k50845j99801j48012j03777j42195k98776J4118m76778r6312j02169
14156A1384492l45670j92505k42566k65118o5652l95508J1809l75583k33617J80365
14146I460447J17317n31099J90237j29097n32211K5001M726k84099j75239p4702
14136H071281K18766l90820k05965J7196k43891L19637m76666j0949J00061m83423
14126F915227j17491J79277J19695m88051K3754j84204m9847j02637J02900k22652
$$ plain form
14116 6175971 6463238 6029126 6069811 5605980 5816002 5619863 5671697 5729172 5481127 5049727
14106 5049727 5487204 5349616 5108469 5238381 5112239 4935017 5020249 5417444 5080640 4764846
14096 4764846 4859171 4431077 4530172 4500530 4326528 4511926 4362635 4257336 4277690 4664273
14086 4664273 4402878 4279347 3979786 3692249 3969950 4021262 4122386 4057102 4276236 3855370
14076 3855370 3870198 3542524 3747509 3812975 3685908 3560866 3801455 3579727 3594509 3469690
14066 3469690 3646156 3480276 3482628 3317077 3251508 3442790 3567470 3343439 3346782 3240094
14056 3240094 3214067 3035397 2903545 3254699 3400619 3057011 2913166 2691937 3074135 3146641
14046 3146641 3038341 2646120 2604898 2943437 2817138 2487567 2613966 2776895 2486252 2613502
$$ packed form
14116F175971K87267m34112M0685m63831K10022j96139N1834N7475k48045m31400
14106E049727M37477j37588k41147J29912j26142j77222Q5232L97195l36804l15794
14096D764846R4325m28094R9095k9642j74002J85398j49291j05299K0354L86583
14086D664273k61395j23531k99561k87537K77701N1312J01124o5284K19134m20866
14076C855370J4828l27674K04985O5466j27067j25042K40589k21728J4782j24819
14066C469690J76466j65880K352j65551o5569J91282J24680k24031L343j06688
14056C240094k6027j78670j31852L51154J45920l43608j43845k21229L82198P2506
14046C146641j08300l92221m1222L38539j26299l29571J26399J62929k90643J27250
$$ plain form
14036 2613502 2501875 2529265 2611990 2388168 2593581 2492833 2365100 2342453 2614586 2391484
14026 2391484 2684812 2231095 2439891 2271710 2467640 2146037 2014269 2021976 2261689 2191231
14016 2191231 2177866 1966189 2237277 1985341 1891589 2199765 2122031 1817520 1829569 1674483
14006 1674483 1618992 1667665 1362310 1796600 2170411 1774468 1432352 1527420 1514702 1659063
13996 1659063 1604894 1815822 1623470 1501548 1596562 1852588 1978614 3112002 5729871
13987 5729871 12550466 31436378 45441921 19262725 10293419 6215407 4482640 3779348
13979 3779348 3443023 3291948 2774831 2616674 2439954 2387616 2201357 2171577 2077647 2116033
13969 2116033 1973879 2057461 1679981 2074674 2095636 1782476 1840926 1924911 1711110 1776215
$$ packed form
14036B613502j11627K7390Q2725k23822K05413j00748j27733k2647K72133k23102
14026B391484K93328m53717K08796j68181J95930l21603j31768P707K39713p0458
14016B191231j3365k11677K71088k51936r3752L08176p7734l04511J2049j55086
14006A674483n5491M8673l05355M34290L73811l95943l42116R5068j2718J44361
13996A659063n4169K10928j92352j21922R5014K56026J26026J133388K617869
13987E729871O820595J8885912J4005543A9262725q969306m078012j732767p03292
13979C779348l36325j51075n17117j58157j76720n2338j86259k9780r3930L8386
13969B116033j42154Q3582l77480L94693K0962l13160N8450Q3985k13801O5105
$$ plain form
13959 1776215 1881801 1654561 1593292 1772268 1482627 1680660 1467483 1429897 1908548 1640238
13949 1640238 2046080 1680533 1407806 1580195 1659698 1392263 1404165 1535688 1810556 1617817
13939 1617817 1588886 1693188 1494429 1582374 1524245 1572952 1436665 1284350 1449410 1242711
13929 1242711 1448074 1347323 1560764 1487838 1171215 1591250 1368692 1222684 1534975 1191947
13919 1191947 1621173 1291761 954342 1626924 1561239 1485071 1480847 1104610 1171003 1122961
13909 1122961 1004170 1503481 1068715 1184952 886602 1508681 1209297 959144 972153 1175262
13899 1175262 1219429 1416680 1153738 1215304 993369 1268387 740096 1054116 1422694 957223
13889 957223 1142047 868694 941389 1084509 1102653 1004626 1326913 1159598 977168 962862
$$ packed form
13959A776215J05586k27240o1269J78976k89641J98033k13177l7586M78651k68310
13949A640238M05842l65547k72727J72389P9503k67435J1902J31523K74868j92739
13939A617817k8931J04302j98759Q7945n8129M8707j36287j52315J65060k06699
13929A242711K05363j00751K13441p2926l16623M20035k22558j46008L12291l43028
13919A191947M29226l29412l37419O72582o5685p6168m224l76237O6393m8042
13909A122961j18791M99311m34766J16237k98350O22079k99384k50153J3009K03109
13899A175262M4167J97251k62942O1566k21935K75018n28291L14020L68578m65471
13889I57223J84824k73353P2695J43120J8144r8027L22287j67315j82430j4306
$$ plain form
13879 962862 642084 1216820 1189725 975879 863796 1120612 1006780 1046307 852709 1027083
13869 1027083 1298975 841409 922526 984200 465189 971179 872074 1206818 1215829 650585
13859 650585 680624 1065476 906826 964526 631105 571654 721259 664697 973616 597376
13849 597376 942936 913315 821531 670485 918533 849580 761242 643646 1015060 587742
13839 587742 1047360 1043541 1052707 854326 685535 787615 815999 798767 1165383 756662 1028912
13828 1028912 748875 717382 805687 782216 927829 655734 623964 781493 668876 999582
13818 999582 681155 650326 752390 543487 847366 730353 852299 479344 774652 603832
13808 603832 820654 723358 794329 501003 841790 811788 563339 665804 669439 812185
$$ packed form
13879I62862l20778N74736k7095k13846j12083K56816j13832L9527j93598J74374
13869A027083K71892m57566Q1117O1674D65189N05990r9105L34744R011n65244
13859F50585L0039L84852j58650N7700l33421n9451J49605n6562L08919l76240
13849E97376L45560k9621r1784j51046K48048o8953q8338j17596L71414m27318
13839E87742M59618l819R166j98381j68791J02080K8384j7232L66616m08721K72250
13828A028912k80037l1493Q8305k3471J45613k72095l1770J57529j12617L30706
13818I99582l18427l0829J02064k08903L03879j17013J21946l72955K95308j70820
13808F03832K16822r7296P0971k93326L40787l0002k48449J02465L635J42746
$$ plain form
13798 812185 873673 663235 934352 947688 1055158 804587 897516 794292 593988 417586
13788 417586 549204 609586 617967 488195 552904 138330 721543 762831 718445 763628 575533
13777 575533 750912 514033 386025 503067 937546 705996 725401 552167 708374 412540
13767 412540 354613 657830 452128 791892 314384 850350 729249 706724 564740 356629
13757 356629 829102 835972 620603 342291 510973 604689 639910 663530 468422 598993
13747 598993 715242 247638 329458 340346 166853 912188 628806 508503 315321 606466
13737 606466 395897 639782 629696 535560 475966 564074 549651 875748 402587 716422
13727 716422 413985 350900 544820 279340 601399 421423 439065 628327 527324 789766
$$ packed form
13798H12185O1488k10438K71117J3336J07470k50571R2929j03224k00304j76402
13788D17586J31618O0382Q381j29772O4709A38330N83213M1288m4386M5183j88095
13777E75533J75379k36879j28008J17042M34479k31550J9405j73234J56207k95834
13767D12540n7927L03217k05702L39764C14384N35966j21101k2525j41984k08111
13757C56629M72473O870k15369k78312J68682R3716L5221K3620j95108J30571
13747E98993J16249B47638Q1820J0888A66853P45335k83382j20303j93182K91145
13737F06466k10569K43885j0086r4136n9594Q8108j4423L26097D02587L13835
13727G16422l02437o3085J93920k65480L22059j79976J7642J89262j01003K62442
$$ plain form
13717 789766 412410 389683 561577 389240 326571 315775 502306 341639 416257 315962
13707 315962 514389 420634 425992 555220 273014 334109 374527 380507 322921 518831 463702
13696 463702 544512 637372 395533 400653 506659 428104 545452 321576 655404 176589
13685 168462 466839 274172 482778 174871 253818 737350 333355 475528 396100 338114
13675 338114 523384 472897 596740 230228 537607 609043 139436 302825 275164 554849
13665 554849 453282 379082 284697 113319 473832 210404 270686 173099 66974 638664
13655 638664 526321 443528 469166 384276 198522 395841 80770 226429 260784 499704
13645 499704 426494 310611 765740 298648 333168 463082 331234 228013 335037 191982
$$ packed form
13717G89766l77356k2727J71894j72337o2669j0796J86531j60667P4618j00295
13707C15962J98427r3755N358J29228B73014O1095M0418N980n7586J95910n5129
13696D63702Q0810R2860k41839N120J06006p8555J17348k23876L33828A76589
13685A68462K98377j92667K08606A74871P8947M83532C33355J42173p9428n7986
13675C38114J85270n0487J23843B30228L07379P1436A39436J63389k7661K79685
13665E54849j01567p4200r4385A13319L60513B10404O0282r7587F6974N71690
13655F38664j12343q2793K5638q4890j85754J97319H0770J45659L4355K38920
13645D99704p3210j15883M55129B98648L4520J29914j31848j03221J07024j43055
$$ plain form
13635 191982 466722 296328 244041 469227 213211 504110 418805 893682 442245 347995
13625 347995 328510 438247 439927 354759 437333 415920 316144 379160 311132 218856 365969
13614 365969 278691 510190 66079 283447 117985 245539 289218 448849 309739 53479
13603 204550 16456 157935 503034 238294 163255 404535 340314 350390 101937 390256
13593 390256 205009 61045 376213 381078 218217 475044 324190 413741 188694 497852
13583 497852 421077 256621 149667 476957 664319 499286 91724 333361 344916 -46327
13572 -69453 252239 210143 339571 248421 115726 478373 262303 331067 413475 452996 491114
13561 491114 314752 143478 412716 175812 367694 328165 522186 279252 338796 367482
$$ packed form
13635A91982K74740j70394n2287K25186B13211K90899q5305M74877D42245r4250
13625C47995j9485J09737J680q5168Q2574k1413r9776O3016o8028r2276J47113
13614C65969q7278K31499F6079K17368A17985J27554M3679J59631j39110E3479
13603B04550A6456J41479L45099B38294p5039K41280o4221J0076A01937K88319
13593C90256j85247F1045L15168M865j62861K56827j50854Q9551A88694L09158
13583D97852p6775j64456j06954L27290J87362j65033I1724K41637J1555d6327
13572f9453B52239m2096J29428r1150A15726L62647k16070O8764Q2408L9521L8118
13561D91114j76362A43478K69238A75812J91882l9529J94021k42934N9544K8686
$$ plain form
13551 367482 107557 299975 328123 414206 465903 158202 266332 424002 262709 169826
13541 169826 8792 332224 245467 138024 141186 230145 225240 274522 244345 159155 185594 481207
13529 481207 249896 264640 360519 328828 263926 214743 150537 -63297 -38038 65222 241858
13518 241858 387751 227904 534306 -36242 302886 336456 140364 212442 428860 460684
13508 460684 170946 56967 287595 412303 275771 205430 205104 276735 380496 202803 428137
13497 428137 -34146 119561 153984 -144407 209970 200893 -59387 142624 94643 270856 34973
13485 269400 611347 528618 196221 171842 -104484 285537 -38186 -68994 150841 382543
13475 382543 163459 230835 -8328 31930 22197 397921 279413 589097 -190476 206091 478036
$$ packed form
13551C67482A07557J92418K8148Q6083N1697A58202J08130J57670j61293r2883
13541A69826H792L23432q6757j07443L162Q8959m905M9282l0177q5190K6439K95613
13529D81207k31311J4744R5879l1691o4902m9183o4206f3297K5259F5222J76636
13518B41858J45893j59847L06402c6242C02886L3570A40364P2078K16418L1824
13508D60684A70946E6967K30628J24708j36532p0341l26P1631J03761j77693K25334
13497D28137c4146A19561L4423a44407B09970r077e9387A42624m7981J76213C4973
13485B69400L41947q2729A96221k4379a04484B85537c8186l0808A50841K31702
13475C82543A63459O7376h328C1930r733L75724j18508L09684a90476B06091K71945
$$ plain form
13464 478036 7528 281208 218327 396604 67387 409492 380975 117890 331900 190709
13454 190709 80450 518447 -168408 -31704 445735 221909 645304 250971 86350 262183
13444 262183 3656 259422 299159 507228 241795 331569 100851 251070 193326 325877
13434 325877 252997 31632 270553 73816 49498 73069 -274947 -55905 240170 482973 91285
13422 -133509 213212 113233 358773 62231 347949 -124295 303576 31808 172686 398874
13412 398874 112605 -17413 51011 224459 254444 59180 115296 51734 196894 415872 62169
13400 303962 209472 153077 369871 -44645 105995 211213 228958 83298 131276 215810 89060
13388 150514 192705 -33375 211673 241571 115858 383065 514018 -163634 489887 68998
$$ packed form
13464D78036G528K73680o2881J78277F7387L42105k8517A17890K14010j41191
13454A90709H0450M37997a68408c1704D45735B21909M23395B50971H6350J75833
13444B62183C656K55766L9737K08069B41795Q9774A00851J50219n7744J32551
13434C25877p2880C1632K38921G3816k4318K3571b74947e5905B40170K42803I1285
13422a33509B13212r9979K45540F2231K85718a24295C03576C1808J40878K26188
13412C98874A12605a7413E1011J73448K9985E9180N6116E1734J45160K18978F2169
13400C03962r4490n6395K16794d4645A05995J05218J7745H3298M7978Q4534H9060
13388A50514M2191c3375B11673K9898A15858K67207J30953a63634D89887F8998
$$ plain form
13377 183229 82388 -143197 99250 678596 147551 316517 19982 34520 279512 257901
13367 257901 276029 197391 251821 126421 242919 468807 206967 290366 512064 74806
13356 280909 -19272 -76423 283967 117750 302434 124779 212800 280840 256351 240161 136693
13345 136693 229761 385542 363022 418492 330569 348795 309300 118492 471948 165619 524855
13334 524855 204394 -165849 -58339 299891 -45258 319122 202401 338312 246027 -75952
13323 257714 -168623 -13526 371997 29773 76195 240122 -123862 270808 196353 28014
13312 213326 265324 109262 258189 110258 225084 354915 128407 68886 149453 -131519
13301 54812 145516 -81539 346888 73537 47999 -128396 -157338 -199849 -80467 -143144 -58542
$$ packed form
13377A83229H2388a43197I9250N79346A47551J68966A9982J4538K44992k1611
13367B57901J8128p8638N4430j25400J16498K25888B06967Q3399K21698G4806
13356B80909a9272n7151B83967A17750J84684A24779Q8021O8040k4489j6190j03468
13345A36693R3068J55781k2520N5470q7923J8226l9495A18492L53456A65619L59236
13334E24855B04394a65849e8339B99891d5258C19122j16721J35911r2285g5952
13323B57714a68623a3526C71997B9773M6422J63927a23862B70808p4455B8014
13312B13326N1998A09262J48927A10258J14826J29831A28407n9521Q0567a31519
13301E4812R0704h1539C46888G3537k5538a28396k8942m2511h0467o2677e8542
$$ plain form
13289 112013 84522 166648 153820 -6044 21268 419900 229700 241706 120727 160234 114035
13278 114035 101068 616830 198477 240136 -116305 120027 -62297 334629 -25243 227820
13267 284625 164417 5294 21336 153894 -153888 20446 2995 223496 177514 -71933 -247503
13256 -247503 116018 425648 266118 146827 259266 364785 -21508 -166490 93340 172466
13246 172466 80792 -351952 58586 -133743 173761 -61253 -15907 -8370 210842 -183275 318185
13234 112335 243761 322296 8675 -299339 205276 133207 82958 77433 -5379 171446 165171
13223 165171 103108 118991 -2172 -72930 200003 13922 -6346 266789 150553 -41234 134747
13211 220728 -3754 182777 188989 6840 42870 191407 -197805 318605 -92816 -243719 256222
$$ packed form
13289A12013k7491Q2126j2828f044B1268L98632j90200J2006A20727L9507m6199
13278A14035j2967N15762A98477M1659a16305A20027f2297C34629b5243B27820
13267B84625j20208E294J6042J32558a53888B0446B995K20501m5982g1933j75570
13256b47503A16018L09630j59530j19291J12439J05519b1508j44982I3340P9126
13246A72466H0792c51952E8586a33743A73761f1253a5907P537B10842a83275C18185
13234A12335J31426P8535H675b99339B05276p2069n0249n525e379A71446o275
13223A65171o2063J5883b172p0758B00003A3922f346B66789j16236d1234A34747
13211B20728c754A82777O212F840L6030J48537a97805C18605i2816j50903B56222
$$ plain form
13199 77358 -22252 366055 24024 -132374 322039 252014 -106926 161065 69605 -293837
13188 -249759 11128 264271 119213 165755 194259 67388 139971 132995 201437 -185801 91898
13176 -15426 -13837 -239896 118029 79879 108510 -148594 -249135 -125665 48193 141932 -124889
13164 246954 157257 -361385 313806 169376 199753 78059 293219 122084 82655 110058
13154 110058 49960 94944 274254 -113964 119548 -161207 -6182 77760 477636 690 350012
13143 350012 376329 -46828 22391 46782 426 -98510 102028 153854 -84620 -131918 377438
13131 -179547 -107442 129930 140977 120049 275424 67608 480188 -317572 338699 24432
13120 -1791 178063 688 53055 186401 60477 165303 -152840 -137431 -258082 -53904 241362
$$ packed form
13199G7358b2252C66055B4024a32374C22039p0025a06926A61065F9605b93837
13188b49759A1128K53143A19213M6542K8504F7388P2583o976O8442a85801I1898
13176a5426J589k26059A18029l8150K8631a48594j00541J23470D8193R3739a24889
13164B46954q9697c61385C13806j44430L0377G8059K15160A22084l9429K7403
13154A10058D9960M4984J79310a13964A19548a61207f182G7760L99876F90L49322
13143C50012K6317d6828B2391K4391D26i8510A02028N1826h4620m7298C77438
13131a79547P2105A29930J1047k0928J55375F7608M12580c17572C38699B4432
13120a791A78063F88N2367J33346F0477J04826a52840J5409j20651e3904B41362
$$ plain form
13108 41347 -172313 115963 172879 -160264 -150796 -139558 259320 -25630 208182 223179 338331
13097 338331 131879 194979 279559 -31255 -109681 159851 -385383 223479 -115685 -116496 219295
13085 116375 125968 98387 112428 193938 56112 179634 -45547 167016 -197254 102689 248771
13074 248771 17718 241787 415746 -73826 -68775 -260598 8001 14770 40191 -76051 82484
13062 17648 -59102 213256 -64132 111763 188297 190590 127566 -100838 -178563 292006 87513
13050 -13418 375231 27722 55201 473828 407625 -250571 53624 -12175 -214507 274930 482562
13039 482562 258107 372007 -217 -51286 -236804 75781 229481 83278 319721 262630 -269952
13027 -61296 163467 -219598 104475 301345 65633 99525 123567 155198 384767 304656 357989
$$ packed form
13108D1347a72313A15963N6916a60264R468J1238B59320b5630B08182J4997J15152
13097C38331A31879O3100Q4580c1255p8426A59851c85383B23479a15685q11B19295
13085A16375R593k7581J4041Q1510E6112J23522d5547A67016a97254A02689J46082
13074B48771A7718K24069J73959g3826N051j91823H001O769K5421g6051H2484
13062A7648e9102B13256f4132A11763P6534K293o3024a00838p7725B92006H7513
13050a3418C75231B7722K7479M18627o6203b50571E3624a2175k02332B74930K07632
13039D82562k24455J13900b17n1069j85518G5781J53700H3278K36443n7091b69952
13027f1296A63467b19598A04475J96870F5633L3892K4042L1631K29569q0111N3333
$$ plain form
13016 357989 -64613 64531 -28197 200264 -106272 2641 331938 -350672 98874 10642 -56854
13004 109203 26669 145236 -101366 -60731 235763 -3274 -290636 -306090 159935 46902 270217
12993 270217 78483 -207005 221529 111021 149550 286366 -123188 150503 71582 -53688
12982 287628 29931 199574 208701 180158 91126 55064 -396853 -43599 216695 -154214 -106217
12971 -106217 -174454 13662 101704 59728 -20937 220298 -85035 -67127 -378151 -95336 -348769
12960 -348769 -201184 141511 48312 79331 229913 275007 331340 -40986 -97155 302639 335057
12949 335057 58220 287459 83104 24776 -93640 173435 269676 74812 -167556 187005 81259
12937 19758 -176269 -3234 297716 -115782 427063 234430 39905 -61203 -142922 -137215 -44018
$$ packed form
13016C57989f4613F4531b8197B00264a06272B641L29297c50672I8874A0642e6854
13004A09203B6669J18567a01366M0635B35763c274k87362j5454A59935D6902K23315
12993B70217G8483b07005B21529j10508L8529J36816a23188A50503G1582e3688
12982B87628B9931J69643R127k8543q9032l6062c96853d3599B16695a54214M7997
12971a06217o8237A3662Q8042m1976b0937B20298h5035J7908l11024i5336k53433
12960c48769J47585A41511D8312L1019J50582M5094N6333d0986n6169C02639L2418
12949C35057E8220K29239H3104B4776i3640A73435R6241G4812a67556A87005H1259
12937A9758a76269c234B97716a15782D27063j92633C9905f1203q1719N707d4018
$$ plain form
12925 -277083 29579 366469 325682 -5302 13630 396227 75788 27131 300534 335314 60517
12913 161759 132173 9014 227680 -35229 -39467 147122 -109248 -5805 189521 177720 -358352
12901 97030 -52148 -125390 64241 -78987 29770 120149 -179887 -222721 270333 -55313 240464
12889 104025 81113 148485 -34150 -120698 73941 13277 -23672 100457 -85063 21309 -234512
12877 -108380 -242096 173338 342815 -195888 39455 -159339 -107497 -310985 79572 52312
12867 52312 66689 190092 207933 405672 44071 -213058 124794 -49559 -34747 -120815 -91160
12856 -91160 196708 450429 62407 -145486 -1057 13719 156722 15720 119440 -130150 99680
12844 -325048 -64352 57899 32681 260104 27947 201812 37611 -43478 2046 58924 135531
$$ packed form
12925b77083B9579L36890m0787e302A3630L82597G5788B7131K73403L4780F0517
12913A61759k9586I014K18666c5229m238A47122a09248e805A89521j1801c58352
12901I7030e2148p3242F4241g8987B9770R0379a79887m2834B70333e5313B40464
12889A04025k2912O7372c4150q6548G3941A3277b3672A00457h5063B1309b34512
12877a08380j33716A73338J69477a95888C9455a59339N1842k03488G9572k7260
12867E2312J4377J23403J7841J97739D4071b13058A24794d9559J4812q6068K9655
12856i1160A96708K53721F2407a45486a057A3719J43003A5720J03720a30150I9680
12844c25048f4352E7899k5218K27423B7947J73865C7611d3478B046N6878P6607
$$ plain form
12833 135531 166695 -68367 121947 98222 143565 -120139 95117 92937 176482 136698 -154095
12821 52156 139384 -80803 476867 217031 108470 -228727 -97683 -170457 -158425 -43323 -33472
12810 -33472 101367 -69583 -325089 -34820 20733 -49416 -243628 21611 235136 232444 127474
12799 127474 -168091 -265590 394671 -98751 -18409 -43818 238572 -16969 -86764 6948 -17620
12787 298287 104102 -136402 382856 -122008 -147675 -26022 -61533 -37548 44281 -284983
12776 107760 164473 -270124 4023 -229574 100206 213050 204321 324084 -115717 -89322 -67071
12765 -67071 114373 -36184 41692 -74305 14611 150148 125148 249897 64578 69685 -5904
12753 -80998 8204 -18227 84843 100534 213718 227831 -126785 -183964 30161 -42549 253596
$$ packed form
12833A35531L1164f8367A21947k3725M5343a20139I5117k180Q3545l9784a54095
12821E2156Q7228h0803D76867B17031A08470b28727i7683p2774J2032d3323R851
12810c3472A01367f9583k55506c4820B0733d9416j94212B1611K13525k692j04970
12799A27474a68091r7499C94671i8751a8409k5409B38572a6969o9795F948a7620
12787B98287A04102a36402C82856a22008k5667b6022l5511K3985D4281b84983
12776A07760N6713b70124D023b29574A00206J12844q729J19763a15717K6395K2251
12765f7071A14373c6184D1692g4305A4611J35537k5000J24749F4578N107e904
12753h0998H204a8227H4843J5691J13184J4113a26785n7179C0161d2549B53596
$$ plain form
12741 253432 -160014 6589 -34511 325509 -94251 91421 102727 -191387 -169217 -283512 -321380
12730 -321380 -65415 54062 -271229 -19868 100396 469257 196054 172537 4642 -26840 -146544
12719 -146544 -144495 -214546 -196177 166614 -266352 341303 121486 434273 209944 148806
12709 148806 159409 79643 -20816 498605 252427 -107305 7890 92627 154674 -120951 270913
12697 23833 -132528 415061 43420 128536 67401 287208 139992 150993 -21094 130512 80237
12686 80237 -44192 -254624 171413 33115 209827 198936 201881 260556 -151316 259972 318277
12675 318277 420464 160177 281952 26263 108705 -373340 282352 -190750 -33870 67282
12664 -51606 40681 -80201 -162763 -123634 41533 107941 -84637 369062 -49285 -166449 -147153
$$ packed form
12741B53432a60014F589c4511C25509i4251I1421J1306a91387K2170j14295l7868
12730c21380f5415E4062b71229a9868A00396L68861A96054k3517D642b6840j19704
12719a46544K049p0051J8369A66614b66352C41303A21486L12787B09944o1138
12709A48806J0603G9643b0816D98605k46178a07305G890Q4737O2047a20951B70913
12697B3833a32528D15061D3420Q5116o1135K19807A39992J1001b1094A30512n0275
12686H0237d4192k10432A71413C3115J76712j0891K945N8675a51316B59972N8305
12675C18277J02187A60177J21775B6263Q2442c73340B82352a90750c3870F7282
12664e1606D0681h0201q2562L9129D1533O6408h4637C69062d9285j17164J9296
$$ plain form
12653 -147153 151386 281595 -225371 6407 -112782 -52674 -120720 43366 54535 -170216 54899
12641 -110333 -118461 28272 68357 59842 -89681 -19529 209498 -43603 217437 208109 360465
12630 360465 162436 208065 351133 -165480 37294 -72371 100071 242403 177997 285074
12620 285074 302371 228148 285078 66424 88278 62125 242329 -78537 53147 41631 -15965
12608 -63456 72769 84431 227183 215145 199151 93499 -51357 217941 366562 -72211 92553
12596 246542 161286 119553 -36734 205909 194056 97948 357 -26453 -76598 69973 61543 124691
12584 124691 23839 -84483 39974 -42977 97446 187853 119193 -120254 492441 -99425 112198
12572 -124002 424590 169269 168964 148341 239756 364467 90465 -78670 153067 238786 47679
$$ packed form
12653a47153A51386J30209b25371F407a12782e2674o8046D3366J1169a70216E4899
12641a10333q128B8272M0085q515h9681a9529B09498d3603B17437r328J52356
12630C60465A62436M5629J43068a65480C7294g2371A00071J42332o4406J07077
12620B85074J7297p4223N6930F6424K1854k6153J80204g8537E3147j1516a5965
12608f3456G2769J1662J42752j2038j5994I3499e1357B17941J48621g2211I2553
12596B46542q5256m1733c6734B05909j1853r6108C57b6453n0145F9973q430O3148
12584A24691B3839h4483C9974d2977I7446R0407o8660a20254D92441i9425A12198
12572a24002D24590A69269l05k0623R1415J24711I0465g8670A53067Q5719D7679
$$ plain form
12560 -41593 114437 174369 48111 129143 44462 -86523 -51751 323680 32503 -85774 134276
12548 143980 40833 -152439 104059 63840 62314 -6620 154549 299864 120649 159887 136756
12537 136756 -54697 -6507 -104277 113416 44849 -121644 31092 -69240 132549 184636 181978
12526 181978 -123742 281945 -118128 -27781 230550 -166157 -109635 109914 75820 -7872
12515 79034 -115317 -20535 -203898 158980 118574 -81725 163676 -190816 -104129 -80137 -157520
12504 -157520 8679 233602 35490 547844 -106744 329835 91996 66102 132561 -117793 16492
12492 -105141 -124692 -414732 -244172 143949 -369 47801 83052 295546 -40641 -37124 51208
12480 -33264 140700 89309 108951 -362904 -80435 -365 -139541 248181 168884 -1866 -31423
$$ packed form
12560d1593A14437N9932D8111Q1032D4462h6523L4772C23680C2503h5774A34276
12548A43980D0833a52439A04059m0219j526f620A54549J45315A20649L9238k3131
12537A36756e4697f507r7770A13416D4849a21644C1092f9240A32549N2087k658
12526A81978a23742B81945a18128b7781B30550a66157N6522A09914l4094g872
12515G9034a15317b0535j83363A58980m0406h1725A63676a90816Q6687K3992p7383
12504a57520H679K24923C5490N12354a06744C29835I1996k5894O6459a17793A6492
12492a05141j9551k90040J70560A43949c69D7801L5251K12494d0641L517E1208
12480c3264A40700n1391J9642c62904h0435c65j39176B48181p9297a866k9557
$$ plain form
12469 -31423 128385 -213591 103722 -238754 142235 -21091 71539 -51932 -56655 -58569 -202419
12458 -202419 183716 -141568 -194180 53398 187182 -11218 22741 220435 -130762 175207
12447 -237382 152500 75598 206093 2743 15455 22746 48133 189633 -187761 -116321 -75294
12436 -75294 -265535 144483 -117565 -75434 -112860 -160609 333666 -244984 279924 -66830
12425 -195 -384758 -282829 -481742 -149626 187017 301482 -195732 81604 196357 -139151
12414 -180188 -1293 170547 -120088 187831 -276121 112804 -153604 86168 201807 -183630
12403 156018 239096 -31193 -165190 -211616 -123433 4627 4286 191759 117146 3915 -129594 88178
12390 -546199 613579 62004 58422 -183899 102319 116920 7064 -259332 72338 9211 -146670
$$ packed form
12469c1423A28385b13591A03722b38754A42235b1091G1539e1932m723j914j43850
12458b02419A83716a41568n2612E3398J33784a1218B2741J97694a30762A75207
12447b37382A52500G5598J30495B743J2712P291K5387J41500a87761P1440M1027
12436g5294j90241A44483a17565M2131l7426m7749C33666b44984B79924f6830
12425a95l84563J01929j98913a49626A87017J14465a95732H1604J14753a39151
12414a80188a293A70547a20088A87831b76121A12804a53604H6168J15639a83630
12403A56018Q3078c1193j33997m6426Q8183D627l41J87473p4613C915a29594H8178
12390e46199F13579F2004l582a83899A02319J4601G064b59332G2338I211a46670
$$ plain form
12378 22581 -208946 -430 114816 269548 136583 -220677 242859 56308 -92331 343546 -46354
12366 -111369 87676 -96833 -22187 -343503 -284539 267813 -92351 -37203 120256 31368 -189511
12354 62720 70282 -232227 137333 -151599 308636 -141585 -88832 336508 -71929 78424 16599
12342 175927 -37409 22062 263619 40426 104541 -119578 53816 94377 -141082 138137 134733
12331 134733 -100260 124334 54903 32977 68034 248225 -25448 -104711 142692 -35497 58673
12319 -277918 -182071 370417 -211607 219061 -299904 -141740 70019 219545 181768 -176598
12308 301408 202876 166503 -118242 -112985 -91939 54583 33599 -67511 -28970 45259 -195506
12296 -14506 -117849 -69659 127692 76131 170045 328279 98727 98602 55505 41341 256385
$$ packed form
12378B2581b08946d30A14816J54732j32965b20677B42859E6308i2331C43546d6354
12366a11369H7676i6833b2187l21316N8964B67813i2351c7203A20256C1368a89511
12354F2720P562b32227A37333a51599C08636a41585N2753C36508g1929G8424A6599
12342A75927c7409B2062K41557D0426O4115a19578E3816M0561a41082A38137l404
12331A34733a00260A24334E4903k1926L5057J80191b5448p9263A42692c5497E8673
12319b77918R5847C70417b11607B19061b99904a41740G0019J49526l7777a76598
12308C01408r8532l6373a18242N257K1046E4583k0984f7511b8970D5259a95506
12296a4506j03343M8190A27692n1561R3914J58234I8727j25m3097j4164K15044
$$ plain form
12285 256385 183511 -190925 2825 -192031 5768 21714 -57721 -34944 454381 156300 249942
12274 249942 431658 148751 206387 53630 447926 345858 41338 281565 200517 -110559
12263 -160053 339928 107508 258218 310215 322019 -1387 -109214 35565 268254 -266703
12252 64217 89094 284688 118636 -16590 29611 -138061 148573 -26852 -87677 641554 -198103
12240 316351 -48129 4072 472926 -54069 44465 5606 15217 79908 -135194 138616 -31171
12228 155352 307204 -4252 191635 291118 109223 207036 -71047 -28864 15726 487467 45527
12216 2500 530082 140192 238624 351821 30484 -27897 54880 -58796 151459 48274 229434
12205 229434 263456 263918 -51074 121082 -13343 100712 113620 -54516 105773 207447 562449
$$ packed form
12285B56385p2874a90925B825a92031E768J5946e7721K2777D54381A56300R3642
12274B49942J81716A48751N7636E3630L94296j02068D1338K40227q1048a10559
12263a60053C39928A07508J50710N1997J1804a387j07827C5565K32689b66703
12252F4217K4877J95594A18636a6590B9611a38061A48573b6852o0825F41554a98103
12240C16351d8129D072M68854e4069D4465E606R611O4691a35194A38616c1171
12228A55352J51852d252A91635R9483A09223R7813g1047b8864A5726M71741D5527
12216B500N27582A40192R8432J13197C0484b7897E4880e8796A51459D8274J81160
12205B29434L4022M62e1074A21082a3343A00712J2908e4516A05773J01674L55002
$$ plain form
12194 562449 41783 205537 293887 -86427 140227 158101 57839 -27007 71685 84565 -498
12182 -232300 -70047 91874 217657 249684 114049 451644 127169 359969 255956 -182786
12171 -10008 233515 239298 333649 -28915 -187189 -87061 167929 -199523 41751 -159604 183700
12159 36766 571381 -45810 -328904 296150 97621 16727 51145 -296544 -323359 -11308 272880
12147 -58451 -67158 48989 156712 103538 -63544 110979 305220 356135 -308176 98372 50637
12136 50637 -146924 63205 239196 -120955 -180514 -58705 241683 49869 325753 84689 31793
12124 176637 -35114 85400 -128983 -285462 2525 -21417 331819 -46885 -135076 152286 150659
12113 150659 77277 -52408 -212456 -152271 44203 -110741 -73709 -192545 -263966 308944 16012
$$ packed form
12194E62449D1783J63754Q8350h6427A40227J7874E7839b7007G1685J2880d98
12182b32300g0047I1874J25783L2027A14049L37595A27169K32800j04013a82786
12171a0008B33515N783R4351b8915j58274h7061A67929a99523D1751a59604A83700
12159C6766N34615d5810k83094B96150I7621A6727L4418b96544k6815a1308B72880
12147e8451q707D8989J07723n3174f3544A10979J94241N0915c08176I8372m7735
12136E0637a46924F3205J75991a20955n9559e8705B41683D9869K75884H4689C1793
12124A76637c5114H5400a28983j56479B525b1417C31819d6885q8191A52286j627
12113A50659p3382e2408j60048O0185D4203a10741L7032j18836p1421C08944A6012
$$ plain form
12101 380517 141718 48318 -56206 -198429 126887 4604 314229 128149 46979 -150823
12090 32870 -174004 69428 -48225 28339 -63486 57640 -149942 65754 -79433 -190034 96924
12078 267832 216266 523907 1143306 2550835 1102712 410337 422462 -41815 -58826 96336
12067 112393 -175686 -101918 47104 -273168 -74928 -129202 12934 -264761 -247977 159866 -160782
12055 92659 -35081 -28191 173816 77861 -297973 -179239 -36177 48551 -40804 49151 71382
12044 71382 -1208 -221962 -253668 -269007 150933 -263933 315461 -231983 130426 -57582 107716
12032 -418930 27305 -20944 182006 -58084 131977 267790 163576 -536 -21357 -611 202989
12020 36125 49695 211190 124465 106328 44768 175598 327245 -10637 21385 90945 46930
$$ packed form
12101C80517A41718D8318e6206j42223A26887D604L09625A28149D6979a50823
12090C2870a74004F9428d8225B8339f3486E7640a49942F5754g9433j10601I6924
12078B67832n1566L07641O19399J407529A102712D10337J2125d1815j7011I6336
12067A12393a75686P3768D7104b73168g4928n4274A2934b64761J6784A59866a60782
12055I2659c5081O890A73816G7861b97973J18734c6177D8551d0804D9151K2231
12044G1382a208k20754l1706j5339A50933b63933C15461b31983A30426e7582A07716
12032d18930B7305b0944A82006e8084A31977J35813j04214e36k0821f11B02989
12020C6125J3570J61495q6725j8137D4768J30830J51647a0637B1385O9560m4015
$$ plain form
12009 46930 -15094 124169 25676 -234824 -114520 -424191 -7879 328498 99320 -67233 -185047
11998 -185047 179616 -72042 -134879 -226613 -37209 27327 -177338 -233960 49835 37473 225645
11987 225645 73592 -86187 -298026 210812 152841 179759 -64721 598451 49872 -414269 84588
11975 44245 -59968 -266020 12960 94203 175320 60249 105082 -247703 -218111 24101 191726
11964 191726 18080 158408 73439 199472 -339449 -172632 -152246 16072 78503 31258 261454
11953 261454 -49274 188160 -50654 241200 263767 -64786 -29723 23172 110781 163627 -55069
11941 34033 10964 -284939 -146939 47012 -8354 -164743 -168216 -173508 -252114 -353904 196192
11929 -202776 -54528 -51325 -228870 108399 109652 66556 -211664 -40273 319425 134544 126853
$$ packed form
12009D6930a5094A24169B5676b34824a14520l09671g879C28498I9320f7233j17814
11998a85047A79616g2042o2837r1734c7209B7327a77338n6622D9835j2362J88172
11987B25645G3592h6187k11839B10812n7971K6918f4721E98451D9872d14269H4588
11975D4245e9968k06052A2960Q1243Q1117F0249M4833b47703K9592B4101J67625
11964A91726A8080J40328G3439J26033c39449J66817K0386A6072O2431C1258K30196
11953B61454d9274A88160e0654B41200K2567f4786b9723B3172Q7609N2846e5069
11941C4033A0964b84939J38000D7012h354j56389l473n292p8606j01790A96192
11929b02776e4528L203j77545A08399J253m3096b11664d0273C19425A34544p691
$$ plain form
11918 126853 84711 -134229 65369 130568 45927 -61548 -355616 69734 -102229 -114427 26233
11906 -112068 143606 163287 282655 448362 -6197 63430 -74038 -225968 -121491 -42203 -154882
11895 -154882 -114565 135544 -170612 -40237 -108934 23262 119374 273995 9415 76208 -239730
11883 234574 -233716 -87699 307137 -51232 411267 -157669 201757 47240 -49680 220207
11872 163402 132264 48128 130474 -295655 -89289 20007 -371756 7121 -190026 256479 245381
11861 245381 5440 -68282 115360 -139015 -174827 165206 185126 -90530 -9461 -92583 225570
11849 144296 -62810 3724 175094 -41418 45152 -24018 -171768 167601 -72596 435523 -17649
11837 14217 -145986 -28598 -50196 -34270 65058 -227599 -408285 -137221 12167 309440 10728
$$ packed form
11918A26853m2142a34229F5369O5199D5927f1548k94068F9734a02229j2198B6233
11906a12068A43606J9681J19368J65707f197F3430g4038j51930J04477d2203j12679
11895a54882M0317A35544a70612d0237o8697B3262R6112J54621I415O6793b39730
11883B34574b33716h7699C07137e1232D11267a57669B01757D7240d9680B20207
11872A63402l1138D8128Q2346b95655h9289B0007c71756G121a90026B56479j1098
11861B45381E440f8282A15360a39015l5812A65206J9920i0530i461q3122B25570
11849A44296f2810C724J71370d1418D5152b4018j47750A67601g2596D35523a7649
11837A4217a45986b8598k1598J5926F5058b27599j80686a37221A2167K97273A0728
$$ plain form
11825 -12500 -203848 -42243 86228 153586 123949 309862 -37293 125702 -229096 -166799 -136503
11814 -136503 -28382 341094 -40685 7167 -144166 221925 -186707 -141467 264501 -70818 -309092
11803 -309092 82943 159741 128770 -349808 -34287 -325605 71633 123531 116437 -226883 247043
11791 -122635 -146491 -127718 154858 98419 301182 -57000 -53941 286985 130356 -380327 -176145
11779 -162672 -181409 -279528 -352070 -65992 149650 143205 19844 165389 -13281 -77693 355872
11767 -127803 273746 -60576 -60429 -50092 -90574 -103114 -164642 -78506 90661 -238702 28797
11755 184778 -182825 36641 -114947 -64943 -160894 18197 20800 126065 -115997 -102512 75128
11743 101890 -81371 115423 -42946 -18171 34869 79104 -237838 -4494 7026 -4269 -287115
$$ packed form
11825a2500j91348d2243H6228O7358k9637J85913c7293A25702b29096O2297L0296
11814a36503b8382C41094d0685G167a44166B21925a86707M5240B64501g0818k38274
11803c09092H2943P6798l0971c49808c4287k91318G1633N1898p094b26883B47043
11791a22635k3856J8773A54858n6439K02763e7000L059B86985A30356c80327a76145
11779a62672j8737r8119p2542f5992A49650o445A9844J45545a3281o4412C55872
11767a27803B73746f0576J47J0337m0482j2540o1528g8506I0661b38702B8797
11755A84778a82825C6641a14947N0004r5951A8197K603J05265a15997J3485G5128
11743A01890h1371A15423d2946a8171C4869M4235b37838d494G026d269k82846
$$ plain form
11732 -287115 43536 -34241 33871 -162632 -128500 -20094 357483 9008 81443 31250 -156963
11720 -8917 -65766 91532 -12299 176277 77218 -9415 23327 217730 -160068 -255176 -137875
11709 -137875 68355 31447 74439 254810 -69208 -109508 12017 27878 242235 132720 56163
11697 172638 -121017 269480 99155 -272852 -258840 -66196 -80690 -60571 -100551 286847 198323
11686 198323 160428 -233798 -104676 277457 -124528 -111931 36057 106543 222347 -11431
11675 -198965 96302 100732 182213 197594 -69139 -99371 -205538 106206 -23420 343819 174320
11664 174320 -105545 -251466 24495 101565 145507 31857 -140709 -179220 -162197 -11952 125715
11652 -228916 -317257 89201 -144334 254600 158276 -171402 57696 46671 124790 30715 -165214
$$ packed form
11732b87115D3536c4241C3871a62632L4132b0094C57483I008P2435C1250a56963
11720h917n6849I1532a2299A76277G7218i415B3327J94403a60068r5108J17301
11709a37875F8355C1447M2992J80371f9208m0300A2017J5861K14357j09515E6163
11697A72638a21017B69480I9155b72852J4012f6196j4494K0119l9980B86847q8524
11686A98323l7895b33798a04676B77457a24528J2597C6057P0486J15804a1431
11675a98965I6302M430Q1481J5381f9139l0232j06167A06206b3420C43819j69499
11664A74320a05545j45921B4495P7070M3942C1857a40709l8511J7023a1952A25715
11652b28916q8341H9201a44334B54600r6324a71402E7696j1025P8119C0715a65214
$$ plain form
11640 -70580 92565 174973 17961 53104 152109 -99635 20371 89291 -33034 -233401 -20502
11628 -196181 7855 73813 216065 -36090 -143166 227516 76684 -196597 199772 159427 -168933
11616 166596 -1674 -40716 -212532 -160996 4425 194606 400564 342609 126046 -42252 124593
11604 211504 146967 -554 144070 135888 261885 104930 33712 28902 -40949 92122 -43047 51157
11591 -57750 -134812 179962 161755 153848 -248425 -172146 166261 238506 -19160 -29232 198080
11579 -23030 141346 -33184 -76758 -50442 54016 78692 -64645 181910 -170847 187238 17581
11567 328398 195872 250329 -279262 -196384 57904 140466 232229 -200226 121143 206419 123818
11556 123818 -78370 -260799 -186537 146445 -113814 18812 143855 212581 54237 -158188
$$ packed form
11640g0580I2565Q2408A7961L5143R9005i9635B0371O8920c3034k00367b0502
11628a96181G855O5958J42252c6090j07076B27516G6684a96597A99772m0345a68933
11616A66596a674l9042j71816N1536D425J90181K05958n7955A26046d2252A24593
11604B11504o4537e54A44070q182J25997A04930C3712m810d0949I2122d3047E1157
11591e7750p7062A79962j8207p907b48425P6279A66261P2245a9160j0072A98080
11579b3030A41346c3184m3574K6316E4016K4676f4645A81910a70847A87238A7581
11567C28398j32526N4457b79262Q2878E7904Q2562R1763b00226A21143Q5276q2601
11556A23818g8370j82429P4262A46445a13814A8812J25043O8726E4237a58188
$$ plain form
11545 -86550 -71782 231129 -13002 -160214 258371 29056 239964 63780 33507 417457 147947
11533 -38352 -7592 66905 -50814 -36674 473192 22911 -93479 -78343 310601 264224 396013
11522 396013 -14644 -266875 -94757 194598 -139309 -46386 220099 -64570 142451 -66242
11511 369642 -30109 71854 413189 150854 -111953 247688 178157 77666 43683 193875
11501 193875 359789 304128 48957 318911 359415 -51558 -266917 270729 -69984 -102243 294933
11489 247606 -148471 23081 45482 -41861 59302 175890 438401 236336 223106 321660 10973
11477 41161 104307 137230 -110834 124439 -156517 61374 66284 216392 -15926 -91002 -148571
11466 -148571 -54747 9296 -186288 90068 -60641 119163 151930 -42738 240657 211969 -177077
$$ packed form
11545h6550J4768B31129a3002j47212B58371B9056K10908F3780l0273L83950A47947
11533c8352g592F6905e0814J4140D73192B2911i3479J5136C10601m6377J31789
11522C96013a4644k52231i4757A94598a39309d6386B20099f4570A42451f6242
11511C69642c0109G1854L41335A50854a11953B47688o9531G7666l3983J50192
11501A93875J65914n5661D8957K69954M0504e1558k15359B70729f9984l2259B94933
11489B47606a48471B3081K2401d1861E9302J16588K62511k02065j3230R8554A0973
11477D1161O3146L2923a10834A24439a56517F1374M910J50108a5926p5076n7569
11466a48571e4747I296a86288I0068f0641A19163L2767d2738B40657k8688a77077
$$ plain form
11454 320822 -35156 139299 -137380 -196972 -17157 194772 -2824 120810 -84007 418085 157778
11442 16246 -30847 -201061 206944 178362 -146775 84359 92464 -167493 -140257 138127 64830
11430 433459 -44005 -23278 29540 20405 234050 95993 -8023 96256 157680 -22201 22639 -221246
11417 48402 -244376 -31586 -12187 218814 313500 162462 -67082 139596 -171135 45912 30616
11406 30616 -292983 170799 111847 -477257 85958 78370 261254 -110753 -165497 320380 -2688
11394 117935 185284 -48039 -152649 72091 194268 -156760 -548611 132044 121469 49734
11383 78186 80529 34738 418965 81298 14946 50068 -79336 -239905 77231 -105594 101181
11371 102839 -35183 37069 243216 -263454 -196682 17357 18591 260403 -58653 -138093 -327900
$$ packed form
11454C20822c5156A39299a37380n9592a7157A94772b824A20810h4007D18085A57778
11442A6246c0847j70214B06944k8582a46775H4359Q105a67493K7236A38127F4830
11430D33459d4005K0727B9540r135K13645I5993h023I6256O1424b2201B2639b21246
11417D8402b44376c1586a2187B18814R4686j51038f7082A39596a71135D5912j5296
11406C0616b92983A70799n8952d77257H5958p588J82884a10753n4744C20380b688
11394A17935O7349d8039j04610G2091J22177a56760l91851A32044j0575D9734
11383G8186K343C4738L84227H1298A4946L5122g9336j60569G7231a05594A01181
11371A02839c5183C7069K06147b63454O6772A7357J234K41812e8653p9440j89807
$$ plain form
11360 -327900 94111 -26391 -67961 160202 -64268 248908 90709 -169021 -64775 -101510 -194783
11349 -194783 14689 -21443 -16068 -208189 -287657 -91885 94856 130937 -42732 -41154 150916
11337 172998 101840 -293947 198090 -102104 -152243 -219622 -31052 84337 104541 166907 79516
11325 69735 -43943 -237844 -284599 33121 196332 38131 59745 -4091 114843 9167 -21703
11313 -54401 15431 53783 -2248 -48158 133734 75717 -18015 12873 -9547 -252269 -109577
11301 -463329 -10521 -152513 -318706 466485 -34549 13176 -90956 200407 100173 -75704
11290 112384 -195232 121203 39451 14432 6858 -12279 -196957 -222252 -156346 66699 1579
11278 -57588 213532 -198585 53710 266633 -56357 -126191 -153411 -125742 169218 -193437 29377
$$ packed form
11360c27900I4111b6391m1570A60202f4268B48908I0709a69021f4775l6735r3273
11349a94783A4689b1443N375j92121p9468i1885I4856L6081d2732J578A50916
11337A72998p1158b93947A98090a02104n0139o7379c1052H4337K0204O2366G9516
11325F9735d3943j93901m6755C3121J63211C8131K1614d091A14843I167b1703
11313e4401A5431L8352b248m5910A33734n8017a8015A2873i547k42722a09577
11301d63329a0521j41992j66193D66485c4549A3176i0956B00407A00173g5704
11290A12384a95232A21203C9451A4432F858a2279j84678k5295O5906F6699A579
11278e7588B13532a98585E3710K12923e6357o9834k7220K7669A69218a93437B9377
$$ plain form
11266 97355 -38205 -15086 -264833 -272479 64283 -303801 130963 62281 -78458 -69438 -174530
11255 -174530 39123 -20747 -51580 -52636 -60586 256618 -13421 -238371 -286564 140388 -193238
11243 -144369 -68208 -99025 -9856 55987 262365 -138761 115172 -130374 -25158 70498 190647
11232 190647 -85646 -11307 280322 51469 213752 -221037 -138763 -57189 -303050 -158699
11222 -158699 -207238 63667 -67270 229000 -131711 172250 -105162 181816 -44795 -16751
11211 -178452 35422 -183619 -146254 119203 92348 -261516 216099 222000 70175 256021 47539
11199 -25127 -174247 -203319 -190890 -109323 -223708 52832 -86342 -105727 -92057 128572 -254716
11187 -9979 -763 104135 -98064 -201512 -159807 -34381 41802 145434 -10182 -109439 -173685 -262496
$$ packed form
11266I7355c8205a5086k49747p646F4283c03801A30963F2281g8458R020j05092
11255a74530C9123b0747l0833j056p950B56618a3421k24950m8193A40388a93238
11243a44369f8208l0817i856E5987K06378a38761A15172a30374b5158G0498J20149
11232A90647h5646a1307B80322E1469J62283b21037Q2274e7189k45861J44351
11222a58699m8539F3667f7270B29000a31711A72250a05162A81816d4795a6751
11211a78452C5422a83619L7365A19203k6855b61516B16099N901G0175J85846D7539
11199b5127j49120k9072J2429Q1567j14385E2832h6342j9385J3670A28572b54716
11187i979g63A04135i8064j03448M1705c4381D1802J03632a0182r9257o4246q8811
$$ plain form
11175 -262496 -226199 -272349 362922 212380 120568 184048 -32690 -92347 208676 80383 84737
11164 84737 117846 15405 -96383 13123 -30796 -324703 99084 28198 -97407 -102374 -129176 -54432
11151 394203 136807 86996 -79773 115411 -60091 -130766 -92244 -193297 102041 11707 127592
11140 127592 -339229 -103877 329738 -252847 -271298 -86449 57165 -79232 -104649 71358 4482
11128 -59888 35904 93478 137776 -76809 101215 57930 -15289 50258 -62116 -216834 57130
11116 30550 51017 77925 -40285 181773 -4762 -108864 56141 -7259 97191 382909 57996
11104 551672 19552 14588 11273 327314 81935 109390 49287 -156894 210328 158366 108927
11093 108927 253477 -84729 188771 459192 161245 320506 76910 281798 406639 154480
$$ packed form
11175b62496L6297m6150C62922j50542r1812O3480c2690n9657B08676H0383M354
11164H4737L3109A5405i6383A3123c0796k93907I9084B8198i7407m967k6802e4432
11151C94203A36807m9811g9773A15411f0091p0675L8522j01053A02041A1707J15885
11140A27592c39229a03877C29738b52847j8451h6449E7165g9232k5417G1358D482
11128e9888C5904N7574M4298g6809A01215m3285a5289E0258f2116j54718E7130
11116C0550K0467K6908d0285A81773d762j04102E6141g259I7191K85718E7996
11104E51672A9552m964l315L16041H1935K7455D9287a56894B10328n1962m9439
11093A08927J44550h4729A88771K70421A61245J59261G6910K04888J24841A54480
$$ plain form
11082 140321 5286 262808 205300 159936 227600 206731 -67196 60523 -24872 307681 477799
11071 477799 339279 404690 220095 321168 367525 125836 394759 372522 336454 443148
11061 443148 267438 372835 475137 339958 354376 427538 648909 725366 397699 520831
11051 520831 436129 615227 722361 740221 659074 818092 527780 918936 633470 278940
11040 329130 689125 584860 577326 560757 538907 578741 683603 764861 578669 648894 408374
11029 408374 557506 440569 474704 797942 535174 697873 717449 593587 514653 853022
11019 853022 644656 417997 436393 786614 551139 850712 622052 653782 527018 694574
11009 694574 684335 704650 664492 361157 338726 594283 758750 463958 565177 896381
$$ packed form
11082A40321E286K57522n7508m5364O7664k0869f7196F0523b4872C07681J70118
11071D77799j38520O5411j84595J01073M6357A25836K68923k2237l6068J06694
11061D43148j75710J05397J02302j35179J4418P3162K21371P6457l27667J23132
11051E20831q4702J79098J07134J7860q1147J59018k90312L91156k85466B78940
11040C29130L59995j04265p534j6569k1850L9834J04862Q1258j86192P0225k40520
11029D08374J49132j16937L4135L23238k62768J62699J9576j23862p8934L38369
11019H53022k08366k26659J8396L50221k35475K99573k28660L1730j26764J67556
11009F94574j0239K0315m0158l03335k2431K55557J64467k94792J01219L31204
$$ plain form
10999 896381 687542 859794 584331 365597 546522 722532 625479 507238 446143 729129
10989 729129 513635 347994 748906 758841 738202 528359 745148 929881 809764 1157173
10979 1157173 1034457 1463462 1379734 1142962 1784280 1835077 2041320 2224496 2442304 2710729
10969 2710729 2347253 2711624 2753730 2247022 2282266 2262850 1610593 1359425 1503798 1306505
10959 1306505 1331452 1444137 1539419 1418394 1611180 1566730 1144094 1317038 952281 968464
10949 968464 730963 405303 568171 230242 488376 368491 264991 89399 134943 68491
10939 68491 158678 223016 165585 -10835 256922 -1538 10324 100695 233961 203075 55202
10927 95662 56997 17376 67158 -215396 -57753 250016 66935 59769 193504 19818 -47935
$$ packed form
10999H96381k08839J72252k75463k18734J80925J76010r7053j18241o1095K82986
10989G29129k15494j65641M00912R935k0639k09843K16789J84733j20117L47409
10979A157173j22716M29005q3728k36772O41318N0797K06243J83176K17808K68425
10969B710729l63476L64371M2106n06708L5244j9416o52257k51168J44373j97293
10959A306505K4947J12685R5282j21025J92786m4450m22636J72944l64757J6183
10949I68464k37501l25660J62868B30242K58134j19885j03500H9399M5544o6452
10939F8491R0187O4338n7431a0835B56922a538A0324R0371J33266l0886E5202
10927I5662l8665A7376M9782b15396e7753B50016F6935p166J33735A9818d7935
$$ plain form
10915 -308998 256007 59804 -72773 183671 94169 73933 -89904 17368 -164739 256327 -108780
10903 -191585 9817 -29335 217740 -147443 76417 22324 61297 113866 -370477 25919 185455
10892 185455 -52191 -2013 183937 203100 139073 16136 108265 -163539 -235857 -47712 -353253
10881 -353253 -165047 -172229 181339 -21903 124107 -66582 60767 -133882 -95311 -18218 -34612
10870 -34612 63877 -324264 441707 -264229 88248 -146416 -41971 83869 117378 2138 -24154
10858 -84133 -13062 -135497 27492 -109797 209665 -164257 207257 15156 -81676 -273401
10848 -273401 -50452 84181 -150006 -339189 -119343 -65182 258127 38226 45936 -206705 -58248
10836 43305 -148528 313884 -107635 31783 50509 26814 -34991 39946 35515 -155423 38800
$$ packed form
10915c08998B56007E9804g2773A83671q9502k0236h9904A7368a64739B56327a08780
10903a91585I817b9335B17740a47443G6417B2324L8973N2569c70477B5919J59536
10892A85455e2191b013A83937J9163o4027A6136R2129a63539p2318d7712l05541
10881c53253a65047p182A81339b1903A24107f6582F0767a33882L8571a8218j6394
10870c4612F3877c24264D41707b64229H8248a46416d1971H3869L3509B138b4154
10858h4133a3062j22435B7492a09797B09665a64257B07257A5156h1676j91725
10848b73401e0452H4181a50006j89183a19343N4161B58127C8226P710b06705e8248
10836D3305a48528C13884a07635C1783J8726k3695c4991C9946m431a55423C8800
$$ plain form
10824 -328781 3358 21180 50979 -56561 -64014 -292988 -102304 -77640 113366 284211 -224273
10812 -42148 -69223 -139990 -144222 103363 -267493 53317 232877 28547 38082 -207206 -42505
10800 -49961 -78721 -255159 252788 -124611 42215 196506 -13079 153837 288709 -317231
10789 127221 -43331 -119117 -180030 -138898 -137175 -18884 -146584 253602 -148062 -129526 -100355
10778 -100355 -161846 64140 -281357 -204782 7798 46632 139558 126276 -6025 -256008 -216768
10767 -216768 -331531 136507 -177576 13799 280429 -331227 241794 -212689 123673 -288593
10756 -130536 -75459 -1869 146513 -70765 -46225 7366 12698 249279 -72461 -28254 56957 -293574
10743 161208 2934 -12271 -45570 124298 50036 -158726 49099 -36929 106598 -107122 -64310
$$ packed form
10824c28781C358J7822K9799e6561p453k28974a02304K4664A13366J70845b24273
10812d2148k7075p0767m232A03363b67493E3317J79560B8547R535b07206d2505
10800d9961k8760j76438B52788a24611D2215J54291a3079A53837J34872c17231
10789A27221d3331p5786o0913M1132J723a8884j27700B53602a48062J8536K9171
10778a00355o1491F4140b81357P6575G798L8834R2926j3282f025k49983L9240
10767b16768j14763A36507a77576A3799K66630c31227B41794b12689A23673b88593
10756a30536N5077a869A46513g0765K4540G366N332K36581g2461b8254E6957b93574
10743A61208B934a2271l3299A24298E0036a58726D9099c6929A06598a07122M2812
$$ plain form
10732 -64310 -810 -265252 143099 276818 -91422 57524 -114068 -182826 -196176 -305819 -73416
10720 266144 193624 -222149 202506 194693 167839 1790 85811 -218474 -203828 68673 -232403
10708 -99921 273866 -68502 -65163 90253 38780 -64072 215838 -157954 -16256 98104 25916
10696 -137625 -184131 104610 131299 76861 163996 2614 8077 -33395 541 130557 21190 -127324
10683 -45670 78044 -194014 239842 -212479 263069 -203061 170807 -173462 -17200 265710
10672 343971 72216 -164328 -18803 60678 -156910 -59877 32973 -112678 251347 -118683
10661 137896 -33974 7551 -47192 -266911 -234444 58815 -102779 -161196 -42916 -36986 -129786
10650 -129786 -362986 -204515 -193196 -155517 12250 -421207 -380234 111134 -190427 -95064
$$ packed form
10732f4310h10k64442A43099J33719i1422E7524a14068o8758j3350j09643g3416
10720B66144p2520b22149B02506p813k6854A790Q4021b18474J4646F8673b32403
10708i9921B73866f8502L339I0253C8780f4072B15838a57954a6256I8104B5916
10696a37625m6506A04610K6689n4438Q7135B614N463c3395E41J30016B1190a27324
10683d5670G8044a94014B39842b12479B63069b03061A70807a73462a7200B65710
10672C43971G2216a64328a8803F0678a56910e9877C2973a12678B51347a18683
10661A37896c3974G551d7192k19719L2467E8815a02779n8417d2916N930r2800
10650a29786k33200J58471J1319L7679A2250d21207M0973A11134a90427i5064
$$ plain form
10639 201385 -149452 140454 -160304 -86618 357 -12121 -193599 132194 -71397 -178902 97468
10627 15689 -356036 -403641 -12289 -27800 135492 197015 -42193 75922 -131999 115161 -152875
10615 109273 -51767 96375 171191 -374955 60689 53371 90220 -32828 -273842 40027 49318
10604 49318 -317990 -157438 -295798 -438330 233843 -21455 33941 76960 -6749 -115039 225704
10592 92818 45343 82441 -324179 -99257 64359 66877 -212933 134154 -394106 -255693 -27069
10580 -149366 151416 -168180 -61073 -204632 -2789 91728 148647 -57725 34379 -134448 -420332
10569 -420332 28579 57452 -39544 175143 145383 -153406 -144316 -187582 -192095 189425 224434
10558 224434 -251639 -19008 8677 186898 -15979 174981 5128 -68820 5875 172656 -58127
$$ packed form
10639B01385a49452A40454a60304P3686C57a2121j81478A32194g1397j07505I7468
10627A5689c56036m7605a2289j5511A35492O1523d2193G5922a31999A15161a52875
10615A09273e1767I6375P4816c74955F0689p318L6849c2828k41014D0027R291
10604D9318c17990a57438j38360j42532B33843b1455C3941M3019f749j08290B25704
10592I2818D5343L7098c24179i9257F4359K518b12933A34154c94106J38413b7069
10580a49366A51416a68180f1073j43559b789I1728N6919e7725C4379a34448k85884
10569d20332B8579K8873c9544A75143k9760a53406R090m3266m513A89425L5009
10558B24434b51639a9008H677J78221a5979A74981E128f8820E875J66781e8127
$$ plain form
10546 -92024 78982 160788 -269983 -68276 89001 412596 67951 313761 -412980 -73179 95388
10534 65841 -360196 280965 990 -25343 308818 82174 50440 -211134 8205 -152984 71187
10522 327803 -348140 146567 30515 -34709 716 -190308 -6136 -55348 -295777 140238 63257
10510 -17610 -141358 -35149 68541 -121051 -53217 -250552 -145520 223981 -188294 118031
10499 176222 40000 -296244 -49702 -279815 93852 -328849 -106360 -265865 -85121 -96978
10489 -96978 177609 87939 -103167 -87168 109858 -359260 -154349 -2773 125174 238293
10479 238293 639807 454991 739713 -77142 17779 46123 -220157 147644 -193617 60750
10468 -139442 -374504 -118179 187699 -6006 -105225 1869 -64661 -215618 -187416 227624 -515670
$$ packed form
10546i2024G8982Q1806b69983f8276H9001L23595F7951K45810d12980g3179I5388
10534F5841c60196B80965I90b5343C08818H2174l1734b11134H205a52984G1187
10522C27803c48140A46567C0515c4709G16a90308f136m9212k40429A40238F3257
10510a7610j23748c5149F8541a21051e3217j97335J05032B23981a88294A18031
10499A76222D0000b96244d9702k30113I3852c28849a06360j59505h5121j1857
10489i6978A77609H7939a03167J5999A09858c59260a54349b773A25174J13119
10479B38293M01514j84816K84722g7142A7779K8344b20157A47644a93617F0750
10468a39442k35062a18179A87699f006r9219A869f4661j50957K8202B27624e15670
$$ plain form
10456 -154145 59168 -36757 -29214 19220 -2979 -75834 388189 -17560 -15075 -282041 119066
10444 1630 -107054 105538 -227684 -5954 298485 -153717 136142 -222145 52177 151825 97225
10433 97225 -87606 83049 97846 -297117 -35588 171784 -50868 -65347 194275 -93398 81524
10421 -77344 -119312 -63457 -40623 -390080 95973 -119979 -103697 -41927 56466 -116497 45506
10409 271851 60154 -367502 160491 -27026 188098 54311 -23682 206579 111427 220250
10399 220250 175836 56014 128463 155994 -128633 -75499 -133033 147267 -35686 300247 391089
10388 391089 184589 -11502 16815 260484 44403 110929 -174758 72819 341442 40084 213047
10377 213047 144882 69783 220436 327393 372575 129843 351587 148903 257573 273387
$$ packed form
10456a54145E9168c6757P543A9220b979p2855C88189a7560K485k66966A19066
10444A630a07054A05538b27684e954B98485a53717A36142b22145E2177R9648n4600
10433I7225h7606H3049J4797b97117c5588A71784e0868j4479A94275i3398H1524
10421g7344m1968N5855K2834l49457I5973a19979J6282d1927E6466a16497D5506
10409B71851F0154c67502A60491b7026A88098E4311b3682B06579r5152J08823
10399B20250m4414E6014P2449K7531a28633N3134n7534A47267c5686C00247R0842
10388C91089A84589a1502A6815K43669D4403O6526a74758G2819K68623D0084J72963
10377B13047o8165F9783J50653J06957M5182A29843K21744A48903J08670J5814
$$ plain form
10367 273387 308643 325291 462801 299172 298226 306487 537890 119251 51616 79416 22162
10355 35907 279542 255375 171850 613118 439591 570090 677187 404637 268866 175689
10345 175689 339637 211143 228195 611768 379513 107277 -12964 200320 262517 292554
10335 292554 473122 154626 358335 386649 532 35771 -163700 -111989 -35013 -171099 -11499
10323 311729 -96392 167510 87209 -82926 -45884 368479 -16110 -168278 295370 -118841
10312 -237133 -208196 -56755 -188966 93727 36372 -34407 -299177 55406 277170 176707 258531
10301 258531 -127373 -49775 -120485 303596 -29283 82923 -51575 17589 -72813 -159310 -64924
10289 -83877 100300 -195926 -371426 -82011 -237552 -135723 128304 -294004 60726 93237
$$ packed form
10367B73387L5256J6648J37510j63629r46Q261K31403A19251E1616K7800B2162
10355C5907K43635k4167q3525M41268j73527J30499J07097k72550j35771r3177
10345A75689J63948j28494J7052L83573k32255A07277a2964B00320O2197L0037
10335B92554J80568A54626K03709K8314E32L5239a63700N1711c5013j36086a1499
10323C11729i6392A67510q0301h2926L7042C68479a6110j52168B95370a18841
10312b37133K8937e6755j32211I3727C6372c4407k64770E5406K21764j00463Q1824
10301B58531a27373d9775p0710C03596b9283H2923e1575A7589g2813q6497f4924
10289h3877A00300a95926j75500h2011j55541J01829A28304b94004F0726L2511
$$ plain form
10279 93237 57386 -166865 -9220 -347768 -135526 -59018 -163453 313049 -90172 161338 -318876
10267 -251585 245939 38806 -251137 -108382 -139646 -1762 175653 -10212 209796 183264 -77995
10255 395799 493570 167399 26382 152239 -130944 -35398 -105923 -128885 -142066 -117917 231582
10243 -4840 21846 331271 113230 -176727 -68398 -369963 -73154 29488 -126333 8828 306020
10232 306020 132834 136997 -176030 252685 -126416 -152974 101284 134310 -113422 -213013
10222 -213013 -189124 242772 -13479 -50781 -90560 -31657 99344 -42302 -4910 38224 179391
10211 179391 -153100 211489 -72917 86934 21627 -150215 126611 -53345 180475 88737
10200 -77978 -111110 -164415 168408 -227732 -280622 -105538 -58566 111196 -111218 -231875
$$ packed form
10279I3237l5851a66865i220l38548a35526e9018j04435C13049i0172A61338c18876
10267b51585B45939C8806b51137a08382l1264a762A75653a0212B09796k6532g7995
10255C95799R7771A67399B6382J25857a30944c5398p0525k2962j3181K4149B31582
10243d840B1846L09425A13230a76727f8398l01565g3154B9488a26333H828K97192
10232C06020A32834M163a76030B52685a26416k6558A01284L3026a13422r9591
10222b13013K3889B42772a3479l7302l9779c1657I9344d2302d910C8224J41167
10211A79391a53100B11489g2917H6934B1627a50215A26611e3345A80475H8737
10200g7978l3132n3305A68408b27732n2890a05538M6972A11196a11218j20657
$$ plain form
10190 -231875 -78770 -50950 -135339 -24942 194460 -168678 -21365 -244001 -328706 -363043 -305864
10179 -305864 -327082 -74081 -38147 213133 -141152 114484 -284863 -54477 -292350 -78088
10168 149820 -12506 -337108 -119795 85512 118835 -282225 40214 -54429 -142395 -337447 -24422
10156 -101216 28569 -309022 -202016 118160 -67334 77946 20944 -144782 144987 -47964
10145 -128861 41196 -75192 173631 -313091 -206414 -79741 -16403 -99321 118467 -137312
10134 -45953 58033 164926 -15442 14328 -254038 45576 4605 -202471 -151387 -167922 -29477
10122 -218675 226562 243604 155240 23124 -176588 -150405 -99114 -115434 -197185 61671 -26427
10110 -179236 -81178 -75358 -58005 -132548 -82754 73686 151949 112560 -166513 -54938 -34597
$$ packed form
10190b31875g8770K7820q4389b4942A94460a68678b1365k22636q4705l4337N7179
10179c05864k1218g4081L5934B13133a41152A14484b84863e4477k37873g8088
10168A49820a2506l24602a19795H5512L3323b82225D0214e4429q7966j95052b4422
10156a01216B8569c09022J07006A18160f7334G7946B0944a44782A44987d7964
10145a28861D1196g5192A73631c13091J06677g9741a6403q2918A18467a37312
10134d5953E8033J06893a5442A4328b54038D5576D605b02471N1084j6535b9477
10122b18675B26562J7042q8364B3124a76588K6183N1291j6320q1751F1671b6427
10110a79236h1178N820J7353p4543M9794G3686P8263l9389a66513e4938K0341
$$ plain form
10099 -34597 -361261 201957 123017 21783 -50185 -272129 13259 79406 200843 28853 66305
10088 66305 -79627 72978 -309122 -270071 -51480 -64594 -131935 160129 -413435 -84713 222723
10076 53920 -43068 -91120 -46938 -135271 -80192 -159231 89889 14832 -10532 -7854 -20109 -247752
10064 -247752 -178370 -84824 -60636 181269 51559 -117483 -94075 -323434 -379010 -8153 -22925
10053 -22925 -261544 8520 62531 -116867 -14297 -63027 11448 -120204 27170 223720 181695
10042 181695 -138773 298387 -30101 81011 126657 -152891 -193234 -243451 91998 -1380 17853
10030 -341949 62586 -31694 -20453 -108261 -32588 -280940 -281909 -51007 215265 -215534 89156
10018 -188162 -467559 -435786 -107008 111438 36539 -247635 39025 23611 -246768 183736
$$ packed form
10099c4597l26664B01957p8940B1783e0185k21944A3259O6147J21437B8853L7452
10088F6305g9627G2978c09122L9051e1480j3114o7341A60129d13435h4713B22723
10076E3920d3068m8052M4182q8333N5079p9039H9889A4832a0532K678j2255k27643
10064b47752O9382h4824K4188A81269E1559a17483K3408k29359n5576h153j4772
10053b2925k38619H520N4011a16867a4297m8730A1448a20204B7170J96550m2025
10042A81695a38773B98387c0101H1011M5646a52891m0343n0217I1998a380A7853
10030c41949F2586c1694J1241q7808c2588k48352r69e1007B15265b15534H9156
10018a88162k79397L1773a07008A11438C6539b47635C9025j5414b46768A83736
$$ plain form
10007 64108 11673 -269268 -31081 -245400 -168043 34851 -39397 -394960 -130882 -164030 167652
9995 130670 -93455 -4944 -227112 24053 278550 469272 -169224 -210137 8599 -139597 -74386
9984 -74386 194160 -264284 121761 -251677 -46213 48804 -5581 -72648 -38013 235465 226409
9973 226409 -155070 -18952 138185 -131396 -363576 -28125 -214205 -561061 -134642 122502
9962 -318186 -138631 336425 -75342 112165 -86843 182741 -404487 68578 -358460 7264 -228065
9950 -114147 26120 -225622 -156629 -188925 262 -119822 -52194 19257 15397 -32064 90884 232377
9938 232377 -42300 193058 38836 -80680 -209862 146926 -87861 -88048 -147655 -75476 18022
9926 -120332 -159150 -51134 -134612 209994 -354312 -124344 -196467 -389334 -86531 -439317 -165847
$$ packed form
10007F4108A1673b69268c1081k14319P7357C4851c9397l55563a30882l3148A67652
9995A30670i3455d944k22168B4053K54497J90722a69224m0913H599a39597O5211
9984g4386A94160b64284A21761b51677d6213D8804e581o7067L4635B35465r056
9973B26409a55070a8952A38185a31396k32180b8125j86080l46856a34642A22502
9962c18186a38631C36425g5342A12165h6843A82741d04487F8578c58460G264b28065
9950a14147B6120b25622O8993l2296B62a19822e2194A9257l860c2064I0884J41493
9938B32377d2300A93058C8836h0680j29182A46926h7861j87n9607P2179A8022
9926a20332l8818e1134q3478B09994c54312a24344p2123j92867h6531l52786a65847
$$ plain form
9914 -47596 -75167 99278 140427 -182957 261878 -191512 215923 -152634 -109434 -178963 -149197
9903 -149197 41991 248688 -256686 143920 -182636 94951 80817 -57605 -327867 84222 92320
9892 92320 19508 -259217 179574 189493 -16920 -14863 -104449 133780 147758 -416571 -9448 -93055
9880 -93055 -229611 -387602 -277655 -79740 -363545 -199447 177349 147392 -170763 320288
9869 85614 -265904 -64416 230196 -256056 14488 -119206 175991 27229 -155258 208537
9858 -105892 241931 -202489 186582 75614 -140560 -316697 -258130 -221550 276135 -332469
9847 107984 -195283 -42836 -215511 4383 1724 229504 -428520 -27774 -375676 -221464 24306
9835 -44635 72575 -157858 33405 -86920 67444 -114141 -24750 -147051 -92125 -135364 -149640
$$ packed form
9914d7596k7571I9278M1149a82957B61878a91512B15923a52634M3200o9529K9766
9903a49197D1991K06697b56686A43920a82636I4951j4134e7605k70262H4222Q098
9892I2320A9508b59217A79574R919a6920K057q9586A33780J3978d16571i448q3607
9880i3055j36556j57991J09947g9740k83805J64098A77349k9957a70763C20288
9869H5614b65904f4416B30196b56056A4488a19206A75991B7229a55258B08537
9858a05892B41931b02489A86582G5614a40560j76137N8567L6580B76135c32469
9847A07984a95283d2836j72675D383A724K27780d28520b7774l47902J54212B4306
9835d4635G2575a57858C3405h6920F7444a14141b4750j22301N4926m3239j4276
$$ plain form
9824 -149640 121521 -165587 -121045 -9455 39220 -133011 -48586 171250 124231 69161 -285931
9812 -238760 174223 -91494 -264509 -418673 -38882 265547 -119116 67315 -291832 37201
9801 -190720 -2273 -249437 73829 -20856 -63985 -223372 -213835 -67324 -52341 290457 -33367
9789 -44775 -18440 -152294 -14390 66761 -63995 -244753 -141462 -102075 292422 -112631 -119331
9778 -119331 25863 210118 -52638 250726 -2524 -255688 -246922 -373676 -171463 -150040 -81145
9767 -81145 90795 139750 -121233 -5911 -284869 -29467 43510 -137986 143244 83261 -10620
9755 -16626 -234637 -179596 -352160 18537 -151634 -70365 -7599 -421309 -333413 27654 116476
9744 116476 -325054 -9287 -59657 165347 14945 -48687 -230600 108612 -29233 35789 -183860
$$ packed form
9824a49640A21521a65587M4542i455C9220a33011d8586A71250m7019n5070b85931
9812b38760A74223i1494j73015j54164c8882B65547a19116F7315b91832C7201
9801a90720b273k47164G3829b0856m3129j59387R537f7324J4983B90457c3367
9789d4775a8440j33854a4390F6761f3995j80758J03291L9387B92422a12631o700
9778a19331B5863J84255e2638B50726b524k53164Q766j26754a71463K1423O8895
9767h1145I0795M8955a21233e911k78958b9467D3510a37986A43244n9983a0620
9755a6626k18011N5041j72564A8537a51634g0365g599m13710Q7896B7654Q8822
9744A16476c25054i287n0370A65347A4945d8687j81913A08612b9233C5789a83860
$$ plain form
9732 33212 318524 -90368 332484 -63352 19558 -5693 -19621 -149549 51934 -74274 -14375
9720 -19278 -147135 44108 324641 68249 -242027 -244854 -9033 -113090 -231830 31822 10612
9708 161221 -101319 -165047 -237608 62664 258877 -223950 219545 -271832 85569 -455322
9697 22184 3727 -275561 -77311 -123948 -322496 212529 137145 -94910 -40784 -241588 -104690
9685 -211518 -158104 -300865 129043 82654 -242629 -90853 -14620 215303 -252530 111954
9674 10236 -70472 -202408 88948 196896 43531 182855 -108358 114371 -75045 -100181 -258900
9663 -258900 99071 -396557 -192501 -165912 -59159 -72729 152098 124916 74238 -324048 -87295
9651 -46316 47477 -52706 -106354 -153561 -216207 30294 -87163 -458624 -13939 12976 -31106 56441
$$ packed form
9732C3212K85312i0368C32484f3352A9558e693j3928j29928E1934g4274a4375
9720a9278j27857D4108K80533F8249b42027k827i033j04057j18740C1822A0612
9708A61221a01319o3728p2561F2664J96213b23950B19545b71832H5569d55322
9697B2184C727b75561g7311m6637j98548B12529p5384i4910d0784k00804a04690
9685b11518N3414j42761A29043m6389b42629i0853a4620B15303b52530A11954
9674A0236g0472j31936H8948J07948D3531J39324a08358A14371g5045k5136j58719
9663b58900I9071c96557a92501K6589e9159j3570A52098k7182n0678c24048h7295
9651d6316D7477e2706n3648m7207o2646C0294h7163l71461a3939A2976c1106E6441
$$ plain form
9638 45602 -154960 -107325 -75193 47801 62426 164314 -326191 -111875 -92838 108541 3424
9626 -83825 -153011 968 -19163 -249749 204779 -398658 -61505 43614 -101976 240070 -223278
9614 -90779 -437003 -68311 -559720 -156088 -233005 36136 -43427 -297102 129289 -30438 12228
9602 -435218 125078 -161075 152894 -285093 79274 -141127 158805 -76974 316412 -27410
9591 -116793 -153738 -265863 -162315 -72078 -198107 71867 -146839 36252 214672 -445283
9580 -71329 -337999 198023 33539 309549 359006 -86018 -44783 -167853 -76876 86469 166697
9569 166697 -108900 -154042 -87275 186478 103636 49902 -443120 -136835 -36495 45375 -52276
9557 6683 -107479 -147295 -157569 -248272 -18633 -258857 187813 153079 -302103 -217488 -220391
$$ packed form
9638D5602a54960M7635L2132D7801J4625J01888c26191a11875J9037A08541C424
9626h3825o9186I68a9163k30586B04779c98658f1505D3614a01976B40070b23278
9614i0779l46224f8311m91409a56088p6917C6136d3427k53675A29289c0438A2228
9602d35218A25078a61075A52894b85093G9274a41127A58805g6974C16412b7410
9591a16793l6945j12125J03548g2078j26029G1867a46839C6252J78420d45283
9580g1329k66670A98023C3539K76010M9457h6018M1235j23070g6876H6469Q0228
9569A66697a08900m5142O6767A86478q2842D9902d43120a36835c6495D5375e2276
9557F683a07479l9816j0274r0703a8633k40224A87813l4734c02103Q4615k903
$$ plain form
9546 -220391 157393 74735 -3338 -374770 186419 17517 128864 -181092 -91703 -15742 -15679
9535 -15679 159773 136886 -417020 264948 131177 166445 -230632 -113074 -109988 231780 -68605
9523 -205243 -66460 -174020 240796 -96922 -37434 -104640 44445 -89287 23072 -375768 -22488
9511 40987 145714 -173149 74107 -343633 -200307 -292366 -59086 216470 -35186 74792 51022
9500 51022 141302 -366132 118416 34338 -146393 -275791 105705 50783 -22878 -89693 115952
9488 -261749 -47839 -221332 -95092 -135308 32476 85580 -16278 28736 -131414 -162691 -359700
9477 -359700 376429 -295678 -60458 -291147 -33494 -41297 -122170 -8599 70542 -66093 17632
9465 -247010 -209866 164948 83942 -197422 -76795 -375007 -200639 -112146 38256 -59301 -228162
$$ packed form
9546b20391A57393G4735c338l71432A86419A7517J11347a81092Q9389a5742O3
9535a5679A59773k2887d17020B64948A31177L5268b30632a13074L086B31780f8605
9523b05243f6460j07560B40796i6922c7434o7206D4445h9287B3072c75768b2488
9511D0987J04727a73149G4107c43633J43326r2059e9086B16470c5186G4792k3770
9500E1022R0280c66132A18416C4338a46393j29398A05705E0783b2878o6815A15952
9488b61749d7839j73493i5092m0216C2476N3104a6278B8736a31414l1277j97009
9477c59700C76429b95678f0458k30689c3494p803q0873h599G0542f6093A7632
9465b47010L7144A64948q1006a97422g6795k98212J74368Q8493C8256e9301j68861
$$ plain form
9454 -228162 -148348 -148561 -27628 31846 114224 112814 -249835 -169332 89038 416 175214 -165253
9441 114603 -166816 47315 -224542 -15167 -107800 -120203 -92309 -13473 242635 214837 -155097
9429 17992 -143334 -342341 90750 -8828 210718 -27702 -72642 -86332 -41219 158016 -97529
9417 33784 107401 -242537 11567 -68049 -257815 261377 -196006 -41009 70903 -58883 -191037
9406 -191037 -319250 110970 -280401 -182945 -439256 -215566 148378 211503 -5399 66591 257838
9395 257838 -69850 -343310 -67393 221428 -373453 -1982 70308 293612 -121242 -73322 106565
9383 52032 -154454 189218 -144977 19623 33306 -133671 46447 -161099 -425811 -101307
9372 -94374 -88924 -154345 57080 -27439 194470 73175 -144059 -138431 -370530 -283017 -209289 -4750
$$ packed form
9454b28162P9814k13b7628C1846Q2378j410b49835Q0503H9038D16J74798a65253
9441A14603a66816D7315b24542a5167r2633j2403K7894a3473B42635k7798a55097
9429A7992a43334j99007I0750h828B10718b7702m4940j3690d1219A58016i7529
9417C3784P3617b42537A1567f8049j89766B61377a96006d1009G0903e8883j32154
9406a91037j28213A10970b80401R7456k56311b15566A48378O3125e399F6591J91247
9395B57838f9850k73460f7393B21428c73453a982G0308K23304a21242M7920A06565
9383E2032a54454A89218a44977A9623J3683a33671D6447a61099k64712a01307
9372i4374N450o5421E7080b7439A94470G3175a44059N628k32099Q7513P3728d750
$$ plain form
9359 281545 -30568 -55558 -205136 -24038 -326781 -449890 -111936 -81506 -260408 -318196 -65128
9347 -237558 -122232 55376 150800 -253376 -253147 -336080 -112949 47266 -44134 -173275 -184210
9336 -184210 -149229 269658 -213189 -59491 -486063 -94064 -73620 -90462 65266 34507 135666
9325 135666 54269 147385 22687 -60424 283111 -265293 -34491 90181 -227367 -17010 -89043
9314 -89043 -256701 41720 83710 237098 -237414 -52466 -242756 -492646 -222859 -260246 -38201
9302 10936 -32766 -37704 34743 39566 -101699 -252542 -176398 515 -22591 -144696 -271444 -119681
9289 165172 -436800 62901 -7084 -16905 -128878 146936 150440 -55063 27625 52215 -71221 70796
9276 -33019 51044 -21504 -155806 -365777 -127890 57835 -50831 128184 -70730 -109490 63227
$$ packed form
9359B81545c0568k4990j49578b4038l02743j23109a11936L0430j78902n7788f5128
9347b37558J15326E5376R5424b53376K29q2933a12949D7266d4134j29141j0935
9336a84210L4981B69658b13189e9491m26572i4064K0444j6842F5266l0759J01159
9325A35666E4269R3116B2687f0424B83111b65293c4491I0181b27367a7010p2033
9314h9043j67658D1720M1990J53388b37414e2466j90290k49890b22859l7387c8201
9302A0936c2766m938C4743M823a01699j50843P6144E15b2591j22105j26748a19681
9289A65172d36800F2901g084r821j11973A46936L504e5063B7625K4590g1221G0796
9276c3019E1044b1504j34302k09971a27890E7835e0831A28184g0730l8760F3227
$$ plain form
9264 -277627 -22846 -18965 101513 50189 -264741 49540 87521 -165877 -349867 -3505 -255732
9253 -255732 18177 -174583 -149900 109985 -198853 -386821 -100466 -46186 105184 -78720
9242 60195 -169215 165592 15528 -314101 -43193 -133982 -409595 -44144 81646 -80279 -204207
9231 -204207 66656 29689 115117 52988 -54468 -285366 -82131 -172311 -90387 -29062 -341221
9220 -341221 -7442 -189564 -116496 242449 -226215 -150110 118763 -184192 200453 344342
9210 344342 300527 -89083 123685 -11442 -238620 237639 -337974 165396 37581 150781
9200 150781 156220 22416 162939 -111309 -120745 -189768 -56000 -135891 195049 -27275 84439
9188 32986 -181577 -36296 145218 2298 -94579 -82098 -257136 -68028 -33038 -285297 -67456
$$ packed form
9264b77627b2846L881A01513E0189b64741D9540L7981a65877j83990c505k52227
9253b55732A8177a74583K4683A09985a98853j87968a00466d6186A05184g8720
9242F0195a69215A65592A5528c14101d3193r0789k75613d4144H1646h0279j23928
9231b04207F6656B9689Q5428E2988e4468k30898h2131r0180Q1924b9062l12159
9220c41221g442j82122P3068B42449b26215P6105A18763a84192B00453J43889
9210C44342m3815h9083A23685a1442k27178B37639c37974A65396C7581J13200
9200A50781N439B2416J40523a11309r436o9023e6000p9891A95049b7275H4439
9188C2986a81577c6296A45218B298i4579J2481j75038f8028c3038k52259f7456
$$ plain form
9176 34370 11288 -37629 225056 -68459 201797 -128954 45030 -196396 -83462 -112842 40078
9164 150724 -160399 -160080 54657 119861 -75196 -25055 150786 124423 250681 -51376 89587
9152 -372140 -4111 -150619 -273268 61729 353603 -300435 139357 -111557 66116 17504 -82202
9140 -29943 -118236 14867 -47289 137614 23786 -132065 181404 -104213 105925 217139 -222192
9128 -236751 -71429 -149160 -118440 -190090 -154567 -194787 -27793 -8860 -165940 -199639 215121
9116 35420 172645 -274892 -240861 151637 -41897 300397 26242 -69511 21480 49275 158550
9105 158550 -352982 64948 -159025 159761 -28695 70194 30859 -25896 -50414 -199764 27729
9093 -19278 -272673 -77885 -48680 123076 -81241 40454 8101 904 -5497 109877 347 8331 -48149
$$ packed form
9176C4370A1288c7629B25056f8459B01797a28954D5030a96396h3462k9380D0078
9164A50724a60399L19E4657O5204g5196b5055A50786k6363J26258e1376H9587
9152c72140d111j46508j22649F1729K91874c00435A39357a11557F6116A7504h2202
9140b9943q8293A4867d7289A37614B3786a32065A81404a04213A05925J11214b22192
9128b36751g1429p7731L0720p1650L5523m0220b7793h860j57080l3699B15121
9116C5420J37225b74892L4031A51637d1897C00397B6242f9511B1480K7795J09275
9105A58550c52982F4948a59025A59761b8695G0194C0859b5896k4518j49350B7729
9093a9278k53395g7885K9205A23076h1241D0454H101I04e497A09877C47P984d8149
$$ plain form
9079 83522 -22725 -138809 107066 -59897 -39762 -31896 66347 -113030 -132640 -114215 -301510
9068 -301510 -187795 -29585 -165142 94978 -102598 118264 258440 -55718 141791 86229
9058 86229 31984 1942 -210599 -197311 -334149 27913 113039 -46844 51005 162609 329678
9047 329678 -64966 -264258 -7301 -185676 -90016 -100236 -52817 -5469 -120925 -95899 -128760
9036 -128760 2312 -45766 -139620 103005 -309686 -154565 42373 -92878 -102953 157764 -222290
9024 167074 99357 -200166 40192 171112 -135649 -166411 -197648 23600 38428 266244 13001
9012 -257568 -112585 -86052 -379133 -55141 18385 -4584 -86467 -7854 187892 100401 -390675
9000 -342841 -7909 -188708 -136461 181341 25950 -189335 101896 87539 -36011 -255323 -31138
$$ packed form
9079H3522b2725j16084A07066e9897K0135P866F6347a13030j9610J8425j87295
9068c01510J13715b9585j35557I4978a02598A18264J40176e5718A41791n5562
9058H6229C1984A942b10599J3288j36838B7913Q5126d6844E1005J11604J67069
9047C29678f4966j99292g301j78375i0016j0220M7419e469j15456K5026l2861
9036a28760B312d5766r3854A03005c09686a54565D2373i2878j0075A57764b22290
9024A67074o7717b00166D0192J30920a35649l0762l1237B3600J4828K27816A3001
9012b57568a12585K6533k93081e5141A8385d584q1883g854A87892q7491c90675
9000c42841g909j80799N2247A81341B5950a89335A01896j4357c6011k19312c1138
$$ plain form
8988 22852 63086 8278 46676 188588 -24215 37190 -109967 138552 -41455 92302 16260
8976 130277 -384309 -69210 213786 -8966 93649 95591 64348 -244418 -165933 162823 -245145
8964 -297407 -119962 -267635 83553 -142690 45264 317233 73808 -247482 219131 85241
8953 -97692 -49017 14364 -293667 17413 -7297 -69517 -104431 -64779 -273428 -111135 76710
8941 45939 -106122 178276 175797 -43349 86195 83456 -238323 -186030 15577 -55640 88770 461
8928 29795 -19645 -47134 -185442 106212 -16277 409573 647668 2233522 526170 -17888
8917 -63920 -105878 -41908 -946 -271863 -147716 14900 -12755 48909 -106608 134111 -59598
8905 -30542 -185440 -383820 -595 -14781 -57501 149060 118757 239052 -80330 -5910 -29680 -57798
$$ packed form
8988B2852M0234H278L8398J41912b4215C7190a09967A38552d1455I2302A6260
8976A30277c84309f9210B13786h966I3649J942l1243b44418P8485A62823b45145
8964b97407a19962j47673H3553a42690D5264K71969G3808b47482B19131H5241
8953i7692M8675A4364b93667A7413g297o2220l4914L9652k08649a11135G6710
8941D5939a06122A78276k479d3349H6195k739b38323N2293A5577e5640H8770D61
8928B9795a9645k7489j38308A06212a6277D09573K38095J585854E26170a7888
8917f3920m1958d1908i46k70917J24147A4900a2755D8909a06608A34111e9598
8905c0542j54898j98380e95j4186m2720A49060l0303J20295h0330e910k3770k8118
$$ plain form
8893 -57798 -341225 16139 -51526 -173666 -455378 -393645 13441 -309571 -227938 -59467 30890
8881 -76169 228904 -50425 -9253 56735 71882 -276225 -320312 79238 -199021 -155471 -103613
8870 -103613 -261746 44312 -14392 30595 -9587 122114 -72107 -91014 -225287 -127035 -28699
8858 -74976 -44769 48029 84409 37189 109708 261930 163425 -130066 -43118 -16188 -81993
8847 -81993 28206 -27791 -247654 89364 216349 -386682 -107661 -159518 72334 -83392 -130131
$$ packed form
8893e7798k83427A6139e1526j22140k81712O1733A3441c09571Q1633e9467C0890
8881g6169B28904e0425i253E6735J5147b76225m4087G9238a99021M3550N1858
8870a03613j58133D4312a4392C0595i587A22114g2107j8907j34273R8252b8699
8858g4976L0207D8029L6380C7189P2519J52222r8505a30066d3118a6188o5805
8847h1993B8206b7791k19863H9364J26985c86682a07661n1857G2334h3392m6739
$$ [...]
##END NTUPLES=NMR SPECTRUM
##END=
