##TITLE=AC1727_3474_9208054_ibkSnlMSrY
##JCAMPDX= 6.0         $$ Bruker NMR JCAMP-DX V2.0
##DATA TYPE= NMR SPECTRUM
##DATA CLASS= NTUPLES
##ORIGIN= BRUKER
##OWNER= Administrator
$$ 1.72 TOPSPIN		Version 2.1
$$ 2015-06-01 18:11:53.889 -0700  Administrator@X
$$ Compression mode = diff/dup
##.OBSERVE FREQUENCY= 400.02188249412
##.OBSERVE NUCLEUS= ^1H
##.ACQUISITION MODE= SIMULTANEOUS (DQD)
##.ACQUISITION SCHEME= undefined
##.AVERAGES= 64
##.DIGITISER RES= 22
##SPECTROMETER/DATA SYSTEM= spect
##.PULSE SEQUENCE= noesygpps1d.comp
##.SOLVENT NAME= COFFEE_meoh
##.SHIFT REFERENCE= INTERNAL, COFFEE_meoh, 1, 14.96122
##AUDIT TRAIL= $$ (NUMBER, WHEN, WHO, WHERE, PROCESS, VERSION, WHAT)
$$ ##TITLE= Audit trail, TOPSPIN		Version 2.1
$$ ##JCAMPDX= 5.01
$$ ##ORIGIN= Bruker BioSpin GmbH
$$ ##OWNER= Administrator
$$ $$ E:\/data/COFFEE/nmr/AC1727_3474_9208054_ibkSnlMSrY/12/pdata/1/auditp.txt
$$ ##AUDIT TRAIL=  $$ (NUMBER, WHEN, WHO, WHERE, PROCESS, VERSION, WHAT)
(   1,<2015-06-01 18:11:48.717 -0700>,<Administrator>,<X>,<go>,<TOPSPIN 2.1>,
      <created by zg
	started at 2015-06-01 18:00:19.186 -0700,
	POWCHK enabled, PULCHK disabled,
       configuration hash MD5:
       21 0F 79 D6 B3 7B B4 F6 88 20 88 DB 03 48 BD 9F
       data hash MD5: 64K
       39 F5 72 86 4D E6 25 93 06 87 3C E6 6E 7B 32 29>)
(   2,<2015-06-01 18:11:51.826 -0700>,<Administrator>,<X>,<proc1d>,<TOPSPIN 2.1>,
      <Start of raw data processing
       efp LB = 0.3 FT_mod = 6 PKNL = 1 PHC0 = 0 PHC1 = 0 SI = 128K 
       data hash MD5: 128K
       5A 7B 8E 3D EC 51 3A 8F 2C 05 5F 90 23 0A 84 A4>)
(   3,<2015-06-01 18:11:52.701 -0700>,<Administrator>,<X>,<proc1d>,<TOPSPIN 2.1>,
      <pk PHC0 = -86.79199 PHC1 = 0 
       data hash MD5: 128K
       BD BB 53 61 E8 A0 28 23 E4 51 80 6A E7 C9 23 D6>)
(   4,<2015-06-01 18:11:53.076 -0700>,<Administrator>,<X>,<proc1d>,<TOPSPIN 2.1>,
      <abs ABSG = 1 
       data hash MD5: 128K
       1E 59 58 2E 0D 18 05 1C 27 D3 B4 D0 90 14 EE 16>)
(   5,<2015-06-01 18:11:53.186 -0700>,<Administrator>,<X>,<proc1d>,<TOPSPIN 2.1>,
      <abs ABSG = 2 
       data hash MD5: 128K
       FB 0B 5B 53 2D DF CF FF 6D 70 A7 54 EB 37 0A 67>)
(   6,<2015-06-01 18:11:53.264 -0700>,<Administrator>,<X>,<proc1d>,<TOPSPIN 2.1>,
      <abs ABSG = 3 
       data hash MD5: 128K
       C2 6B DF 5E 52 3F 46 33 8A C0 CB E2 4B 71 63 7A>)
(   7,<2015-06-01 18:11:53.358 -0700>,<Administrator>,<X>,<proc1d>,<TOPSPIN 2.1>,
      <abs ABSG = 4 
       data hash MD5: 128K
       95 68 F9 D7 68 73 2B D9 7A 3B BE 21 08 52 8C 02>)
(   8,<2015-06-01 18:11:53.483 -0700>,<Administrator>,<X>,<proc1d>,<TOPSPIN 2.1>,
      <abs ABSG = 5 
       data hash MD5: 128K
       76 60 F5 0C 40 37 26 22 4A B0 41 B8 C1 82 75 F5>)
$$ ##END=
$$ 
$$ $$ hash MD5
$$ $$ E2 8D C2 02 6E 42 62 46 4A 86 EE A7 38 E9 D9 72
##$RELAX= 
##$RELAX= 
##$RELAX= 
##$RELAX= 
##$RELAX= 
##$RELAX= 
##$RELAX= 
##$RELAX= 
$$ Bruker specific parameters
$$ --------------------------
##$DU= <E:\>
##$EXPNO= 12
$$ [...]
##$TP07= 0
##$TPNAME0= <>
##$TPNAME1= <>
##$TPNAME2= <>
##$TPNAME3= <>
##$TPNAME4= <>
##$TPNAME5= <>
##$TPNAME6= <>
##$TPNAME7= <>
##$TPOAL= (0..7)
0.5 0.5 0.5 0.5 0.5 0.5 0.5 0.5
##$TPOFFS= (0..7)
0 0 0 0 0 0 0 0
##$TUNHIN= 0
##$TUNHOUT= 0
##$TUNXOUT= 0
##$USERA1= <user>
##$USERA2= <user>
##$USERA3= <user>
##$USERA4= <user>
##$USERA5= <user>
##$V9= 5
##$VALIST= <valist>
##$VCLIST= <CCCCCCCCCCCCCCC>
##$VD= 0
##$VDLIST= <DDDDDDDDDDDDDDD>
##$VPLIST= <PPPPPPPPPPPPPPP>
##$VTLIST= <TTTTTTTTTTTTTTT>
##$WBST= 2048
##$WBSW= 25
##$XGAIN= (0..3)
0 0 0 0
##$XL= 0
##$YL= 0
##$YMAX_a= 5437253
##$YMIN_a= -11511049
##$ZGOPTNS= <>
##$ZL1= 120
##$ZL2= 120
##$ZL3= 120
##$ZL4= 120
##$ABSF1= 14.96122
##$ABSF2= -5.596962
##$ABSG= 5
##$ABSL= 3
##$ALPHA= 0
##$AQORDER= 0
##$ASSFAC= 0
##$ASSFACI= 0
##$ASSFACX= 0
##$ASSWID= 0
##$AUNMP= <proc_prof1d_extract.lims>
##$AXLEFT= 0
##$AXNAME= <>
##$AXNUC= <1H>
##$AXRIGHT= 0
##$AXTYPE= 0
##$AXUNIT= <>
##$AZFE= 0.1
##$AZFW= 0.1
##$BCFW= 0
##$BC_mod= 0
##$BYTORDP= 0
##$COROFFS= 0
##$CY= 15
##$DATMOD= 1
##$DC= 0
##$DFILT= <>
##$DTYPP= 0
##$F1P= 0
##$F2P= 0
##$FCOR= 0.5
##$FTSIZE= 131072
##$FT_mod= 6
##$GAMMA= 0
##$GB= 0
##$INTBC= 1
##$INTSCL= 1
##$ISEN= 128
##$LB= 0.3
##$LEV0= 0
##$LPBIN= 0
##$MAXI= 10000
##$MC2= 0
##$MEAN= 0
##$ME_mod= 0
##$MI= 0
##$NCOEF= 0
##$NC_proc= -2
##$NLEV= 6
##$NOISF1= 0
##$NOISF2= 0
##$NSP= 0
##$NTH_PI= 0
##$NZP= 0
##$OFFSET= 14.96122
##$PC= 1
##$PHC0= -86.79199
##$PHC1= 0
##$PH_mod= 1
##$PKNL= yes
##$PPARMOD= 0
##$PPDIAG= 0
##$PPIPTYP= 0
##$PPMPNUM= 2147483647
##$PPRESOL= 1
##$PSCAL= 4
##$PSIGN= 0
##$PYNMP= <proc.py>
##$REVERSE= no
##$SF= 400.020009550464
##$SI= 131072
##$SIGF1= 0
##$SIGF2= 0
##$SINO= 400
##$SIOLD= 131072
##$SPECTYP= <>
##$SREGLST= <1H.CDCl3>
##$SSB= 0
##$STSI= 131072
##$STSR= 0
##$SW_p= 8223.68421052631
##$SYMM= 0
##$S_DEV= 0
##$TDeff= 65536
##$TDoff= 0
##$TI= <>
##$TILT= no
##$TM1= 0
##$TM2= 0
##$TOPLEV= 0
##$USERP1= <user>
##$USERP2= <user>
##$USERP3= <user>
##$USERP4= <user>
##$USERP5= <user>
##$WDW= 1
##$XDIM= 131072
##$YMAX_p= 406610891
##$YMIN_p= -11205
##$CURPLOT= <Network HP LaserJet P1505>
##$CURPRIN= <$Network HP LaserJet P1505>
##$DFORMAT= <normdp>
##$LAYOUT= <+/1D_H.xwp>
##$LFORMAT= <normlp>
##$PFORMAT= <normpl>
##$SURQMSG= 1
$$ End of Bruker specific parameters
$$ ---------------------------------
##NTUPLES= NMR SPECTRUM
##VAR_NAME=  FREQUENCY,     SPECTRUM/REAL,   SPECTRUM/IMAG
##SYMBOL=    X,             R,               I
##VAR_TYPE=  INDEPENDENT,   DEPENDENT,       DEPENDENT
##VAR_FORM=  AFFN,          ASDF,            ASDF
##VAR_DIM=   131072,        131072,          131072
##UNITS=     HZ,            ARBITRARY UNITS, ARBITRARY UNITS
##FACTOR=    0.0627417313425164, 1,          1
##FIRST=     8223.62146879497, 1191,         -54197
##LAST=      0,             2799,            -54223
##MIN=       0,             -11205,          0
##MAX=       8223.62146879497, 406610891,    0
$$ Real data points
##PAGE= N=1
##DATA TABLE= (X++(R..R)), XYDATA
$$ [...]
$$ plain form
61638 504806 507430 509026 508838 506857 503888 500595 496924 492666 488071 483524 478977 474128 468983 463889
61624 463889 459174 455106 452148 450858 451403 453320 455749 457820 458849 458447 456653 453930 450793 447291 442986
61609 442986 437654 431893 426699 422387 418381 414248 410426 407553 405505 403637 401649 399606 397334 394560
61595 394560 391595 389182 387581 386364 385115 383755 382141 380088 377962 376583 376289 376657 377324 378411 379769
61580 379769 380497 379774 377796 375467 373497 372154 371517 371525 371943 372563 373278 373856 374081 374244 375066 376805 378884
61563 378884 380648 382120 383723 385638 387732 389725 391111 391370 390592 389552 388884 388563 388440 388754 389711 391012
61547 391012 392310 393727 395445 397172 398561 399927 401995 405027 408543 411827 414501 416812 419532 423197
61533 423197 427289 430545 432304 433083 433597 433804 433332 432266 431011 429795 428728 427907 427017 425449 423305 421626
$$ packed form
61638E04806K624J596j88j981k969l293l671m258m595m547m547m849n145n094
61624D63889m715m068k958j290N45J917K429K071J029m02j794k723l137l502m305
61609D42986n332n761n194m312m006m133l822k873k048j868j988k043k272k774
61595C94560k965k413j601j217j249j360j614k053k126j379k94L68O67J087J358
61580C79769P28p23j978k329j970j343o37QM18O20P15N78K25J63Q22J739K079
61563C78884J764J472J603J915K094J993J386K59p78j040o68l21j23L14R57J301
61547C91012J298J417J718J727J389J366K068L032L516L284K674K311K720L665
61533D23197M092L256J759P79N14K07m72j066j255j216j067q21q90j568k144j679
$$ plain form
61517 421626 421018 420714 419842 418892 418828 419251 418765 417016 415078 413732 412551 411069 409768 409275 409317 409112 408400
61500 408400 407548 406944 406684 406751 407147 407874 408877 410019 411205 412586 414420 416514 418110 418811 419396 421147
61484 421147 424366 427989 430725 432162 432765 433258 434111 435269 436234 436610 436544 436443 436396 436253 436082 436077 436101 435812 435308
61465 435308 435121 435433 435692 435228 433964 432368 430957 430002 429575 429710 430492 431903 433592 435030 436030 436898
61449 436898 437913 438967 439965 441207 442955 444977 447000 449320 452398 456107 459988 464033 468498 473056
61435 473056 476957 480077 483054 486166 488834 490559 491699 492888 494173 495295 496464 498294 500984 503979
61421 503979 506487 508089 508815 508871 508418 507529 506210 504376 501998 499353 496985 495082 493012 489953 485995
61406 485995 482099 478810 475655 472137 468619 465608 462781 459554 456274 453873 452488 451274 449638 447927
$$ packed form
61517D21626o08l04q72r50o4M23m86j749j938j346j181j482j301m93M2k05p12
61500D08400q52o04k60O7L96P27J003J142J186J381J834K094J596P01N85J751
61484D21147L219L623K736J437O03M93Q53J158R65L76o6j01m7j43j71nK4k89n04
61465D35308j87L12K59m64j264j596j411r55m27J35P82J411J689J438J000Q68
61449D36898J015J054R98J242J748K022K023K320L078L709L881M045M465M558
61435D73056L901L120K977L112K668J725J140J189J285J122J169J830K690K995
61421E03979K508J602P26N6m53q89j319j834k378k645k368j903k070l059l958
61406D85995l896l289l155l518l518l011k827l227l280k401j385j214j636j711
$$ plain form
61392 447927 446727 446229 446432 447392 448934 450559 451877 452867 453681 454507 455623 457154 458804 460240 461689 463644
61376 463644 466005 468129 469826 471693 474250 477201 479805 481626 482741 483603 484846 486908 489709 492938
61362 492938 496593 500884 505685 510593 515536 520828 526670 533160 540783 550196 561356 573563 586574
61349 586574 601006 617246 634523 651387 666655 679537 689495 696544 701350 704487 705845 705073 702265
61336 702265 697766 691669 684087 675676 667294 659137 650731 641854 633098 625343 618969 613713 609142 605087
61322 605087 601681 599123 597434 596389 595603 594766 593992 593947 595309 597936 600806 603108 605226 608367 613418
61307 613418 620546 629643 640535 652666 665087 676940 687640 696480 702431 704555 702530 696856 688730
61294 688730 679518 669945 659905 649435 639614 631829 626266 621916 618211 615845 615561 616793 618128 618775
$$ packed form
61392D47927j200m98K03R60J542J625J318R90Q14Q26J116J531J650J436J449J955
61376D63644K361K124J697J867K557K951K604J821J115Q62J243K062K801L229
61362D92938L655M291M801M908M943N292N842O490P623R413J1160J2207J3011
61349E86574J4432J6240J7277J6864J5268J2882R958P049M806L137J358p72k808
61336G02265m499o097p582q411q382q157q406q877q756p755o374n256m571m055
61322F05087l406k558j689j045p86q37p74m5J362K627K870K302K118L141N051
61307F13418P128R097J0892J2131J2421J1853J0700Q840N951K124k025n674q126
61294F88730r212r573j0040j0470r821p785n563m350l705k366k84J232J335O47
$$ plain form
61280 618775 619122 620132 622626 626984 633032 640113 647520 654973 662674 671000 680092 689589 698771 707194
61266 707194 715190 723533 732687 742655 753581 766112 781030 798623 818298 838478 856963 871815
61254 871815 882030 887255 887140 881528 871167 857687 842666 827093 811603 796702 782602 769341
61242 769341 757194 746595 737639 730106 723955 719274 715702 712483 709201 705927 702650 699302 696535 695657
61228 695657 697325 700842 705147 709928 715303 720895 725840 729467 731633 732534 732465 731544 729650 726976 724644
61213 724644 724140 725876 728864 732001 735036 738023 740671 742976 745896 750623 757503 766267 776958 789855
61199 789855 804748 821095 838969 859176 882276 907917 935241 963425 991581 1018379 1042142
61188 1042142 1061413 1075465 1084450 1089223 1091039 1091182 1090472 1088927 1086022 1081399 1075039 1066628 1055352 1040895
$$ packed form
61280F18775L47J010K494M358O048P081P407P453P701Q326R092R497R182Q423
61266G07194P996Q343R154R968J0926J2531J4918J7593J9675K0180J8485J4852
61254H71815J0215N225j15n612j0361j3480j5021j5573j5490j4901j4100j3261
61242G69341j2147j0599q956p533o151m681l572l219l282l274l277l348k767q78
61228F95657J668L517M305M781N375N592M945L627K166R01o9r21j894k674k332
61213G24644n04J736K988L137L035K987K648K305K920M727O880Q764J0691J2897
61199G89855J4893J6347J7874K0207K3100K5641K7324K8184K8156K6798K3763
61188A042142J9271J4052Q985M773J816J43p10j545k905m623o360q411j1276j4457
$$ plain form
61174 1040895 1024236 1006753 988772 969746 949643 929136 908415 886887 864368 841686 819791
61163 819791 799119 780177 763760 749975 737917 726933 717524 710347 705098 701137 698528 697602 698156
61150 698156 700001 703785 710169 718426 726777 733923 739336 742317 741923 738106 732194 725955 720675 717129
61136 717129 715796 716875 720526 727202 737324 750507 765626 781788 798999 817784 838505 861171
61124 861171 885577 911382 938086 965116 992073 1018964 1046132 1073702 1101079 1127220 1151362
61113 1151362 1173191 1192348 1208353 1221181 1231429 1239598 1245599 1249197 1250462 1249509 1246190 1240303 1231641
61100 1231641 1219535 1202957 1181454 1155604 1126283 1094129 1060164 1026222 993952 963751 935252
61089 935252 908471 883868 861628 841562 823543 807589 793740 782226 773323 766637 761055 755937
$$ packed form
61174A040895j6659j7483j7981j9026k0103k0507k0721k1528k2519k2682k1895
61163H19791k0672j8942j6417j3785j2058j0984r409p177n249l961k609r26N54
61150F98156J845L784O384Q257Q351P146N413K981l94l817n912o239n280l546
61136G17129j333J079L651O676J0122J3183J5119J6162J7211J8785K0721K2666
61124H61171K4406K5805K6704K7030K6957K6891K7168K7570K7377K6141K4142
61113A151362K1829J9157J6005J2828J0248Q169O001L598J265r53l319n887q662
61100A231641j2106j6578k1503k5850k9321l2154l3965l3942l2270l0201k8499
61089I35252k6781k4603k2240k0066j8019j5954j3849j1514q903o686n582n118
$$ plain form
61077 755937 751831 749468 748605 748559 749260 750903 753059 755152 757529 761111 766150 772198 779159 787445 797164
61062 797164 807943 819589 832286 846293 862073 880371 901365 923950 946836 970239 995557
61051 995557 1023439 1053136 1083758 1115164 1147416 1180224 1213235 1246142 1278348 1309220 1338942
61040 1338942 1368421 1398106 1427340 1454999 1480313 1503125 1523967 1543941 1563937 1583931 1603483
61029 1603483 1622719 1642138 1661687 1680932 1700145 1720368 1742440 1766808 1794256 1825756 1861335
61018 1861335 1899879 1940230 1981800 2024242 2067697 2113674 2164766 2223165 2290200 2367333 2456353
61007 2456353 2558137 2672186 2797932 2936039 3088806 3260892 3460132 3696300 3978535
60998 3978535 4315081 4715709 5192780 5760134 6434070 7237138 8199005 9353329 10737382
$$ packed form
61077G55937m106k363q63m6P01J643K156K093K377L582N039O048O961Q286R719
61062G97164J0779J1646J2697J4007J5780J8298K0994K2585K2886K3403K5318
61051I95557K7882K9697L0622L1406L2252L2808L3011L2907L2206L0872K9722
61040A338942K9479K9685K9234K7659K5314K2812K0842J9974J9996J9994J9552
61029A603483J9236J9419J9549J9245J9213K0223K2072K4368K7448L1500L5579
61018A861335L8544M0351M1570M2442M3455M5977N1092N8399O7035P7133Q9020
61007B456353J01784J14049J25746J38107J52767J72086J99240K36168K82235
60998C978535L36546M00628M77071N67354O73936Q03068R61867J154324J384053
$$ plain form
60989 10737382 12390721 14329096 16482492 18640609 20481866 21707817 22199862 22076856
60981 22076856 21616355 21119750 20821580 20857813 21239491 21814260 22275409 22272480 21578358 20194707
60971 20194707 18322978 16241141 14185515 12299683 10642875 9220296 8010819 6985891
60963 6985891 6119529 5390609 4781329 4275688 3858711 3515810 3232715 2996340 2795622
60954 2795622 2621650 2467662 2329221 2203833 2089789 1985304 1888672 1798779 1715199 1638027
60944 1638027 1567688 1504508 1448048 1396795 1348503 1300922 1252658 1203897 1156386 1112280 1072662
60933 1072662 1037159 1004836 975184 948208 923971 902309 882943 865725 850742 838126 827688
60922 827688 818835 810986 804082 798606 795114 793735 794002 795084 796304 797535 799037 800878 802668 803852
$$ packed form
60989A0737382J653339J938375K153396K158117J841257J225951M92045j23006
60981B2076856m60501m96605k98170L6233L81678N74769M61149k929o94122j383651
60971B0194707j871729k081837k055626j885832j656808j422579j209477j024928
60963F985891q66362p28920o09280n05641m16977l42901k83095k36375k00718
60954B795622j73972j53988j38441j25388j14044j04485r6632q9893q3580p7172
60944A638027p0339o3180n6460n1253m8292m7581m8264m8761m7511m4106l9618
60933A072662l5503l2323k9652k6976k4237k1662j9366j7218j4983j2616j0438
60922H27688q853p849o904n476l492j379K67J082J220J231J502J841J790J184
$$ plain form
60908 803852 804099 803352 801746 799527 796741 792913 787362 780017 771636 763025 754394 745663 736904 728095 718849
60893 718849 708951 698941 689570 680862 672304 663949 656606 650758 645846 640957 635834 630875 626380 622170
60879 622170 617831 613083 607916 602607 597555 592987 588770 584621 580478 576619 573431 571104 569502 568288
60865 568288 567201 566293 565918 566420 567827 569833 572099 574528 577207 580113 583023 585769 588513 591655 595409
60850 595409 599475 603143 605737 607108 607798 608757 610804 614201 618541 622830 625768 626261 623989 619514 613798
60835 613798 607631 601440 595404 589624 584279 579703 576135 573316 570574 567473 564203 561219 558735 556753
60821 556753 555237 553881 551962 548909 545002 541078 537555 534083 530184 525855 521420 517094 512886 508806
60807 508806 504993 501580 498426 495033 490954 486340 481878 478063 474828 472002 469731 468144 466966 465909
$$ packed form
60908H03852K47p47j606k219k786l828n551p345q381q611q631q731q759q809r246
60893G18849r898j0010r371q708q558q355p343n848m912m889n123m959m495m210
60879F22170m339m748n167n309n052m568m217m149m143l859l188k327j602j214
60865E68288j087r08l75N02J407K006K266K429K679K906K910K746K744L142L754
60850E95409M066L668K594J371O90R59K047L397M340M289K938M93k272m475n716
60835F13798o167o191o036n780n345m576l568k819k742l101l270k984k484j982
60821E56753j516j356j919l053l907l924l523l472l899m329m435m326m208m080
60807E08806l813l413l154l393m079m614m462l815l235k826k271j587j178j057
$$ plain form
60793 465909 465131 464851 464813 464638 464489 464788 465429 465856 465878 465791 465810 465954 466456 467615 469142 470333 471034 471836 473091
60774 473091 474355 475142 475738 476811 478535 480471 482194 483739 485452 487481 489483 491045 492429 494489 497482
60759 497482 500392 502013 502380 502415 502448 501965 500772 499438 498384 497340 495955 494269 492364 490289 488522 487726
60743 487726 487651 486982 484675 480881 476248 471082 465661 460655 456546 453068 449742 446633 444113 442279 440991
60728 440991 440097 439224 437793 435660 433390 431568 430208 429112 428295 427738 427282 427170 428119 430317 432888 434859
60712 434859 436213 437535 439139 441138 443790 447019 449999 451939 453054 454140 455455 456685 457677 458585 459458
60697 459458 460344 461581 463391 465319 466676 467373 467795 468091 468189 468299 468714 469220 469420 469522 470135 471250 472107
60680 472107 472232 471994 472001 472397 472941 473307 473172 472379 471199 470131 469273 468113 466059 463025 459467 456009 453006
$$ packed form
60793D65909p78k80l8j75j49K99O41M27K2q7J9J44N02J159J527J191P01Q02J255
60774D73091J264P87N96J073J724J936J723J545J713K029K002J562J384K060K993
60759D97482K910J621L67L5L3m83j193j334j054j044j385j686j905k075j767p96
60743D87726p5o69k307l794m633n166n421n006m109l478l326l109k520j834j288
60728D40991q94q73j431k133k270j822j360j096q17n57m56j12R49K198K571J971
60712D34859J354J322J604J999K652L229K980J940J115J086J315J230R92R08Q73
60697D59458Q86J237J810J928J357O97M22K96R8J10M15N06K00J02O13J115Q57
60680D72107J25k38PL96N44L66j35p93j180j068q58j160k054l034l558l458l003
$$ plain form
60663 453006 450319 447515 444386 441212 438490 436588 435719 435909 436821 437967 439330 441389 444254 447210 449538
60648 449538 451406 453430 455699 457773 459375 460395 460355 458589 455096 450744 446522 442940 440196 438517 438088
60633 438088 438749 439834 440435 440128 439556 439892 441494 443416 444572 444925 445205 445829 446620 447205 447236 446550 445596 445293
60615 445293 445892 446434 446020 445165 445020 445584 445772 445184 444683 445007 445768 446213 446150 445688 444709 443172 441491 440145
60597 440145 439192 438536 438405 439187 440977 443532 446560 449889 453466 457265 461091 464506 467186 469290 471204
60582 471204 472957 474241 474956 475313 475356 474853 473934 473444 474343 476869 480434 484239 487934 491898 496955 503706
60566 503706 512086 521692 532444 544653 558393 573090 587890 602172 615530 627360 636707 642635
60554 642635 644753 643416 639458 633756 627083 620173 613691 608073 603527 600157 597903 596462 595645 595814 597603
$$ packed form
60663D53006k687k804l129l174k722j902q69J90R12J146J363K059K865K956K328
60648D49538J868K024K269K074J602J020m0j766l493m352m222l582k744j679m29
60633D38088O61J085O01l07n72L36J602J922J156L53K80O24P91N85L1o86r54l03
60615D45293N99N42m14q55j45N64J88n88n01L24P61M45o3m62r79j537j681j346
60597D40145r53o56j31P82J790K555L028L329L577L799L826L415K680K104J914
60582D71204J753J284P15L57M3n03r19m90Q99K526L565L805L695L964N057O751
60566E03706Q380R606J0752J2209J3740J4697J4800J4282J3358J1830R347N928
60554F42635K118j337l958n702o673o910o482n618m546l370k254j441q17J69J789
$$ plain form
60539 597603 601236 606581 613939 624136 637578 653734 671833 691540 712543 734043 755138 775227
60527 775227 793524 808594 819044 824436 825114 821530 814298 804496 793222 781006 768195 755609 744149
60514 744149 733983 724717 716227 708778 702595 697949 695412 695313 697063 699715 703158 708152 715303 724591
60500 724591 735855 749193 764984 784072 807743 836865 871203 910141 953806 1002596 1055655
60489 1055655 1110640 1165015 1216780 1263971 1304478 1336738 1359950 1373336 1375827 1366851 1346970 1317454
60477 1317454 1279525 1234196 1182593 1126392 1068085 1010517 955696 904251 856431 813092 775002
60466 775002 741699 712140 686205 664409 646234 630065 614913 600961 588134 575578 563191
60455 563191 552392 544368 538378 532738 526847 521280 516434 512129 508333 505340 503116 501119 498914 496597
$$ packed form
60539E97603L633N345P358J0197J3442J6156J8099J9707K1003K1500K1095K0089
60527G75227J8297J5070J0450N392O78l584p232r802j1274j2216j2811j2586j1460
60514G44149j0166r266q490p449o183m646k537r9J750K652L443M994P151R288
60500G24591J1264J3338J5791J9088K3671K9122L4338L8938M3665M8790N3059
60489A055655N4985N4375N1765M7191M0507L2260K3212J3386K491q976j9881k9516
60477A317454l7929m5329n1603n6201n8307n7568n4821n1445m7820m3339l8090
60466G75002l3303k9559k5935k1796j8175j6169j5152j3952j2827j2556j2387
60455E63191j0799q024n990n640n891n567m846m305l796k993k224j997k205k317
$$ plain form
60441 496597 494521 492835 491356 489809 488180 486780 485788 484856 483570 482199 481470 481523 481655 481353 481002 481237
60425 481237 481965 482462 482241 481530 481002 481181 482011 482988 483833 484883 486576 488753 490841 492545 493905 494865 495410
60408 495410 495988 497159 498857 500607 502345 504326 506347 507932 509243 510883 512696 513834 514256 515126 517294
60393 517294 520266 523213 526110 529227 532247 534663 536640 538816 541566 544822 548233 551198 553210 554476
60379 554476 555720 557155 558331 559260 560856 563730 567251 570412 573030 575484 577815 579788 581425 582871
60365 582871 584042 584859 585558 586380 587329 588495 590092 591911 593430 594878 597388 601556 606615 611734 617421
60350 617421 624753 633773 643523 653215 662496 670911 678030 683901 688548 691202 690807 687238 681429 674470
60336 674470 667138 660045 653434 646954 640252 633676 627844 622713 617789 613108 609290 606622 604729 603179
$$ packed form
60441D96597k076j686j479j547j629j400r92r32j286j371p29N3J32l02l51K35
60425D81237P28M97k21p11n28J79Q30R77Q45J050J693K177K088J704J360R60N45
60408D95410N78J171J698J750J738J981K021J585J311J640J813J138M22Q70K168
60393E17294K972K947K897L117L020K416J977K176K750L256L411K965K012J266
60379E54476J244J435J176R29J596K874L521L161K618K454K331J973J637J446
60365E82871J171Q17O99Q22R49J166J597J819J519J448K510M168N059N119N687
60350F17421P332R020R750R692R281Q415P119N871M647K654l95l569n809o959
60336F74470p332p093o611o480o702o576n832n131m924m681l818k668j893j550
$$ plain form
60322 603179 601865 600764 599872 599429 599725 600681 602006 603694 606036 609232 613453 619181 626958 636828 648412
60307 648412 661535 676427 693372 712435 733445 756050 780001 805500 832715 860362 885229
60296 885229 903872 914770 918370 915349 905652 889209 866833 840161 811187 781932 754141 729028
60284 729028 707350 689514 675270 663514 652934 642961 633840 625932 619272 613639 608627 603723 598702
60271 598702 593904 589868 586836 584764 583481 582454 580839 578325 575692 573982 573345 573214 573279 573576 573887 573933
60255 573933 574135 575361 577697 580114 581559 581843 581318 580276 578966 577721 576684 575605 574144 572291 570451
60240 570451 569253 569189 570207 571746 573377 575227 577525 580067 582650 585767 590216 596038 602433 608700 614710
60225 614710 620476 625968 631499 637674 644629 651822 658857 666026 673696 681563 688984 695804 702469 709455
$$ packed form
60322F03179j314j101q92m43K96R56J325J688K342L196M221N728P777R870J1584
60307F48412J3123J4892J6945J9063K1010K2605K3951K5499K7215K7647K4867
60296H85229J8643J0898L600l021r697j6443k2376k6672k8974k9255k7791k5113
60284G29028k1678j7836j4244j1756j0580r973r121p908o660n633n012m904n021
60271E98702m798m036l032k072j283j027j615k514k633j710o37j31O5K97L11M6
60255E73933K02J226K336K417J445K84n25j042j310j245j037j079j461j853j840
60240E70451j198o4J018J539J631J850K298K542K583L117M449N822O395O267O010
60225F14710N766N492N531O175O955P193P035P169P670P867P421O820O665O986
$$ plain form
60211 709455 716875 724568 732247 739516 745935 751196 755246 758269 760555 762350 763778 764793 765155 764484 762476
60196 762476 759112 754545 748900 742454 735964 730323 725662 721088 715640 709290 702804 696922 691946 687872
60182 687872 684515 681595 679007 676908 675386 674258 673401 673099 673773 675494 677942 680653 683206 685478 687939
60167 687939 691359 695911 700815 705001 707825 708989 708382 706488 704494 703426 703382 703927 704836 706062 707463
60152 707463 709175 711891 716137 721505 727178 732852 738610 744251 749525 754796 760701 767273 774044 780869
60138 780869 787964 795288 802637 810264 818688 827842 837065 845805 853665 859874 863638 865091 865113 864074 861607
60123 861607 857839 853978 851184 849483 848242 847170 846297 845386 843882 841352 837683 833092 828139 823436 819034
60108 819034 814224 808205 800927 793181 786004 780120 775813 773099 771852 771676 771889 771984 772143 772859 773959 774568
$$ packed form
60211G09455P420P693P679P269O419N261M050L023K286J795J428J015L62o71k008
60196G62476l364m567n645o446o490n641m661m574n448o350o486n882m976m074
60182F87872l357k920k588k099j522j128q57l02O74J721K448K711K553K272K461
60167F87939L420M552M904M186K824J164o07j894j994j068m4N45R09J226J401
60152G07463J712K716M246N368N673N674N758N641N274N271N905O572O771O825
60138G80869P095P324P349P627Q424R154R223Q740P860O209L764J453K2j039k467
60123H61607l768l861k794j701j241j072q73r11j504k530l669m591m953m703m402
60108H19034m810o019p278p746p177n884m307k714j247j76K13R5J59P16J100O09
$$ plain form
60092 774568 774378 774372 775765 778701 782559 786998 791916 796753 800899 804701 809102 814106 818416 820776 820949
60077 820949 819130 815131 808553 799305 787669 774225 759940 745920 732812 720670 709454 699329
60065 699329 690416 682694 676259 671325 667872 665569 664109 663279 662760 662158 661315 660321 659367 658886 659607 662007
60049 662007 665848 670644 676296 682721 689180 694819 699712 704506 708937 711565 711245 708196 703415 697739
60035 697739 691764 685955 680386 674686 668620 662402 656352 650576 645043 639553 633621 626965 620143 614117
60021 614117 609038 604072 598598 592925 587552 582384 577134 571982 567287 563024 558971 555285 552479 550888
60007 550888 550403 550688 551454 552521 553657 554474 554772 555063 556381 559214 562897 566433 569589 572759 576156 579809
59991 579809 584070 589286 595002 600141 603913 606029 606302 604806 602228 599223 595555 590761 585471 580973
$$ packed form
60092G74568j90oJ393K936L858M439M918M837M146L802M401N004M310K360J73
60077H20949j819l999o578r248j1636j3444j4285j4020j3108j2142j1216j0125
60065F99329q913p722o435m934l453k303j460q30n19o02q43r94r54m81P21K400
60049F62007L841M796N652O425O459N639M893M794M431K628l20l049m781n676
60035F97739n975n809n569n700o066o218o050n776n533n490n932o656o822o026
60021F14117n079m966n474n673n373n168n250n152m695m263m053l686k806j591
60007E50888m85K85P66J067J136Q17K98K91J318K833L683L536L156L170L397L653
59991E79809M261N216N716N139L772K116K73j496k578l005l668m794n290m498
$$ plain form
59977 580973 577501 574145 570615 567829 566377 565640 565030 565038 566314 568584 571277 574566 578959 584414 590572
59962 590572 597401 604913 612538 619375 624773 628299 629558 628590 626139 623090 619864 616643 613749 611344
59948 611344 609077 606460 603416 600190 596896 593386 589437 585026 580659 577261 575327 574302 573383 572773 573421
59933 573421 575603 578660 582120 586081 590359 594368 598245 603028 609224 616191 623394 631181 639634 647715
59919 647715 654457 660126 665344 669871 673348 676561 680853 686591 693121 699826 706376 712311 717302 721605
59905 721605 725511 728644 730501 731293 731441 730681 728639 726080 724572 724860 726313 727961 729441 730993 733108
59890 733108 736111 739551 742308 743945 745683 749224 754819 761311 767910 774878 782391 789776 796281 801798
59876 801798 806320 809331 810351 809767 808480 806802 804157 799991 794689 789249 784116 778653 772074 764633
$$ packed form
59977E80973l472l356l530k786j452p37o10QJ276K270K693L289M393N455O158
59962E90572O829P512P625O837N398L526J259r68k451l049l226l221k894k405
59948F11344k267k617l044l226l294l510l949m411m367l398j934j025r19o10O48
59933E73421K182L057L460L961M278M009L877M783O196O967P203P787Q453Q081
59919F47715O742N669N218M527L477L213M292N738O530O705O550N935M991M303
59905G21605L906L133J857P92J48p60k042k559j508K88J453J648J480J552K115
59890G33108L003L440K757J637J738L541N595O492O599O968P513P385O505N517
59876H01798M522L011J020n84j287j678k645m166n302n440n133n463o579p441
$$ plain form
59862 764633 757424 751094 745350 739871 734981 731071 727894 725012 722560 721050 720670 721259 722750 725224 728626
59847 728626 732765 737347 741846 745693 748963 752465 756775 761656 766864 773005 780776 789606 797792 804035
59833 804035 808389 811804 815290 819490 824534 830057 835454 840011 842681 842136 837523 829174 818292 806123
59819 806123 793552 781143 769132 757487 746276 735844 726477 718185 710994 705089 700430 696626 693519
59806 693519 691457 690665 690763 691210 691787 692248 692016 690770 688913 686962 684852 682307 679447 676489 673340 670066
59790 670066 667292 665384 663639 661060 657677 654344 651460 648707 645915 643382 641305 639591 638314 637742
59776 637742 637844 638252 638810 639745 641228 643119 645230 647603 650589 654743 660457 667457 674920 682287 689619
59761 689619 697100 704792 713128 722851 733813 744519 753668 761693 770025 779304 789170 799348 809852
$$ packed form
59862G64633p209o330n744n479m890l910l177k882k452j510l80N89J491K474L402
59847G28626M139M582M499L847L270L502M310M881N208O141P771Q830Q186O243
59833H04035M354L415L486M200N044N523N397M557K670n45m613q349j0882j2169
59819H06123j2571j2409j2011j1645j1211j0432r367q292p191n905m659l804l107
59806F93519k062p92R8M47N77M61k32j246j857j951k110k545k860k958l149l274
59790F70066k774j908j745k579l383l333k884k753k792k533k077j714j277n72
59776F37742J02M08N58R35J483J891K111K373K986M154N714P000P463P367P332
59761F89619P481P692Q336R723J0962J0706R149Q025Q332R279R866J0178J0504
$$ plain form
59748 809852 820218 829521 837221 843279 847503 849545 849452 847529 843726 837919 830683 823021 815361 807620
59734 807620 800242 794212 789815 786182 782373 778286 774224 770210 766143 762247 758962 756501 754615 752700
59720 752700 750249 747457 745217 744158 743912 743723 743527 743877 744968 746370 747701 749040 750679 752947 756178
59705 756178 760355 764825 768798 772059 774825 777131 778908 780453 782193 784059 785669 786994 788230 789169
59691 789169 789350 788804 788014 787175 786122 784913 783860 782974 781996 780901 779724 777875 774358 768823 761901 754407
59675 754407 746787 739303 732193 725532 719393 714097 709815 706074 702321 698862 696554 695603 695448 695805 696975
59660 696975 698932 701019 702879 704994 707924 711538 715394 719325 723291 727016 730071 732011 732338 730751
59646 730751 727607 723628 718999 713248 706274 698973 692490 687260 683217 680560 679686 680318 681183 680882 679070
$$ packed form
59748H09852J0366R303P700O058M224K042r3j923l803n807p236p662p660p741
59734H07620p378o030m397l633l809m087m062m014m067l896l285k461j886j915
59720G52700k451k792k240j059k46j89j96L50J091J402J331J339J639K268L231
59705G56178M177M470L973L261K766K306J777J545J740J866J610J325J236R39
59691G89169J81n46p90q39j053j209j053q86r78j095j177j849l517n535o922p494
59675G54407p620p484p110o661o139n296m282l741l753l459k308r51j55L57J170
59660F96975J957K087J860K115K930L614L856L931L966L725L055J940L27j587
59646G30751l144l979m629n751o974p301o483n230m043k657q74O32Q65l01j812
$$ plain form
59631 679070 676546 674090 671431 667656 662481 656579 650631 644764 639206 634748 631901 630043 628110 625878
59617 625878 623998 623023 622962 623524 624259 624754 625266 626872 630330 635025 639623 643521 647091 650785 654623 658286
59601 658286 661096 662289 661975 661504 662159 663796 665473 666917 668464 669956 670693 670318 668879 666324 662854
59586 662854 659379 656627 654124 651104 648043 646047 644985 643567 641169 638254 635150 631822 628878 627248
59572 627248 626671 625945 624891 624664 625789 627435 629044 631156 633917 636248 637345 637814 638446 638989 639021 638974 639372
59555 639372 639918 640199 640463 640940 641214 641112 641442 643025 645686 648958 653064 658470 665255 673683 684504 697869
59539 697869 712869 729279 748757 772638 798727 821714 837043 843803 844245 841810 839659 839714 842033
59526 842033 845232 847844 849261 849517 848630 846311 842089 835625 826959 816442 804416 791134 776964 762472
$$ packed form
59631F79070k524k456k659l775n175n902n948n867n558m458k847j858j933k232
59617F25878j880r75o1N62P35M95N12J606L458M695M598L898L570L694L838L663
59601F58286K810J193l14m71O55J637J677J444J547J492P37l75j439k555l470
59586F62854l475k752k503l020l061j996j062j418k398k915l104l328k944j630
59572F27248n77p26j054k27J125J646J609K112K761K331J097M69O32N43L2m7L98
59555F39372N46K81K64M77K74j02L30J583K661L272M106N406O785Q428J0821J3365
59539F97869J5000J6410J9478K3881K6089K2987J5329O760M42k435k151N5K319
59526H42033L199K612J417K56q87k319m222o464q666j0517j2026j3282j4170j4492
$$ plain form
59512 762472 748305 735169 723779 714375 706382 699017 692240 686627 682356 678931 675934 673400 671318
59499 671318 669497 668064 667448 667633 668043 668372 668874 669625 670230 670577 671189 672478 674189 675919 677627 679402
59483 679402 681331 683834 687546 692538 698180 703914 709605 715120 720358 725808 732115 738846 744568 748516
59469 748516 751280 753562 755272 756401 757778 760249 763824 768274 773871 780897 789054 797950 807564 817674
59455 817674 827417 835934 842912 848179 851475 852980 853277 852379 849620 844881 838948 832149 823709 813193
59441 813193 801577 790177 779481 769890 762511 758055 755731 754376 754061 755520 758626 762634 767480 773780
59427 773780 781911 792069 804779 820263 837634 855684 874185 893468 913104 932079 949963 966806
59415 966806 982155 995530 1007935 1021424 1036284 1049264 1055293 1051107 1037381 1017981 997468 979047
$$ packed form
59512G62472j4167j3136j1390r404p993p365o777n613m271l425k997k534k082
59499F71318j821j433o16J85M10L29N02P51O05L47O12J289J711J730J708J775
59483F79402J929K503L712M992N642N734N691N515N238N450O307O731N722L948
59469G48516K764K282J710J129J377K471L575M450N597P026Q157Q896R614J0110
59455H17674R743Q517O978N267L296J505K97q98k759m739n933o799q440j0516
59441H13193j1616j1400j0696r591p379m456k324j355l15J459L106M008M846O300
59427G73780Q131J0158J2710J5484J7371J8050J8501J9283J9636J8975J7884J6843
59415I66806J5349J3375J2405J3489J4860J2980O029m186j3726j9400k0513j8421
$$ plain form
59403 979047 964284 954060 949196 950258 957231 969112 982900 993098 993851 982853 962868 939021
59391 939021 915247 893444 874510 858665 845268 833520 823314 814774 807536 801223 796153 792647
59379 792647 790098 787643 785385 784050 783708 783713 783694 783739 783842 784000 784723 786669 789831 793752 798388 804147 811255
59362 811255 819756 829963 842206 856202 871261 887125 904220 923179 944414 967848 992720 1017896
59350 1017896 1042703 1067128 1090974 1113408 1133636 1151300 1165753 1175620 1179746 1178060 1171015 1158849
59338 1158849 1141996 1121560 1098640 1073704 1047252 1020393 994060 968295 943003 918803 896410
59327 896410 875880 857231 841069 827730 816466 806359 797416 789885 783216 776654 770213 764116 757987
59314 757987 751629 745869 741453 737693 733428 728800 724898 722126 720064 718502 717421 716367 714997 713869
$$ packed form
59403I79047j4763j0224m864J062O973J1881J3788J0198P53j0998j9985k3847
59391I39021k3774k1803j8934j5845j3397j1748j0206q540p238o313n070l506
59379G92647k549k455k258j335l42Nj9M5J03J58P23J946L162L921M636N759P108
59362H11255Q501J0207J2243J3996J5059J5864J7095J8959K1235K3434K4872K5176
59350A017896K4807K4425K3846K2434K0228J7664J4453R867M126j686p045j2166
59338A158849j6853k0436k2920k4936k6452k6859k6333k5765k5292k4200k2393
59327H96410k0530j8649j6162j3339j1264j0107q943p531o669o562o441o097o129
59314G57987o358n760m416l760m265m628l902k772k062j562j081j054j370j128
$$ plain form
59300 713869 713667 714183 715188 717649 722729 730113 738795 749081 762316 778880 797799 817798 837040
59287 837040 852179 859827 859518 854004 846525 839081 833219 830590 831968 836907 844895 855935 869665 884930
59273 884930 900509 915505 929016 940390 949881 958062 964570 968410 969431 968406 965701 961064 954739
59260 954739 947519 939513 930111 919410 908543 898372 888977 880619 874007 869216 865488 862538 861140
59247 861140 862006 864983 869629 875706 882783 890176 897662 905479 913428 920657 926444 930450 932173 931058
59233 931058 927281 921590 914260 904932 893446 879970 864387 846590 827463 808613 791066 775006
59221 775006 760643 748304 737740 728429 720545 714557 710029 705993 702408 699897 698093 695737 692674
59208 692674 690257 689363 689301 689159 689025 689371 690272 691742 693946 696687 699483 702353 705667 709226 712515 715801
$$ packed form
59300G13869k02N16J005K461N080P384Q682J0286J3235J6564J8919J9999J9242
59287H37040J5139P648l09n514p479p444n862k629J378M939P988J1040J3730J5265
59273H84930J5579J4996J3511J1374R491Q181O508L840J021j025k705m637o325
59260I54739p220q006r402j0701j0867j0171r395q358o612m791l728k950j398
59247H61140Q66K977M646O077P077P393P486P817P949P229N787M006J723j115
59233I31058l777n691p330r328j1486j3476j5583j7797j9127j8850j7547j6060
59221G75006j4363j2339j0564r311p884n988m528m036l585k511j804k356l063
59208F92674k417q94o2j42j34L46R01J470K204K741K796K870L314L559L289L286
$$ plain form
59192 715801 719824 724362 728367 731517 734223 736157 736511 735939 736474 738972 742236 745162 748006 750810 752498
59177 752498 752753 753342 756237 761442 767808 774972 783351 792975 803322 813648 822767 829331 833121 835291
59163 835291 836651 836490 833664 827929 819603 808922 796530 783665 771032 758261 745146 732514 721197
59150 721197 711108 702060 694444 688203 682170 675471 668806 663336 659063 655338 652244 650300 649258 648207
59136 648207 646670 644844 643096 641884 641837 643325 646212 650314 655554 661362 666732 671296 675666 680381 685453
59121 685453 691343 699272 709825 722179 735456 749862 765658 782026 798038 813929 830263 846459
59109 846459 861250 874163 885525 895381 903401 909594 914219 917130 917901 916462 913122 908193 902051 895243
59095 895243 888189 881196 875046 870925 869239 869026 868973 868439 867077 864136 858877 851286 841933 831467 820585
$$ packed form
59192G15801M023M538M005L150K706J934L54n72N35K498L264K926K844K804J688
59177G52498K55N89K895N205O366P164Q379R624J0347J0326R119O564L790K170
59163H35291J360j61k826n735q326j0681j2392j2865j2633j2771j3115j2632j1317
59150G21197j0089r048p616o241o033o699o665n470m273l725l094j944j042j051
59136F48207j537j826j748j212m7J488K887M102N240N808N370M564M370M715N072
59121F85453N890P929J0553J2354J3277J4406J5796J6368J6012J5891J6334J6196
59109H46459J4791J2913J1362R856Q020O193M625K911P71j439l340m929o142o808
59095H95243p054o993o150m121j686k13n3n34j362k941n259p591r353j0466j0882
$$ plain form
59080 820585 809914 799604 789512 779974 771753 765033 759229 753981 749453 745382 740922 735878 731166
59067 731166 727566 724876 722684 720900 719098 716466 713054 709986 707780 705544 702474 699069 696061 693282
59053 693282 690472 688116 686566 685308 684052 683517 684128 684931 684928 684563 684751 685294 685489 685586 686343 687665 688928
59036 688928 690277 692630 696710 702826 711101 721174 732267 744355 758584 775728 794861 814338
59024 814338 833308 851344 867381 880120 888968 893758 894215 890616 884316 876717 868362 859755 852159
59011 852159 846493 842231 838545 835877 835311 837067 840706 846135 853289 861487 870207 879874 890721 901540
58997 901540 910809 918486 925496 931972 937266 941151 943639 943969 941050 934756 925773 914648 902122 889990
58983 889990 880233 873281 868149 864111 861348 860196 860727 862936 866565 871008 876045 882242 889996 898800
$$ packed form
59080H20585j0671j0310j0092r538q221o720n804n248m528m071m460n044m712
59067G31166l600k690k192j784j802k632l412l068k206k236l070l405l008k779
59053F93282k810k356j550j258j256n35O11Q03ll65J88N43J95R7P57J322J263
59036F88928J349K353M080O116Q275J0073J1093J2088J4229J7144J9133J9477
59024H14338J8970J8036J6037J2739Q848M790M57l599o300p599q355q607p596
59011H52159n666m262l686k668n66J756L639N429P154Q198Q720R667J0847J0819
58997I01540R269P677P010O476N294L885K488L30k919o294q983j1125j2526j2132
58983H89990r757o952n132m038k763j152N31K209L629M443N037O197P754Q804
$$ plain form
58969 898800 908223 918908 931676 946272 961896 978225 994859 1010470 1023620 1033785 1040524 1042498
58957 1042498 1038614 1029519 1016650 1000460 980927 959139 936839 914793 893060 872483 854322 838587
58945 838587 824167 810632 798759 789457 783236 780381 780472 781973 783437 784770 786269 787032 785684 782222
58931 782222 777652 772201 765427 757831 750727 744511 738524 732643 727565 723464 719700 716046 712998 710831
58917 710831 709460 709229 710666 713466 716816 720731 725897 732303 739187 746352 754323 763186 772488 782479
58903 782479 794384 809157 826680 846180 866721 887543 908796 931705 957167 984551 1012823
58892 1012823 1042360 1074532 1109846 1147612 1186880 1226283 1263216 1294668 1319010 1336063 1345872
58881 1345872 1348667 1345572 1337719 1324701 1305266 1279544 1249388 1216722 1182943 1149735 1118971 1091538
$$ packed form
58969H98800R423J0685J2768J4596J5624J6329J6634J5611J3150J0165O739J974
58957A042498l884r095j2869j6190j9533k1788k2300k2046k1733k0577j8161j5735
58945H38587j4420j3535j1873r302o221k855R1J501J464J333J499P63j348l462
58931G82222m570n451o774p596p104o216n987n881n078m101l764l654l048k167
58917G10831j371k31J437K800L350L915N166O406O884P165P971Q863R302R991
58903G82479J1905J4773J7523J9500K0541K0822K1253K2909K5462K7384K8272
58892A012823K9537L2172L5314L7766L9268L9403L6933L1452K4342J7053R809
58881A345872K795l095p853j3018j9435k5722l0156l2666l3779l3208l0764k7433
$$ plain form
58869 1091538 1067319 1046223 1028146 1012210 997330 983360 970456 957690 943803 929152 915403
58858 915403 903432 892986 884144 877369 871989 866257 859133 850723 840981 829500 816618 803210 789247
58845 789247 774053 758089 742967 729518 717262 705918 695918 687217 679083 671355 664610 658960
58833 658960 654049 650315 648687 648857 649368 649700 650763 653097 656091 659278 662867 666648 669821 672332 674960
58818 674960 677725 679619 680250 680362 680350 679726 678459 677402 676965 676756 676885 678064 679883 680597 679400 677651
58802 677651 677040 677660 678529 678969 678770 677890 676551 674997 672980 670286 667656 666178 665938 666525 668594 673354
58786 673354 680508 688355 695981 703657 710948 716454 719919 722777 725984 729045 731792 735244 739749 743810
58772 743810 745818 745639 743656 739648 733656 726889 720808 716137 713359 713101 715312 718959 723057 727167 730612
$$ packed form
58869A091538k4219k1096j8077j5936j4880j3970j2904j2766j3887j4651j3749
58858I15403j1971j0446q842o775n380n732p124q410r742j1481j2882j3408j3963
58845G89247j5194j5964j5122j3449j2256j1344j0000q701q134p728o745n650
58833F58960m911l734j628J70N11L32J063K334K994L187L589L781L173K511K628
58818F74960K765J894O31J12j2o24j267j057m37k09J29J179J819P14j197j749
58802F77651o11O20Q69M40j99q80j339j554k017k694k630j478k40N87K069M760
58786F73354P154P847P626P676P291N506L465K858L207L061K747L452M505M061
58772G43810K008j79j983m008n992o767o081m671k778k58K211L647M098M110L445
$$ plain form
58757 730612 732423 732474 731632 730484 729049 727887 728056 729648 731735 734151 737818 742905 748242 753179 758550
58742 758550 765088 772298 779652 787657 797019 807863 820341 834769 850593 866386 881378 895891
58730 895891 909902 922489 933076 942014 949638 956064 962158 969163 977018 984504 991361 998585 1006286
58717 1006286 1012981 1017533 1020110 1020697 1018496 1013413 1006455 998005 987353 974428 960119 944201 924989
58704 924989 901991 877124 852365 827934 803660 780225 757949 736166 715000 696175 680880
58693 680880 668307 657302 647884 640145 633268 626773 621239 616814 612545 608141 604712 602757 601181 599369
58679 599369 598476 599388 601201 603072 605961 611176 618726 628373 640706 655790 672388 689950 709878
58666 709878 733241 758542 783057 804895 822400 833196 835721 830748 820039 804558 785234 764190
$$ packed form
58757G30612J811N1q42j148j435j162J69J592K087K416L667N087N337M937N371
58742G58550O538P210P354Q005R362J0844J2478J4428J5824J5793J4992J4513
58730H95891J4011J2587J0587Q938P624O426O094P005P855P486O857P224P701
58717A006286O695M552K577N87k201n083o958q450j0652j2925j4309j5918j9212
58704I24989k2998k4867k4759k4431k4274k3435k2276k1783k1166j8825j5295
58693F80880j2573j1005r418p739o877o495n534m425m269m404l429j955j576j812
58679E99369q93R12J813J871K889N215P550R647J2333J5084J6598J7562J9928
58666G09878K3363K5301K4515K1838J7505J0796K525m973j0709j5481j9324k1044
$$ plain form
58654 764190 743742 725024 708549 694967 684292 675692 668937 664766 663057 662334 661897 662663 664933 667347
58640 667347 669170 671519 674993 678178 679984 681348 682913 683171 680883 677449 674852 672962 670812 668849
58626 668849 667909 667658 668003 670376 675544 681887 688053 695603 706632 720204 733619 745844 757173 766664
58612 766664 772605 774798 774107 770509 763792 755454 747731 741190 734996 728822 722867 716892 710974 706279
58598 706279 703465 701358 698772 696464 695711 696466 698710 703997 713482 725796 739057 753595 770412 788353
58584 788353 805327 821142 836583 850717 861757 869849 876550 882286 886750 891108 897490 906836 919319
58571 919319 936024 957971 984233 1013285 1045393 1081373 1119827 1158017 1194762 1229990 1262021
58560 1262021 1287776 1305438 1314891 1316201 1309949 1298521 1284800 1269799 1253370 1236525 1221018 1207325
$$ packed form
58654G64190k0448j8718j6475j3582j0675q600o755m171j709p23m37P66K270K414
58640F67347J823K349L474L185J806J364J565K58k288l434k597j890k150j963
58626F68849r40k51L45K373N168O343O166P550J1029J3572J3415J2225J1329R491
58612G66664N941K193o91l598o717q338p723o541o194o174n955n975n918m695
58598G06279k814k107k586k308p53P55K244N287R485J2314J3261J4538J6817J7941
58584G88353J6974J5815J5441J4134J1040Q092O701N736M464M358O382R346J2483
58571I19319J6705K1947K6262K9052L2108L5980L8454L8190L6745L5228L2031
58560A262021K5755J7662R453J310o252j1428j3721j5001j6429j6845j5507j3693
$$ plain form
58548 1207325 1195045 1184389 1175110 1164826 1150788 1132750 1112099 1089114 1063459 1036420 1010099
58537 1010099 985027 961009 939568 922910 910929 901703 894428 889521 886467 884195 883152 884518 887731
58524 887731 891131 894592 899070 903993 907549 909245 909860 909241 906423 901585 895723 888886 880844 872795 866167
58509 866167 860444 854440 848809 844842 841747 837804 833325 829674 826180 821042 814685 809261 805317 801894
58495 801894 799423 799408 801549 804166 807239 812146 818722 825572 833101 843285 856574 871810 888954 908964
58481 908964 931145 953428 974922 995251 1011808 1021000 1022208 1017540 1007937 992833 973558 953542
58469 953542 934714 916723 899902 885837 874700 865167 857492 853744 854619 858820 865892 876772 891189
58456 891189 907257 923915 941001 956697 967794 972853 972626 967390 956817 942503 927633 913771
$$ packed form
58548A207325j2280j0656r279j0284j4038j8038k0651k2985k5655k7039k6321
58537A010099k5072k4018k1441j6658j1981r226p275m907l054k272j043J366L213
58524H87731L400L461M478M923L556J696O15o19k818m838n862o837q042q049o628
58509H66167n723o004n631l967l095l943m479l651l494n138o357n424l944l423
58495H01894k471j5K141K617L073M907O576O850P529J0184J3289J5236J7144K0010
58481I08964K2181K2283K1494K0329J6557R192J208m668r603j5104j9275k0016
58469I53542j8828j7991j6821j4065j1137r533p675l748Q75M201P072J0880J4417
58456H91189J6068J6658J7086J5696J1097N059k27n236j0573j4314j4870j3862
$$ plain form
58444 913771 900587 888650 879545 873289 868652 866071 867190 871463 876287 880577 885296 890614 895745 901491
58430 901491 909563 919404 929017 938772 950696 963889 974398 980066 981977 980858 975853 967383 957657
58417 957657 947607 936482 924657 913383 901634 887047 870335 855006 842326 830493 819193
58406 819193 810756 805868 802186 798296 795388 794132 793581 794064 797425 803391 809218 813720 818106 822296 824325
58391 824325 824131 824007 824485 823702 821604 820678 821620 822396 822572 824379 828462 832756 836676 842160 849323 855346
58375 855346 859116 862924 868276 874073 880145 888368 898951 909784 920746 934459 951471 968956 985382
58362 985382 1002073 1018855 1032742 1042448 1049756 1055023 1055988 1052568 1048155 1044527 1040086 1034591 1030757 1029414
58348 1029414 1028092 1026348 1027552 1033433 1041676 1050926 1063177 1079053 1095773 1112051 1130076 1150358
$$ packed form
58444I13771j3184j1937r105o256m637k581J119M273M824M290M719N318N131N746
58430I01491Q072R841R613R755J1924J3193J0509N668J911j119n005q470r726
58417I57657j0050j1125j1825j1274j1749j4587j6712j5329j2680j1833j1300
58406H19193q437m888l682l890k908j256n51M83L361N966N827M502M386M190K029
58391H24325j94j24M78p83k098r26R42P76J76J807M083M294L920N484P163O023
58375H55346L770L808N352N797O072Q223J0583J0833J0962J3713J7012J7485J6426
58362I85382J6691J6782J3887R706P308N267R65l420m413l628m441n495l834j343
58348A029414j322j744J204N881Q243R250J2251J5876J6720J6278J8025K0282
$$ plain form
58336 1150358 1169523 1185537 1200222 1214361 1225328 1231927 1236550 1240203 1240520 1237019 1233079 1230394 1226826
58323 1226826 1222114 1220029 1222180 1225299 1227439 1231139 1237651 1243908 1248329 1253855 1262107 1270363 1277519 1287054
58309 1287054 1300656 1314860 1327456 1341136 1357165 1371711 1382494 1393053 1406302 1419706 1430875
58298 1430875 1442021 1454811 1466723 1476576 1487764 1502096 1516453 1529331 1544238 1562723 1580870
58287 1580870 1596858 1614961 1637563 1660440 1680768 1702540 1728989 1756933 1783936 1813692 1848610
58276 1848610 1884370 1917635 1952076 1990966 2031034 2069366 2108924 2151321 2191945 2228455 2266390
58265 2266390 2310012 2355458 2399132 2444344 2492822 2538419 2576696 2612316 2649714 2685416 2717328
58254 2717328 2752322 2796033 2844030 2891592 2943097 3002914 3066410 3129337 3196772 3273321 3353965
$$ packed form
58336A150358J9165J6014J4685J4139J0967O599M623L653L17l501l940k685l568
58323A226826m712k085K151L119K140L700O512O257M421N526Q252Q256P156R535
58309A287054J3602J4204J2596J3680J6029J4546J0783J0559J3249J3404J1169
58298A430875J1146J2790J1912R853J1188J4332J4357J2878J4907J8485J8147
58287A580870J5988J8103K2602K2877K0328K1772K6449K7944K7003K9756L4918
58276A848610L5760L3265L4441L8890M0068L8332L9558M2397M0624L6510L7935
58265B266390M3622M5446M3674M5212M8478M5597L8277L5620L7398L5702L1912
58254B717328L4994M3711M7997M7562N1505N9817O3496O2927O7435P6549Q0644
$$ plain form
58243 3353965 3434310 3520012 3615960 3716363 3816202 3922162 4041109 4168228 4298011 4436155
58233 4436155 4588558 4749554 4913647 5087756 5279095 5482417 5692495 5917217 6164709
58224 6164709 6430016 6708691 7010269 7343549 7702646 8083191 8497318 8956183 9453859
58215 9453859 9986493 10570504 11222917 11942124 12729135 13609011 14609260 15737802 17007148
58206 17007148 18459856 20145520 22097511 24361960 27025216 30183065 33912940 38313428
58198 38313428 43543654 49790033 57233580 66097179 76693887 89398262 104637867 122977726
58190 122977726 145156549 171983010 204231384 242444121 286062472 331798942 372708665
58183 372708665 399888997 406610891 391923803 360817334 321099855 279785917 241335926
$$ packed form
58243C353965Q0345Q5702R5948J00403R9839J05960J18947J27119J29783J38144
58233D436155J52403J60996J64093J74109J91339K03322K10078K24722K47492
58224F164709K65307K78675L01578L33280L59097L80545M14127M58865M97676
58215I453859N32634N84011O52413P19207P87011Q79876J000249J128542J269346
58206A7007148J452708J685664J951991K264449K663256L157849L729875M400488
58198C8313428N230226O246379P443547Q863599J0596708J2704375J5239605J8339859
58190A22977726K2178823K6826461L2248374L8212737M3618351M5736470M0909723
58183C72708665K7180332O721894j4687088l1106469l9717479m1313938l8449991
$$ plain form
58176 241335926 207825265 179818735 157073424 138905505 124321189 112094988 101019950
58169 101019950 90312682 79830458 69873378 60796199 52792413 45901615 40059834 35123784
58161 35123784 30926038 27341143 24285170 21673945 19423372 17479235 15808049 14364948
58153 14364948 13101131 11993070 11033220 10198941 9457566 8793803 8205445 7678885 7193531
58144 7193531 6743995 6334787 5959085 5604217 5271904 4972024 4701706 4450089 4217988
58135 4217988 4013580 3833637 3667438 3514398 3379884 3257929 3135561 3010893 2890886
58126 2890886 2775113 2657760 2542263 2438082 2345198 2256077 2170327 2093501 2024005 1955019
58116 1955019 1887373 1827591 1775085 1723537 1672860 1627827 1586903 1544107 1500027 1459848 1422540
$$ packed form
58176B41335926l3510661k8006530k2745311j8167919j4584316j2226201j1075038
58169A01019950j0707268j0482224r957080r077179q003786o890798n841781m936050
58161C5123784m197746l584895l055973k611225k250573j944137j671186j443101
58153A4364948j263817j108061r59850q34279p41375o63763n88358n26560m85354
58144G193531m49536m09208l75702l54868l32313k99880k70318k51617k32101
58135D217988k04408j79943j66199j53040j34514j21955j22368j24668j20007
58126B890886j15773j17353j15497j04181r2884q9121q5750p6826o9496o8986
58116A955019o7646n9782n2506n1548n0677m5033m0924m2796m4080m0179l7308
$$ plain form
58105 1422540 1382936 1342333 1305982 1272109 1234360 1193524 1156342 1124196 1093261 1064230 1041509
58094 1041509 1023897 1005968 987741 973532 962439 949451 935018 924192 916973 908421 897492 887008
58082 887008 875707 859184 838224 817793 798372 776522 753293 733588 717492 700458 681893
58071 681893 665659 652344 638972 626258 618204 614225 609211 601856 595770 592116 588174 583569 581021
58058 581021 580423 578631 575390 573174 571163 565864 557812 551294 547244 542634 536887 532527 529274 523940
58044 523940 516584 510673 506674 501454 494375 488015 482516 475227 466471 459785 455839 451797 447170 444513
58030 444513 443687 441180 436016 430926 426871 421797 415570 410746 407550 403368 398133 395032 394830 394491 392560
58015 392560 391051 390940 390488 389117 388492 388825 388442 387710 388980 392033 394059 394705 396530 399932 402369 403374
$$ packed form
58105A422540l9604m0603l6351l3873l7749m0836l7182l2146l0935k9031k2721
58094A041509j7612j7929j8227j4209j1093j2988j4433j0826p219q552j0929j0484
58082H87008j1301j6523k0960k0431j9421k1850k3229j9705j6096j7034j8565
58071F81893j6234j3315j3372j2714q054l979n014p355o086l654l942m605k548
58058E81021n98j792l241k216k011n299q052o518m050m610n747m360l253n334
58044E23940p356n911l999n220p079o360n499p289q756o686l946m042m627k657
58030D44513q26k507n164n090m055n074o227m824l196m182n235l101k02l39j931
58015C92560j509j11m52j371o25L33l83p32J270L053K026O46J825L402K437J005
$$ plain form
57999 403374 405539 409646 413453 416263 420046 424940 428146 428421 427350 425192 420010 412142 405127 400758
57985 400758 397281 393633 391263 390546 389497 387425 385941 385173 382967 379070 376130 375288 374629 373194 372567
57970 372567 373159 372908 371117 369790 369719 368951 366571 364277 362806 360464 356735 353797 352855 352359 351173 350081
57954 350081 348882 345631 340302 335712 333392 331948 330849 332054 336203 340848 344371 348326 354070 360427
57940 360427 366638 374323 384392 394992 404637 414623 426326 438693 450335 461562 472513 481622
57928 481622 487715 491439 493209 492040 487696 481617 474479 465303 454081 442739 432377 422255 412565
57915 412565 405355 401379 398795 396251 394567 394188 393901 393368 393991 395864 396801 395856 394882 395094 395100 393942 393096
57898 393096 393667 394472 394738 395906 398855 401999 404011 405835 408217 409929 410324 411042 413184 415289 415974 416069
$$ packed form
57999D03374K165M107L807K810L783M894L206K75j071k158n182p868p015m369
57985D00758l477l648k370p17j049k072j484p68k206l897k940q42o59j435o27
57970C72567N92k51j791j327p1p68k380k294j471k342l729k938r42m96j186j092
57954C50081j199l251n329m590k320j444j099J205M149M645L523L955N744O357
57940C60427O211P685J0069J0600R645R986J1703J2367J1642J1227J0951R109
57928D81622O093L724J770j169m344o079p138r176j1222j1342j0362j0122r690
57915D12565p210l976k584k544j684l79k87n33O23J873R37r45r74K12Oj158q46
57898C93096N71Q05K66J168K949L144K012J824K382J712L95P18K142K105O85R5
$$ plain form
57882 416069 416222 414972 411257 406374 401491 395651 388256 381012 375277 369865 363666 358076 354605 352377
57868 352377 350268 349348 350844 353782 356933 361087 367122 373759 379565 385281 392022 399062 405597 412788
57854 412788 421717 431060 439099 446318 453806 460849 466374 471053 475611 478670 478630 476248 473112 469069 463443
57839 463443 457256 451776 446165 438937 430629 422775 415384 407613 399885 393177 387094 380693 374324 368938
57825 368938 364515 360821 358526 357859 357362 355620 353050 350446 347263 343043 338941 335940 333062 329256 325545
57810 325545 323249 321582 319139 316291 313828 310560 304678 296492 287674 278817 269916 262147 256884 253746
57796 253746 251611 250609 251220 252562 253694 255553 259407 264393 268748 272536 276957 281843 286148 290261
57782 290261 295663 302831 311350 321317 332757 344502 355616 367024 379699 392167 402060 409240 415210
$$ packed form
57882D16069J53j250l715m883m883n840p395p244n735n412o199n590l471k228
57868C52377k109r20J496K938L151M154O035O637N806N716O741P040O535P191
57854D12788Q929R343Q039P219P488P043N525M679M558L059m0k382l136m043n626
57839D63443o187n480n611p228q308p854p391p771p728o708o083o401o369n386
57825C68938m423l694k295o67m97j742k570k604l183m220m102l001k878l806l711
57810C25545k296j667k443k848k463l268n882q186q818q857q901p769n263l138
57796B53746k135j002O11J342J132J859L854M986M355L788M421M886M305M113
57782B90261N402P168Q519R967J1440J1745J1114J1408J2675J2468R893P180N970
$$ plain form
57769 415210 420172 423023 423629 422779 420365 415781 409714 403452 396857 389079 380756 373356 366783 359749 352133
57754 352133 344878 337971 330703 323714 318577 315456 313101 311017 309770 309303 308840 308364 308430 308674 308193 307180
57738 307180 306575 306434 306245 306350 307272 308176 307978 307506 308496 310763 312488 313119 313906 315618 317793 320265 323445
57721 323445 326957 329780 331877 333998 335899 336452 335462 333697 331190 327261 322209 317190 312415 307103 301193
57706 301193 295410 289728 283533 277302 272295 268564 264974 261192 257843 254770 251052 246910 243597 241145
57692 241145 238090 233805 229311 225371 221606 218036 215778 215452 216249 217251 218525 220512 223526 228233 235521
57677 235521 245630 258392 274342 294389 318585 346687 380000 421170 472044 533134 604940
57666 604940 687267 775660 859229 923088 953763 944540 898612 827863 746828 666203 591227 524320
$$ packed form
57769D15210M962K851O06q50k414m584o067o262o595p778q323p400o573p034p616
57754C52133p255o907p268o989n137l121k355k084j247m67m63m76O6K44m81j013
57738C07180o05j41j89J05R22R04j98m72R90K267J725O31P87J712K175K472L180
57721C23445L512K823K097K121J901N53r90j765k507l929n052n019m775n312n910
57706C01193n783n682o195o231n007l731l590l782l349l073l718m142l313k452
57692B41145l055m285m494l940l765l570k258l26P97J002J274J987L014M707P288
57677B35521J0109J2762J5950K0047K4196K8102L3313M1170N0874O1090P1806
57666F04940Q2327Q8393Q3569O3859L0675r223m5928p0749q1035q0625p4976o6907
$$ plain form
57654 524320 466806 418386 377505 343237 315573 293732 275819 260556 247864 237391 228047 219438
57642 219438 212305 206999 202770 198935 195458 192111 188517 185344 183950 184344 184868 184417 183622 183374 183507 183563
57626 183563 183582 183474 182707 181224 179732 178628 177569 176394 175441 174653 173450 171726 169995 168344 166408 164517
57610 164517 163579 163547 163305 162387 161575 161429 161479 161272 161012 160754 160144 159329 158984 159054 158607 157263 155605 153867 151394
57591 151394 147774 143418 138705 133697 128929 125207 122374 119523 116648 114690 113730 112625 110863 109237
57577 109237 108086 106396 103356 99520 95722 92129 88994 87025 86190 85343 83795 82214 81282 80570 79471
57562 79471 78197 77161 76374 76074 76933 79003 81364 83348 85142 86783 87793 88372 89720 92460 95784
57547 95784 98798 101601 104429 106950 109150 111752 114876 117339 118146 117732 116912 115559 113222 110195 107113
$$ packed form
57654E24320n7514m8420m0881l4268k7664k1841j7913j5263j2692j0473r344q609
57642B19438p133n306m229l835l477l347l594l173j394L94N24m51p95k48J33N6
57626A83563J9j08p67j483j492j104j059j175r53p88j203j724j731j651j936j891
57610A64517r38l2k42r18q12j46N0k07k60k58o10q15l45P0m47j344j658j738k473
57591A51394l620m356m713n008m768l722k833k851k875j958r60j105j762j626
57577A09237j151j690l040l836l798l593l135j969q35q47j548j581r32p12j099
57562G9471j274j036p87l00Q59K070K361J984J794J641J010N79J348K740L324
57547I5784L014K803K828K521K200K602L124K463Q07m14q20j353k337l027l082
$$ plain form
57532 107113 104110 101121 98357 95949 93813 92264 91953 92710 93367 93161 92436 91672 90861 90239 90446 91400 92162
57515 92162 92478 93276 95063 97075 98645 100156 101898 103282 104034 104924 106390 107588 107810 107679 107878 107738
57499 107738 106213 103408 100124 96701 93267 90250 87724 85049 82028 79597 78454 77938 77093 75971 74983
57484 74983 73954 72817 72263 72640 73116 73071 73404 75243 78082 80419 81574 81673 80439 77367 72878 68237
57468 68237 64404 61621 59657 57845 55452 52742 51102 51413 52902 54275 55236 56138 56853 56894 56111 54596
57452 54596 52507 50533 49665 49853 49812 48874 48006 48208 49014 49602 50277 51618 53077 53706 53595 53403 53199 52822
57434 52822 52638 52760 52337 50792 48991 47900 46956 45166 43079 42049 42050 41850 41054 40459 40468 40536 40237 39770 39366
57415 39366 39084 39065 39287 39377 39373 40107 41965 43931 44889 45174 45683 46133 45564 44051 42512 41237 39925 38816
$$ packed form
57532A07113l003k989k764k408k136j549l11P57O57k06p25p64q11o22K07R54P62
57515I2162L16P98J787K012J570J511J742J384P52Q90J466J198K22j31J99j40
57499A07738j525k805l284l423l434l017k526k675l021k431j143n16q45j122r88
57484G4983j029j137n54L77M76m5L33J839K839K337J155R9j234l072m489m641
57468F8237l833k783j964j812k393k710j640L11J489J373R61R02P15M1p83j515
57452E4596k089j974q68J88m1r38q68K02Q06N88O75J341J459O29j11j92k04l77
57434E2822j84J22m23j545j801j091r44j790k087j030Jk00p96n95RO8k99m67m04
57415C9366k82j9K22R0mP34J858J966R58K85N09M50n69j513j539j275j312j109
$$ plain form
57397 38816 38388 38267 37785 37328 37718 38525 38512 37605 36908 36816 36690 36591 37764 40905 45179 49476 53579 57588
57379 57588 61095 63500 64617 64589 63622 61903 59425 55995 51830 47846 44771 42326 39911 37631 35864
57364 35864 34301 32416 30538 29426 29082 28921 28828 29020 29209 29037 29069 30166 32021 33557 34656 36296 38903
57347 38903 41733 44024 45714 46848 47255 47058 46686 46238 45543 44770 44214 43561 42244 40487 39116 38344 37569
57330 37569 36365 34868 33212 31260 28962 26395 23679 21300 20006 19753 19376 18141 16868 16510 16447 15552
57314 15552 14208 13596 13465 12410 10236 8273 7294 6771 6363 6499 7187 7701 7815 7973 8039 7249 5786 4961
57296 4961 5389 6274 6900 7549 8458 9148 9360 9517 9753 9559 8883 8477 8619 8549 7636 6213 4902 4096 4319
57277 4319 5808 7361 6904 3862 -149 -3512 -6241 -8826 -10758 -11205 -10185 -8162 -5303 -1907 1152
$$ packed form
57397C8816m28j21m82m57L90Q07j3r07o97r2j26r9J173L141M274M297M103M009
57379E7588L507K405J117k8r67j719k478l430m165l984l075k445k415k280j767
57364C5864j563j885j878j112l44j61r3J92J89j72L2J097J855J536J099J640K607
57347C8903K830K291J690J134M07j97l72m48o95p73n56o53j317j757j371p72p75
57330C7569j204j497j656j952k298k567k716k379j294k53l77j235j273l58o3q95
57314A5552j344o12j31j055k174j963r79n23m08J36O88N14J14J58O6p90j463q25
57296D961M28Q85O26O49R09O90K12J57K36j94o76m06J42p0r13j423j311q06K23
57277D319J489J553m57l042a49l363k729k585j932m47J020K023K859a907A152
$$ plain form
57261 3283 4850 6452 8138 9800 11627 13561 15069 15990 16955 18462 20219 21804 23157 23984 23584 21946
57245 21946 20237 19579 19988 21027 22725 25196 28073 30971 33979 37195 40391 43618 47450 52158 57282
57230 57282 62507 68267 75014 82547 90515 98882 107509 116065 124772 134447 145373 156961 168998 182229
57216 182229 197045 212600 228017 243657 260319 277880 295600 313173 330612 347542 363418
57205 363418 378188 392212 405835 419404 433216 447165 460966 474972 489983 506048 522434
57194 522434 539123 557181 577000 597355 617067 636617 657113 678548 700177 721982 744669
57183 744669 768695 794172 821345 850406 881318 914335 950028 988170 1027484 1067326 1108750
57172 1108750 1153089 1200460 1250780 1305241 1365067 1429022 1493223 1553145 1605023 1646266 1676314
$$ packed form
57261C283J567J602J686J662J827J934J508R21R65J507J757J585J353Q27m00j638
57245B1946j709o58M09J039J698K471K877K898L008L216L196L227L832M708N124
57230E7282N225N760O747P533P968Q367Q627Q556Q707R675J0926J1588J2037J3231
57216A82229J4816J5555J5417J5640J6662J7561J7720J7573J7439J6930J5876
57205C63418J4770J4024J3623J3569J3812J3949J3801J4006J5011J6065J6386
57194E22434J6689J8058J9819K0355J9712J9550K0496K1435K1629K1805K2687
57183G44669K4026K5477K7173K9061L0912L3017L5693L8142L9314L9842M1424
57172A108750M4339M7371N0320N4461N9826O3955O4201N9922N1878M1243L0048
$$ plain form
57161 1676314 1697161 1711828 1722252 1729289 1734179 1738511 1742890 1746970 1750994 1756192 1763445 1772483 1782588
57148 1782588 1793328 1804453 1815737 1827045 1838050 1848049 1856723 1864923 1873927 1884032 1894593 1905270
57136 1905270 1916437 1928399 1940922 1953572 1965940 1977741 1989213 2001120 2013667 2025761 2036123
57125 2036123 2044715 2052234 2058798 2064428 2070576 2079853 2094206 2114516 2141814 2177380 2221267 2271966
57113 2271966 2327942 2388504 2452963 2520452 2591530 2669481 2759874 2869779 3007510 3181712 3399993
57102 3399993 3669550 3999857 4404143 4898791 5504044 6246969 7161599 8283004 9640375
57093 9640375 11255656 13146521 15328712 17818562 20638406 23818173 27380817 31312793
57085 31312793 35541006 39938072 44354741 48655324 52729322 56469737 59734118 62324084
$$ packed form
57161A676314K0847J4667J0424P037M890M332M379M080M024N198P253R038J0105
57148A782588J0740J1125J1284J1308J1005R999Q674Q200R004J0105J0561J0677
57136A905270J1167J1962J2523J2650J2368J1801J1472J1907J2547J2094J0362
57125B036123Q592P519O564N630O148R277J4353K0310K7298L5566M3887N0699
57113B271966N5976O0562O4459O7489P1078P7951R0393J09905J37731J74202K18281
57102C399993K69557L30307M04286M94648O05253P42925R14630J121405J357371
57093I640375J615281J890865K182191K489850K819844L179767L562644L931976
57085C1312793M228213M397066M416669M300583M073998L740415L264381K589966
$$ plain form
57077 62324084 64014848 64630247 64116353 62561612 60154469 57116490 53653256 49933537
57069 49933537 46084045 42191800 38316447 34509940 30831300 27347517 24123559 21210030
57061 21210030 18634395 16398698 14484512 12861705 11495272 10348243 9383717 8568094
57053 8568094 7873701 7278903 6766654 6322564 5932616 5581995 5257301 4950697 4661073
57044 4661073 4390693 4141361 3913661 3707615 3522227 3354880 3202318 3062159 2933134
57035 2933134 2814500 2705743 2606244 2514811 2430165 2352154 2281629 2218868 2163159 2114309 2073350
57024 2073350 2041135 2017486 2002607 1998305 2006980 2030212 2068304 2118476 2171123 2209234 2215054 2179478
57012 2179478 2105844 2006150 1894655 1783206 1678950 1584212 1498459 1420584 1349690 1284985 1226240
$$ packed form
57077F2324084J690764O15399n13894j554741k407143l037979l463234l719719
57069D9933537l849492l892245l875353l806507l678640l483783l223958k913529
57061B1210030k575635k235697j914186j622807j366433j147029r64526q15623
57053H568094o94393n94798n12249m44090l89948l50621l24694l06604k89624
57044D661073k70380k49332k27700k06046j85388j67347j52562j40159j29025
57035B933134j18634j08757r9499r1433q4646p8011p0525o2761n5709m8850m0959
57024B073350l2215k3649j4879m302Q675K3232L8092N0172N2647L8111N820l5576
57012B179478p3634r9694j11495j11449j04256r4738q5753p7875p0894o4705n8745
$$ plain form
57001 1226240 1174056 1128822 1089807 1056094 1027919 1006119 990679 980748 975619 974703 976956 981318
56989 981318 987448 995125 1003392 1011300 1019106 1027741 1037292 1046660 1053928 1056043 1049101 1030863 1003087 970310
56975 970310 936429 903298 871895 843114 817339 794551 774991 758734 744880 732371 721551
56964 721551 713781 709679 709031 712245 720491 734349 753629 778347 807990 839114 865051 879103 877964
56951 877964 862472 836516 805456 774157 745346 719885 698273 680968 667456 656456 647523 641437
56939 641437 638803 639391 643246 651289 664152 681319 702150 727202 757775 794044 833219 868794
56927 868794 892044 896085 879899 848575 809643 769211 730656 695141 662588 632827 606314 583527
56915 583527 563942 546467 530789 517350 506014 495795 486093 477242 469612 463086 457575 453130 449351
$$ packed form
57001A226240n2184m5234l9015l3713k8175k1800j5440r931n129r16K253M362
56989I81318O130P677Q267P908P806Q635R551R368P268K115o942j8238k7776l2777
56975I70310l3881l3131l1403k8781k5775k2788j9560j6257j3854j2509j0820
56964G21551p770m102o48L214Q246J3858J9280K4718K9643L1124K5937J4052j139
56951H77964j5492k5956l1060l1299k8811k5461k1612j7305j3512j1000q933o086
56939F41437k634N88L855Q043J2863J7167K0831K5052L0573L6269L9175L5575
56927H68794K3250M041j6186l1324l8932m0432l8555l5515l2553k9761k6513k2787
56915E83527j9585j7475j5678j3439j1336j0219r702q851p630o526n511m445l779
$$ plain form
56902 449351 445607 442103 439811 439078 439123 439133 439106 439489 440858 444041 449669 457432 466598 477249 490008 504630
56886 504630 520118 536258 553529 570871 584847 591823 590372 581408 567177 550622 534559 520511
56874 520511 508740 499523 493462 490368 489108 489169 491419 496879 505813 518584 536263 559675 588821
56861 588821 624090 667026 718493 775806 831777 876429 900493 899475 875968 837869 793735 749552
56849 749552 708757 673205 643340 618776 599803 587711 583295 586041 595285 611162 634025 664193
56837 664193 702936 752534 814603 889292 975923 1071637 1167263 1246195 1290891 1292278 1253422 1185591
56825 1185591 1102142 1014771 932084 859152 797808 747560 706707 673622 647847 629942 620184
56814 620184 617945 622620 634560 654740 684150 723926 775208 837805 908546 980287 1041842 1079932
$$ packed form
56902D49351l744l504k292p33M5J0k7L83J369L183N628P763R166J0651J2759J4622
56886E04630J5488J6140J7271J7342J3976O976j451q964j4231j6555j6063j4048
56874E20511j1771r217o061l094j260O1K250N460Q934J2771J7679K3412K9146
56861E88821L5269M2936N1467N7313N5971M4652K4064j018k3507l8099m4134m4183
56849G49552m0795l5552k9865k4564j8973j2092m416K746R244J5877K2863L0168
56837F64193L8743M9598O2069P4689Q6631R5714R5626P8932M4696J387l8856o7831
56825A185591q3449q7371q2687p2932o1344n0248m0853l3085k5775j7905r758
56814F20184k239M675J1940K0180K9410L9776N1282O2597P0741P1741O1555L8090
$$ plain form
56802 1079932 1084362 1053819 996739 925950 852377 782818 720827 667551 622380 584452 553673
56791 553673 529945 512218 499222 490599 486653 487668 494160 506999 526493 552020 583085 619417
56779 619417 658572 694128 717783 723647 710545 681495 642193 599134 557305 518954 484601 454526
56767 454526 428711 406308 386443 369292 355507 344893 336433 329286 323117 317824 313481 310143 307251
56754 307251 303894 300072 296871 294787 292843 290111 287128 284866 283220 281502 279627 277798 275814 273761
56740 273761 272619 273034 274167 274769 274720 274474 273841 272525 271140 270373 269821 268885 268150 268504 269523 270192 270759
56723 270759 272336 274966 277544 279455 280954 282075 282506 282509 282801 283505 284193 284792 285509 286062 285955 285283 284433
56706 284433 283404 282311 281941 282668 283369 282657 280811 279295 278779 278853 279184 279626 279577 278651 277713 277894 278829 279224
$$ packed form
56802A079932M430l0543n7080p0789p3573o9559o1991n3276m5171l7928l0779
56791E53673k3728j7727j2996q623l946J015O492J2839J9494K5527L1065L6332
56779F19417L9155L5556K3655N864j3102k9050l9302m3059m1829l8351l4353l0075
56767D54526k5815k2403j9865j7151j3785j0614q460p147o169n293m343l338k892
56754C07251l357l822l201k084j944k732k983k262j646j718j875j829j984k053
56740B73761j142M15J133O02m9k46o33j316j385p67n52r36p35L54J019O69N67
56723B70759J577K630K578J911J499J121M31LK92P04O88N99P17N53j07o72q50
56706B84433j029j093l70P27P01p12j846j516n16P4L31M42m9r26r38J81R35L95
$$ plain form
56688 279224 278922 278948 279735 280702 281494 282259 282821 282901 283099 284303 286211 287739 288770 290105 291802 293029 293597
56671 293597 294231 295179 295949 296513 297470 298833 299935 300635 301423 302271 302644 302690 303094 303719 303757 303355 303695 305227
56653 305227 307130 308744 310206 311384 311582 310735 309720 309072 308443 307603 306843 306076 304664 302504 300280 298323
56637 298323 296179 293570 290829 288167 285453 282845 280765 279135 277523 276041 275144 274673 274092 273453 272970
56622 272970 271941 269513 266389 264234 263433 262892 262128 261810 262037 261773 260529 259184 258617 258794 259521 260733
56606 260733 261750 261602 260536 259894 260197 260699 261024 261670 262498 262399 261107 259839 259466 259491 259497 260130 261842 263953
56588 263953 265777 267497 269221 270376 270771 271144 271936 272606 272740 272779 273101 273497 274058 275334 277141 278493 279252
56571 279252 280477 282549 284493 285912 288082 292173 297737 304001 311398 320705 331786 344288 358486
$$ packed form
56688B79224l02K6P87R67P92P65N62Q0J98J204J908J528J031J335J697J227N68
56671B93597O34R48P70N64R57J363J102P00P88Q48L73M6M04O25L8m02L40J532
56653C05227J903J614J462J178J98q47j015o48o29q40p60p67j412k160k224j957
56637B98323k144k609k741k662k714k608k080j630j612j482q97m71n81o39m83
56622B72970j029k428l124k155q01n41p64l18K27k64j244j345n67J77P27J212
56606B60733J017j48j066o42L03N02L25O46Q28r9j292j268l73K5OO33J712K111
56588B63953J824J720J724J155L95L73P92O70J34L9L22L96N61J276J807J352P59
56571B79252J225K072J944J419K170M091N564O264P397R307J1081J2502J4198
$$ plain form
56558 358486 374209 389607 402033 409709 412091 409596 403757 396788 390166 384099 378566 373788 369364
56545 369364 364248 358255 352424 347351 342445 337418 333149 330198 327792 325122 322418 319883 316887 313236
56531 313236 310028 308163 307027 305625 304018 302728 301797 301281 301576 302345 302234 300584 298327 296365 294320
56516 294320 291828 289656 288384 287186 285191 282870 280825 278400 274900 271170 268515 266887 265432 264011
56502 264011 262907 261819 260448 259369 259147 259258 259075 259109 260110 261651 262766 263339 263776 264008 263965 264309 265562
56485 265562 267072 267874 267959 267827 267584 267402 268018 269660 271245 271636 271059 270410 270034 270064 270977 272744 274321 275044
56467 275044 275646 276920 278348 279087 279257 279150 278254 276292 274250 273082 272350 271336 270501 270550 271073 271446 272063
56450 272063 273307 274333 274406 274431 275573 277223 277963 277774 277663 277823 277795 277828 278445 279173 279215 278882 278963 279191 278731
$$ packed form
56558C58486J5723J5398J2426P676K382k495n839o969o622o067n533m778m424
56545C69364n116n993n831n073m906n027m269k951k406k670k704k535k996l651
56531C13236l208j865j136j402j607j290r31n16K95P69j11j650k257j962k045
56516B94320k492k172j272j198j995k321k045k425l500l730k655j628j455j421
56502B64011j104j088j371j079k22J11j83L4J001J541J115N73M37K32m3L44J253
56485B65562J510Q02Q5j32k43j82O16J642J585L91n77o49l76L0R13J767J577P23
56467B75044O02J274J428P39J70j07q96j962k042j168p32j014q35M9N23L73O17
56450B72063J244J026P3K5J142J650P40j89j11J60k8L3O17P28M2l33Q1K28m60
$$ plain form
56431 278731 277695 276853 276398 276205 276639 277804 278663 278300 277321 276768 276448 275752 275220 275728 276887 277825 278802 280453
56413 280453 282189 283049 283447 284367 285505 285907 285824 286149 286575 286164 285304 285267 286159 286988 287484 288219 289212 289930 290430
56394 290430 291111 291777 292256 293283 295300 297144 297582 297379 298126 299684 300701 300973 301335 301743 301586 301470 302615
56377 302615 304661 306077 306611 307435 309033 310745 312270 313780 314764 314587 314048 314590 316119 317353 318028 318890
56361 318890 319758 319630 318627 317864 317390 316220 314436 313353 313402 313680 313766 314283 315407 316448 317126 317866 318706
56344 318706 319268 319757 320634 321499 321684 321720 322764 324944 327676 331148 335846 341140 346040 350834 356215 361422
56328 361422 365218 368182 371938 376532 380593 383643 386042 387047 385340 381357 376922 372750 368395 364339
56314 364339 361735 360288 358784 357543 357843 359061 359015 357374 356153 356603 358038 360032 363245 367550 371645
$$ packed form
56431B78731j036q42m55j93M34J165Q59l63r79n53l20o96n32N08J159R38R77J651
56413B80453J736Q60L98R20J138M02q3L25M26m11q60l7Q92Q29M96P35R93P18N00
56394B90430O81O66M79J027K017J844M38k03P47J558J017K72L62M08j57j16J145
56377C02615K046J416N34Q24J598J712J525J510R84j77n39N42J529J234O75Q62
56361C18890Q68j28j003p63m74j170j784j083M9K78Q6N17J124J041O78P40Q40
56344C18706N62M89Q77Q65J85L6J044K180K732L472M698N294M900M794N381N207
56328C61422L796K964L756M594M061L050K399J005j707l983m435m172m355m056
56314C64339k604j447j504j241L00J218m6j641j221M50J435J994L213M305M095
$$ plain form
56299 371645 375049 378467 381929 384692 387150 390571 394692 397794 399427 400892 402866 404857 407149 410824
56285 410824 415584 419892 423508 427534 431865 435212 437828 441448 446139 449990 452418 455031 458599 462006
56271 462006 464954 468899 474386 480051 485265 491279 498777 506740 514731 523992 535342 548231 562630
56258 562630 579562 599039 619827 641976 667190 696071 727521 761515 799727 842591 888451
56247 888451 936559 988170 1043656 1101235 1159626 1219252 1279580 1337928 1392189 1442251 1487544
56236 1487544 1525696 1554877 1575058 1586002 1586631 1577586 1561685 1540541 1513242 1479523 1441424 1400482
56224 1400482 1356089 1308191 1259026 1210627 1163067 1116601 1072937 1032881 995132 958770 924420
56213 924420 891833 859181 826230 795408 768157 743021 718791 696605 677238 659295 641975
$$ packed form
56299C71645L404L418L462K763K458L421M121L102J633J465J974J991K292L675
56285D10824M760M308L616M026M331L347K616L620M691L851K428K613L568L407
56271D62006K948L945N487N665N214O014P498P963P991R261J1350J2889J4399
56258E62630J6932J9477K0788K2149K5214K8881L1450L3994L8212M2864M5860
56247H88451M8108N1611N5486N7579N8391N9626O0328N8348N4261N0062M5293
56236A487544L8152K9181K0181J0944O29r045j5901k1144k7299l3719l8099m0942
56224A400482m4393m7898m9165m8399m7560m6466m3664m0056l7749l6362l4350
56213I24420l2587l2652l2951l0822k7251k5136k4230k2186j9367j7943j7320
$$ plain form
56202 641975 626753 614427 603419 592923 584771 580011 576536 572458 569032 567769 567262 565468 562834
56189 562834 560739 558956 556943 555506 555022 554102 551962 549937 548837 547314 544734 542982 543345 544284 544476
56174 544476 545343 548195 551541 553737 555779 558990 562444 565212 568691 574083 579946 584807 589893 596727
56160 596727 604362 611582 619573 629822 641465 653178 665557 679359 693728 708429 725430 745917
56148 745917 768310 791515 817479 848163 882877 921229 965792 1018965 1079921 1147581 1223992
56137 1223992 1311906 1411634 1523003 1647284 1783544 1925290 2063654 2191867 2304695 2397457
56127 2397457 2469664 2527229 2577602 2624462 2668913 2711710 2750380 2777442 2786060 2776021 2751676
56116 2751676 2717241 2677156 2636878 2598041 2554682 2498077 2423544 2330080 2217429 2088361 1951187
$$ packed form
56202F41975j5222j2326j1008j0496q152m760l475m078l426j263n07j794k634
56189E62834k095j783k013j437m84r20k140k025j100j523k580j752L63R39J92
56174E44476Q67K852L346K196K042L211L454K768L479N392N863M861N086O834
56160E96727P635P220P991J0249J1643J1713J2379J3802J4369J4701J7001K0487
56148G45917K2393K3205K5964L0684L4714L8352M4563N3173O0956O7660P6411
56137A223992Q7914R9728J11369J24281J36260J41746J38364J28213J12828R2762
56127B397457P2207N7565N0373M6860M4451M2797L8670K7062Q618j0039k4345
56116B751676l4435m0085m0278l8837m3359n6605p4533r3464j12651j29068j37174
$$ plain form
56105 1951187 1815295 1685680 1564791 1456493 1363842 1285459 1218289 1161820 1116172 1078871
56095 1078871 1047460 1022549 1004577 990618 978209 968978 964399 961489 957259 953920 954858 958732 962481
56082 962481 966840 973720 981295 986958 992158 999181 1006244 1011057 1015996 1024308 1034307 1042877 1051468 1062824
56068 1062824 1074972 1084413 1092214 1101001 1109107 1113896 1117724 1124173 1131449 1136027 1139758 1146672 1155703 1163443
56054 1163443 1171166 1182143 1194811 1205651 1216084 1229405 1243793 1255596 1266623 1280776 1296508
56043 1296508 1310212 1324016 1342161 1362658 1380856 1398474 1420544 1446071 1470372 1494195 1521769
56032 1521769 1552247 1581912 1612331 1647239 1683743 1715925 1744926 1776275 1809713 1841125 1871981
56021 1871981 1906889 1944179 1979005 2013558 2053935 2099243 2144176 2189975 2242093 2299416 2356719
$$ packed form
56105A951187j35892j29615j20889j08298r2651p8383o7170n6469m5648l7301
56095A078871l1411k4911j7972j3959j2409r231m579k910m230l339R38L874L749
56082I62481M359O880P575N663N200P023P063M813M939Q312R999Q570Q591J1356
56068A062824J2148R441P801Q787Q106M789L828O449P276M578L731O914R031P740
56054A163443P723J0977J2668J0840J0433J3321J4388J1803J1027J4153J5732
56043A296508J3704J3804J8145K0497J8198J7618K2070K5527K4301K3823K7574
56032A521769L0478K9665L0419L4908L6504L2182K9001L1349L3438L1412L0856
56021A871981L4908L7290L4826L4553M0377M5308M4933M5799N2118N7323N7303
$$ plain form
56010 2356719 2415322 2480110 2548667 2614996 2681376 2754602 2833318 2911487 2991395 3080127 3176131
55999 3176131 3272855 3372764 3483506 3603166 3724125 3848778 3986073 4135293 4289126 4449816
55989 4449816 4625503 4813554 5005244 5204374 5423122 5662173 5913841 6181752 6477326
55980 6477326 6799807 7141093 7507412 7913977 8361425 8841441 9362516 9944849 10593313
55971 10593313 11303105 12089360 12982245 13996214 15136057 16431229 17931662 19674252
55963 19674252 21691405 24050463 26846031 30159061 34070286 38713177 44268792 50918126
55955 50918126 58859218 68370425 79805116 93551011 110085024 130064508 154288330
55948 154288330 183587467 218717384 259813832 304939764 348557471 382014275 397006593
$$ packed form
56010B356719N8603O4788O8557O6329O6380P3226P8716P8169P9908Q8732R6004
55999C176131R6724R9909J10742J19660J20959J24653J37295J49220J53833J60690
55989D449816J75687J88051J91690J99130K18748K39051K51668K67911K95574
55980F477326L22481L41286L66319M06565M47448M80016N21075N82333O48464
55971A0593313P09792P86255Q92885J013969J139843J295172J500433J742590
55963A9674252K017153K359058K795568L313030L911225M642891N555615O649334
55955E0918126P941092R511207J1434691J3745895J6534013J9979484K4223822
55948A54288330K9299137L5129917M1096448M5125932M3617707L3456804J4992318
$$ plain form
55941 397006593 389948350 363734247 325602175 283232003 242087033 204983730 172861269
55934 172861269 145607906 122651427 103369811 87262899 73904544 62879763 53812389
55927 53812389 46385854 40304683 35284286 31098662 27594735 24645056 22125017 19944055
55919 19944055 18054927 16414997 14969140 13678323 12530276 11510102 10589088 9751156
55911 9751156 9001605 8339533 7746233 7208505 6728901 6304726 5919625 5563946 5242475
55902 5242475 4954891 4688448 4436732 4206528 3999623 3805922 3620654 3450841 3298611
55893 3298611 3154905 3015652 2888046 2774891 2668049 2563143 2465965 2378773 2294605 2210784
55883 2210784 2134339 2068460 2006697 1945950 1892445 1849427 1811313 1775457 1747654 1730033 1714282
$$ packed form
55941C97006593p058243k6214103l8132072m2370172m1144970l7103303l2122461
55934A72861269k7253363k2956479j9281616j6106912j3358355j1024781r067374
55927E3812389p426535o081171n020397m185624l503927k949679k520039k180962
55919A9944055j889128j639930j445857j290817j148047j020174r21014q37932
55911I751156p49551o62072n93300n37728m79604m24175l85101l55679l21471
55902E242475k87584k66443k51716k30204k06905j93701j85268j69813j52230
55893C298611j43706j39253j27606j13155j06842j04906r7178q7192q4168q3821
55883B210784p6445o5879o1763o0747n3505m3018l8114l5856k7803j7621j5751
$$ plain form
55872 1714282 1692279 1663449 1627387 1580120 1522897 1464710 1411083 1359192 1307591 1260730 1219613
55861 1219613 1177905 1132109 1086722 1045253 1005266 966399 934084 910673 891388 873268 859628
55850 859628 851479 843021 830229 815945 802257 785875 765437 745557 729048 712513 693977 677476
55838 677476 665514 654155 640237 626754 616547 607152 596372 586765 580265 574289 567311 562398 561320
55825 561320 560912 559045 558251 559720 559722 556050 552225 551287 551066 549593 549553 553089 557537 560597 564778 572479
55809 572479 581395 588758 595663 603365 609780 613294 615606 617295 615080 606991 595952 584861 572507
55796 572507 557555 541986 527193 511224 493323 476876 464408 453994 443901 436296 432982 431940
55784 431940 431568 433730 438846 442428 440615 435288 429952 424544 418055 412207 408348 404344 398444 392812
$$ packed form
55872A714282k2003k8830l6062m7267n7223n8187n3627n1891n1601m6861m1117
55861A219613m1708m5796m5387m1469l9987l8867l2315k3411j9285j8120j3640
55850H59628q149q458j2792j4284j3688j6382k0438j9880j6509j6535j8536j6501
55838F77476j1962j1359j3918j3483j0207r395j0780r607o500n976o978m913j078
55825E61320m08j867p94J469Kl672l825r38k21j473m0L536M448L060M181P701
55809E72479Q916P363O905P702O415L514K312J689k215q089j1039j1091j2354
55796E72507j4952j5569j4793j5969j7901j6447j2468j0414j0093p605l314j042
55784D31940l72K162N116L582j813n327n336n408o489n848l859m004n900n632
$$ plain form
55770 392812 389435 386026 379843 372221 365550 359009 351111 343326 337417 332168 326351 321876 320394 319738
55756 319738 317342 314310 312598 311072 307867 303772 299715 293857 284910 275649 269374 265416 261649 258783
55742 258783 258337 258814 257771 255708 254398 253357 251384 249601 249593 250420 250603 251084 253068 254983 254807 253560
55726 253560 253301 253438 252075 249358 246631 243913 240873 238568 237731 237212 236328 236489 238089 238469 235783 232322
55710 232322 231027 231205 230862 230737 232484 235020 236280 236796 238169 239682 239739 238954 238595 237665 234810 231496
55694 231496 230034 229947 229539 229451 231296 234103 235566 235814 236797 238833 240710 242291 244289 246406 248179 250581
55678 250581 254366 258138 260497 262572 265793 268761 269210 267766 266890 267237 267811 268568 270167 272191 274095
55663 274095 276814 281156 285932 289866 293692 297949 300620 299758 296662 293546 289819 283785 276312 269465
$$ packed form
55770C92812l377l409o183p622o671o541p898p785n909n249n817m475j482o56
55756C19738k396l032j712j526l205m095m057n858q947r261o275l958l767k866
55742B58783m46M77j043k063j310j041j973j783qQ27J83M81J984J915j76j247
55726B53560k59J37j363k717k727k718l040k305q37n19q84J61J600L80k686l461
55710B32322j295J78l43j25J747K536J260N16J373J513N7p85l59r30k855l314
55694B31496j462q7m08q8J845K807J463K48R83K036J877J581J998K117J773K402
55678B50581L785L772K359K075L221K968M49j444q76L47N74P57J599K024J904
55663B74095K719M342M776L934L826M257K671q62l096l116l727o034p473o847
$$ plain form
55649 269465 262901 255077 246798 240182 235031 229499 223480 218234 213587 208601 204115 201501 199764 196933
55635 196933 193512 191512 190940 190302 189639 189920 190303 189288 187790 187696 188110 186579 183515 181842 182431 183344 183556
55618 183556 184032 184950 185145 184652 184832 185593 185272 183622 182327 182164 182062 181210 179886 178151 175890 174048 173601
55601 173601 173576 172328 170312 169132 168485 166812 164564 163753 164358 164222 162672 161350 161120 160979 160456 160439 161095
55584 161095 161415 161332 161916 163131 163683 163465 163818 165041 165982 166494 167877 170368 172477 173537 174787 177277
55568 177277 180584 184152 188019 191687 194057 194998 195407 195464 194473 192579 190844 189467 187744 185939 185351 186290
55552 186290 187680 188837 189969 190907 191132 191087 191729 192775 193097 192669 192377 192166 191379 190597 190915 191577 190686 188256
55534 188256 186177 185058 183550 181071 178717 176939 174686 171569 168775 166995 165352 163066 160574 158417
$$ packed form
55649B69465o564p824q279o616n151n532o019n246m647m986m486k614j737k831
55635A96933l421k000n72o38o63K81L83j015j498r4M14j531l064j673N89R13K12
55618A83556M76R18J95m93J80P61l21j650j295j63j02q52j324j735k261j842m47
55601A73601k5j248k016j180o47j673k248q11O05j36j550j322k30j41n23j7O56
55584A61095L20q3N84J215N52k18L53J223R41N12J383K491K109J060J250K490
55568A77277L307L568L867L668K370R41M09N7r91j894j735j377j723j805n88R39
55552A86290J390J157J132R38K25m5O42J046L22m28k92k11p87p82L18O62q91k430
55534A88256k079j119j508k479k354j778k253l117k794j780j643k286k492k157
$$ plain form
55520 158417 156622 155524 155559 155894 154959 152660 150446 149100 148122 147379 147414 147952 148011 147749 148368 149948 151263
55503 151263 151891 152600 153472 153658 153169 152949 152950 152167 150728 149799 149241 147643 145037 143254 143084 143370 143440 144104
55485 144104 145513 146327 145894 145242 145099 144885 144403 144496 145268 145682 145706 146768 149163 151097 151332 150832 150767 150790 150415
55466 150415 150265 150704 150839 150024 148950 148324 147954 147897 148855 150531 151345 150754 150267 151097 152357 152620 151778 150366
55448 150366 148554 146790 146036 146361 146603 146258 146266 147178 148090 148263 148243 148389 147908 146440 145125 144985 145552 146086
55430 146086 146784 147779 148358 148263 148478 149643 150910 151341 151220 150994 150222 148625 147021 146206 146001 146229 147436
55413 147436 149698 151908 153158 153748 154097 153899 153148 152650 152622 152083 150585 149254 149162 149832 150332 150632 150959 150944
55395 150944 150359 149640 148886 147549 145784 144783 144956 145210 144907 145071 146579 148539 149623 149783 149599 149134 148538
$$ packed form
55520A58417j795j098L5L35r35k299k214j346r78p43L5N38N9k62O19J580J315
55503A51263O28P09Q72J86m89k20Jp83j439r29n58j598k606j783j70K86P0O64
55485A44104J409Q14m33o52j43k14m82R3P72M14K4J062K395J934K35n00o5K3l75
55466A50415j50M39J35q15j074o26l70n7R58J676Q14n91m87Q30J260K63q42j412
55448A50366j812j764p54L25K42l45QR12R12J73k0J46m81j468j315j40N67N34
55430A46086O98R95N79r5K15J165J267M31j21k26p72j597j604q15k05K28J207
55413A47436K262K210J250N90L49j98p51m98k8n39j498j331r2O70N00L00L27j5
55395A50944n85p19p54j337j765j001J73K54l03J64J508J960J084J60j84m65n96
$$ plain form
55378 148538 148555 149321 149725 149029 147979 147418 147015 146371 146096 146662 147418 147857 148641 150185 151457 151427 150669 150264
55360 150264 150150 149749 149273 149242 149590 150228 151510 153193 154058 153607 153032 153440 154217 154256 153677 153193 152865 152624 152927
55341 152927 153744 154042 153410 152985 153566 154071 153240 151671 150644 150048 149133 148358 148711 149855 150543 150429 150077 149658
55323 149658 148945 148177 147785 147703 147838 148528 149652 150164 149548 148803 148875 149100 148481 147543 147488 148276 148984 149431 150033
55304 150033 150632 150831 150987 151627 152321 152338 151957 152024 152648 153331 153894 154372 154560 154538 154890 155578 155518 154208 152808
55285 152808 152500 152823 152766 152419 152145 151285 149306 147417 147244 148533 149725 150253 150654 150939 150516 149520 148720 148289
55267 148289 147887 147712 148234 149237 150220 151362 152945 154360 154842 154712 154716 154773 154590 154808 156099 157717 158437 158425
55249 158425 158648 158893 158025 156004 154063 152974 152504 152496 153051 153731 153835 153499 153408 153570 153463 153169 153193 153337 152923
$$ packed form
55378A48538J7P66M04o96j050n61m03o44k75N66P56M39P84J544J272l0p58m05
55360A50264j14m01m76l1L48O38J282J683Q65m51n75M08P77L9n79m84l28k41L03
55341A52927Q17K98o32m25N81N05q31j569j027n96r15p75L53J144O88j14l52m19
55323A49658p13p68l92q2J35O90J124N12o16p45P2K25o19r38n5P88P08M47O02
55304A50033N99J99J56O40O94J7l81O7O24O83N63M78J88k2L52O88o0j310j400
55285A52808l08L23n7l47k74q60j979j889j73J289J192N28M01K85m23r96q00m31
55267A48289m02j75N22J003R83J142J583J415M82j30MN7j83K18J291J618P20j2
55249A58425K23K45q68k021j941j089m70qN55O80J04l36r1J62j07k94K4J44m14
$$ plain form
55230 152923 151952 150983 150131 149255 148827 149399 150462 151047 151197 151635 152290 152452 152213 152384 153042 153408 153261 153324 154109
55211 154109 155283 156251 156570 156009 154924 154289 154505 154665 153895 152811 152524 152807 152677 152306 152724 153800 154120
55194 154120 153057 151627 151002 151217 151642 151852 151837 151985 152813 154230 155430 156086 157004 158748 160378 160726 160254
55177 160254 160295 160924 161051 160327 159580 159444 159796 160398 160997 161053 160415 159940 160312 160741 160138 159030 158847 159687 160421
55158 160421 160711 161249 162080 162431 162298 162651 163772 164800 165120 164963 164482 163553 162614 162391 162603 162174 160949 159991
55140 159991 159980 160464 160886 161215 161350 160972 160212 159567 159075 158459 157984 158127 158494 158158 157058 156002 155373 154890
55122 154890 154515 154492 154580 154336 153985 153973 154040 153900 154336 156131 158332 159258 158947 158908 159610 160110 160126 160522 161522 162324
55102 162324 162870 164099 165963 166989 166496 165628 165454 165545 165188 164653 164459 164561 164914 165693 166435 166169 164975 164212
$$ packed form
55230A52923r71r69q52q76m28N72J063N85J50M38O55J62k39J71O58L66j47O3P85
55211A54109J174R68L19n61j085o35K16J60p70j084k87K83j30l71M18J076L20
55194A54120j063j430o25K15M25K10j5J48Q28J417J200O56R18J744J630L48m72
55177A60254M1O29J27p24p47j36L52O02N99N6o38m75L72M29o03j108j83Q40P34
55158A60421K90N38Q31L51j33L53J121J028L20j57m81r29r39k23K12m29j225r58
55140A59991j1M84M22L29J35l78p60o45m92o16m75J43L67l36j100j056o29m83
55122A54890l75k3Q8k44l51j2O7j40M36J795K201R26l11l9P02N00J6L96J000Q02
55102A62324N46J229J864J026m93q68j74R1l57n35j94J02L53P79P42k66j194p63
$$ plain form
55084 164212 164624 165346 165290 164388 162994 161317 160005 160052 161465 163020 163885 164432 165047 165343 165111 164880 164939 164874
55066 164874 164606 164788 165664 166601 167250 168042 169044 169514 169090 168297 167410 166033 164370 163571 164122 165038 165335 165198
55048 165198 165023 164504 163429 162277 161289 159989 158360 157391 157668 158445 158868 159121 159632 160185 160601 161314 162496
55031 162496 163577 164380 165648 167625 169184 169310 168469 167577 166567 165054 163561 162942 163204 163837 164702 165713
55015 165713 166249 165819 164875 164186 163866 163646 163590 163865 164329 164886 165728 166746 167359 167375 167380 167802 168332 168729 169359 170446
54995 170446 171687 173058 175049 177480 179075 178976 177847 176808 176117 175566 175228 175008 174320 173060 172086 172010 172309
54978 172309 172387 172596 173379 174314 174969 175883 177634 179648 180913 181334 181522 181814 182335 183381 184851 185888 185891 185331
54960 185331 184856 184345 183687 183652 184947 186966 188479 189073 189046 188497 187524 186878 187316 188589 189825 190587 190848 190461
$$ packed form
55084A64212M12P22n6r02j394j677j312M7J413J555Q65N47O15K96k32k31N9o5
55066A64874k68J82Q76R37O49P92J002M70m24p93q87j377j663p99N51R16K97j37
55048A65198j75n19j075j152r88j300j629r69K77P77M23K53N11N53M16P13J182
55031A62496J081Q03J268J977J559J26q41q92j010j513j493o19K62O33Q65J011
55015A65713N36m30r44o89l20k20n6K75M64N57Q42J018O13J6NM22N30L97O30J087
54995A70446J241J371J991K431J595r9j129j039o91n51l38k20o88j260r74p6K99
54978A72309P8K09P83R35O55R14J751K014J265M21J88K92N21J046J470J037Ln60
54960A85331m75n11o58l5J295K019J513N94k7n49r73o46M38J273J236P62K61l87
$$ plain form
54942 190461 189488 188640 188590 189219 190145 191451 193236 195096 196901 199435 203415 208449 213906 220209 228166 237423
54926 237423 246644 254916 261936 267044 269227 268190 264683 259693 253805 247241 240064 232533 225491 219907
54912 219907 215627 211265 205964 200616 196656 194282 192668 191342 190407 189793 189287 189084 189531 190494 191597 192780
54896 192780 194026 194991 195648 196851 199520 203497 207909 212362 217183 222789 229440 237175 245396 252849 258645
54881 258645 262986 266387 268633 269074 267419 263664 257758 250032 241515 233204 225421 218327 212385 207697
54867 207697 203583 199581 196266 194306 193365 192708 192292 192333 192359 191677 190349 188857 187193 185155 183144 181804
54851 181804 181127 180631 180106 179527 178696 177615 176784 176486 176292 175875 175673 175988 176180 175569 174574 174043 174044 174153 174365
54832 174365 174865 175455 176021 176924 178163 178887 178591 177987 177740 177268 175927 174508 174216 174892 175555 176020 176599 176883
$$ packed form
54942A90461r73q48n0O29R26J306J785J860J805K534L980N034N457O303P957R257
54926B37423R221Q272P020N108K183j037l507m990n888o564p177p531p042n584
54912B19907m280m362n301n348l960k374j614j326r35o14n06k03M47R63J103J183
54896A92780J246R65O57J203K669L977M412M453M821N606O651P735Q221P453N796
54881B58645M341L401K246M41j655l755n906p726q517q311p783p094n942m688
54867B07697m114m002l315j960r41o57m16M1K6o82j328j492j664k038k011j340
54851A81804o77m96n25n79q31j081q31k98j94m17k02L15J92o11r95n31JJ09K12
54832A74365N00N90N66R03J239P24k96o04k47m72j341j419k92O76O63M65N79K84
$$ plain form
54814 176883 176406 175987 176844 178728 180449 181844 183617 185502 186322 185887 185241 184985 184817 184820 185694 187479 189315
54797 189315 190709 191883 192791 193044 192930 193292 194174 194782 194960 195534 196909 198422 199436 200124 200950 202193 204152
54780 204152 206994 210363 213949 218275 223997 230631 237077 243249 249926 257040 263393 268145 271313 272682
54766 272682 271642 268372 263995 259214 253917 248348 243403 239353 235411 231026 226606 222583 218755 214948
54752 214948 211417 208247 205260 202783 201512 201344 201342 201145 201364 202270 203186 203640 204075 204951 206096 207451 209504
54735 209504 212455 215839 219507 224135 230220 237301 244661 252023 259037 264847 268739 270675 270759 268762 264507
54720 264507 258204 250258 241418 233165 226952 222663 218737 214184 209673 206280 204127 202782 202072 201755 201127
54705 201127 199720 197959 196569 195683 194980 194231 193348 192305 191318 190709 190383 189919 189276 188822 188599 188205 187634
$$ packed form
54814A76883m77m19Q57J884J721J395J773J885Q20m35o46k56j68LQ74J785J836
54797A89315J394J174R08K53j14L62Q82O08J78N74J375J513J014O88Q26J243J959
54780B04152K842L369L586M326N722O634O446O172O677P114O353M752L168J369
54766B72682j040l270m377m781n297n569m945m050l942m385m420m023l828l807
54752B14948l531l170k987k477j271j68kj97K19R06R16M54M35Q76J145J355K053
54735B09504K951L384L668M628O085P081P360P362P014N810L892J936Q4j997m255
54720B64507o303p946q840q253o213m289l926m553m511l393k153j345p10l17o28
54705B01127j407j761j390q86p03p49q83j043r87o09l26m64o43m54k23l94n71
$$ plain form
54688 187634 187514 188253 189549 190919 192080 192679 192404 191570 190942 190766 190646 190437 190461 190695 190598 189961 189163 188371
54670 188371 187348 186172 185318 184835 184329 183918 184214 185180 186073 186702 187634 188859 189490 189227 188841 188716 188209 187188
54652 187188 186820 187856 189298 189849 189749 189944 190322 190023 189026 188195 188043 188440 189246 190297 190948 190504 189131
54635 189131 187777 187289 187981 189685 191719 193052 193022 191819 190080 188366 187187 186899 187240 187490 187407 187416 187616
54618 187616 187437 186728 186358 187052 188314 189162 189341 189170 188807 188432 188563 189439 190492 191132 191632 192525 193557 193994
54600 193994 193707 193241 192997 192907 192760 192358 191575 190588 189826 189383 188886 188199 187722 187649 187539 187111 186895 187498 188707
54581 188707 189839 190512 190612 190062 189203 188899 189652 191014 192318 193453 194449 194993 195003 195042 195461 195733 195406 195087
54563 195087 195559 196446 196758 196416 196229 196554 196988 197323 197855 198629 199184 199294 199430 200266 202036 204379 206514 207644
$$ packed form
54688A87634j20P39J296J370J161N99k75q34o28j76j20k09K4K34r7o37p98p92
54670A88371j023j176q54m83n06m11K96R66Q93O29R32J225O31k63l86j25n07j021
54652A87188l68J036J442N51j00J95L78k99r97q31j52L97Q06J051O51m44j373
54635A89131j354m88O92J704K034J333l0j203j739j714j179k88L41K50q3RK00
54618A87616j79p09l70O94J262Q48J79j71l63l75J31Q76J053O40N00Q93J032M37
54600A93994k87m66k44r0j47m02p83r87p62m43m97o87m77p3j10m28k16O03J209
54581A88707J132O73J00n50q59l04P53J362J304J135R96N44J0L9M19K72l27l19
54563A95087M72Q87L12l42j87L25M34L35N32P74N55J10J36Q36J770K343K135J130
$$ plain form
54545 207644 207513 206573 205446 204501 204062 204512 205783 207132 207882 208067 208046 207972 208036 208672 209896 210898 210965 210440
54527 210440 210129 210041 209481 208197 206774 205934 205891 206336 206723 206695 206456 206498 206850 207071 207126 207568 208449 208874 208235 207161
54507 207161 206474 205893 204710 203133 201873 200811 199270 197441 196388 196542 197202 197768 198581 200196 202476 204829
54491 204829 206895 208665 210243 211710 213092 214248 214882 214726 213773 212498 211732 211952 212715 213304 213879 215229
54475 215229 217246 218617 218589 218147 218660 220037 221146 221517 221631 221830 221941 221867 221715 221420 220922 220574 220713 220969
54457 220969 220687 219912 219341 219382 219849 220416 220786 220583 219739 218855 218595 218804 218766 218192 217440 216939 216905 217388 218043 218130
54437 218130 217334 216349 216017 216200 216167 215810 215739 216338 217454 218848 220261 221223 221482 221464 221655 221851 221779 222075 223602
54418 223602 225991 227906 228738 228991 228936 228050 226126 223924 222199 220847 219511 218438 218193 218921 220255 221683
$$ packed form
54545B07644j31r40j127r45m39M50J271J349P50J85k1p4O4O36J224J002O7n25
54527B10440l11q8n60j284j423q40m3M45L87k8k39M2L52K21N5M42Q81M25o39j074
54507B07161o87n81j183j577j260j062j541j829j053J54O60N66Q13J615K280K353
54491B04829K066J770J578J467J382J156O34j56r53j275p66K20P63N89N75J350
54475B15229K017J371k8m42N13J377J109L71J14J99J11p4j52k95m98l48J39K56
54457B20969k82p75n71M1M67N67L70k03q44q84k60K09l8n74p52n01l4M83O55Q7
54437B18130p96r85l32J83l3l57p1N99J116J394J413R62K59j8J91J96p2K96J527
54418B23602K389J915Q32K53n5q86j924k202j725j352j336j073k45P28J334J428
$$ plain form
54402 221683 222825 223647 224482 225490 226171 225861 224749 223839 223831 224488 225145 225373 225114 224702 224823 225916 227496 228546
54384 228546 228643 228268 227963 227720 227326 226782 226175 225566 225126 225010 225030 224815 224367 224078 224160 224447 224829 225476 226572
54365 226572 228193 230398 233111 235924 238426 240663 242893 244981 246534 247552 248340 248760 248153 246206 243482
54350 243482 240877 238850 237244 235605 233647 231585 229969 229007 228281 227373 226443 225818 225356 224718 223892 222978
54334 222978 221845 220679 220440 221870 224259 226108 226955 227607 228576 229274 229026 228046 227037 226467 226497 227058 227726
54317 227726 227970 227706 227204 226447 225145 223478 222161 221593 221520 221620 221879 222169 222091 221481 220597 219600 218343 216856
54299 216856 215536 214647 214043 213581 213363 213418 213591 213876 214483 215431 216461 217411 218274 218844 218795 218204 217530 217035 216677
54280 216677 216547 216807 217150 216948 216133 215361 215134 215278 215438 215580 215782 216065 216597 217608 218917 220064 221081
$$ packed form
54402B21683J142Q22Q35J008O81l10j112r10qO57O57K28k59m12J21J093J580J050
54384B28546R7l75l05k43l94n44o07o09m40j16K0k15m48k89Q2K87L82O47J096
54365B26572J621K205K713K813K502K237K230K088J553J018P88M20o07j947k724
54350B43482k605k027j606j639j958k062j616r62p26r08r30o25m62o38q26r14
54334B22978j133j166k39J430K389J849Q47O52R69O98k48r80j009n70L0N61O68
54317B27726K44k64n02p57j302j667j317n68p3J00K59K90p8o10q84r97j257j487
54299B16856j320q89o04m62k18N5J73K85O07R48J030R50Q63N70m9n91o74m95l58
54280B16677j30K60L43k02q15p72k27J44J60J42K02K83N32J011J309J147J017
$$ plain form
54263 221081 222614 224977 227602 229663 230856 231324 231278 231002 230885 231108 231518 231938 232355 232705 232743 232260 231240
54246 231240 229845 228467 227657 227609 227866 227891 227802 228043 228585 229025 229324 229767 230310 230690 231086 231855 232629 232614 231905
54227 231905 231614 232388 233623 234463 234803 234902 234756 234364 234040 233984 233956 233722 233388 233044 232554 231929 231375 230799 229899
54208 229899 229022 229202 230871 233135 234755 235363 235263 234618 233389 231730 229918 228151 226739 226141 226424 227016
54192 227016 227323 227289 227088 226694 226129 225784 226063 226925 228000 228981 229624 229711 229311 228895 228933 229488 230249 230811 230911
54173 230911 230650 230396 230234 229724 228620 227568 227400 227926 228142 227552 226471 225098 223315 221521 220616 220754 221060
54156 221060 220973 221008 221673 222532 222919 222854 222633 222236 221768 221819 222660 223647 224112 224311 224823 225534 225960 226179 226656 227437
54136 227437 228152 228607 228856 228929 228942 229206 229802 230411 230941 231820 233218 234534 235282 235928 237107 238492 239320 239718
$$ packed form
54263B21081J533K363K625K061J193M68m6k76j17K23M10M20M17L50L8m83j020
54246B31240j395j378q10m8K57K5q9K41N42M40K99M43N43L80L96P69P74j5p09
54227B31905k91P74J235Q40L40R9j46l92l24n6k8k34l34l44m90o25n54n76r00
54208B29899q77J80J669K264J620O08j00o45j229j659j812j767j412n98K83N92
54192B27016L07l4k01l94n65l45K79Q62J075R81O43Q7m00m16L8N55P61N62J00
54173B30911k61k54j62n10j104j052j68N26K16n90j081j373j783j794r05J38L06
54156B21060q7L5O65Q59L87o5k21l97m68N1Q41R87M65J99N12P11M26K19M77P81
54136B27437P15M55K49P3J3K64N96O09N30Q79J398J316P48O46J179J385Q28L98
$$ plain form
54118 239718 240535 241973 243300 244095 244961 246661 249061 251258 252515 252818 252699 252724 253234 254558 257196 261414
54102 261414 266713 272203 277660 283790 291277 300131 310166 321496 333912 346094 355936 361560 361943
54089 361943 357166 348553 338228 327887 318032 308555 299752 292358 286832 282986 280245 278125 276672 276544
54075 276544 278404 282214 287408 293626 300698 307972 314428 319634 323791 326608 327022 324422 319378 312786
54061 312786 305207 297495 290959 286025 281612 276805 272397 269756 268839 268483 268190 268393 269190 270077 270912 272114
54045 272114 273770 275413 276835 278438 280603 283304 286421 289938 293819 298119 303161 309129 315608 321951
54031 321951 327939 333702 339208 344349 349249 353937 358023 361255 364074 366986 369618 371170 371629 371797 372181
54016 372181 372506 372282 371233 369212 366314 363057 359872 356485 352260 347097 341477 335793 330204 324991 320434
$$ packed form
54118B39718Q17J438J327P95Q66J700K400K197J257L03j19K5N10J324K638M218
54102B61414N299N490N457O130P487Q854J0035J1330J2416J2182R842N624L83
54089C61943m777q613j0325j0341r855r477q803p394n526l846k741k120j453j28
54075B76544J860L810N194O218P072P274O456N206M157K817M14k600n044o592
54061C12786p579p712o536m934m413m807m408k641r17l56k93K03P97Q87Q35J202
54045B72114J656J643J422J603K165K701L117L517L881M300N042N968O479O343
54031C21951N988N763N506N141M900M688M086L232K819K912K632J552M59J68L84
54016C72181L25k24j049k021k898l257l185l387m225n163n620n684n589n213m557
$$ plain form
54001 320434 316421 312731 309567 307215 305331 303252 300937 298863 297069 295019 292505 290000 287947 286243
53987 286243 284558 282692 280622 278608 277179 276518 275982 274835 273350 272469 272422 272482 272179 271921 272104 272343 272050
53970 272050 271320 270785 270863 271487 272333 273080 273532 273716 273858 274323 275580 277962 281222 284579 287562 290578 294286
53953 294286 298690 303333 308167 313631 320026 327470 336445 347718 361576 377636 395391 414218 432505
53940 432505 447311 455571 455949 449705 439916 429664 420460 412133 404040 396155 388954 382778 377768 374238
53926 374238 372578 372842 374613 377177 379704 381693 383522 386239 390479 395906 401925 408425 415451 422783
53912 422783 430337 438433 447055 455417 462886 469733 476205 481530 484753 486004 485922 484417 481171 476954 473083
53897 473083 469716 465955 461499 456927 452287 446806 440257 433423 426852 420161 412923 405264 397328 389132
$$ packed form
54001C20434m013l690l164k352j884k079k315k074j794k050k514k505k053j704
53987B86243j685j866k070k014j429o61n36j147j485q81m7O0l03k58J83K39k93
53970B72050p30n35P8O24Q46P47M52J84J42M65J257K382L260L357K983L016L708
53953B94286M404M643M834N464O395P444Q975J1273J3858J6060J7755J8827J8287
53940D32505J4806Q260L78o244r789j0252r204q327q093p885p201o176n010l530
53926C74238j660K64J771K564K527J989J829K717M240N427O019O500P026P332
53912D22783P554Q096Q622Q362P469O847O472N325L223J251q2j505l246m217l871
53897D73083l367l761m456m572m640n481o549o834o571o691p238p659p936q196
$$ plain form
53883 389132 381262 374677 369449 364608 359609 355037 351499 348773 346418 344280 341949 338659 334323 329809
53869 329809 325643 321309 316405 311632 307904 305202 302994 301116 299530 297831 295777 293849 292594 291791
53855 291791 290849 289576 288067 286331 284563 283296 282652 281926 280480 278621 277010 275710 274475 273566 273526 274405
53839 274405 275801 277364 278710 279173 278327 276628 274980 273878 273382 273578 274466 275646 276705 277737 278945
53824 278945 279993 280391 280383 280785 281946 283360 284311 284522 284263 284211 285101 287075 289449 291506 293366 295765 299168
53807 299168 303573 308945 315177 321612 327224 331542 335029 338507 342518 347273 352758 358646 364397 369696
53793 369696 374606 379154 382908 385277 386215 386459 386891 387675 388178 387792 386681 385469 384339 382799 380350 377009
53777 377009 373038 368518 363501 358312 353377 348803 344383 339942 335530 331278 327184 323077 318808 314547
$$ packed form
53883C89132p870o585n228m841m999m572l538k726k355k138k331l290m336m514
53869C29809m166m334m904m773l728k702k208j878j586j699k054j928j255q03
53855B91791r42j273j509j736j768j267o44p26j446j859j611j300j235r09m0Q79
53839B74405J396J563J346M63q46j699j648j102m96J96Q88J180J059J032J208
53824B78945J048L98qM02J161J414R51K11k59n2Q90J974K374K057J860K399L403
53807B99168M405N372O232O435N612M318L487L478M011M755N485N888N751N299
53793C69696M910M548L754K369R38K44M32P84N03l86j111j212j130j540k449l341
53777C77009l971m520n017n189m935m574m420m441m412m252m094m107m269m261
$$ plain form
53763 314547 310791 307940 305913 304367 303196 302507 302142 301592 300512 299034 297426 295678 293621 291333 289294
53748 289294 288045 287581 287090 285589 283027 280459 278847 278052 277444 277004 277092 277429 277264 276529 275903 275593 275000
53731 275000 273919 273173 273518 274552 275289 275333 275025 274916 275574 277419 280175 282779 284339 285038 285780 287231 289503
53714 289503 292358 295274 297553 298860 299580 300419 301838 304015 307019 310753 314991 319667 324771 329809 333895
53699 333895 336757 339192 342093 345347 348131 350012 351324 352663 354351 356161 357368 357309 356218 355193 355120
53684 355120 355925 357082 358330 359518 360258 360286 359881 359434 358914 358137 357262 356549 355919 355230 354682 354441 354142 353287
53666 353287 351962 350687 349713 349035 348919 349809 351645 353737 355346 356062 355700 354300 352349 350692 349960 350120
53650 350120 350568 350629 350106 349411 349058 349051 349008 348871 349070 349879 351072 352380 353848 355462 356879 357894 358794 359905
$$ packed form
53763C14547l756k851k027j546j171o89l65n50j080j478j608j748k057k288k039
53748B89294j249m64m91j501k562k568j612p95o08m40Q8L37j65p35o26l10n93
53731B75000j081p46L45J034P37M4l08j09O58J845K756K604J560O99P42J451K272
53714B89503K855K916K279J307P20Q39J419K177L004L734M238M676N104N038M086
53699C33895K862K435K901L254K784J881J312J339J688J810J207n9j091j025p3
53684C55120Q05J157J248J188P40K8m05m47n20p77q75p13o30o89n48k41k99q55
53666C53287j325j275r74o78j16Q90J836K092J609P16l62j400j951j657p32J60
53650C50120M48O1n23o95l53pm3j37J99Q09J193J308J468J614J417J015R00J111
$$ plain form
53632 359905 361150 362347 363509 364462 364684 364057 363455 364000 365946 368660 371383 373632 375284 376810 379127
53617 379127 382641 386694 390393 393643 396832 399966 402909 406168 410606 416417 423123 430461 438455 446577
53603 446577 453769 459621 464892 470474 476344 481853 486540 490196 492481 493049 492106 490432 488690 486800 484179
53588 484179 480650 476865 473609 470854 467918 464582 461530 459472 458280 457364 456465 455676 454940 453992 452633
53573 452633 450756 448303 445490 442803 440469 438151 435518 432798 430406 428350 426440 424788 423650 423040
53559 423040 422868 423233 424112 425094 425896 426865 428423 430317 431948 433165 434061 434270 433285 431469 430032 429881 430977
53542 430977 432743 434586 436041 436993 437905 439381 441510 443998 446788 450062 453698 457331 460971 465041 469772
53527 469772 475057 480942 487709 495414 503708 512291 521187 530597 540776 551940 563928 576154 588352
$$ packed form
53632C59905J245J197J162R53K22o27o02N45J946K714K723K249J652J526K317
53617C79127L514M053L699L250L189L134K943L259M438N811O706P338P994Q122
53603D46577P192N852N271N582N870N509M687L656K285N68r43j674j742j890k621
53588D84179l529l785l256k755k936l336l052k058j192r16q99p89p36r48j359
53573D52633j877k453k813k687k334k318k633k720k392k056j910j652j138o10
53559D23040j72L65Q79R82Q02R69J558J894J631J217Q96K09r85j816j437j51J096
53542D30977J766J843J455R52R12J476K129K488K790L274L636L633L640M070M731
53527D69772N285N885O767P705Q294Q583Q896R410J0179J1164J1988J2226J2198
$$ plain form
53514 588352 601187 615517 631194 647295 663448 680152 697702 715645 733630 752085 771522
53503 771522 791612 811353 829972 847415 864263 881376 899276 917653 935706 953170 970759
53492 970759 989388 1009105 1029006 1048094 1066139 1083740 1101565 1119553 1137041 1153649 1169617
53481 1169617 1185121 1199817 1213601 1227328 1242005 1257484 1272763 1287485 1302268 1317480 1332504
53470 1332504 1346468 1358956 1369644 1377962 1383613 1386985 1388571 1388248 1385509 1380056 1371866 1361006 1347864
53457 1347864 1333437 1319020 1305507 1292983 1280800 1267956 1253635 1237626 1220263 1202055 1183539
53446 1183539 1165309 1147775 1130831 1114052 1097299 1080809 1064646 1048402 1031651 1014535 997879
53435 997879 982865 970525 961163 954203 948800 944570 941452 938996 936375 933341 930837 930356 932793 937988
$$ packed form
53514E88352J2835J4330J5677J6101J6153J6704J7550J7943J7985J8455J9437
53503G71522K0090J9741J8619J7443J6848J7113J7900J8377J8053J7464J7589
53492I70759J8629J9717J9901J9088J8045J7601J7825J7988J7488J6608J5968
53481A169617J5504J4696J3784J3727J4677J5479J5279J4722J4783J5212J5024
53470A332504J3964J2488J0688Q318N651L372J586l23k739n453q190j0860j3142
53457A347864j4427j4417j3513j2524j2183j2844j4321j6009j7363j8208j8516
53446A183539j8230j7534j6944j6779j6753j6490j6163j6244j6751j7116j6656
53435I97879j5014j2340r362o960n403m230l118k456k621l034k504m81K437N195
$$ plain form
53421 937988 945225 953917 963832 974746 986178 997723 1009631 1022656 1037245 1053270 1070625 1089419
53409 1089419 1109170 1128498 1146422 1163644 1181883 1202219 1224780 1249655 1277101 1306854 1338214
53398 1338214 1371048 1406038 1443728 1483910 1525959 1569213 1612959 1656805 1701234 1747138 1794660
53387 1794660 1843080 1891904 1941296 1991231 2040971 2089742 2137261 2183318 2227451 2269445 2309567
53376 2309567 2347941 2384194 2418011 2449509 2478705 2505142 2528439 2548730 2566227 2580804 2592265
53365 2592265 2600405 2604288 2602049 2592003 2573756 2547961 2515505 2477432 2435181 2390179 2343314 2295158
53353 2295158 2246434 2197764 2149200 2100495 2051710 2003278 1955694 1909571 1865719 1824588 1785660
53342 1785660 1747786 1710150 1672630 1635228 1597570 1559198 1520291 1481961 1445660 1412185 1381310
$$ packed form
53421I37988P237Q692R915J0914J1432J1545J1908J3025J4589J6025J7355J8794
53409A089419J9751J9328J7924J7222J8239K0336K2561K4875K7446K9753L1360
53398A338214L2834L4990L7690M0182M2049M3254M3746M3846M4429M5904M7522
53387A794660M8420M8824M9392M9935M9740M8771M7519M6057M4133M1994M0122
53376B309567L8374L6253L3817L1498K9196K6437K3297K0291J7497J4577J1461
53365B592265Q140L883k239j0046j8247k5795l2456l8073m2251m5002m6865m8156
53353B295158m8724m8670m8564m8705m8785m8432m7584m6123m3852m1131l8928
53342A785660l7874l7636l7520l7402l7658l8372l8907l8330l6301l3475l0875
$$ plain form
53331 1381310 1352537 1325985 1302220 1281390 1263040 1246779 1232535 1220056 1208729 1198176 1188495
53320 1188495 1179526 1170298 1159682 1147455 1134441 1121823 1110497 1100771 1092379 1084823 1077859 1071569 1066072
53307 1066072 1061512 1058314 1056990 1057538 1059364 1061918 1065050 1068788 1073258 1078900 1086241 1095306 1105734 1117539
53293 1117539 1131123 1146391 1162665 1179773 1198466 1219229 1241349 1263761 1286287 1309416 1333247
53282 1333247 1357207 1380449 1402006 1421030 1437580 1452911 1468312 1483771 1498199 1510675 1520875
53271 1520875 1528545 1533337 1535231 1534632 1531919 1527164 1520207 1510702 1498232 1482709 1464547 1444225 1421880
53258 1421880 1397634 1372012 1345650 1318808 1291539 1264087 1236648 1208968 1180733 1152324 1124745
53247 1124745 1098754 1074366 1051179 1028872 1007418 986958 967364 947835 927210 905055 882208
$$ packed form
53331A381310k8773k6552k3765k0830j8350j6261j4244j2479j1327j0553r681
53320A188495q969r228j0616j2227j3014j2618j1326r726q392p556o964o290n497
53307A066072m560l198j324N48J826K554L132L738M470N642P341R065J0428J1805
53293A117539J3584J5268J6274J7108J8693K0763K2120K2412K2526K3129K3831
53282A333247K3960K3242K1557J9024J6550J5331J5401J5459J4428J2476J0200
53271A520875P670M792J894n99k713m755o957r505j2470j5523j8162k0322k2345
53258A421880k4246k5622k6362k6842k7269k7452k7439k7680k8235k8409k7579
53247A124745k5991k4388k3187k2307k1454k0460j9594j9529k0625k2155k2847
$$ plain form
53236 882208 859899 838540 817673 796941 776667 757571 740189 724532 710142 696596 684081
53225 684081 673188 663942 655459 646977 638867 632094 626821 622050 616570 609845 602028 593467 584323 574434
53211 574434 563573 551928 540166 528896 518310 508472 499635 491935 485054 478550 472324 466516 461204
53198 461204 456499 452606 449373 446056 441919 436875 431234 425108 418533 411884 405697 400179 395273 390952
53184 390952 387050 383075 378675 374137 370010 366419 363158 360174 357493 354934 352459 350514 349417 348620
53170 348620 347316 345637 344504 344324 344609 344857 345036 345022 344350 342930 341366 340180 339169 337947 336672 335821
53154 335821 335494 335367 335109 334563 333656 332471 331247 330111 328848 327194 325245 323441 322135 321325 320699 319859
53138 319859 318548 316900 315460 314896 315516 317123 319298 321710 324018 325685 326374 326709 328125 331418 335697
$$ packed form
53236H82208k2309k1359k0867k0732k0274j9096j7382j5657j4390j3546j2515
53225F84081j0893r246q483q482q110o773n273m771n480o725p817q561r144r889
53211E74434j0861j1645j1762j1270j0586r838q837p700o881o504o226n808n312
53198D61204m705l893l233l317m137n044n641o126o575o649o187n518m906m321
53184C90952l902l975m400m538m127l591l261k984k681k559k475j945j097p97
53170C48620j304j679j133j80K85K48J79j4o72j420j564j186j011j222j275q51
53154C35821l27j27k58n46r07j185j224j136j263j654j949j804j306q10o26q40
53138C19859j311j648j440n64O20J607K175K412K308J667O89L35J416L293M279
$$ plain form
53123 335697 339393 342149 344994 348703 352891 356997 361174 365586 369642 372757 375333 378082 380677 382044
53109 382044 381825 380640 378900 376250 372461 368113 363981 360216 356465 352419 347972 343148 338230 333839
53095 333839 330636 328886 328293 328178 327912 327371 326924 326864 327015 327059 326976 326804 326238 324969 323386 322412 322530 323327
53077 323327 324088 324431 324285 323671 322817 322245 322312 322680 322470 321166 319283 317944 317684 317843 317372 316043 314497
53060 314497 313271 312344 311682 311510 311705 311520 310419 308846 307727 307519 308112 309264 310691 311991 312964 313757
53044 313757 314384 314534 314199 314026 314484 315154 315432 315441 315560 315522 314875 314002 313705 313927 313860 313238 312543 311921 310905 309478
53024 309478 308506 308759 310168 312294 314775 317048 318416 318902 319466 320926 323044 325037 326524 327649 328667
53009 328667 329806 331209 332686 333777 334281 334430 334367 333847 332741 331516 330810 330713 330733 330426 329908 329774 330537 332000
$$ packed form
53123C35697L696K756K845L709M188M106M177M412M056L115K576K749K595J367
53109C82044k19j185j740k650l789m348m132l765l751m046m447m824m918m391
53095C33839l203j750n93j15k66n41m47o0J51M4q3j72n66j269j583r74J18P97
53077C23327P61L43j46o14q54n72O7L68k10j304j883j339k60J59m71j329j546
53060C14497j226r27o62j72J95j85j101j573j119k08N93J152J427J300R73P93
53044C13757O27J50l35j73M58O70K78RJ19l8o47q73k97K22o7o22o95o22j016j427
53024C09478r72K53J409K126K481K273J368M86N64J460K118J993J487J125J018
53009C28667J139J403J477J091N04J49o3n20j106j225p06r7K0l07n18j34P63J463
$$ plain form
52991 332000 333277 333630 333216 332803 332941 333765 335369 337756 340462 342752 344336 345472 346378 347020 347465 347877
52975 347877 348150 348116 348184 349129 351060 353191 354840 356072 357183 358217 359369 361148 363629 365961 367165 367128
52959 367128 366383 365231 363567 361298 358498 355232 351614 347983 344794 342418 341060 340576 340256 339220 337359
52944 337359 335553 334578 334104 333263 332020 331370 332037 333433 334198 333582 332049 330602 329812 329667 329978 330480 330561
52927 330561 329560 327705 326259 326226 327112 327513 326740 325296 323901 322751 321837 321397 321747 323027 325176 327849
52911 327849 330345 332030 332942 333553 333944 333668 332536 331089 330138 330144 331075 332455 333519 333764 333481 333495 334400 336391
52893 336391 339500 343366 346851 348734 348922 348364 347741 346956 345973 345200 344675 343762 342225 340922 340795 341650 342506
52876 342506 342799 342714 342654 342896 343582 344717 346254 348306 350965 353846 356255 357936 359165 360013 360181 359766 359463
$$ packed form
52991C32000J277L53m14m13J38Q24J604K387K706K290J584J136R06O42M45M12
52975C47877K73l4O8R45J931K131J649J232J111J034J152J779K481K332J204l7
52959C67128p45j152j664k269k800l266l618l631l189k376j358m84l20j036j861
52944C37359j806r75m74q41j243o50O67J396P65o16j533j447p90j45L11N02Q1
52927C30561j001j855j446l3Q86M01p73j444j395j150r14m40L50J280K149K673
52911C27849K496J685R12O11L91k76j132j447r51OR31J380J064K45k83J4R05J991
52893C36391L109L866L485J883J88n58o23p85r83p73n25r13j537j303j27Q55Q56
52876C42506K93q5o0K42O86J135J537K052K659K881K409J681J229Q48J68m15l03
$$ plain form
52859 359463 359597 359568 358750 357341 355827 354152 351925 349002 345375 341041 336527 332952 330813 329132 326633
52844 326633 323441 320806 319336 318388 317213 315993 315424 315777 316622 317300 317520 317529 317734 318211 318836 319748 321179
52827 321179 322763 323599 323233 322019 320270 317812 314867 312592 311973 312627 313489 314248 315378 317123 319410 322534
52811 322534 326956 332245 336938 339635 339857 337889 334408 330334 326508 323341 320946 319438 318671 317979 316802
52796 316802 315470 314725 314484 313819 312326 310782 310103 310147 310035 309394 308810 309058 310162 311379 312099 312563 313441
52779 313441 314761 315772 316025 316143 317027 318652 320159 320923 320972 320494 319545 318261 316869 315428 314010 313120
52763 313120 313424 314888 316627 317790 318281 318493 318684 318898 319224 319852 320899 322294 323773 324942 325464 325262
52747 325262 324614 324098 324348 325576 327219 328316 328414 327959 327654 327723 328069 328776 330031 331690 333424 335270 337637
$$ packed form
52859C59463J34k9q18j409j514j675k227k923l627m334m514l575k139j681k499
52844C26633l192k635j470r48j175j220n69L53Q45O78K20RK05M77O25R12J431
52827C21179J584Q36l66j214j749k458k945k275o19O54Q62P59J130J745K287L124
52811C22534M422N289M693K697K22j968l481m074l826l167k395j508p67o92j177
52796C16802j332p45k41o65j493j544o79M4j12o41n84K48J104J217P20M64Q78
52779C13441J320J011K53J18Q84J625J507P64M9m78r49j284j392j441j418q90
52763C13120L04J464J739J163M91K12J91K14L26O28J047J395J479J169N22k02
52747C25262o48n16K50J228J643J097R8m55l05O9L46P07J255J659J734J846K367
$$ plain form
52730 337637 340664 343869 346538 348305 349241 349478 348845 346985 343914 340382 337329 334935 332580 329869 327267
52715 327267 325449 324398 323572 322677 321828 321108 320428 319808 319445 319471 319786 320145 320348 320509 321179 322883 325394 327782
52697 327782 329352 330245 330964 331704 332337 332620 332206 330972 329635 329401 330543 331898 332318 332068 332135 332709 333183
52680 333183 333239 333008 332404 331279 330118 329696 329962 330102 329796 329641 330180 331193 332185 332955 333508 333982 334833 336509
52662 336509 338681 340282 340579 339879 339090 338991 339997 342100 344773 347301 349364 351013 352061 352035 350892 349340
52646 349340 348192 347725 347802 348172 348476 348354 347885 347659 348123 349098 350152 351229 352637 354529 356739 359187 362216
52629 362216 366268 371002 374951 376441 375049 371837 368049 364018 359621 355194 351319 348041 345083 342667
52615 342667 341385 341201 341272 340918 340223 339622 339411 339788 340805 342092 343096 343745 344396 344986 344840 343650 342215
$$ packed form
52730C37637L027L205K669J767R36K37o33j860l071l532l053k394k355k711k602
52715C27267j818j051q26q95q49p20o80o20l63K6L15L59K03J61O70J704K511K388
52697C27782J570Q93P19P40O33K83m14j234j337k34J142J355M20k50O7N74M74
52680C33183N6k31o04j125j161m22K66J40l06j55N39J013R92P70N53M74Q51J676
52662C36509K172J601K97p00p89r9J006K103K673K528K063J649J048k6j143j552
52646C49340j148m67P7L70L04j22m69k26M64R75J054J077J408J892K210K448L029
52629C62216M052M734L949J490j392l212l788m031m397m427l875l278k958k416
52615C42667j282j84P1l54o95o01k11L77J017J287J004O49O51N90j46j190j435
$$ plain form
52598 342215 341737 342562 343916 344794 344888 344731 345074 346221 347945 349976 352250 354580 356453 357551 358189 358836
52582 358836 359428 359623 359503 359492 359727 360010 360253 360440 360318 359771 359338 359603 360078 359537 357612 355367 353998 353616
52564 353616 353573 353389 352960 352291 351471 350757 350415 350588 351204 351789 351582 350308 348701 347766 347671 347954 348544 349696
52546 349696 350998 351484 350940 350181 349754 349349 348876 349144 350777 353213 355452 357233 358796 360036 360698 361069
52530 361069 361746 362867 364050 364975 365568 365853 365963 366126 366416 366739 367232 368252 369786 371389 372978 375094
52514 375094 378059 381460 384879 388407 391783 393742 393166 390490 387191 384099 381024 377771 374603 371723
52500 371723 369099 366883 365344 364327 363396 362550 362171 362216 362117 361604 360936 360133 358698 356567 354735 354366 355550
52483 355550 357417 359227 360885 362493 363943 365053 365812 366370 366968 367834 368991 370139 370961 371603 372584 374229
$$ packed form
52598C42215m78Q25J354Q78R4j57L43J147J724K031K274K330J873J098O38O47
52582C58836N92J95j20j1K35K83K43J87j22n47m33K65M75n41j925k245j369l82
52564C53616m3j84m29o69q20p14l42J73O16N85k07j274j607r35r5K83N90J152
52546C49696J302M86n44p59m27m05m73K68J633K436K239J781J563J240O62L71
52530C61069O77J121J183R25N93K85J10J63K90L23M93J020J534J603J589K116
52514C75094K965L401L419L528L376J959n76k676l299l092l075l253l168k880
52500C71723k624k216j539j017r31q46l79M5r9n13o68q03j435k131j832l69J184
52483C55550J867J810J658J608J450J110P59N58N98Q66J157J148Q22O42R81J645
$$ plain form
52467 374229 376464 379329 383211 388153 393109 396455 397294 395880 392828 388528 383482 378522 374186 370290
52453 370290 366507 362978 359886 356926 353887 351455 350585 351155 351929 351902 351112 350111 349314 348933 348905 348685 347629
52436 347629 345793 343930 342647 341973 341832 342315 343331 344485 345478 346253 346733 346940 347388 348645 350368 351468
52420 351468 351530 351451 352350 354394 357010 359721 362383 365063 368038 371648 375964 380902 386717 393907 402658
52405 402658 413045 425700 441248 458705 475217 487842 495007 496164 491277 481413 468903 455923
52393 455923 443311 431309 420635 412020 405286 399818 395495 392377 390008 387936 386500 386198 386648 387084
52379 387084 387548 388655 390462 392554 395069 398548 402821 406923 410206 412687 414322 414857 414525 414020 413510
52364 413510 412434 410551 408482 406853 405511 404008 402492 401697 402216 403938 406035 407538 408175 408617 409662
$$ packed form
52467C74229K235K865L882M942M956L346Q39j414l052m300n046m960m336l896
52453C70290l783l529l092k960l039k432q70N70P74k7p90j001p97l81k8k20j056
52436C47629j836j863j283o74j41M83J016J154R93P75M80K07M48J257J723J100
52420C51468O2p9Q99K044K616K711K662K680K975L610M316M938N815P190Q751
52405D02658J0387J2655J5548J7457J6512J2625P165J157m887r864j2510j2980
52393D55923j2612j2002j0674q615o734n468m323l118k369k072j436l02M50M36
52379C87084M64J107J807K092K515L479M273M102L283K481J635N35l32n05n10
52364D13510j076j883k069j629j342j503j516p95N19J722K097J503O37M42J045
$$ plain form
52349 409662 411286 412812 413855 414654 415578 416783 418290 419990 421606 423068 424873 427649 431484 436024 441038
52334 441038 446385 451648 456477 461268 466891 473687 481233 489028 496840 504409 511481 518175 524721 530777
52320 530777 535668 539522 543536 548918 556011 564592 574397 585061 596118 607457 619415 632198 645579
52307 645579 659372 673782 689037 705112 722089 740331 759895 780042 799643 817856 834251
52296 834251 848706 861548 873508 885106 896171 906204 915065 923003 930212 936712 942625 948251 953782
52283 953782 959051 963590 966981 969222 970822 972414 974159 975595 976134 975624 974446 973245 972633 973004 974286
52268 974286 975747 976186 974652 971247 967241 964187 962913 963370 965309 968688 973522 979790 987669 997406 1008702
52253 1008702 1020627 1032389 1043794 1054666 1064380 1072522 1079621 1086622 1093888 1101272 1108908 1117189 1126047
$$ packed form
52349D09662J624J526J043P99R24J205J507J700J616J462J805K776L835M540N014
52334D41038N347N263M829M791N623O796P546P795P812P569P072O694O546O056
52320E30777M891L854M014N382P093Q581R805J0664J1057J1339J1958J2783J3381
52307F45579J3793J4410J5255J6075J6977J8242J9564K0147J9601J8213J6395
52296H34251J4455J2842J1960J1598J1065J0033Q861P938P209O500N913N626N531
52283I53782N269M539L391K241J600J592J745J436N39n10j178j201o12L71J282
52268I74286J461M39j534l405m006l054j274M57J939L379M834O268P879R737J1296
52253A008702J1925J1762J1405J0872R714Q142P099P001P266P384P636Q281Q858
$$ plain form
52240 1126047 1134883 1143216 1150848 1157456 1162667 1166627 1169946 1172953 1175401 1176978 1177650 1177481 1176515 1174915 1172814
52225 1172814 1170034 1166342 1161967 1157469 1153072 1148548 1143701 1138518 1132931 1126947 1121002 1115663 1111015 1106879
52211 1106879 1103511 1101453 1100688 1100663 1101161 1102361 1103937 1105021 1105455 1106279 1108543 1112375 1117673 1124893 1134270
52196 1134270 1144679 1154210 1161773 1167575 1172123 1175396 1177074 1177116 1175908 1174044 1171965 1169671 1166826 1163229
52182 1163229 1159185 1155341 1152265 1150147 1148692 1147227 1145179 1142533 1139636 1136588 1133174 1129411 1125729 1122451
52168 1122451 1119508 1116854 1114734 1113294 1112362 1111943 1112478 1114069 1115720 1115998 1114487 1112159 1110218 1108956 1107891
52153 1107891 1106747 1105987 1106405 1108445 1112001 1116705 1122155 1127774 1132802 1136663 1139289 1140875 1141525 1141329 1140551
52138 1140551 1139391 1137748 1135646 1133816 1133346 1134698 1137479 1141188 1145733 1151208 1157697 1165450 1174793 1185589
$$ packed form
52240A126047Q836Q333P632O608N211L960L319L007K448J577O72j69r66j600k101
52225A172814k780l692m375m498m397m524m847n183n587n984n945n339m648m136
52211A106879l368k058p65k5M98J200J576J084M34Q24K264L832N298P220R377
52196A134270J0409R531P563N802M548L273J678M2j208j864k079k294k845l597
52182A163229m044l844l076k118j455j465k048k646k897l048l414l763l682l278
52168A122451k943k654k120j440r32m19N35J591J651K78j511k328j941j262j065
52153A107891j144p60M18K040L556M704N450N619N028L861K626J586O50j96p78
52138A140551j160j643k102j830m70J352K781L709M545N475O489P753R343J0796
$$ plain form
52124 1185589 1197125 1208654 1219750 1230042 1239073 1246699 1253313 1259387 1265055 1270337 1275471 1280796 1286533
52111 1286533 1292949 1300560 1309957 1321483 1335153 1350749 1367964 1386589 1406498 1427301 1448091 1467772
52099 1467772 1485441 1500238 1511263 1518393 1523008 1527063 1531311 1535080 1537886 1540417 1543634 1547668 1552063
52086 1552063 1556419 1560284 1563019 1564413 1565020 1565244 1564385 1561223 1555375 1547603 1538941 1529989 1520859 1511335 1501128
52071 1501128 1490411 1480150 1471603 1465456 1461566 1459398 1458538 1458926 1460865 1464738 1470562 1477853 1486003 1494571
52057 1494571 1503182 1511427 1519078 1526231 1533016 1539282 1544660 1548902 1552193 1555301 1559245 1564433 1570173 1575473
52043 1575473 1580235 1585234 1590962 1597023 1602716 1607546 1611068 1612916 1613238 1612573 1611077 1608453 1604728 1600333
52029 1600333 1595190 1588550 1580171 1570956 1561988 1553716 1546555 1541359 1538467 1536981 1535845 1535072 1535127 1535721 1536277
$$ packed form
52124A185589J1536J1529J1096J0292R031P626O614O074N668N282N134N325N737
52111A286533O416P611R397J1526J3670J5596J7215J8625J9909K0803K0790J9681
52099A467772J7669J4797J1025P130M615M055M248L769K806K531L217M034M395
52086A552063M356L865K735J394O07K24q59l162n848p772q662q952r130r524j0207
52071A501128j0717j0261q547o147l890k168q60L88J939L873N824P291Q150Q568
52057A494571Q611Q245P651P153O785O266N378M242L291L108L944N188N740N300
52043A575473M762M999N728O061N693M830L522J848L22o65j496k624l725m395
52029A600333n143o640q379r215q968q272p161n196k892j486j136p73N5N94N56
$$ plain form
52014 1536277 1537132 1539099 1541845 1543607 1542492 1537369 1527723 1513643 1496085 1476427 1455618 1434230 1413139
52001 1413139 1393381 1375288 1358367 1341973 1325432 1307575 1287041 1263339 1237110 1209208 1180102
51990 1180102 1150253 1120529 1091956 1065353 1041120 1018848 997120 974398 950333 925891 902222
51979 902222 879909 859360 841245 826231 814620 806441 801516 799313 799077 800256 802543 805533 808724
51966 808724 811789 814308 815213 813079 807193 797986 786391 773305 759821 747327 736854 728513 721821
51953 721821 716426 712419 710234 710363 712993 717923 725031 734629 746903 761172 776293 791787 807889
51940 807889 824347 839957 853626 865212 874842 882074 886534 889029 891234 894244 897967 901926 906153
51927 906153 911086 916961 923519 930065 935509 938305 936565 928561 913536 892356 867373 841480 817030
$$ packed form
52014A536277Q55J967K746J762j115n123r646j4080j7558j9658k0809k1388k1091
52001A413139j9758j8093j6921j6394j6541j7857k0534k3702k6229k7902k9106
51990A180102k9849k9724k8573k6603k4233k2272k1728k2722k4065k4442k3669
51979I02222k2313k0549j8115j5014j1611q179m925k203k36J179K287K990L191
51966H08724L065K519R05k134n886r207j1595j3086j3484j2494j0473q341o692
51953G21821n395m007k185J29K630M930P108R598J2274J4269J5121J5494J6102
51940H07889J6458J5610J3669J1586R630P232M460K495K205L010L723L959M227
51927I06153M933N875O558O546N444K796j740q004j5025k1180k4983k5893k4450
$$ plain form
51914 817030 795440 777527 763909 754833 749647 746755 744579 742591 741093 739892 737567 732366 723567
51901 723567 711679 697650 682318 666438 650645 635209 620128 605511 591667 578971 567943
51890 567943 559315 553596 550633 549992 551718 556194 563328 572447 583196 595988 611197 628244 645820
51877 645820 662742 678135 690869 699309 702066 699100 691947 682688 672775 663025 654390 647914 643649
51864 643649 640399 637149 634239 632437 631318 629548 626579 623147 620104 617666 615814 614380 612401 608304
51850 608304 601358 592414 582851 573382 564220 555709 548159 541532 535836 531498 528904 527921 528273 529969 532884
51835 532884 536351 539703 542960 546445 549947 552761 554428 555027 554994 554980 555633 557008 558381 559132 559687 561153
51819 561153 564116 568144 572260 575368 576387 574605 570132 563758 556339 548577 541251 535178 530773 527862
$$ packed form
51914H17030k1590j7913j3618r076n186k892k176j988j498j201k325n201q799
51901G23567j1888j4029j5332j5880j5793j5436j5081j4617j3844j2696j1028
51890E67943q628n719k963o41J726M476P134R119J0749J2792J5209J7047J7576
51877F45820J6922J5393J2734Q440K757k966p153r259r913r750q635o476m265
51864F43649l250l250k910j802j119j770k969l432l043k438j852j434j979m097
51850F08304o946q944r563r469r162q511p550o627n696m338k594r83L52J696K915
51835E32884L467L352L257L485L502K814J667N99l3j4O53J375J373P51N55J466
51819E61153K963M028M116L108J019j782m473o374p419p762p326o073m405k911
$$ plain form
51805 527862 526029 525021 524845 525631 527385 529752 532178 534364 536353 538079 539246 539946 540991 543110 546025
51790 546025 548688 550247 550326 548739 545621 541760 538159 535230 532926 531593 531972 534327 538282 543799 551541
51775 551541 561895 574200 587381 600795 613880 625461 634081 638883 639686 636496 629570 619923 609043
51762 609043 597942 586903 576221 566615 558609 551872 545552 539173 532981 527548 523212 519846 517063
51749 517063 514716 513244 513324 515098 517934 521118 524536 528412 532568 536417 539704 542874 546501 550687 555307
51734 555307 560601 567002 574304 581286 586431 588957 589156 587978 586635 586520 589032 594979 603924 614099
51720 614099 623000 628265 628516 623981 616532 608861 603176 600397 600336 602215 604862 606773 606741 604849 602757
51705 602757 602657 605615 610597 614982 616238 613621 608569 603490 600090 598775 599340 601764 606134 611956 617722
$$ packed form
51805E27862j833j008j76P86J754K367K426K186J989J726J167P00J045K119K915
51790E46025K663J559P9j587l118l861l601k929k304j333L79K355L955N517P742
51775E51541J0354J2305J3181J3414J3085J1581Q620M802Q03l190o926r647j0880
51762F09043j1101j1039j0682r606q006o737o320o379o192n433m336l366k783
51749E17063k347j472Q0J774K836L184L418L876M156L849L287L170L627M186M620
51734E55307N294O401P302O982N145K526J99j178j343j15K512N947Q945J0175
51720F14099Q901N265K51m535p449p671n685k779o1J879K647J911l2j892k092
51705F02757j00K958M982M385J256k617n052n079l400j315N65K424M370N822N766
$$ plain form
51690 617722 621295 620927 616266 608532 599635 591115 583859 578436 575050 573048 571039 567904 563554 558588
51676 558588 553538 548732 544557 541424 539573 539214 540712 544386 550291 558637 570277 586290 606785 630233
51662 630233 654044 675689 693365 705823 711949 710911 703081 690717 677148 664901 654679 646203
51650 646203 639468 634791 632008 630225 628268 624979 619311 610764 599854 587833 575890 564766 554852
51637 554852 546182 538459 531560 525908 521922 519308 517470 516455 516758 518170 519662 520674 521739 523362
51623 523362 524839 524787 522570 518767 514473 510517 507159 504144 501076 497925 495063 492693 490511 488112 485443
51608 485443 482696 480034 477749 476439 476611 478139 480385 482896 485902 490252 496943 506577 519059 533798
51594 533798 550063 566818 582195 593653 599225 598713 593621 586091 577999 570731 565321 562530 562821 566277
$$ packed form
51690F17722L573l68m661p734q897q520p256n423l386k002k009l135m350m966
51676E58588n050m806m175l133j851l59J498L674N905Q346J1640J6013K0495K3448
51662F30233K3811K1645J7676J2458O126j038p830j2364j3569j2247j0222q476
51650F46203o735m677k783j783j957l289n668q547j0910j2021j1943j1124r914
51637E54852q670p723o899n652l986k614j838j015L03J412J492J012J065J623
51623E23362J477n2k217l803m294l956l358l015l068l151k862k370k182k399k669
51608D85443k747k662k285j310J72J528K246K511L006M350O691R634J2482J4739
51594E33798J6265J6755J5377J1458N572n12n092p530q092p268n410k791K91L456
$$ plain form
51580 566277 572722 582131 594971 611861 632700 656238 680643 704584 728028 752309 779253 809583
51568 809583 841812 872954 900727 925224 948692 974065 1003735 1039050 1080275 1126750 1177014
51557 1177014 1228486 1277013 1317273 1344403 1355792 1351652 1334121 1305720 1268265 1222917 1171192
51546 1171192 1115583 1058786 1002437 947194 894050 844857 801193 763274 730478 702546 679731
51535 679731 662061 649006 639760 633419 629033 625916 623951 623232 623361 623334 622070 618958 614059 608009 601610
51520 601610 595251 588805 582245 576137 571233 567715 565109 562790 560292 557238 553411 548963 544382 540168
51506 540168 536536 533331 530129 526641 523153 520322 518398 516928 515485 514292 513728 513422 512456 510481 508201
51491 508201 506649 506224 506498 506715 506368 505431 504102 502354 499954 496974 493995 491572 489728 488229 487073
$$ packed form
51580E66277O445R409J2840J6890K0839K3538K4405K3941K3444K4281K6944L0330
51568H09583L2229L1142K7773K4497K3468K5373K9670L5315M1225M6475N0264
51557A177014N1472M8527M0260K7130J1389m140j7531k8401l7455m5348n1725
51546A171192n5609n6797n6349n5243n3144m9193m3664l7919l2796k7932k2815
51535F79731j7670j3055r246o341m386l117j965p19J29k7j264l112m899o050o399
51520F01610o359o446o560o108m904l518k606k319k498l054l827m448m581m214
51506E40168l632l205l202l488l488k831j924j470j443j193n64l06r66j975k280
51491E08201j552m25K74K17l47r37j329j748k400k980k979k423j844j499j156
$$ plain form
51476 487073 486362 485934 485587 485507 485978 486698 486883 486161 484933 483763 482734 481552 479982 478017 475887 474006
51460 474006 472710 471901 471131 470100 468905 467798 467000 466941 468316 471601 476593 482690 489702 498206 509091
51445 509091 522855 539313 557682 576533 593676 606650 613960 616076 615193 614008 614751 618757 625898
51432 625898 633993 639410 639140 632595 621449 608101 594479 581763 570422 560363 551476 544156 539034
51419 539034 536130 534591 533402 532151 530999 530128 529454 528830 528328 528092 527942 527350 526078 524655 523909 524062
51403 524062 524746 525911 528156 531927 536939 542798 549692 557997 567583 578074 589548 602376 616616
51390 616616 632209 649670 669969 693727 721139 752743 789692 833089 883444 940744 1004420
51379 1004420 1073080 1144850 1218312 1292633 1366246 1435500 1494828 1538406 1562052 1564389 1546760
$$ packed form
51476D87073p11m28l47q0M71P20J85p22j228j170j029j182j570j965k130j881
51460D74006j296q09p70j031j195j107p98n9J375L285M992O097P012Q504J0885
51445E09091J3764J6458J8369J8851J7143J2974P310K116q83j185P43M006P141
51432F25898Q095N417k70o545j1146j3348j3622j2716j1341j0059q887p320n122
51419E39034k904j539j189j251j152q71o74o24n02k36j50n92j272j423p46J53
51403E24062O84J165K245L771N012N859O894Q305R586J0491J1474J2828J4240
51390F16616J5593J7461K0299K3758K7412L1604L6949M3397N0355N7300O3676
51379A004420O8660P1770P3462P4321P3613O9254N9328M3578K3646K337j7629
$$ plain form
51368 1546760 1511972 1462934 1402459 1333946 1261340 1187946 1115603 1045286 978118 915347 857726
51357 857726 805574 759374 719724 686514 658658 634945 614894 598414 584779 572448 560098
51346 560098 547634 535923 525714 517060 509658 503274 497767 493066 489344 486842 485259 483661 481373
51333 481373 478731 476586 475335 474887 475311 476796 478930 480796 482088 483647 486480 490582 495011 498867 501807
51318 501807 503804 504896 505202 504890 504017 502599 500897 499415 498389 497412 495859 493776 492086 491616 492041 492136
51302 492136 490990 488597 485241 480899 475571 469764 464231 459437 455648 453126 451787 450954 450120 449773 450846
51287 450846 453386 456491 459651 463508 468985 476226 484702 493926 503607 513299 522226 529425 534114 536178
51273 536178 536398 535850 535027 533850 532593 532221 533499 536175 539460 543005 546899 550841 553812 554781 553596
$$ packed form
51368A546760l4788m9038o0475o8513p2606p3394p2343p0317o7168o2771n7621
51357H57726n2152m6200l9650l3210k7856k3713k0051j6480j3635j2331j2350
51346E60098j2464j1711j0209q654p402o384n507m701l722k502j583j598k288
51333D81373k642k145j251m48M24J485K134J866J292J559K833M102M429L856K940
51318E01807J997J092L06l12q73j418j702j482j026r77j553k083j690m70M25R5
51302D92136j146k393l356m342n328n807n533m794l789k522j339q33q34l47J073
51287D50846K540L105L160L857N477P241Q476R224R681R692Q927P199M689K064
51273E36178K20n48q23j177j257l72J278K676L285L545L894L942K971R69j185
$$ plain form
51258 553596 551127 548555 546420 544266 541265 537175 532444 527393 521710 515025 507706 500677 494525 489189
51244 489189 484553 480969 478921 478310 478308 478021 477212 476324 475873 475979 476504 477405 478776 480614 482766 485064 487397
51227 487397 489643 491658 493334 494613 495609 496762 498652 501396 504390 506876 508660 509977 510866 511027 510303
51212 510303 508978 507647 507053 507860 510086 512796 514861 516162 517608 519939 522934 525952 528681 531080 532981
51197 532981 534176 534680 534676 534405 534249 534632 535540 536399 536715 536689 536974 537996 539721 541886 544098 545838 546657 546424
51179 546424 545276 543367 540790 537659 534160 530572 527285 524647 522742 521478 520939 521448 523165 525790 528840
51164 528840 532112 535730 539766 543858 547147 548661 547995 545684 542763 539920 537187 534302 531011 527060
51150 527060 522343 517271 512648 508977 506103 503707 501775 500380 499350 498486 497935 497970 498474 498977 499216 499480
$$ packed form
51258E53596k469k572k135k154l001m090m731n051n683o685p319p029o152n336
51244D89189m636l584k048o11kk87q09q88m51J06N25R01J371J838K152K298K333
51227D87397K246K015J676J279R96J153J890K744K994K486J784J317Q89J61p24
51212E10303j325j331n94Q07K226K710K065J301J446K331K995L018K729K399J901
51197E32981J195N04mk71j56L83R08Q59L16k6K85J022J725K165K212J740Q19k33
51179E46424j148j909k577l131l499l588l287k638j905j264n39N09J717K625L050
51164E28840L272L618M036M092L289J514o66k311k921k843k733k885l291l951
51150E27060m717n072m623l671k874k396j932j395j030q64n51L5N04N03K39K64
$$ plain form
51134 499480 500359 502212 504820 507497 509721 511752 514488 518544 523603 528787 533475 537550 541036 543865
51120 543865 546044 547756 549073 549749 549526 548662 547896 547744 547983 548101 548111 548475 549169 549378 548471 546853 545448
51103 545448 544644 544292 544437 545365 546935 548479 549436 549655 549074 547676 545832 544104 542573 540895 539190 538319
51087 538319 538937 540679 542514 543643 543916 543764 543901 544751 546021 547143 548094 549298 550743 551921 552830 554262
51071 554262 556703 559616 562313 565005 568484 573224 579333 586984 596334 607332 620040 634860 652051
51058 652051 671466 693130 717361 743416 768348 788257 801042 807687 811081 814154 818935 826284
51046 826284 835673 845225 852492 855793 855264 852469 848543 842686 833127 819763 805229 793105 785667 783491
51032 783491 785844 790318 792929 790318 782171 770803 758536 746342 734689 724273 715489 708164 702355
$$ packed form
51134D99480Q79J853K608K677K224K031K736M056N059N184M688M075L486K829
51120E43865K179J712J317O76k23q64p66j52K39J18J0L64O94K09r07j618j405
51103E45448q04l52J45R28J570J544R57K19n81j398j844j728j531j678j705q71
51087E38319O18J742J835J129K73j52J37Q50J270J122R51J204J445J178R09J432
51071E54262K441K913K697K692L479M740O109P651R350J0998J2708J4820J7191
51058F52051J9415K1664K4231K6055K4932J9909J2785O645L394L073M781P349
51046H26284R389R552P267L301n29k795l926n857r559j3364j4534j2124p438k176
51032G83491K353M474K611k611q147j1368j2267j2194j1653j0416q784p325n809
$$ plain form
51019 702355 698763 697931 699600 703267 708904 716726 726681 738542 752191 767434 783773 800596 817357
51006 817357 833342 847597 859411 868684 875586 880023 881680 880486 876821 871286 864346 856125 846547
50993 846547 835772 824544 813919 804658 796971 790873 786615 784679 785395 788625 793898 800984 810299 822528
50979 822528 837827 855647 875333 896380 917963 938875 958587 978078 999123 1022965 1050097
50968 1050097 1080888 1115657 1154202 1196022 1241077 1289735 1341876 1396570 1452728 1509545 1566185
50957 1566185 1621523 1674421 1723918 1769103 1809175 1843805 1873165 1897601 1917527 1933504 1946000
50946 1946000 1955186 1961536 1966548 1972286 1980014 1989561 1999666 2008193 2012314 2009905 2001433 1989736 1977256
50933 1977256 1963915 1948025 1928538 1905656 1879773 1850766 1818283 1782044 1741786 1697388 1649217
$$ packed form
51019G02355l592q32J669L667N637P822R955J1861J3649J5243J6339J6823J6761
51006H17357J5985J4255J1814R273O902M437J657j194l665n535o940q221r578
50993H46547j0775j1228j0625r261p687o098m258j936P16L230N273P086R315J2229
50979H22528J5299J7820J9686K1047K1583K0912J9712J9491K1045K3842K7132
50968A050097L0791L4769L8545M1820M5055M8658N2141N4694N6158N6817N6640
50957A566185N5338N2898M9497M5185M0072L4630K9360K4436J9926J5977J2496
50946A946000R186O350N012N738P728R547J0105Q527M121k409q472j1697j2480
50933A977256j3341j5890j9487k2882k5883k9007l2483l6239m0258m4398m8171
$$ plain form
50922 1649217 1598170 1545352 1491903 1438986 1387664 1338694 1292517 1249347 1209251 1172270 1138517
50911 1138517 1107977 1080184 1054379 1030109 1007552 987236 969640 954959 942820 932199 922050
50900 922050 912219 903386 895999 889707 884019 879029 875180 872651 871203 870333 869394 868033 866748 866581 867961
50885 867961 870304 873058 876566 881413 887415 893923 900815 908560 917452 927333 937852 948472 958456 967505
50871 967505 976396 986486 998567 1012607 1028359 1045679 1064400 1084619 1107101 1132754 1161665 1193355
50859 1193355 1228075 1267077 1311265 1360270 1413361 1470867 1534150 1604472 1682341 1767749 1860528
50848 1860528 1960424 2067042 2179750 2297601 2419526 2544660 2672163 2800470 2926953 3048370
50838 3048370 3161390 3262589 3348656 3417363 3468309 3502338 3520453 3523766 3514294 3494995 3468862
$$ packed form
50922A649217n1047n2818n3449n2917n1322m8970m6177m3170m0096l6981l3753
50911A138517l0540k7793k5805k4270k2557k0316j7596j4681j2139j0621j0149
50900I22050r831q833p387o292n688m990l849k529j448q70r39j361j285j67J380
50885H67961K343K754L508M847O002O508O892P745Q892R881J0519J0620R984R049
50871I67505Q891J0090J2081J4040J5752J7320J8721K0219K2482K5653K8911L1690
50859A193355L4720L9002M4188M9005N3091N7506O3283P0322P7869Q5408R2779
50848A860528R9896J06618J12708J17851J21925J25134J27503J28307J26483J21417
50838C048370J13020J01199Q6067O8707N0946L4029J8115L313r472j9299k6133
$$ plain form
50827 3468862 3438519 3406816 3377133 3352472 3334492 3323737 3320412 3324352 3334153 3346729 3357795 3362736
50815 3362736 3357404 3338862 3305817 3258258 3196558 3120987 3032037 2930935 2819733 2701081 2577998
50804 2577998 2453628 2330957 2212643 2101032 1998049 1904901 1821953 1749059 1686064 1632941
50794 1632941 1589535 1555259 1529091 1509899 1496786 1489121 1486263 1487441 1491899 1498867 1507166 1515158 1521539
50781 1521539 1526052 1529014 1530215 1528841 1524493 1517688 1509094 1498858 1487001 1473901 1459808 1444209 1426278
50768 1426278 1405800 1383227 1358956 1333069 1305732 1277487 1249129 1221600 1195888 1172618 1151749
50757 1151749 1133014 1116672 1103449 1093676 1086791 1081837 1078326 1076613 1077561 1081839 1089407 1099726 1112490
50744 1112490 1127972 1146632 1168731 1194500 1224250 1257973 1295252 1335982 1380774 1430059 1483166
$$ packed form
50827C468862l0343l1703k9683k4661j7980j0755l325L940R801J2576J1066M941
50815C362736n332j8542l3045m7559o1700p5571q8950j01102j11202j18652j23083
50804B577998j24370j22671j18314j11611j02983r3148q2948p2894o2995n3123
50794A632941m3406l4276k6168j9192j3113p665k858J178M458O968Q299P992O381
50781A521539M513K962J201j374m348o805q594j0236j1857j3100j4093j5599j7931
50768A426278k0478k2573k4271k5887k7337k8245k8358k7529k5712k3270k0869
50757A151749j8735j6342j3223r773o885m954l511j713R48M278P568J0319J2764
50744A112490J5482J8660K2099K5769K9750L3723L7279M0730M4792M9285N3107
$$ plain form
50733 1483166 1538977 1597198 1658142 1721431 1785882 1850684 1915726 1980527 2043868 2104987 2164244
50722 2164244 2221755 2275802 2323247 2361213 2387781 2401553 2401634 2388457 2364231 2332196 2295485 2256692
50710 2256692 2218326 2183306 2154616 2134139 2121927 2116800 2117589 2123529 2133634 2146231 2159158 2169987
50698 2169987 2175949 2174210 2162566 2139723 2105052 2058788 2002717 1939989 1873789 1806448 1739993 1676770
50686 1676770 1618833 1567114 1521790 1483205 1451778 1427278 1408993 1396718 1391059 1392677 1401655 1417679
50674 1417679 1440416 1469531 1504631 1545275 1590746 1639622 1689777 1738901 1785022 1826653 1862878
50663 1862878 1893555 1919318 1941131 1959709 1975313 1988020 1998073 2005886 2011654 2015060 2015509 2012687
50651 2012687 2006824 1998554 1988801 1978795 1969932 1963392 1960020 1960538 1965597 1975460 1989855 2008355 2030730
$$ packed form
50733A483166N5811N8221O0944O3289O4451O4802O5042O4801O3341O1119N9257
50722B164244N7511N4047M7445L7966K6568J3772Q1j3177k4226l2035l6711l8793
50710B256692l8366l5020k8690k0477j2212n127P89N940J0105J2597J2927J0829
50698B169987N962j739j1644k2843l4671m6264n6071o2728o6200o7341o6455o3223
50686A676770n7937n1719m5324l8585l1427k4500j8285j2275n659J618Q978J6024
50674A417679K2737K9115L5100M0644M5471M8876N0155M9124M6121M1631L6225
50663A862878L0677K5763K1813J8578J5604J2707J0053P813N768L406M49k822
50651B012687n863q270r753j0006q863o540l372N18N059R863J4395J8500K2375
$$ plain form
50638 2030730 2056689 2085303 2114941 2143931 2171323 2197087 2221576 2244784 2266264 2285847 2304296
50627 2304296 2323136 2343858 2367039 2391228 2411697 2420693 2410706 2379067 2329879 2271499 2212118 2157175
50615 2157175 2109486 2070399 2040424 2019227 2005559 1997702 1994324 1994955 1999353 2006436 2014093 2019923 2021745
50602 2021745 2017487 2005367 1984638 1955788 1919781 1877496 1830073 1779206 1726615 1673536 1621035
50591 1621035 1570374 1522576 1477920 1436174 1397038 1360012 1324324 1289570 1256262 1225259 1196820
50580 1196820 1170616 1146459 1124600 1105461 1089509 1077258 1068945 1064222 1062476 1063385 1066921 1072945 1081127
50567 1081127 1091120 1102595 1115215 1128847 1143726 1160222 1178556 1198795 1220934 1244948 1271090
50556 1271090 1300056 1332331 1367350 1404058 1442464 1483685 1527952 1573466 1617932 1660382 1700626
$$ packed form
50638B030730K5959K8614K9638K8990K7392K5764K4489K3208K1480J9583J8449
50627B304296J8840K0722K3181K4189K0469Q996r987l1639m9188n8380n9381n4943
50615B157175m7689l9087k9975k1197j3668p857l378O31M398P083P657N830J822
50602B021745m258j2120k0729k8850l6007m2285m7423n0867n2591n3079n2501
50591A621035n0661m7798m4656m1746l9136l7026l5688l4754l3308l1003k8439
50580A196820k6204k4157k1859j9139j5952j2251q313m723j746R09L536O024Q182
50567A081127R993J1475J2620J3632J4879J6496J8334K0239K2139K4014K6142
50556A271090K8966L2275L5019L6708L8406M1221M4267M5514M4466M2450M0244
$$ plain form
50545 1700626 1737883 1771460 1802432 1833175 1865199 1898631 1933851 1972219 2014678 2060608 2108592
50534 2108592 2157503 2206474 2254867 2303146 2353269 2407485 2466991 2532102 2603164 2680516 2763741
50523 2763741 2851500 2942068 3033668 3124424 3212377 3295516 3371526 3437594 3490885 3529352 3552015
50512 3552015 3558532 3548709 3522479 3480230 3422931 3351918 3268791 3175799 3076311 2974501 2874318
50501 2874318 2778918 2691136 2613970 2550101 2501098 2467543 2449770 2447974 2461589 2488886 2527244
50490 2527244 2573586 2624584 2676490 2724518 2762439 2783644 2783546 2760954 2716922 2653013 2571490 2476492
50478 2476492 2373398 2266641 2158914 2052493 1950131 1854206 1765907 1685792 1614354 1551454
50468 1551454 1495855 1446021 1401015 1360168 1322444 1286842 1253163 1221813 1193090 1167121 1144237
$$ packed form
50545A700626L7257L3577L0972L0743L2024L3432L5220L8368M2459M5930M7984
50534B108592M8911M8971M8393M8279N0123N4216N9506O5111P1062P7352Q3225
50523B763741Q7759R0568R1600R0756Q7953Q3139P6010O6068N3291L8467K2663
50512C552015O517r823k6230m2249n7299p1013q3127r2992r9488j01810j00183
50501B874318r5400q7782p7166o3869m9003l3555j7773j796J3615K7297L8358
50490B527244M6342N0998N1906M8028L7921K1205r8k2592m4032o3909q1523r4998
50478B476492j03094j06757j07727j06421j02362r5925q8299q0115p1438o2900
50468A551454n5599m9834m5006m0847l7724l5602l3679l1350k8723k5969k2884
$$ plain form
50457 1144237 1124841 1108947 1096169 1086103 1078495 1073266 1070573 1070594 1073041 1077208 1082778 1090216 1100073
50444 1100073 1112352 1126937 1144125 1163968 1185188 1205406 1222543 1235777 1245373 1252213 1257552 1262609
50432 1262609 1267971 1273470 1278666 1283384 1287911 1292974 1299474 1307930 1318083 1329244 1341030 1353657 1367609
50419 1367609 1383323 1401245 1421943 1446017 1473949 1506066 1542493 1583070 1627371 1674875 1725136
50408 1725136 1777734 1832028 1886997 1941501 1994762 2046514 2096379 2143189 2185110 2220468 2248232
50397 2248232 2267739 2278307 2279200 2269688 2248993 2216526 2172542 2118578 2057184 1991325 1923926 1857570
50385 1857570 1794299 1735696 1683164 1637880 1600421 1570764 1548859 1534944 1529183 1531236 1540324 1555365
50373 1555365 1574771 1596368 1617817 1636889 1651167 1657966 1655239 1642558 1620871 1591526 1555952 1516100
$$ packed form
50457A144237j9396j5894j2778j0066p608n229k693K1K447M167N570P438R857
50444A100073J2279J4585J7188J9843K1220K0218J7137J3234R596O840N339N057
50432A262609N362N499N196M718M527N063O500Q456J0153J1161J1786J2627J3952
50419A367609J5714J7922K0698K4074K7932L2117L6427M0577M4301M7504N0261
50408A725136N2598N4294N4969N4504N3261N1752M9865M6810M1921L5358K7764
50397B248232J9507J0568Q93r512k0695l2467m3984n3964o1394o5859o7399o6356
50385A857570o3271n8603n2532m5284l7459k9657k1905j3915n761K053R088J5041
50373A555365J9406K1597K1449J9072J4278O799k727j2681k1687k9345l5574l9852
$$ plain form
50361 1516100 1474341 1432558 1391704 1352437 1315693 1282201 1251755 1223538 1197177 1173097 1151891
50350 1151891 1133832 1119243 1108915 1103584 1102789 1104344 1104894 1100963 1089947 1070949 1045185 1015450 984798
50337 984798 955520 929022 906113 887013 871343 858590 848591 841426 836945 834661 834000 834411 835415
50324 835415 836888 839242 842956 847894 853370 858872 864540 870950 878663 887898 898408 909744 921752
50311 921752 934598 948149 961812 975510 990418 1007948 1028167 1049977 1072737 1096825 1122544
50300 1122544 1149502 1177560 1207584 1240539 1275945 1311119 1341088 1359263 1359982 1342235 1311046 1274363
50288 1274363 1238338 1205508 1176384 1151241 1130244 1113055 1099081 1087884 1079134 1072603 1068388 1066849
50276 1066849 1068035 1071406 1076316 1082613 1090560 1100335 1111806 1124839 1139598 1156315 1174709 1193888
$$ packed form
50361A516100m1759m1783m0854l9267l6744l3492l0446k8217k6361k4080k1206
50350A151891j8059j4589j0328n331p95J555N50l931j1016j8998k5764k9735l0652
50337I84798k9278k6498k2909j9100j5670j2753r999p165m481k284o61M11J004
50324H35415J473K354L714M938N476N502N668O410P713R235J0510J1336J2008
50311I21752J2846J3551J3663J3698J4908J7530K0219K1810K2760K4088K5719
50300A122544K6958K8058L0024L2955L5406L5174K9969J8175P19j7747l1189l6683
50288A274363l6025l2830k9124k5143k0997j7189j3974j1197q750o531m215j539
50276A066849J186L371M910O297P947R775J1471J3033J4759J6717J8394J9179
$$ plain form
50264 1193888 1213112 1232626 1253519 1276826 1303142 1333051 1367377 1406639 1450532 1498096 1548062
50253 1548062 1598889 1648941 1697010 1742357 1783958 1820308 1850667 1876248 1899465 1922019 1944174
50242 1944174 1965630 1986034 2004174 2017263 2021772 2015052 1996122 1965338 1923968 1874239 1819363 1762945
50230 1762945 1708092 1657015 1611385 1572713 1541953 1518555 1499974 1482247 1461310 1434422 1401190
50219 1401190 1363594 1324852 1287876 1254438 1225184 1199744 1176901 1155400 1134987 1116311 1099628
50208 1099628 1084130 1068897 1053992 1040022 1026969 1014109 1000934 987568 974266 961043 947946
50197 947946 935316 923595 913044 903687 895410 888120 881905 876943 873099 869830 866788 864364 863300
50184 863300 863828 865540 868036 871310 875360 879802 884177 888583 893765 900417 908462 917112 925670 934049
$$ packed form
50264A193888J9224J9514K0893K3307K6316K9909L4326L9262M3893M7564M9966
50253A548062N0827N0052M8069M5347M1601L6350L0359K5581K3217K2554K2155
50242A944174K1456K0404J8140J3089M509o720j8930l0784m1370m9729n4876n6418
50230A762945n4853n1077m5630l8672l0760k3398j8581j7727k0937k6888l3232
50219A401190l7596l8742l6976l3438k9254k5440k2843k1501k0413j8676j6683
50208A099628j5498j5233j4905j3970j3053j2860j3175j3366j3302j3223j3097
50197I47946j2630j1721j0551r357q277p290o215m962l844l269l042k424j064
50184H63300N28J712K496L274M050M442M375M406N182O652Q045Q650Q558Q379
$$ plain form
50170 934049 942367 950401 957906 965361 973651 982858 991892 999609 1005790 1010732 1014568 1017672 1021339 1027130
50156 1027130 1035484 1045528 1056363 1068068 1081364 1096748 1114165 1133216 1153441 1174543 1196599
50145 1196599 1220167 1246275 1276258 1311393 1352586 1400491 1455981 1520218 1593999 1677020 1767691
50134 1767691 1863412 1961013 2057388 2150210 2238205 2321114 2399798 2476157 2551909 2626756 2697797
50123 2697797 2760675 2810643 2842598 2851528 2834467 2792047 2727662 2645335 2548870 2442385 2330370
50112 2330370 2216842 2104856 1996834 1894870 1800663 1715463 1639928 1573708 1515376 1463255
50102 1463255 1416116 1372857 1332060 1292653 1254820 1219577 1187656 1159334 1134920 1114544 1097538
50091 1097538 1082836 1069872 1058383 1047577 1036477 1025032 1013877 1002949 991393 979050 966949
$$ packed form
50170I34049Q318Q034P505P455Q290R207R034P717O181M942L836L104L667N791
50156A027130Q354J0044J0835J1705J3296J5384J7417J9051K0225K1102K2056
50145A196599K3568K6108K9983L5135M1193M7905N5490O4237P3781Q3021R0671
50134A767691R5721R7601R6375R2822Q7995Q2909P8684P6359P5752P4847P1041
50123B697797O2878M9968L1955Q930j7061m2420o4385q2327r6465j06485j12015
50112B330370j13528j11986j08022j01964r4207q5200p5535o6220n8332n2121
50102A463255m7139m3259m0797l9407l7833l5243l1921k8322k4414k0376j7006
50091A097538j4702j2964j1489j0806j1100j1445j1155j0928j1556j2343j2101
$$ plain form
50080 966949 955958 945902 936557 928620 923019 919830 918510 918669 920096 922531 926008 931040 937979 946465
50066 946465 955856 965800 976009 986021 995661 1005347 1015327 1024945 1033246 1040042 1045828 1050829 1054798 1057758
50052 1057758 1060351 1063169 1066033 1068143 1068881 1068419 1067594 1067270 1067925 1069921 1073823 1080034 1088143 1097171 1106541
50037 1106541 1116420 1127148 1138916 1152192 1167707 1185512 1204551 1223740 1243226 1264114 1287164
50026 1287164 1312323 1339415 1368793 1401278 1437820 1479332 1526511 1579438 1637099 1697222 1756911
50015 1756911 1814036 1868188 1920060 1969922 2017139 2061277 2102964 2143227 2182341 2219783 2254904
50004 2254904 2286828 2313550 2331500 2336273 2324070 2293041 2243942 2179619 2103700 2019557 1930190
49993 1930190 1838391 1746563 1656505 1569687 1487621 1411697 1342800 1281285 1227197 1180296 1139996
$$ packed form
50080I66949j0991j0056r345p937n601l189j320J59J427K435L477N032O939Q486
50066I46465R391R944J0209J0012R640R686R980R618Q301O796N786N001L969K960
50052A057758K593K818K864K110P38m62q25l24O55J996L902O211Q109R028R370
50037A106541R879J0728J1768J3276J5515J7805J9039J9189J9486K0888K3050
50026A287164K5159K7092K9378L2485L6542M1512M7179N2927N7661O0123N9689
50015A756911N7125N4152N1872M9862M7217M4138M1687M0263L9114L7442L5121
50004B254904L1924K6722J7950M773j2203l1029m9099o4323p5919q4143q9367
49993A930190r1799r1828r0058q6818q2066p5924o8897o1515n4088m6901m0300
$$ plain form
49982 1139996 1105579 1076430 1052031 1031829 1015237 1001641 990355 980819 972908 966836 962659 960144
49970 960144 959196 959994 962486 966046 969955 974061 978811 984881 992959 1003575 1016883 1032741 1051007 1071255
49956 1071255 1091966 1110481 1124314 1132444 1135311 1134085 1130299 1125467 1120155 1113426 1103726 1090269 1073251
49943 1073251 1053090 1030269 1005958 982117 960542 941939 925840 911082 896395 880992 864942
49932 864942 848974 833963 820641 809509 800621 793517 787719 783274 780564 779661 780217 781962 784983 789520
49918 789520 795774 803883 813727 824597 835396 845408 854863 864735 876106 889634 905293 922361
49906 922361 939579 955364 968128 976882 981915 984744 987076 989662 992014 992920 990973 984944 974194
49893 974194 958942 940047 918649 896118 873978 853386 834684 817784 802973 790982 782219 776284
$$ packed form
49982A139996l4417k9149k4399k0202j6592j3596j1286r536p911o072m177k515
49970I60144r48P98K492L560L909M106M750O070Q078J0616J3308J5858J8266K0248
49956A071255K0711J8515J3833Q130K867j226l786m832n312o729r700j3457j7018
49943A073251k0161k2821k4311k3841k1575j8603j6099j4758j4687j5403j6050
49932H64942j5968j5011j3322j1132q888p104n798m445k710r03N56J745L021M537
49918G89520O254Q109R844J0870J0799J0012R455R872J1371J3528J5659J7068
49906I22361J7218J5785J2764Q754N033K829K332K586K352R06j947o029j0750
49893I74194j5252j8895k1398k2531k2140k0592j8702j6900j4811j1991q763n935
$$ plain form
49881 776284 772317 769527 767240 764717 761307 756869 751994 747728 744996 744176 745134 747564 751228 756011 762032
$$ packed form
49881G76284l967k790k287k523l410m438m875m266k732q20R58K430L664M783O021
$$ [...]
##END NTUPLES=NMR SPECTRUM
##END=
