##TITLE=AC1727_3474_9208054_ibkSnlMSrY
##JCAMPDX= 6.0         $$ Bruker NMR JCAMP-DX V2.0
##DATA TYPE= NMR SPECTRUM
##DATA CLASS= NTUPLES
##ORIGIN= BRUKER
##OWNER= Administrator
$$ 1.72 TOPSPIN		Version 2.1
$$ 2015-06-01 21:03:15.295 -0700  Administrator@X
$$ Compression mode = diff/dup
##.OBSERVE FREQUENCY= 400.02188249412
##.OBSERVE NUCLEUS= ^1H
##.ACQUISITION MODE= SIMULTANEOUS (DQD)
##.ACQUISITION SCHEME= undefined
##.AVERAGES= 8
##.DIGITISER RES= 22
##SPECTROMETER/DATA SYSTEM= spect
##.PULSE SEQUENCE= zg30
##.SOLVENT NAME= COFFEE_meoh
##.SHIFT REFERENCE= INTERNAL, COFFEE_meoh, 1, 14.98509
##AUDIT TRAIL= $$ (NUMBER, WHEN, WHO, WHERE, PROCESS, VERSION, WHAT)
$$ ##TITLE= Audit trail, TOPSPIN		Version 2.1
$$ ##JCAMPDX= 5.01
$$ ##ORIGIN= Bruker BioSpin GmbH
$$ ##OWNER= Administrator
$$ $$ E:\/data/COFFEE/nmr/AC1727_3474_9208054_ibkSnlMSrY/20/pdata/1/auditp.txt
$$ ##AUDIT TRAIL=  $$ (NUMBER, WHEN, WHO, WHERE, PROCESS, VERSION, WHAT)
(   1,<2015-06-01 21:03:08.061 -0700>,<Administrator>,<X>,<go>,<TOPSPIN 2.1>,
      <created by zg
	started at 2015-06-01 21:02:02.389 -0700,
	POWCHK enabled, PULCHK disabled,
       configuration hash MD5:
       21 0F 79 D6 B3 7B B4 F6 88 20 88 DB 03 48 BD 9F
       data hash MD5: 64K
       67 F6 23 B9 1C 90 05 96 88 49 4F 7F C9 95 4B C5>)
(   2,<2015-06-01 21:03:11.311 -0700>,<Administrator>,<X>,<proc1d>,<TOPSPIN 2.1>,
      <Start of raw data processing
       efp LB = 0 FT_mod = 6 PKNL = 1 PHC0 = 0 PHC1 = 0 SI = 32K 
       data hash MD5: 32K
       FD 84 7E 92 8A 1F BB A0 87 2B FF 70 47 27 5C C5>)
(   3,<2015-06-01 21:03:11.592 -0700>,<Administrator>,<X>,<proc1d>,<TOPSPIN 2.1>,
      <pk PHC0 = 89.69238 PHC1 = 0 
       data hash MD5: 32K
       17 6B 0A 48 05 D7 F0 EF 80 6A 2F 6B 71 B1 27 3D>)
(   4,<2015-06-01 21:03:11.701 -0700>,<Administrator>,<X>,<proc1d>,<TOPSPIN 2.1>,
      <abs ABSG = 1 
       data hash MD5: 32K
       49 77 1D D2 35 25 72 E2 9C FD EB EC CE BD 20 55>)
(   5,<2015-06-01 21:03:11.764 -0700>,<Administrator>,<X>,<proc1d>,<TOPSPIN 2.1>,
      <abs ABSG = 2 
       data hash MD5: 32K
       88 8C DB FA B8 E6 10 1A A9 E1 0C 5C BA 7B 97 DF>)
(   6,<2015-06-01 21:03:11.826 -0700>,<Administrator>,<X>,<proc1d>,<TOPSPIN 2.1>,
      <abs ABSG = 3 
       data hash MD5: 32K
       07 07 E7 B4 23 DA 2E 3B 2F 89 89 54 15 92 62 FF>)
(   7,<2015-06-01 21:03:11.889 -0700>,<Administrator>,<X>,<proc1d>,<TOPSPIN 2.1>,
      <abs ABSG = 4 
       data hash MD5: 32K
       5D F7 AD 49 C2 E5 DF 69 4E 96 86 CF 18 18 7B 42>)
(   8,<2015-06-01 21:03:11.951 -0700>,<Administrator>,<X>,<proc1d>,<TOPSPIN 2.1>,
      <abs ABSG = 5 
       data hash MD5: 32K
       4D 59 C0 2A BC D9 56 5D 0E 5F 9F 69 88 33 2B 5D>)
$$ ##END=
$$ 
$$ $$ hash MD5
$$ $$ AD 69 87 6B 45 8B A5 21 25 32 63 9C DC 09 F2 4A
##$RELAX= 
##$RELAX= 
##$RELAX= 
##$RELAX= 
##$RELAX= 
##$RELAX= 
##$RELAX= 
$$ Bruker specific parameters
$$ --------------------------
##$DU= <E:\>
##$EXPNO= 20
##$NAME= <AC1727_3474_9208054_ibkSnlMSrY>
##$PROCNO= 1
$$ [...]
150 150 150 150 150 150 150 150
##$TP07= 0
##$TPNAME0= <>
##$TPNAME1= <>
##$TPNAME2= <>
##$TPNAME3= <>
##$TPNAME4= <>
##$TPNAME5= <>
##$TPNAME6= <>
##$TPNAME7= <>
##$TPOAL= (0..7)
0.5 0.5 0.5 0.5 0.5 0.5 0.5 0.5
##$TPOFFS= (0..7)
0 0 0 0 0 0 0 0
##$TUNHIN= 0
##$TUNHOUT= 0
##$TUNXOUT= 0
##$USERA1= <user>
##$USERA2= <user>
##$USERA3= <user>
##$USERA4= <user>
##$USERA5= <user>
##$V9= 5
##$VALIST= <valist>
##$VCLIST= <CCCCCCCCCCCCCCC>
##$VD= 0
##$VDLIST= <DDDDDDDDDDDDDDD>
##$VPLIST= <PPPPPPPPPPPPPPP>
##$VTLIST= <TTTTTTTTTTTTTTT>
##$WBST= 2048
##$WBSW= 25
##$XGAIN= (0..3)
0 0 0 0
##$XL= 0
##$YL= 0
##$YMAX_a= 589097
##$YMIN_a= -509325
##$ZGOPTNS= <>
##$ZL1= 120
##$ZL2= 120
##$ZL3= 120
##$ZL4= 120
##$ABSF1= 14.98509
##$ABSF2= -5.573092
##$ABSG= 5
##$ABSL= 3
##$ALPHA= 0
##$AQORDER= 0
##$ASSFAC= 0
##$ASSFACI= 0
##$ASSFACX= 0
##$ASSWID= 0
##$AUNMP= <proc_prof1d_extract_pilot.lims>
##$AXLEFT= 0
##$AXNAME= <>
##$AXNUC= <1H>
##$AXRIGHT= 0
##$AXTYPE= 0
##$AXUNIT= <>
##$AZFE= 0.1
##$AZFW= 0.1
##$BCFW= 0
##$BC_mod= 0
##$BYTORDP= 0
##$COROFFS= 0
##$CY= 15
##$DATMOD= 1
##$DC= 0
##$DFILT= <>
##$DTYPP= 0
##$F1P= 0
##$F2P= 0
##$FCOR= 0.5
##$FTSIZE= 32768
##$FT_mod= 6
##$GAMMA= 0
##$GB= 0
##$INTBC= 1
##$INTSCL= 1
##$ISEN= 128
##$LB= 0
##$LEV0= 0
##$LPBIN= 0
##$MAXI= 10000
##$MC2= 0
##$MEAN= 0
##$ME_mod= 0
##$MI= 0
##$NCOEF= 0
##$NC_proc= -8
##$NLEV= 6
##$NOISF1= 0
##$NOISF2= 0
##$NSP= 0
##$NTH_PI= 0
##$NZP= 0
##$OFFSET= 14.98509
##$PC= 1
##$PHC0= 89.69238
##$PHC1= 0
##$PH_mod= 1
##$PKNL= yes
##$PPARMOD= 0
##$PPDIAG= 0
##$PPIPTYP= 0
##$PPMPNUM= 2147483647
##$PPRESOL= 1
##$PSCAL= 4
##$PSIGN= 0
##$PYNMP= <proc.py>
##$REVERSE= no
##$SF= 400.02
##$SI= 32768
##$SIGF1= 0
##$SIGF2= 0
##$SINO= 400
##$SIOLD= 32768
##$SPECTYP= <>
##$SREGLST= <1H.CDCl3>
##$SSB= 0
##$STSI= 32768
##$STSR= 0
##$SW_p= 8223.68421052631
##$SYMM= 0
##$S_DEV= 0
##$TDeff= 65536
##$TDoff= 0
##$TI= <>
##$TILT= no
##$TM1= 0
##$TM2= 0
##$TOPLEV= 0
##$USERP1= <user>
##$USERP2= <user>
##$USERP3= <user>
##$USERP4= <user>
##$USERP5= <user>
##$WDW= 1
##$XDIM= 32768
##$YMAX_p= 438039720
##$YMIN_p= -690040
##$CURPLOT= <Network HP LaserJet P1505>
##$CURPRIN= <$Network HP LaserJet P1505>
##$DFORMAT= <normdp>
##$LAYOUT= <+/1D_H.xwp>
##$LFORMAT= <normlp>
##$PFORMAT= <normpl>
##$SURQMSG= 1
$$ End of Bruker specific parameters
$$ ---------------------------------
##NTUPLES= NMR SPECTRUM
##VAR_NAME=  FREQUENCY,     SPECTRUM/REAL,   SPECTRUM/IMAG
##SYMBOL=    X,             R,               I
##VAR_TYPE=  INDEPENDENT,   DEPENDENT,       DEPENDENT
##VAR_FORM=  AFFN,          ASDF,            ASDF
##VAR_DIM=   32768,         32768,           32768
##UNITS=     HZ,            ARBITRARY UNITS, ARBITRARY UNITS
##FACTOR=    0.250966925370066, 1,           1
##FIRST=     8223.43324360094, -222087,      -171089
##LAST=      0,             34767,           -90032
##MIN=       0,             -690040,         0
##MAX=       8223.43324360094, 438039720,    0
$$ Real data points
##PAGE= N=1
##DATA TABLE= (X++(R..R)), XYDATA
$$ [...]
19564b43590b0651A62909N4352a19601b5612C1167L6681b382j46100L0047K0362
19553i8073A37298B1011L9908A7333L1008b17520B18222b67940J10666G5141d8437
19541b4120j73194A8103a72479M3420q6371F1142a64968B63927c52753g8432j18391
19530a96823m0108D4552c8440G1133c75412F2164N6283a68711N4640r8466A96020
19518c866j72008A2577g3041K275A09863E3162L75397E2056e1323a7644j62962
19507a80606P8480G8670M6588i6120j48864h6525m7447c5828I1237K07677M665
19496C03579A2208a54327E268b02556k20859I4082J38649H8703c50950J43581
19486b07369h4928F0070b22558g1478j47268g5671K2242l28610A31684B0193J79110
$$ plain form
19564 -243590 -20651 162909 217261 -119601 -25612 31167 67848 -2382 -148482 -118435 -98073
19553 -98073 137298 21011 60919 17333 48341 -217520 218222 -267940 -157274 75141 -48437
19541 -24120 -197314 18103 -172479 -129059 -215430 61142 -164968 263927 -352753 -78432 -196823
19530 -196823 -236931 44552 -38440 71133 -375412 62164 118447 -168711 -114071 -212537 196020
19518 -3866 -175874 12577 -73041 -70766 109863 53162 428559 52056 -51323 -17644 -180606
19507 -180606 -102126 78670 125258 -96120 -244984 -86525 -133972 -35828 91237 298914 303579
19496 303579 12208 -154327 5268 -202556 -423415 94082 232731 88703 -350950 -207369
19486 -207369 -84928 60070 -222558 -71478 -218746 -75671 -53429 -382039 131684 20193 199303
19475A99303a48891M8213E7858j3752E82a07918C7396h2390n4A56123J30622b97551
19462g4515A69152k4573a67772L2117A95973b0659H8167J90118j33195C167O0373
19451F3540b2630j32831A35968e1552H4472f9908k47091a54745B12415m3791i531
19439b35154f9439j45084l2701b2107A81714G5490b03644N5514d7470j88370D03331
19427A54528L4007a43413C2836b18522B23028D3220c46999g6418j1287A0739a38177
19415h433j39483A92060E2149K48255a9281o2400j9403A93070K9693B6187a09789
19403b4085E7403A8070i2692j98340J22177A30047g1068B0410O6069d7518j28559
19392a76077r305A08194b24737i3413m9621O0993P035B20980a73307D89223d7170
$$ plain form
19475 199303 -148891 -100678 57858 44106 582 -107918 37396 -82390 -82444 156123 286745 -297551
19462 -74515 169152 144579 -167772 -135655 195973 -20659 88167 278285 145090 3167 63540
19451 63540 -22630 -155461 135968 -51552 84472 -69908 -316999 -154745 212415 168624 -9531
19439 -235154 -69439 -214523 -247224 -22107 181714 75490 -203644 -148130 -47470 -235840 403331
19427 154528 188535 -143413 32836 -218522 223028 43220 -346999 -76418 -87705 10739 -138177
19415 -8433 -147916 192060 52149 300404 -19281 -81681 -101084 193070 222763 26187 -109789
19403 -24085 57403 18070 -92692 -291032 -168855 130047 -71068 20410 86479 -47518 -176077
19392 -176077 -185382 108194 -224737 -93413 -143034 -82041 -75006 220980 -173307 489223 -47170
19380F9186B2868a24773r8503j3941E0157b09271J01482j63180J24552O5698d172
19368b21242p5104a33872N2740j52244I3657B9526R5663b3449H3137C3483N9060
19357I2543h6874A15056J43623C76e01932i5081d6701l88739h1030A95357c53598
19345b33126A25455l4197d06862a9369j29557A20925m9994a03383d1387j76934
19335b18321H7246a1882p5511k16674h7292D7225b67960B51192j18692b80579
19324g6309A56525b50609A71287b394B37998a56467L2141H9364A9197b02297q8307
19313b90604k32250A10767h3159B85448b09965A27904G925c3928j35424A49228
19302a11432b6220j92926F8930a28267M4874j3807j17550P6251A49856J20178
$$ plain form
19380 69186 22868 -124773 -223276 -237217 50157 -209271 -107789 -270969 -146417 -80719 -4172
19368 -221242 -296346 -133872 -81132 -233376 93657 29526 125189 -23449 83137 33483 92543
19357 92543 -86874 115056 258679 376 -501932 -95081 -46701 -435440 -81030 195357 -353598
19345 -233126 125455 91258 -406862 -19369 -148926 120925 70931 -103383 -41387 -218321
19335 -218321 87246 -11882 -87393 -304067 -87292 47225 -267960 251192 132500 -280579
19324 -76309 156525 -250609 171287 -2394 237998 -156467 -124326 89364 19197 -202297 -290604
19313 -290604 -522854 110767 -83159 285448 -209965 127904 7925 -33928 -169352 149228
19302 -111432 -26220 -219146 68930 -128267 -83393 -97200 -214750 -138499 149856 270034
19292B70034m720g6112D7307N8980a98385J6767N4056E4875j7862b4294C6045
19280G9217B3086b15210c4415k87889B45447a12238b6417k0190C547b36633j9579
19269b56212j37437C699N7029b88599D8252k528L61b41766f1143j29626P3916
19258a16853a6158A70965J35154a96707p3516B3955J53951n137a17933k82860
19248d00793a11552k50078a78q1388j84710M9340A9542c1667j89596H6901j377
19237H5524B2289J13531F3354a71146c4358q3821j8510j64870H7977J8431b39458
19225b00158k62237C307a94044P7911K027q9188N9981G8150j8221b9658D8410
19213C00100b7208j25809B16857j05630a93393g5093p3063N6218n355j04254q4698
$$ plain form
19292 270034 265314 -76112 47307 106287 -198385 -181618 -127562 54875 37013 -24294 36045
19280 79217 23086 -215210 -34415 -322304 245447 -112238 -26417 -46607 3547 -236633 -256212
19269 -256212 -393649 3699 60728 -288599 48252 45724 46085 -241766 -61143 -190769 -116853
19258 -116853 -16158 170965 306119 -196707 -270223 23955 177906 172769 -117933 -400793
19248 -400793 -111552 -361630 -178 -81566 -266276 -216936 19542 -31667 -221263 86901 85524
19237 85524 22289 135820 63354 -171146 -34358 -118179 -136689 -301559 87977 106408 -239458
19225 -200158 -462395 3307 -194044 -116133 -114106 -203294 -143313 78150 59929 -29658 48410
19213 300100 -27208 -153017 216857 111227 -193393 -75093 -148156 -91938 -97293 -201547 -286245
19202b86245O5689k03334A20362K6646f8821A8592b1294B76191c9133A05018d8905
19190A12562b75681b8582A6188a2129H2995b80704c7322k01026c0779r8645k16085
19179c45509G0786b32715G100f7602B158L9011c82893a3852n3233C9272P7185
19168A16457k714B0061b35675B2861h5825A44237g4251k9521o3851f6457H4772
19156F0065P5759a09605j08296k05603b3996A45249i8865l4423r0094B84855b6910
19144I552K70444d340l58702A6385F064a25677q8793E007a26537k7706B06794
19132H0019b56040L3607A46901i2131m5811j1020q7364A40887E514K7630K64078
19121B97222A06529j7581c00109a41486q7547g594m0692m421l51549a37869j50456
$$ plain form
19202 -286245 -220556 -423890 120362 147008 -68821 18592 -21294 276191 -39133 105018 -48905
19190 112562 -275681 -28582 16188 -12129 82995 -280704 -37322 -238348 -30779 -129424 -345509
19179 -345509 70786 -232715 7100 -67602 2158 41169 -382893 -13852 -67085 39272 116457
19168 116457 113743 20061 -235675 22861 -85825 144237 -74251 -103772 -167623 -66457 84772
19156 60065 135824 -109605 -217901 -423504 -23996 145249 -98865 -133288 -223382 284855 -26910
19144 9552 279996 -4340 -363042 16385 6064 -125677 -214470 5007 -126537 -154243 206794
19132 80019 -256040 -222433 146901 -92131 -137942 -148962 -236326 140887 5514 33144 297222
19121 297222 106529 88948 -300109 -141486 -229033 -7594 -48286 -52707 -404256 -137869 -288325
19110b88325b4949p7862q8800K9256O9340m19071f3614r4855a2944l7597j01752
19099a52293P4769J8566l1555G986b06667A51215D0477b75488B54058h7021A48841
19087g7580C7640L803a78139J9921A67803m785D8533b93529e2997j63605h1584
19075B59427a63897G0772g6755a6223o4102B06972a23414A68863J98627a11081
19064c79225J65890j80736A7372e988m99551b3595j39689B5249M1061b37209f3092
19052D018d6362A35531h1680B62277j0253e5284j1555B14931b83988D2264a43066
19040d6726A67122a00659j5934E5394K0591a81597H0552j0786a1370B00733m8019
19029A52714m1940J22846g1382p7482e7085j7336C03450d1554k19117B69094a55882
$$ plain form
19110 -288325 -24949 -102811 -191611 -162355 -93015 -512086 -63614 -158469 -12944 -50541 -152293
19099 -152293 -77524 -58958 -90513 7986 -206667 151215 40477 -275488 254058 -87021 148841
19087 -77580 37640 41443 -178139 -158218 167803 163018 48533 -293529 -52997 -216602 -81584
19075 259427 -163897 70772 -76755 -16223 -80325 206972 -123414 168863 367490 -111081
19064 -379225 -213335 -394071 17372 -5988 -505539 -23595 -163284 25249 66310 -237209 -63092
19052 4018 -46362 135531 -81680 262277 252024 -55284 -66839 214931 -283988 42264 -143066
19040 -46726 167122 -100659 -116593 55394 75985 -181597 80552 69766 -11370 200733 152714
19029 152714 110774 233620 -71382 -148864 -57085 -74421 303450 -41554 -260671 269094 -155882
19017a72918f0568R778J1049e216q9553b3856g374B63885b3546o4187A2402b67102
19004c25965g702j27211O4806m0264j7527A63003N601b79527o9854E475K35144
18993B40619g1310l56045d0632A59102a19891d7080q45q5534K9780C35366h3849
18981B13265g6572B6555a12655F5618a40159M3932M2543I6456l323a27242f0562
18969G296K0742J87969a58259f2891j11155A0865a32379a8439H4916f9699C2031
18957i3064m34995b31231e7938k3031I1503D2048a25605A20881h1304B06045C0308
18945c3149p1073l1471G6608a6822H8422k4158L3100e3957k04288a03737l15183
18934d18920a22640H4050c3558A13814J41472c49576c291F4541K5207P7320D9346
$$ plain form
19017 -172918 -60568 -50790 -39741 -5216 -94769 -23856 -7374 263885 -23546 -87733 12402 -267102
19004 -325965 -7702 -134913 -70107 -110371 -127898 163003 168604 -279527 -349381 5475 240619
18993 240619 -71310 -427355 -40632 159102 -119891 -47080 -47925 -133459 -103679 335366 -83849
18981 213265 -76572 26555 -112655 65618 -140159 -96227 -53684 96456 93133 -127242 -60562
18969 7296 28038 216007 -158259 -62891 -174046 10865 -132379 -18439 84916 -69699 32031
18957 -93064 -528059 -231231 -57938 -80969 91503 42048 -125605 120881 -81304 206045 30308
18945 -33149 -104222 -135693 76608 -16822 88422 64264 97364 -53957 -258245 -103737 -418920
18934 -418920 -122640 84050 -33558 113814 255286 -349576 -3291 64541 89748 167068 49346
18922g4584j66162A9050G973b61295B5930a02316k49189J74421c9203D3687b38770
18910i3716K3639J8337l10493A36039C2066O5401b84472B38308A08545i9329A31321
18898a66207c6218a6250j36053G745a16234B45343C4428d6692l16608A48332n7777
18887I0555k9022P9752c09805J25796j38498a35702a1636j92491J00495j81598
18877b85230L6364a013I048b39039j75648f8276L757C8694b41745A33406b19644
18865a69139n4057e7238g960j06933Q334N2791B50900m7294a66754k28638b9083
18853a41487N260j8132b1328k8651l29695A37100b0748l05989H5587d5384p9419
18842a24803A41855m2255a30424n5447h9749a2356C8906h7378j75013n0572m4957
$$ plain form
18922 -74584 -240746 19050 7973 -261295 25930 -102316 -351505 -177084 -39203 43687 -238770
18910 -93716 -70077 -51740 -362233 136039 32066 97467 -284472 238308 108545 -99329 131321
18898 -166207 -36218 -16250 -152303 7745 -116234 245343 34428 -46692 -363300 148332 90555
18887 90555 61533 141285 -309805 -184009 -322507 -135702 -11636 -204127 -103632 -285230
18877 -285230 -248866 -1013 9048 -239039 -414687 -68276 -64519 38694 -241745 133406 -219644
18865 -169139 -223196 -57238 -7960 -114893 -106559 -53768 250900 203606 -166754 -395392 -29083
18853 -141487 -136227 -154359 -21328 -49979 -379674 137100 -20748 -326737 85587 -45384 -124803
18842 -124803 141855 99600 -130424 -185871 -89749 -12356 38906 -87378 -262391 -312963 -357920
18831c57920I4212l3018J2215J4374m3449d19706A8970h0314j87945D5638P2918
18820A18556a38201d1420B34770i4955C13499G9165C1728K66096q9029R6268A15498
18808B77121B7791K97676h5635A97924G4571a07109a6909q2761A49583a6353k1343
18797c7696b390j45643I1080c51744j0446C8871c50822e5740a5920B07280a15864
18785a72360M9765L6076j9149l9223A12356c07464J49952j86214P148B68021b1968
18773C51632e112k1592p77j52572k47320J95174A07278k9444P7393m4314B3159
18761A74724b20577A92072c39152E0247N4521G020b48514Q8511k3758j88223B90834
18749b30123G4417J01249B5775a62607G4592a43749O5527A02219J4597h3828J0471
$$ plain form
18831 -357920 94212 61194 73409 87783 44334 -419706 18970 -80314 -268259 45638 118556
18820 118556 -138201 -41420 234770 -94955 313499 79165 31728 297824 208795 305063 115498
18808 277121 27791 325467 -85635 197924 74571 -107109 -16909 -99670 149583 -16353 -37696
18797 -37696 -2390 -148033 91080 -351744 -362190 38871 -350822 -55740 -15920 207280 -115864
18785 -172360 -122595 -86519 -105668 -144891 112356 -307464 -157512 -343726 -336578 268021 -21968
18773 351632 -5112 -26704 -27481 -180053 -427373 -232199 107278 77834 155227 110913 23159
18761 174724 -220577 192072 -339152 50247 104768 7020 -248514 -160003 -183761 -371984 290834
18749 -230123 74417 175666 25775 -162607 74592 -143749 -78222 102219 116816 -83828 -73357
18738g3357K53j22352G9233Q6411a0542B9273O8680f4099l94253J58297f0501
18726C16569a97390Q9500q3026B19822K8188E1124a99753F8163Q8295a59809E0985
18714A10406l8302J57833a80204e0580l0044l6664n7328j30172J04999C094b91547
18702b94487a30745G4002J59782a25399F7784a95272i009j318j30784p7202A6857
18690b19749h5718a7237k76138d8806l43339B05797a14965C001d0447D65206b2486
18678e7325k75538B38930a15111c3756k86035C3256a84240h1872B40813D5304
18667d0750A85590a04067j44336A13371a80468P9854D0668J2267a68130B97489
18656e2795A50490B7038L1649a74344A30994a99720G0022h0456i394l98911a63130
$$ plain form
18738 -73357 -73104 -195456 79233 165644 -10542 29273 97953 -64099 -458352 -300055 -60501
18726 316569 -197390 -107890 -190916 219822 248010 51124 -199753 68163 156458 -159809 50985
18714 110406 72104 229937 -180204 -50580 -80624 -117288 -174616 -304788 -199789 3094 -291547
18702 -294487 -130745 74002 233784 -125399 67784 -195272 -9009 -10327 -141111 -218313 16857
18690 -219749 -85718 -17237 -293375 -48806 -392145 205797 -114965 3001 -40447 465206 -22486
18678 -57325 -332863 238930 -115111 -33756 -319791 33256 -184240 -81872 240813 45304
18667 -40750 185590 -104067 -248403 113371 -180468 -100614 40668 52935 -168130 297489
18656 -52795 150490 27038 58687 -174344 130994 -199720 70022 -80456 -9394 -408305 -163130
18644B70116j23405a12426N1713j50956B6489J25994a75372A38153D9160b42817
18633a96528j25525A66929a17957G0808j0876a77198A03095Q666a14271O564L9983
18622f7724b1514K448A77398a84692j7292R1517j01190f8925A65022g1391k2369
18611i3760m4636a0936I4190a14295m3015A21020d3979B45327c45563N7887K3602
18600b64074g8574B96927b27676C46400b08402I4360J12575c10851d0043H0974
18589a85036G024J77389a25493A08651O885b52261a23721A25580f5289G110K59213
18578B66323E8040b9268k69164A12010i2461j27771H4437A8732a71636k3775E8385
18566b79412M6828D0794K28174a84594f7113m0043A4077c0353k9289k64664b3884
$$ plain form
18644 270116 146711 -112426 -60713 -211669 26489 152483 -175372 138153 49160 -242817
18633 -196528 -322053 166929 -117957 70808 59932 -177198 103095 111761 -114271 -107707 -67724
18622 -67724 -21514 -19066 177398 -184692 -201984 -110467 -211657 -68925 165022 -71391 -93760
18611 -93760 -138396 -10936 94190 -114295 -157310 121020 -43979 245327 -345563 -287676 -264074
18600 -264074 -78574 296927 -227676 346400 -208402 94360 206935 -310851 -40043 80974
18589 -185036 7024 184413 -125493 108651 115536 -252261 -123721 125580 -65289 7110 266323
18578 266323 58040 -29268 -298432 112010 -92461 -220232 84437 18732 -171636 -195411 58385
18566 -279412 -232584 40794 268968 -184594 -67113 -107156 14077 -30353 -59642 -324306 -23884
18554a19137n0407k20229B28449b25311G7816i9331A53527B8054a63890B892c00710
18542d8705a7903j77341d7424I0942O5801f6958j15810L6097L0956e55k15014
18531b15569F4836B2295J62558j5604l7201n2704i7932j91764c3815I2213e7253
18519A16891a57579f0363B73485a05982C6788a7787p7744A16726c1223m4294C2470
18507a9475j98243K987c0205C1061K7084b16626R409h5501A17408D1136L6630
18496G7766a39962O7876A1992c749j42087E5690K74141I1530b72320A31201N6613
18485A87814q254a75113h0561d979j26432L5437b5316A79750a90556b6126P372
18474a8754j73872J5886A87979B1336m883a02357d9515d6A23246O4638r1999a03384
$$ plain form
18554 -119137 -169544 -389773 228449 -225311 77816 -99331 153527 28054 -163890 2892 -300710
18542 -48705 -17903 -195244 -47424 90942 156743 -66958 -182768 -146671 -115715 -555 -215569
18531 -215569 64836 22295 184853 169249 132048 79344 -97932 -289696 -33815 92213 -57253
18519 116891 -157579 -60363 273485 -105982 36788 -17787 -95531 116726 -31223 -75517 32470
18507 -19475 -217718 -214731 -30205 31061 58145 -216626 -207217 -85501 117408 41136 77766
18496 77766 -139962 -72086 11992 -3749 -145836 55690 329831 91530 -272320 131201 187814
18485 187814 179560 -175113 -80561 -4979 -131411 -95974 -25316 179750 -190556 -26126 -18754
18474 -18754 -192626 -176740 187979 21336 16453 -102357 -49515 -46 123246 187884 95885 -103384
18461a09372b3791r5173j52840a05991j05627Q5712D6066b73024i4388L5327r3760
18450a52821E7944a29700a9326A5724a93818A6461d1784j50832g1454n9669F5692
18438G2703b07450q3637b4804j11589A05276d194j74030B8638a9381m6464q3696
18427a49541c191j78084O53h8247A65763b72653E0537f9095J8313k53715B48931
18415b87213L9891l9351B67321a07866o6965h172F9768a41500j59800Q5390C2503
18403I9953M8315b9445j6400A31408B9776J94205b22548A4320K48756a00808D4827
18391C31260f9566C93475a55059b1563D09521d089F0621a35226B7594a16222j81799
18380b98021C73539B4325d1066l14968c5659l3214k07759E6038e4340D7482K82709
$$ plain form
18461 -109372 -23791 -118964 -271804 -105991 -211618 -125906 46066 -273024 -94388 -59061 -152821
18450 -152821 57944 -129700 -19326 15724 -193818 16461 -41784 -192616 -71454 -131123 65692
18438 72703 -207450 -291087 -24804 -136393 105276 -4194 -178224 28638 -19381 -65845 -149541
18427 -149541 -3191 -181275 -180622 -88247 165763 -272653 50537 -69095 -50782 -304497 248931
18415 -287213 -247322 -286673 267321 -107866 -174831 -8172 69768 -141500 -301300 -215910 32503
18403 99953 148268 -29445 -45845 131408 29776 223981 -222548 14320 263076 -100808 44827
18391 331260 -69566 393475 -155059 -21563 409521 -4089 60621 -135226 27594 -116222 -298021
18380 -298021 373539 24325 -41066 -356034 -35659 -68873 -276632 56038 -54340 47482 330191
18369C30191E2882c6813C7818a6492j42443E5879a92655A95441D921J02999a25916
18357g457B73489C4624a61092L4167J3584k7277A15460A3236a03613j15508J9484
18346a99637O66Q7053A61381p8557P262b05845A7054a30911A04841g4584G4948
18334a62585C5621a68755P8472b4543j98030A35990e6114r3815E4431J43214I1162
18322C11677a40285q5152k5715J11621B1527O7440P2078M3814b97633g0128L2750
18311c7378k40005L6899h7815q8778j11679a31647C24530a91396m7931G4679R7897
18300A72576E9015h1606d0386k26283a29083n2903A94965b51862m946B84533b8449
18288i5958B04184b77928g7773Q428B90874a95644A02808d0880q102m8309A35761
$$ plain form
18369 330191 52882 -36813 37818 -16492 -158935 55879 -192655 195441 4921 107920 -125916
18357 -7457 273489 34624 -161092 -126925 -113341 -140618 115460 13236 -103613 -219121 -199637
18346 -199637 -198971 -111918 161381 82824 90086 -205845 17054 -130911 104841 -74584 74948
18334 -162585 35621 -168755 -90283 -24543 -222573 135990 -56114 -149929 54431 197645 91162
18322 311677 -140285 -225437 -251152 -139531 21527 88967 161045 204859 -297633 -70128 -37378
18311 -37378 -277383 -240484 -87815 -176593 -288272 -131647 324530 -191396 -239327 74679 172576
18300 172576 59015 -81606 -40386 -266669 -129083 -181986 194965 -251862 -256808 284533 -28449
18288 -95958 204184 -277928 -77773 -69345 290874 -195644 102808 -40880 -48982 -97291 135761
18276A32297b8003A09216e2666J877A93205a5225l2743C66161A77083B4015K12703
18265B36718D0904b09587B7368c8803J2256D5478K10448j08800a03619c3736k10816
18254b44552N4447B38871r7414b8094B04968g8465A58632D8400a27927C1051K9558
18243F0609c82898d5375B7701c13822j87974b769k7636k01973b4560B53145a44337
18231d6025E5576K8061K74968a2690j31222J0891B1749c766A08255b6267o1521
18220h7788F6698a49790B62116a61355A03219a25662B21861b61468f7100a3403
18209a28167B4365p872P3859a09656C40921A3846h9058j67046a13327j8110p7708
18198b09145A93196E8361b36781f6722j44051m7823P5498D8034a25284k77253
$$ plain form
18276 132297 -28003 109216 -52666 -50789 193205 -15225 -47968 366161 177083 24015 236718
18265 236718 40904 -209587 27368 -38803 -26547 45478 255926 147126 -103619 -33736 -244552
18254 -244552 -190105 238871 141457 -28094 204968 -78465 158632 48400 -127927 31051 60609
18243 60609 -382898 -45375 27701 -313822 -501796 -2769 -30405 -232378 -24560 253145 -144337
18231 -46025 55576 83637 358605 -12690 -143912 -133021 21749 -3766 108255 -26267 -87788
18220 -87788 66698 -149790 262116 -161355 103219 -125662 221861 -261468 -67100 -13403
18209 -128167 24365 16493 90352 -109656 340921 13846 -89058 -256104 -113327 -131437 -209145
18198 -209145 193196 58361 -236781 -66722 -210773 -258596 -183098 48034 -125284 -402537
18188d02537a71788D2709N499b9585B4229i7472A3807b21669i1955F2551K07976
18177B70527c9446A37839c3974I01K08983a41712m9371A19839C1060b02589j6782
18166b19371A8731J2453J72025j00917a67112H3934L2920d8908m1126A55196C2542
18154B23590i3950a9207k43742G2245e4601J034j15765B60488A0317g6668q4416
18143a61084i952k30143A7080b96865J25044o9890A82945b5152k15188R6367j69379
18132c13352L967h08j87774d7745l19453R2820A85755b29868b7381B29080a8056
18120b17284J03903B05847h1205M581A84247a26216k9713J9677c7822C7404b07394
18108e4837n2310c7631B2190a5543H2079c5521o6462B73747F928c38709J17310
$$ plain form
18188 -402537 -171788 42709 48208 -29585 24229 -97472 13807 -221669 -91955 62551 270527
18177 270527 -39446 137839 -33974 901 209884 -141712 -191083 119839 31060 -202589 -219371
18166 -219371 18731 31184 203209 102292 -167112 83934 116854 -48908 -90034 155196 32542
18154 223590 -93950 -19207 -262949 72245 -54601 -53567 -169332 260488 10317 -76668 -161084
18143 -161084 -9952 -240095 17080 -296865 -171821 -241711 182945 -25152 -240340 -143973 -313352
18132 -313352 -309385 -808 -188582 -47745 -367198 -274378 185755 -229868 -27381 229080 -18056
18120 -217284 -113381 205847 -81205 -76624 184247 -126216 -155929 -136252 -37822 37404 -207394
18108 -54837 -107147 -37631 22190 -15543 82079 -35521 -101983 273747 6928 -338709 -221399
18097b21399I1735b4462A81107G5817a38507G8660B9841a57909H5484b6094A17859
18085A49M0331m16a59636A70414d7503j58730A7457a4028O731l19907A76777c25445
18072c80056B03381p8836n9287a23579q5265a9624p1707d0856A74643c05535f7132
18060a18953M3246C06293a95380A47792a9921n14465a14712o5320B38748n9533
18050A79215q141e806n4235A62580e8787r0918m5421i6535A26402b07901D30809
18038H9593C0843Q2987K88977f5276p5010b8301A39047B1138a02085p841k02711
18027c12637E4420A8654L4871b34981C5970R3475c82381K4521f3134K6440F6225
18015A35747K0276D5685A5389e9865A68573F8307a06988A07263b92506m9307i4954
$$ plain form
18097 -221399 91735 -24462 181107 75817 -138507 78660 29841 -157909 85484 -26094 117859
18085 149 40480 40064 -159636 170414 -47503 -206233 17457 -14028 -7297 -327204 176777 -325445
18072 -380056 203381 124545 65258 -123579 -208844 -19624 -91331 -40856 174643 -305535 -67132
18060 -118953 -75707 306293 -195380 147792 -19921 -534386 -114712 -180032 238748 179215
18050 179215 171074 -5806 -60041 162580 -58787 -149705 -195126 -96535 126402 -207901 430809
18038 89593 30843 113830 402807 -65276 -140286 -28301 139047 21138 -102085 -109926 -312637
18027 -312637 54420 18654 53525 -234981 35970 129445 -382381 -357860 -63134 -36694 66225
18015 135747 156023 45685 15389 -59865 168573 68307 -106988 107263 -292506 -341813 -94954
18003c29587A85676a96653B10589q0854g9749j0988M0319j11895A67879A4407
17992A19819m4565a81899d9828a3932j76859P111D8694N5157K7500b65932B6341
17980c16517g376j23171f4788C8704J86551f5849l47208D0618c10084h6303G5606
17968a84101k27883a35796E7570c34267A66299k9308b70607B31499I0245a62557
17957G3871a82976O3461B08358p2226a98047C34326c39152e7565I7462b20736
17946A63444g4054E9638H274c52373J69301A78608C7937M5811a43204c177k20934
17935b24111G3930d2833l4465B96692m6608I8955b5574r3529Q259A80255D483
17923B1385b37414G2801a0105B23144f4219j67085F0982a15726j04004b9620k7721
$$ plain form
18003 -329587 185676 -196653 210589 129735 -79749 -90737 -50418 -162313 167879 14407
17992 119819 75254 -181899 -49828 -13932 -190791 -183680 48694 103851 131351 -265932 26341
17980 -316517 -7376 -130547 -64788 38704 225255 -65849 -413057 40618 -310084 -86303 75606
17968 -184101 -411984 -135796 57570 -334267 166299 136991 -270607 231499 90245 -162557
17957 73871 -182976 -119515 208358 136132 -198047 334326 -339152 -57565 97462 -220736
17946 163444 -74054 59638 8274 -352373 -183072 178608 37937 83748 -143204 -3177 -224111
17935 -224111 73930 -42833 -77298 296692 250084 98955 -25574 -119103 -110844 180255 4483
17923 21385 -237414 72801 -10105 223144 -64219 -231304 60982 -115726 -219730 -29620 -57341
17912e7341E8033A5636e8958B9043K24870l157E86J14164j4974K00688a81478
17900B21694j06889n0641Q3022b5936j3241G7051J18794q6219c11806H0755J12333
17889A93088B7827e7782l28795d293A00144h5761D1793b9m16849I0504c2143G5267
17876e25901B35695g918j85366G2849M3210H780a52571H197a2087m02339D846
17864A18284a0542A0864J64104b27834Q4553l7717L7477A09228L9402e5480K0251
17853c5229C7182a68737D5200J92395J54515A12054a067B94806e2388b3995A0090
17841b46240A95024K1581a87333D2767f6885o2079d7459n0893A34135b6851F6257
17829a05157A68664c14897a13166B30807o0304C6756N9266b80431A84458J31334
$$ plain form
17912 -57341 58033 15636 -58958 29043 253913 250756 586 114750 99776 300464 -181478
17900 221694 114805 64164 147186 -25936 -39177 77051 195845 109626 -311806 80755 193088
17889 193088 27827 -57782 -386577 -4293 100144 -85761 41793 -29 -416878 90504 -32143 75267
17876 -525901 235695 -7918 -193284 72849 116059 8780 -152571 8197 -12087 -414426 4846
17864 118284 -10542 10864 174968 -227834 -143281 -180998 -143521 109228 148630 -55480 -35229
17853 -35229 37182 -168737 45200 237595 392110 112054 -1067 294806 -52388 -23995 10090
17841 -246240 195024 216605 -187333 42767 -66885 -128964 -47459 -98352 134135 -26851 66257
17829 -105157 168664 -314897 -113166 230807 170503 36756 96022 -280431 184458 315792
17819C15792A52656a69220A02226n0500a30126C599J60619m2848d4764k6727H9634
17807H3095b29011F3311a78081C52176i6979B79141A08330J10805o7180N291b18971
17795a1587l35661f0904k3549k08412a28770A34244a30701H5209c8459j2933o935
17784e8327j54278j03759B44174i2019A04608l8728Q8661a37370m1164d2516A34955
17772h456j13779j11935A86480E8536f8701a9066q6873a4644C4217a34259j38955
17761b73214e4015k12664P4529p998C69337j04052a26591A52939h815D3645i7376
17749A06159j8259L06426d5743l8042F5255K16504c90394a00767A28228b29922
17738a93086D4069J36781c2176A15297n3013R3147N066o2345c55127a13687n389
$$ plain form
17819 315792 152656 -169220 102226 51726 -130126 3599 164218 121370 -44764 -71491 89634
17807 83095 -229011 63311 -178081 352176 -96979 279141 108330 219135 151955 157246 -218971
17795 -11587 -347248 -60904 -84453 -292865 -128770 134244 -130701 85209 -38459 -51392 -58327
17784 -58327 -212605 -316364 244174 -92019 104608 65880 154541 -137370 -178534 -42516 134955
17772 -8456 -122235 -234170 186480 58536 -68701 -19066 -105939 -14644 34217 -134259 -273214
17761 -273214 -54015 -266679 -192150 -200148 369337 265285 -126591 152939 -8815 43645 -97376
17749 106159 87900 394326 -45743 -83785 65255 281759 -390394 -100767 128228 -229922
17738 -193086 44069 180850 -32176 115297 62284 155431 160497 98152 -355127 -113687 -119076
17727a19076l0814B6784K28449D0164R9086J1050b19774I7512a98321A63484a84412
17715B67188g7171C8955g5504L473H283J31834a08029A70187l374E777N8552J65772
17703B30101B530c82090n4724A36247P7575G8471B4417b33081e1679B84702b88153
17691A1407e6452A75579a16244G9209K2839L54894d0939A70532E8132b4680j76910
17680b01590E0816M9657h2470A6249J03639J28618C7105M0199Q859d9169a5859
17668a13842j32114c093o6411A51489J17691d9563H3005j5902a44317B72035J40603
17657D12638C8745K6394a23816A38076d3571A24890b91040b9765B8892O106h243
17645A23070F0566O4599e6414A89932m5977a16957B08800N992J23532a87158A47289
$$ plain form
17727 -119076 -149890 26784 255233 40164 139250 150300 -219774 97512 -198321 163484 -184412
17715 267188 -77171 38955 -75504 -72031 8283 140117 -108029 170187 166813 5777 64329 230101
17703 230101 2530 -382090 -436814 136247 213822 78471 24417 -233081 -51679 284702 -288153
17691 11407 -56452 175579 -116244 79209 102048 456942 -40939 170532 58132 -24680 -201590
17680 -201590 50816 100473 -82470 16249 119888 248506 37105 77304 86163 -49169 -15859
17668 -113842 -245956 -3093 -69504 151489 269180 -49563 83005 67103 -144317 272035 412638
17657 412638 38745 65139 -123816 138076 -43571 124890 -291040 -29765 28892 34998 -8243
17645 123070 60566 125165 -56414 189932 143955 -116957 208800 214792 338324 -187158 147289
17633c41612H8391g6792A94148C6087L48065b68271b7966k16526B48281b87F4982
17621a43152l49872F3021a33314C1063J6579h3688j31883H4267a81969A13532
17610C5728c5737D46392j20975A14425C3933P694J75950I2824C7133d8102k75766
17599c23868A58886A0121i3290n9737A53724a13956b4070B8956J7757R3003k4860
17588A14856D9050Q315K2039P4223m3160h2041E7467f2708A22322J61557a34000
17576A19923a01220o6775b7375n7767E8709f7917F0592a03627c8761G6327l908
17565G2419Q512a40681B93954e6026p058j01448j86319P9867h7639I4462e1758
17553A36273R9490j11391L19N0579E0769a53616C7862K30479I2935R1985K39914
$$ plain form
17633 -341612 88391 -76792 194148 36087 384152 -268271 -27966 -244492 248281 -287 64982
17621 -143152 -493024 63021 -133314 31063 47642 -83688 -215571 84267 -181969 113532
17610 35728 -35737 446392 325417 114425 33933 41627 217577 92824 37133 -48102 -323868
17599 -323868 158886 10121 -93290 -153027 153724 -113956 -24070 28956 46713 139716 114856
17588 114856 49050 57365 79404 153627 110467 -82041 57467 -62708 122322 283879 -134000
17576 119923 -101220 -167995 -27375 -85142 58709 -67917 60592 -103627 -38761 76327 72419
17565 72419 80931 -140681 293954 -56026 -63084 -164532 -350851 -270984 -87639 94462 -51758
17553 136273 235763 124372 124691 175270 50769 -153616 37862 268341 92935 184920 424834
17542D24834A41245j7292b98302C32248j03297a15166G5079i247B57440q6590
17532A70850E2990P4402M5180C3951Q2826e147k49887A48441j3426e31033K52514
17521b78519e4878B41909F6411K85045k0895h8817D38661j15356A9525M55645
17511D75170A04849c8067j13612B74669G3598K18697H7517K94836a30683e6302
17500b80654A45405D3704J85234C4574M27632j83343j19628g3977j16025B89188
17489A5691a76654C91370j90912i4470F5484Q3390e7809B3441K75844c58869B44685
17477B81705a0313C11f2004K654D39085B19346P8297a5142C07000J39341h875
17465G5562a70420A63612m3781A2282K1224a917k38623C5958O6451J12778J6559
$$ plain form
17542 424834 141245 123953 -298302 332248 228951 -115166 75079 -9247 257440 170850
17532 170850 52990 127392 172572 33951 116777 -5147 -255034 148441 135015 -531033 -278519
17521 -278519 -54878 241909 66411 351456 330561 -88817 438661 323305 19525 475170
17511 475170 104849 -38067 -151679 274669 73598 292295 87517 382353 -130683 -56302
17500 -280654 145405 43704 228938 34574 462206 278863 159235 -73977 -190002 289188
17489 15691 -176654 391370 200458 -94470 65484 148874 -57809 23441 299285 -358869 244685
17477 281705 -10313 311 -62004 -59350 439085 219346 297643 -15142 307000 446341 -8875
17465 75562 -170420 163612 119831 12282 33506 -1917 -240540 35958 102409 215187 231746
17454B31746n682q6823J54038J45681A02675J17047b2739D93271k02523I0793
17443B72843n9156b58256A58650o2621a9561C89435b08955C34632m8499K2189
17433C08322D7919J96344P8861H1455J05517J02311K20859A61736Q2027j03293
17423A40470J46511J4946l9642N2219m1157p4597D2172J79001J12380j22455L8174
17412B49272r6674K4739E9322J22988M1511m8705N2616n6055J4742c21761B21936
17400A80525C6056e3907n6834B50969A24382L57989A19520L71410G7775L79699
17390D57474A34605P5052K9988a04766H7045K47312h4875b6407P541C05330k9722
17379B75608b85485G9187K21636j5563A21552K29302K226o8445A07389J49324
$$ plain form
17454 231746 226064 139241 293279 438960 102675 219722 -22739 493271 290748 90793
17443 272843 213687 -258256 158650 96029 -19561 389435 -208955 334632 286133 308322
17433 308322 47919 244263 323124 81455 186972 289283 510142 161736 243763 140470
17423 140470 286981 301927 262285 314504 273347 198750 42172 221173 333553 211098 249272
17412 249272 152598 177337 59322 182310 223821 175116 227732 171677 186419 -321761 221936
17400 180525 36056 -53907 -110741 250969 124382 482371 119520 490930 77775 457474
17390 457474 134605 209657 239645 -104766 87045 334357 -84875 -26407 -18866 305330 275608
17379 275608 -285485 79187 300823 285260 121552 350854 353080 284635 107389 256713
17369B56713C9811N28738A71571a12686C43354a1638C18496j05349O14r2249I658
17357D4755b36404C95260k8208L2461A13377K40188a93200I4597A2601D232K58212
17346B62444O258I2043m5395R0455F587M03591f9790j16674B31418L1486j00679
17335A62225c30488H3955Q4484p5773J67489g1641C08055C3654a4883l426C04572
17323B46168J7301H0091J34218n6641J13496O3397r4183a03320C22476j42592
17313A79884p1080J23636i5272C15778R0945H0211J37891b85645F9734J43250
17303B12984J17876a3856f548A26062P8591h2586a7166A56079R0437l1116I4474
17291A96665J55167A26957K30362D6102d4995D45616B6309f7136A51186n7354
$$ plain form
17369 256713 39811 568549 171571 -112686 343354 -11638 318496 213147 213761 121512 9658
17357 44755 -236404 395260 367052 399513 113377 353565 -193200 94597 12601 4232 262444
17346 262444 268702 92043 46648 137103 6587 410178 -69790 -186464 231418 262904 162225
17335 162225 -330488 83955 168439 92666 260155 -71641 308055 33654 -14883 -18309 304572
17323 246168 263469 80091 214309 157668 271164 334561 240378 -103320 322476 179884
17313 179884 108804 232440 -95272 315778 406723 80211 218102 -285645 69734 212984
17303 212984 330860 -13856 -6548 126062 204653 -82586 -17166 156079 246516 215400 94474
17291 196665 351832 126957 357319 46102 -44995 445616 26309 -67136 151186 93832
17281I3832J26882B2519B41K09463J43130h9731B5915J5318K32142c170I8446
17269I2375e6845B10742K5114F4583J54289J53695r1071A26337K6967g4148B18808
17257A57786p1723J08078b21911A82553M6121k2361p8901J34718G6343N78389
17247F54732k98868c19709B66637r3917J21030C5491J89664a49868G9232K96294
17237C75526j14911Q1034P2026c6935A80354J24286r2487b4665F0891J6221M4870
17226A21982J91361q2014j00873J69147A45684K26632j30125n5865J17684A23271
17215C98088A28645B9556J0743d9629F02671B57937b4563A4221a0057C87506A16186
17203C48154o7214j27419K01737j31777L44314B08456I9731D1206J2645J22535
$$ plain form
17281 93832 220714 22519 241 209704 352834 -89731 25915 41233 273375 -3170 98446
17269 92375 -56845 210742 235856 64583 218872 372567 281496 126337 153304 -74148 218808
17257 157786 86063 194141 -221911 182553 228674 206313 127412 262130 76343 654732
17247 654732 355864 -319709 266637 172720 293750 35491 225155 -149868 79232 375526
17237 375526 260615 341649 413675 -36935 180354 304640 212153 -24665 60891 77112 121982
17226 121982 313343 231329 130456 299603 145684 372316 242191 186326 304010 123271
17215 398088 128645 29556 40299 -49629 602671 257937 -24563 14221 -10057 387506 116186
17203 348154 280940 153521 355258 223481 567795 208456 99731 41206 53851 176386
17193A76386k6921J28541k8127K52704k38240K99726B80635J84530q1905O2135
17183D45395A64759Q7240m3904Q0035K06218q1116N0771J57584r8591n8043J18667
17172E83620j56978J3713j2002n3498K01711B50708G1823J67087L35704m7986
17162E26628k10269n7836p825J92303q2276J38912A15768J65508p2899p577C0067
17150C52170q8251n5080J97753j54532O026a673C95210j75422K0200p7469K98374
17139D60893A87024J71950j3671j11998L5760O1595L9186O6990j50350n1991K74516
17128E09011K16252l19186B00499K21953J47413k04990J01826A64298L71888A40831
17117E12786K35950k97961N5500B12099L21796j72340N8031J61726a3835F82918
$$ plain form
17193 176386 149465 278006 249879 502583 264343 564069 280635 465165 383260 445395
17183 445395 164759 251999 208095 288130 494348 413232 464003 621587 522996 464953 583620
17172 583620 426642 440355 428353 374855 576566 250708 71823 238910 574614 526628
17162 526628 316359 258523 250698 443001 360725 499637 115768 281276 208377 200800 30067
17150 352170 263919 208839 406592 252060 258086 -1673 395210 219788 239988 162519 460893
17139 460893 187024 358974 345303 233305 269065 330660 369846 436836 286486 234495 509011
17128 509011 725263 406077 200499 422452 569865 364875 466701 164298 536186 140831
17117 512786 748736 450775 506275 212099 533895 361555 419586 581312 -13835 682918
17106B88695L34566k60429J80163j48107q4265K23472k64451G5540J44607r753
17096B10394K22978j17044l5831R890J72578J38976k22690o8552K7101r6095K30655
17085D72360R5403O4678B59823L76659J47751j39170k30915L4138J24216j24356
17075D48146l0496L69711j19916l23826K59056j16k01462J79691q7315N3301P5162
17064F21936j88934p5895r4250J61258K32103j20791l9731J37782j78666P7774
17054E32586J09373q6561J17758R537l23317J59022J08529k80427K32831J08712
17044F88043r6827k03477M86948j88562j41524j6300Q1720O0757k66233L47383
17034G51928q4470o9271K49815j61072P9510N0104j00044k60773L83164o9384
$$ plain form
17106 288695 623261 362832 542995 394888 310623 534095 269644 75540 220147 210394
17096 210394 433372 316328 280497 290387 462965 601941 379251 310699 337800 241705 472360
17085 472360 567763 632441 259823 636482 784233 645063 414148 448286 572502 448146
17075 448146 417650 787361 667445 343619 602675 602559 401097 580788 493473 546774 621936
17064 621936 433002 357107 262857 424115 656218 535427 495696 633478 454812 532586
17054 532586 641959 555398 673156 682693 359376 518398 626927 346500 579331 688043
17044 688043 591216 387739 874687 686125 544601 528301 610021 670778 404545 751928
17034 751928 667458 598187 848002 686930 766440 816544 716500 455727 838891 769507
17024G69507o1760j62099R8523J4358L23088m47200J08287M4709j14043J54523
17014G27893j62995K91781k28299J69665J65796j02644k83409L56000l00544J74794
17004H08038m1699C53758M50302j05742j29567J00162m3318Q0335K44679k94863
16994F55746L02310K3197q1675k32832J19133q2777j17923L01156M806j01992
16984G89149n019o447j42583K96473K39493j2294l24063J71051l12208L90013
16974A083565j88383R7036k14868J50194K21331k63021P4209L21810l87481n5312
16964H39080Q6003J27825r3900K30963l31152K50388Q7591J7068j81869j08653
16954I23344L63273j08331k65384K64988k42297N4433n9597J43905o5441L94907
$$ plain form
17024 769507 707747 545648 644171 658529 981617 534417 642704 687413 573370 727893
17014 727893 564898 856679 628380 798045 963841 861197 577788 933788 633244 808038
17004 808038 766339 353758 804060 698318 568751 668913 625595 705930 950609 655746
16994 655746 958056 981253 899578 666746 785879 703102 585179 886335 891141 789149
16984 789149 784130 777683 635100 931573 1171066 1158772 834709 1005760 693552 1083565
16974 1083565 895182 992218 777350 927544 1148875 885854 960063 1281873 894392 839080
16964 839080 925083 1052908 959008 1189971 858819 1109207 1196798 1213866 1031997 923344
16954 923344 1286617 1178286 912902 1177890 935593 990026 930429 1074334 1008893 1403800
16944A403800l42991Q4442l1582o8096R774R9412R6132K50418n3606O05O2617
16933A510925l42747j49643K75650J96501j78001J05041J39524k4573k82928j49854
16923A099895K1771L93372J01710l27914L97408j82583j00277p9791J66532j1998
16913A478125j37114K07485J08486j14153L4297l930L2942k87767M60582o5925
16903A713028n1700K60430k22275K53313p6392Q2109J69889l32653N6357j07306
16893A744800K74438N3554R3754l33226K28191l59771L42227j09100o9763L07817
16883B172921J30339P2773j88740M94360n06557K29134j14040K71386j31513J26268
16873B556331J61230j23928k7517j88600p0909N13554k23971J89228J02717J96913
$$ plain form
16944 1403800 1060809 1145251 1113669 1045573 1055347 1154759 1250891 1501309 1447703 1448308 1510925
16933 1510925 1168178 1018535 1294185 1490686 1312685 1417726 1557250 1532677 1249749 1099895
16923 1099895 1121666 1515038 1616748 1288834 1686242 1503659 1403382 1323591 1490123 1478125
16913 1478125 1341011 1548496 1656982 1542829 1577126 1573196 1606138 1318371 1778953 1713028
16903 1713028 1661328 1921758 1699483 1952796 1876404 1958513 2128402 1795749 1852106 1744800
16893 1744800 2019238 2072792 2166546 1833320 2061511 1701740 2043967 1934867 1865104 2172921
16883 2172921 2303260 2376033 2187293 2681653 2175096 2404230 2290190 2561576 2430063 2556331
16873 2556331 2717561 2593633 2566116 2377516 2306607 2820161 2596190 2785418 2888135 3085048
16863C085048m03822J64412N7571J13696l06080L80775m77610K16830P62268l86434
16853C206654k27511K02731J86148K0667q937o8293l7672j28483L55980j20688
16843C380596J91013J57655M7217J63559J44854r5686K27860J81344m16958L37362
16833D318816n2470k1567M20163J3107p5494M0337j02970J70001L21413J22326
16823E153662J9927N0533J04318j19244M23485j30460P2940M10443k31267L00572
16813F054909J81917k5489Q0100K23086L76562k1512q2425L52396K88371K1709
16803G449624J17288K15858L83275j36902K54058J71692L73757M4029N04522j11914
16793I265287L29460L9728M13954J19970M28560J93103L98831N34877K4673L86357
$$ plain form
16863 3085048 2681226 2845638 2903209 3016905 2710825 3091600 2613990 2830820 3593088 3206654
16853 3206654 2979143 3181874 3368022 3388689 3379752 3311459 3273787 3145304 3501284 3380596
16843 3380596 3571609 3729264 3776481 3940040 4084894 3989208 4217068 4398412 3981454 4318816
16833 4318816 4266346 4244779 4664942 4678049 4602555 4642892 4539922 4709923 5031336 5153662
16823 5153662 5173589 5224122 5328440 5209196 5632681 5502221 5575161 5985604 5754337 6054909
16813 6054909 6236826 6211337 6291437 6514523 6891085 6869573 6787148 7139544 7427915 7449624
16803 7449624 7566912 7782770 8166045 8029143 8283201 8454893 8828650 8872679 9377201 9265287
16793 9265287 9594747 9634475 10048429 10168399 10596959 10790062 11188893 11723770 11748443 12134800
16783A2134800L34379K63372Q39327j94160K19977L70872O79700N32183N18251
16774A5698701J87123M34110Q00700M81435L27847J004380N56674R42659N99788
16765B1033417O23938P99130P76589Q59746J027923J061210Q33058J270302J190281
16756B9475594Q10206J581183J466054J187612J511860J797820J529412J807879
16748D1167620K101480K290689J960265K090478L006301K621485K696033L403116
16740F1337467K864500L447591L664523M263694M075748M278333M508951N321595
16732I3762402N048849N256974O208994N357423N716530O375402N783392O266720
16724A39776686N731821N318469N357853M662129L442315L008242K472375J317894
$$ plain form
16783 12134800 12469179 12732551 13571878 13377718 13597695 13968567 14648267 15180450 15698701
16774 15698701 15885824 16319934 17120634 17602069 17929916 18934296 19490970 20433629 21033417
16765 21033417 21657355 22456485 23233074 24092820 25120743 26181953 27015011 28285313 29475594
16756 29475594 30285800 31866983 33333037 34520649 36032509 37830329 39359741 41167620
16748 41167620 43269100 45559789 47520054 49610532 52616833 55238318 57934351 61337467
16740 61337467 64201967 67649558 71314081 75577775 79653523 83931856 88440807 93762402
16732 93762402 98811251 104068225 110277219 115634642 121351172 127726574 133509966 139776686
16724 139776686 145508507 150826976 156184829 160846958 164289273 167297515 169769890 171087784
16716A71087784l43655k30979j860452k522285l866081m333613m693956n479841
16708A47756922n897528o221055n993662o475489n928171o277889n716432n861527
16700I9385169n147440n495826m746124m915149m240166m138842l679272l936401
16692F3085949l500888l127936k654580k905646k656701k408990k157614k207105
16684D1466489j968489j806243j945284j601735j453962j639049j331283j444428
16676B8276016o26754j915889m10363j229834p94155j153399o74033j020728r64131
16667A9486730m03141o93146l49526r99387m21183p48139l24734o99976n63629
16658A4283869m44196l19761l63954l95196m03190l44057l85414k43182o36566
$$ plain form
16716 171087784 170744129 170513150 168652698 166130413 162264332 157930719 153236763 147756922
16708 147756922 141859394 135638339 129644677 123169188 117241017 110963128 105246696 99385169
16700 99385169 94237729 88741903 83995779 79080630 74840464 70701622 67022350 63085949
16692 63085949 59585061 56457125 53802545 50896899 48240198 45831208 43673594 41466489
16684 41466489 39498000 37691757 35746473 34144738 32690776 31051727 29720444 28276016
16676 28276016 27649262 25733373 25323010 24093176 23299021 22145622 21471589 20450861 19486730
16667 19486730 19083589 18390443 18040917 17041530 16620347 15872208 15547474 14847498 14283869
16658 14283869 13839673 13519912 13155958 12760762 12357572 12013515 11628101 11384919 10748353
16649A0748353l52608j48748o13717r7019l80904K16551n94569J50659p12823
16640H215175j39779m12218J90847j73648m54898r9214K7156l48889l70311j39182
16630F295039K15840k66542J833k74401J28828m95875J48799m07936j69561O6734
16620E242758k84246L5028J7468k51484R284k31815k52098j23104j89575q4179
16610C888037M37142j94675k4714q1834n3917l55472M0654N861j83493J18614
16600C596203j94854j03286J77567m3160l45155R4572j17222L2716q3950o4637
16590B948794j02382J55828j96792m1859K67328j34459m65665m4065J76592j67066
16580B396254K4655L06910m82454J26908j20715L40767j88474k00576P1709K0602
$$ plain form
16649 10748353 10395745 10246997 9633280 9536261 9155357 9371908 8777339 8927998 8215175
16640 8215175 8075396 7663178 7854025 7680377 7225479 7126265 7153421 6804532 6434221 6295039
16630 6295039 6510879 6244337 6246170 5971769 6100597 5604722 5753521 5345585 5176024 5242758
16620 5242758 4958512 4993540 5011008 4759524 4768808 4536993 4284895 4161791 3972216 3888037
16610 3888037 4325179 4130504 4105790 4023956 3970039 3614567 3655221 3661082 3477589 3596203
16600 3596203 3401349 3298063 3475630 3432470 3087315 3181887 3064665 3097381 3013431 2948794
16590 2948794 2846412 3002240 2805448 2763589 3030917 2896458 2430793 2386728 2563320 2396254
16580 2396254 2420909 2727819 2245365 2372273 2251558 2592325 2403851 2203275 2274984 2295586
16570B295586k30790l06851K65000J71977j16844p6443Q6591l55162L52899j66700
16560A919263k0601k17583J5850K46945j52170j53628o5958o3205j53926L06975
16550A661962j2224k62227K76254J60084j90609j48214J71175j86933k84473K29622
16540A414417J69775k95203K5730m4782O6861r691j29269J01383o3915o1398L18832
16529A492740m08640k2567N2506j46461J29400P211J45587l18316J34047K2533
16519A088040k39206Q8229K7394k14079J80377n5671J62154J72456k21550j85993
16509H02151M16221k81834j58557o7751J47159k55488K64768J2004J97863l24093
16499G52443p5833J65825K826M740k63838r6838K13185J27807q9521K2797o8934
$$ plain form
16570 2295586 2064796 1757945 2022945 2194922 2078078 2001635 2088226 1733064 2085963 1919263
16560 1919263 1898662 1681079 1696929 1943874 1791704 1638076 1572118 1508913 1354987 1661962
16550 1661962 1649738 1387511 1663765 1823849 1633240 1485026 1656201 1469268 1184795 1414417
16540 1414417 1584192 1288989 1314719 1269937 1336798 1327107 1197838 1299221 1235306 1173908 1492740
16529 1492740 1084100 1061533 1114039 967578 1096978 1104189 1249776 931460 1065507 1088040
16519 1088040 848834 937063 964457 750378 930755 875084 1037238 1209694 988144 802151
16509 802151 1218372 936538 777981 710230 857389 601901 866669 878673 1076536 752443
16499 752443 676610 842435 845261 850001 586163 489325 702510 830317 740796 763593 694659
16488F94659K84681l55811L31397j32128j8504n1430N9988M2400j24898J19251
16478H49605j39867j1692r1017Q8928j94751j2051p6616K69986j3270r7532j65835
16467D05888L53798l12654J06038j69372J06424L56064J4658k64379J78635J0907
16457G86007r6301m4077M3848l11098R5704K0154j71418M86226k66049r0630A02705
16445E68565B65135K31594o1104n5771r1563L80174j22016q3766J23753j79667
16435D06769J33741J59054r274C08639J42822K28572j59740j14084q8475J13204
16425D30938L1728A78838L10064m5648l3094R0036j13120J45148j82819K32352
16415E81757j08422m4164M1488M711J657J31190j80665K35346B54484M8572J58999
$$ plain form
16488 694659 979340 623529 954926 822798 804294 752864 812852 855252 730354 849605
16478 849605 709738 698046 607029 695957 501206 489155 412539 682525 669255 571723 405888
16467 405888 759686 447032 553070 383698 490122 846186 860844 596465 775100 786007
16457 786007 689706 645629 689477 378379 474083 494237 322819 809045 542996 452366 102705
16445 568565 265135 496729 435625 379854 288291 668465 546449 462683 586436 406769
16435 406769 540510 699564 690290 308639 451461 680033 520293 406209 317734 430938
16425 430938 462666 178838 488902 443254 410160 500196 387076 532224 349405 581757
16415 581757 473335 429171 470659 475370 477027 608217 427552 662898 254484 303056 462055
16404D62055k1116E9281J63145O1273J56328r1639A40375h6530F86692N4778B13894
16392E18895j62013O2027K27084k88168p2863A17830J43248c0791j29676B62153
16381B22509E619L18354P4269A29532L07538L164p2760A208K76309E6783e7494
16369B21776O0310b02383B61055q976O6282j2869f136C11352g4092A78590K18323
16358C96913A72705Q6988n9540J19730j19117j244m2799O8358K05720n1901A86717
16346C55137n3204P3296j86388O1570K11448A98569B7194O0881l752J00311K05509
16335C90143r2002r4052k2470i6100A11367b5055B6732J96053G6959c573B17080
16323D32506E3887f4164B33543D7246c5182j8476B52771K9414A21297E4449c0983
$$ plain form
16404 462055 440939 59281 222426 283699 440027 348388 140375 -86530 686692 741470 213894
16392 518895 356882 418909 645993 357825 284962 117830 261078 -30791 -160467 262153
16381 222509 5619 323973 398242 129532 437070 440234 367474 1208 277517 56783 -57494
16369 221776 282086 -202383 261055 252079 318361 305492 -6136 311352 -74092 178590 396913
16358 396913 172705 259693 200153 319883 200766 199522 156723 225081 430801 378900 186717
16346 355137 301933 375229 188841 250411 461859 198569 27194 88075 84323 184634 390143
16335 390143 298141 204089 181619 -96100 111367 -25055 26732 222785 76959 -3573 217080
16323 432506 53887 -64164 233543 47246 -35182 -53658 252771 282185 121297 54449 -30983
16311A25826R818J11083E1714L97179q9122G41b01651B6086c4161I5621J83138
16300B78759f061B7619J58345n8596n282K57024A68256a81526r7482A15645b56431
16288g9667C79349F6822K3296b01199h3036B68145H3524o124R7299J78999a08862
16276B87970m7731a33135G4594g8710B60206n5965P0952a27658J8263A17675L34764
16265D52439B07238b3438D27058j52867A03306j0064c49302A56819p5008M4444
16255A26255Q6227j03127i391B07180f3996A95527b55035q2651A31903K5529c0747
16243C11657n3716J3695e0499j25665C59605b7266C60820q8090n9015l2407b0233
16231b8762A39051a88783c2886B02674a32530N7291D48737A19715a94747l3839
$$ plain form
16311 125826 135644 246727 51714 448893 359771 741 -201651 26086 -34161 95621 278759
16300 278759 -6061 27619 185964 127368 122086 379110 168256 -181526 -279008 115645 -256431
16288 -79667 379349 66822 90118 -201199 -83036 268145 83524 77400 174699 353698 -108862
16276 287970 240239 -133135 74594 -78710 260206 204241 275193 -127658 -109395 117675 452439
16265 452439 207238 -23438 427058 274191 103306 93242 -349302 156819 81811 126255
16255 126255 212482 109355 -9391 207180 -63996 195527 -255035 -337686 131903 157432 -30747
16243 311657 257941 271636 -50499 -176164 359605 -27266 360820 272730 213715 181308 -20233
16231 -28762 139051 -188783 -32886 202674 -132530 -75239 448737 119715 -194747 -228586
16221b28586e2722C3759P5289L1542N0631D918P2573J84605B1638L02305j04600
16210B19343E3352L77383b9159q209A11825M3484c6728G7415b2744D57379B2552
16198A12516K6528o1493O327M1991m2266b23219D270R4691b85245B3325J30319
16187A53644R1370b77852G307J04385J68160E4386i3240l575B14382j00667A7600
16175A11015a93566f0350k25629b2594p2865F4586j7860K590K16247B2640J33575
16164A56215P5109b71D24852a0601E2424o954r753b79714J6857F4770e3790k1252
16152g5042A98101g6088r5030C20122j16869a85775I500J65465b48099J08041
16142a40058l1545A6208e34o3156a6330j26516E2037J88713q6278g5833H4938
$$ plain form
16221 -228586 -52722 33759 109048 140590 191221 4918 77491 262096 21638 323943 219343
16210 219343 53352 430735 -29159 -37368 111825 155309 -36728 77415 -22744 457379 22552
16198 112516 139044 77551 83878 125869 83603 -223219 4270 98961 -285245 23325 153644
16187 153644 245014 -277852 7307 111692 279852 54386 -93240 -96815 214382 113715 17600
16175 111015 -193566 -60350 -285979 -22594 -95459 64586 46726 49316 265563 22640 156215
16164 156215 231324 -271 424852 -10601 52424 45470 35717 -279714 -262857 64770 -53790 -75042
16152 -75042 198101 -76088 -171118 320122 203253 -185775 9500 174965 -248099 -140058
16142 -140058 -171603 16208 -534 -63690 -16330 -142846 52037 240750 154472 -75833 84938
16130B85604o5939b48691a14552k24266h0914L8175n9973J2051k62634h3600j03294
16119a86894e3643B90939a71588k34416H6539J02643a92595c5800B38613b48838
16108b40280b043j40272F1134J25863l6922K78187a12740d7468D67325j96740
16098B70585c20810F4132K15661q6069q5629c3583A06141M2596a64143A04153
16087b06706A56664a9469A2751d6276A47939g6148k1806A60319a80938A14630
16076e0464k82939B43823D8893g017A77460p5939b23773M284B56399D3426J76118
16065B19544A08686l7032a12083k36487B96567b16845C3327j4242b36056A2546
16054C4923J18736o8682b93525J19747d3003B8933c60835J72758N2210F4320L3953
$$ plain form
16130 285604 219665 -248691 -114552 -338818 -80914 -42739 -102712 -90661 -353295 -83600 -186894
16119 -186894 -53643 290939 -171588 -406004 86539 189182 -192595 -35800 238613 -248838
16108 -240280 -2043 -142315 61134 186997 150075 428262 -112740 -47468 467325 270585
16098 270585 -320810 64132 279793 193724 108095 -33583 106141 148737 -164143 104153
16087 -206706 156664 -19469 12751 -46276 147939 -76148 -97954 160319 -180938 114630
16076 -50464 -333403 243823 48893 -7017 177460 101521 -223773 -219489 256399 43426 219544
16065 219544 108686 71654 -112083 -348570 296567 -216845 33327 19085 -236056 12546
16054 34923 153659 84977 -293525 -173778 -43003 28933 -360835 -188077 -135867 64320 98273
16043I8273m5464J24235H4469q591h2379m9946B85i1376G6005B9989a37353B44260
16030B60595a42909d6083p2905E828a03254o9600f9051j2873H5904a04355r1414
16019a95769I7869d01212g5969C4323a8983j1126j12533A55775a48946f7102k49903
16008c17005C19744d6638q6492j81403B78171a5463j11514q9794A59367c2040
15997B4903b81324R5085l6837O4843b998n3474k7140A20358J04838E4711a73392
15985c36A41336J49140m2622A14753P1873k2178K67707A72004Q9268i7477J1571
15974h5906f993j78437G7319l1217a05226C6139c16139j47984e1406j02845l9216
15963a93467D97454k33592A16687n6813M0080C5085a00161L4964J607q2822C18810
$$ plain form
16043 98273 52809 177044 84469 75878 -82379 -132325 285 -91376 76005 29989 -137353 244260
16030 260595 -142909 -46083 -118988 5828 -103254 -172854 -69051 -81924 85904 -104355 -195769
16019 -195769 97869 -401212 -75969 34323 -18983 -30109 -142642 155775 -148946 -67102 -317005
16008 -317005 319744 -46638 -133130 -314533 278171 -15463 -126977 -216771 159367 -32040
15997 24903 -281324 -186239 -223076 -158233 -2998 -56472 -83612 120358 225196 54711 -173392
15985 -336 141336 290476 247854 114753 186626 164448 432155 172004 261272 -97477 -85906
15974 -85906 -6993 -185430 77319 46102 -105226 36139 -316139 -464123 -51406 -154251 -193467
15963 -193467 497454 263862 116687 59874 99954 35085 -100161 -65197 -63590 -146412 318810
15951b4473k56165M0914C16081a00212B08014a64548N1754E3966j519c3142I1430
15939A12259k3587f5601k18110b9618A63534b85471N8447l751L2766B1180b19637
15927B3200J30270a27225O1495C9471L0088J17659c19652J47104C33310H7744
15916C0931d782p8376C7362a56923D2838c28337J56994I4244a21217o9678e8953
15904b326j12140J9942B36108d9892m0683B02795b34744H2253a59933j22853j00982
15893c83768J11728h0410p5400E9397a03391A65573K938D8380B0912L21368q8044
15882B54236D5529i2940E990b27493M5397E2524a47212B18109e6648l1807L9418
15871d9037j97675f241o0952H5353I055a54131p5487C6174K5140a10846g888A44333
$$ plain form
15951 -24473 -280638 -239724 316081 -100212 208014 -164548 -112794 53966 52447 -33142 91430
15939 112259 88672 -65601 -283711 -29618 163534 -285471 -227024 -230775 -198009 21180 -219637
15927 23200 153470 -127225 -65730 39471 69559 187218 -319652 -172548 333310 87744
15916 30931 -4782 -83158 37362 -156923 42838 -328337 -171343 94244 -121217 -190895 -58953
15904 -2326 -114466 -94524 236108 -49892 -90575 202795 -234744 82253 -159933 -282786 -383768
15893 -383768 -272040 -80410 -155810 59397 -103391 165573 168511 48380 20912 342280 254236
15882 254236 45529 -92940 5990 -227493 -182096 52524 -147212 218109 -56648 -88455 -49037
15871 -49037 -246712 -6241 -67193 85353 9055 -154131 -229618 36174 61314 -110846 -7888 144333
15858G082L0571J07547a28825C40589j40795a14419C1245K6581D813K45297B9302
15846b26752j18528I5650b9552k40460g7851j69087B00160B7637K15995o4962
15836A78670e505p9574r3130M3514B86319b06035j19O1908A10550C7877K60788
15825B98665b9822m7597A06816g7965a4274B7898a59325C4422J7224d0065B21291
15813E9826c21237B1242G987P9188e12686a86887h1353q3129P9877E7335M1362
15802I8697b0138B96982D288M0068A8435e34965A84048h2160L0099n7650j18565
15791b28276A45766a73111A70099a34896r6516b1814E0187c40445A41221D5505
15780B43231I4544j2183c30498b6251A8582O9714j7305a73837g5041B60243H3758
$$ plain form
15858 7082 37653 145200 -128825 340589 199794 -114419 31245 57826 4813 250110 29302
15846 -226752 -345280 95650 -29552 -270012 -77851 -246938 200160 27637 243632 178670
15836 178670 -5505 -85079 -178209 -134695 286319 -206035 -206154 -144246 110550 37877 298665
15825 298665 -29822 -77419 106816 -77965 -14274 27898 -159325 34422 51646 -40065 221291
15813 59826 -321237 21242 7987 87175 -512686 -186887 -81353 -164482 -84605 57335 98697
15802 98697 -20138 296982 4288 44356 18435 -534965 184048 -82160 -52061 -109711 -228276
15791 -228276 145766 -173111 170099 -134896 -231412 -21814 50187 -340445 141221 45505
15780 243231 94544 82361 -330498 -26251 18582 88296 70991 -173837 -75041 260243 83758
15768b57278l31292C3755h8349c203C08468A44901L2808a01345D0089a95672H7781
15756b14813D35410j89577b42108d7967A48494d56218b2359G348g1814A5231i2535
15744e7809A02606f8751j973A5761Q7437a96226l11135e8585a5606r7953L1533
15733h2026p2524Q521B00924H3943a98965B80931A0746a47802A87471E3552a56878
15721a20613N1471o8893G7457R4416o2940a45855e186k8046l2848C26176p7036
15710B49140d0303j33336c7826l57811a37040A3533a72437f0411A13430n0825
15700F2605g4658K6573F7677B0600P4027a17668b1419A99279d69009a42331A73612
15688b926A12156J2450e7618q0849n8151F6882a14877j07023F2739h2727j3313
$$ plain form
15768 -257278 -588570 33755 -88349 -3203 308468 144901 177709 -101345 40089 -195672 87781
15756 -214813 435410 245833 -242108 -47967 148494 -456218 -22359 7348 -71814 15231 -92535
15744 -57809 102606 -68751 -70724 15761 103198 -196226 -507361 -58585 -15606 -113559 -82026
15733 -82026 -154550 -146029 200924 83943 -198965 280931 10746 -147802 187471 53552 -156878
15721 -120613 -69142 -138035 77457 171873 108933 -145855 -5186 -33232 -66080 326176 249140
15710 249140 -40303 -173639 -37826 -395637 -137040 13533 -172437 -60411 113430 62605
15700 62605 -74658 -48085 67677 20600 94627 -117668 -21419 199279 -469009 -142331 173612
15688 -2926 112156 124606 -57618 -138467 -196618 66882 -114877 -221900 62739 -82727 -96040
15677i6040B42238B0308c38777E1666b25115A20090g1831A53593k1433l9112K8415
15666A21463e3833A79219K5375b57278C6690k017e4564A39753k6635a22347G8438
15654D2358R9843d253j3128m05647a10061F0010a4674m5355D9996A2013J29382
15643A41395a2905I8671b47648A78235a04791G1996k9314m355a67524d6035m7595
15632i3630A0416g8357j00786A50307a15615C7226K66800A03154a18376A46329
15621A96041B0970b16278a3719j21538F667a46857r0607e1684j73230a10526o915
15610a17441N2732A17918i0513k23970k3589L5538B51207N5457a20945E29744
15599a71188D5598b64094L5467C58785A46091c78092A57152D7152b1920A00183
$$ plain form
15677 -96040 242238 20308 -338777 51666 -225115 120090 -71831 153593 132160 93048 121463
15666 121463 -53833 179219 204594 -257278 36690 34673 -54564 139753 113118 -122347 78438
15654 42358 142201 -4253 -17381 -423028 -110061 60010 -14674 -60029 49996 12013 141395
15643 141395 -12905 98671 -247648 178235 -104791 71996 42682 38327 -167524 -46035 -93630
15632 -93630 10416 -78357 -179143 150307 -115615 37226 304026 103154 -118376 146329
15621 196041 20970 -216278 -13719 -135257 6667 -146857 -237464 -51684 -224914 -110526 -117441
15610 -117441 -64709 117918 -90513 -314483 -338072 -302534 251207 306664 -120945 529744
15599 -171188 45598 -264094 -228627 358785 146091 -378092 157152 47152 -21920 100183
15588e721A23717C682P1117d80658C33949a18414i633A42466a62592A19016b72309
15576d7454B1227c51129e6972A81068o194a27241O2135j37121A57553J2355B6448
15564e765k8751A82785e7697E270K0756b38804L6378A3707a01540j33022B85135
15552c26972E6027a13926B60184g925k9307q239C13373b78110b7102D3130J34231
15541A77361d4747k9566j30662M6010m3096k31343a25710e7245B06029q9489I296
15529C06660d4477h325A07412a89261H6391J8896J98874a5852r327I9224c78289
15517c41707R4783k40972C10335A32698D9423a12014L8349A22953a96844j0218
15507b07062A77530a1766A30899j3373E8192e4282C16655q1580J59116a06767
$$ plain form
15588 -5721 123717 3682 74799 -480658 333949 -118414 -9633 142466 -162592 119016 -272309
15576 -47454 21227 -351129 -56972 181068 174874 -127241 -65106 -202227 157553 169908 26448
15564 -5765 -34516 182785 -57697 5270 26026 -238804 -202426 13707 -101540 -234562 285135
15552 -326972 56027 -113926 260184 -7925 -37232 -45471 313373 -278110 -27102 43130 177361
15541 177361 -44747 -74313 -204975 -158965 -202061 -433404 -125710 -57245 206029 116540 9296
15529 306660 -44477 -8325 107412 -189261 86391 105287 304161 -15852 -25179 99224 -378289
15517 -341707 -246924 -487896 310335 132698 49423 -112014 -73665 122953 -196844 -207062
15507 -207062 177530 -11766 130899 117526 58192 -54282 316655 235075 394191 -106767
15496a68578b0465r2088c4830D8749a85774l3183B05717a95957E5268J06167b38194
15484c46173B896d2878m4545B33000j06868q403g5434I2927Q8223a71282O6653
15473a04629b5100A06839a41623B09360d7312j10969N8078C12722A50861f7869
15462C75630j83485p2406c24446A90901J42494C6105R3045R1241b5213C76039
15451B11365a20015A16548g3983b6281k3610k84853a14030k45172a72249k0389
15441a92638d0309A84581q6545i3630M2101B11972I391g5905E3862L45784a4558
15429A77565n4546g2678k15980A29503a28311G0870C2131a49203j3884J9247b7531
15417A36337d9105m4859A08217d9884A51427o1448K183L2899J54586B6047a53439
$$ plain form
15496 -168578 -20465 -112553 -34830 48749 -185774 -218957 205717 -195957 55268 161435 -238194
15484 -346173 2896 -42878 -87423 233000 126132 117729 -75434 92927 181150 -171282 -104629
15473 -104629 -25100 106839 -141623 209360 -47312 -158281 -100203 312722 150861 -67869
15462 375630 192145 119739 -324446 190901 333395 36105 129150 220391 -25213 376039
15451 211365 -120015 116548 -73983 -26281 -49891 -334744 -114030 -359202 -172249 -192638
15441 -192638 -40309 184581 98036 -93630 -51529 211972 9391 -75905 53862 399646 -14558
15429 177565 123019 -72678 -288658 129503 -128311 70870 32131 -149203 -163087 -143840 -27531
15417 136337 -49105 -93964 108217 -49884 151427 89979 92162 125061 279647 26047 -153439
15405F6315e0506C40434e256k1713j14158F5426b10880m7544C09303b13682m5955
15394b59637B00102a67154b0745g148B1949O3656a55700A22401J34383b51666
15383B31491a36019L6033B84157f2685p9441K9102j0163F2166I820K9089d4274
15371e4745A17628P1290F7161K27582c07045d3269j036A25082d5154J9782j9522
15360d4894D46284g4832A16914K09052a05915n0248C5588c43602A9162a0670A5003
15348a2135A34359a18757n9219I7737i1721k6646A33830a28727b864j39100F8563
15336g0379A73622C7135g3308A09621f1311D9981J46529I6471J44590G2553h5947
15324i5604B40297a97261A17510B8981O2414K82384a80530o5663g4495L0248k76023
$$ plain form
15405 66315 -50506 340434 -5256 -26969 -141127 65426 -210880 -258424 309303 -213682 -259637
15394 -259637 200102 -167154 -20745 -7148 21949 85605 -155700 122401 256784 -251666
15383 231491 -136019 -99986 284157 -62685 -142126 -113024 -123187 62166 9820 38909 -44274
15371 -54745 117628 188918 67161 294743 -307045 -43269 -44305 125082 -45154 -25372 -44894
15360 -44894 446284 -74832 116914 325966 -105915 -156163 35588 -343602 19162 -10670 15003
15348 -12135 134359 -118757 -177976 97737 -91721 -118367 133830 -128727 -2864 -141964 68563
15336 -70379 173622 37135 -73308 109621 -61311 49981 196510 96471 241061 72553 -85947
15324 -95604 240297 -197261 117510 28981 91395 373779 -180530 -246193 -74495 -44247 -320270
15313c20270j7239A12004c1729C62348A76248D4091K94240b14574B5826a48783
15302a40097H8199b97276b2783C2625O9438K7612K83360j82926a5816B00023K34629
15291D34652F1293j1496J14338c3875j84355F0232J99203F7522J54078a23020
15280h1791B22452M268A09601J55006A8806J77038B6176a93175A0094K11440p0973
15269A50561m2737M0885l1390K94021L8033c0049G7902k4848M6501K6052J08717
15258B34324E286J12688L8555J6849p8855J72948L6789P7268B6138K66960K9689
15247C22787L86147J093549q78578M48402l6654E69882B26454L5581B1587a22083
15236b29179b3027A79523a17137A60728A9649a24165B56661b7525F9243J70326
$$ plain form
15313 -320270 -337509 112004 -31729 362348 176248 44091 338331 -214574 25826 -148783
15302 -140097 88199 -297276 -22783 32625 102063 129675 413035 230109 -15816 200023 434652
15291 434652 61293 49797 164135 -33875 -218230 60232 259435 67522 221600 -123020
15280 -81791 222452 226720 109601 264607 18806 195844 26176 -193175 10094 221534 150561
15269 150561 107824 148709 117319 411340 449373 -30049 77902 53054 99555 125607 234324
15258 234324 5286 117974 156529 173378 94523 267471 304260 381528 26138 293098 322787
15247 322787 708934 1802483 923905 1372307 1335653 569882 226454 262035 21587 -122083
15236 -229179 -23027 179523 -117137 160728 19649 -124165 256661 -27525 69243 239569
15226B39569I8358a65422f2919A9907c28392B80750a13414A22397A2251a97514
15215B5203d4766C38329A60439a0672E2985a9962B91357a06559E3992R6721p2777
15204G7936P93C2225J68242c0836A99437H5676L33452b19715A18215n2686b60615
15192c15887a31089E8429J84233C348L2681F260N2596g4605E2343J66871c7761
15180b88707A86124B3341g8121k7333C66646c74415A99323o7115j3688Q1075A9658
15168A54352O517N3087l0101H9496L1997b65212B61269B6812R829J58236a44289
15156C5156D38M00719b01013B22915F4046P7715H359a5710p0960D34208a22643
15144C88636c5640A01763B3745J47917a05254A90959C1328J51891a9053E8068
$$ plain form
15226 239569 98358 -165422 -62919 19907 -328392 280750 -113414 122397 12251 -197514
15215 25203 -44766 338329 160439 -10672 52985 -19962 291357 -106559 53992 150713 77936
15204 77936 78729 32225 200467 -30836 199437 85676 419128 -219715 118215 65529 -260615
15192 -315887 -131089 58429 242662 3348 36029 6260 58856 -74605 52343 219214 -37761
15180 -288707 186124 23341 -78121 -105454 366646 -374415 199323 132208 118520 199595 19658
15168 154352 160869 213956 183855 89496 121493 -265212 261269 26812 36641 194877 -144289
15156 35156 438 401157 -201013 222915 64046 141761 8359 -15710 -86670 434208 -122643
15144 388636 -35640 101763 23745 171662 -105254 190959 31328 183219 -19053 58068
15133H5376A0294P3606O8506J19317a6176k8512D01032C6070K33504C7593b03162
15121A13777Q440E8926J55323B3050K27524I2732K1291C4871J16105o2417F958
15109b01996A57432K35863b7187B15310l3636p6717g4674E449M26753e30A72826
15097D33693A99243K039J23983j07263b21476B48010A2910L83898G3865A605O0911
15086F2516K21896C2004j4280J36092K07886g752p0755B12178l5766I128L56882
15075C66010j64313A4885Q0418j7677d1358B75976G340e173B87215f9521A40509
15063H2347A3605a9357B58052G5835M29708I7758M12084B14368b1458B81781a12400
15051G0559B2839J19365j4553M77550E8917Q3719n6137j3908A9894J14478n9907
$$ plain form
15133 85376 10294 83900 152406 271723 -16176 -44688 401032 36070 269574 37593 -203162
15121 113777 122217 58926 214249 23050 250574 92732 114023 34871 150976 88559 6958
15109 -201996 157432 393295 -27187 215310 181674 104957 -74674 5449 432202 -530 172826
15097 433693 199243 201282 325265 218002 -221476 248010 12910 396808 73865 1605 62516
15086 62516 284412 32004 17724 153816 361702 -7752 -78507 212178 176412 9128 366010
15075 366010 201697 14885 95303 77626 -41358 275976 7340 -5173 287215 -69521 140509
15063 82347 13605 -19357 258052 75835 505543 97758 509842 214368 -21458 281781 -112400
15051 70559 22839 142204 127651 605201 58917 142636 86499 72591 19894 134372 74465
15040G4465J63997l9758H4259b32763D23531H6432L36942a06925B17842C6373
15029A24314K12629I3605J73786B1453a48971A27275K0421E0849J29466E5194
15018F2493f6524k9846C39579G2503J71022k5656k1363O2459b7539I4865O5192
15007A60057k5939h2142B65666j18635B5934P0912J37572R3920l3001j1778R3787
14996C77346M3688A77195a5942B46991n2896b127B55025L4759N2110A39663J53561
14985B93224c4557c618A772L31954K04376A37201L18337B10944r0470J79370F7402
14973A34891k9334J63445J85043j7889B894K71293A15759o880J48058n2375D619
14961B98433A13983L5282K2591N0080A02822J99445j2232J53497q4704f5114A89476
$$ plain form
15040 74465 238462 198704 84259 -232763 423531 86432 423374 -106925 217842 36373
15029 124314 336943 93605 267391 21453 -148971 127275 147696 50849 180315 55194
15018 62493 -66524 -96370 339579 72503 243525 217869 196506 258965 -27539 94865 160057
15007 160057 134118 -82142 265666 147031 25934 96846 234418 328338 295337 283559 377346
14996 377346 421034 177195 -15942 246991 194095 -2127 255025 289784 341894 139663 293224
14985 293224 -34557 -3618 1772 333726 538102 137201 455538 210944 120474 299844 67402
14973 134891 105557 269002 454045 436156 2894 274187 115759 108879 256937 204562 4619
14961 298433 113983 149265 171856 221936 102822 302267 290035 443532 358828 -65114 189476
14949D05579O0831j92475g7483B90640J67223H7766k1522J89343L3717j38914
14939A50390n9169J32922J54523f923A08975L7612L68804A8841g208A86562J60051
14928C46613j1468J97015J12243l11652K24645j81017G7327K41047b34751E79712
14917A72722H5748j077N10161k47924J72807k16042f3800C23871H6522h027C23065
14905A74746L2937p7261M07466B57075J65073f5277C87363j41592J76134A96659
14894D09638j33608K47808j61633A35021K10029D1717K17496K16729m4905A78546
14883B85408K38557B29175K086J30027a4618B86807f774D05271n8484J03496j84650
14872B65633J44800j12791m2845N3979K28564D6427K77740m3758K77706j73810
$$ plain form
14949 405579 466410 273935 -77483 290640 457863 87766 66244 255587 289304 150390
14939 150390 91221 224143 378666 -6923 108975 146587 515391 18841 -7208 186562 346613
14928 346613 335145 532160 644403 332751 557396 376379 77327 318374 -234751 579712
14917 172722 85748 84671 594832 346908 519715 303673 -63800 323871 86522 -8027 323065
14905 174746 207683 130422 537888 257075 422148 -65277 387363 245771 421905 196659
14894 409638 276030 523838 362205 135021 345050 41717 259213 475942 431037 178546
14883 285408 523965 229175 231261 361288 -14618 286807 -6774 405271 346787 450283 265633
14872 265633 410433 297642 254797 308776 537340 46427 324167 280409 558115 384305
14862C84305J19631G5580L73344B02275M51276j21055j17541N2293N0895J23236
14852F41379p8505B73487R0918P39K47264A75519O2571L0736O9983K06602L6750
14841E82161k35637k7940J47817j90634o2468J98034r1280M82770B12400N9799
14831B72199R56J95703o0281L58570C63469K79443k83483j960P0750A28784L69046
14820D97830j1829n4450J43291j95350K19736M6118B20852L10213k63367J43909
14810D11607J14256L4978n1768n8845K9192L4568A35765N5547K47914j12725J83525
14799E10026j59563J33276j71301K08042p4403o6703J59185O5540J53167k85299
14789D71967q4721J65261k48005L13267j43383K37061j12783l1940K71549k62803
$$ plain form
14862 384305 503936 75580 448924 202275 653551 532496 414955 467248 518143 641379
14852 641379 562874 273487 364405 365144 612408 175519 238090 268826 338809 545411 582161
14841 582161 346524 318584 466401 275767 213299 411333 320053 802823 212400 272199
14831 272199 273155 468858 408577 767147 363469 642912 359429 357469 428219 128784 497830
14820 497830 486001 431551 574842 379492 599228 645346 220852 531065 267698 411607
14810 411607 525863 560841 509073 450228 479420 513988 135765 191312 439226 326501 510026
14799 510026 350463 483739 312438 520480 446077 379374 538559 604099 757266 471967
14789 471967 387246 552507 304502 617769 474386 711447 598664 566724 838273 575470
14779E75470k41693M6696r7331J72809j60348M32916K95741k12729k86376n2751
14769D72404K84776r9435M5496j42823o826j12050J25635j27844J0120L0197j89424
14758B90226K06692j6451M8140K7062r8125N3459K42607l9302L99217m92989M02245
14747A022781k79421O8569k27520j93238K85549r8107N3376J11635M7822j34880
14737F56566k90480K1125L50027j67725L49230l40132M0062l6340K68291R2617
14727I43241D52218r4414L26648L6450j65600K5307N18975m61415J32244j30014
14717F40399J77880r9414r2029P8033Q2985n4422K03508k69433k18366J7867L69910
14706H36918k23178J04759J83285j36723P593O0400j07189K68024m38760K21878
$$ plain form
14779 575470 333777 380473 283142 455951 295603 728519 1024260 811531 525155 472404
14769 472404 757180 657745 703241 560418 553592 441542 567177 439333 449453 479650 290226
14758 290226 496918 480467 528607 555669 457544 511003 753610 714308 1113525 620536 1022781
14747 1022781 743360 811929 584409 391171 676720 578613 631989 743624 791446 656566
14737 656566 366086 387211 737238 569513 918743 578611 618673 582333 850624 943241
14727 943241 452218 357804 684452 720902 555302 580609 1099584 638169 770413 640399
14717 640399 818279 718865 626836 704869 787854 733432 936940 667507 449141 467008 836918
14706 836918 613740 718499 901784 765061 772654 833054 725865 993889 555129 777007
14696G77007j03873K3353l6279K48435N9347k34171K65247l86733K45242J33599
14686I91174J47442j52067J65260j77198j65154K70277j18810j01545q5070K82845
14676A057154k90842K87117j30005l5172k5723j63503O2924J63461R552r4111
14666H40852n4252L03696k43547J93896k94945M87938k47405J79257K00409j72121
14656A193778j95073K72657k65704L45963k51163k36201K84786k55751K11006
14647A104298k00567N45542k58618l0102l69158M83901J31495q7568L7750m69844
14637H87129M8043O35370l51301j89407Q3213J80265J6234J16351j01645l32054
14627I92198J51248K58693k37978j03965L94353j28408l22688M34182o0423L18439
$$ plain form
14696 777007 673134 696487 660208 908643 967990 733819 999066 612333 857575 991174
14686 991174 1138616 986549 1151809 974611 809457 1079734 960924 859379 774309 1057154
14676 1057154 766312 1053429 923424 888252 862529 699026 761950 925411 934963 840852
14666 840852 786600 1090296 846749 1040645 745700 1233638 986233 1165490 1365899 1193778
14656 1193778 998705 1271362 1005658 1351621 1100458 864257 1149043 893292 1104298
14647 1104298 903731 1449273 1190655 1160553 791395 1275296 1406791 1319223 1356973 887129
14637 887129 935172 1570542 1219241 1029834 1113047 1293312 1309546 1425897 1324252 992198
14627 992198 1143446 1402139 1164161 1060196 1454549 1326141 1003453 1437635 1377212 1695651
14617A695651k04301k07869O6554K58514Q3479j62005p3243k80201K72300l501
14607A445378l6338K19493r4513j85493o037j6584K29319l26996K04205M5156
14597A477590K78887j43609J62049m03700J22779l8081J49744q4746J66033k12016
14587A474930N262Q0336K66567j68767j135J35712J50041m62417J9741K75133
14577A775403j07087K4924P5845k45297N56887k80808L77664l09703L18476j30687
14567B055617k70438M72474p0125J61001m96238M54539j11493o555J41565K38995
14557B569342K5853J16528K31840l1956O05685P6929O48380Q04471J783189M204161
14547A1034422P562003K0284480O538141A7054692p771683l423634k815008o62812
$$ plain form
14617 1695651 1491350 1283481 1350035 1608549 1692028 1530023 1456780 1176579 1448879 1445378
14607 1445378 1409040 1628533 1534020 1348527 1342490 1325906 1555225 1228229 1432434 1477590
14597 1477590 1756477 1612868 1774917 1371217 1493996 1455915 1605659 1520913 1686946 1474930
14587 1474930 1480192 1560528 1827095 1658328 1657193 1792905 1942946 1480529 1500270 1775403
14577 1775403 1668316 1693240 1769085 1523788 2080675 1799867 2177531 1867828 2186304 2055617
14567 2055617 1785179 2257653 2187528 2348529 1852291 2306830 2195337 2188782 2330347 2569342
14557 2569342 2595195 2711723 2943563 2911607 3517292 3594221 4242601 5047072 6830261 11034422
14547 11034422 18596425 38880905 45419046 17054692 9283009 5859375 3044367 2381555
14539B381555l28555l77300l24185L85068J15631j36679j5533K87864k15816R8767
14529A870817P4847P2456o3922R2207j58440J49175L10726j95775k88170L20383
14519B184304J25741j60108p3564L64551J92917l93073M9783O8339o3174r5586
14509B200130O71293m99581L56254j42762L14960m19154J31K62438K81653k24581
14499B800781M49858l27064j12235K30193K84355k93568p9980L4568O632j93294
14489B800246K48423J77228K47690j73975Q8438j1938K74818k76793o0793J60823
14479C474167J41689P3579k70304J84030L26089k5654k18187K14629P937L17141
14469D225116j96664N1584k43406J64067p0850n7405N23090k89024L53276k76079
$$ plain form
14539 2381555 2053000 1675700 1351515 1736583 1852214 1715535 1700002 1987866 1772050 1870817
14529 1870817 1945664 2018120 1954198 2046405 1887965 2037140 2347866 2152091 1863921 2184304
14519 2184304 2310045 2149937 2076373 2440924 2633841 2240768 2290551 2358890 2295716 2200130
14509 2200130 2871423 2371842 2728096 2585334 2900294 2481140 2481271 2743709 3025362 2800781
14499 2800781 3250639 2923575 2811340 3041533 3325888 3032320 2952340 2986908 2993540 2800246
14489 2800246 3048669 3225897 3473587 3299612 3388050 3376112 3650930 3374137 3313344 3474167
14479 3474167 3615856 3689435 3419131 3603161 3929250 3903596 3685409 3900038 3907975 4225116
14469 4225116 4028452 4080036 3836630 4000697 3929847 3872442 4395532 4106508 4459784 4183705
14459D183705K96360P0277L10540p8018j15510M9445n24L5703J43867K37139r1899
14448E041085j0978Q207k26565K91880j6979L40232j22434J34294J59625J93144
14438E791511j24737P647K8767J82916L12405j36778P1171N7545J38748l87706
14428E941489M65585J51548K13576K4181q5799L52532p157k66730K72275L13659
14418G375159J11511J5360p838L52253J20725J39321J01349Q1354K11848j08832
14408H392210Q7441J20740J29213K61034j2075J83578K29321j574J72496L85726
14398I948110J4502J60613L02629O3324K47135L41801P3729l1982K64506M2368
14388A1426735K36885N48528j32524M237J67787N17606O40231N689K5073K57954
$$ plain form
14459 4183705 4480065 4550342 4860882 4782864 4667354 4716799 4716275 4751978 4895845 5132984 5041085
14448 5041085 5030107 5038314 4811749 5103629 5086650 5426882 5304448 5438742 5598367 5791511
14438 5791511 5666774 5674421 5703188 5886104 6198509 6061731 6132902 6190447 6329195 5941489
14428 5941489 6407074 6558622 6772198 6796379 6710580 7063112 7055955 6789225 7061500 7375159
14418 7375159 7486670 7502030 7494192 7846445 7967170 8106491 8207840 8289194 8501042 8392210
14408 8392210 8479651 8600391 8729604 8990638 8978563 9162141 9391462 9389888 9562384 9948110
14398 9948110 9962612 10123225 10425854 10489178 10736313 11078114 11151843 11119861 11384367 11426735
14388 11426735 11663620 12212148 12079624 12083861 12251648 12769254 13409485 13415174 13440247 13698201
14378A3698201L42439N08445R9717K72422K67099J93375M90364L15524N1651L82771
14368A6622008M19481L99845N56223L96893O9948Q08179M9580N58171M72915j08191
14358B0245052J084772N08244K55405K79628P49184L99854O16973O18661Q08071
14349B5565844L51264J073920N72152N82401M50099J029084N51369J337686O32661
14340C2146480J297384M28725J173567N64186J401193R60031J102424J059169
14332D0133159J214499J256465J461238J213225J773125J404489J237942J843173
14324E1537315K043478J219259K238791J758093K239871K376227K481307K467462
14316F8361803K407184K915235K481831L069144L132202L574541L655728L589233
$$ plain form
14378 13698201 14040640 14549085 14648802 14921224 15188323 15381698 15872062 16187586 16239237 16622008
14368 16622008 17041489 17441334 17997557 18394450 18464398 19272577 19322157 19880328 20353243 20245052
14358 20245052 21329824 21838068 22093473 22373101 23122285 23522139 24139112 24757773 25565844
14349 25565844 25917108 26991028 27563180 28145581 28595680 29624764 30176133 31513819 32146480
14340 32146480 33443864 33872589 35046156 35610342 37011535 37971566 39073990 40133159
14332 40133159 41347658 42604123 44065361 45278586 47051711 48456200 49694142 51537315
14324 51537315 53580793 54800052 57038843 58796936 61036807 63413034 65894341 68361803
14316 68361803 70768987 73684222 76166053 79235197 82367399 85941940 89597668 93186901
14308I3186901M153762M118891M201175N076620N278663N222539N475109O188556
14300A32902216O158192O916454O824717P997180Q064822Q304019R090066R551197
14292A95808863J0250785J0583381J1153755J1977985J2123341J2897056J3107755
14285B77902921J3935859J4103986J4107371J4566106J4637218J3792970J4430710
14278C77477141J3524587J2526892J1315174J0094607P787531M743449j08457
14271D37360924J19385N59411r29552n817657n581216o199098p664969j0735503
14263D01111725j2636104j3525902j4610838j4953513j5489043j5247090j4967314
14256B99681921j4757360j4180208j3661801j1977483j2253018j2156689j1444473
$$ plain form
14308 93186901 97340663 101459554 105660729 110737349 116016012 121238551 126713660 132902216
14300 132902216 139060408 145976862 152801579 160798759 168863581 177167600 186257666 195808863
14292 195808863 206059648 216643029 227796784 239774769 251898110 264795166 277902921
14285 277902921 291838780 305942766 320050137 334616243 349253461 363046431 377477141
14278 377477141 391001728 403528620 414843794 424938401 432725932 437469381 437360924
14271 437360924 437480309 438039720 437110168 431292511 425711295 419512197 411847228 401111725
14263 401111725 388475621 374949719 360338881 345385368 329896325 314649235 299681921
14256 299681921 284924561 270744353 257082552 245105069 232852051 220695362 209250889
14249B09250889j0675187j0142186r488691q778613q296893p401563p638789p294127
14241A39534840o146729o276552n844516n375291m878787m694920m749563m664814
14233I6903668m266538l610096k902695l484335l703385l236176k617057k904337
14225G0179049k567608k648756k099195k543591j935778j774577k162439j833565
14217E2613540j731771j892062j271419j356219r92626j482976j841288j244405
14209D0800774j187799p48466r71161j037360r88867j275441q45244j161072p84673
14200C1800691k10900j366573r42079n25185q16186o58961o20102o90124o25482
14191B5345099r87981n2952p10207o76723n71673l24303o74413n11844j29516
$$ plain form
14249 209250889 198575702 188433516 178944825 170166212 161869319 154467756 146828967 139534840
14241 139534840 133388111 127111559 121267043 115891752 111012965 106318045 101568482 96903668
14233 96903668 92637130 89027034 86124339 82640004 78936619 75700443 73083386 70179049
14225 70179049 67611441 64962685 62863490 60319899 58384121 56609544 54447105 52613540
14217 52613540 50881769 48989707 47718288 46362069 45369443 43886467 42045179 40800774
14209 40800774 39612975 38864509 37893348 36855988 35867121 34591680 33746436 32585364 31800691
14200 31800691 31589791 30223218 29281139 28755954 27939768 27280807 26660705 25970581 25345099
14191 25345099 24357118 24304166 23593959 22917236 22345563 22021260 21346847 20835003 20705487
14182B0705487o80585n28807m24948l2778n41094l03261n87484l71139j50187
14173A7085204m88146k47292j94730m03741o46170J94734n14074j36535l95144
14164A4254106j90947n52300j58830j99810m6639l31833k34443q8238n8293l04012
14154A2088761n13566O9779k08955n99000K63006m18896p3454J18201k91819l44226
14144A0089831J6363n5012l27173k45538k37433K61819l78032k08115l00471K8868
14134H645107j63109j95786k6388K45045n99148J51583J33861k76281q5219n66132
14124G263533J04029j13463L5349j82981J84374k28968j38016j31035N372j83729
14114F614465K43279j35209k90501m7022m5165L6654j73761Q2480j65834k01764
$$ plain form
14182 20705487 20024902 19496095 19071147 19038369 18497275 18194014 17606530 17235391 17085204
14173 17085204 16597058 16349766 16155036 15751295 15105125 15299859 14785785 14649250 14254106
14164 14254106 14063159 13510859 13352029 13152219 13105580 12773747 12539304 12451066 12392773 12088761
14154 12088761 11575195 11644974 11436019 10837019 11100025 10681129 10607675 10725876 10434057 10089831
14144 10089831 10106194 10051182 9724009 9478471 9241038 9502857 9124825 8916710 8616239 8645107
14134 8645107 8481998 8286212 8259824 8504869 7905721 8057304 8191165 7914884 7829665 7263533
14124 7263533 7367562 7254099 7289448 7106467 7290841 7061873 6923857 6792822 6798194 6614465
14114 6614465 6857744 6722535 6432034 6385012 6339847 6376501 6202740 6285220 6119386 5917622
14104E917622j26627j74862J66079j65158n16005L22844l9588l085l70086N4863
14094E065997q5987K07323j78049R1880j39449J0640p9396J27898k69322Q508
14084D760043j30266j0290k98803K67521K8970j17170k02352J36744l59108K40642
14074D315931m80716K03213R4579k40605r8672K31235k45390j3704J51397j66908
14064C750360J43564l72962J7328j54865N78532m78543J77756r8829j39544J01398
14054C524195j73346O2594L14888p81069N02564k68890N8223J42301m77803r0529
14044B813128L32059O472k59811J91548l04846J86321K0776j94122J59817J24386
14034C075728o10949Q4221K56980M6859m8271K46409k98528N96M6479k95153J98950
$$ plain form
14104 5917622 5790995 5616133 5782212 5617054 5101049 5423893 5384305 5381220 5011134 5065997
14094 5065997 4980010 5187333 5009284 5101164 4961715 4972355 4892959 5020857 4751535 4760043
14084 4760043 4629777 4619487 4320684 4588205 4617175 4500005 4297653 4434397 4075289 4315931
14074 4315931 3835215 4038428 4133007 3892402 3793730 4024965 3779575 3765871 3917268 3750360
14064 3750360 3893924 3520962 3538290 3383425 3961957 3483414 3661170 3562341 3422797 3524195
14054 3524195 3350849 3413443 3728331 2947262 3449826 3180936 3239159 3381460 2903657 2813128
14044 2813128 3145187 3151659 2891848 3083396 2778550 2964871 2985647 2791525 2951342 3075728
14034 3075728 2464779 2549000 2805980 2852839 2804568 3050977 2752449 2753045 2799524 2504371 2703321
14023B703321M055N14362n94289j05036J69665j97208l05010Q4906L10208k94176
14013B290798J92349k52651M1524J0614J95024m11903k06627L26421r0033M2711
14003B138227N0529k46695j09008J85417j31700n062j39532M7491N35456m42734
13993A882389K60658k19556Q1404J9213J177812K319404N851688J8297393K0012996
13984D9683401B3729778A1821918m265239k178698j047338q59903k91743l39616
13976B839381j65853j17899J96125l53803j37866K32842J5818o3901J23183m17865
13966B150162r6371J52350j39686j97461j30296L51411k8654P2717k60909J8907
13956A892170j50917N555K00968k75702m1901K29034n3958J83033j76544O4438
$$ plain form
14023 2703321 2707376 3221738 2627449 2522413 2692078 2494870 2189860 2274766 2584974 2290798
14013 2290798 2483147 2230496 2272020 2282634 2477658 2065755 1859128 2185549 2095516 2138227
14003 2138227 2188756 1942061 1833053 2018470 1886770 1881708 1742176 1789667 2325123 1882389
13993 1882389 2143047 1923491 2004895 2024108 3201920 5521324 11373012 29670405 49683401
13984 49683401 23729778 11821918 7556679 5377981 4330643 3470740 3178997 2839381
13976 2839381 2673528 2555629 2751754 2397951 2260085 2492927 2508745 2444844 2568027 2150162
13966 2150162 2053791 2206141 2066455 1868994 1738698 2090109 2061455 2134172 1873263 1892170
13956 1892170 1741253 1746808 1947776 1672074 1630173 1859207 1805249 1988282 1811738 1876176
13946A876176n232k17198J58193o7934j04641J27615j24695m29045N01809n04216
13936A210832K95168J35712M1229l67266p85L15231k64851J65808J60452l37313
13926A354217K20912m2713m43095M00257j4971J5342r634J03952n65649N45515
13916A564133J4234q6950L9091m61042K42063K11968k19554J39482o4335n9967
13906A319123Q1479j61999o0897j7076o7264L17971k3682Q1494l09108k28890
13896I31151J8379K16336l28306K61078Q878k26990M35512K2296J8056M2591p3941
13885A325040k16321k81033M07042k36689K6483L21107k73145P031L8054j42307
13875I75262P9763K7958k16260K16365j31628N054L28473l00125j46053P2502
$$ plain form
13946 1876176 1870944 1653746 1811939 1744005 1639364 1766979 1642284 1213239 1715048 1210832
13936 1210832 1506000 1641712 1682941 1315675 1314890 1630121 1365270 1531078 1691530 1354217
13926 1354217 1575129 1532416 1089321 1489578 1474607 1489949 1480315 1584267 1018618 1564133
13916 1564133 1578367 1491417 1530508 1069466 1311529 1523497 1303943 1443425 1379090 1319123
13906 1319123 1400602 1238603 1177706 1160630 1093366 1411337 1387655 1469149 1160041 931151
13896 931151 949530 1165866 837560 1098638 1107516 880526 1316038 1338334 1356390 1398981 1325040
13885 1325040 1108719 827686 1234728 998039 1024522 1345629 1072484 1079515 1117569 975262
13875 975262 1055025 1082983 866723 1083088 951460 956514 1284987 984862 838809 911311
13865I11311j71025j3454K58780K59485l76413J61823j60656q3543J94787D38619
13854H92706m3866K46050l9719l46050J14873M53785m73100L4987K42189J76715
13844A258570m00705j23724J67263K23193q8205L020l39413J95754J97863n28538
13834E65078L28982J8658Q2502j64183K03076m02711J28065j12460J78717j53776
13824F71948N5260C05866L06267K26653k98166J56125r2804K96929j48095R6906
13814H49681k65612K92085P1312j36857k0166P1390B34521Q04216j06279K26285
13804A158743m59697J80545j16761p4013J31806j80268R079j8064j6309j15715
13794D99346L91370l40213J70644L3142r6889B94423M99444O5647j05583l47614
$$ plain form
13865 911311 740286 726832 985612 1245097 868684 1030507 869851 786308 981095 438619
13854 892706 848840 1094890 1055171 709121 823994 1277779 804679 839666 1081855 1258570
13844 1258570 857865 734141 901404 1124597 1036392 1039412 699999 895753 1093616 565078
13834 565078 894060 912718 995220 831037 1034113 631402 759467 647007 825724 671948
13824 671948 727208 305866 612133 838786 540620 696745 603941 900870 752775 849681
13814 849681 584069 876154 947466 810609 790443 861833 234521 1038737 932458 1158743
13804 1158743 699046 879591 762830 688817 820623 640355 649434 631370 615061 499346
13794 499346 890716 550503 721147 754289 657400 294423 793867 859514 753931 406317
13784D06317J25145L2766L77905k62399j43608N56810D64169M84116l18945O9517
13774F98857j5823o4543m5846M88929n15403K4194J9104q3433P7350m7995R1410
13763F26801k56466K55304j24914L3468L8531j63502Q6576n8195N3812m7890L22087
13752G65612C55470J87254L13364j02759B71946L48453j15928J38400Q1581k6066
13742F98386J23898l73621K23302k69998K54722K7846l20035J83403J64848J86652
13732H99403j84584j55696K1235o8276K02643k33395k6923o7373J31773P4832
13722E93639J19443Q7772C79930N4395r810r1973L67850J7604k65857O5857K00591
13711G18587B54287L37871B51860K69154j8270J88021C37360L09411J22248B02406
$$ plain form
13784 406317 531462 564228 942133 679734 536126 1092936 464169 948285 629340 698857
13774 698857 683034 618491 572645 1061574 546171 570365 589469 506036 583386 535391 626801
13763 626801 370335 625639 500725 534193 572724 409222 495798 437603 491415 443525 765612
13752 765612 355470 542724 856088 753329 271946 620399 504471 642871 724452 698386
13742 698386 822284 448663 671965 401967 656689 684535 364500 547903 712751 899403
13732 899403 714819 559123 580358 512082 714725 481330 454407 387034 518807 593639
13722 593639 713082 800854 379930 434325 424515 332542 700392 717996 452139 517996 718587
13711 718587 254287 592158 251860 521014 502744 690765 337360 646771 769019 202406
13700C36114N7370O6529L07874q5700k36619P7577K35401l41705J03979l2889
13690D87931j34306n9706L52649k50353O7049l3261K06171B55875M32000j7067
13680F70808C34034J78658K5485l3863o7263F0822M22467l3240B22996J46554
13670C69550J10614j49822L14211k11744j07145M13078k92696K51998j50241B68835
13659B85440J14813J81949B61282K25875k06038K69802q340n1493k41743J75927
13649D25272j82117J11577N7628j58703O2329o8640K84703B55966Q8910L32891
13639F77767A55519N4492l8155K00459o1896J30667J14250q9392p7798O9702N1190
13628E09038k21456K7933j02652a03915B87438q8106K85160B24078K04988K47328
$$ plain form
13700 336114 393484 460013 767887 682187 445568 523145 758546 416841 520820 487931
13690 487931 353625 293919 646568 396215 463264 430003 636174 255875 687875 670808
13680 670808 334034 512692 538177 504314 437051 60822 483289 450049 222996 369550
13670 369550 480164 330342 644553 432809 325664 738742 446046 698044 547803 268835
13659 285440 400253 582202 261282 487157 281119 550921 542581 491088 249345 425272
13649 425272 243155 354732 412360 253657 315986 247346 532049 255966 344876 677767
13639 677767 155519 210011 171856 372315 310419 441086 555336 465944 388146 457848 509038
13628 509038 287582 315515 212863 -103915 287438 199332 484492 224078 429066 676394
13618F76394l17113R4152C3660L72349j04827q327L3068o877J726p4916o8760
13607A77096J6926J88755K12683D7608K67914L93873A82225L38728o2506m3177
13597D15270j3768J66809j74647j34694J44015P6708B30860J06108k1456J6247
13587C31759l6524J86818b0253C46945j65262R7008K31231j20712A19490M9327
13577A68817k075j000o7472J31554J98961j39294J9601j36259G7482N70415k89071
13566C58826J9156J67181A77895J68184M27735C06266j20533K34085m7133o3280
13556C09405L5181c5155F60632B93328J12266j78902I6978K57485G2470J36332
13546B08802L3964M5860j09579C4086M76798A72845A6730K55299C9464J04062
$$ plain form
13618 676394 359281 453433 33660 406009 301182 292855 325923 319046 320772 245856 177096
13607 177096 194022 382777 595460 47608 315522 709395 182225 520953 458447 415270
13597 415270 401502 568311 393664 258970 402985 479693 230860 336968 315512 331759
13587 331759 295235 482053 -20253 346945 181683 278691 509922 389210 119490 168817
13577 168817 166742 165742 98270 229824 428785 289491 309092 172833 77482 647897 358826
13566 358826 377982 545163 177895 346079 773814 306266 185733 419818 372685 309405
13556 309405 344586 -35155 660632 293328 405594 226692 96978 354463 72470 208802
13546 208802 242766 288626 179047 34086 510884 172845 16730 272029 39464 143526
13536A43526K62109j66763j13405J67898n6836p0804a179A71825O1621M7626A25552
13524E7462J08005K82308A46753K26257A67495J81339j15377a29759B13200L73457
13514E86657A82991D3875J49524J07945M5610A68732M1490l8922J85989J74813
13504E32102j6617H8243K14468I0695K14474K8767Q12J57226k07214j25507a078
13492e5387C75714j59092K94313D8534K01180M1792F603L82921J7782C4973R2631
13481A27604l8399J73604j09153J79087b549B63420a65996A85675K17692j70064
13471B33303J30422A15265A599L75545j01082M154q5914K13a7291B99603d7650
13459A06742b1320B49366G8329K41368l1957A37876J82212A09369k8565M23113
$$ plain form
13536 143526 405635 238872 125467 293365 236529 165725 -1179 171825 233446 281072 125552
13524 57462 165467 447775 146753 373010 167495 348834 233457 -129759 213200 586657
13514 586657 182991 43875 193399 301344 346954 168732 210222 171300 357289 532102
13504 532102 515485 88243 302711 90695 305169 333936 334748 491974 284760 159253 -1078
13492 -55387 375714 216622 510935 48534 249714 291506 6603 389524 407306 34973 127604
13481 127604 89205 262809 153656 332743 -2549 263420 -165996 185675 403367 233303
13471 233303 363725 115265 1599 377144 276062 280216 194302 194515 -17291 299603 -47650
13459 106742 -21320 249366 78329 319697 287740 137876 320088 109369 80804 503917
13449E03917A16212B862J55956J13880J76515L1731j46632K119k8662I8745R9508
13438A98253p0205r73K15871a43541d2411D80539A37698e7273q962A26400L44844
13427D71244K25533B47719D8383K04457g5157j58788R4794a0972A85930J4031
13417A99961J23615J48065k10764N8621k868q9376K96270A0887P5857L21209E3232
13405e3068D15120A66923Q7520l8484b75507C24261g000n197B87662g8054H7636
13393C31849A56928K22004j71680L0074a22925N2448A59321m1356n1752K0816
13383H7029M8178K17544g6939B06842A00768J20791o5512P4016R4969B5447J30162
13372A55609b06677g79A21131J35459A15220J02057j00871K13999j08557a15213
$$ plain form
13449 503917 116212 2862 158818 272698 449213 480944 334312 336431 307769 98745 198253
13438 198253 128048 127075 342946 -143541 -42411 480539 137698 -57273 -66235 126400 471244
13427 471244 696777 247719 48383 252840 -75157 -233945 -139151 -10972 185930 199961
13417 199961 323576 471641 260877 319498 316630 227254 523524 10887 86744 407953 53232
13405 -53068 415120 166923 254443 215959 -275507 324261 -7000 -12197 287662 -78054 87636
13393 331849 156928 378932 207252 237326 -122925 -70477 159321 117965 66213 87029
13383 87029 135207 352751 -76939 206842 100768 221559 156047 230063 325032 25447 155609
13372 155609 -206677 -779 121131 256590 115220 217277 116406 330405 221848 -115213
13361c0501A86833m7287m2616b3698A22913J17909K6870H3207K58741A30350r727
13350A20623L20143G343J71220a90064B88313J18384A60221K97535B27655B5852
13339B14568F9544L26455j18494m1471o9902M2305a76924A70188K8965J97121
13329C96274I2848K19088A8441K04488j00979L82633A25435k1474J50219C8270
13318B49551b2685C64015A79536K44704A32911K22019A03817a43809B24777a4888
13307i4594G4559J81854A20191P894R2055H6497d3908C86175i6282A99018o2103
13296A36915a73781A22214J15458l3699m2720Q887m9863E09a46967B48458b0590
13284I7697L59523P2454A2068Q0981L1108d50233K17622h2354B72465I9875k3790
$$ plain form
13361 -30501 186833 139546 96930 -23698 122913 240822 267692 83207 341948 130350 120623
13350 120623 440766 7343 178563 -190064 288313 406697 160221 457756 227655 25852
13339 214568 69544 395999 277505 236034 166132 208437 -176924 170188 199153 396274
13329 396274 92848 311936 18441 222929 121950 504583 125435 103961 254180 38270
13318 249551 -22685 364015 179536 424240 132911 354930 103817 -143809 224777 -14888
13307 -94594 74559 256413 120191 128085 220140 86497 -43908 386175 -96282 199018 136915
13296 136915 -173781 122214 237672 203973 161253 170140 120277 509 -146967 248458 -20590
13284 97697 457220 529674 12068 93049 124157 -450233 -232611 -82354 272465 99875 76085
13273G6085K77849o4806a58817A65488B9126J5782M37255A07545a39235I7990
13262B9152J36211K6811a62832c1297A57301K05978b13851C14955A36402g6698
13251B23759M7970a83555C59159c9976A59306K8549J92739a50284B39721b7441
13240f825B55470k8376A06627Q1296k3431c9069i939I4551B9058B888R8396j2618
13228H8666A2873a4901E9132J62349M3845a21744C55436A25168N3287k1649M9931
13217B06737J59542G7919K33384j04859o1878M8140K47237g2327n4961C23113
13206D8365b9120A50610a91834A39380n7233a84676B02017K1746J85557A55945
13195A43931b2721D30015B12780a52141g1310p6805C52202h9639G5062b17695
$$ plain form
13273 76085 353934 289128 -158817 165488 29126 44908 482163 107545 -139235 97990
13262 29152 165363 192174 -162832 -31297 157301 363279 -213851 314955 136402 -76698
13251 223759 271729 -183555 359159 -39976 159306 187855 380594 -150284 239721 -27441
13240 -6825 255470 227094 106627 187923 164492 -39069 -9939 94551 29058 2888 101284 88666
13228 88666 12873 -14901 59132 221481 265326 -121744 355436 125168 178455 156806 206737
13217 206737 366279 77919 311303 206444 144566 192706 439943 -72327 -127288 323113
13206 48365 -29120 150610 -191834 139380 82147 -184676 202017 223763 409320 155945
13195 143931 -22721 430015 212780 -152141 -71310 -148115 352202 -89639 75062 -217695
13184e7506B45774F4699a10422F5528H332a12268A70704K6834N9864A14821L6586
13173A51407F0778j2339G916h0445C13469H4519R5026a61851A27032L4894a49652
13161a11533j08396B8664L19286g1186C79224A50809d9472n245D8517J55088k2255
13150A81350a09939G7967L08582K4208A99579R4433j02857h1921G1372d9353D5053
13138a99902e9396B9889J42161Q2702A06228k3191a52982A55986F4226J25533
13128A89759n8898E8086a85007f9834B23247K26313E6523a57542B32133a72095
13117A73797d4202D9263B1661J92536j1267D2330e5709A93840H9310R5129Q4482
13106B68921n5091l3045p0867c57005B75409a3894B29812g8287C50318C00e8991
$$ plain form
13184 -57506 245774 64699 -110422 65528 8332 -112268 170704 197538 257402 114821 151407
13173 151407 60778 48439 7916 -80445 313469 84519 179545 -161851 127032 161926 -149652
13161 -111533 -219929 28664 347950 -71186 379224 150809 -49472 -54717 48517 203605 181350
13150 181350 -109939 77967 386549 410757 199579 294012 191155 -81921 71372 -49353 45053
13138 -199902 -59396 29889 172050 254752 106228 83037 -152982 155986 64226 189759
13128 189759 130861 58086 -185007 -69834 223247 449560 56523 -157542 232133 -172095
13117 173797 -44202 49263 21661 214197 202930 42330 -55709 193840 89310 184439 268921
13106 268921 213830 180785 109918 -357005 275409 -13894 229812 -78287 350318 300 -58991
13094B83951H6603Q2257o7734a89581C08183a51422D0830K0304J62161d3390A37492
13082b71893Q4095A60614K356b51186I7101b44806K5091B10844h099k121k78978
13071b89198A17006I14c0749j00430B69488j29416R4320p6845L02405A66532E8647
13059g1098j4876A77690k8529L0023J3251J48229A42289B8805O8127C929a69431
13047F4232J38351a00565C16142h0157G6070C2288M04653a52685A18462E326g2872
13035A25973n0603a43250C69867A4177J29398K72926A82574P4121H3202L20225
13025D03427a46444E5440K59448p5314H3996P5529K30856r8823a86437a9143B1312
13013B38529K378I1093C7619J83226o6848k4020C9891K24978D6825N02271A95332
$$ plain form
13094 283951 86603 168860 101126 -189581 308183 -151422 40830 61134 223295 -43390 137492
13082 -271893 -187798 160614 162970 -251186 97101 -244806 -219715 210844 -8099 -10220 -289198
13071 -289198 117006 914 -30749 -131179 269488 140072 234392 157547 459952 166532 58647
13059 -71098 -85974 177690 149161 179184 192435 340664 142289 28805 96932 3929 -169431
13047 64232 202583 -100565 316142 -80157 76070 32288 436941 -152685 118462 5326 -72872
13035 125973 75370 -143250 369867 14177 143575 416501 182574 256695 83202 403427
13025 403427 -146444 55440 314888 239574 83996 159525 390381 291558 -186437 -19143 21312
13013 238529 240907 91093 37619 220845 153997 129977 39891 264869 46825 549096 195332
13001C60572j57053P850J37052j00516b89945A20438l4832K18738D5983H98P913
12990H811d659D0596J9029K70317G6024a90052A74736j7934a98396E2020a65114
12978f5896b9298A67138O8852B1431K25688C9478A6679b97388E0526J23112L7608
12967B11246B2968K73204F9069j1202B1157a06322H4540c18776J11884r8703A07644
12955A37339K5519b54093f9216B726b32993K5755D7352K00327C1409J20746e7152
12943B82344A32830J09297F4660J96028a35069A70946n9067a80163A1230L94308
12933D05538j23510g730A84249a79052I5751c0088j16907B03373f1831o4081A31789
12921B9050g0538K1062j90116k3668B2775J9541a49145B36675a12321I8883D0532
$$ plain form
13001 360572 203519 211369 348421 247905 -289945 120438 85606 304344 45983 898 8811
12990 8811 -4659 40596 59625 329942 76024 -190052 174736 156802 -198396 52020 -165114
12978 -65896 -29298 167138 235990 21431 247119 39478 16679 -297388 50526 173638 211246
12967 211246 22968 296172 69069 57867 21157 -106322 84540 -318776 -206892 -305595 107644
12955 137339 162858 -254093 -69216 2726 -232993 -207238 47352 247679 31409 152155 -57152
12943 282344 132830 242127 64660 260688 -135069 170946 111879 -180163 11230 405538
12933 405538 282028 -7730 184249 -179052 95751 -30088 -146995 203373 -61831 -125912 131789
12921 29050 -70538 -49476 -239592 -263260 22775 42316 -149145 236675 -112321 98883 40532
12909H3364i7401j87227B13340a89590C7316b07790C64837E8406N7602H025a75309
12897A04284b8439j21321N8775A47023f7926J038H1962l5347K8209c53920a07516
12885a64987C7475M6673j6215H918J6216e1403j93286a07136A19239J24526a30328
12873I9898J29179H7444J67732a15965A43751c9928k38075a09560A79887a93969
12862D8457a92971C7794L58525E241b03470f9086C64021a50889B86742j30715
12852A56027L03534A40254l2093e749n7078k08288b7537p1298j63950B13321E4185
12840A89755H4871A0876A105J4653K7821K45171b24838B19576f0682j32626G1106
12828b2161l9211l9767m1984F7913d894k02642G4073f1096n8959J8459c1189k3637
$$ plain form
12909 83364 -97401 -284628 213340 -189590 37316 -207790 364837 58406 116008 8025 -175309
12897 104284 -28439 -149760 -90985 147023 -67926 -66888 81962 46615 74824 -353920 -107516
12885 -164987 37475 84148 67933 8918 25134 -51403 -244689 -107136 119239 243765 -130328
12873 99898 229077 87444 255176 -115965 143751 -39928 -278003 -109560 179887 -193969
12862 48457 -192971 37794 396319 5241 -203470 -69086 364021 -150889 286742 156027
12852 156027 459561 140254 108161 -5749 -62827 -271115 -27537 -98835 -262785 213321 54185
12840 189755 84871 10876 1105 15758 43579 288750 -224838 219576 -60682 -193308 71106
12828 -22161 -61372 -101139 -143123 67913 -4894 -207536 74073 -61096 -120055 -101596 -31189 -54826
12816e4826B84161F8804b51284P0770h2958J5573B39031b31204A53979l2170a06535
12804b91615h356A13551d0938k61356A02076l4003a59567o0956C4702a27429A32577
12792a57187o8038d9204p6255I4212J03274D2122D729a16354k429e4176F9853
12780a94006B58254L0867c54914J57359A2354P9777c4113C25087b1781G0691j082
12769F9609J22743j0200a51154F3980a87640Q6294B17689C1765K7321k2760J30143
12758A66469C4866O31122c551C87794r6882A07633f7255D6194J83922b01147d365
12746a9031l76j87411A59830a34865I9568J84068j11135a5563k73813A26433A5643
12734A70794L3712j299g0278A64002l5856K44031A3599J20845b81778C26590I962
$$ plain form
12816 -54826 284161 68804 -251284 -180514 -82958 -67385 239031 -231204 153979 121809 -106535
12804 -291615 -8356 113551 -40938 -302294 102076 68073 -159567 -220523 34702 -127429 132577
12792 -157187 -225225 -49204 -125459 94212 197486 42122 4729 -116354 -118783 -54176 69853
12780 -194006 258254 289121 -354914 -197555 12354 92131 -34113 325087 -21781 70691 69609
12769 69609 192352 182152 -151154 63980 -187640 -101346 217689 31765 59086 36326 166469
12758 166469 34866 665988 -3551 387794 290912 107633 -67255 46194 230116 -201147 -4365
12746 -19031 -19407 -206818 159830 -134865 99568 283636 172501 -15563 -289376 126433 15643
12734 170794 204506 203207 -70278 164002 128146 372177 13599 134444 -281778 326590 9962
12722B00411i2030B4426c0119j5212A44755d4792j64463j4216B23234q8498J48140
12711B82876c6317B05067J8457c2413B60526H2413D1165J65634b72687A55325
12700A45000a94666A37630A2825N9781L32974I3517b5179j21434H9144m1413Q413
12689E6144g5179A57646C0363a44665e6107j0418D25134a27668B36032e2675a3196
12677A02280k2165J09452a88064m569h8473A80016F4892C0559J56240C947K93556
12666B97503a2943k3528j22442A77312a9488A37967q541L9256o6896g5131A8102
12654C78374A51091R0508e9425A35645K05223d6805G6436O6200E3222b07792A45851
12642A60288R8134b62610A62223J37045a26948A23944J13313f2219A74869N1156
$$ plain form
12722 200411 -92030 24426 -30119 -45331 144755 -44792 -209255 -223471 223234 134736 282876
12711 282876 -36317 205067 223524 -32413 260526 82413 41165 206799 -272687 155325
12700 145000 -194666 137630 12825 72606 405580 93517 -25179 -146613 89144 47731 56144
12689 56144 -75179 157646 30363 -144665 -56107 -66525 425134 -127668 236032 -52675 -13196
12677 102280 80115 189567 -188064 -192633 -88473 180016 64892 30559 186799 3947 297503
12666 297503 -12943 -36471 -158913 177312 -19488 137967 129426 168682 101786 -75131 18102
12654 378374 151091 241599 -59425 135645 340868 -46805 76436 142636 53222 -207792 145851
12642 160288 258422 -262610 162223 299268 -126948 123944 237257 -62219 174869 226025
12632B26025a21757H8923O7634A650K23157m6481F2163J45155J20394e0231K3878
12621b6353j26398B43787i7788H3643J5854K2418L0345j6344e3132B13301n8113
12610A55188e2318B711e0839G588c07265A86426q4245B7285g1827E9309K91208
12599C50517A7047J8745K41543m6167a18075B92893c00675I8182b63964A80175
12588A40986b08950a1193m0410I0778J4383P4651h250E4885a08048L8921I3660
12576d9437A34048D9122J17722d3230A13133a94733A24804J07553F0280A9917
12565G936C537R6830N3381a60381B85907a24454j64274f3824J598A54932D8633
12553a96677N5622E3492a96219B81212b06154A51403a48198D1332g3071C9493
$$ plain form
12632 226025 -121757 88923 156557 1650 224807 178326 62163 207318 327712 -50231 -26353
12621 -26353 -152751 243787 -97788 83643 99497 121915 152260 135916 -53132 213301 155188
12610 155188 -52318 2711 -50839 7588 -307265 186426 102181 27285 -71827 59309 350517
12599 350517 17047 35792 277335 231168 -118075 292893 -300675 98182 -263964 180175
12588 140986 -208950 -11193 -51603 90778 105161 179812 -8250 54885 -108048 -69127 93660
12576 -49437 134048 49122 166844 -43230 113133 -194733 124804 232357 60280 19917
12565 7936 3537 100367 153748 -160381 285907 -124454 -288728 -63824 -62226 154932 48633
12553 -196677 -141055 53492 -196219 281212 -206154 151403 -148198 41332 -73071 39493
12542A21819L964G600k273a60851N6868a2550n6984D325L0865k090L3208J04518
12530A70826k8514O8335d4140g921A7388a25974M2667J5997A44006h8860B2728
12518b1598k9087m959j0779b3394C9889a35567j53776B14568B1886J27475c63664
12506h556B284a31964k3988D8877K50511G6621h1814E0665J01080b01251B57904
12494a08082B24363r9435c538E3110k2266P4894b49335j16568A31023R208K60877
12483D01108B9242K58359D76g6107B5107K47550D5598c04559B80802A00251k162
12472I8089D6624b95099A01825d1086j43539F4699i6445E5039M0592K3897b77511
12460i6169j4813A01054d5505p9300q0402a658j98662C07152C070J09942b4060
$$ plain form
12542 121819 125783 7600 5327 -160851 -103983 -12550 -69534 4325 35190 33100 66308 170826
12530 170826 142312 210647 -44140 -7921 17388 -125974 -83307 -67310 144006 -88860 22728
12518 -21598 -50685 -55644 -66423 -23394 39889 -135567 -289343 214568 21886 149361 -363664
12506 -8556 2284 -131964 -155952 48877 299388 76621 -81814 50665 151745 -201251 257904
12494 -108082 224363 124928 -3538 53110 30844 105738 -249335 -365903 131023 140231 401108
12483 401108 29242 287601 476 -76107 25107 272657 45598 -304559 280802 100251 98089
12472 98089 46624 -295099 101825 -41086 -184625 64699 -96445 55039 95631 119528 -277511
12460 -96169 -110982 101054 -45505 -124805 -205207 -1658 -200320 307152 3070 113012 -24060
12448c399B72926j24558F5243A5668i550j84610Q2924B0749n518b88323B22662
12436C5789K99992a27841D9383e578A77378a02448C04284i2127C2906a84768A41474
12424D7112f1075I4707a41998N9268A04712m5872J98794I9505k0777M7293J43561
12413B69582I3736a70979b6269j13082D3945K87112g3945j17291H2468h4441A22969
12401G8741a8150l43871a03415p1497P8497n0682e8507B8498b23C7767P8384d680
12388A9802K45302a0387k6406B2981K12689E9822a41017o21A15677A5544b01325
12376i6768I5667a03970b3601I9233g0056E2880a30008B45340e7496A75498L2168
12365B07666N5866j27063b32296A43563M3244a36113j00634c0325j0883o6837
$$ plain form
12448 -3399 272926 148368 65243 15668 -9550 -194160 -111236 20749 15231 -288323 222662
12436 35789 335781 -127841 49383 -5578 177378 -102448 304284 -92127 32906 -184768 141474
12424 47112 -61075 94707 -141998 -82730 104712 58840 257634 99505 78728 126021 269582
12413 269582 93736 -170979 -26269 -139351 43945 331057 -73945 -191236 82468 -84441 122969
12401 78741 -18150 -362021 -103415 -174912 -96415 -147097 -58507 28498 -223 37767 116151 -4680
12388 19802 265104 -10387 -36793 22981 235670 59822 -141017 -141638 115677 15544 -201325
12376 -96768 95667 -103970 -23601 99233 -70056 52880 -130008 245340 -57496 175498 207666
12365 207666 263532 136469 -232296 143563 186807 -136113 -236747 -30325 -41208 -108045
12355a08045j70193g7203A34823b74775B0339o723K07482h5164B9696M9241e4742
12343e6628j38476D1295M8066e4882k04555h3307o5599a4268j57660A89582a17267
12331A01429a87992C6197A4915J56095b41865c5675D226J63216b3373c034D5151
12319C13141i8732c1530m8443n2487I0547a13183G0194K53807a67153Q229k85983
12308d44907a75676j26694a47422d1470B91535A17632n3015P7825l9134J77084
12298B80392e1373A37333J86183j55070a42131C19789j23903b3674D62081E7075
12287b64260B0609O0751b30720g2166B92303c02116A87501a68849A80297Q0463
12277B60760Q7976l9328j33774C3616R8221K68051G8613J76570f2277H8476L1827
$$ plain form
12355 -108045 -278238 -77203 134823 -274775 20339 13616 221098 -85164 29696 78937 -54742
12343 -56628 -195104 41295 89361 -54882 -259437 -83307 -148906 -14268 -171928 189582 -117267
12331 101429 -187992 36197 14915 171010 -241865 -35675 4226 167442 -23373 -3034 45151
12319 313141 -98732 -31530 -79973 -132460 90547 -113183 70194 324001 -167153 -158924 -444907
12308 -444907 -175676 -302370 -147422 -41470 291535 117632 64617 142442 103308 280392
12298 280392 -51373 137333 323516 168446 -142131 319789 195886 -23674 462081 57075
12287 -264260 20609 81360 -230720 -72166 292303 -302116 187501 -168849 180297 260760
12277 260760 348736 309408 175634 33616 131837 399888 78613 255183 -62277 88476 120303
12266A20303e1573C80707A08764l8171b06952A293a92824R2315k50893B22603
12255I6069j2980b4145G6729k4117g8343I735J32381K20046H8952O0050K2872
12244A71874H5212j8598K0075J6253e0633j20910I2429J88071e9674A62740a01915
12232B59241g63j2113C30540D7736d0972C56200o2249C6818M91012A76550K2889
12221A99439D8606J93195M5871D7952K21100c0848F912h0718A34690E3163c29357
12209i4899B29971e5667B80508J25670b25989C16102A51797a0946C02256h4362
12198B89864A43806k6706g4708a862D4108K80433j37157J59909j31533J7945D266
12186B47624A0477J15923C8033e5257B25810k0557J24778f897j12103e87k9477
$$ plain form
12266 120303 -51573 380707 108764 70593 -206952 1293 -192824 -100509 -351402 222603
12255 96069 83089 -24145 76729 52612 -78343 9735 142116 362162 88952 149002 171874
12244 171874 85212 66614 86689 102942 -50633 -171543 92429 280500 -59674 162740 -101915
12232 259241 -763 -12876 330540 47736 -40972 356200 293951 36818 527830 176550 199439
12221 199439 48606 241801 287672 47952 269052 -30848 6912 -80718 134690 53163 -329357
12209 -94899 229971 -55667 280508 406178 -225989 316102 151797 -10946 302256 -84362
12198 289864 143806 117100 -74708 -1862 44108 324541 187384 347293 215760 233705 4266
12186 247624 10477 126400 38033 -55257 225810 205253 330031 -6897 -119000 -587 -30064
12175c0064A10665J62108F6919J77117b25934F7692J4340d3127B4750L20770J2832
12164C58352l9082c01248A61765A9788K273a30988j47418j02600A98592P7286
12154B75878I1427h5700J5881B61729i8963B29752C6269b16715f4913B20857i1532
12142A11569f3208a4529B55093n0940I2286f3019j63962R5291B09613f1378r4611
12131a55989c7482B12473L9142G2262a94452H3720J79170j10584a05249I8359
12120c447o0638b5066B06004j01092b4722A20683P2515g8554I4577h3732A9983
12108A44255N77f8091A64380o1697a71566C1349J84865D6364J16330l5718C9341
12096a47541A59505m8815h541A78331L9703I62P7980F6a37269p1228B54918A19302
$$ plain form
12175 -30064 110665 272773 66919 244036 -225934 67692 82032 -43127 24750 345520 358352
12164 358352 319270 -301248 161765 19788 22061 -130988 -278406 -381006 198592 275878
12154 275878 91427 -85700 -69819 261729 -98963 229752 36269 -216715 -64913 220857 -91532
12142 111569 -63208 -14529 255093 204153 92286 -63019 -226981 -131690 209613 -61378 -155989
12131 -155989 -37482 212473 251615 72262 -194452 83720 262890 152306 -105249 98359
12120 -3447 -64085 -25066 206004 104912 -24722 120683 193198 -78554 94577 -83732 19983
12108 144255 144832 -68091 164380 102683 -171566 31349 216214 46364 162694 126976 39341
12096 -147541 159505 110690 -8541 178331 218034 962 78942 66 -137269 -208497 254918 119302
12083d50693A64843B8651L818h8217A16390E6104K36601P16249J302716n61216
12073A750454F62632A30542j6689b31411e2971A32790J1312a61955j03342g5319
12062A28621D957J95990a70800e5483B95067d120j23542b5859B83028r6669N8364
12051B44723J52578a13257I1673c20093C68299f8901A86511J7164C1319J1479
12041D2798J6386h1710c6718j32329L7140A27432e7099H6181H036b01655C7674
12029D082j632P4731C2604F692a20133A96496F752M4230a88088M061H4249k8277
12017E5972d6545f497l22659I1904a43871B2543a36882l1591G6813a27509L8911
12006h8598A6410G85K56944E2125K5487c8644j10866J770L5345k40856F6356j3811
$$ plain form
12083 -450693 164843 28651 32469 -88217 116390 56104 292705 1008954 2311670 1750454
12073 1750454 662632 130542 113853 -231411 -52971 132790 144102 -161955 -265297 -75319
12062 128621 4957 200947 -170800 -55483 295067 -4120 -127662 -25859 283028 186359 244723
12051 244723 397301 -113257 91673 -320093 368299 -68901 186511 203675 31319 42798
12041 42798 59184 -81710 -36718 -169047 -131907 127432 -57099 86181 8036 -201655 37674
12029 4082 2450 77181 32604 6692 -120133 196496 6752 50982 -188088 -184027 84249 55972
12017 55972 -46545 -6497 -329156 91904 -143871 22543 -136882 -168473 76813 -127509 -88598
12006 -88598 16410 785 257729 52125 77612 -38644 -149510 -147740 -112395 -353251 66356 52545
11994E2545c8285j02756A27477m6348n191a05981B31716j7434I2656b23915E1809
11982B06739e4447b5619k0524A13731a26441J4481A06724b87606D1632O7614a93551
11970b1643B06102a05455n14685a91373p1706B16706C6053N7296k5407P0895d7355
11958d44498A10813J3197E5715R1326k6089a57046A23914a29568B38573H8893
11947d7803k3787A14947a79903K2581a2993B4879q488c05217A45135l1240a53432
11935b13394H4367f1389j84591B38276g0183r8878h170C6789N3689a37211c5486
11923H9986Q0015N7495B0186J98986d030C41984E7365b0659C1775b08686b1992
11911a49601B35416h5048A84783a46302J2185c5204J6692m7265p6248m49034A92942
$$ plain form
11994 52545 -38285 -141041 127477 81129 75938 -105981 231716 214282 92656 -223915 51809
11982 206739 -54447 -25619 -46143 113731 -126441 -111960 106724 -287606 41632 109246 -193551
11970 -21643 206102 -105455 -620140 -191373 -263079 216706 36053 93349 67942 138837 -47355
11958 -444498 110813 124010 55715 147041 120952 -157046 123914 -129568 238573 88893
11947 -47803 -71590 114947 -179903 -157322 -12993 24879 16391 -305217 145135 113895 -153432
11935 -213394 84367 -61389 -245980 238276 -70183 -169061 -8170 36789 90478 -137211 -35486
11923 89986 170001 227496 20186 219172 -4030 341984 57365 -20659 31775 -208686 -21992
11911 -149601 235416 -85048 184783 -146302 -134117 -35204 -18512 -65777 -142025 -591059 192942
11899B90173a64019B65549C842g3118B989M3927h7437c861B35782a06647B2853
11887A91697a5377B53804b4254j88571R847N0551j23448R4441h8858i119b90F6632
11874a03280M8136k07357A18920a43788E9531K85488A71070R734g6950Ad2624
11862b94874A36114J21177a79875h7453H9755b08836f831A16175a17812B72386
11851B32174b00599B35248I4535h0855C82435G2289a2747j38497j65124B90697
11840b53651j601m8320B80044e5109G0679a71144A09536b94004F3559J40990p9965
11829A24584q711a33257c4830k61330P3872R7983N1326k72915g1009K3006o7930
11818a15933B59554h8510J4925j01035j81544f005j25471K8717c6208q4346j12340
$$ plain form
11899 290173 -164019 265549 3842 -73118 2989 46916 -87437 -3861 235782 -106647 22853
11887 191697 -15377 253804 -24254 -212825 -202978 -152427 -275875 -181434 -88858 -9119 -290 66632
11874 -103280 -55144 -262501 118920 -143788 59531 345019 171070 180804 -76950 1 -42624
11862 -294874 136114 257291 -179875 -87453 89755 -208836 -6831 116175 -117812 272386
11851 232174 -200599 235248 94535 -80855 382435 72289 -12747 -151244 -316368 290697
11840 -253651 -255252 -303572 280044 -55109 70679 -171144 109536 -294004 63559 204549 124584
11829 124584 115873 -133257 -34830 -296160 -222288 -124305 -72979 -345894 -71009 -48003 -115933
11818 -115933 259554 -88510 -73585 -174620 -356164 -6005 -131476 -102759 -36208 -120554 -232894
11807b32894R9671q6925a6776F3372a78647j46860C90101a98854A25695a14530
11796A63566a72493c2868A54601b18304E9590b32604a7562A9631J34195i063n5579
11785f4642b1219l97734q8547J98494h7861J1968k9338d4742j45859A66444C0930
11773B24891d21448g3314F3162c33850J63491B89624J35988j03102d8964E7274
11762b05907C07154C7070q281b8222B14761B5560c6162j851q9236a9742j08898
11751a28640c8682B14002g1974j07637L1599B22477f6243C26517I2089K74052
11741C66141a54957j8956B24812r395a15185k2913a906G1533a36459c7172b224
11729A33961b5030A01046a04990b8604A72054D2580J27215b8580j01103C56408
$$ plain form
11807 -232894 -133223 -220148 -16776 63372 -178647 -325507 390101 -198854 125695 -114530
11796 163566 -172493 -32868 154601 -218304 59590 -232604 -17562 19631 153826 -9063 -64642
11785 -64642 -21219 -418953 -507500 -309006 -87861 -75893 -105231 -44742 -190601 166444 30930
11773 224891 -421448 -73314 63162 -333850 -170359 289624 425612 322510 -48964 57274
11762 -205907 307154 37070 28789 -28222 214761 25560 -36162 -38013 -127249 -19742 -128640
11751 -128640 -38682 214002 -71974 -179611 -148012 222477 -66243 326517 92089 366141
11741 366141 -154957 -173913 224812 215417 -115185 -138098 -1906 71533 -136459 -37172 -2224
11729 133961 -25030 101046 -104990 -28604 172054 42580 169795 -28580 -129683 356408
11718b77983A15949d8666B3040a5609j2737k45731J07287A0489a76302g311A41243
11706b542C22310c9178k5065I1469b62378J28654A62704c5695j62111e5848r6969
11695a52817H1647e1950A1987K09672b23059e9415C22036q8233q8851a40355b1028
11683A66956g6440C0919O7547g4854k07093C52204a05405k61288c0087l9807C6591
11671B26571M456a5718r223G8886R3199o4086e2392B9827h7983A21729j1345K15311
11659C25695C4323e0438G9098J90451c7487j86208F1748b61446C6062J53440m6190
11648A43312a99380D0761N5355b2255A9367c2751A07049R8103N8247I6364K0136
11637A16500P5973h3026m738p4948j06224c5470n7001D71292k17602d1877A03174
$$ plain form
11718 -277983 115949 -48666 23040 -15609 -28346 -274077 -166790 10489 -176302 -7311 141243
11706 -2542 322310 -39178 -64243 91469 -262378 -133724 162704 -35695 -197806 -55848 -152817
11695 -152817 81647 -51950 11987 221659 -223059 -59415 322036 233803 144952 -140355 -21028
11683 166956 -76440 30919 98466 -74854 -281947 352204 -105405 -366693 -30087 -69894 36591
11671 226571 231027 -15718 -24941 78886 172085 107999 -52392 29827 -87983 121729 110384 325695
11659 325695 34323 -50438 79098 269549 -37487 -223695 61748 -261446 36062 189502 143312
11648 143312 -199380 40761 96116 -22255 19367 -32751 107049 205152 263399 96364 116500
11637 116500 192473 -83026 -87764 -162712 -268936 -35470 -92471 471292 253690 -41877 103174
11625B08455e89B30021m2028E0459O4998J80880A15470a64582B42049A2981M9712
11614F2693i9599p4888j37375J35172f3216j47913J02282I6220B307J63603a31276
11602A1571C983b81864F040R8263e121A01809K46250E7004a18074B16331p2726
11591A43605F7620d01068a52561A72795b0214A37284J47434a34955d9880B16144
11580b7466j10621A05273Q8470N1711b292A97687G3664b34534m7149g8702A21764
11568I9817J7162e8044A74538a40233A52178e3530H9009E857J28033n0716a8690
11556B5630d4312b0665F0226d8653C60423A9555M0475B4923K58282d8005B17376
11544a23617b0378B86523b07195R9779C50234m5105q8309a15318p556A19363O1567
$$ plain form
11625 208455 -589 230021 187993 50459 115457 296337 115470 -164582 242049 12981 62693
11614 62693 -99599 -174487 -311862 -176690 -63216 -211129 -108847 96220 2307 165910 -131276
11602 11571 3983 -281864 6040 104303 -5121 101809 348059 57004 -118074 216331 143605
11591 143605 67620 -401068 -152561 172795 -20214 137284 284718 -134955 -49880 216144
11580 -27466 -138087 105273 193743 245454 -2292 197687 73664 -234534 -281683 -78702 121764
11568 99817 116979 -58044 174538 -140233 152178 -53530 89009 5857 133890 83174 -18690
11556 25630 -44312 -20665 60226 -48653 360423 19555 60030 24923 283205 -48005 217376
11544 -123617 -20378 286523 -207195 -107416 350234 305129 216820 -115318 -122874 119363 180930
11533A80930O6214E3313b82470B82145D1517M4385J01233D5054K70646p4703H1765
11521E1137a58963L4185A15354O5939c5391o3251j18449c5780C93910c5429A38267
11509A35656A335K89834P776b1647A76463d5151B07737p7115L29728a18700A48401
11497A38073o475D8416J69291J8371r5721N5819g0594o1318C5525h8036a3831
11485a12816C58433r2707h6484D4406i0458B68175e1486M611J4142A13288e6087
11473E06636A51566L4069J19570A27007N0928O6302a45263p2354B17926a30230
11462b38179c0656o776r1399A69612d5295D1985Q346b7747G9714a83439D12909
11450A42671M3877L0503b3326l5662E2126N16655i8832I3940P8246K2400p0937
$$ plain form
11533 180930 247144 53313 -282470 282145 41517 85902 187135 45054 315700 240997 81765
11521 51137 -158963 -124778 115354 181293 -35391 -98642 -217091 -35780 393910 -35429 138267
11509 135656 1335 291169 298945 -21647 176463 -45151 207737 130622 460350 -118700 148401
11497 138073 131598 48416 217707 236078 140357 196176 -70594 -131912 35525 -88036 -13831
11485 -112816 358433 265726 -86484 44406 -90458 268175 -51486 -46875 -32733 113288 -56087
11473 506636 151566 185635 305205 127007 177935 244237 -145263 -217617 217926 -130230
11462 -238179 -30656 -37432 -128831 169612 -45295 41985 50331 -27747 79714 -183439 412909
11450 142671 186548 217051 -23326 -58988 52126 568781 -98832 93940 172186 194586 123649
11439A23649c44250f1104J8830j0057N003o631J7527C82877a11488K2340p099
11428i6247A41095b4751C0846a53372c0126q6580K2645A13084e9271l2433o8414
11417a60118r0096a06128C80982D2266b07282j5982q987A91330d0739G2104b45430
11405a05170c5595r9977c6423m6175G9451e9987B21749l9911c9643B36972r155
11394B27817c7108A3520L7314c9237m1085A05516B9247c2429F6629a53307B66761
11382H8161R2833h807j22988O0220A96430o9434a11061A93962g2836C41025b68193
11370B5882K82714b5273B11129f4139B24929F3625f6606j7080A32849b45538i8673
11358h4196Q670B21506C6860J04316Q3532a61506b578k80590C51312A22047J38239
$$ plain form
11439 123649 -344250 -61104 -42274 -52331 -47328 -53959 -36432 382877 -111488 -89148 -96247
11428 -96247 141095 -24751 30846 -153372 -30126 -116706 -94061 113084 -59271 -91704 -160118
11417 -160118 -250214 -106128 380982 42266 -207282 -223264 -232251 191330 -40739 72104 -245430
11405 -105170 -35595 -135572 -36423 -82598 79451 -59987 221749 181838 -39643 236972 227817
11394 227817 -37108 13520 50834 -39237 -80322 105516 29247 -32429 66629 -153307 266761
11382 88161 180994 -8807 -131795 -71575 196430 126996 -111061 193962 -72836 341025 -268193
11370 25882 308596 -25273 211129 -64139 224929 63625 -66606 -83686 132849 -245538 -98673
11358 -84196 -75526 221506 36860 141176 224708 -161506 -2578 -283168 351312 122047 260286
11347B60286q3709f9223l74204C3141K9582a81035B15489b52497R7476c7087j32326
11336a69413A07747a7682C03048A22218O9097i8823p1320B12601A12N2648b72979
11324A96669e5137H4039M8822g1265q7596k4375B25513A9507P6474d52977h1421
11312b04044e154r2055o8805n3359A564a30826A51193R5192d41028h9550A08924
11300A81174b05799C4647N2819J05977b93376B62373j16702E8708g3870r9524
11290a73394B03514l2333F7052J1856a88041N0534A36035e9879Q86j2736B4939
11278F6974K0822a98889f8999F4530d8145D8089c16556H6888L3548g3712j33101
11267b06813O9323A58635D528J04383e3305A03504a30583p8817m4931A12887a62434
$$ plain form
11347 260286 176577 -69223 -443427 33141 62723 -181035 215489 -252497 -155021 -37087 -169413
11336 -169413 107747 -17682 303048 122218 191315 -98823 -170143 212601 112 52760 -272979
11324 196669 -55137 84039 132861 -71265 -158861 -183236 225513 19507 95981 -452977 -81421
11312 -204044 -5154 -97209 -166014 -219373 1564 -130826 151193 246385 -441028 -89550 108924
11300 181174 -205799 34647 87466 193443 -293376 262373 145671 58708 -73870 -173394
11290 -173394 203514 171181 67052 78908 -188041 -137507 136035 -59879 -58993 -71729 24939
11278 66974 87796 -198889 -68999 64530 -48145 48089 -316556 86888 120436 -73712 -206813
11267 -206813 -137490 158635 4528 108911 -53305 103504 -130583 -209400 -254331 112887 -162434
11255D0753J30578D9701a87434j3783c12C589J47792a45036j35006J06931A17441
11243b32974b0488q0646q1350K4338B53480D6087B0905b72323E3525n689K86320
11232C34156c72006c3664k67181c31j71739r0734i6522k7027K7923c5256j86813
11221b22069B91893e74052a27956A6422a56933A23742d7749l5829o0284I5737
11210B05670C5495a27060M8112H19J37820m6496b02977i4022a0066d433E7331
11198g062J001A66774J7J17280a56694A9475J42953c94082B75273c8326A27184
11186A28040L7090o511j8368c29107C07705a9470m0279j04425P8541o3865j7851
11175a67349q7030B66858b07559B1283J28557l0249l7758a16540H5013k7109q753
$$ plain form
11255 40753 171331 49701 -187434 -201217 -312 3589 151381 -145036 -280042 -173111 117441
11243 -232974 -20488 -101134 -182484 -158146 253480 46087 20905 -272323 53525 47836 334156
11232 334156 -372006 -33664 -300845 -331 -172070 -262804 -96522 -123549 -95626 -35256 -222069
11221 -222069 291893 -574052 -127956 16422 -156933 123742 -47749 -83578 -143862 95737
11210 205670 35495 -127060 -78948 819 138639 92143 -202977 -94022 -10066 -4433 57331
11198 -7062 -6061 166774 166791 284071 -156694 19475 162428 -394082 275273 -38326 127184
11186 128040 165130 158619 140251 -329107 307705 -19470 -59749 -164174 -85633 -149498 -167349
11175 -167349 -254379 266858 -207559 21283 149840 119591 81833 -116540 85013 57904 49151
11164D9151e1433F377J45275J27745a88825P2028k78451H3751c40579f4268B3066
11152A82188b04894A26657J3917F6112h7418D0122K15512A16385a17524A7228
11141f3689C10456A29436C0937a44388M3669K7999a1041A23818a42396A48667
11130A63708p3088J25585m5595f8229J5223D3151b25526A46314d9364B06058i804
11118b27702B8630c0114A51354C0354b23957j74716i7594B86288l8973a14554
11107h9716C222K22256C9122c872A37031C9485K00493M4856k5396a51189A27501
11095B28017a09130G2136K08194n5870k9864j920O4359a89051A28056L96890B19176
11083D68018D9301K77843a79339A55309h2679B90691K37855B37535l1170e363
$$ plain form
11164 49151 -51433 6377 151652 279397 -188825 -116797 -395248 83751 -340579 -64268 23066
11152 182188 -204894 126657 140574 66112 -87418 40122 255634 116385 -117524 17228
11141 -63689 310456 129436 30937 -144388 -100719 -72720 -11041 123818 -142396 148667
11130 163708 90620 216205 170610 -68229 -53006 43151 -225526 146314 -49364 206058 -9804
11118 -227702 28630 -30114 151354 30354 -223957 -398673 -97594 286288 247315 -114554
11107 -89716 3222 225478 39122 -3872 137031 39485 239978 284834 259438 -151189 127501
11095 228017 -109130 72136 280330 224460 194596 192676 257035 -189051 128056 524946 219176
11083 468018 49301 327144 -179339 155309 -82679 290691 528546 237535 206365 -5363
11072h582B83534P5082B9909L76110h9045B61359j1772H6592L49222j87203K90690
11061E39301p2117L1150A99708K42547K85068k43280L68213C33448K81507R1727
11051G06682j4990p1904Q079k59034K97665K7043J91551j89244C38164J91575
11041E29739J27351J10136R6562q4100k34226j1437K24344k38375n1648J65957
11031F34303N329J9966j55892N8039P3596L12170j14230q0919K02696j54692k90935
11020E09431K26332C36232L10481L0567j77l1654k60494J30847N3268j23842K83419
11009G28647k62231k11613J52088k9599K04568J75646j64692j26302M04391m34125
10999D36778K26853j8466J72163l81335Q1891k49834L74032R3595J43066j44859
$$ plain form
11072 -8582 283534 358616 29909 406019 -89045 261359 249587 86592 435814 248611 539301
11061 539301 467184 498334 199708 442255 727323 484043 852256 333448 614955 706682
11051 706682 691692 619788 627867 368833 666498 693541 885092 695848 338164 529739
11041 529739 657090 767226 863788 779688 545462 534025 758369 519994 468346 634303
11031 634303 639632 659598 503706 561745 635341 947511 833281 752362 955058 800366 509431
11020 509431 735763 336232 646713 677280 677103 645449 384955 515802 569070 445228 728647
11009 728647 466416 254803 406891 377292 581860 757506 592814 466512 870903 436778
10999 436778 663631 645165 817328 435993 517884 268050 642082 735677 878743 733884
10989G33884o317j80455N2769J66890p696l988K70425j89356J82131q6890J03184
10978A034581K10131J29435K23505l01845P63498J82126J34831J03261K12504
10969B692027R6612k53879J20539l69370k59313o1430l25689j47255p6540p4456
10959A341246M97301l10299M55397j35150l02848L41635j66478k29570n98429
10950H92805P1845l72900K27531k37402k60918J39376l2199q5361j62130J01543
10940B82190A32461K17930E4210a03815F11J68464G9636A8323O2548M4920J75204
10929C00995r6093a32709D757K00671l6398D0573J74610J39024e4381B39379b34342
10917C43373A09789b17744O0491A30891O805b92924A79443n8151l4772d5554A49999
$$ plain form
10989 733884 727567 547112 599881 766771 759075 755087 1025512 836156 1018287 931397 1034581
10978 1034581 1244712 1374147 1597652 1295807 2059305 2241431 2376262 2479523 2692027
10969 2692027 2788639 2534760 2655299 2285929 2026616 1965186 1639497 1492242 1415702 1341246
10959 1341246 1838547 1528248 1983645 1848495 1545647 1887282 1720804 1491234 892805
10950 892805 964650 591750 819281 581879 320961 460337 428138 342777 180647 282190
10940 282190 132461 350391 54210 -103815 611 169075 79636 18323 80871 125791 300995
10929 300995 204902 -132709 4757 205428 169030 40573 215183 354207 -54381 239379 -234342
10917 343373 109789 -217744 -157253 130891 137696 -292924 179443 121292 86520 -45554 149999
10905C77049C7681a94135k4694b4441l0017A25915E7928K46183e6309k71009d6193
10893B5642b33226n2661a31213k16074a15055J6573A83688b68456B62139n0816
10883B11323m0662c70417J09747C1113K03439a42409j2194d3219a1424l29166
10873c40590i2255D5758b432l75986H1174r771L207a20231B05032m6783h6095
10861a06523p4211M1658j52815A27847a28517F7040N9466C4047o947b27689B00510
10849E996K27732G3866K0837a72092A50173b40202F7090M3984q003f4985b6223
10837b81969A76313A5274a59156d8431E4611K68174b1249j49755F326P3487i9868
10825B9270a54346F6713A3566e941B18392g7127l55159c7129F8084k7741a40197
$$ plain form
10905 377049 37681 -194135 -218829 -24441 -54458 125915 57928 304111 -56309 -327318 -46193
10893 25642 -233226 -285887 -131213 -347287 -115055 -98482 183688 -268456 262139 211323
10883 211323 170661 -370417 -260670 31113 234552 -142409 -154603 -43219 -11424 -340590
10873 -340590 -92255 45758 -2432 -378418 81174 71403 74610 -120231 205032 158249 -86095
10861 -106523 -180734 -139076 -291891 127847 -128517 67040 126506 34047 27100 -227689 200510
10849 5996 233728 73866 94703 -172092 150173 -240202 67090 111074 103071 -64985 -26223
10837 -281969 176313 15274 -159156 -48431 54611 322785 -21249 -171004 6326 79813 -99868
10825 29270 -154346 66713 13566 -5941 218392 -77127 -432286 -37129 68084 40343 -140197
10813F5711a30873k53559A07268m3312a02337G4701J55689b4898A56594b76167
10802a8038m7229j04860C54597h4291r8482e2182j51277p4822B59501D5717a8720
10790C287e9048C51895h7303j31171A97808P1538b67594A19312O1400N3661G2674
10778G809J35652b12045J05824A0335c02899a21914I281a7687A04410J8786a36039
10766C7372J38706a5598G9597a88884B60777a07849r8115m1214A09915a23306
10755F5111d6700A71517b81174d4094m5560j20434C14589A03186c25265a39171
10744A01964A0018R2189a03870l33819a4894j74433h3000Q489A06173a50907j30410
10733b81317D27218h0696b5580j39177M8525F3015C001J56027K5813c64577C10340
$$ plain form
10813 65711 -130873 -384432 107268 63956 -102337 74701 230390 -24898 156594 -276167
10802 -18038 -65267 -170127 354597 -84291 -182773 -52182 -203459 -278281 259501 45717 -18720
10790 3287 -59048 351895 -87303 -218474 197808 269346 -267594 119312 180712 234373 72674
10778 7809 143461 -212045 -106221 10335 -302899 -121914 9281 -17687 104410 123196 -136039
10766 37372 176078 -15598 79597 -188884 260777 -107849 -205964 -247178 109915 -123306
10755 65111 -46700 171517 -281174 -44094 -89654 -210088 314589 103186 -325265 -139171
10744 101964 10018 102207 -103870 -437689 -14894 -189327 -83000 -74511 106173 -150907 -281317
10733 -281317 427218 -80696 -25580 -164757 -116232 63015 3001 159028 184841 -364577 310340
10721h6160a0646B6900b43917A72955a55713A16781a51221A56316a07281j24333
10711b31614i4733b8794j81731m1340h630r5202j98596f7371b8772n4471p7181
10700a60424N8082b4719n4090F2883M1789b2567A85660b54698n3682g7982E3272
10688C3250d911p5522p8698k3796e6494j35402A82684G2735b26404n7054b2947
10676e3453K5317j02800I1221C4294d8748g284A22152E6610a64645P6985k80708
10665c68368J58464D5402a33763d7133i151j28797A57880B9475L760b01747B11347
10653a75069C8295e4581B46593a32622H4660b74627C21156c17961a18622D4051
10642a57839F1374a80115A55551J19387j00579c378l3282k60932I2907a01155
$$ plain form
10721 -86160 -10646 26900 -243917 172955 -155713 116781 -151221 156316 -107281 -231614
10711 -231614 -94733 -28794 -210525 -251865 -8630 -103832 -302428 -67371 -28772 -83243 -160424
10700 -160424 -102342 -24719 -78809 62883 104672 -22567 185660 -254698 -308380 -77982 53272
10688 33250 -4911 -80433 -159131 -182927 -56494 -191896 182684 72735 -226404 -283458 -22947
10676 -53453 -28136 -130936 91221 34294 -48748 -7284 122152 56610 -164645 -87660 -368368
10665 -368368 -209904 45402 -133763 -47133 -9151 -137948 157880 29475 33235 -201747 211347
10653 -175069 38295 -54581 246593 -132622 84660 -274627 321156 -317961 -118622 44051
10642 -157839 61374 -180115 155551 274938 174359 -3378 -36660 -297592 92907 -101155
10631A9542a15157R760o110C24163a53430I2675a72045j20843i0565N957A35368
10619a93401i2818m3200M4595M0392p1019k1630k80711E2124J05386a11053r2962
10608b04015R3838L1786q2261A81413c7606j72168j87590B49323I5218b17214
10597c28692d3577j7264F8712M2372b45720B66153B0677a97742R6791A4326J94576
10586B08902J13561A7882h696A54538b62853B52507j12748a52153j14956Q4705
10576a82404J3222F7011a69014K5595B03226d57645A6092J40398c1392A31694
10565A37734i5733M2637D3681a32305A66471h9370m3268B21706b03839c6127B7373
10553g1431k05104A14304l1083c62508h6526H7219R0760e3208l3574A75968K6649
$$ plain form
10631 19542 -115157 -105397 -111507 324163 -153430 92675 -172045 -292888 -90565 -84608 135368
10619 -193401 -92818 -136018 -91423 -51031 -122050 -143680 -424391 52124 157510 -111053 -204015
10608 -204015 -110177 -78391 -160652 181413 -37606 -209774 -397364 249323 95218 -217214
10597 -328692 -43577 -60841 68712 111084 -245720 266153 20677 -197742 -100951 14326 208902
10586 208902 322463 17882 -8696 154538 -262853 252507 139759 -152153 -267109 -182404
10576 -182404 -169182 67011 -169014 -143419 203226 -457645 16092 156490 -31392 131694
10565 137734 -95733 -53096 43681 -132305 166471 -89370 -132638 221706 -203839 -36127 27373
10553 -71431 -276535 114304 83221 -362508 -86526 87219 177979 -53208 -86782 175968 202617
10542B02617G4074J75919b11694B81608B1089b9048n1496L1012A21004Q2555g0734
10530b51734J19174f3948A47081e4427k82047B41313C748O7539d4613p7719J0846
10519a11486d6033j8705j21062c2256m8438F8416a34093j6289c7403I6813J10067
10508B06880b38959n821M4479F3284b01827A10052a56523P6636c617A94145G8902
10496A4242J75055a18057b473k09502J01283e399D786L19975j06665a27568L6806
10485i0762E5427A4791a6254q2042a4423A00571M26950j83539j45645J11951A20242
10473A48296m3457J44676b1301q7345B18151d431p2367A14222b15488C36260j37490
10462A98770b66010a28295A36845c6383a6614j53317A48842a2358G6382a9329
$$ plain form
10542 202617 74074 249993 -211694 281608 21089 -29048 -80544 -49532 121004 203559 -70734
10530 -251734 -132560 -63948 147081 -54427 -336474 241313 3748 71287 -44613 -122332 -111486
10519 -111486 -46033 -64738 -185800 -32256 -80694 68416 -134093 -150382 -37403 96813 206880
10508 206880 -238959 -244780 -200301 63284 -201827 110052 -156523 -79887 -3617 194145 78902
10496 14242 189297 -118057 -2473 -211975 -110692 -5399 4786 324761 218096 -127568 -90762
10485 -90762 55427 14791 -16254 -98296 -14423 100571 527521 343982 198337 310288 120242
10473 148296 104839 249515 -21301 -108646 218151 -4431 -76798 114222 -215488 336260 198770
10462 198770 -266010 -128295 136845 -36383 -16614 -169931 148842 -12358 76382 -19329
10451b14006C3606O8506j4772a77189m5994Q4789k678e9242l35625a10049A04830
10439A83655q7442J67718B3740c03004D7779L7622a15756F562h8976A09505B2892
10427B892J48020c0178P539j97081J9501D5416a63702P4462A93252j2798Q7226
10416B67680m0209b86230i2820C7568b21276b6535o3415b2121k33424B4141c2454
10404c0591A08276M7796b15892B74378a19349B1232J06274g9104E3373N4784K38943
10393C47100C4304L52662A43164l3862K22285a22068A73223n9908J2952j6365
10383A09902K80194j82303F6345O950J36994L337N2965a9556C41471A04639J10802
10372B15441g2163D80362A76601m2316J99609n7599Q2997n873m9204K63603G3541
$$ plain form
10451 -214006 33606 102112 87340 -177189 -223183 -138394 -141072 -59242 -394867 -110049 104830
10439 183655 96213 263931 23740 -303004 47779 85401 -115756 6562 -88976 109505 22892
10427 2892 150912 -30178 -22639 -219720 -200219 45416 -163702 -89240 193252 180454 267680
10416 267680 227471 -286230 -92820 37568 -221276 -26535 -89950 -22121 -255545 24141 -32454
10404 -30591 108276 156072 -215892 274378 -119349 21232 127506 -79104 53373 108157 347100
10393 347100 34304 386966 143164 109302 331587 -122068 173223 113315 126267 109902
10383 109902 390096 207793 66345 73295 210289 213626 266591 -19556 341471 104639 215441
10372 215441 -72163 480362 176601 134285 333894 276295 359292 353419 304215 567818 73541
10360C55379C6462K40039J1616A03193a06814A20110n7567I629J6972M04173B02647
10348D50073p8327D6155L51249l6990K99451C18358J5825J49832a23950A66104
10337A6928L75757d6111A06692L29508h1686C64123A18370D2132e7055B63089
10326a09279b362G7370P8509a04461A3410O5741K24772J10764E3805a6155C58362
10314I9072d9273k3422A26467a10283A95034J16375j14582J68649a51718a8753
10303a44468j19389Q3497j82526d8582j84996a4945l379j7889r4347p1799C28355
10291A97563K5851P547g252j52252m1451n8150b1516H0856f9493j128l06522a34327
10278b5904j04388b3499j39327n1042R1181J8675D338h5139B03081c77623I0380
$$ plain form
10360 355379 36462 276501 288117 103193 -106814 120110 62543 9629 26601 430774 202647
10348 450073 371746 46155 397404 360414 659865 318358 334183 484015 -123950 166104
10337 16928 392685 -46111 106692 436200 -81686 364123 118370 42132 -57055 263089
10326 -109279 -2362 77370 155879 -104461 13410 79151 303923 414687 53805 -16155 358362
10314 99072 -49273 -72695 126467 -110283 195034 311409 196827 365476 -151718 -18753
10303 -144468 -263857 -180360 -362886 -48582 -233578 -14945 -18324 -36213 -130560 -202359 328355
10291 197563 223414 230961 -7252 -159504 -200955 -259105 -21516 80856 -69493 -70621 -377143 -134327
10278 -25904 -130292 -23499 -162826 -213868 -122687 -104012 4338 -85139 203081 -377623 90380
10266D5486K1000J22107a40772A72859j623g7267A23278K23623G0183p979J34698
10255A96902J78667A57961a2711F3619K83282a07834A55584a11475D6557a91529
10244A27635a77634P538D8014K83226c89042P2823J42972L8636n6007a0533j42471
10233a53004a6654o0905r0111N8182o6898f628k13007f2205i346j76225q3599
10222b69170A22968f6106B3209e9134j18495B51796m1071a94400k11560A2937
10211E0233O0973a51338I2612j9178c33799J41259l0773A3594a22639r1411j32943
10200c46993J7075B2465a25891a9531q2904R69o6038A77095c61451f2564b0642
10188a7277A63947L655a25587C6493F854b34440j570l32955E7164a73928A17682
$$ plain form
10266 45486 66486 188593 -140772 172859 171236 -77267 123278 346901 70183 62204 196902
10255 196902 375569 157961 -12711 63619 346901 -107834 155584 -111475 46557 -191529
10244 127635 -177634 -170096 48014 331240 -389042 -316219 -173247 -134611 -190618 -10533 -153004
10233 -153004 -16654 -77559 -167670 -109488 -176386 -6628 -219635 -62205 -9346 -185571 -269170
10222 -269170 122968 -66106 23209 -59134 -177629 251796 210725 -194400 -405960 12937
10211 50233 111206 -151338 92612 73434 -333799 -192540 -223313 13594 -122639 -214050 -346993
10200 -346993 -329918 22465 -125891 -19531 -102435 -101466 -167504 177095 -361451 -62564 -20642
10188 -17277 163947 167602 -125587 36493 6854 -234440 -236010 -568965 57164 -173928 117682
10176C9203a60439k00954d9195A72139a52163P3327c2600a6217I0688d2225B26697
10164C05229a46218n4579l8646c4299q9011C14155a84236n1433i7252B1463e5938
10152a6233m0857n2193c1451j35720B29332c79668J66105a4698l3196k0661l50466
10141d19021A29793b69727f5697j72053Q7784A97952B8258b89629a09303B54338
10130A37026b03544a01162A53377e3410k48289M3032J2632p6678f9321o8376N8485
10119g9212L2039D3749a46494B55750g6448k40737q9774D8960J4224a79823D8606
10107a32303N6354k55620g4089L1397k14437k8409a7542j34830B1046J95478a115
10095g1077J5464A12219J29026F5115R0379c22580A60496o20N0968b44068i4664
$$ plain form
10176 39203 -160439 -361393 -49195 172139 -152163 -78836 -32600 -16217 90688 -42225 226697
10164 305229 -146218 -200797 -239443 -34299 -123310 314155 -184236 -235669 -97252 21463 -55938
10152 -16233 -57090 -109283 -31451 -167171 229332 -379668 -213563 -14698 -47894 -68555 -419021
10141 -419021 129793 -269727 -65697 -237750 -149966 197952 28258 -289629 -109303 254338
10130 137026 -203544 -101162 153377 -53410 -301699 -258667 -246035 -322713 -69321 -137697 -79212
10119 -79212 -47173 43749 -146494 255750 -76448 -317185 -406959 48960 63184 -179823 48606
10107 -132303 -75949 -331569 -74089 -42692 -257129 -285538 -17542 -152372 21046 216524 -1115
10095 -71077 -55613 112219 241245 65115 155494 -322580 160496 159876 210844 -244068 -94664
10083B70840A6468a71960L3373f0162C6770b40869I5933a57999b3806A01962b82431
10071h7082C00562a80990Q3092n704k22923g7724K7782p4652d9310B78819q3959
10060A94860K50146E5953a9421j29244a8200j66436m069B8756e9754G4288a07554
10048b16574f272k23148C8426a32897I1399h1044A09450e804B93711b78467A62111
10036A44335m1182b97693J48060d8753A03430a98205F2840a1791m7354l55821
10026d14966I6601D1644e8531k5950k74484I7813a01122d552A41253n3605L7448
10015A25096C7695i313l4879g687j72653O2628l4782H4974a14363a3214A92327
10003c05649k37137K32336Q9152d9525I8424b59183G3009n673J38855a99816c2626
$$ plain form
10083 270840 16468 -171960 -138587 -60162 36770 -240869 95933 -157999 -23806 101962 -282431
10071 -87082 300562 -180990 -97898 -103602 -326525 -77724 -49942 -124594 -49310 278819 194860
10060 194860 445006 55953 -19421 -148665 -18200 -184636 -188705 28756 -59754 74288 -107554
10048 -216574 -6272 -229420 38426 -132897 91399 -81044 109450 -5804 293711 -278467 162111
10036 144335 103153 -297693 -149633 -48753 103430 -198205 62840 -11791 -59145 -414966
10026 -414966 96601 41644 -58531 -84481 -358965 97813 -101122 -4552 141253 87648 125096
10015 125096 37695 -9313 -44192 -7687 -180340 -117712 -152494 84974 -114363 -13214 192327
10003 -305649 -542786 -310450 -221298 -49525 98424 -259183 73009 67336 206191 -199816 -32626
9991A9184c21870c8965H6570n423C6324a26539l2376l3052k27568a30009N6995
9980g3014n9500D1755j0112L40211a37224H1864g4558A85494Q9966f8849o3803
9969a32652J3383L8207G6481c58007J04487J06629B3047b56353i7218j48620Q5359
9958a60479B57176b0140j04657K5050G429b24762m060A38712a28788c4044o9575
9947a03619m1309A45502o2066c08340a10788d9503k9840p3308p7430N3123A12283
9935A27926j8247k3249K2818b7817C6570d6395D7620J8884a19951j14907D5226
9923e0312k58300A74364a98101P6567A54577c8469A37054h6617o2591A02712a82291
9911a44293d8434a6213A64394C601e4582q4427m1196I0210c48411N8615J41180
$$ plain form
9991 19184 -321870 -38965 86570 81147 36324 -126539 -158915 -191967 -419535 -130009 -73014
9980 -73014 -132514 41755 31643 371854 -137224 81864 -74558 185494 275460 -68849 -132652
9969 -132652 -119269 -81062 76481 -358007 -253520 -146891 23047 -256353 -97218 -245838 -160479
9958 -160479 257176 -20140 -124797 -99747 7429 -224762 -228822 138712 -128788 -34044 -103619
9947 -103619 -144928 145502 83436 -308340 -110788 -49503 -79343 -152651 -230081 -176958 112283
9935 127926 109679 86430 109248 -27817 36570 -46395 47620 66504 -119951 -234858 45226
9923 -50312 -308612 174364 -198101 -121534 154577 -38469 137054 -86617 -149208 102712 -182291
9911 -144293 -48434 -16213 164394 3601 -54582 -139009 -180205 90210 -348411 -289796 -148616
9900a48616L4503C07492A32685J24336F391J64165D1095O3532c9274D0006b65300
9888g0480G571d261A87342g8151j57079L3960B90988f3108I1366a18004j54476
9877b72480g2170k6593r9870l6105p713a4682q8684j53765I8168B7897R6437l680
9865A20654b65686M6937f085D3542c16756i7468j64028J29621B57927E298d7206
9853D91734a45280J8643n3010g9547C8061b46677k1174J06649f4337I6312a36488
9841D0817a6029o9767M269p4516N0155M4161B75863a00417k68955E3628d00002
9829a80991h9774j97563j54249A38730N4566a81317C5639a97425c6856G1416a97173
9817F8166C3494L04423i4462j02178A51491C4437c19821P4477a01472j6188K7672
$$ plain form
9900 -148616 -114113 307492 132685 257021 6391 170556 41095 104627 -39274 40006 -265300
9888 -70480 7571 -4261 187342 -78151 -235230 -201270 290988 -63108 91366 -118004 -272480
9877 -272480 -72170 -98763 -198633 -234738 -242451 -14682 -103366 -257131 98168 27897 124334 120654
9865 120654 -265686 -218749 -6085 43542 -316756 -97468 -261496 -131875 257927 5298 -47206
9853 491734 -145280 -126637 -179647 -79547 38061 -246677 -267851 -161202 -64337 96312 -136488
9841 40817 -16029 -85796 -81527 -156043 -105888 -61727 275863 -100417 -369372 53628 -400002
9829 -180991 -89774 -287337 -441586 138730 193296 -181317 35639 -197425 -36856 71416 -197173
9817 68166 33494 337917 -94462 -196640 151491 34437 -319821 -245344 -101472 -117660 -89988
9806h9988C09217F5831b62824b1522l39079C9941J01366b79568A45594n7657b12817
9794a86617Q3220q4579j55546f8771k0826A56785K5866a61490B66209I0619g9069
9782b09688B05723D5734j5248e5740a5161l96806B87922a08027j79140Q0259C19115
9770A12919a94783m5851A5231a16548j44813J04323p6961c900k7984E5710O0827
9759A16537B2265J26575D7951a52254L8792j90350g7687j42310O7690J5724E6980
9747f9403k5607j94074I7822J16119b22659Q0962P329r5794K6073K6165H8213
9735G0253J4210h9643p7166Q561M4633j879p2335B8521c29212a42329j18636D0616
9722c81913a32755N6728A4726a66887f8147m5138j69033C11441a13866L0550a6317
$$ plain form
9806 -89988 309217 65831 -262824 -21522 -360601 39941 141307 -279568 145594 87937 -212817
9794 -186617 -103397 -187976 -343522 -68771 -89597 156785 182651 -161490 266209 90619 -79069
9782 -209688 205723 45734 30486 -55740 -15161 -411967 287922 -108027 -287167 -206908 319115
9770 112919 -194783 -240634 15231 -116548 -261361 -157038 -233999 -3900 -31884 55710 116537
9759 116537 22265 148840 47951 -152254 -113462 -303812 -77687 -219997 -152307 -136583 56980
9747 -69403 -95010 -289084 97822 213941 -222659 -141697 -134368 -230162 -204089 -177924 88213
9735 70253 84463 -89643 -166809 -158248 -113615 -115494 -187829 28521 -329212 -142329 -260965 40616
9722 -381913 -132755 -76027 14726 -166887 -68147 -113285 -282318 311441 -113866 -83316 -16317
9710A674J38751m1257a25794b1200B2861H837c44567a70370A6922K5985c43229
9698B13988b12455a0116k5216j17179f7284l714B9157J1072J10599B3133J08593
9687A31726a17853B33725a78384j13920e3150o9145A87285a50712F9979b58096
9676a85115I2698b38234M2509f6775D8387M9246a21007j92868C10482b31863I2228
9664f1422B16362d70253B41310h9436F3989A327f968H4993a3892F9045K37433
9653C06478K6105f2057B08220I7140b29258A68181g9298K5081I4706D4074J02386
9642A46460a74937o9068C85336h6015q1466f6465m2936B92806g0101k36228C07219
9630c23627O8560A14599B7928K6064N1489l6512a62965K9590h355j04462J9238
$$ plain form
9710 1674 140425 99168 -125794 -21200 22861 8837 -344567 -170370 16922 42907 -343229
9698 213988 -212455 -10116 -35332 -152511 -67284 -70998 29157 40229 150828 23133 131726
9687 131726 -117853 233725 -178384 -292304 -53150 -122295 187285 -150712 69979 -258096
9676 -185115 92698 -238234 -195725 -66775 48387 97633 -121007 -313875 310482 -231863 92228
9664 -61422 216362 -470253 241310 -89436 63989 1327 -6968 84993 -13892 69045 306478
9653 306478 332583 -62057 208220 97140 -229258 168181 -79298 -54217 94706 44074 146460
9642 146460 -174937 -244005 385336 -86015 -167481 -66465 -109401 292806 -70101 -306329 307219
9630 -323627 -255067 114599 27928 53992 105481 68969 -162965 -133375 -8355 -112817 -93579
9619i3579b9564o514J3720k63130E1957a80554i440A19084b38460B18895a42903
9607B92688c2167Q810f088o453B29755a2692D4341b36310G0981B9910a56985P8160
9595g8825B7794a39419e4740j51218a00426j56945J633K8316g7478j72627M5434
9584b04671P1770j12833j21040a78944N7885I7659c9315E2132J38317b13642Q9250
9573a24392K8626c5271j06878j08520j64536i8259M3531A16562b30603N2188C3605
9561C6883M687c1834k97968R4872A09238h9907j0837A37122e7364E2723a99107
9549b88024A62397B2371J27120L4713i3911r2519A16426b35546j17554a62106
9538H603K6679h845k10261F8370R7684a93708c9940m6736l23689C2973c26340
$$ plain form
9619 -93579 -29564 -36078 -22358 -285488 51957 -180554 -9440 119084 -238460 218895 -142903
9607 292688 -32167 -23357 -6088 -12541 229755 -12692 44341 -236310 70981 29910 -156985 -78825
9595 -78825 27794 -139419 -54740 -205958 -100426 -257371 -255738 -227422 -77478 -250105 -204671
9584 -204671 -132901 -245734 -366774 -178944 -121059 97659 -39315 52132 190449 -213642 -124392
9573 -124392 -95766 -35271 -142149 -250669 -415205 -98259 -54728 116562 -230603 -178415 33605
9561 36883 41570 -31834 -329802 -234930 109238 -89907 -100744 137122 -57364 52723 -199107
9549 -288024 162397 22371 149491 184204 -93911 -186430 116426 -235546 -353100 -162106
9538 8603 35282 -8845 -219106 68370 166054 -193708 -39940 -86676 -410365 32973 -326340
9526A16917a6585k77949a06597e1486n3041m6479A68610a3168A05744c3756c079
9514c55251B26b66438M1664I49a28283k14883C4970f3305G7290B0977L68J8129
9502C9474c2013n2367B14687a5732E6058g3325P858J7179j68450m7481B32342
9490e9658G4724a09993p6514n3689L3066i1489j44435g9091a0148j70284j03804
9479b84236h6506j6200c5409g3j4945A19033b48569L0928R0404A12018b81596
9467i9611j0451A13501f5723l24817b1343I7045d9129o5498L9415c0300A53029
9455C8162J67236e0662m0714L0152F2422Q4117b77403a12531p7288N7259B27182
9443g1402m90094H415g3910k66211h5802k09994J3290A35817J3636m8520h7840
$$ plain form
9526 116917 -16585 -294534 -106597 -51486 -104527 -151006 168610 -13168 105744 -33756 -3079
9514 -355251 226 -266438 -224774 949 -128283 -343166 34970 -63305 77290 20977 21345 39474
9502 39474 -32013 -84380 214687 -15732 56058 -73325 -65467 -48288 -216738 -264219 232342
9490 -59658 74724 -109993 -186507 -240196 -207130 -91489 -235924 -79091 -10148 -180432 -284236
9479 -284236 -86506 -102706 -35409 -73 -15018 119033 -248569 -217641 -127237 112018 -281596
9467 -99611 -110062 113501 -65723 -390540 -21343 97045 -49129 -114627 -75212 -30300 153029
9455 38162 205398 -50662 -91376 -61224 62422 146539 -277403 -112531 -189819 -132560 227182
9443 -71402 -561496 8415 -73910 -340121 -85802 -295796 -282506 135817 149453 100933 -87840
9431A73702a02959I3809L0483O9214b38397M5094L6283B5143d6866q1881D000
9419a68453C5940f6698E8303a78069D695a44033K8377l57262f153C10537A2513
9407A05004b54939a7151k91689B81559a17064d3805b027k37488j08849d8884r005
9396e7889j68379h7750B56074b30850O1561P10r6701p805A43317b05138k5320
9385b30458b6789j30768J0161j20818B63722a79996g5328B24061a549o429l83145
9374c91123a62935A71256c56321g2599k86449B68193f6893A44627e0820A23810
9363a79070A41181J12954c8527k25044d2694j74027f3331k41854A37495a50477
9352D7765a84397B40715B0685c60921A79814h987A15852b65967h0692g922C1595
$$ plain form
9431 173702 -102959 93809 124292 193506 -238397 -193303 -157020 25143 -46866 -128747 4000
9419 -168453 35940 -66698 58303 -178069 4695 -144033 -115656 -472918 -6153 310537 12513
9407 105004 -254939 -17151 -308840 281559 -117064 -43805 -2027 -239515 -348364 -48884 -57889
9396 -57889 -226268 -87750 256074 -230850 -169289 -168579 -265280 -273085 143317 -205138 -230458
9385 -230458 -26789 -157557 -147396 -268214 263722 -179996 -75328 224061 -1549 -7978 -391123
9374 -391123 -162935 171256 -356321 -72599 -359048 268193 -66893 144627 -50820 123810
9363 -179070 141181 254135 -38527 -263571 -42694 -216721 -63331 -305185 137495 -150477
9352 47765 -184397 240715 20685 -360921 179814 -8987 115852 -265967 -80692 -7922 31595
9340i6791A50087a53108E5543K5205J25417o7511c54509J34237c7113J6594j66013
9329a86532Q4733B007J89037B2181M6350P6044m2907b501D658K03993k4513B4886
9316a72388C68752b44360C45169a51430k74272B57781d3042j35348g5679A7361
9305b36274A3691d2688l16562J23569c0973F4689c07778b7319j62719r7576A85336
9293g3657A37266b03716p3589a04872A7519J34809b9908C4889b6933j1240j72052
9282b10225g9174d611B64586f9372r8148N3798A3825a44259m3106I6211a07299
9270a29530a0284j83405g8103G7542i6752c5988m23519c5863j9755A31797c25510
9258a25939N3241C76580d1117C0982b52321r2475A40657O0188f9009q5446k82145
$$ plain form
9340 -96791 150087 -153108 55543 80748 206165 138654 -354509 -220272 -37113 -20519 -186532
9329 -186532 -101799 2007 191044 22181 68531 144575 101668 -2501 4658 208651 184138 24886
9316 -172388 368752 -244360 345169 -151430 -425702 257781 -43042 -178390 -75679 17361
9305 -236274 13691 -42688 -359250 -235681 -30973 64689 -307778 -27319 -190038 -287614 185336
9293 -73657 137266 -203716 -277305 -104872 17519 152328 -29908 34889 -26933 -38173 -210225
9282 -210225 -79174 -4611 264586 -69372 -167520 -113722 13825 -144259 -187365 96211 -107299
9270 -129530 -10284 -193689 -78103 77542 -96752 -35988 -459507 -35863 -55618 131797 -325510
9258 -125939 -72698 376580 -41117 30982 -252321 -344796 140657 200845 -69009 -154455 -436600
9247d36600F3668K2038c27958A13151g8044A75016G1740J34937c16095Q5695o2843
9236b93243G508c43942g8868A12051l7504J7701a84208L0869m0138D52093G3700
9224G0010a69601L0694o1703k55539i544k31862A45045a5340D7457L0023j3323
9213F4157a8574j9342F9628N8848c27709B8093J161b56476D2164K8481J79377
9202B50022a26264O0371n6874j03194J10356A61500a59462A30642o2665a37455
9191a16161o7062B2850Q9655M5213J74769b52767H1645a6763k3500j84244A30165
9179h0911F1531a97063d8039r6520C86328C0469a0694l7505l47226K7142F6637
9167a02587I1942d14994a44870A63823i1279K1380A64116b71368Q8842g9695m4665
$$ plain form
9247 -436600 63668 85706 -327958 113151 -78044 175016 71740 206677 -316095 -230400 -293243
9236 -293243 7508 -343942 -78868 112051 74547 92248 -184208 -153339 -193477 452093 73700
9224 70010 -169601 -138907 -200610 -456149 -9544 -241406 145045 -15340 47457 77480 64157
9213 64157 -18574 -37916 69628 128476 -327709 28093 29254 -256476 42164 70645 250022
9202 250022 -126264 -65893 -122767 -225961 -115605 161500 -159462 130642 67977 -137455
9191 -116161 -183223 22850 112505 157718 332487 -252767 81645 -16763 -40263 -224507 130165
9179 -80911 61531 -197063 -48039 -144559 386328 30469 -10694 -48199 -395425 -368283 66637
9167 -102587 91942 -414994 -144870 163823 -91279 -69899 164116 -271368 -182526 -79695 -124360
9156a24360j29933d7488A1787L3312A2698l829a09486r040J9072A53196F1481
9144a94873G7611P2277k531a63583A15445R613B7909H076B799a4493D945a428
9131A62378b30632H9601b17669H9886k6120a30420k13219B45645a95142c5886
9120i3903O099B13372a40640D1372b5995k4794B63199K3275g7263p847m7321j12733
9108b45164a10999j05529I7285c99655a73066I0120A1262a55535N9976r1115A14456
9096a01821N582m2458j50228J12300m8310G8478a67715c0501l2059H8950a8839
9084a09453F6002b3854C2761J07429D6703R1093n3509a01653o032K5008E8368
9072d36680b2047A37864e4026k51628A94504b27891f6354H1222b69478a7191k13368
$$ plain form
9156 -124360 -254293 -47488 11787 45099 12698 8869 -109486 -118526 -99454 153196 61481
9144 -194873 77611 149888 147357 -163583 115445 125058 27909 8076 2799 -14493 4945 -1428
9131 162378 -230632 89601 -217669 89886 63766 -130420 -343639 245645 -195142 -35886
9120 -93903 -87804 213372 -140640 41372 -25995 -50789 263199 286474 -77263 -85110 -132431 -245164
9108 -245164 -110999 -216528 97285 -399655 -173066 90120 11262 -155535 -95559 -186674 114456
9096 -101821 -96239 -138697 -288925 -176625 -224935 78478 -167715 -30501 -62560 88950 -18839
9084 -109453 66002 -23854 32761 140190 46703 137796 84287 -101653 -107685 -82677 58368
9072 -436680 -22047 137864 -54026 -305654 194504 -227891 -66354 81222 -269478 -17191 -230559
9061b30559A27934A1010g1514k1855j21388m8086F1265a71767c7643j86422B1932
9049e4281G538N6772b1553k1162l731k08422c5045j15634J9099j55562j16210
9038d03352E9234d5602A88976P413b27413H0608a40195F1196b2730D5513a20636
9026d8095l9687f861B0929c81097G7826a9256C9811A6625e5951C7725Q818b85008
9013e4170A50300g9652j2381H9355b01022L2441A82050a75474j59194g4757l06525
9002c81282a6930m05520e4374j69077A72880a53520j98437f8874L2677A68548
8991a35178e824A36815a11178I0443a43107E12655a68111N1520A84172A9433N2716
8980G2149b4230k9494j39947e7357n9261M6609I225Q9127J76694a88847A4634
$$ plain form
9061 -230559 127934 11010 -71514 -93369 -214757 -262843 61265 -171767 -37643 -224065 21932
9049 -54281 7538 64310 -21553 -42715 -46446 -254868 -35045 -150679 -131580 -287142 -403352
9038 -403352 59234 -45602 188976 196389 -227413 80608 -140195 61196 -22730 45513 -120636
9026 -48095 -87782 -6861 20929 -381097 77826 -19256 39811 16625 -55951 37725 46543 -285008
9013 -54170 150300 -79652 -92033 89355 -201022 -168581 182050 -175474 -334668 -74757 -381282
9002 -381282 -16930 -422450 -54374 -223451 172880 -153520 -351957 -68874 -36197 168548
8991 -135178 -5824 136815 -111178 90443 -143107 512655 -168111 -116591 184172 19433 72149
8980 72149 -24230 -53724 -193671 -57357 -116618 -70009 9225 98352 275046 -188847 14634
8968a72398B311J62896H619J80987f4573A62443i1901B0253J54878f2317j0034
8957g2351C2276e8549M530A86844b29960J03008k05917A16528a45482A72873a70367
8945D6577h4515m235A3699a22326a2961M414B17600i2379K8282k77419a27852
8933C3869e769A4185i0478A81449H287K49868A7813b55681l3326H8910L66814
8922D55724M69129K301482F30412k39402D6553a14723A37379j5153m1337a91505
8911B35129A4003K51158p2898N5410j6504a91913f2359k30278A74457b24E1958
8899B5225a71417l8687G1112a30769j11524B37807K4343r6506a14880m0374A76194
8887G0097a30494f0028A63692c24605O7689E1888a05365j02093f6728B02686O8646
$$ plain form
8968 -172398 2311 165207 8619 189606 -64573 162443 -91901 20253 175131 -62317 -72351
8957 -72351 32276 -58549 -54019 186844 -229960 -126952 -332869 116528 -145482 172873 -170367
8945 46577 -84515 -88750 13699 -122326 -12961 -8547 217600 -92379 -64097 -341516 -127852
8933 33869 -5769 14185 -90478 181449 8287 258155 17813 -255681 -289007 88910 455724
8922 455724 924853 3226335 630412 391010 46553 -114723 137379 122226 80889 -191505
8911 235129 14003 265161 192263 247673 231169 -191913 -62359 -292637 174457 -224 51958
8899 25225 -171417 -210104 71112 -130769 -242293 237807 262150 165644 -114880 -155254 176194
8887 70097 -130494 -60028 163692 -324605 -256916 51888 -105365 -207458 -66728 202686 271332
8876B71332F5043a41428I168e8590l0744n3171J2207C0978c8504A6295b47622
8864a07838n15497B91253i3996j2691e0558B0187L0087q934c7502A05945c21276
8852I8368m5571b72673C2389a33348N2212L6002k15072h9458m95187D3485b0584
$$ plain form
8876 271332 65043 -141428 9168 -58590 -89334 -142505 -130298 30978 -38504 16295 -247622
8864 -107838 -623335 291253 -93996 -106687 -50558 20187 50274 41340 -37502 105945 -321276
8852 98368 52797 -272673 32389 -133348 -81136 -45134 -260206 -89458 -584645 43485 -20584
$$ [...]
##END NTUPLES=NMR SPECTRUM
##END=
