##TITLE=AC1727_3474_9208054_ibkSnlMSrY
##JCAMPDX= 6.0         $$ Bruker NMR JCAMP-DX V2.0
##DATA TYPE= NMR SPECTRUM
##DATA CLASS= NTUPLES
##ORIGIN= BRUKER
##OWNER= Administrator
$$ 1.72 TOPSPIN		Version 2.1
$$ 2015-06-01 21:16:18.295 -0700  Administrator@X
$$ Compression mode = diff/dup
##.OBSERVE FREQUENCY= 400.02188249412
##.OBSERVE NUCLEUS= ^1H
##.ACQUISITION MODE= SIMULTANEOUS (DQD)
##.ACQUISITION SCHEME= undefined
##.AVERAGES= 64
##.DIGITISER RES= 22
##SPECTROMETER/DATA SYSTEM= spect
##.PULSE SEQUENCE= noesygpps1d.comp
##.SOLVENT NAME= COFFEE_meoh
##.SHIFT REFERENCE= INTERNAL, COFFEE_meoh, 1, 14.96121
##AUDIT TRAIL= $$ (NUMBER, WHEN, WHO, WHERE, PROCESS, VERSION, WHAT)
$$ ##TITLE= Audit trail, TOPSPIN		Version 2.1
$$ ##JCAMPDX= 5.01
$$ ##ORIGIN= Bruker BioSpin GmbH
$$ ##OWNER= Administrator
$$ $$ E:\/data/COFFEE/nmr/AC1727_3474_9208054_ibkSnlMSrY/22/pdata/1/auditp.txt
$$ ##AUDIT TRAIL=  $$ (NUMBER, WHEN, WHO, WHERE, PROCESS, VERSION, WHAT)
(   1,<2015-06-01 21:16:13.155 -0700>,<Administrator>,<X>,<go>,<TOPSPIN 2.1>,
      <created by zg
	started at 2015-06-01 21:04:43.358 -0700,
	POWCHK enabled, PULCHK disabled,
       configuration hash MD5:
       21 0F 79 D6 B3 7B B4 F6 88 20 88 DB 03 48 BD 9F
       data hash MD5: 64K
       2D 2D E6 41 45 7A 2F A1 E6 7E 55 85 6A 70 C2 E6>)
(   2,<2015-06-01 21:16:16.248 -0700>,<Administrator>,<X>,<proc1d>,<TOPSPIN 2.1>,
      <Start of raw data processing
       efp LB = 0.3 FT_mod = 6 PKNL = 1 PHC0 = 0 PHC1 = 0 SI = 128K 
       data hash MD5: 128K
       B3 D6 46 CE 37 1F 0A C5 98 0C B8 BD 61 90 7B 2E>)
(   3,<2015-06-01 21:16:17.123 -0700>,<Administrator>,<X>,<proc1d>,<TOPSPIN 2.1>,
      <pk PHC0 = -87.91809 PHC1 = 0 
       data hash MD5: 128K
       DD EB 40 F9 76 04 AD 1B 95 54 17 FF A8 C5 08 F1>)
(   4,<2015-06-01 21:16:17.483 -0700>,<Administrator>,<X>,<proc1d>,<TOPSPIN 2.1>,
      <abs ABSG = 1 
       data hash MD5: 128K
       63 D1 2B 70 B3 D5 3F F7 21 B3 04 DF E9 18 3E 55>)
(   5,<2015-06-01 21:16:17.592 -0700>,<Administrator>,<X>,<proc1d>,<TOPSPIN 2.1>,
      <abs ABSG = 2 
       data hash MD5: 128K
       06 B1 16 84 74 49 E3 53 48 33 DF CB 73 42 56 29>)
(   6,<2015-06-01 21:16:17.686 -0700>,<Administrator>,<X>,<proc1d>,<TOPSPIN 2.1>,
      <abs ABSG = 3 
       data hash MD5: 128K
       32 02 FE 5C 84 EA 3D D8 28 45 3E B0 2D 15 6C B2>)
(   7,<2015-06-01 21:16:17.764 -0700>,<Administrator>,<X>,<proc1d>,<TOPSPIN 2.1>,
      <abs ABSG = 4 
       data hash MD5: 128K
       7A F2 F7 0F 27 C5 1D 7B 6C EE F5 A2 AC F5 83 2B>)
(   8,<2015-06-01 21:16:17.858 -0700>,<Administrator>,<X>,<proc1d>,<TOPSPIN 2.1>,
      <abs ABSG = 5 
       data hash MD5: 128K
       38 F8 26 2C A7 0F EA 3D 75 B7 5A 69 47 F1 FE 98>)
$$ ##END=
$$ 
$$ $$ hash MD5
$$ $$ 08 13 3B DC EF 60 62 5F BD D3 96 D5 A9 BE 3B C9
##$RELAX= 
##$RELAX= 
##$RELAX= 
##$RELAX= 
##$RELAX= 
##$RELAX= 
##$RELAX= 
##$RELAX= 
$$ Bruker specific parameters
$$ --------------------------
##$DU= <E:\>
##$EXPNO= 22
$$ [...]
##$TP07= 0
##$TPNAME0= <>
##$TPNAME1= <>
##$TPNAME2= <>
##$TPNAME3= <>
##$TPNAME4= <>
##$TPNAME5= <>
##$TPNAME6= <>
##$TPNAME7= <>
##$TPOAL= (0..7)
0.5 0.5 0.5 0.5 0.5 0.5 0.5 0.5
##$TPOFFS= (0..7)
0 0 0 0 0 0 0 0
##$TUNHIN= 0
##$TUNHOUT= 0
##$TUNXOUT= 0
##$USERA1= <user>
##$USERA2= <user>
##$USERA3= <user>
##$USERA4= <user>
##$USERA5= <user>
##$V9= 5
##$VALIST= <valist>
##$VCLIST= <CCCCCCCCCCCCCCC>
##$VD= 0
##$VDLIST= <DDDDDDDDDDDDDDD>
##$VPLIST= <PPPPPPPPPPPPPPP>
##$VTLIST= <TTTTTTTTTTTTTTT>
##$WBST= 2048
##$WBSW= 25
##$XGAIN= (0..3)
0 0 0 0
##$XL= 0
##$YL= 0
##$YMAX_a= 6087998
##$YMIN_a= -12460691
##$ZGOPTNS= <>
##$ZL1= 120
##$ZL2= 120
##$ZL3= 120
##$ZL4= 120
##$ABSF1= 14.96121
##$ABSF2= -5.596972
##$ABSG= 5
##$ABSL= 3
##$ALPHA= 0
##$AQORDER= 0
##$ASSFAC= 0
##$ASSFACI= 0
##$ASSFACX= 0
##$ASSWID= 0
##$AUNMP= <proc_prof1d_extract.lims>
##$AXLEFT= 0
##$AXNAME= <>
##$AXNUC= <1H>
##$AXRIGHT= 0
##$AXTYPE= 0
##$AXUNIT= <>
##$AZFE= 0.1
##$AZFW= 0.1
##$BCFW= 0
##$BC_mod= 0
##$BYTORDP= 0
##$COROFFS= 0
##$CY= 15
##$DATMOD= 1
##$DC= 0
##$DFILT= <>
##$DTYPP= 0
##$F1P= 0
##$F2P= 0
##$FCOR= 0.5
##$FTSIZE= 131072
##$FT_mod= 6
##$GAMMA= 0
##$GB= 0
##$INTBC= 1
##$INTSCL= 1
##$ISEN= 128
##$LB= 0.3
##$LEV0= 0
##$LPBIN= 0
##$MAXI= 10000
##$MC2= 0
##$MEAN= 0
##$ME_mod= 0
##$MI= 0
##$NCOEF= 0
##$NC_proc= -2
##$NLEV= 6
##$NOISF1= 0
##$NOISF2= 0
##$NSP= 0
##$NTH_PI= 0
##$NZP= 0
##$OFFSET= 14.96121
##$PC= 1
##$PHC0= -87.91809
##$PHC1= 0
##$PH_mod= 1
##$PKNL= yes
##$PPARMOD= 0
##$PPDIAG= 0
##$PPIPTYP= 0
##$PPMPNUM= 2147483647
##$PPRESOL= 1
##$PSCAL= 4
##$PSIGN= 0
##$PYNMP= <proc.py>
##$REVERSE= no
##$SF= 400.020009554385
##$SI= 131072
##$SIGF1= 0
##$SIGF2= 0
##$SINO= 400
##$SIOLD= 131072
##$SPECTYP= <>
##$SREGLST= <1H.CDCl3>
##$SSB= 0
##$STSI= 131072
##$STSR= 0
##$SW_p= 8223.68421052631
##$SYMM= 0
##$S_DEV= 0
##$TDeff= 65536
##$TDoff= 0
##$TI= <>
##$TILT= no
##$TM1= 0
##$TM2= 0
##$TOPLEV= 0
##$USERP1= <user>
##$USERP2= <user>
##$USERP3= <user>
##$USERP4= <user>
##$USERP5= <user>
##$WDW= 1
##$XDIM= 131072
##$YMAX_p= 421235199
##$YMIN_p= -281769
##$CURPLOT= <Network HP LaserJet P1505>
##$CURPRIN= <$Network HP LaserJet P1505>
##$DFORMAT= <normdp>
##$LAYOUT= <+/1D_H.xwp>
##$LFORMAT= <normlp>
##$PFORMAT= <normpl>
##$SURQMSG= 1
$$ End of Bruker specific parameters
$$ ---------------------------------
##NTUPLES= NMR SPECTRUM
##VAR_NAME=  FREQUENCY,     SPECTRUM/REAL,   SPECTRUM/IMAG
##SYMBOL=    X,             R,               I
##VAR_TYPE=  INDEPENDENT,   DEPENDENT,       DEPENDENT
##VAR_FORM=  AFFN,          ASDF,            ASDF
##VAR_DIM=   131072,        131072,          131072
##UNITS=     HZ,            ARBITRARY UNITS, ARBITRARY UNITS
##FACTOR=    0.0627417313425164, 1,          1
##FIRST=     8223.62146879497, -664,         -55632
##LAST=      0,             1021,            -56692
##MIN=       0,             -281769,         0
##MAX=       8223.62146879497, 421235199,    0
$$ Real data points
##PAGE= N=1
##DATA TABLE= (X++(R..R)), XYDATA
$$ [...]
61552D20885J709J356Q28Q76J197J139Q31Q16J075J253J455J976K511K523K287
61537D42717K569L361L881L855L815L921L500K172O01l69p14r12j089j047q11
61522D65450o86q86j367j881k159k167k164k254k063j286l85j77p18j188j023
61507D45046n61m43q04j296j540j330p36r4L09N38P40Q07P18R67J927K969L029
61490D50246K098J260J122J133P94O27J259K252K618K119J424J126J187J177P33
61475D71175j34r28j024l71L98O85N00K32J71M13Q22Q89J13j231k159k118j583
61458D65850j200p92P5J067J337P35Q0R4O31J142J456J809K325K799K999K995
61442D83402L056L291L526L580L536L590L755L902M025M151M075L478K396J233
$$ y = [420885, 422594, 423950, 424778, 425654, 426851, 427990, 428821, 429637, 430712, 431965, 433420, 435396, 437907, 440430, 442717, 445286, 448647, 452528, 456383, 460198, 464119, 467619, 469791, 470392, 470023, 469309, 468397, 467308, 466261, 465450, 464764, 463878, 462511, 460630, 458471, 456304, 454140, 451886, 449823, 448537, 448152, 447975, 447257, 446069, 445046, 444485, 444042, 443238, 441942, 440402, 439072, 438336, 438242, 438551, 439089, 439829, 440636, 441354, 442321, 444248, 447217, 450246, 452344, 453604, 454726, 455859, 456653, 457280, 458539, 460791, 463409, 465528, 466952, 468078, 469265, 470442, 471175, 471041, 470113, 469089, 468718, 469116, 469801, 470301, 470533, 470704, 471117, 471939, 472828, 472941, 471710, 469551, 467433, 465850, 464650, 463858, 463933, 465000, 466337, 467072, 467152, 467246, 467877, 469019, 470475, 472284, 474609, 477408, 480407, 483402, 486458, 489749, 493275, 496855, 500391, 503981, 507736, 511638, 515663, 519814, 523889, 527367, 529763, 530996]
61428E30996L20k74m50%R61J854K174K045K022K460L141L403K604O78j617l228
61412E47089l683l404l153l347l848m164l867l048k391k524l316m042m158l669
61398D98475k787j793j178j375k134k584k238j519j127j132j037m58N19J530K229
61383D83391K508K529K435K131J586J191J425K145K719K939L238L830M208L811
61369E20086K793J705Q76M16M93J124J895K399K761L366M258N140N891O646P432
61354E67281Q118Q682R316J0240J1607J3502J5698J7480J7975J6830J4481J1776
61342G22986R376P463N811M072K030l06k701m771o183p029p819q861r751r852
61328F94465r159q314p719p136o248n129l997k950k220k146k544k518j440J88
$$ y = [530996, 531316, 531042, 530592, 530592, 531553, 533407, 535581, 537626, 539648, 542108, 545249, 548652, 551256, 551934, 550317, 547089, 543406, 540002, 536849, 533502, 529654, 525490, 521623, 518575, 516184, 513660, 510344, 506302, 502144, 498475, 495688, 493895, 492717, 491342, 489208, 486624, 484386, 482867, 481740, 480608, 479571, 479113, 479632, 481162, 483391, 485899, 488428, 490863, 492994, 494580, 495771, 497196, 499341, 502060, 504999, 508237, 512067, 516275, 520086, 522879, 524584, 525460, 525876, 526369, 527493, 529388, 531787, 534548, 537914, 542172, 547312, 553203, 559849, 567281, 575399, 584081, 593397, 603637, 615244, 628746, 644444, 661924, 679899, 696729, 711210, 722986, 732362, 739825, 745636, 749708, 751738, 751432, 748731, 743960, 737777, 730748, 722929, 714068, 704317, 694465, 685306, 676992, 669273, 662137, 655889, 650760, 646763, 643813, 641593, 639447, 636903, 634385, 632945, 633133]
61314F33133J330J703J940K601L591M522N256N909O676P774R292J0969J2245J2610
61300G19551J1822R874O886L137r96n096q653j1074j2010j1674j0622r237p615
61287F74293n911m457l404k519j552o25P1O99J617K764L690M242M822N727O670
61272F86127P315P903Q782R509R230Q044P229P796R312J0647J1434J2293J3872
61259H09493J6182J8685K0531K0817J9070J5575J0986N779L07m832q957j1848
61247I11788j3801j5188j6159j6729j6795j6170j4735j2602j0026p339n082l770
61235G63392l323l109k769k527k415j855n37Q78J698K276L314M538N044M720M215
61220G73540L641K422N66j041j777j899j718j067R5J344K338L040L195K414J102
$$ y = [633133, 634463, 636166, 638106, 640707, 644298, 648820, 654076, 659985, 666661, 674435, 683727, 694696, 706941, 719551, 731373, 741247, 748133, 751270, 750274, 745178, 736525, 725451, 713441, 701767, 691145, 681908, 674293, 668382, 663925, 660521, 658002, 656450, 655825, 655896, 656595, 658212, 660976, 664666, 668908, 673730, 679457, 686127, 693442, 701345, 710127, 719636, 728866, 736910, 744139, 751935, 761247, 771894, 783328, 795621, 809493, 825675, 844360, 864891, 885708, 904778, 920353, 931339, 937118, 937425, 932593, 923636, 911788, 897987, 882799, 866640, 849911, 833116, 816946, 802211, 789609, 779583, 772244, 767162, 763392, 760069, 756960, 754191, 751664, 749249, 747394, 746857, 747735, 749433, 751709, 755023, 759561, 764605, 769325, 773540, 777181, 779603, 780169, 779128, 777351, 775452, 773734, 772667, 772762, 774106, 776444, 779484, 782679, 785093, 786195]
61205G86195N08J400L332N526P848J0512J3433J6333J8990K1121K2558K3781K5547
61192I57084K7710K9056K8676K6739K3662J9356J4012Q785M957K692J258L0j182
61179A142835k430l711n029o659q966j1724j4206j6172j8104k0162k1715k2379
61167I91578k2705k3200k3407k2758k1602k0583j9496j7738j5412j3190j1296
61156G80191r416p409n413l512j875q08j10J184L637O429Q209Q581P905O147K988
61141G96728j088m814p293q337p849n798k852n4K336M941Q062J1107J3455J5247
61127H13791J7032J9079K1319K3505K5249K6260K6750K7266K8009K8617K8638
61116A085515K8016K7045K6098K5284K4180K2113J8986J5605J2781J0413P899
$$ y = [786195, 786703, 788103, 791435, 796961, 804809, 815321, 828754, 845087, 864077, 885198, 907756, 931537, 957084, 984794, 1013850, 1042526, 1069265, 1092927, 1112283, 1126295, 1135080, 1140037, 1142729, 1143987, 1144017, 1142835, 1140405, 1136694, 1131665, 1125006, 1116040, 1104316, 1090110, 1073938, 1055834, 1035672, 1013957, 991578, 968873, 945673, 922266, 899508, 877906, 857323, 837827, 820089, 804677, 791487, 780191, 770775, 763366, 757953, 754441, 752566, 751758, 751648, 752832, 756469, 762898, 771107, 779688, 787593, 793740, 796728, 795640, 790826, 783533, 775196, 767347, 761549, 758697, 758643, 760979, 765920, 773982, 785089, 798544, 813791, 830823, 849902, 871221, 894726, 919975, 946235, 972985, 1000251, 1028260, 1056877, 1085515, 1113531, 1140576, 1166674, 1191958, 1216138, 1238251, 1257237, 1272842, 1285623, 1296036, 1303935]
61105A303935N194K747N77j863m883q286j2058j6672k2236k7772l1816l3675l3893
61092A119299l3514l2994l1946k9941k7306k4792k2597k0279j7723j5540j4095
61081H48572j2845j1121r156p613o542n388l798j859J99J983K952L072L153L903
61067H05512N019N829O461P434Q559R284R923J1389J3609J5411J6285J7143J8875
61054I50733K1096K2934K4314K5753K7397K8965L0304L1510L2602L3491L4100
61043A263199L4325L4109L3712L3515L3388L2675L1141K9495K8486K7866K6734
61032A608645K4820K2856K1679K1434K1807K2532K3447K4328K5103K6152K8026
61021A870829L0849L4259L7841M1219M3741M4836M5050M6129M9533N5277O2818
$$ y = [1303935, 1309129, 1311876, 1312453, 1310590, 1305707, 1297421, 1285363, 1268691, 1246455, 1218683, 1186867, 1153192, 1119299, 1085785, 1052791, 1020845, 990904, 963598, 938806, 916209, 895930, 878207, 862667, 848572, 835727, 824606, 815450, 807837, 801295, 795907, 792109, 790250, 790449, 792432, 795384, 798456, 801609, 805512, 810531, 816360, 822821, 830255, 838814, 848098, 858021, 869410, 883019, 898430, 914715, 931858, 950733, 971829, 994763, 1019077, 1044830, 1072227, 1101192, 1131496, 1163006, 1195608, 1229099, 1263199, 1297524, 1331633, 1365345, 1398860, 1432248, 1464923, 1496064, 1525559, 1554045, 1581911, 1608645, 1633465, 1656321, 1678000, 1699434, 1721241, 1743773, 1767220, 1791548, 1816651, 1842803, 1870829, 1901678, 1935937, 1973778, 2014997, 2058738, 2103574, 2148624, 2194753, 2244286, 2299563, 2362381]
61010B362381P2286Q3804R6140J07468J17561J28017J40534J56475J78208K08944
61000C651818K50451L02244L63507M34531N16349O11668P27113Q72448J057440
60991H787569J291983J583933J917187K214597K332854K132307J588314Q42656
60983B2691400J32886l43087n09209l93996p8557L15583O15571O36879K85410
60974B3352880l64386j101996j705069k051012k139346k040959j839165j600180
60966A0510767j366722j159061r80528q27219o95465n82730m86160m03406l34035
60957C675441k78423k35670k03325j78424j58224j40845j25920j13962j04684
60948B135964r6674q8960q1805p5469o9359o3128n7670n4139n2527n1902n1414
$$ y = [2362381, 2434667, 2518471, 2614611, 2722079, 2839640, 2967657, 3108191, 3264666, 3442874, 3651818, 3902269, 4204513, 4568020, 5002551, 5518900, 6130568, 6857681, 7730129, 8787569, 10079552, 11663485, 13580672, 15795269, 18128123, 20260430, 21848744, 22691400, 22824286, 22481199, 21971990, 21577994, 21499437, 21815020, 22430591, 23067470, 23352880, 22988494, 21886498, 20181429, 18130417, 15991071, 13950112, 12110947, 10510767, 9144045, 7984984, 7004456, 6177237, 5481772, 4899042, 4412882, 4009476, 3675441, 3397018, 3161348, 2958023, 2779599, 2621375, 2480530, 2354610, 2240648, 2135964, 2039290, 1950330, 1868525, 1793056, 1723697, 1660569, 1602899, 1548760, 1496233, 1444331, 1392917]
60937A392917n0459m8542m5658m2476l9528l6687l3687l0630k7613k4502k1477
60926I91658j9048j7129j4893j2079r656q465p912o869n307m120l659l261k212
60913H77048n14J246K427K750K480K052J484N25o65j568k201l228m909o635p957
60898H62335r186j0556j1505j1567j1240j1206j1248j0771r948r436r240q730
60886G37702p645o376n275m353l703l631m230n198o129o758o998o902o499n703
60872F58302m608l800l803m171l793k397r84m31l75k9N59Q83R94J387K087K669
60856F42490K964L206L578M081M618M817M162K710J348Q28J016J494K351L684
60842F83347M778M611K915J87k983n879p535p562o867o619o747o315n161m120
$$ y = [1392917, 1342458, 1293916, 1248258, 1205782, 1166254, 1129567, 1095880, 1065250, 1037637, 1013135, 991658, 972610, 955481, 940588, 928509, 918853, 910388, 902476, 895607, 890300, 886180, 882521, 879260, 877048, 876534, 877780, 880207, 882957, 885437, 887489, 888973, 889498, 888833, 887265, 885064, 881836, 876927, 870292, 862335, 853149, 842593, 831088, 819521, 808281, 797075, 785827, 775056, 765108, 755672, 746432, 737702, 730057, 723681, 718406, 714053, 710350, 706719, 702489, 697291, 691162, 684404, 677406, 670504, 664005, 658302, 653694, 649894, 646091, 641920, 638127, 635730, 634746, 634315, 633940, 633911, 634470, 635353, 636347, 637734, 639821, 642490, 645454, 648660, 652238, 656319, 660937, 665754, 669916, 672626, 673974, 674802, 675818, 677312, 679663, 683347, 688125, 692736, 695651, 695838, 692855, 686976, 679441, 671879, 665012, 658393, 651646, 645331, 640170, 636050]
60828F36050l680l455l116k839k686k387k025k103k630k935k717k529k768k987
60814E97193k691k291k569l594m714n313n163m337l319k888l384m185m445m207
60800E44093m193m529m426l373k010j283j168r05k97Ll53p28m67P4J16k70l26
60783E19958J37L90k9n71m17M90J543K203K324K036J656J484J474J342J102J110
60767E36232J431J673J664J780K165K232J497N27L53J085J703J327Q8j166j763
60752E50828j666j355j339j604j665j201m66J43N24O23L8j574l760n467o048n769
60736E20242n251m743m176l657l595m143m682m277k793j255o82q81q35j24O91
60721D79839J117J319J520J532J270J117J302J432J055L26k81m63l3J055K288
$$ y = [636050, 632370, 628915, 625799, 622960, 620274, 617887, 615862, 613759, 611129, 608194, 605477, 602948, 600180, 597193, 594502, 592211, 589642, 586048, 581334, 576021, 570858, 566521, 563202, 560314, 556930, 552745, 548300, 544093, 539900, 535371, 530945, 527572, 525562, 524279, 523111, 522206, 521909, 521912, 521559, 520831, 520364, 520438, 520554, 520284, 519958, 520095, 520485, 520456, 519885, 519468, 519958, 521501, 523704, 526028, 528064, 529720, 531204, 532678, 534020, 535122, 536232, 537663, 539336, 541000, 542780, 544945, 547177, 548674, 549201, 549554, 550639, 552342, 553669, 553757, 552591, 550828, 549162, 547807, 546468, 544864, 543199, 541998, 541532, 541675, 542199, 542822, 542860, 541286, 537526, 532059, 526011, 520242, 514991, 510248, 506072, 502415, 498820, 494677, 489995, 485718, 482925, 481670, 480988, 480107, 479272, 479148, 479839, 480956, 482275, 483795, 485327, 486597, 487714, 489016, 490448, 491503, 491829, 491548, 491085, 491052, 492107, 494395]
60706D94395K741K181J424J147R49K52m74l17O97J692K182K393K470K218J657
60691E15607J137Q34O16M32L73L97M33N43O43K96n72j124m96Q86J698J341M37
60674E23481l00q36j289j472j322j153j131j027q61j209k372l671m105l512k545
60659D96676j757j159o95n50o89n46L61J642K300J994J547J882K806L356L122
60644E10290K512J789O40r95k406k908k745k656k919l241l286k918k147j245o84
60629D87081n84m75P0Q24J313J530J795K141K201J678O59l16m97L44J316J160
60613E00240j02j037p13N4O4m48m34R1M0j002k108k319j708r29l83j28q9p5J00
60594D89114L94P18J241K181L316M138M417M283L888L353K891K523J923R59K24
$$ y = [494395, 497136, 499317, 500741, 501888, 502837, 503089, 502615, 502298, 502995, 504687, 506869, 509262, 511732, 513950, 515607, 516744, 517578, 518194, 518626, 518999, 519396, 519829, 520372, 521015, 521311, 520739, 519615, 519119, 520005, 521703, 523044, 523481, 523181, 522345, 521056, 519584, 518262, 517109, 515978, 514951, 514090, 512881, 510509, 506838, 502733, 499221, 496676, 494919, 493760, 493065, 492515, 491826, 491280, 491641, 493283, 495583, 497577, 499124, 501006, 503812, 507168, 510290, 512802, 514591, 515231, 514236, 511830, 508922, 506177, 503521, 500602, 497361, 494075, 491157, 489010, 487765, 487081, 486497, 486022, 486092, 486916, 488229, 489759, 491554, 493695, 495896, 497574, 498233, 497917, 497420, 497764, 499080, 500240, 500138, 499101, 498388, 498442, 498506, 498058, 497624, 497715, 497755, 496753, 494645, 492326, 490618, 489689, 489306, 489178, 489089, 489014, 489114, 489508, 490226, 491467, 493648, 496964, 501102, 505519, 509802, 513690, 517043, 519934, 522457, 524380, 525339, 525563]
60579E25563L71J097J375P64j00m01RQ33J933L424N287P101Q281Q651Q790R482
60563E82460J0887J2513J3970J5126J5534J4519J2168R390O592L188r62m570o347
60550F84468o602o406n870m488k695j617j421j139j92J039K179L372M728O276
60536F71632Q427J1492J4717J6929J8249J9994K2438K3935K2844J9480J5329J1143
60524H76609O590J440l657p635r906j0842j1362j1970j2238j1563j0153q807p908
60511G78598p154o233n100l649j774K35J936L432N200P237R038J0526J2414J5432
60497H20138J9627K4564K9808L5075M0252M5284M9829N3221N5013N5195N3624
60486A281630M9736M3380L5320K6251J5933M191p873j8827k8599l7981m6703n3350
$$ y = [525563, 525934, 527031, 528406, 529170, 529070, 528669, 528678, 529511, 531444, 534868, 540155, 547256, 555537, 564188, 572978, 582460, 593347, 605860, 619830, 634956, 650490, 665009, 677177, 686567, 693159, 696347, 695385, 690815, 684468, 677866, 671460, 665590, 661102, 658407, 656790, 655369, 654230, 654038, 655077, 657256, 660628, 665356, 671632, 680059, 691551, 706268, 723197, 741446, 761440, 783878, 807813, 830657, 850137, 865466, 876609, 883199, 884639, 880982, 873347, 863441, 852599, 841237, 829267, 817029, 805466, 795313, 786506, 778598, 771444, 765211, 760111, 756462, 754688, 754923, 756859, 760291, 765491, 772728, 781766, 792292, 804706, 820138, 839765, 864329, 894137, 929212, 969464, 1014748, 1064577, 1117798, 1172811, 1228006, 1281630, 1331366, 1374746, 1410066, 1436317, 1452250, 1456441, 1448568, 1429741, 1401142, 1363161, 1316458, 1263108]
60474A263108n7147n8592n8300n6408n3229m9353m4919l9777l4450k9879k6226
60463G54828k2999k0257j8393j6896j4803j2498j1363j1322j0547q192n821n129
60451E96608n697o066n774n162m283l168k426k409k468j951j300j202j369j160
60437E52173q15j020j676k046j913j699j675j706j617j304o30K21O57L21m65j154
60421E35652j435j037K40J889K784K493J902J931K257J989J101L82K69M02L12
60406E51131M5R5Q69K061K682K131J166J122K117K915K680J971J692J977K529
60391E77183L184L665L548K968K592K587K456K200K495L282L453K636K034K498
60377F16781L001K251Q66N13J496K541K705K270J912J926K210K346J878R70M30
$$ y = [1263108, 1205961, 1147369, 1089069, 1032661, 979432, 930079, 885160, 845383, 810933, 781054, 754828, 731829, 711572, 693179, 676283, 661480, 648982, 637619, 626297, 615750, 607558, 601737, 596608, 590911, 584845, 579071, 573909, 569626, 566458, 564032, 561623, 559155, 557204, 555904, 554702, 553333, 552173, 551358, 550338, 548662, 546616, 544703, 543004, 541329, 539623, 538006, 536702, 536072, 536293, 536950, 537271, 536806, 535652, 534217, 533180, 533420, 535309, 538093, 540586, 542488, 544419, 546676, 548665, 549766, 550148, 550417, 550819, 551131, 551176, 551271, 552140, 554201, 556883, 559014, 560180, 561302, 563419, 566334, 569014, 570985, 572677, 574654, 577183, 580367, 584032, 587580, 590548, 593140, 595727, 598183, 600383, 602878, 606160, 609613, 612249, 614283, 616781, 619782, 622033, 622899, 623412, 624908, 627449, 630154, 632424, 634336, 636262, 638472, 640818, 642696, 643666, 644096]
60362F44096N73O86K25j71L66J620K751L520M176M702M997N374O084O797P300
60347F93096Q059R283J0074R465P704N606L231K93k673m715n737o311o623o575
60333G14177o496o695o667n806m592m021m157m298m241m184l795k598j148n39
60319F54940p63p33P7J161K139L238M463N365N929O816Q459J0620J2912J5094
60305G29717J6916J8336J9910K2175K4811K7019K8451K8844K7132K2197J4584
60294I80092O264j441q730j5961k2483k7142k9266k8846k6504k3391k0486j7885
60282G64221j5282j2960j1489j0681r838q900q384q168p491o271n297m888m418
60269F50154l444k333j445o97k44n24j193j094J00J115P57m33r79m14L68M02l81
$$ y = [644096, 644669, 645355, 645580, 645409, 645775, 647395, 650146, 653666, 657842, 662544, 667541, 672915, 678999, 685796, 693096, 701155, 710438, 720512, 729977, 737681, 743287, 746518, 746811, 744138, 739423, 733686, 727375, 720752, 714177, 707681, 700986, 694319, 688513, 683921, 679900, 675743, 671445, 667204, 663020, 659225, 656627, 655479, 654940, 654177, 653444, 653521, 654682, 656821, 660059, 664522, 669887, 675816, 682632, 691091, 701711, 714623, 729717, 746633, 764969, 784879, 807054, 831865, 858884, 887335, 916179, 943311, 965508, 980092, 986356, 984915, 976185, 960224, 937741, 910599, 881333, 852487, 825983, 802592, 782106, 764221, 748939, 735979, 724490, 713809, 703971, 695071, 686687, 678519, 671028, 664757, 659460, 654572, 650154, 646710, 644377, 642932, 642235, 641991, 641467, 640274, 639180, 639280, 640395, 641152, 640719, 639740, 639326, 639694, 640096, 639715]
60252F39715j367j925j872j511j152o87P3P91P96L4p54q86m24J47M54L97J64J73
60234F32166O80J481K309L299M611N854O537O845P216P379O689N404M641M917
60220G00028N657O247O706P119P252P138P233P644P887P754P592P508P088O337
60206G99190O017O441O680N737M000K687K150J576L28j158k040k202k378l208
60192H23820m506n626o349o963p457p304o356n305m723m257l510l089l668m485
60178G50222m068k371q28k16K78J408K533K635J789R39P65J323K268K921K678
60163G62276J713R43R68J461J775J613R81J41k49L79J608K290K019J645J981K782
60147G84326L437L958M664N464O055O423O686O804O835P055P501P839P999Q417
$$ y = [639715, 638348, 636423, 634551, 633040, 631888, 631201, 631274, 632065, 632861, 632895, 632141, 631255, 630831, 630978, 631432, 631829, 631993, 632166, 632846, 634327, 636636, 639935, 644546, 650400, 656937, 663782, 670998, 678377, 685066, 690470, 695111, 700028, 705685, 711932, 718638, 725757, 733009, 740147, 747380, 755024, 762911, 770665, 778257, 785765, 792853, 799190, 805207, 811648, 818328, 824065, 828065, 830752, 832902, 834478, 834806, 833648, 831608, 829406, 827028, 823820, 819314, 813688, 807339, 800376, 792919, 785615, 779259, 773954, 769231, 764974, 761464, 758375, 754707, 750222, 746154, 743783, 742955, 742739, 743017, 744425, 746958, 749593, 751382, 752321, 753086, 754409, 756677, 759598, 762276, 763989, 764932, 765900, 767361, 769136, 770749, 771730, 771871, 771622, 772001, 773609, 775899, 777918, 779563, 781544, 784326, 787763, 791721, 796385, 801849, 807904, 814327, 821013, 827817, 834652, 841707, 849208, 857047, 865046, 873463]
60133H73463R280J0054J0132R481Q285O454M011J497n24j956k814k798j780l85
60119I22400M23J86q27j990k597k293j540j378k253l515m320m708n232n953o347
60104H80056o137n687n543n791n960n479m242k676j166L51J891K852K570J411
60090H46450O05Q65J772K642L326L948M495M986N507N822N450M338K871J039j682
60075H92434n281q795j1347j3001j4125j4571j4120j3169j2295j1521j0502r190
60063G54517p793o380m980l809l012k417j852j377j019o28k28j9K20J101K607
60048G24931L820M202M465N443O633O786N639M129K987J986O83q32k229l483m781
60033G60379o104p095p313o624n476m685m786n647o728p558p917p788p428p246
$$ y = [873463, 882743, 892797, 902929, 912410, 920695, 927149, 931160, 932657, 932133, 930177, 927363, 924565, 922785, 922400, 922823, 923009, 922182, 920192, 917595, 915302, 913762, 912384, 910131, 906616, 902296, 897588, 892356, 886403, 880056, 873919, 868232, 862689, 856898, 850938, 845459, 841217, 838541, 837375, 837726, 839617, 842469, 845039, 846450, 847055, 847920, 849692, 852334, 855660, 859608, 864103, 869089, 874596, 880418, 885868, 890206, 893077, 894116, 892434, 887153, 878358, 867011, 854010, 839885, 825314, 811194, 798025, 785730, 774209, 763707, 754517, 746724, 740344, 735364, 731555, 728543, 726126, 724274, 722897, 721878, 721250, 721022, 721003, 721223, 722324, 724931, 728751, 732953, 737418, 742861, 749494, 756280, 761919, 766048, 769035, 771021, 771704, 770872, 768643, 765160, 760379, 754275, 747180, 739867, 733243, 727767, 723082, 718296, 712649, 705921, 698363, 690446, 682658, 675230, 667984]
60019F67984p366p403o909n934m980m470m341m196l711k994k424k145j854j249
60005F08008m68J87O89J140J375J213R43J052J599K316L168M201N019N081M559
59990F40082M160M087L888L327K715K198J512N93k97j177k295l320l490k887k643
59975F46453l330m066l818k873k181j852j171J79J682K679L050L225L866N322
59961F47165P155Q441Q671Q112P095N457L032K88j965l336l963m049l593k640
59947F75870j659j481k529m091m829m317l515l302l268k741k141k207k419j714
59933F35657l45M98Q10J775L529M707M701M662N472O437O885P494Q852R871R111
59918G10116O809M465L083K784L322M090M285M030M499O092P405P069N710M835
$$ y = [667984, 660618, 653215, 646306, 640372, 635392, 630922, 626581, 622385, 618674, 615680, 613256, 611111, 609257, 608008, 607540, 607727, 608416, 609556, 610931, 612144, 613087, 614139, 615738, 618054, 621222, 625423, 630442, 635523, 640082, 644242, 648329, 652217, 655544, 658259, 660457, 661969, 662562, 662265, 661088, 658793, 655473, 651983, 649096, 646453, 643123, 639057, 635239, 632366, 630185, 628333, 627162, 627341, 629023, 631702, 634752, 637977, 641843, 647165, 654320, 662761, 671432, 679544, 686639, 692096, 695128, 695416, 693451, 690115, 686152, 682103, 678510, 675870, 674211, 672730, 670201, 666110, 661281, 656964, 653449, 650147, 646879, 644138, 641997, 639790, 637371, 635657, 635312, 635810, 636620, 638395, 641924, 646631, 651332, 655994, 661466, 667903, 674788, 682282, 691134, 701005, 710116, 716925, 721390, 724473, 727257, 730579, 734669, 738954, 742984, 747483, 753575, 760980, 768049, 773759, 778594]
59904G78594M580L929K583J212J87o58j167r47j69N63J037J382J496J326J349
59889G95297J937K586K670K543L012M034M861N239N550O005O502P050P513P199
59875H61998N565L166J156J4o06j080j625k568l996n348o040o238o425o516o188
59860H25269n688n469n380m917m109l410k952k511j918j011L81J863K541K296
59846G94985K305L452M985N690N701N986O719P430Q181R155R452P822M678J950
59832H78491R42J396K718M741O959Q089P019L718q93n543r167j1486j2936j3669
59818H60379j3140j1263r279q479q630q655q327q053p538o150m296l034k386j466
59804G59683k07N39O24Q01J135O87p38j964k158j962k290k985l380l388l352l459
$$ y = [778594, 783174, 787103, 789686, 790898, 791085, 790427, 789260, 788313, 788144, 788707, 789744, 791126, 792622, 793948, 795297, 797234, 799820, 802490, 805033, 808045, 812079, 816940, 822179, 827729, 833734, 840236, 847286, 854799, 861998, 867563, 870729, 871885, 871899, 871293, 870213, 868588, 866020, 862024, 856676, 850636, 844398, 837973, 831457, 825269, 819581, 814112, 808732, 803815, 799706, 796296, 793344, 790833, 788915, 787904, 788285, 790148, 792689, 794985, 797290, 800742, 805727, 811417, 817118, 823104, 829823, 837253, 845434, 854589, 864041, 871863, 876541, 878491, 879433, 880829, 883547, 888288, 895247, 903336, 910355, 914073, 913180, 907637, 898470, 886984, 874048, 860379, 847239, 835976, 826697, 818218, 809588, 800933, 792606, 784553, 777015, 770865, 766569, 763535, 761149, 759683, 759476, 760015, 760639, 761440, 762575, 763262, 762524, 760560, 758402, 756440, 754150, 751165, 747785, 744397, 741045, 737586]
59788G37586l739m148m367m029l299k721k437k221k143k404k576j922n63N93J116
59773G02726J405J762K078K527L493M623N018M598M333M786N442N811O195O975
59759G61772Q022R217J0632J1841J1925J0778R554R293R773J0135R991R431Q603
59746H90967P758P151O481M917K186q78l155m249m553m785n564o871p725p129
59732H74551n442m181m204m826m950m376l620l085k868k934l138l315l459l548
59718H20605l291k522j673j286j186q12j72L21Q13J759K847L214K894K867L508
59703H27886L967L527K600J976J937K433L333M092M016L249K731K840K908K351
59689H69846J434N35m71j602k333k325j922j563j340j519k631m551o238o969p188
$$ y = [737586, 733847, 729699, 725332, 721303, 718004, 715283, 712846, 710625, 708482, 706078, 703502, 701580, 701017, 701610, 702726, 704131, 705893, 707971, 710498, 713991, 718614, 723632, 728230, 732563, 737349, 742791, 748602, 754797, 761772, 769794, 779011, 789643, 801484, 813409, 824187, 833741, 843034, 852807, 862942, 872933, 882364, 890967, 898725, 905876, 912357, 917274, 919460, 918582, 915427, 911178, 906625, 901840, 896276, 889405, 881680, 874551, 869109, 864928, 860724, 855898, 850948, 846572, 842952, 839867, 836999, 834065, 830927, 827612, 824153, 820605, 817314, 814792, 813119, 811833, 810647, 809835, 809663, 809984, 810797, 812556, 815403, 818617, 821511, 824378, 827886, 831853, 835380, 837980, 839956, 841893, 844326, 847659, 851751, 855767, 859016, 861747, 864587, 867495, 869846, 871280, 871815, 871344, 869742, 867409, 865084, 863162, 861599, 860259, 858740, 856109, 851558, 845320, 838351, 831163]
59674H31163p580p994p868p218o535o101n818n453m678l271j571l45N1PJ6J83
59658G66988M55Q94J529K322L330M418M978M548L613K945K339R09j344l382m659
59643G89883n673o714p139o450n125l903k977k287j841j350l65Q05J127J53j463
59628G46681l048m592o022o781o702o446o450o230n282l942k821k047j568j522
59614F83228j735j534n14J024K690M342N630O024N692N432N328M513K754J250
59600G24124J066J682J922J582J302J378J539J547J334Q41K36j09j83n32j502
59585G36227k747l668l937l439k345j375j303k050k857l387l851m076l522k339
59571F95331j351q11k29M59P53Q43J565K727K945J806P36R46J785J993J438P32
$$ y = [831163, 823583, 815589, 807721, 800503, 793968, 787867, 782049, 776596, 771918, 768647, 767076, 766731, 766782, 766789, 766805, 766988, 767443, 768337, 769866, 772188, 775518, 779936, 784914, 789462, 793075, 796020, 798359, 799268, 797924, 794542, 789883, 784210, 777496, 770357, 763907, 758782, 754879, 751902, 749615, 747774, 746424, 746059, 746864, 747991, 748144, 746681, 743633, 739041, 733019, 726238, 719536, 713090, 706640, 700410, 695128, 691186, 688365, 686318, 684750, 683228, 681493, 679959, 679445, 680469, 683159, 687501, 693131, 699155, 704847, 710279, 715607, 720120, 722874, 724124, 725190, 726872, 728794, 730376, 731678, 733056, 734595, 736142, 737476, 738317, 738553, 738444, 738261, 737729, 736227, 733480, 729812, 725875, 722436, 720091, 718716, 717413, 715363, 712506, 709119, 705268, 701192, 697670, 695331, 693980, 693169, 692940, 693399, 694152, 694995, 696560, 699287, 702232, 704038, 704774, 705720, 707505, 709498, 710936, 711668]
59555G11668J98L8N84J520J881J461J196J542J767J535J741K937M350N519P400
59540G45337J0586J3952J6556J9419K3409K6448K5081J8586R875K539j645k691
59528I07452j621P6J337K095K577K463J405j85j697l171m895o794q876j1473j4253
59513H64440j5862j5473j3841j2075j0310q533p470p479p561o820n848n401m806
59500G42961l227j442p05o91l06K81K76J60R62K148K225J255P82J388K134K459
59484G50660K848L499L938M136M668N568O292O835P605Q323Q302P710P183O466
59470H34033M888K963J924J747J284L63Q0Q30J761K490L767N993Q452J0479J2050
59455H93104J2890J2376J0802R386Q490P100M614J938J50r25k192m191o973j0207
$$ y = [711668, 711866, 711904, 712488, 714008, 715889, 717350, 718546, 720088, 721855, 723390, 725131, 728068, 732418, 737937, 745337, 755923, 769875, 786431, 805850, 829259, 855707, 880788, 899374, 909249, 911788, 910143, 907452, 905831, 905907, 907244, 909339, 911916, 914379, 915784, 915599, 913902, 910731, 905836, 899042, 890166, 878693, 864440, 848578, 833105, 819264, 807189, 796879, 788346, 780876, 773397, 765836, 759016, 753168, 747767, 742961, 739734, 738292, 737587, 736896, 736590, 736871, 737147, 737307, 738269, 740417, 742642, 743897, 744679, 746067, 748201, 750660, 753508, 757007, 760945, 765081, 769749, 775317, 781609, 788444, 796049, 804372, 812674, 820384, 827567, 834033, 838921, 841884, 843808, 845555, 846839, 847202, 847282, 848112, 849873, 852363, 856130, 862123, 870575, 881054, 893104, 905994, 918370, 929172, 938558, 947048, 954148, 958762, 960700, 960850, 959925, 957733, 953542, 946569, 936362]
59441I36362j2964j4188j3781j2552j0982q903o477m448l118k006p95L15J375
59428H47838K846M756O624Q484J1000J4218J7186J9118K0094K0420K0181J9665
59416A012430J9259J8759J7826J7224J8211K0085J9576J3722K854r626j9730k4870
59404A105720k4653k0705j5368r788l465M106J1692J6455J5583Q166l705j5539
59392A068499k3173k5458k4170k1568j8723j5941j3483j1473r837q695q097p406
59380H80475n868l860k611k429k318j652j088j244j547j174l22K86O45J369K680
59365H61342M136N271O095P012Q387J0156J1835J3187J4612J6535J8662K0399
59353I97629K1753K3098K4263K4695K4405K3919K3320K2218K0561J8568J5816
$$ y = [936362, 923398, 909210, 895429, 882877, 871895, 862992, 856515, 852067, 848949, 846943, 846148, 846463, 847838, 850684, 855440, 862064, 870548, 881548, 895766, 912952, 932070, 952164, 972584, 992765, 1012430, 1031689, 1050448, 1068274, 1085498, 1103709, 1123794, 1143370, 1157092, 1159946, 1150320, 1130590, 1105720, 1081067, 1060362, 1044994, 1035206, 1031741, 1035847, 1047539, 1063994, 1079577, 1087743, 1084038, 1068499, 1045326, 1019868, 995698, 974130, 955407, 939466, 925983, 914510, 904673, 895978, 887881, 880475, 874607, 870747, 868136, 865707, 863389, 861737, 860649, 859405, 857858, 856684, 856362, 856648, 857293, 858662, 861342, 865478, 870749, 876844, 883856, 892243, 902399, 914234, 927421, 942033, 958568, 977230, 997629, 1019382, 1042480, 1066743, 1091438, 1115843, 1139762, 1163082, 1185300, 1205861, 1224429, 1240245]
59342A240245J1494N830K51m269q238j2647j7582k2223k5659k7460k7907k7803
59330A084032k7638k6954k5120k2504k0179j8566j7164j5583j3880j1953r575
59319H74916p199n843n878o623p218p212o411n039m048m250n023m906l599k366
59305G99301k181k483k248j372m86j2J97O38J822L762N913P987J0532J3972J7449
59290H52791J9357J8766J5523R610J806n425r385r651p981n765k978M88M050P402
59276H88608J0807J4026J6217J7159J7390J6911J5240J2941J1448J0895R698O921
59264A048261L553P32j780m463o801q230r158j0019j0424j0189j0102j0582j0593
59251I60205r030o389m049k505j268Q9J689L572N410O565P023P589Q571R084Q305
$$ y = [1240245, 1251739, 1257569, 1257820, 1253551, 1245313, 1232666, 1215084, 1192861, 1167202, 1139742, 1111835, 1084032, 1056394, 1029440, 1004320, 981816, 961637, 943071, 925907, 910324, 896444, 884491, 874916, 867717, 861874, 855996, 849373, 842155, 834943, 828532, 823493, 819445, 815195, 810172, 805266, 801667, 799301, 797120, 794637, 792389, 791017, 790531, 790519, 790716, 791354, 793176, 796938, 802851, 810838, 821370, 835342, 852791, 872148, 890914, 906437, 916047, 917853, 912428, 903043, 893392, 885411, 879646, 876668, 877156, 881206, 888608, 899415, 913441, 929658, 946817, 964207, 981118, 996358, 1009299, 1020747, 1031642, 1041340, 1048261, 1051814, 1052546, 1050766, 1046303, 1039502, 1031272, 1022114, 1012095, 1001671, 991482, 981380, 970798, 960205, 951175, 944786, 940737, 938232, 936964, 937053, 938742, 942314, 947724, 954289, 961312, 968901, 977472, 986556, 994861]
59236I94861O608M685K379o21l697n911p337q833j0857j3200j5578j7740j9226
59223I05533j9628j9010j7711j6000j4078j2096j0036p944o308n577n293m509
59211G67343l110j870j134m72J56J17n80q22J30J545K303K250K007K080K669L663
59195G76275M435M300L486K909K859K801K545K567K902K945K600K441K425J766
59181H17256N59P2P84J583J641J721K679M030N031O011P440Q778R325R377R409
59166H85696Q953P371N060K888J024q25k780n066q088j1431j3665j4035j3484
59153H41618j3131j2722j1571j0082r138q662q014p288p073p322p399o979o226
59140G26011n359m596m126l641k561r91J95O36R24J456J892K200L024M406N311
$$ y = [994861, 1001469, 1006154, 1008533, 1007912, 1004215, 998304, 990967, 982134, 971277, 958077, 942499, 924759, 905533, 885905, 866895, 849184, 833184, 819106, 807010, 796974, 789030, 782722, 777145, 771852, 767343, 764233, 762363, 761229, 760757, 760913, 761030, 760450, 759628, 759758, 761303, 763606, 765856, 767863, 769943, 772612, 776275, 780710, 785010, 788496, 791405, 794264, 797065, 799610, 802177, 805079, 808024, 810624, 813065, 815490, 817256, 817815, 817887, 818671, 820254, 821895, 823616, 826295, 830325, 835356, 841367, 848807, 857585, 866910, 876287, 885696, 894649, 902020, 907080, 909968, 910992, 910167, 907387, 902321, 894233, 882802, 869137, 855102, 841618, 828487, 815765, 804194, 794112, 784974, 776312, 768298, 761010, 753937, 746615, 739216, 732237, 726011, 720652, 716056, 711930, 708289, 705728, 704737, 704932, 705568, 706492, 707948, 709840, 712040, 715064, 719470, 724781]
59125G24781N190M898N304O212P373R205J1549J3100J3286J3436J4758J6321J6509
59112H61922J5495J4711J4613J4423J3612J2294J0596Q713P195O211N056L130
59100I87971P68j571m001o275p256o454n021m156l488k229r04n11q55j151j587
59085I43280k866m793o516p770q752r367r574r810j0145r825q551p232o485n565
59071H36029l943k744l116m291m761m473m272m103l416k553k181k020j647j672
59057G90837k582l320k724j524j176j493j347q67r35j167n35M63L95o09j086p41
59041G71589o72j144j156l93L45Q35J808L339M572N398O877R478J2287J4385J5905
59026H43453J7364J8904K0367K1264K0713J8189J4261R842N173L70l711o336p982
$$ y = [724781, 729971, 734869, 740173, 746385, 753758, 762963, 774512, 787612, 800898, 814334, 829092, 845413, 861922, 877417, 892128, 906741, 921164, 934776, 947070, 957666, 966379, 973574, 979785, 984841, 987971, 988739, 987168, 983167, 976892, 969636, 963182, 958161, 954005, 950517, 948288, 947384, 946873, 946018, 944867, 943280, 940414, 935621, 929105, 921335, 912583, 903216, 893642, 883832, 873687, 863862, 855311, 848079, 841594, 836029, 832086, 829342, 826226, 821935, 817174, 812701, 808429, 804326, 800910, 798357, 796176, 794156, 792509, 790837, 788255, 784935, 782211, 780687, 779511, 778018, 776671, 775804, 774869, 773702, 773167, 773630, 774025, 773416, 772330, 771589, 770917, 769773, 768617, 768224, 768569, 769404, 771212, 774551, 779123, 784521, 791398, 800876, 813163, 827548, 843453, 860817, 879721, 900088, 921352, 942065, 960254, 974515, 984357, 989530, 989900, 986189, 979853, 971871]
59013I71871r347r972r164p566o273n000k813q5K058L790O136Q845J0592J1131
58999I64203J1403J1572J0899R555Q711Q609Q196O811M706J896j840n726q430
58986A030565r843j0924j1709j1225r459p638o238m415j788P41K429L550M417
58973I68463M880N177O073P747R536J0990J2306J3614J4840J6072J7105J6943
58961A103746J4902J1784Q675N137J52n710j0791j4650j8004k0767k2184k2628
58949A029662k3234k3676k2465j9540j6541j4306j2109r603p403n409k701L67
58937H73042K030J735R37O25p3j915l982n148n604o006o307o307o251o249o042
58922H24485n671n382m813l471j977j384j288l04J622L183M071N329P075P929
$$ y = [971871, 962524, 952552, 943388, 935822, 929549, 924549, 921736, 921651, 923709, 927499, 933635, 942480, 953072, 964203, 975606, 987178, 998077, 1007632, 1016343, 1024952, 1033148, 1039959, 1044665, 1046561, 1044721, 1038995, 1030565, 1020722, 1009798, 998089, 986864, 977405, 969767, 963529, 959114, 957326, 958067, 960496, 964046, 968463, 973343, 978520, 984593, 992340, 1001876, 1012866, 1025172, 1038786, 1053626, 1069698, 1086803, 1103746, 1118648, 1130432, 1139107, 1144244, 1144396, 1138686, 1127895, 1113245, 1095241, 1074474, 1052290, 1029662, 1006428, 982752, 960287, 940747, 924206, 909900, 897791, 888188, 880785, 875376, 872675, 873042, 875072, 876807, 877744, 878369, 878296, 876381, 872399, 867251, 861647, 855641, 849334, 843027, 836776, 830527, 824485, 818814, 813432, 808619, 805148, 803171, 801787, 800499, 800195, 801817, 805000, 809071, 814400, 821475, 829404]
58908H29404P352O633O870P716Q807J0626J3222J5655J7466J9229K1096K2361
58896I86437K3011K4028K5627K6882K7652K9142L1919L5034L7627L9545L9916
58885A326820L7166L1318K4380J7664J0629L110l580q912j4330k0717k6582l0282
58873A346684l2204l3211l2618k9605k5302k1636j9091j7128j5794j5389j5388
58862A089318j5151j5020j5467j5897j5419j4161j2821j1525j0036q526p356o734
58850I41205p083q879j1586j3734j4578j4759j4895j4715j4134j3786j3775j3119
58838G86162j1339r442q499q241p759o692n122l278j828j373j341n66P55J220
58824G22657O66P15K200L768L984L293K850K744K457J931J314O04J38L36O11j35
$$ y = [829404, 836756, 843389, 850259, 857975, 866782, 877408, 890630, 906285, 923751, 942980, 964076, 986437, 1009448, 1033476, 1059103, 1085985, 1113637, 1142779, 1174698, 1209732, 1247359, 1286904, 1326820, 1363986, 1395304, 1419684, 1437348, 1447977, 1451087, 1447507, 1438595, 1424265, 1403548, 1376966, 1346684, 1314480, 1281269, 1248651, 1219046, 1193744, 1172108, 1153017, 1135889, 1120095, 1104706, 1089318, 1074167, 1059147, 1043680, 1027783, 1012364, 998203, 985382, 973857, 963821, 955295, 947939, 941205, 934122, 925243, 913657, 899923, 885345, 870586, 855691, 840976, 826842, 813056, 799281, 786162, 774823, 765381, 756882, 748641, 740882, 734190, 729068, 725790, 723962, 722589, 721248, 720682, 721437, 722657, 723323, 724038, 726238, 730006, 733990, 737283, 740133, 742877, 745334, 747265, 748579, 749183, 749321, 749657, 750268, 750133]
58808G50133j538j894p29M51M95j3l29o80j011n47N28P32m58j700k027k115k425
58791G36873k065o01Q87J764K970N009O675P089P126P510P337N943M437L853L523
58776G98330K802K597L510M197L296J417l65k344m813o511o375n411m902m196
58762G81232k136N91K457L319L841L763K598J048J07m50j168j521q26M39J572
58747G94866K805M343N447N725N979O645O861O340O490Q168J0053J0831J1323
58734H85876J2685J4203J4792J5059J5852J6271J5107J3021J1246R550P403N828
58722A036893N997P183Q051Q686R496R492P778N390L553J498j835n316p249q266
58708A081351j0173j2937j5196j6844j8816k1098k3093k5130k7531k9070k8454
$$ y = [750133, 748595, 746701, 745972, 746423, 746918, 746905, 746576, 745896, 744885, 744338, 744866, 745598, 745140, 743440, 741413, 739298, 736873, 734808, 734207, 735094, 736858, 739828, 744837, 751512, 758601, 765727, 773237, 780574, 786517, 790954, 794807, 798330, 801132, 803729, 807239, 811436, 814732, 816149, 815784, 813440, 808627, 802116, 795741, 790330, 785428, 781232, 779096, 779687, 782144, 785463, 789304, 793067, 795665, 796713, 796820, 796370, 795202, 793681, 792855, 793294, 794866, 797671, 802014, 807461, 813186, 819165, 825810, 832671, 839011, 845501, 853669, 863722, 874553, 885876, 898561, 912764, 927556, 942615, 958467, 974738, 989845, 1002866, 1014112, 1023662, 1031065, 1036893, 1042890, 1050073, 1058124, 1066810, 1076306, 1085798, 1093576, 1098966, 1102519, 1104017, 1102182, 1096866, 1089617, 1081351, 1071178, 1058241, 1043045, 1026201, 1007385, 986287, 963194, 938064, 910533, 881463, 853009]
58697H53009k6384k4215k1724j8252j4853j2887j1653r708p521o450o117n302
58685F87943m422m609n245m924l960l450k817q98J432K493K824M218O430P809
58671F82824Q594J0570J3772J6459J8236K0346K2863K4232K3698K1721J8005J1602
58659H92922L220m866j1306j6124j8983j9370j8290j7422j6599j4383j1036q504
58647G39259p417o391m577k681j242J18J470K350K848L323L245J981L90j16K62
58632G32822K71j87l36l46q65j239m03J005J536J476K272L942N269O167P600R526
58616G68510J1065J2167J3031J2499R486N277K009m26l392o268p218o669o850
58603H03221p972p995o347m914m911n346n105m222k814q67Q57J704K677N070Q153
$$ y = [853009, 826625, 802410, 780686, 762434, 747581, 734694, 723041, 713333, 705812, 699362, 693245, 687943, 683521, 678912, 673667, 668743, 664783, 661333, 658516, 657618, 659050, 661543, 664367, 668585, 675015, 682824, 691418, 701988, 715760, 732219, 750455, 770801, 793664, 817896, 841594, 863315, 881320, 892922, 896142, 891276, 879970, 863846, 844863, 825493, 807203, 789781, 773182, 758799, 747763, 739259, 731842, 725451, 720874, 718193, 716951, 717069, 718539, 720889, 723737, 727060, 730305, 732286, 732676, 732560, 732822, 733093, 732906, 732570, 732224, 731359, 730120, 729717, 730722, 732258, 733734, 736006, 739948, 745217, 751384, 758984, 768510, 779575, 791742, 804773, 817272, 826758, 832035, 834044, 833618, 830226, 823958, 816740, 810071, 803221, 795249, 787254, 780907, 775993, 771082, 765736, 760631, 756409, 753595, 752728, 753585, 755289, 757966, 763036, 771189]
58588G71189J0453J2569J5838J9030J9546J7639J6119J5893J5079J2742J0259
58577I36356Q520O802N039M485N506P317J0068J4624K0134K4592K8012L2164L6965
58564A140584M0133M0753M0056L8192L3501K5775J7278R570K083n305j1005j4121
58552A357494j5651j6421j6003j4470j2958j1921j0892j0440j2031j5606j9465
58541A201636k2759k5778k7836k7577k5581k3923k2900k0858j7414j4057j1330
58530I61623q329n250l436k633j117J149K498K862L900N448N263K901N91n07j697
58515I63266l697n388o383p713r208r230p788o816o763o055m520l968m600m381
58501H76756k870k199l248m242m130l973l963k611n4J377J152J601L794N847O715
$$ y = [771189, 781642, 794211, 810049, 829079, 848625, 866264, 882383, 898276, 913355, 926097, 936356, 944876, 951678, 956717, 961202, 966708, 974025, 984093, 998717, 1018851, 1043443, 1071455, 1103619, 1140584, 1180717, 1221470, 1261526, 1299718, 1333219, 1358994, 1376272, 1385842, 1387925, 1382620, 1371615, 1357494, 1341843, 1325422, 1309419, 1294949, 1281991, 1270070, 1259178, 1248738, 1236707, 1221101, 1201636, 1178877, 1153099, 1125263, 1097686, 1072105, 1048182, 1025282, 1004424, 987010, 972953, 961623, 953294, 948044, 944608, 941975, 940858, 942007, 944505, 947367, 951267, 956715, 961978, 964879, 965470, 964963, 963266, 959569, 954181, 947798, 940085, 930877, 921647, 913859, 907043, 900280, 894225, 889705, 885737, 881137, 876756, 873886, 871687, 868439, 864197, 860067, 856094, 852131, 849520, 849466, 850843, 851995, 853596, 857390, 863237, 869952]
58486H69952Q037J0744J3293J4888J7053K0311K2605K2640K1596J9976J6074R256
58474A066425J614n122j1239j6401j8893j8935j9114j9973j8823j4679j0446q165
58462I06249n919j803K665N694Q371J2022J5333J6690J6721J6237J4192R835M440
58449A020727q70o443j1749j4641j4546j3546j2846j1265q464o208m912k622R92
58436I13607L264L003K510L380M125L954M889P816J0339J0882J1129J2082J1656
58423A002636Q628N135K689l50m751p944q342q272r747j1289j1665j2680j5133
58410I28915j6197j4124j1702j1572j1959j0507q510p661o380l181k55K04M6J835
58396H28952M487N744N925N940M703J905J17Q82J869J021N3P30J405N27j14Q94
$$ y = [869952, 877989, 888733, 902026, 916914, 933967, 954278, 976883, 999523, 1021119, 1041095, 1057169, 1066425, 1068039, 1062917, 1051678, 1035277, 1016384, 997449, 978335, 958362, 939539, 924860, 914414, 906249, 900330, 898527, 901192, 906886, 915257, 927279, 942612, 959302, 976023, 992260, 1006452, 1016287, 1020727, 1019857, 1013414, 1001665, 987024, 972478, 958932, 946086, 934821, 926357, 920149, 915237, 912615, 913607, 916871, 919874, 922384, 925764, 929889, 933843, 938732, 946548, 956887, 967769, 978898, 990980, 1002636, 1011264, 1016399, 1019088, 1018738, 1013987, 1006043, 997701, 989429, 979682, 968393, 956728, 944048, 928915, 912718, 898594, 886892, 875320, 863361, 852854, 844344, 836683, 830303, 827122, 826867, 827071, 827117, 828952, 833439, 839183, 845108, 851048, 855751, 857656, 857773, 858655, 860524, 861545, 861598, 862328, 863733, 864260, 864146, 865040]
58380H65040J484J95n71J045K676K219J941M126O692P237P484R473J1315J1163
58366I31519J1410J4366J7539J7885J6966J7192J6797J3343Q748N875L587p9l318
58353A071830l948l834n217o152m372k004j556r62K416O556Q591J0137J3601J6972
58339A102058J7501J6960J7935J8688J6905J4715J4616J4329J1130P291N678M190
58327A261996K81l290l262k117l302m631k869m61r47j930L87L847M609M601P393
58312A260305J0692J0484Q803R760J1628J0626Q825J0399J3554J3995J2932J3795
58300A395798J4771J2559R866J0888J3051J1640Q879R766J2656J2810J1745J3928
58288A538357J7647J8306J7478J9537K2680K2570K1419K4039K8361K9394K8978
$$ y = [865040, 866524, 866719, 866148, 867193, 869869, 872088, 874029, 878155, 884847, 892084, 899568, 909041, 920356, 931519, 942929, 957295, 974834, 992719, 1009685, 1026877, 1043674, 1057017, 1065765, 1071640, 1075227, 1075148, 1071830, 1067882, 1064048, 1058831, 1052679, 1048307, 1046303, 1044747, 1043785, 1046201, 1052757, 1061348, 1071485, 1085086, 1102058, 1119559, 1136519, 1154454, 1173142, 1190047, 1204762, 1219378, 1233707, 1244837, 1252128, 1257806, 1261996, 1262277, 1258987, 1255725, 1253608, 1250306, 1245675, 1242806, 1242345, 1241398, 1239468, 1239855, 1243702, 1248311, 1252912, 1260305, 1270997, 1281481, 1290284, 1300044, 1311672, 1322298, 1331123, 1341522, 1355076, 1369071, 1382003, 1395798, 1410569, 1423128, 1432994, 1443882, 1456933, 1468573, 1477452, 1487218, 1499874, 1512684, 1524429, 1538357, 1556004, 1574310, 1591788, 1611325, 1634005, 1656575, 1677994, 1702033, 1730394, 1759788, 1788766]
58277A788766L1831L5749L5815L4524L7343M1939M2519M1001M2939M6270M5513
58266B224209M3298M5932N1133N2098N0060N0679N1835M7733M1399M0040M1609
58255B740025L9266L5414L7462M3429M5982M7081N3764O3157O7050O7800P3840
58244C314270Q2922Q6340Q6430R2666J03418J09242J11411J19053J30593J36811
58234D373156J39729J49298J63750J73021J79113J92497K10925K23307K32122
58225F036918K49551K73751K92378L07431L32068L64909L93165M19307M57516
58216I126994N05556N48794N90606O48728P22753P97197Q75649R77715J102877
58207A5896869J234076J377230J558644J783477K039373K342478K734729L234812
$$ y = [1788766, 1820597, 1856346, 1892161, 1926685, 1964028, 2005967, 2048486, 2089487, 2132426, 2178696, 2224209, 2267507, 2313439, 2364572, 2416670, 2466730, 2517409, 2569244, 2616977, 2658376, 2698416, 2740025, 2779291, 2814705, 2852167, 2895596, 2941578, 2988659, 3042423, 3105580, 3172630, 3240430, 3314270, 3397192, 3483532, 3569962, 3662628, 3766046, 3875288, 3986699, 4105752, 4236345, 4373156, 4512885, 4662183, 4825933, 4998954, 5178067, 5370564, 5581489, 5804796, 6036918, 6286469, 6560220, 6852598, 7160029, 7492097, 7857006, 8250171, 8669478, 9126994, 9632550, 10181344, 10771950, 11420678, 12143431, 12940628, 13816277, 14793992, 15896869, 17130945, 18508175, 20066819, 21850296, 23889669, 26232147, 28966876, 32201688]
58199C2201688L842236M591389N542965O714983Q085471R676889J1577998J3880650
58191I6114269J6683881K0189538K4698341L0399378L7036196M3503466M7504763
58184C16129832M5859078L6060841J8458357k934952k2293289l5230250m0706351
58177C15343266m0346733l6512999l1091892k5431301k0557862j7089235j5069632
58170A29243612j4063634j3453668j2730889j1671223j0342847q945731p627982
58163E0407638o443197n415964m566086l875024l294434k799581k394682k068519
58155A9550151j789121j543331j341206j179188j035882r05968q03043p26156
58147A0226256o56298n88546n36448n01268m66344m25614l90184l62893l32660
$$ y = [32201688, 36043924, 40635313, 46178278, 52893261, 60978732, 70655621, 82233619, 96114269, 112798150, 132987688, 157686029, 188085407, 225121603, 268625069, 316129832, 361988910, 398049751, 416508108, 413573156, 391279867, 356049617, 315343266, 274996533, 238483534, 207391642, 181960341, 161402479, 144313244, 129243612, 115179978, 101726310, 88995421, 77324198, 66981351, 58035620, 50407638, 43964441, 38548477, 33982391, 30107367, 26812933, 24013352, 21618670, 19550151, 17761030, 16217699, 14876493, 13697305, 12661423, 11755455, 10952412, 10226256, 9569958, 8981412, 8444964, 7943696, 7477352, 7051738, 6661554, 6298661, 5966001]
58138E966001k97869k70344k51919k30575k03811j83449j73270j63456j51093
58129D040215j45222j47136j45699j36878j29257j25984j19407j07878j00109
58120B882645r8316r3802q3766p6344p4683p1652o4612o0362o0973n9370n3249
58109B085516m9446n0253m9123m3989m1412m3498m3765m0103l8883m2058m2833
58098A600153l8570l5565l6462l4985k8088k1817k0046j8260j3507j0121j0579
58087A332153j0563p859o798r403j1302j0628j1935j7127k1262k1436k1269k2840
58075A159731k2746j9919j8787k0874k1499j8465j5790j5394j3514r054o937r217
58063I67535j0961r098p326q188q226n392l646n653p950p712p464q943r204o929
$$ y = [5966001, 5668132, 5397788, 5145869, 4915294, 4711483, 4528034, 4354764, 4191308, 4040215, 3894993, 3747857, 3602158, 3465280, 3336023, 3210039, 3090632, 2982754, 2882645, 2784329, 2690527, 2606761, 2530417, 2455734, 2384082, 2319470, 2259108, 2198135, 2138765, 2085516, 2036070, 1985817, 1936694, 1892705, 1851293, 1807795, 1764030, 1723927, 1685044, 1642986, 1600153, 1561583, 1526018, 1489556, 1454571, 1426483, 1404666, 1384620, 1366360, 1352853, 1342732, 1332153, 1321590, 1313731, 1306933, 1297530, 1286228, 1275600, 1263665, 1246538, 1225276, 1203840, 1182571, 1159731, 1136985, 1117066, 1098279, 1077405, 1055906, 1037441, 1021651, 1006257, 992743, 983689, 976752, 967535, 956574, 947476, 940150, 931962, 923736, 918344, 914698, 909045, 901095, 893383, 885919, 876976, 867772, 860843]
58049H60843n850p711q456n563k763l279m679m535n010p559r140p935p084q679
58035G72600r670p769n774o047o251m636m058o519q975q645p519p665p179m730
58021F77163l090m043m634k568o07j463k953k346j181j547j829k07J404R69J53
58006F53221R25J870J401J060K230L153K365J616K319K719J549P44J651K288J230
57991F80341L78J000J030p85k100j300n76j648k546j713j285k927m460l917l051
57976F56441l502l475j635l78j567k870j986q13j698l125k877k107k536k924j988
57961F22960j564l178m703m003k753l076l677k891k265l330m071k536p57j143
57947E83013k003q03J128J424J426L609O733Q017Q039R220J1221J2004J1866J2434
$$ y = [860843, 854993, 847282, 838826, 833263, 830500, 827221, 822542, 818007, 812997, 805438, 796298, 788363, 781279, 772600, 762930, 755161, 749387, 743340, 737089, 732453, 728395, 721876, 712901, 704256, 696737, 689072, 681893, 677163, 674073, 670030, 665396, 662828, 662221, 660758, 657805, 655459, 654278, 652731, 650902, 650695, 652099, 653068, 653221, 654146, 656016, 657417, 658477, 660707, 663860, 666225, 667841, 670160, 672879, 674428, 675172, 676823, 679111, 680341, 680719, 681719, 682749, 681964, 679864, 678564, 677988, 676340, 673794, 672081, 670796, 667869, 663409, 659492, 656441, 652939, 649464, 647829, 647451, 645884, 643014, 641028, 640215, 638517, 635392, 632515, 630408, 627872, 624948, 622960, 621396, 618218, 613515, 609512, 606759, 603683, 600006, 597115, 594850, 591520, 587449, 584913, 584156, 583013, 581010, 580207, 581335, 582759, 584185, 587794, 594527, 602544, 610583, 619803, 631024, 643028, 654894, 667328]
57933F67328J3187J2531J0998R999Q975O894M763L550J602k516o667q099p868
57920G14677q740j0447j0742r630q879q540p352n621m584l863k351n19O98J887
57906F35994L606M481L404J923J850K305J781J128J650K234J379K67P24J872J841
57891F66439J152J332J853J425P30R06J007j36j290j082r74k817n278o034n769
57876F51464o551p831p694o623o456o787n837l913k661j924m92J119J702K053
57862E99569L478M891M570L629M379O384P516P817Q919J0458J0587R359Q381P719
57848F97656O290M566L774L161J194j290k276k132k840m376n103n146o106p859
57834F79513q795q801r072r439q786p598p109o606m595j996r83j277q24L66L86
$$ y = [667328, 680515, 693046, 704044, 714043, 723018, 729912, 734675, 738225, 739827, 737311, 730644, 722545, 714677, 705937, 695490, 684748, 675118, 666239, 657699, 650347, 644726, 640142, 636279, 633928, 633409, 634107, 635994, 639600, 644081, 647485, 649408, 651258, 653563, 655344, 656472, 658122, 660356, 661735, 662002, 662726, 664598, 666439, 667591, 668923, 670776, 672201, 672931, 673837, 674844, 674708, 673418, 672336, 671362, 668545, 663267, 657233, 651464, 644913, 637082, 629388, 622765, 616309, 609522, 603685, 599772, 597111, 595187, 594695, 595814, 597516, 599569, 603047, 607938, 612508, 616137, 620516, 626900, 634416, 642233, 651152, 661610, 672197, 681556, 689937, 697656, 703946, 708512, 712286, 715447, 716641, 715351, 713075, 710943, 708103, 703727, 698624, 693478, 687372, 679513, 670718, 661917, 652845, 643406, 634620, 627022, 619913, 613307, 608712, 606716, 605733, 604456, 603632, 603998, 604384]
57819F04384r26j865k094k771l668l425k529k821m058m149k885k262l021l929
57805E63981m635o118q031q602p632o753o445n547m028l331l554l038j266L70
57791D95371J197K156L572M413M294M135M480N093O177Q007R450R165Q031Q104
57777E73645R457J0458J0859J1760J2785J2228J0096Q172O903M981K259J51j132
57764F72622k990n574p333p915q787j0328j0928r804q314p654p369o808o030m864
57750E67924l047j568j785l028l247k140j316j358j199n78n11j002q64j60j57
57735E45964n69L65K532L559K494J170J093J568J793K237K878K615J497J284K636
57720E73116L868L519K162Q12m36j377j381q98j288k522l129k936l531n311o534
$$ y = [604384, 603458, 601593, 599499, 596728, 593060, 589635, 587106, 584285, 580227, 576078, 573193, 570931, 567910, 563981, 559346, 553228, 545197, 536595, 528963, 522210, 515765, 510218, 506190, 502859, 499305, 496267, 495001, 495371, 496568, 498724, 502296, 506709, 511003, 515138, 519618, 524711, 530888, 538895, 548345, 557510, 565541, 573645, 583102, 593560, 604419, 616179, 628964, 641192, 651288, 659460, 666363, 671344, 673603, 673754, 672622, 669632, 664058, 656725, 648810, 640023, 629695, 618767, 608963, 600649, 592995, 585626, 578818, 572788, 567924, 564877, 563309, 561524, 558496, 555249, 553109, 551793, 550435, 549236, 548658, 548147, 547145, 546281, 546121, 545964, 545395, 545760, 548292, 551851, 554345, 555515, 556608, 558176, 559969, 562206, 565084, 567699, 569196, 570480, 573116, 576984, 580503, 582665, 583477, 583041, 581664, 580283, 579385, 578097, 575575, 572446, 569510, 565979, 560668, 554134]
57705E54134o218n592n623n468m498l668l613l453k668k259k869l595l699l720
57691D97191l920l551k561k086k407k334j513j212j862j947m76J564L346N655
57677D83887Q965J2159J4633J7734K2623K8477L4184M0340M8126N7708O8655P9924
57665I17415Q7899Q6348P0602M1541N033l1172n9747p5904p9664p5363o7690n8890
57653G60408m9922m2018l5719l0033k4153j8867j5150j2636j0539q856p652o472
57641D98391n309m912n247n113l984k797k157j415k74M09K74K75Q60J106M92j29
57625D70470k69o72j539j729q27j34m88r21n97k72o25j005r98j384k235k144o28
57608D54003O03K91m10j78K22l08j054r28m50n22p53o67r64j913k158q79M05Q3
$$ y = [554134, 547916, 542324, 536701, 531233, 526735, 523067, 519454, 516001, 513333, 511074, 508205, 504610, 500911, 497191, 493271, 489720, 487159, 485073, 482666, 480332, 478819, 477607, 475745, 473798, 473322, 474886, 478232, 483887, 492852, 505011, 519644, 537378, 560001, 588478, 622662, 663002, 711128, 768836, 837491, 917415, 1005314, 1091662, 1162264, 1203805, 1208838, 1177666, 1117919, 1042015, 962351, 886988, 819298, 760408, 710486, 668468, 632749, 602716, 578563, 559696, 544546, 531910, 521371, 512515, 504863, 498391, 493082, 488170, 482923, 477810, 473826, 471029, 468872, 467457, 467183, 467592, 467866, 468141, 469001, 470107, 470599, 470470, 470201, 469529, 467990, 466261, 465434, 465300, 464812, 463891, 463294, 463022, 462397, 461392, 460394, 459010, 456775, 454631, 454003, 454606, 454897, 454487, 454309, 454531, 454223, 453169, 452241, 451791, 451269, 450516, 449849, 448885, 446972, 444814, 443935, 444340, 444423]
57590D44423j140j855k309l148l416k116m17q3q18j281j547k352k995k309r91
57575D17646o81j397j860j805j982k420k481k229k110j780p80K40M87M21P79J082
57559D01130P21N02J327K267J912Q40P16J532J795J121P00J276K351L363M204
57544D25757M680M639M435M276L695K599K027K589L059J924m22k469l680m309
57530D48800l971k280l27K80m11r05l72P86J989K855K968K462K297K844L060K157
57514D62232J111J050J329Q61L47J122K542K682J258j09m18k37k13k47j86m1M36
57497D73519J232J502O23o86j386j611j949k081j522r27j069j326p99j52n00j175
57481D61693n97J107K321K509K613L049L150K656K118J739J214O74N51O89P58
$$ y = [444423, 443283, 441428, 439119, 435971, 432555, 430439, 430022, 429939, 429121, 427840, 426293, 423941, 420946, 418637, 417646, 416965, 415568, 413708, 411903, 409921, 407501, 405020, 402791, 400681, 398901, 398121, 398361, 398848, 399269, 400048, 401130, 401851, 402353, 403680, 405947, 407859, 408699, 409415, 410947, 412742, 413863, 414563, 415839, 418190, 421553, 425757, 430437, 435076, 439511, 443787, 447482, 450081, 452108, 454697, 457756, 459680, 459258, 456789, 453109, 448800, 444829, 442549, 442222, 442502, 442091, 441186, 440814, 441600, 443589, 446444, 449412, 451874, 454171, 457015, 460075, 462232, 463343, 464393, 465722, 466583, 466930, 468052, 470594, 473276, 474534, 474425, 474007, 473770, 473557, 473310, 473124, 473083, 473519, 474751, 476253, 476876, 476190, 474804, 473193, 471244, 469163, 467641, 466714, 465645, 464319, 463520, 463368, 462868, 461693, 461096, 462203, 464524, 467033, 469646, 472695, 475845, 478501, 480619, 482358, 483572, 484246, 484797, 485486, 486244]
57466D86244J132K110K824K399J559J562K159K226J863K009K469K257J544J418
57452E13775J890J973J549J336J275P08N7M81J866K876K979K822K699K333K042
57437E40661K443L141L248K975L090L205K474J578J889K919K862J647J079J802
57423E75013K410K025J580J814K088J906J885K371K679K461K386K845L324L568
57409F08355M021M644M648L846L006K507J933J229J001J354J789K329L397M541
57395F48600M830M548M894N831O069N338M811M939M837M331M677O404Q237R051
57381G27397R264R423Q986P570O033N227M808M172L515L084K475J530R32J157
57367G95573J696K037K472L340M277M866N249N614N874O124O625P085O906O347
$$ y = [486244, 487376, 489486, 492310, 494709, 496268, 497830, 499989, 502215, 504078, 506087, 508556, 510813, 512357, 513775, 515665, 517638, 519187, 520523, 521798, 522506, 522563, 523044, 524910, 527786, 530765, 533587, 536286, 538619, 540661, 543104, 546245, 549493, 552468, 555558, 558763, 561237, 562815, 564704, 567623, 570485, 572132, 573211, 575013, 577423, 579448, 581028, 582842, 584930, 586836, 588721, 591092, 593771, 596232, 598618, 601463, 604787, 608355, 612376, 617020, 621668, 625514, 628520, 631027, 632960, 634189, 635190, 636544, 638333, 640662, 644059, 648600, 653430, 657978, 662872, 668703, 674772, 680110, 684921, 689860, 694697, 699028, 703705, 710109, 718346, 727397, 736661, 746084, 755070, 762640, 768673, 773900, 778708, 782880, 786395, 789479, 791954, 793484, 794416, 795573, 797269, 799306, 801778, 805118, 809395, 814261, 819510, 825124, 830998, 837122, 843747, 850832, 857738, 864085]
57353H64085O381P175P813P801P671P805P849P703P888Q527Q952Q813Q553Q421
57339I75437Q077P475P162P336P544P579P706P877P722P419P543P955Q001P698
57325A082531P632P723P459P241P986R346R919R468R307J0221J1508J2396J2917
57312A205654J3053J2508J1691J1528J2049J2501J2909J3927J5147J5420J5019
57301A351406J5457J6789J7274J6269J5338J5637J6282J6290J6232J6700J6970
57290A530644J6427J5869J6173J6991J7756J8694J9864K0536K0454K0400K0698
57279A734506K0567J9715J9149J9510K0121K0500K1244K2554K3515K3754K4139
57268A969274K4944K5090K4347K4304K5799K7228K7028K6108K6058K6522K6289
$$ y = [864085, 870466, 877641, 885454, 893255, 900926, 908731, 916580, 924283, 932171, 940698, 949650, 958463, 967016, 975437, 983514, 990989, 998151, 1005487, 1013031, 1020610, 1028316, 1036193, 1043915, 1051334, 1058877, 1066832, 1074833, 1082531, 1090163, 1097886, 1105345, 1112586, 1120572, 1129918, 1139837, 1149305, 1158612, 1168833, 1180341, 1192737, 1205654, 1218707, 1231215, 1242906, 1254434, 1266483, 1278984, 1291893, 1305820, 1320967, 1336387, 1351406, 1366863, 1383652, 1400926, 1417195, 1432533, 1448170, 1464452, 1480742, 1496974, 1513674, 1530644, 1547071, 1562940, 1579113, 1596104, 1613860, 1632554, 1652418, 1672954, 1693408, 1713808, 1734506, 1755073, 1774788, 1793937, 1813447, 1833568, 1854068, 1875312, 1897866, 1921381, 1945135, 1969274, 1994218, 2019308, 2043655, 2067959, 2093758, 2120986, 2148014, 2174122, 2200180, 2226702, 2252991]
57257B252991K5687K5851K6601K6992K7228K8118K9286K9660K9292K9266L0095
57246B561067L1508L3355L5487L7289L8323L9057L9936M0462M0124L9471L9227
57235B975306L9065L8375L7516L7133L6899L6068L4789L3792L3226L2779L2490
57224C367438L2594L2960L3374L3937L4655L5235L5784L6894L8560L9967M0815
57213C762213M1836M3356M4593M5048M5412M6244M6929M6924M6814M7121M7196
57202D263686M6362M5200M4575M4273M3684M2901M2224M1378M0234L9387L9217
57191D733121L9244L9225L9785M1080M2005M1763M1182M1402M2253M2986M3601
57180E187647M4399M5127M5574M6196M7265M8229M8645M8776M8639M7628M5784
$$ y = [2252991, 2278678, 2304529, 2331130, 2358122, 2385350, 2413468, 2442754, 2472414, 2501706, 2530972, 2561067, 2592575, 2625930, 2661417, 2698706, 2737029, 2776086, 2816022, 2856484, 2896608, 2936079, 2975306, 3014371, 3052746, 3090262, 3127395, 3164294, 3200362, 3235151, 3268943, 3302169, 3334948, 3367438, 3400032, 3432992, 3466366, 3500303, 3534958, 3570193, 3605977, 3642871, 3681431, 3721398, 3762213, 3804049, 3847405, 3891998, 3937046, 3982458, 4028702, 4075631, 4122555, 4169369, 4216490, 4263686, 4310048, 4355248, 4399823, 4444096, 4487780, 4530681, 4572905, 4614283, 4654517, 4693904, 4733121, 4772365, 4811590, 4851375, 4892455, 4934460, 4976223, 5017405, 5058807, 5101060, 5144046, 5187647, 5232046, 5277173, 5322747, 5368943, 5416208, 5464437, 5513082, 5561858, 5610497, 5658125, 5703909]
57169E703909M4171M3185M1919M0050L8802L9018L9685L9600L9101L8945L8883
57158F147268L8601L8821M0188M2133M3990M6058M8527N0638N1967N3181N4398
57147F655770N4241N1743M7812M3608L8823L2794K6004J9331J3144Q116N426N189
57135G002001O233Q361J2859J9665K6228L0625L3854L7473M0923M2842M3131M2089
57123G346284L9346L5383L2379L1967L3900L8199M6411N9115P4300Q9840J05535
57112G932659J21351J36341J51209J69488J94261K25948K64655L11669L67020
57103I874601M29035M98741N81934O85368Q14586R77374J184958J447231J770588
57094A8264416K161822K627934L169012L777241M446023N172548N946909O745782
$$ y = [5703909, 5748080, 5791265, 5833184, 5873234, 5912036, 5951054, 5990739, 6030339, 6069440, 6108385, 6147268, 6185869, 6224690, 6264878, 6307011, 6351001, 6397059, 6445586, 6496224, 6548191, 6601372, 6655770, 6710011, 6761754, 6809566, 6853174, 6891997, 6924791, 6950795, 6970126, 6983270, 6991386, 6996812, 7002001, 7008234, 7016595, 7029454, 7049119, 7075347, 7105972, 7139826, 7177299, 7218222, 7261064, 7304195, 7346284, 7385630, 7421013, 7453392, 7485359, 7519259, 7557458, 7603869, 7662984, 7737284, 7827124, 7932659, 8054010, 8190351, 8341560, 8511048, 8705309, 8931257, 9195912, 9507581, 9874601, 10303636, 10802377, 11384311, 12069679, 12884265, 13861639, 15046597, 16493828, 18264416, 20426238, 23054172, 26223184, 30000425, 34446448, 39618996, 45565905, 52311687]
57086E2311687P537970Q277867Q877829R199704R100716Q498324P390514N830545
57078A17025156L909590J762600m43726k555751m464099o088754p354559q203744
57070I3586713q630183q687531q462549q044232p507259o904339o265545n608911
57062C3476164m953487m320359l725288l177603k685415k255499j888043j576997
57054H893473j316043j100365r23490p77565o57221n59538m80327m14175l57928
57045B306821l10672k70495k34643k02600j75586j53219j33669j16650j03066
57036F06221r1943q0964o9964o0901n4289m8510m2625l7081l1573k4929j7285
57025D6157r880k586O160J7168L0774M8691P1807R4772J05693R3845N8026P819
$$ y = [52311687, 59849657, 68127524, 77005353, 86205057, 95305773, 103804097, 111194611, 117025156, 120934746, 122697346, 122253620, 119697869, 115233770, 109145016, 101790457, 93586713, 84956530, 76268999, 67806450, 59762218, 52254959, 45350620, 39085075, 33476164, 28522677, 24202318, 20477030, 17299427, 14614012, 12358513, 10470470, 8893473, 7577430, 6477065, 5553575, 4776010, 4118789, 3559251, 3078924, 2664749, 2306821, 1996149, 1725654, 1491011, 1288411, 1112825, 959606, 825937, 709287, 606221, 514278, 433314, 363350, 302449, 248160, 199650, 157025, 119944, 88371, 63442, 46157, 36277, 33691, 39851, 57019, 87793, 136484, 208291, 303063, 408756, 502601, 560627, 568446]
57013E68446m1917p8468r6501r8657r1419q0255A2952d4474m8731m1647l5094
57002a69946k9057k4108j9860j5390j0840p070m109j389Q53J993K492L459M948
56989b68024O167P163Q821J1376J4325J7692K1838K5916K7575K4566J6154L669
56977h2762r539j9390k3779k3844k1973j9290j5929j2506r731p268m484j789J27
56964b52157J780M142P045R741J2627J6864K2660K9120L5135L8897c6829h766
56951C709a112j9302k8655l2483l1623k7844k2876j7514j2233p997n324l155l8
56938b10156L929P545J0528J3843J8292K3971L0878L8801a5897C5569N0844M1888
56926A28301K3917M64k1416l5810m1811A1499b7923l5031l0204k5946k2120j8319
$$ y = [568446, 526529, 448061, 351560, 252903, 161484, 81229, 12952, -44474, -93205, -134852, -169946, -199003, -223111, -242971, -258361, -269201, -276271, -280380, -281769, -280916, -278923, -276431, -272972, -268024, -261857, -254694, -245873, -234497, -220172, -202480, -180642, -154726, -127151, -102585, -86431, -82762, -92301, -111691, -135470, -159314, -181287, -200577, -216506, -229012, -238743, -246011, -250495, -252284, -252157, -250377, -246235, -239190, -229449, -216822, -199958, -177298, -148178, -113043, -74146, -36829, -8766, 3709, -1112, -20414, -49069, -81552, -113175, -141019, -163895, -181409, -193642, -201639, -206963, -210118, -210156, -206227, -198682, -188154, -174311, -156019, -132048, -101170, -62369, -15897, 35569, 86413, 128301, 152218, 152682, 131266, 95456, 53645, 11499, -27923, -62954, -93158, -119104, -141224, -159543]
56914a59543j5224j3618j2685j0958q429o186m505k993k085k498l454l317j817
56901b47312j15J173K352L280L347K937L254M599O122P387Q906J1155J4223J8265
56887a60427K3085K7485L0229L1281a7578I745J9342P840l502j1510F383a0146
56874b5790j3783j1379q193m199l35K560N160Q667J2883J6706B523K4837L1204
56861E8564L8775M7081N5897O3507O5970N9041M1057J4738j3180l5062m6821m9655
56849B99912m7240m2197l5801k9245k3090j6340q093M80P590J3673K0803K9731
56837A70183L9545N0012O2203P6543R1632J04482J10034J01423P4140L1417j5956
56826H95658n6146q2308r3592r3108q5717p5666o4875n3643m2698l3233k5137
$$ y = [-159543, -174767, -188385, -201070, -212028, -220457, -226643, -231148, -234141, -236226, -238724, -242178, -245495, -247312, -247427, -246254, -243902, -240622, -237275, -234338, -231084, -226485, -220363, -212976, -204070, -192915, -178692, -160427, -137342, -109857, -79628, -48347, -17578, 9745, 29087, 36927, 33425, 21915, 6383, -10146, -25790, -39573, -50952, -59145, -63344, -63679, -61119, -55959, -47292, -34409, -17703, 2523, 27360, 58564, 97339, 144420, 200317, 263824, 329794, 388835, 429892, 444630, 431450, 396388, 349567, 299912, 252672, 210475, 174674, 145429, 122339, 105999, 97906, 98386, 105976, 119649, 140452, 170183, 209728, 259740, 321943, 398486, 490118, 594600, 704634, 806057, 880197, 911614, 895658, 839512, 757204, 663612, 570504, 484787, 409121, 344246, 290603, 247905, 214672, 189535]
56815A89535j7002q198M87Q524J6571K5579L6117M8625O2687P5466Q1908P7164
56803E97463N8954K8860p113m0063o2657p3023p3859o8603n9756m9778m0912l3599
56791A75914k6793k0000j3748q204k873K346P281J2402J8254K4375L0120L5697
56779B34771M0483M1118L3843J8701l87j9198l4726m4280m6443m3316l8992l5206
56767A06368l0835k5598k1247A0154e812j2672r931q719q059p006o138n907n479
56754f9723m362l368k897k082o50K31o0n00k75L2nK31Q11O89k41m89N50J333O60
56735h0115l95m39P0P0j60J55P44R61J007J276J525J572J847K405K542K128K070
56718f2737K676K964K350J685J758K089J982J542R77J80l81J53J431J985J471
$$ y = [189535, 172533, 164335, 164822, 173346, 189917, 215496, 251613, 300238, 362925, 438391, 520299, 597463, 656417, 685277, 678164, 638101, 575444, 502421, 428562, 359959, 300203, 250425, 209513, 175914, 149121, 129121, 115373, 107169, 104296, 106642, 113923, 126325, 144579, 168954, 199074, 234771, 275254, 316372, 350215, 368916, 368529, 349331, 314605, 270325, 223882, 180566, 141574, 106368, 75533, 49935, 28688, 10154, -5812, -18484, -28415, -37134, -45193, -52199, -58337, -64244, -69723, -74085, -77453, -80350, -82432, -83082, -82851, -82911, -83411, -83686, -83654, -83659, -83428, -82617, -81928, -82169, -82658, -82108, -80775, -80115, -80510, -80949, -80879, -80809, -80969, -80814, -80070, -79109, -78102, -76826, -75301, -73729, -71882, -69477, -66935, -64807, -62737, -60061, -57097, -54747, -53062, -51304, -49215, -47233, -45691, -44714, -44534, -44915, -44762, -43331, -41346, -39875]
56703c9875J142J483J337J59q16o50q2J98P51J725J930Q92N0N23J315J175O11
56686b8132N90P85N94N08R89J330R78P06J131J459J007O41J277K243K532K408
56670h954K459K331J698a178D19J878J491J138J413J572J010M69N55N30l6L9J614
56653A2092L440L939L507L324L173K197P76r0l96o76q08o04o20j142j420j071
56637B5621j000j740k246j692r44q75q08k77n44k444m196l669j617l81l70j76
56621B642N98R13M28m6r7o5K4M32Q55P37J59m86j069j251l65J202J780O57o40
56602F408n90J57K39j13O8N35M73J69L96R98J490K103K843K754J537O04R29J300
56584B2300M91l31M64K041K355J387P22P59O39L45O54J346J476J111J043J251
$$ y = [-39875, -38733, -37250, -35913, -35754, -36570, -37220, -37302, -37104, -36353, -34628, -32698, -31806, -31756, -31233, -29918, -28743, -28132, -27542, -26757, -26163, -25655, -24666, -23336, -22358, -21652, -20521, -19062, -18055, -17414, -16137, -13894, -11362, -8954, -6495, -4164, -2466, -1178, 419, 2297, 3788, 4926, 6339, 7911, 8921, 9390, 9945, 10475, 10439, 10478, 12092, 15532, 19471, 22978, 26302, 29475, 31672, 32448, 32358, 31962, 31286, 30478, 29874, 29254, 28112, 26692, 25621, 24621, 22881, 20635, 18943, 17999, 17124, 16316, 16039, 15495, 13051, 8855, 5186, 3569, 3188, 2818, 2642, 3240, 4153, 4581, 4535, 4438, 4373, 4397, 4829, 5684, 6421, 6580, 6094, 5025, 3774, 3409, 4611, 6391, 7048, 6408, 5818, 5975, 6214, 6101, 6169, 6704, 7177, 7346, 7742, 8740, 10230, 12333, 15176, 17930, 19467, 20071, 21000, 22300, 22791, 22460, 22924, 24965, 27320, 28707, 29429, 30188, 30827, 31172, 31826, 33172, 34648, 35759, 36802, 38053]
56568C8053J319J769L312N338O797P881R319J0907J2341J4410J7294J8740J6204
56555A63684J0308M088n17l472m731m003k281j431k079l340m406m991m790l950
56541A38089l541m112m568l914l039l173l677l257k351k213k645k638k403k653
56527I3905k784j932r21r48j232l72Q96P31o88j643j771k037k350j833j038j303
56511G4680k221k186j218q00j215j442j446k074k911k554j053J96P84J319J519
56496E9378N68r02j473j254j304j274j56J205J064m9jJ314J892J158O60J020J093
56479F2939N36N25J344J755J319J027J244J264J095J436J758P79r09j156M39J923
56463G7318J993J327O57j22o35j32P95Q04J80L08Q82K56j302j633l01O77K84l6
$$ y = [38053, 39372, 41141, 44453, 49791, 56588, 64469, 73788, 84695, 97036, 111446, 128740, 147480, 163684, 173992, 178080, 177563, 174091, 169360, 165357, 163076, 161645, 159566, 156226, 151820, 146829, 142039, 138089, 134548, 130436, 125868, 121954, 118915, 115742, 112065, 108808, 106457, 104244, 101599, 98961, 96558, 93905, 91121, 89189, 88268, 87320, 86088, 85716, 86612, 87343, 86655, 85012, 83241, 81204, 78854, 77021, 75983, 74680, 72459, 70273, 69055, 68255, 67040, 65598, 64152, 62078, 59167, 56613, 55560, 55756, 56540, 57859, 59378, 59946, 59044, 57571, 56317, 55013, 53739, 53583, 54788, 55852, 55803, 55802, 57116, 59008, 60166, 60826, 61846, 62939, 63475, 64000, 65344, 67099, 68418, 69445, 70689, 71953, 73048, 74484, 76242, 77021, 76112, 74956, 75395, 77318, 79311, 80638, 81295, 81173, 80538, 80406, 81201, 82005, 82185, 82493, 83375, 83631, 82329, 80696, 80395, 81072, 81356, 81320]
56445H1320P86J729J689R87J07r60j578q29N58P97j11m07L59P69L63L47J043J232
56427H8201O43M82R27O42n16r33n8P14O67P51J299J319P58R32J901K061J055M97
56409A01342J016J231N54L17J126J664J168O10N12O3p13n37N48P99p1j57J208
56392A10680K134J501P73J151J588J148P66J155J338O73J73M96Q26Q48J446K442
56376A29138K177N01m86J63Q07L91J93R65J283L95r7P93J515R07L95J258K195
56359A42493J722O98M01K89l37n26M05J159O34j18J27O94O82P15J329J497N94
56342A52458m5P50K066K672K868L134K893K072J929K853L384K762K322K958L452
56327A88528K879K391K995L719L578L190K921J738n20k045j841j344j777k251
$$ y = [81320, 82106, 83835, 85524, 86511, 86618, 85658, 84080, 83251, 83809, 84606, 84495, 84088, 84447, 85216, 85579, 85926, 86969, 88201, 88844, 89326, 90253, 90895, 90379, 89446, 89388, 90102, 90769, 91520, 92819, 94138, 94896, 95828, 97729, 99790, 100845, 101342, 102358, 103589, 104143, 104460, 105586, 107250, 108418, 109028, 109540, 109603, 108890, 108353, 108901, 109700, 109629, 109472, 110680, 112814, 114315, 115088, 116239, 117827, 118975, 119741, 120896, 122234, 122907, 123080, 123576, 124402, 125250, 126696, 129138, 131315, 131816, 131330, 131493, 132300, 132691, 132884, 133849, 135132, 135527, 135430, 136223, 137738, 138645, 139040, 140298, 142493, 144215, 144913, 145314, 145603, 145266, 144740, 145145, 146304, 146938, 146820, 146947, 147641, 148323, 149038, 150367, 151864, 152458, 152413, 153163, 155229, 157901, 160769, 163903, 166796, 168868, 170797, 173650, 177034, 179796, 182118, 185076, 188528, 191407, 193798, 196793, 200512, 204090, 207280, 210201, 211939, 211419, 209374, 207533, 206189, 204412, 202161]
56313B02161j997j914k304j746P1J095L74J5J610L475L654L088L474M405M852
56298B20313N197N534M475J793j23L11J424J452J429K636L825L682L566M986O573
56283B67073O316M819L726K990K076J839K751L328K637K249L445M761M639M159
56269C16808M741N559N643O119P818R208R195R462J1439J3593J4470J5568J8316
56256D47939K1005K1938K2953K6372L0903L4066L6392L9731M3589M6603M9684
56245H21175N4182N8754O1281O2185O2728O2019N8780N4111M9446M3740L5692
56234A424093K6611J8062Q944j873j2381k0150k5976l1666l6547l9479m1836m4966
56222A222836m7176m6757m5417m5152m4415m1293l7754l6581l6575l5170l3261
$$ y = [202161, 200164, 198250, 195946, 194200, 194271, 195366, 195740, 195755, 197365, 200840, 204494, 207582, 211056, 215461, 220313, 225510, 231044, 235519, 237312, 237189, 237500, 238924, 240376, 241805, 244441, 248266, 251948, 255514, 260500, 267073, 273389, 278208, 281934, 284924, 287000, 288839, 291590, 294918, 297555, 299804, 303249, 308010, 312649, 316808, 321549, 327108, 332751, 338870, 346688, 355896, 365091, 374553, 385992, 399585, 414055, 429623, 447939, 468944, 490882, 513835, 540207, 571110, 605176, 641568, 681299, 724888, 771491, 821175, 875357, 934111, 995392, 1057577, 1120305, 1182324, 1241104, 1295215, 1344661, 1388401, 1424093, 1450704, 1468766, 1477710, 1475837, 1463456, 1443306, 1417330, 1385664, 1349117, 1309638, 1267802, 1222836, 1175660, 1128903, 1083486, 1038334, 993919, 952626, 914872, 878291, 841716, 806546, 773285]
56211G73285l2986l2977l0610k6970k4950k4174k2333j9792j8369j7259j4693
56200E08172j1932j1138j1003r029o378n803o472n593l598k929l113j930j36j66
56186D28952j394j371n65j155k375j859l41k88j057k66J282J011k42M83K818L788
56170D27421L148L152L907L740L352M757O951P328O489O980Q334Q175P118P747
56156E08599R671J0533J0770J2503J4966J5997J6792J9916K4020K5920K6653K9873
56144G26213L5345L9808M3293M8741N6205O3247P0581Q1609R6659J12893J28972
56133A503566J44326J54889J55464J45929J30035J09745Q6496O6207N5623N3981
56123B606261N4303N2088M6692L6010J7771m043k1390l1301l6772l9578l9600
$$ y = [773285, 740299, 707322, 676712, 649742, 624792, 600618, 578285, 558493, 540124, 522865, 508172, 496240, 485102, 474099, 465070, 458692, 452889, 446417, 440824, 437226, 434297, 431184, 429254, 429118, 428952, 427558, 426187, 425622, 424467, 422092, 420233, 419892, 419604, 418547, 418281, 419563, 420574, 420332, 420815, 423633, 427421, 430569, 433721, 437628, 441368, 444720, 449477, 456428, 463756, 470245, 477225, 485559, 493734, 500852, 508599, 518270, 528803, 539573, 552076, 567042, 583039, 599831, 619747, 643767, 669687, 696340, 726213, 761558, 801366, 844659, 893400, 949605, 1012852, 1083433, 1165042, 1261701, 1374594, 1503566, 1647892, 1802781, 1958245, 2104174, 2234209, 2343954, 2430450, 2496657, 2552280, 2606261, 2660564, 2712652, 2759344, 2795354, 2813125, 2809082, 2787692, 2756391, 2719619, 2680041, 2640441]
56112B640441m0861n0199o8643r0492j11203j29735j43264j47249j41916j32235
56102A584644j20773j06494r0565p6636o5155n3781m3260l6338l1501k4868j7630
56091I17643j4104j3152r611l815j154k151j753J090K073O25J408N324P640O699
56077H96762O305P925Q546P783R009J2064J2767J0948J0925J3026J2894J0122
56065A019076Q958R570P543L109J737M239N475M194M791P969R209P970Q797J1936
56051A114573J2580J0780J1975J6292J7816J5862J6128J9209J9417J6674J7742
56040A289048K3289K5982K3951K3922K7999K9996K8254K9274L4728L7573L5284
56029A609300L4363L7382L8342L5332L4898L9123M1211L8751L8366M2485M4749
$$ y = [2640441, 2599580, 2549381, 2480738, 2390246, 2279043, 2149308, 2006044, 1858795, 1716879, 1584644, 1463871, 1357377, 1266812, 1190176, 1125021, 1071240, 1027980, 991642, 960141, 935273, 917643, 903539, 890387, 880776, 876961, 875807, 873656, 871903, 872993, 875066, 875691, 877099, 882423, 890063, 896762, 903067, 910992, 919538, 927321, 936330, 948394, 961161, 972109, 983034, 996060, 1008954, 1019076, 1028034, 1037604, 1045147, 1048256, 1049993, 1054232, 1059707, 1063901, 1068692, 1076661, 1085870, 1093840, 1102637, 1114573, 1127153, 1137933, 1149908, 1166200, 1184016, 1199878, 1216006, 1235215, 1254632, 1271306, 1289048, 1312337, 1338319, 1362270, 1386192, 1414191, 1444187, 1472441, 1501715, 1536443, 1574016, 1609300, 1643663, 1681045, 1719387, 1754719, 1789617, 1828740, 1869951, 1908702, 1947068, 1989553, 2034302]
56018B034302M3294M4889N1042N4039N1960N3125O0269O5220O4794O6630P3357
56007B662921P6952P5123P6968Q5586R1777R2008R5412J05491J12730J13496J17936
55996C706400J30428J40752J43901J49638J62878J74071J79000J88055K05542
55987E180665K20498K28785K42526K66452K87687L00968L20128L51715L82249
55978G781673M05484M36127M81622N27721N68126O19775O91442P67425Q41057
55969A3120452R32313J051980J182623J317602J483023J696790J945079K227255
55961B4957117K583399L047573L618769M312071N188605O292993P611863R142393
55953F6754783J0953979J3140434J5783249J9037158K3193338K8538570L5044704
$$ y = [2034302, 2077596, 2122485, 2173527, 2227566, 2279526, 2332651, 2392920, 2458140, 2522934, 2589564, 2662921, 2739873, 2814996, 2891964, 2977550, 3069327, 3161335, 3256747, 3362238, 3474968, 3588464, 3706400, 3836828, 3977580, 4121481, 4271119, 4433997, 4608068, 4787068, 4975123, 5180665, 5401163, 5629948, 5872474, 6138926, 6426613, 6727581, 7047709, 7399424, 7781673, 8187157, 8623284, 9104906, 9632627, 10200753, 10820528, 11511970, 12279395, 13120452, 14052765, 15104745, 16287368, 17604970, 19087993, 20784783, 22729862, 24957117, 27540516, 30588089, 34206858, 38518929, 43707534, 50000527, 57612390, 66754783, 77708762, 90849196, 106632445, 125669603, 148862941, 177401511, 212446215]
55946B12446215M1966010M7395119M8223598M1296089K5672379M235789j7281956
55939D03953243l3490082m2069495m3948081m1519299l6977306l1799336k6863962
55932A47285682k2559115j8899014j5775358j3136291j0947378r122889p583002
55925D9262635o309564n288499m457459l756959l178362k719655k342991k013907
55917A9195239j738094j523833j347062j184867j046659r42270q52807p60839
55909I798808o78148o17259n64575n06329m53611m17810l86821l48383l12975
55900E512897k91729k74236k49155k25545k13448k03602j85881j68850j62094
55891C538357j57201j44439j31170j26122j21893j10145r8512r5614r4139q5058
$$ y = [212446215, 254412225, 301807344, 350030942, 391327031, 416999410, 421235199, 403953243, 370463161, 328393666, 284445585, 242926286, 205948980, 174149644, 147285682, 124726567, 105827553, 90052195, 76915904, 65968526, 56845637, 49262635, 42953071, 37664572, 33207113, 29450154, 26271792, 23552137, 21209146, 19195239, 17457145, 15933312, 14586250, 13401383, 12354724, 11412454, 10559647, 9798808, 9120660, 8503401, 7938826, 7432497, 6978886, 6561076, 6174255, 5825872, 5512897, 5221168, 4946932, 4697777, 4472232, 4258784, 4055182, 3869301, 3700451, 3538357, 3381156, 3236717, 3105547, 2979425, 2857532, 2747387, 2648875, 2553261, 2459122, 2374064]
55881B374064p4455p0498o7281n7064m5665m0805l7625l0326k6102l2902m4506
55870A846835n1483n6080o3038o6867o1934n4929n3923n4663n0342m5194m5576
55859A242806m7009m2922l7449l6921l7084l1257k3286k0085j8955j4287r703
55848I23848j1534j6567j7904j6905j8566k0863j9368j6753j7553j8933j6374
55837G32528j2946j3512j5324j3750j1532j3064j5127j2667q405p489p880n139
55825E95693j572j585k990j783n52l297o813o085l524m045n641l620K25J419J477
55810E57307M216P579P681O883R294J2225J0592O127L694K194k300p780r486q857
55796E99369j0831j4815j6473j6126j7331j9339j8618j5877j4366j3251r604m776
$$ y = [2374064, 2299609, 2229111, 2161830, 2104766, 2059101, 2018296, 1980671, 1950345, 1924243, 1891341, 1846835, 1795352, 1739272, 1676234, 1609367, 1547433, 1492504, 1438581, 1383918, 1333576, 1288382, 1242806, 1195797, 1152875, 1115426, 1078505, 1041421, 1010164, 986878, 966793, 947838, 933551, 923848, 912314, 895747, 877843, 860938, 842372, 821509, 802141, 785388, 767835, 748902, 732528, 719582, 706070, 690746, 676996, 665464, 652400, 637273, 624606, 616201, 608712, 600832, 595693, 594121, 592536, 589546, 587763, 587211, 583914, 577101, 571016, 567492, 563447, 557806, 554186, 554411, 555830, 557307, 561523, 569102, 576783, 583666, 592960, 605185, 615777, 621904, 625598, 627792, 625492, 617712, 608226, 599369, 588538, 573723, 557250, 541124, 523793, 504454, 485836, 469959, 455593, 442342, 432738, 427962]
55784D27962k133q40J516K863jm654o439n961o602p425n534k769k834m248l236
55769C79665j270k538o071p521o866p357q618p790n873o153p793p492n854n753
55755B92716o223m478k110k672m868m888l624m680o939o301l459k719m095l714
55741B31946j370n81j584j164P86J088l85n74O41L46j382j447K54O37o98j043
55725B25470r7l11j809k293j933k979m692m125j726q02j565j203L41K05j696k362
55709A98423j265q77j531r78P63J273O25J238K812K553N74j79M68k55k378k771
55693A98495r52Rq58j092J04M60o55r66J93Q04M87J382L725N024M538M252M602
55676B19552L654J456O94J921K451J131J18P33J521J574K023L113L395K811L134
$$ y = [427962, 425829, 424989, 426505, 429368, 429367, 424713, 418274, 412313, 405711, 398286, 392752, 389983, 387149, 382901, 379665, 378395, 375857, 369786, 362265, 355399, 348042, 339424, 331634, 325761, 319608, 311815, 304323, 298469, 292716, 286493, 282015, 279905, 277233, 272365, 267477, 263853, 259173, 252234, 245933, 242474, 239755, 235660, 231946, 230576, 229995, 228411, 227247, 228033, 229121, 228736, 228162, 228803, 229149, 227767, 226320, 226574, 227211, 226513, 225470, 225373, 225062, 223253, 220960, 219027, 216048, 211356, 207231, 205505, 204703, 203138, 201935, 202276, 202481, 200785, 198423, 197158, 196281, 194750, 193772, 194535, 195808, 196433, 197671, 200483, 203036, 203610, 203431, 203899, 203644, 201266, 198495, 197543, 197552, 196694, 195602, 195706, 196166, 195511, 194545, 194738, 195542, 196029, 197411, 201136, 206160, 210698, 214950, 219552, 223206, 224662, 225356, 227277, 229728, 230859, 230977, 231710, 233231, 234805, 236828, 239941, 243336, 246147, 249281]
55661B49281M647N641N656N786N667L814R96n53j225l272o149p059o218o816r305
55646B40891j0610r696r006r427q688o091m146l982l579k123j751l230m106k993
55632A61463j766j726j429j25M07o41j339n70K6n91q99J8O17j61j079j251j556
55615A49398k078j416K12N14r45j681o01J59p63j693j329j062j877k277j284m91
55599A32786j098j741j223p06j227j705j213p73j194j536j213j135j467q72O74
55584A16357J163O8l98R57K150J465K57L78J349J993K498L110K952J881J378K161
55568A39719K985L044L205L740L335J673M64N07L48r01j925j846j770k337k367
55553A47874j436j064j877k228j208k56k10L68K118L065J863K04q0K35k9j35N28
$$ y = [249281, 253928, 259569, 265225, 271011, 276678, 280492, 281488, 280935, 279710, 276438, 270289, 263230, 257012, 250196, 240891, 230281, 220585, 211579, 202152, 193464, 187373, 183227, 179245, 175666, 173543, 171792, 168562, 164456, 161463, 159697, 157971, 156542, 156417, 156824, 156183, 154844, 154274, 154300, 153709, 152810, 152828, 153445, 153284, 152205, 150954, 149398, 147320, 145904, 146116, 146630, 145685, 144004, 143403, 143562, 142799, 141106, 139777, 138715, 136838, 134561, 133277, 132786, 131688, 129947, 128724, 128018, 126791, 125086, 123873, 123100, 121906, 120370, 119157, 118022, 116555, 115683, 116357, 117520, 117588, 117190, 118147, 120297, 121762, 122019, 122397, 123746, 125739, 128237, 131347, 134299, 136180, 137558, 139719, 142704, 145748, 148953, 152693, 156028, 157701, 158165, 158672, 159020, 158119, 156194, 154348, 152578, 150241, 147874, 146438, 145374, 143497, 141269, 140061, 139805, 139595, 139963, 142081, 145146, 147009, 147213, 147133, 147368, 147339, 147204, 147732]
55536A47732N20j136k755k562j485j246j636j770k086l019l510k820k067k192
55522A19968k266j600j423k567l535k867j522r42o79R9O19J23l29K83R12L24o15
55505A03983m79L84Q93J087J233P05n75j209m79K29k46q51l50M68M01n7k3N0l54
55486A04810m83J29M57n3k43M67O31o07j673j234n58r80j230K36K160K358J129
55469A05316K16j89q76j399r19j91l92j016r85o98r23r73n6Q32N40QO35J638J373
55450A01941J93l42j35k12n49m51k27m86n91K06R87O02j85K3P79P27J04J15N65
55431A03064L35m04n70k51l90q51o89J3L73L52N62Q75P22L01J80K70L97J008K113
55412A07410K604J953J310J505J360k12j922j991r95o86j039q26j48n6l20P6P38
$$ y = [147732, 148252, 147116, 144361, 141799, 140314, 139068, 137432, 135662, 133576, 130557, 127047, 124227, 122160, 119968, 117702, 116102, 114679, 112112, 108577, 105710, 104188, 103246, 102567, 102666, 103285, 103408, 103079, 103362, 104274, 104598, 103983, 103504, 103888, 104781, 105868, 107101, 107806, 107231, 106022, 105543, 105772, 105526, 104675, 104325, 104793, 105194, 105137, 105114, 105164, 104810, 104327, 104456, 104913, 104860, 104617, 105084, 105715, 105108, 103435, 102201, 101643, 100663, 99433, 99669, 101829, 104187, 105316, 105532, 105343, 104467, 103068, 102149, 101958, 101566, 100550, 99565, 98867, 97944, 96971, 96915, 97747, 98287, 98295, 98930, 100568, 101941, 102134, 101792, 101657, 101445, 100896, 100445, 100218, 99732, 99141, 99347, 100334, 100936, 100751, 100774, 101553, 102280, 102384, 102499, 103064, 103399, 102995, 102425, 102174, 101784, 100933, 100244, 100257, 100630, 100982, 101544, 102419, 103141, 103442, 103622, 103892, 104289, 105297, 107410, 110014, 111967, 113277, 114782, 116142, 115930, 114008, 112017, 111022, 110336, 109297, 108471, 108323, 108267, 107947, 108023, 108761]
55395A08761M23o11r53m41j74m25m75l35p86j687j972j282k64N99J243J443J187
55378A04251J112J468J316J3j389j574r30n91m99m0L36r7p05m26L25M35J52N32
55360A03689J399J649J148P23N57J66m62r83j474j930j688n99J41l59j148r40
55344I9889j12K97M40R09J205P23K17M62O57p1p54j78Q01P01M6K25Q47O18l4K09
55324A07097Q66M04q79j363r74r39j102k15J281J489J66r01q47n93o38l12L53
55307A02893L49l20l80M87J061O80J58J91M58N86O06L07m32p68J05J331J435O73
55289A09420N18J063J036K20k43o3k28r66j281q27m39m58k97J23J55j43l3L35
55271A07892N5o98p39O4N24J40l28m32m78l18N25J423J133q8o74j75K64J23J94
$$ y = [108761, 109184, 108573, 107620, 107179, 107005, 106580, 106105, 105770, 104984, 103297, 101325, 100043, 99779, 100378, 101621, 103064, 104251, 105363, 106831, 108147, 108160, 106771, 105197, 104267, 103676, 103177, 103137, 103473, 103376, 102671, 102245, 102570, 103005, 103157, 103689, 105088, 106737, 107885, 108608, 109165, 109331, 108869, 107886, 106412, 104482, 102794, 102195, 102336, 101977, 100829, 99889, 99777, 100074, 100514, 101423, 102628, 103351, 103568, 104030, 104687, 104616, 103862, 103684, 104485, 105186, 105232, 105457, 106304, 106922, 106888, 107097, 107963, 108367, 107488, 106125, 105151, 104212, 103110, 102895, 104176, 105665, 105831, 104930, 104083, 103490, 102852, 102540, 102893, 103242, 102922, 102542, 103029, 104090, 104770, 104928, 105119, 105577, 106163, 106769, 107076, 106644, 105876, 105981, 107312, 108747, 109420, 109938, 111001, 112037, 112257, 112014, 111951, 111723, 110757, 109476, 108649, 108210, 107752, 107455, 107578, 107733, 107590, 107557, 107892, 107947, 107249, 106510, 106574, 107098, 107238, 106910, 106478, 106000, 105682, 106207, 107630, 108763, 108675, 108001, 107826, 108090, 108213, 108407]
55252A08407P58R21L00l21m25l12N7J070K083J789L56n27j46L94K19j74l09n29
55234A13611q67p35k41l26j043j302q09n75j023j193n28J43J71J48O55J220J281
55217A08587J067Q52M89J09K35P50R23O41N45O58K40p20j219p90j04K55M00L22
55199A13240k05p26m38L84O62K78J64N18N33O8j11K3l98j315j522p35j43k69j45
55180A09863P42J372J004N18Q74J560J612J102O63L63p9o06r75j070q23l50j35
55163A15635l78m03L39J149J071M97L78M18k29r74m97Q21J269N49q5k97r27j640
55145A16696r15J067K017R10n60q07l98k69p2M54L96o47j476j141l84j28k4M35
55127A15154P94O46M90O36N63Q0k37l45r05j629j226L03J229P68K43O93J305J260
$$ y = [108407, 109165, 110086, 110386, 110065, 109640, 109328, 109385, 110455, 112538, 114327, 114683, 114156, 114010, 114404, 114623, 114449, 114140, 113611, 112744, 112009, 111768, 111442, 110399, 109097, 108288, 107713, 106690, 105497, 104969, 105112, 105283, 105431, 106086, 107306, 108587, 109654, 110506, 110995, 111104, 111339, 112089, 113012, 113653, 114198, 114856, 115096, 114376, 113157, 112367, 112263, 112518, 112918, 113240, 113035, 112309, 111871, 112255, 112917, 113195, 113359, 113877, 114410, 114478, 114367, 114390, 113992, 112677, 111155, 110420, 110277, 110008, 109863, 110605, 111977, 112981, 113499, 114373, 115933, 117545, 118647, 119310, 119673, 119594, 118988, 118013, 116943, 116120, 115770, 115635, 115257, 114854, 115193, 116342, 117413, 117910, 118288, 118706, 118477, 117503, 117006, 117827, 119096, 119645, 119560, 119263, 118336, 116696, 115781, 116848, 118865, 119775, 119215, 118408, 118010, 117741, 117669, 118123, 118519, 117872, 116396, 115255, 114871, 114743, 114719, 115154, 115948, 116594, 117084, 117720, 118283, 118363, 118126, 117781, 116876, 115247, 114021, 114324, 115553, 116321, 116564, 117257, 118562, 119822]
55109A19822J172J473J302L28k29K81O51L0m46K03Q96M54k96j57K41j39o70k73
55091A24643M75M04j73k48Pj26l40r3O2n10j012m62N00O10j7m28n10n68j55J011
55071A23070J837J223l8m29l7q2o68p75j28N44Q37Q90O17n6n43l52j3j98m95k19
55051A24985K33J04l18l02n7j82l42J64R65J124O48K59J25J9K20R56J390O32o57
55032A29966r54j6R50J095P15L22Kk86n51q58j044o64L03J158J442J494J530J095
55014A35699J45l78M0L90l40j540j969j506p56K60J650K663K550J843J492J393
54998A41636R63N29P19J070O84j56m82l09m04p48o27n8J97q2m14o06q31r44o82
54979A39455k93l8M88J580K411J978O17n03j030j426j693j304k23R82J857K111
$$ y = [119822, 120994, 122467, 123769, 124097, 123868, 124149, 124800, 124830, 124384, 124587, 125483, 125937, 125641, 125484, 125725, 125586, 124916, 124643, 125118, 125522, 125349, 125101, 125108, 124982, 124642, 124549, 124611, 124101, 123089, 122627, 123127, 123737, 123720, 123292, 122782, 122214, 122059, 123070, 124907, 126130, 126092, 125663, 125626, 125544, 124876, 124101, 123973, 124517, 125354, 126244, 126861, 126805, 126262, 125910, 125897, 125699, 125204, 124985, 125218, 125322, 125004, 124702, 124645, 124463, 124121, 124285, 125250, 126374, 127022, 127281, 127406, 127425, 127645, 128601, 129991, 130623, 129966, 129012, 128996, 129946, 131041, 131756, 132078, 132080, 131794, 131243, 130385, 129341, 128677, 128980, 130138, 131580, 133074, 134604, 135699, 135844, 135466, 135506, 135896, 135556, 134016, 132047, 130541, 129785, 130045, 131695, 134358, 136908, 138751, 140243, 141636, 142599, 143128, 143847, 144917, 145601, 145445, 144963, 144654, 144250, 143502, 142875, 142817, 143014, 142932, 142518, 141912, 141081, 140137, 139455, 139162, 139124, 139612, 141192, 143603, 145581, 146198, 145695, 144665, 143239, 141546, 140242, 140019, 141001, 142858, 144969]
54963A44969J357j94j273q78L43R67O81K99L13M83N52M45O9l32j33O78J087N29
54945A49962j12R9O58O57L73N23Q17O41M58J005J805K003K073L056M640N651O083
54928A80392O897Q062Q540Q080P483P010O006M196J991m38l207n791p331p855
54914B14035q032p906p041n749m917m668m363l825l356k784j727o28l17o27o91
54899A57404m24m76p99n71M50J588K274K432K087J597J913L501N335O150O226
54884A88687O712P648Q096P862P431O580M630J951m04k417m826p205q131p447
54870B09167o664o789p166o876n931m781l766l307l534l665k849j591j102j390
54856A49756j384q60o56r40q38o6N28M11L0j66k17k1N12O37m85k089k374r27Q01
$$ y = [144969, 146326, 146132, 144859, 143981, 144324, 145291, 145972, 146271, 146584, 147067, 147619, 148064, 148133, 147801, 147668, 148346, 149433, 149962, 149850, 149949, 150607, 151264, 151637, 152160, 152977, 153618, 154076, 155081, 156886, 158889, 160962, 164018, 168658, 174309, 180392, 187289, 195351, 203891, 211971, 219454, 226464, 232470, 236666, 238657, 238219, 235012, 229221, 221890, 214035, 206003, 198097, 191056, 185307, 180390, 175722, 171359, 167534, 164178, 161394, 159667, 159039, 158722, 158095, 157404, 156980, 156504, 155705, 155134, 155584, 157172, 159446, 161878, 163965, 165562, 167475, 170976, 176311, 182461, 188687, 195399, 203047, 211143, 219005, 226436, 233016, 237646, 239597, 239193, 236776, 231950, 224745, 216614, 209167, 202503, 195714, 188548, 181672, 175741, 170960, 167194, 163887, 160353, 156688, 153839, 152248, 151146, 149756, 148372, 147512, 146856, 145916, 145078, 145012, 145540, 145951, 145981, 145815, 145598, 145577, 146089, 146726, 146241, 144152, 141778, 140851, 141652]
54837A41652J636J799J631Q80k42p38k37L82L23k14p90j306j565j286p58m83j96
54820A40488O13J400J158K55N7O88R05L87K58R88J532J249R28J180J346Q71L07
54803A54610J80J03k10l19q9j13m76m06K67O34L37K53Q70J406J322J291J731J764
54785A63155P65k70l7J315K711L577L921L866L869M584N831O570O440O274O620
54770B19191O875O493N823N060L665J537m59j923l534n447o494o035n201n116
54756B14435n239m688l978l946m102l622k995l123l471k852j479o21n96n81k63
54741A72879j72l79j37R15K184K954L123L056L235L961N007N772O108O506P127
54726B22139P197O025M046K101K47k026m653o850p917p733o745n735n244m962
$$ y = [141652, 143288, 145087, 146718, 147598, 147356, 146618, 146381, 146763, 147086, 146872, 146082, 144776, 143211, 141925, 141167, 140684, 140488, 141101, 142501, 143659, 143914, 143971, 144659, 145564, 145951, 146209, 147197, 148729, 149978, 150906, 152086, 153432, 154303, 154610, 154790, 154893, 154683, 154364, 154275, 154162, 153686, 153280, 153547, 154181, 154518, 154771, 155641, 157047, 158369, 159660, 161391, 163155, 163920, 163650, 163613, 164928, 167639, 171216, 175137, 179003, 182872, 187456, 193287, 199857, 206297, 212571, 219191, 226066, 232559, 238382, 243442, 247107, 248644, 248185, 246262, 242728, 237281, 230787, 224752, 219551, 214435, 209196, 204508, 200530, 196584, 192482, 188860, 185865, 182742, 179271, 176419, 174940, 174319, 173723, 173142, 172879, 172707, 172328, 172191, 173106, 175290, 178244, 181367, 184423, 187658, 191619, 196626, 202398, 208506, 215012, 222139, 229336, 235361, 239407, 241508, 241755, 239729, 235076, 228226, 220309, 212576, 205831, 200096, 194852, 189890]
54712A89890m170k970k283k377k334j558p67q00j296j486j443j610j722j249m68
54697A63357j26l75p60j039j253j292j045p14n04l45k52m81q85p54J53J108J468
54680A56261J478J405P45p81k141k014n20R59J442R77n5j321k320k566k079j281
54664A48189m82K44Q40J285J567J507R64L37L12Q93J325J151O93K53l01q22p44
54647A57211j31J31k61m05L17J164J252Q86P22N02k11q20m20P02J430J287O00
54630A63956l75j440j967j493o29l82o84n43M14J385J436M87p68j464j185l34
54614A56414K18J44qK83Q06J134J291J395J233P19K81J94J30j59k77J46P21Q65
54596A65530N69R5n28j183j471j379j446j735j473l13Q65J172R50R59J162J171
$$ y = [189890, 185720, 182750, 180467, 178090, 175756, 174198, 173431, 172631, 171335, 169849, 168406, 166796, 165074, 163825, 163357, 163231, 162856, 162096, 161057, 159804, 158512, 157467, 156753, 156249, 155904, 155652, 155171, 154286, 153532, 153685, 154793, 156261, 157739, 159144, 159889, 159108, 156967, 154953, 154433, 155392, 156834, 157811, 157756, 156435, 154115, 151549, 149470, 148189, 147707, 147951, 148791, 150076, 151643, 153150, 154114, 154451, 154763, 155656, 156981, 158132, 158825, 159078, 158777, 157955, 157211, 157080, 157211, 156950, 156545, 156862, 158026, 159278, 160164, 160886, 161388, 161177, 160357, 159937, 160639, 162069, 163356, 163956, 163581, 162141, 160174, 158681, 158052, 157670, 156986, 156443, 156857, 158242, 159678, 160165, 159397, 157933, 156748, 156414, 156632, 156776, 156768, 157051, 157857, 158991, 160282, 161677, 162910, 163629, 163910, 164104, 164234, 164075, 163798, 163944, 164665, 165530, 166099, 166194, 165666, 164483, 163012, 161633, 160187, 158452, 156979, 156666, 157531, 158703, 159653, 160612, 161774, 162945]
54580A62945J133J171P38l91j272j064m38m60p43j48J115J628Q88j27n51n42m12
54563A63470o2M67P03M30K8o8J62M79O13M07M2r3M1P2N2N97J698K215J381J29
54543A72763r4O91J260J081P91R17J179J109O60J03k19j13J35Om06l81J48J69
54525A79799q69j967k000j402j310j640j338j44J143J949K335K236J534O80L30
54510A79336L74K43k3N5L54K71j85m34l95n46r18r93o05j95o6o2m2o2j40k50m08
54489A75309m22J0O25O60Q1p4O71J242O35m01n41J18O11R89J943L055L119K108
54471A89738J196Q97O67L97O92J424J519N95l84n37j22J50k6o48j498j972j650
54454A90438j002p43o45J4R72J176M03m91r78j277j298n24P33J290O94j33k56
$$ y = [162945, 164078, 165249, 165987, 165596, 164324, 163260, 162822, 162362, 161619, 161471, 162586, 164214, 165102, 164975, 164424, 163882, 163470, 163408, 163875, 164578, 165008, 165036, 164968, 165130, 165609, 166222, 166629, 166671, 166578, 166619, 166691, 166743, 167340, 169038, 171253, 172634, 172763, 172669, 173360, 174620, 175701, 176492, 177409, 178588, 179697, 180357, 180460, 180241, 180128, 180263, 180269, 179863, 179482, 179630, 179799, 178930, 176963, 174963, 173561, 172251, 170611, 169273, 169129, 170272, 172221, 174556, 176792, 178326, 179006, 179336, 179710, 179953, 179930, 179985, 180339, 180610, 180425, 179991, 179596, 179050, 178132, 177139, 176534, 176339, 176273, 176211, 176169, 176107, 175967, 175717, 175309, 174887, 174897, 175522, 176182, 176263, 176189, 176860, 178102, 178737, 178336, 177795, 177913, 178524, 179513, 181456, 184511, 187630, 189738, 190934, 191831, 192498, 192895, 193587, 195011, 196530, 197125, 196741, 196204, 196082, 196232, 196206, 195558, 194060, 192088, 190438, 189436, 188693, 188048, 188062, 189034, 190210, 190613, 190122, 189144, 187867, 186569, 186045, 186778, 188068, 188762, 188629, 188373]
54437A88373K39Q85J509J870J538N53m96j269j781j719n88J141K138J779Q46L31
54421A95349L20L26Ro65j374j481p71j9q5n97n30J46N01K66J72N21P61P06R63
54402A94518J729K229J870J010K40k78m61j74K59L06Q8J90M96K92l77n93o7M48
54384B01725M55K76N2n56j311j349o54l44q49j071j26J270J930J778J406R83M11
54367B04026p3k29j68J63J172K755L944L981L108J918O72l59o94l72j66n73j239
54350B17866j725k081k255j872j017m38n17q38j092j432j633j025J88P29lj025
54334B01830j316j131j044q12j64L21J67m1L39P97O27K49M54R36Q79M44M33P24
54316B03692L43r63k252k598j988r62m5M20L09k21q92j384j265k94R62J440Q23
$$ y = [188373, 188612, 189497, 191006, 192876, 194414, 194967, 194471, 193202, 191421, 189702, 189114, 190255, 192393, 194172, 195018, 195349, 195669, 195995, 196004, 195339, 193965, 192484, 191713, 191694, 191609, 191012, 190482, 190628, 191129, 191395, 191567, 192088, 192849, 193555, 194518, 196247, 198476, 200346, 201356, 201596, 201318, 200857, 200683, 200942, 201248, 201336, 201526, 202022, 202314, 201937, 201344, 201277, 201725, 202180, 202456, 202508, 201952, 200641, 199292, 198638, 198294, 197445, 196374, 196248, 197518, 199448, 201226, 202632, 203615, 204026, 203953, 203724, 203556, 203719, 204891, 207646, 211590, 215571, 218679, 220597, 221269, 220910, 220216, 219844, 219678, 219105, 217866, 216141, 214060, 211805, 209933, 208916, 208478, 207961, 207123, 206031, 204599, 202966, 201941, 202129, 202858, 202855, 201830, 200514, 199383, 198339, 197527, 197363, 197684, 197851, 197810, 198149, 198946, 199573, 199822, 200276, 201212, 202091, 202535, 202968, 203692, 204035, 203072, 200820, 198222, 196234, 195272, 195227, 195647, 195956, 195735, 194843, 193459, 192194, 191900, 192862, 194302, 195125]
54299A95125j21o64r44j197j011l3J189J822J775J497J167O98J62l08p65j157
54283A97235j222j000r39j124j039m66N1J51K99Q42J184O76k59o80m11l2N8r0
54265A93234k50o9P65J948K581K274J707J615J832J856J700J494R08k57j396j771
54249B08171j514j214j016o92k73P6M08O75N54L9k64o8J04j30k42K10O09K66k84
54230B05415l3Q75J427J295J054R97Q06M03J73K53L27K07ol42r04j434j495j064
54212B07954n53k69k77n50q70p93j59N69R05R60J050J051O35j30q84j412j552
54195B05675j057j22L80k22j450k168j851r53k46j37m68o59l02K87N05M45P69
54178A98426J493J828J470J053Q28O4j486k605k121n80O28J072J148Q99J56o23
$$ y = [195125, 195004, 194340, 193396, 192199, 191188, 191155, 192344, 194166, 195941, 197438, 198605, 199303, 199465, 199157, 198392, 197235, 196013, 195013, 194074, 192950, 191911, 191445, 191496, 191647, 191946, 192788, 193972, 194648, 194389, 193709, 193298, 193266, 193324, 193234, 192984, 192915, 193680, 195628, 198209, 200483, 202190, 203805, 205637, 207493, 209193, 210687, 211595, 211338, 209942, 208171, 206657, 205443, 204427, 203735, 203462, 203538, 203946, 204621, 205175, 205214, 204950, 204882, 204986, 204856, 204614, 204824, 205433, 205699, 205415, 205382, 206257, 207684, 208979, 210033, 211030, 211836, 212239, 212412, 212665, 212992, 213199, 213193, 212851, 211947, 210513, 209018, 207954, 207401, 207132, 206855, 206305, 205435, 204642, 204483, 205052, 205957, 206917, 207967, 209018, 209653, 209523, 208639, 207227, 205675, 204618, 204496, 204876, 204654, 203204, 201036, 199185, 198232, 197986, 197849, 197381, 196722, 196420, 196707, 197212, 197657, 198426, 199919, 201747, 203217, 204270, 205098, 205162, 203676, 201071, 198950, 198370, 198998, 200070, 201218, 202117, 202273, 201650]
54162B01650q66q90j323j846j645p61k1K71N22R47J293J351R76K4j072j213k9
54145A97368J239J267M91J94M01J07p19j008m34J48K66M63J073J555J457R89L81
54128B05238l79r45p30J34Q36J116J455J889J726Q49K07M94J177J442J385J625
54112B17519K263K848K984K614J930J294J006R77R67J114J807L033M298N254O037
54097B55945O975Q364J0401J2856J4776J4983J2907Q645K678l933r418j2305j2634
54084C10240j1617j0237q762p294n937m455k588p25M81J045J527K097K560L147
54070B69482M291N597O050N399M400L505K289M67j438k864l851m571m879m749
54056B79128m488m206l629k786k218k137j988j223n6Q79J269J210J014J117J792
$$ y = [201650, 200784, 199894, 198571, 196725, 195080, 194319, 194298, 194569, 195091, 196038, 197331, 198682, 199658, 199682, 198610, 197397, 197368, 198607, 199874, 200365, 200559, 200960, 201067, 200348, 199340, 198906, 199054, 199320, 199783, 200856, 202411, 203868, 204857, 205238, 204859, 203914, 203184, 203318, 204154, 205270, 206725, 208614, 210340, 211189, 211396, 211890, 213067, 214509, 215894, 217519, 219782, 222630, 225614, 228228, 230158, 231452, 232458, 233435, 234402, 235516, 237323, 240356, 244654, 249908, 255945, 262920, 271284, 281685, 294541, 309317, 324300, 337207, 345852, 348530, 344597, 335179, 322874, 310240, 298623, 288386, 279624, 272330, 266393, 261938, 259350, 258625, 259106, 260151, 261678, 263775, 266335, 269482, 273773, 279370, 285420, 290819, 295219, 298724, 301013, 301480, 300042, 297178, 293327, 288756, 283877, 279128, 274640, 270434, 266805, 264019, 261801, 259664, 257676, 256453, 256397, 257276, 258545, 259755, 260769, 261886, 263678]
54041B63678K727L232L095K799K842L205L627L948M082L978L799L825M142M671
54027C13650N344N940N952N135L935K937K126J270O93Q30J265J114K55p08j593
54012C48145k767m097m850m844m749m922m939m584m411m798n196m925m084l216
53998B85763k554k051j755j745j960k365k868l092k600j521m83J40M27M02p3p97
53982B62868j278j367j330j281j097r52j170j557j540j039n15j70J48K78j07o11
53966B49280l99M76J046R84J057J665K063J683J165J348K020K552L041L947N090
53951B77018N893O313O817P641Q604R604J0897J2978J6183J9942K2371K1273J6041
53938D41575Q230J22o659j1168j2841j2041j0187q620p505o306m829l305j906
$$ y = [263678, 266405, 269637, 272732, 275531, 278373, 281578, 285205, 289153, 293235, 297213, 301012, 304837, 308979, 313650, 318994, 324934, 330886, 336021, 339956, 342893, 345019, 346289, 346982, 347812, 349077, 350191, 350446, 349738, 348145, 345378, 341281, 336431, 331587, 326838, 321916, 316977, 312393, 307982, 303184, 297988, 293063, 288979, 285763, 283209, 281158, 279403, 277658, 275698, 273333, 270465, 267373, 264773, 263252, 262769, 262909, 263336, 263738, 263665, 262868, 261590, 260223, 258893, 257612, 256515, 255563, 254393, 252836, 251296, 250257, 249742, 249572, 249720, 249998, 249891, 249280, 248881, 249357, 250403, 251387, 252444, 254109, 256172, 257855, 259020, 260368, 262388, 264940, 267981, 271928, 277018, 282911, 289224, 296041, 303682, 312286, 321890, 332787, 345765, 361948, 381890, 404261, 425534, 441575, 449805, 449927, 443268, 432100, 419259, 407218, 397031, 388411, 380906, 374600, 369771, 366466, 364560]
53925C64560p34jL25P52J720L012M093M769N212N594N978O385O740O975P280P839
53909D30499Q333Q155P215N981M639K879P24j151k268k874l331l513l265k870
53895D49153k700k846l423m590o019o995p371p787q465q638p727o447n964o405
53881C63776o925o892o315n381m232l105k229j674j503j855k655l503m135m603
53867C08769m871m715m231l939l981l838l121k190j561j220r81r42j248j711k076
53852B68144k219j887q28M53Q36l2j138j463j250j256j368q77J88R88R96N24P6
53835B59887k16m51o23n96k99J03K85J79J46L84M82J01j50M86J407J164l16j353
53817B60620q19M26J080J192J437J721J668J712K497L682M468M826N195N444N187
$$ y = [364560, 363826, 363825, 364150, 364902, 366622, 369634, 373727, 378496, 383708, 389302, 395280, 401665, 408405, 415380, 422660, 430499, 438832, 446987, 454202, 460183, 464822, 467701, 468425, 467274, 465006, 462132, 458801, 455288, 452023, 449153, 446453, 443607, 440184, 435594, 429575, 422580, 415209, 407422, 398957, 390319, 382592, 376145, 370181, 363776, 356851, 349959, 343644, 338263, 334031, 330926, 328697, 327023, 325520, 323665, 321010, 317507, 313372, 308769, 303898, 299183, 294952, 291013, 287032, 283194, 280073, 277883, 276322, 275102, 274121, 273179, 271931, 270220, 268144, 265925, 264038, 263210, 263663, 264499, 264467, 263329, 261866, 260616, 259360, 257992, 257115, 257303, 258291, 259287, 259811, 259887, 259671, 259220, 258597, 258001, 257702, 257805, 258090, 258269, 258415, 258799, 259281, 259382, 259232, 259718, 261125, 262289, 261973, 260620, 259801, 260227, 261307, 262499, 263936, 265657, 267325, 269037, 271534, 275216, 279684, 284510, 289705, 295149, 300336]
53802C00336M764M801N113N090M899N237O018O406O081N561N239M949M512L910
53788C72916K940J446k4o76n45n10j122k096k937l403l391k997k803l427m691
53773C48680n699n857n361m722m315m322m619m727m300l635l273l258l203k970
53759B88419k708k418k011j722j883k273k268j663r48o90j000j533j741j268l58
53744B63935K70J89l32q59j254j321o87M29R84M23l70k89L02K24n64q56q5R05
53726B61044J195R24P31P66P62N60K84K52Q15J933K968L313L100K825K458J591
53710B85521L93l27o4R47K298L749M903N231M673L778L080K661K413K319K375
53695C23950K590L022L471L334K252Q18M5J94O16P35N94M47M00N50R15J143P63
$$ y = [300336, 305100, 309901, 315014, 320104, 325003, 330240, 336258, 342664, 348745, 354306, 359545, 364494, 369006, 372916, 375856, 377302, 377278, 376602, 376057, 375547, 374425, 372329, 369392, 365989, 362598, 359601, 356798, 353371, 348680, 342981, 337124, 331763, 327041, 322726, 318404, 313785, 309058, 304758, 301123, 297850, 294592, 291389, 288419, 285711, 283293, 281282, 279560, 277677, 275404, 273136, 271473, 270525, 269835, 268835, 267302, 265561, 264293, 263935, 264205, 264394, 264062, 263203, 261949, 260628, 259941, 260370, 261354, 261777, 261407, 261118, 261420, 261644, 261080, 260224, 260139, 261044, 262239, 263163, 263894, 264660, 265422, 265982, 266266, 266518, 267333, 269266, 272234, 275547, 278647, 281472, 283930, 285521, 285914, 285587, 285523, 286470, 288768, 292517, 297420, 302651, 307324, 311102, 314182, 316843, 319256, 321575, 323950, 326540, 329562, 333033, 336367, 338619, 339437, 339482, 339676, 340292, 341027, 341621, 342068, 342468, 343018, 343933, 345076, 345839]
53678C45839j28q92j115r23n94k91j72k49j54M25J128J236O21j50o71j052j425
53661C41433j645j677j671j514q20L65J299J303M66n43j095r94m99l9K19M95Q81
53644C35964R51K93p87j504j416o92K85J135J527J516J612K044K287J872J280
53629C46367J231J438J087L99N18J755K974L136K508J899J593J553J966K883L766
53614C75073M074L977M041M416M775M891M931N244O036P147Q069Q383Q208Q023
53600D57288P951P523O190L970J537k23q98j006j510k647l575l491k695k073j949
53585D64392k040k169k285k145j736j697k443l202l001k296k384l285l595k696
53571D29418j676j525j774j643j317j199q82J2P81N34l50p54m96l88q19j253j178
$$ y = [345839, 345711, 344819, 343704, 342781, 342187, 341896, 341724, 341475, 341321, 341746, 342874, 344110, 344731, 344581, 343910, 342858, 341433, 339788, 338111, 336440, 334926, 334106, 334471, 335770, 337073, 337539, 336996, 335901, 334907, 334408, 334369, 334588, 335083, 335964, 336915, 337208, 336421, 334917, 333501, 332809, 333094, 334229, 335756, 337272, 338884, 340928, 343215, 345087, 346367, 347598, 349036, 350123, 350522, 351040, 352795, 355769, 358905, 361413, 363312, 364905, 366458, 368424, 371307, 375073, 379147, 383124, 387165, 391581, 396356, 401247, 406178, 411422, 417458, 424605, 432674, 441057, 449265, 457288, 465239, 472762, 478952, 482922, 484459, 484236, 483338, 482332, 480822, 478175, 474600, 471109, 468414, 466341, 464392, 462352, 460183, 457898, 455753, 454017, 452320, 449877, 446675, 443674, 441378, 438994, 435709, 432114, 429418, 427742, 426217, 424443, 422800, 421483, 420284, 419402, 419414, 420195, 420729, 420379, 419625, 419129, 418741, 417922, 416669, 415491]
53554D15491p66l92j42M2J71L60P68J240J380J080P02O20P58Q82J129J909L197
53537D28429M216M171L279K594K756L337L705L987M680N656O330O623P037P754
53523D94554Q310Q377Q287Q547R303J0396J1594J2627J3369J4056J4979J6023
53511F30422J6885J7651J8584J9451J9730J9533J9598K0267K1021K1214K0707
53500H45063J9657J8390J7515J7557J8225J8685J8773J9172K0187K1108K1155
53489A055487K0453J9557J8697J7964J7629J7686J7533J6642J5294J4205J3721
53478A244868J3748J4177J4965J5963J6860J7229J6603J4951J3009J1613J0634
53467A404620R175O938M570K427r6l491p082r756j1224j1970j2394j2583j2609
$$ y = [415491, 414725, 414333, 414191, 414233, 414404, 414764, 415532, 416772, 418152, 419232, 419934, 420554, 421312, 422194, 423323, 425232, 428429, 432645, 436816, 440095, 442689, 445445, 448782, 452487, 456474, 461154, 466810, 473140, 479763, 486800, 494554, 502864, 511241, 519528, 528075, 537378, 547774, 559368, 571995, 585364, 599420, 614399, 630422, 647307, 664958, 683542, 702993, 722723, 742256, 761854, 782121, 803142, 824356, 845063, 864720, 883110, 900625, 918182, 936407, 955092, 973865, 993037, 1013224, 1034332, 1055487, 1075940, 1095497, 1114194, 1132158, 1149787, 1167473, 1185006, 1201648, 1216942, 1231147, 1244868, 1258616, 1272793, 1287758, 1303721, 1320581, 1337810, 1354413, 1369364, 1382373, 1393986, 1404620, 1413795, 1420733, 1425303, 1427730, 1427634, 1424143, 1417061, 1407305, 1396081, 1384111, 1371717, 1359134, 1346525]
53454A346525j2533j2419j2708j4152j6757j9281k0404k0161j9581j9261j8959
53443A160309j8509j8334j8778j9379j9192j7816j5909j4495j3710j2563j0248
53432I81376p419n466m740m294l426k466j705n50J525L928N673O695P663Q869
53418I85663J0039J1073J2226J3591J4947J6086J6933J7453J7786J8321J9337
53407A153455K0686K2057K3319K4427K5355K6334K7748K9546L1236L2783L4950
53396A451896L8182M1682M4246M5690M6751M7877M8857M9555N0270N1209N2133
53385A968348N2647N2561N1922N0922M9738M8275M6195M3465M0727L8745L7559
53374B481104L6414L4503L1602K8055K4417K1085J8087J5193J2049Q160K887m056
$$ y = [1346525, 1333992, 1321573, 1308865, 1294713, 1277956, 1258675, 1238271, 1218110, 1198529, 1179268, 1160309, 1141800, 1123466, 1104688, 1085309, 1066117, 1048301, 1032392, 1017897, 1004187, 991624, 981376, 973957, 968491, 963751, 959457, 956031, 953565, 951860, 951310, 952835, 956763, 962436, 969131, 976794, 985663, 995702, 1006775, 1019001, 1032592, 1047539, 1063625, 1080558, 1098011, 1115797, 1134118, 1153455, 1174141, 1196198, 1219517, 1243944, 1269299, 1295633, 1323381, 1352927, 1384163, 1416946, 1451896, 1490078, 1531760, 1576006, 1621696, 1668447, 1716324, 1765181, 1814736, 1865006, 1916215, 1968348, 2020995, 2073556, 2125478, 2176400, 2226138, 2274413, 2320608, 2364073, 2404800, 2443545, 2481104, 2517518, 2552021, 2583623, 2611678, 2636095, 2657180, 2675267, 2690460, 2702509, 2710669, 2713556, 2709500]
53362B709500j2149k0344k7815l4198l9391m3599m7367n0836n3129n3316n2013
53351B275343n0985n0993n1032n0025m8155m6072m3848m1591m0072l9832m0303
53340A772435m0625m0728m0755m0177l8545l6531l5106l4060l2417l0048k7732
53329A375711k5780k3616k0805j7532j4134j0987q910q704j0058j1666j2606j2988
53317A197925j3156j3019j2429j1578j0657r585q304p020n896m845l727k543j322
53304A093844j3J346K575L504M154M830N973P701R520J0870J1955J3463J5357
53291A185079J6765J7396J8269K0288K2880K4791K5707K6067K5830K4589K2680
53280A430341K1084K0080J8997J7449J5831J4505J3195J1600R857Q061N917L187
$$ y = [2709500, 2697351, 2677007, 2649192, 2614994, 2575603, 2532004, 2484637, 2433801, 2380672, 2327356, 2275343, 2224358, 2173365, 2122333, 2072308, 2024153, 1978081, 1934233, 1892642, 1852570, 1812738, 1772435, 1731810, 1691082, 1650327, 1610150, 1571605, 1535074, 1499968, 1465908, 1433491, 1403443, 1375711, 1349931, 1326315, 1305510, 1287978, 1273844, 1262857, 1253947, 1245243, 1235185, 1223519, 1210913, 1197925, 1184769, 1171750, 1159321, 1147743, 1137086, 1127501, 1119197, 1112177, 1106281, 1101436, 1097709, 1095166, 1093844, 1093831, 1095177, 1097752, 1101256, 1105410, 1110240, 1116213, 1123914, 1133434, 1144304, 1156259, 1169722, 1185079, 1201844, 1219240, 1237509, 1257797, 1280677, 1305468, 1331175, 1357242, 1383072, 1407661, 1430341, 1451425, 1471505, 1490502, 1507951, 1523782, 1538287, 1551482, 1563082, 1572939, 1581000, 1586917, 1590104]
53268A590104P7l040n953q554j0829j3097j5855j9172k2416k4718k5677k5672
53256A415198k5683k6568k8219k9659l0158l0012k9829k9530k8610k7086k5498
53245A104346k4079k2658k1350k0714k1014k1810k2402k2503k2396k2643k3414
53234H59363k4008k3410k1580j9702j8633j7758j6039j3657j1705j0566r623q429
53222F64253p240o348n801n829o708q065r048r393r647j0215j0842j1228j1429
53209E52460j1487j1278j0825j0292r541q285o735n499m828m534m575n072n705
53196D53804n922n786n831o076n968n544n572o172o287n200l804l557m621n768
53182C77696n884m967l812l142k993k757j932q91n67j250k169k533k468k531k684
$$ y = [1590104, 1590181, 1587141, 1581188, 1572634, 1561805, 1548708, 1532853, 1513681, 1491265, 1466547, 1440870, 1415198, 1389515, 1362947, 1334728, 1305069, 1274911, 1244899, 1215070, 1185540, 1156930, 1129844, 1104346, 1080267, 1057609, 1036259, 1015545, 994531, 972721, 950319, 927816, 905420, 882777, 859363, 835355, 811945, 790365, 770663, 752030, 734272, 718233, 704576, 692871, 682305, 672682, 664253, 657013, 650665, 644864, 639035, 632327, 624262, 615214, 605821, 596174, 585959, 575117, 563889, 552460, 540973, 529695, 518870, 508578, 499037, 490752, 484017, 478518, 473690, 469156, 464581, 459509, 453804, 447882, 442096, 436265, 430189, 424221, 418677, 413105, 406933, 400646, 395446, 391642, 388085, 383464, 377696, 371812, 366845, 363033, 359891, 356898, 354141, 352209, 351318, 350751, 349501, 347332, 344799, 342331, 339800, 337116]
53167C37116k345j337k92J7n21j324j720j470p38K37J164J543R50l13j296j419
53151C28252j076r52j164j470j827k179k109j390n69k92l76l06k43o24j069p74
53135C11832Q0M80J66J2N54J235J482J521J710J925K061K410L020L379L221L029
53119C38117L253L644L842L994M320M492M050L040J860P71j32p91j344k039k805
53104C64272l305l544l919m458m634m144l385k869k698k775k944k791j910o77
53090C20219l7k25m06O6P22Q05L30k01n63p44o01j38K71L33J49j69o60j048q04
53071C17299q0J07p74j946k381k096j734j542j405j450j744j811j188k43K43N2
53055B99307l96p09o70q5R22J699J713J219Q31P33P89J058J574J906J556O59k06
$$ y = [337116, 334771, 333434, 333142, 333159, 332638, 331314, 329594, 328124, 327386, 327623, 328787, 330330, 331280, 330967, 329671, 328252, 327176, 326224, 325060, 323590, 321763, 319584, 317475, 316085, 315516, 315224, 314848, 314542, 314299, 313675, 312606, 311832, 311912, 312392, 312558, 312570, 313124, 314359, 315841, 317362, 319072, 320997, 323058, 325468, 328488, 331867, 335088, 338117, 341370, 345014, 348856, 352850, 357170, 361662, 365712, 368752, 370612, 371383, 371251, 370460, 369116, 367077, 364272, 360967, 357423, 353504, 349046, 344412, 340268, 336883, 334014, 331316, 328541, 325597, 322806, 320896, 320219, 320182, 319957, 319551, 319617, 320339, 321144, 321474, 321273, 320710, 319966, 319365, 319227, 319498, 319831, 319980, 319811, 319151, 318103, 317299, 317219, 317326, 316552, 314606, 312225, 310129, 308395, 306853, 305448, 303998, 302254, 300443, 299255, 299012, 299255, 299307, 298911, 298202, 297532, 297447, 298369, 300068, 301781, 303000, 303831, 304564, 305353, 306411, 307985, 309891, 311447, 312106, 311900]
53038C11900p16r04q44o97p71j053j053n32j9j8j57K10R04J152O81q8p96j283
53020C05916j222l96O71J107P94M64O42J120J517J771J900J763J267N38k15p16
53004C16921p01k78l4l71q15n83L47J234J589J583J424J004L85N4L76J113J717
52987C24965J805J284L69l40k16O71J439J329O04K03N82J248J471J173Q30O92
52971C38109N11J78J64R36K202L201L588L543L126K182R48L3m26r34j688k125
52955C53548j848j383j426j851k108k193k507k971l019k448j742j441j608j939
52941C25064k139k125j985j685r59K62J357J483O60j96m93n26o24n87l84n36j131
52924C15456j311n64K43R2n33l94N80J358J477J450J541J448J219J365J778J653
$$ y = [311900, 311184, 310280, 309436, 308739, 307968, 306915, 305862, 305330, 305311, 305293, 305136, 305346, 306250, 307402, 308083, 307995, 307199, 305916, 304694, 304298, 304969, 306076, 306870, 307334, 307976, 309096, 310613, 312384, 314284, 316047, 317314, 317852, 317637, 316921, 316220, 315942, 315908, 315537, 314722, 314139, 314486, 315720, 317309, 318892, 320316, 321320, 321705, 321759, 322135, 323248, 324965, 326770, 328054, 328423, 328083, 327867, 328538, 329977, 331306, 331910, 332113, 332695, 333943, 335414, 336587, 337417, 338109, 338620, 338798, 338962, 339898, 342100, 345301, 348889, 352432, 355558, 357740, 358688, 358721, 358295, 357361, 355673, 353548, 351700, 350317, 348891, 347040, 344932, 342739, 340232, 337261, 334242, 331794, 330052, 328611, 327003, 325064, 322925, 320800, 318815, 317130, 316171, 316433, 317790, 319273, 319933, 319737, 319244, 318718, 318094, 317507, 317123, 316587, 315456, 314145, 313581, 313824, 313916, 313383, 312989, 313569, 314927, 316404, 317854, 319395, 320843, 322062, 323427, 325205, 326858]
52908C26858P83n0l30n16j000j294q95k54j13m01m31k8K43j17q70j286r19q3M96
52889C19793N93P85J466J992J436N2q70p10k13k15m73k95K81O61O96Q28J346J996
52871C29149K395K460K425K522K749K827K503J911J440J230R98M77j89o88r69
52856C51240j271j781k391k814k913k897l117l580l819l375k352j302o99o52r92
52841C17285j371j430j099o58l51j52p0l61j038j538j305n41J56O15J058J344
52825C10544R79o3j076j389j032n11k76l89m02L31J858L267L684L465L645M338
52809C26973M428L091Q20j385l101m319m820m389l312k157j245o64n20p61r97
52794C07642r33q27j059j419j300n84P1P6l22l98J7L38J07k48l0N40M98l68r50
$$ y = [326858, 327641, 327591, 327261, 326745, 325745, 324451, 323556, 323302, 323189, 322788, 322357, 322329, 322572, 322455, 321585, 320299, 319380, 319297, 319793, 320386, 321171, 322637, 324629, 326065, 326117, 325247, 324537, 324324, 324109, 323636, 323341, 323622, 324283, 324979, 325807, 327153, 329149, 331544, 334004, 336429, 338951, 341700, 344527, 347030, 348941, 350381, 351611, 352609, 353086, 352897, 352209, 351240, 349969, 348188, 345797, 342983, 340070, 337173, 334056, 330476, 326657, 323282, 320930, 319628, 318929, 318277, 317285, 315914, 314484, 313385, 312727, 312376, 312224, 312154, 311793, 310755, 309217, 307912, 307371, 307527, 308142, 309200, 310544, 311523, 311460, 310384, 308995, 307963, 307452, 307176, 306787, 306385, 306716, 308574, 311841, 315525, 318990, 322635, 326973, 331401, 334492, 335312, 333927, 330826, 326507, 321687, 317298, 313986, 311829, 310584, 309920, 309400, 308639, 307642, 306709, 305882, 304823, 303404, 302104, 301520, 301591, 301667, 301345, 300947, 300964, 301302, 301409, 301161, 301131, 301671, 302169, 301801, 300851]
52775C00851l68N86M46p75j523q76L36Q85P23N95P29P63N47L73M51O66Q00O77
52757C05886K13l57m43K84J348J900J695J242R73P67L95Q6K07O47Q87P23N20N97
52739C17570O80L15l56o58k21O00J273J670J964K230K401K386K090J492P94K25
52723C34455m00j387k369k433j447o00r42j982k457k108j734j743j672j216p94
52708C11171q26j106j211r91m86J72O71P78P74J115J682J924J729J496J345R67
52692C19204M04J56K37J4p11j209q97j77L82R66J892K568K074N58p12p99m2N36
52674C24444L65k40n77l39P3P5l74p64p56m46L5P48J542J923J648J113Q76J063
52656C30409J465J931K372K721L010L144K596R09j284k470j958q07l78n93m14
$$ y = [300851, 300483, 301069, 301515, 300740, 299217, 298341, 298677, 299562, 300285, 300880, 301609, 302372, 302919, 303292, 303743, 304409, 305209, 305886, 306099, 305742, 305299, 305583, 306931, 308831, 310526, 311768, 312741, 313508, 313903, 313989, 314196, 314843, 315730, 316453, 316973, 317570, 318250, 318565, 318209, 317551, 317330, 317930, 319203, 320873, 322837, 325067, 327468, 329854, 331944, 333436, 334230, 334455, 334055, 332668, 330299, 327866, 326419, 325819, 324877, 322895, 320438, 318330, 316596, 314853, 313181, 311965, 311171, 310345, 309239, 308028, 307037, 306551, 306723, 307394, 308172, 308946, 310061, 311743, 313667, 315396, 316892, 318237, 319204, 319608, 319764, 320001, 320015, 319304, 318095, 317198, 317021, 317403, 318369, 320261, 322829, 324903, 325461, 324749, 323950, 323908, 324444, 324809, 324569, 323992, 323653, 323726, 323801, 323427, 322663, 321907, 321461, 321496, 322244, 323786, 325709, 327357, 328470, 329346, 330409, 331874, 333805, 336177, 338898, 341908, 345052, 347648, 348557, 347273, 344803, 342845, 342038, 341660, 341067, 340653]
52641C40653L57P86L25l41l01L91R14P74K26j07K20J310K929M527N288M491K078
52624C64520j045l547m612m356l408k381j714j591j810j954j888j815j757j389
52610C31253o13R4K67R2M1K00L41N23J005J631J749R74k61j081r70j24Q28J346
52592C37295J344J098Q94P92P18O77P81J130J672K142K227J883J437J173R61N05
52576C56729r5m04k76r5k35o33r79j109j054r02p47o53n95n69p02j014j196q95
52558C44576k37K79L76J56k17o62r76r46o33k24L10R94J389J016J41n13q14j258
52540C42757j890k023j328l07N66J441K392K944K776K237J703J102O03Q92K072
52525C55937L001K649J520Q63R45R98O08J35q0p8J14N91J307K174L230M189M203
$$ y = [340653, 341010, 341796, 342121, 341780, 341479, 341870, 342784, 343558, 343784, 343677, 343897, 345207, 348136, 352663, 357951, 362442, 364520, 363475, 359928, 355316, 350960, 347552, 345171, 343457, 341866, 340056, 338102, 336214, 334399, 332642, 331253, 330640, 330734, 331001, 331093, 331134, 331334, 331675, 332198, 333203, 334834, 336583, 337557, 337296, 336215, 335245, 335121, 335949, 337295, 338639, 339737, 340631, 341423, 342141, 342818, 343599, 344729, 346401, 348543, 350770, 352653, 354090, 355263, 356224, 356729, 356634, 356230, 355954, 355859, 355624, 354991, 354012, 352903, 351849, 350947, 350200, 349547, 348952, 348383, 347681, 346667, 345471, 344576, 344339, 344618, 344994, 345150, 344933, 344271, 343295, 342349, 341716, 341492, 341802, 342796, 344185, 345201, 345342, 344829, 344015, 342757, 340867, 338844, 337516, 337209, 337775, 339216, 341608, 344552, 347328, 349565, 351268, 352370, 352973, 353865, 355937, 358938, 361587, 363107, 363970, 364915, 365913, 366521, 366656, 366576, 366498, 366612, 367203, 368510, 370684, 373914, 378103, 382306]
52508C82306K793P49o56j121j304j646k062k571l321m015m160l825l420k867j905
52493C52975j048j152j930k084j184k44o4r6L30P44M00l70o52l53j04m2L46J217
52475C46689K007K177J745J038L99K61R57K235L344L805L847L915M017L714K680
52460C82830J019q75k596l886m612m745m348l598k761k112j833j904k055j904
52446C46620j255l41K83K16l52p11k65P88J586J468O89j1l35o24j120j541j586
52429C43509j444j361j051m8J404K342K054Q69k29n10LP87J411J829K127K196
52413C53888J913J603J881K866L962M776N841P971J1103J4296J6713J7942J7466
52400D62221J4564R169K375m202r366j2543j3562j2714j0830q846p176n767m615
$$ y = [382306, 385099, 385848, 385192, 384071, 382767, 381121, 379059, 376488, 373167, 369152, 364992, 361167, 357747, 354880, 352975, 351927, 350775, 348845, 346761, 345577, 345333, 345269, 345173, 345503, 346247, 346647, 346277, 345625, 345272, 345168, 345126, 345472, 346689, 348696, 350873, 352618, 353656, 354055, 354316, 355273, 357508, 360852, 364657, 368504, 372419, 376436, 380150, 382830, 383849, 382974, 380378, 376492, 371880, 367135, 362787, 359189, 356428, 354316, 352483, 350579, 348524, 346620, 345365, 345024, 345307, 345523, 345171, 344460, 344195, 344983, 346569, 348037, 348726, 348715, 348380, 347756, 346636, 345095, 343509, 342065, 340704, 339653, 339605, 341009, 343351, 345405, 346274, 346045, 345535, 345538, 346325, 347736, 349565, 351692, 353888, 355801, 357404, 359285, 362151, 366113, 370889, 376730, 384701, 395804, 410100, 426813, 444755, 462221, 476785, 485954, 488329, 484127, 474761, 462218, 448656, 435942, 425112, 416266, 409090, 403323, 398708]
52387C98708l985l959m143l996l351k356j137K43J482K103K038J819J997K608
52373C88071L487M645N835O112M718K339O18J42j83j376k869l464l148k934l155
52358C98838k965j668K52J747K309K172J760J315R14O11M92O09R01J251J665K211
52342D12414K720K839K506K177K283K706L061L285L617M178M832N481O191P087
52328D65377Q231R446J0241J0130R183Q003P021O243N725N732O092O085N586N664
52314E68759P294R847J1776J2568J3113J4157J5357J6067J6284J6450J6888J7724
52302G36284J8944K0233K0976K0721J9440J7419J5158J3313J2295J1854J1377
52291I18014J0583R617Q562P326O028N004M365L874L359K850K356J785J221Q34
$$ y = [398708, 394723, 390764, 386621, 382625, 379274, 376918, 375781, 376024, 377506, 379609, 381647, 383466, 385463, 388071, 391558, 396203, 402038, 408150, 412868, 415207, 415825, 415967, 415784, 414408, 411539, 408075, 404927, 401993, 398838, 395873, 394205, 394457, 396204, 398513, 400685, 402445, 403760, 404674, 405285, 405777, 406386, 407287, 408538, 410203, 412414, 415134, 417973, 420479, 422656, 424939, 427645, 430706, 433991, 437608, 441786, 446618, 452099, 458290, 465377, 473608, 483054, 493295, 503425, 512608, 520611, 527632, 533875, 539600, 545332, 551424, 557509, 563095, 568759, 576053, 585900, 597676, 610244, 623357, 637514, 652871, 668938, 685222, 701672, 718560, 736284, 755228, 775461, 796437, 817158, 836598, 854017, 869175, 882488, 894783, 906637, 918014, 928597, 938214, 946776, 954102, 960130, 965134, 969499, 973373, 976732, 979582, 981938, 983723, 984944, 985778]
52277I85778O14L95R4l66j109j862j796n16J049J500O47m84j237j862k303j655
52261I76887N48L364N566P068Q518J0009J1121J1871J2648J3315J3208J2154J0854
52248A097131R972R434Q879Q342Q078Q029P845P417O925O390N518M259L159K796
52234A194174K959K823J933O21o10j621k392k791k969l491m588n620n900n698
52220A166830n791o243o408o014n502n146m640l782k913k279j527k67J155J899
52206A119372J578P13K45O65J638K578L547N170P469R348R834R385R121R074Q175
52191A197912O076L858K507J633K68j649l307m164m457m710n140n558n591n082
52177A172596m263l444k607j707j171j599k866m050m428m048l217k002n15P51
$$ y = [985778, 986392, 986787, 986881, 986515, 985406, 983544, 981748, 981232, 982281, 983781, 984428, 983944, 982707, 980845, 978542, 976887, 977435, 980799, 986365, 993433, 1001951, 1011960, 1023081, 1034952, 1047600, 1060915, 1074123, 1086277, 1097131, 1107103, 1116537, 1125416, 1133758, 1141836, 1149865, 1157710, 1165127, 1172052, 1178442, 1183960, 1188219, 1191378, 1194174, 1197133, 1199956, 1201889, 1202510, 1201900, 1200279, 1197887, 1195096, 1192127, 1188636, 1184048, 1178428, 1172528, 1166830, 1161039, 1154796, 1148388, 1142374, 1136872, 1131726, 1127086, 1123304, 1120391, 1118112, 1116585, 1116318, 1117473, 1119372, 1120950, 1121663, 1121908, 1122573, 1124211, 1126789, 1130336, 1135506, 1142975, 1152323, 1162157, 1171542, 1180663, 1189737, 1197912, 1203988, 1207846, 1210353, 1211986, 1212254, 1210605, 1207298, 1203134, 1198677, 1193967, 1188827, 1183269, 1177678, 1172596, 1168333, 1164889, 1162282, 1160575, 1159404, 1157805, 1154939, 1150889, 1146461, 1142413, 1139196, 1137194, 1136679, 1137430]
52163A137430J319J203Q31N97O05N48o7j319k534k944k509j605k43J645L313L727
52147A139997L110K885L727M574M190K779J439O59J40m10r64j352j303n80N92
52132A159483J662K524L596M884N878O631Q024J0253J2032J2209J1451J1237J1816
52119A261680J2204J1817J0959R931Q735P688P299P489P748Q153R434J1838J4641
52106A389616J6993J8689J9951K0923K1604K1894K1498K0082J7557J4106J0138
52095A593051O383L699K282J422M52l22k50M76J020J071R49O91j44j565k916l827
52079A602472m756o254q202j0048j1364j1899j1569j0674r780r065q079o389m162
52066A490231j899J59K107M055N959P712R195J0282J0836J0803J0312R776R567
$$ y = [1137430, 1138749, 1139952, 1140783, 1141380, 1141985, 1142533, 1142466, 1141147, 1138613, 1135669, 1133160, 1131555, 1131312, 1132957, 1136270, 1139997, 1143107, 1145992, 1149719, 1154293, 1158483, 1161262, 1162701, 1163360, 1163500, 1163090, 1162126, 1160774, 1159471, 1158891, 1159483, 1161145, 1163669, 1167265, 1172149, 1178027, 1184658, 1192682, 1202935, 1214967, 1227176, 1238627, 1249864, 1261680, 1273884, 1285701, 1296660, 1306591, 1315326, 1323014, 1330313, 1337802, 1345550, 1353703, 1363137, 1374975, 1389616, 1406609, 1425298, 1445249, 1466172, 1487776, 1509670, 1531168, 1551250, 1568807, 1582913, 1593051, 1599434, 1603133, 1605415, 1606837, 1607289, 1606967, 1606717, 1607193, 1608213, 1609284, 1610233, 1610924, 1610780, 1609215, 1606299, 1602472, 1597716, 1591462, 1583260, 1573212, 1561848, 1549949, 1538380, 1527706, 1517926, 1508861, 1500782, 1494393, 1490231, 1488332, 1488491, 1490598, 1494653, 1500612, 1508324, 1517519, 1527801, 1538637, 1549440, 1559752, 1569528, 1579095]
52053A579095R532R011P639N890M485L524K670J995K029K946M157M893M813M022
52039A646701K875J869J341J069M83n78j682k505l453n159p537r655j0650j0533
52025A602586r927r163p916n950l902k837k989l398l034j841m19Q57J950K661
52011A556678K518J121j736o026j1185j6070j9694k1929k3194k3606k2981k1472
51999A392424j9675j8124j7106j6937j7843j9604k1718k4008k6510k8761k9742
51988A152396k8906k6904k5042k4127k3995k4018k3891k3919k4412k4851k4038
51977H78293k1374j7633j4039j0916p776m507j608O85K772M911O675P414O812
51964H29709M841J617k365o304r631j2162j3679j3857j2888j1620j0587r316p051
$$ y = [1579095, 1588627, 1597638, 1605277, 1611167, 1615652, 1619176, 1621846, 1623841, 1625870, 1628816, 1632973, 1637866, 1642679, 1646701, 1649576, 1651445, 1652786, 1653855, 1654338, 1653760, 1652078, 1649573, 1646120, 1640961, 1633424, 1623769, 1613119, 1602586, 1592659, 1583496, 1575580, 1569630, 1565728, 1562891, 1559902, 1556504, 1553470, 1551629, 1551210, 1552067, 1554017, 1556678, 1559196, 1560317, 1558581, 1552555, 1541370, 1525300, 1505606, 1483677, 1460483, 1436877, 1413896, 1392424, 1372749, 1354625, 1337519, 1320582, 1302739, 1283135, 1261417, 1237409, 1210899, 1182138, 1152396, 1123490, 1096586, 1071544, 1047417, 1023422, 999404, 975513, 951594, 927182, 902331, 878293, 856919, 839286, 825247, 814331, 806555, 802048, 800440, 801125, 803897, 808808, 815483, 822897, 829709, 834550, 836167, 833802, 827498, 817867, 805705, 792026, 778169, 765281, 753661, 743074, 733758, 726707]
51951G26707l951r92J235L171N598Q625J1606J3855J5242J6087J6614J6721J6225
51938H46743J5107J3395J1088Q408N949M313L620L543L705L858L934M190N066
51925I32919O492P502O952M519N45m771j1335j8264k3806k6603k6682k4981k2291
51912H00196j8901j4934j0656o557l261j163j20K58l3j411l991p198j0284j2902
51898G09043j4981j6336j6777j6493j5974j5555j5059j3953j1831q861n719k970
51886E54534n46J967M605O937Q735J0470J2824J5793J8402J9430J8425J5946J2727
51873G00249Q726L457k738q270j1539j2289j1345r498p202n008l455k528j826
51860F36734j274j054r91p09m39q37j863k624k707k936m238o314q035q791q927
$$ y = [726707, 722756, 721764, 722999, 726170, 731768, 740393, 751999, 765854, 781096, 797183, 813797, 830518, 846743, 861850, 875245, 886333, 894741, 900690, 905003, 908623, 912166, 915871, 919729, 923663, 927853, 932919, 939411, 946913, 953865, 958384, 958929, 954158, 942823, 924559, 900753, 874150, 847468, 822487, 800196, 781295, 766361, 755705, 749148, 745887, 744724, 744604, 744862, 744829, 743418, 739427, 732229, 721945, 709043, 694062, 677726, 660949, 644456, 628482, 612927, 597868, 583915, 572084, 563223, 557504, 554534, 553988, 555955, 560560, 567497, 576232, 586702, 599526, 615319, 633721, 653151, 671576, 687522, 700249, 708975, 712432, 709694, 701424, 689885, 677596, 666251, 656753, 649551, 644543, 641088, 638560, 636734, 635460, 634406, 633415, 632706, 632267, 631430, 629567, 626943, 624236, 621300, 617062, 610748, 602713, 593922, 584995]
51845E84995r063r424r734r357p807n350k968j391l38R62K702M277N032M890M242
51830E51668L462K622J618M64n98j339j742j794j257K0J674L108M131M890N142
51815E72069M197J765j476m439o435p372p506p195o566n355l353j038O86J427
51801E29409J546J420J171J134J859L150L864L207J711M32k74n97n68k58k72j123
51785E45811k311k885k758k631k676k209p82J263L608O457R701J2350J3562J3798
51771E90298J4155J4671J4078J1328O841J925k482o082q653r922j0125j0080j0363
51758E95589j0672j0424r684r031q570p694o048m261l335l482l839l332j617O96
51744E14296K573L319L074K625K784L836N429O793P246O813O375O814P929Q444
$$ y = [584995, 575932, 566508, 556774, 547417, 539610, 534260, 531292, 529901, 529563, 530525, 533227, 537504, 542536, 547426, 551668, 555130, 557752, 559370, 559834, 559236, 557897, 556155, 554361, 553104, 553124, 554798, 557906, 562037, 566927, 572069, 576266, 578031, 576555, 572116, 565681, 558309, 550803, 543608, 537042, 531687, 528334, 527296, 527982, 529409, 530955, 532375, 533546, 534680, 536539, 539689, 543553, 546760, 548471, 548903, 548629, 548032, 547464, 547206, 546934, 545811, 543500, 540615, 537857, 535226, 532550, 530341, 529559, 530822, 534430, 540887, 550588, 562938, 576500, 590298, 604453, 619124, 633202, 644530, 651371, 653296, 650814, 644732, 636079, 626157, 616032, 605952, 595589, 584917, 574493, 564809, 555778, 547208, 539514, 533466, 529205, 525870, 522388, 518549, 515217, 513600, 514296, 516869, 520188, 523262, 525887, 528671, 532507, 537936, 544729, 551975, 558788, 565163, 571977, 579906, 588350]
51730E88350P242M395R94j659k600j408J645N642R309J1310J0560O866J445l625
51716F38466o836q010p653o067l506p58J029J213J48j063j169M95L368N760O001
51701F21418L741J00l276n245n542m498k487L66L832O949Q180O538K504k316o310
51686F23954q612r132q306o826n262l917k972k613k873l566m472n395n932n567
51672E48509m250k522q20J113L728O979J0557J4521J8973K3092K5196K4058J9908
51659F89042J3939P237M91n601j0139j2495j2788j1704r835p273m024o98J436
51646F37588J251j394n571r831j2857j4042j3680j2558j1225r800q393p305o523
51633E25660n452l636j518P5J012J879K907L491L088J974P42n14j951l204l671
$$ y = [588350, 595592, 599987, 600981, 599322, 596722, 595314, 596959, 602601, 611910, 623220, 633780, 640646, 642091, 638466, 631630, 623620, 615967, 609900, 606394, 605636, 606665, 607878, 608026, 606963, 605794, 606289, 609657, 615417, 621418, 625159, 625259, 621983, 616738, 611196, 606698, 604211, 604577, 608409, 615358, 623538, 630076, 632580, 630264, 623954, 615342, 606210, 597904, 591078, 585816, 581899, 578927, 576314, 573441, 569875, 565403, 560008, 554076, 548509, 544259, 541737, 540917, 542030, 545758, 552737, 563294, 577815, 596788, 619880, 645076, 669134, 689042, 702981, 710218, 710709, 705108, 694969, 682474, 669686, 657982, 648147, 640874, 636850, 636152, 637588, 638839, 637445, 631874, 622043, 609186, 595144, 581464, 568906, 557681, 547881, 539488, 532183, 525660, 520208, 516572, 515054, 515129, 516141, 518020, 520927, 524418, 527506, 529480, 530222, 529708, 527757, 524553, 520882]
51618E20882l568l878m937n709n117l618k649k715k960k652k114j781j326l83
51604D77475N55Q65R03J566K981M565O115P981J0279J2772J5335J7602J8140J5277
51590E92411R138K000l733p212q686q453o904m668k013J310N194Q865J2024J5451
51576F04724J9626K3477K5465K5574K5340K6098K7880K9756L0513K9258K6237
51565H93948K3077K1737K3123K6978L2667L9497M6501N2467N6079N5750M9960
51554A321784L8571K3529P631p316k0675l2026m0997m7792n2937n6417n7816n7255
51542A018284n5432n2742m9027m4200l8536l2392k6281k1023j7140j4139j1110
51531F56262p978n417l615k046n46K56j38j497l383n502p330q114p694o709n762
$$ y = [520882, 517314, 513436, 508499, 502790, 497673, 494055, 491406, 488691, 485731, 483079, 480965, 479184, 477858, 477475, 478030, 478895, 479798, 481364, 484345, 488910, 495025, 503006, 513285, 526057, 541392, 558994, 577134, 592411, 601549, 603549, 599816, 592604, 583918, 575465, 568561, 563893, 561880, 563190, 568384, 577249, 589273, 604724, 624350, 647827, 673292, 698866, 724206, 750304, 778184, 807940, 838453, 867711, 893948, 917025, 938762, 961885, 988863, 1021530, 1061027, 1107528, 1159995, 1216074, 1271824, 1321784, 1360355, 1383884, 1391515, 1384199, 1363524, 1331498, 1290501, 1242709, 1189772, 1133355, 1075539, 1018284, 962852, 910110, 861083, 816883, 778347, 745955, 719674, 698651, 681511, 667372, 656262, 648284, 642867, 639252, 637206, 636660, 636916, 636778, 635281, 631898, 626396, 619066, 610952, 603258, 596549, 590787]
51516E90787m865l986l421l254l085k735k698l431m554n260n217m730m273m086
51502E35192m022l613k565j293n87o84j110j507k009k584k699k084j252p89n53
51487E07841j64Q8m56j748k818k791j830r65j046j882k433j971r16k76l59n75
51471D87699m81m23q46j572k133k387k400k083j346m62K30O69R00P57J28o68j133
51454D74449j104o94R3J320K767M080N202O472Q304J0951J4467J8399K1483K1957
51440E88146J8722J2436N430L65j339K6L163O533Q444P290K630l969r837j3278
51426F24762j4458j4346j3464j1853r624p130m843l272k672k622k360j722j306
51413E35090j480j764j576j080p44n44j68L12N62O21Q58J376J993K740L812N047
$$ y = [590787, 585922, 581936, 578515, 575261, 572176, 569441, 566743, 563312, 558758, 553498, 548281, 543551, 539278, 535192, 531170, 527557, 524992, 523699, 523112, 522428, 521318, 519811, 517802, 515218, 512519, 510435, 509183, 508394, 507841, 507677, 507765, 507309, 505561, 502743, 499952, 498122, 497157, 496111, 494229, 491796, 489825, 488909, 488633, 488274, 487699, 487218, 486795, 485949, 484377, 482244, 479857, 477457, 475374, 474028, 473566, 473796, 474465, 475365, 476122, 476250, 475582, 474449, 473345, 472651, 472744, 474064, 476831, 480911, 486113, 492585, 500889, 511840, 526307, 544706, 566189, 588146, 606868, 619304, 624734, 625099, 623760, 623786, 626949, 633482, 641926, 649216, 651846, 647877, 638040, 624762, 610304, 595958, 582494, 570641, 561017, 553887, 549044, 545772, 543100, 540478, 538118, 536396, 535090, 533610, 531846, 530270, 529190, 528446, 527902, 527734, 528046, 528608, 529229, 530087, 531463, 533456, 536196, 540008, 545055]
51397E45055N962O415O858P789R238J0920J2645J4456J6518J9011K2043K5630
51385G02540K9815L4719M0436M6890N3819O0730O6929P1899P5716P8717Q0354
51374A342564P8648P1265N7393L8560J7664k732k1421l8185n2624o3711p0654
51363A356767p4017p5242p5017p2791o8174o2133n6125n0565m4977l9310l4194
51352G04222k9906k5898k1707j7742j4813j3210j2536j2218j1864j1275j0362
51341E22691r119p600n958m393l078k101j519j332j309j073n30p3r3m51o77n10
51325D82875QR07K322M057N441N764M774K787N13j253j986j707q92j28J85Nl72
51308E03300o07p23j063j738k359k521k352k350k817l649m515m975m739m031l456
$$ y = [545055, 551017, 557432, 564290, 572079, 581317, 592237, 604882, 619338, 635856, 654867, 676910, 702540, 732355, 767074, 807510, 854400, 908219, 968949, 1035878, 1107777, 1183493, 1262210, 1342564, 1421212, 1492477, 1549870, 1588430, 1606094, 1603362, 1581941, 1543756, 1491132, 1427421, 1356767, 1282750, 1207508, 1132491, 1059700, 991526, 929393, 873268, 822703, 777726, 738416, 704222, 674316, 648418, 626711, 608969, 594156, 580946, 568410, 556192, 544328, 533053, 522691, 513572, 505972, 500014, 495621, 492543, 490442, 488923, 487591, 486282, 485209, 484679, 484606, 484513, 484062, 483385, 482875, 482883, 483790, 486112, 490169, 495610, 501374, 506148, 508935, 509448, 508195, 506209, 504502, 503610, 503482, 503667, 503672, 503300, 502693, 501970, 500907, 499169, 496810, 494289, 491937, 489587, 486770, 483121, 478606, 473631, 468892, 464861, 461405]
51293D61405l162k496r71P61J588J414J244J789K802L851M989O296P502Q515R621
51278E05148J0616J0316P809L927O35j023j625k035k212j671n22O37J554K473
51264E34027L515M352M589M139L050J358o88k454l387l587l651l954m399m818
51250E28092n221n506n355m729m185m249m673m709m080l206k550k150j833j489
51236D74157j027m10J06K46K97R56K323L553L849L396K865K373J640Q99Q55J627
51220D97705K473K739K531K147J441K88p61r22j87O66J022R82R09R28J066J515
51204E14542K409L487M270M467M030K959J415l4p25o40n55j059j711j549m32P15
51188E31589J173J351J987K866L090K517K026K110K003Q02j118k511k861k776
$$ y = [461405, 458243, 455747, 454776, 455537, 457125, 458539, 459783, 461572, 464374, 468225, 473214, 479510, 487012, 495527, 505148, 515764, 526080, 533889, 537816, 538451, 537428, 535803, 533768, 531556, 529885, 529363, 530000, 531554, 534027, 537542, 541894, 546483, 550622, 553672, 555030, 554342, 551888, 548501, 544914, 541263, 537309, 532910, 528092, 522871, 517365, 512010, 507281, 503096, 498847, 494174, 489465, 485385, 482179, 479629, 477479, 475646, 474157, 473130, 472720, 472826, 473072, 473369, 474325, 476648, 480201, 484050, 487446, 490311, 492684, 494324, 495223, 496078, 497705, 500178, 502917, 505448, 507595, 509036, 509324, 508563, 507641, 507454, 508120, 509142, 510124, 511033, 511961, 513027, 514542, 516951, 520438, 524708, 529175, 533205, 536164, 537579, 537545, 536820, 536180, 535625, 534566, 532855, 531306, 530874, 531589, 532762, 534113, 536100, 538966, 542056, 544573, 546599, 548709, 550712, 551514, 550396, 547885, 545024, 542248]
51174E42248k832k788k213j331q19j001j527j751j264j01J437L034M388N013M485
51159E44978L094J837J277P63o36k643m101m607m854n229n140m222l208k850k778
51144E11681k290j662j683k287k561j999q33O34K172L153K872J560L53N3N03J260
51128E10926K173L091L689L930M225M764N106M770L858K767J631L88q32j657j807
51113E47022j296m65K10M67M49L73K05j34m12l42o8Q5J67M32P48P82O47O77O05
51094E50152k00j534k325k006j150l83L73J144J290N10l01j18P83J326J200R77
51078E49738R28P09K62J12N05J046J441J973K939M015M651M790M884N392O518
51063E89903Q262J0418J2609J4543J6346J8522K1386K4499K6568K6113K2493J6523
$$ y = [542248, 539416, 536628, 534415, 533084, 532265, 531264, 529737, 527986, 526722, 526621, 528058, 531092, 535480, 540493, 544978, 548072, 549909, 551186, 551949, 551313, 548670, 544569, 539962, 535108, 529879, 524739, 520517, 517309, 514459, 511681, 509391, 507729, 506046, 503759, 501198, 499199, 498366, 499000, 501172, 504325, 507197, 508757, 509110, 509163, 509666, 510926, 513099, 516190, 519879, 523809, 528034, 532798, 537904, 542674, 546532, 549299, 550930, 551318, 550486, 548829, 547022, 545726, 545261, 545471, 545938, 546387, 546760, 546965, 546831, 546419, 546077, 546009, 546094, 546261, 546693, 547441, 548223, 548870, 549547, 550152, 549952, 548418, 546093, 544087, 542937, 542554, 542927, 544071, 545361, 545871, 545570, 545452, 546235, 547561, 548761, 549738, 550666, 551375, 551637, 551749, 552254, 553300, 554741, 556714, 559653, 563668, 568319, 573109, 577993, 583385, 589903, 598165, 608583, 621192, 635735, 652081, 670603, 691989, 716488, 743056, 769169, 791662, 808185]
51051H08185J0242N895M762O495R346J1199J0686P751L550k43k541l789n611r082
51037H56845j3339j6169j5851j2226o453n48L047K625j356o481j0432j2591j3513
51024G53558j3472j2241r882p070m490k355m90J291L004M665O519Q929J1849J4615
51010G54430J6582J7768J8446J8392J7188J5131J3009J0984Q576N802L395J491
50998I01194p71l783o579q177r027j0136j1397j1787j0858r125p149n105l067
50985H04233r74J545M636P626R730J1204J3071J5720J8442K0285K0839K0279J9309
50972I65945J9015K0115K2293K4800K7603L1283L5865M0482M4379M7689N0929
50961A330398N4188N7054N9011N9754N9284N7798N5320N1586M6535M0730L4957
$$ y = [808185, 818427, 824322, 829084, 835579, 844925, 856124, 866810, 874561, 878111, 877868, 875327, 871538, 865927, 856845, 843506, 827337, 811486, 799260, 792807, 792259, 795306, 797931, 796575, 790094, 779662, 767071, 753558, 740086, 727845, 717963, 710893, 706403, 704048, 703558, 704849, 707853, 712518, 719037, 727966, 739815, 754430, 771012, 788780, 807226, 825618, 842806, 857937, 870946, 881930, 890506, 896308, 899703, 901194, 900423, 896640, 890061, 881884, 872857, 862721, 851324, 839537, 828679, 819554, 812405, 807300, 804233, 803259, 804804, 809440, 817066, 826796, 838000, 851071, 866791, 885233, 905518, 926357, 946636, 965945, 984960, 1005075, 1027368, 1052168, 1079771, 1111054, 1146919, 1187401, 1231780, 1279469, 1330398, 1384586, 1441640, 1500651, 1560405, 1619689, 1677487, 1732807, 1784393, 1830928, 1871658, 1906615]
50950A906615K9501K4248J9265J4859J1149Q111O103N811P438J0014J1576J0207
50938B064897N462j004o569r895j1756j3560j5699j7829k0016k2676k5825k9254
50926A896276l3199l7965m3093m7738n1651n4907n6910n6690n4333n1101m8048
50915A360641m5243m2426l9503l6313l2756k9358k6884k5172k3225k0684j8293
50904A020784j6659j5455j4258j3283j2619j1583r633p368n845n201m623l573
50892I00684k365j587j297j017l21O77J470J839K153K855L893N006O195P479Q462
50877I34126Q799Q874R259R797R977J0078J0936J2523J3796J4216J4450J5306
50865A072137J6843J8901K1563K4608K7408K9873L2805L6717M1100M5444N0214
$$ y = [1906615, 1936116, 1960364, 1979629, 1994488, 2005637, 2013748, 2019851, 2025662, 2033100, 2043114, 2054690, 2064897, 2070359, 2069355, 2062786, 2052891, 2041135, 2027575, 2011876, 1994047, 1974031, 1951355, 1925530, 1896276, 1863077, 1825112, 1782019, 1734281, 1682630, 1627723, 1570813, 1514123, 1459790, 1408689, 1360641, 1315398, 1272972, 1233469, 1197156, 1164400, 1135042, 1108158, 1082986, 1059761, 1039077, 1020784, 1004125, 988670, 974412, 961129, 948510, 936927, 927294, 919926, 914081, 908880, 904257, 900684, 898319, 896732, 895435, 894418, 894097, 894774, 896244, 898083, 900236, 903091, 906984, 911990, 918185, 925664, 934126, 942925, 951799, 961058, 970855, 980832, 990910, 1001846, 1014369, 1028165, 1042381, 1056831, 1072137, 1088980, 1107881, 1129444, 1154052, 1181460, 1211333, 1244138, 1280855, 1321955, 1367399, 1417613]
50854A417613N6090O2866O9829P6778Q3905R1064R7904J04489J11114J17691J23754
50843B413097J28909J32758J34685J34088J30595J23761J12988R8300Q0940O2701
50833C552822M4825K7830J2121j751j3247k1980k7763l0687l0932k8414k3016
50822C459808j5271o381K463J0156J5124J5562J0765J586j0660k5011m0327n5148
50810C362666o8881q2279r5821j08310j17973j24309j27815j28491j25831j20039
50800B262917j12090j02638r1860q0342o9160n8994m9857m1657l4307k7371k0357
50789A574284j3413p100j662K820N845P038P076P013O713N124K205o85k693m521
50775A588044o922r308j0840j1981j3811j6342j8688k0662k2974k5717k7841k8551
$$ y = [1417613, 1473703, 1536569, 1606398, 1683176, 1767081, 1858145, 1956049, 2060538, 2171652, 2289343, 2413097, 2542006, 2674764, 2809449, 2943537, 3074132, 3197893, 3310881, 3409181, 3490121, 3552822, 3597647, 3625477, 3637598, 3635847, 3622600, 3600620, 3572857, 3542170, 3511238, 3482824, 3459808, 3444537, 3438156, 3440619, 3450775, 3465899, 3481461, 3492226, 3493812, 3483152, 3458141, 3417814, 3362666, 3293785, 3211506, 3115685, 3007375, 2889402, 2765093, 2637278, 2508787, 2382956, 2262917, 2150827, 2048189, 1956329, 1875987, 1806827, 1747833, 1697976, 1656319, 1622012, 1594641, 1574284, 1560871, 1553771, 1552109, 1554929, 1560774, 1567812, 1574888, 1581901, 1588614, 1593738, 1595943, 1595258, 1592565, 1588044, 1581122, 1571814, 1560974, 1548993, 1535182, 1518840, 1500152, 1479490, 1456516, 1430799, 1402958, 1374407]
50763A374407k8446k8559k8830k8200k6086k3047k0013j7422j5265j3419j1544
50752A133576r024n651k182K90J669L043N462Q963J2916J6893K0864K4864K8876
50739A240559L2972L7243M1630M5905M9755N2960N5659N8389O1484O4416O6223
50728A807195O6692O6600O6639O6611O5970O4559O2313N8716N3107M5229L5102
50717B458733K2788Q810n528j8745k9822l7847m1691m0891l6595l0698k4125j6728
50705B207661q748j391M344Q599J1912J4007J3822J0487L945n204j6152k8121
50693B215161m0254n1398o0280o6070o8746o8769o6626o2826n8006n2606m6536
50682A573044l9522l1723k3711j5952q538j323N918J3332K0756K7794L4284M0382
$$ y = [1374407, 1345961, 1317402, 1288572, 1260372, 1234286, 1211239, 1191226, 1173804, 1158539, 1145120, 1133576, 1124552, 1118901, 1116719, 1117009, 1118678, 1121721, 1127183, 1136146, 1149062, 1165955, 1186819, 1211683, 1240559, 1273531, 1310774, 1352404, 1398309, 1448064, 1501024, 1556683, 1615072, 1676556, 1740972, 1807195, 1873887, 1940487, 2007126, 2073737, 2139707, 2204266, 2266579, 2325295, 2378402, 2423631, 2458733, 2481521, 2490331, 2484803, 2466058, 2436236, 2398389, 2356698, 2315807, 2279212, 2248514, 2224389, 2207661, 2198913, 2197522, 2201866, 2210465, 2222377, 2236384, 2250206, 2260693, 2264638, 2259434, 2243282, 2215161, 2174907, 2123509, 2063229, 1997159, 1928413, 1859644, 1793018, 1730192, 1672186, 1619580, 1573044, 1533522, 1501799, 1478088, 1462136, 1453598, 1452275, 1458193, 1471525, 1492281, 1520075, 1554359, 1594741]
50670A594741M5895M9932N1703N1351M9518M6386M1759L6013L0176K5078K0794
50659B043346J7050J3708J0811Q475O687N001K660o24m156o934q641r446r175
50646B068762p360m080j07L941Q043J2348J6805K1231K5255K8177K9432K9314
50634B231761K8722K8062K6882K4832K2407K0531J9799K0441K2532K5412K6784
50623B498165K2968J1000q638l1249n0356o1550o4322o0666n2885m2939l2783
50612B126745k3871j6326r395k825K745O650Q798R252P809M130j981j0266j9698
50599B081767k8726l6386m2892m8617n2911n4727n4192n2560n0702m8544m6021
50588A565489m3581m1543l9761l8127l6681l5064l2750k9981k7664k6071k4427
$$ y = [1594741, 1640636, 1690568, 1742271, 1793622, 1843140, 1889526, 1931285, 1967298, 1997474, 2022552, 2043346, 2060396, 2074104, 2084915, 2093390, 2100077, 2105078, 2107738, 2107114, 2102958, 2096024, 2087383, 2077937, 2068762, 2061402, 2057322, 2057215, 2061156, 2069199, 2081547, 2098352, 2119583, 2144838, 2173015, 2202447, 2231761, 2260483, 2288545, 2315427, 2340259, 2362666, 2383197, 2402996, 2423437, 2445969, 2471381, 2498165, 2521133, 2532133, 2523495, 2492246, 2441890, 2380340, 2316018, 2255352, 2202467, 2159528, 2126745, 2102874, 2086548, 2077153, 2074328, 2077073, 2083723, 2092521, 2101773, 2109582, 2113712, 2111731, 2101465, 2081767, 2053041, 2016655, 1973763, 1925146, 1872235, 1817508, 1763316, 1710756, 1660054, 1611510, 1565489, 1521908, 1480365, 1440604, 1402477, 1365796, 1330732, 1297982, 1268001, 1240337, 1214266, 1189839]
50577A189839k2068j9156j5891j1986p417k943O67L362N306O509P365Q741J0824
50564A153152J2694J3747J4897J7361K0855K3952K5958K7489K9347L1701L4392
50553A405545L7258M0076M2592M4722M6283M6729M5587M3132M0157L7270L4814
50542A864165L3310L3285L4645L6732L9147M2037M5387M8441N0234N0620N0606
50531B328609N1577N4169N7977O2375O7476P3812Q1021Q7430R1403R2863R3038
50520C141750R2775R1556Q8168Q1873P2698O0919M6755L0656J3633l204j9544
50509C698035l5980n2867o9308q3622r4685j02324j06511j06876j03167r5720
50499B846975q5142p1993n6968m0903k4330p435R285K4661L7544M7378N3736N5670
$$ y = [1189839, 1167771, 1148615, 1132724, 1120738, 1113321, 1110378, 1111045, 1114407, 1119713, 1126222, 1133587, 1142328, 1153152, 1165846, 1179593, 1194490, 1211851, 1232706, 1256658, 1282616, 1310105, 1339452, 1371153, 1405545, 1442803, 1482879, 1525471, 1570193, 1616476, 1663205, 1708792, 1751924, 1792081, 1829351, 1864165, 1897475, 1930760, 1965405, 2002137, 2041284, 2083321, 2128708, 2177149, 2227383, 2278003, 2328609, 2380186, 2434355, 2492332, 2554707, 2622183, 2695995, 2777016, 2864446, 2955849, 3048712, 3141750, 3234525, 3326081, 3414249, 3496122, 3568820, 3629739, 3676494, 3707150, 3720783, 3717579, 3698035, 3662055, 3609188, 3539880, 3456258, 3361573, 3259249, 3152738, 3045862, 2942695, 2846975, 2761833, 2689840, 2632872, 2591969, 2567639, 2560204, 2569489, 2594150, 2631694, 2679072, 2732808, 2788478]
50487B788478N2073M2509K7387P586j5539l9926o3065q2713r7450j06862j11529
50476B400949j12593j10992j07095j01134r3704q5524p7012o8369o0068n2876
50466A531582m7389m3599m0872l8368l5670l3067l0948k9002k6428k3004j9359
50455A163876j6046j2887r573o406l871j874Q6K249M504O817R281J1862J4495
50442A162513J7178J9642K1058K0583J8255J5036J1999R592P692O168N326N647
50430A320689O950Q086P997P055O667P424Q441Q831R057J0174J2372J5061J7952
50417A446756K1221K4872K8694L2732L7106M1425M5104M8150N1101N4136N6773
50406A888070N8455N8848N7705N5018N1390M7626M3832L9313L3336K5606J6041
$$ y = [2788478, 2840551, 2883060, 2910447, 2918033, 2902494, 2862568, 2799503, 2716790, 2619340, 2512478, 2400949, 2288356, 2177364, 2070269, 1969135, 1875431, 1789907, 1712895, 1644526, 1584458, 1531582, 1484193, 1440594, 1399722, 1361354, 1325684, 1292617, 1261669, 1232667, 1206239, 1183235, 1163876, 1147830, 1134943, 1125370, 1118964, 1115093, 1113219, 1113305, 1115554, 1120058, 1126875, 1136156, 1148018, 1162513, 1179691, 1199333, 1220391, 1240974, 1259229, 1274265, 1286264, 1295856, 1303548, 1309716, 1315042, 1320689, 1327639, 1335725, 1343722, 1350777, 1357444, 1364868, 1373309, 1382140, 1391197, 1401371, 1413743, 1428804, 1446756, 1467977, 1492849, 1521543, 1554275, 1591381, 1632806, 1677910, 1726060, 1777161, 1831297, 1888070, 1946525, 2005373, 2063078, 2118096, 2169486, 2217112, 2260944, 2300257, 2333593, 2359199, 2375240]
50395B375240M786p428j9547l1019m1956n2193o0798o6795o9996p0647o8666o3807
50383A827174n6551m8239m0080l2252k4233j5843p542K24P478J4116J9266K1844
50371A665362K1647J9273J5017Q513k35j0242k0284k9580l7333m2431m4456m4500
50359A500751m4025m3136m0868l7020l2876k9918k8463k7639k6085k2721j7448
50348A150552j1343n719j109K371L765J386n373j4742k3523k9174l1043l0113
50336A005935k7912k5336k2340j8731j5035j2132j0155q330o043l517j287M60
50324H55577J809K776L454M163N154O296P209P620P576P544Q157R537J0943J1537
50310I49352J1516J1953J3387J5192J6545J7483J8557J9876K1025K1781K2408
$$ y = [2375240, 2380026, 2372598, 2353051, 2322032, 2280076, 2227883, 2167085, 2100290, 2030294, 1959647, 1890981, 1827174, 1770623, 1722384, 1682304, 1650052, 1625819, 1609976, 1602434, 1602658, 1610136, 1624252, 1643518, 1665362, 1687009, 1706282, 1721299, 1729812, 1729577, 1719335, 1699051, 1669471, 1632138, 1589707, 1545251, 1500751, 1456726, 1413590, 1372722, 1335702, 1302826, 1272908, 1244445, 1216806, 1190721, 1168000, 1150552, 1139209, 1133490, 1132381, 1134752, 1138517, 1139903, 1134530, 1119788, 1096265, 1067091, 1036048, 1005935, 978023, 952687, 930347, 911616, 896581, 884449, 874294, 865964, 859921, 856404, 855117, 855577, 857386, 860162, 863616, 867779, 872933, 879229, 886438, 894058, 901634, 909178, 917335, 926872, 937815, 949352, 960868, 972821, 986208, 1001400, 1017945, 1035428, 1053985, 1073861, 1094886, 1116667, 1139075]
50299A139075K3318K4678K6378K8032K8849K7552K2622J3221L63j2947k3279k8878
50287A268984l0175k8637k5592k2027j8560j5170j1460p605m527k715j321R35
50275A102130M202P374R425J0336J0785J1463J2738J4499J6158J7109J7423J7873
50263A251515J9131K1060K3053K4917K7240L0762L5504M0662M5280M8806N0983
50252A618913N1532N0331M7745M4342M0316L5619L0803K7156K5591K5633K5884
50241B023865K5198K2991J8598J1154M63j2392k5604l7682m7715n4924n8563n8382
50229A807007n4955m9330m2504l5297k8547k3224k0393k0951k4989l1053l6518
50218A439246l9322l9405l8071l6124l3342k9742k6286k3737k1602j9009j6218
$$ y = [1139075, 1162393, 1187071, 1213449, 1241481, 1270330, 1297882, 1320504, 1333725, 1334088, 1321141, 1297862, 1268984, 1238809, 1210172, 1184580, 1162553, 1143993, 1128823, 1117363, 1109758, 1105231, 1102516, 1101195, 1102130, 1106332, 1113706, 1123131, 1133467, 1144252, 1155715, 1168453, 1182952, 1199110, 1216219, 1233642, 1251515, 1270646, 1291706, 1314759, 1339676, 1366916, 1397678, 1433182, 1473844, 1519124, 1567930, 1618913, 1670445, 1720776, 1768521, 1812863, 1853179, 1888798, 1919601, 1946757, 1972348, 1997981, 2023865, 2049063, 2072054, 2090652, 2101806, 2102269, 2089877, 2064273, 2026591, 1978876, 1923952, 1865389, 1807007, 1752052, 1702722, 1660218, 1624921, 1596374, 1573150, 1552757, 1531806, 1506817, 1475764, 1439246, 1399924, 1360519, 1322448, 1286324, 1252982, 1223240, 1196954, 1173217, 1151615, 1132606, 1116388]
50207A116388j4313j3660j3572j3533j3765j4355j4665j4103j2987j2062j1521
50196I67852j1001j0292r603r125q744q203p314o005m338k555r79J82R01J284
50182H92060J584K141L165M433N408N755N742N960O612P322P724P950Q311Q648
50168I72815Q550Q044P649P606P615P407P107O783O198N335M689M680N287O608
50154A066373R097J2595J5777J7505J8260J9324K0759K1481K1350K1985K4942
50143A269448K9955L5556M0850M6218N2678O0974P0902Q1136Q9911R6153R9695
50132A973476J00490R8322R3727Q8518Q4734Q3111Q2901Q2690Q0826P5236O3779
50121B907810M5542K1819m386l0086n3595p4315r1624j04603j12897j17162j18230
$$ y = [1116388, 1102075, 1088415, 1074843, 1061310, 1047545, 1033190, 1018525, 1004422, 991435, 979373, 967852, 956851, 946559, 936956, 927831, 919087, 910884, 903570, 897565, 893227, 890672, 889693, 889875, 890776, 892060, 893644, 895785, 898950, 903383, 908791, 914546, 920288, 926248, 932860, 940182, 947906, 955856, 964167, 972815, 981365, 989409, 997058, 1004664, 1012279, 1019686, 1026793, 1033576, 1039774, 1045109, 1049798, 1054478, 1059765, 1066373, 1075470, 1088065, 1103842, 1121347, 1139607, 1158931, 1179690, 1201171, 1222521, 1244506, 1269448, 1299403, 1334959, 1375809, 1422027, 1474705, 1535679, 1606581, 1687717, 1777628, 1873781, 1973476, 2073966, 2172288, 2266015, 2354533, 2439267, 2522378, 2605279, 2687969, 2768795, 2844031, 2907810, 2953352, 2975171, 2970785, 2940699, 2887104, 2812789, 2721165, 2616562, 2503665, 2386503, 2268273]
50110B268273j16196j10926j02993r3499q3302p3150o4213n7430n2486m8438m5245
50099A420395m3477m2487m0326l6062l0917k6444k2749j9366j6658j5067j3896
50088A112946j2271j0766j0668j1840j2734j2521j1964j1922j2123j1768j0504
50077I83865q439n885l459j791q16J87J629L234M750O357Q082R431J0061J0293
50063A017499J0502J0442R712Q488P276O173M994L921L435L505L462K887K149
50050A094445J762J537Q19m62j429j160L01K053L382M421N720P438R216J0682
50036A138725J1883J3147J4706J6552J8551K0558K2350K3615K4182K4384K5044
50025A353697K6814K9583L2680L5748L9139M3374M8384N3393N7376N9507N9377
$$ y = [2268273, 2152077, 2041151, 1938158, 1844659, 1761357, 1688207, 1623994, 1566564, 1514078, 1465640, 1420395, 1376918, 1334431, 1294105, 1258043, 1227126, 1200682, 1177933, 1158567, 1141909, 1126842, 1112946, 1100675, 1089909, 1079241, 1067401, 1054667, 1042146, 1030182, 1018260, 1006137, 994369, 983865, 975426, 969541, 966082, 964291, 963475, 963662, 965291, 968525, 973275, 979632, 987714, 997145, 1007206, 1017499, 1028001, 1038443, 1048155, 1056643, 1063919, 1070092, 1075086, 1079007, 1082442, 1085947, 1089409, 1092296, 1094445, 1096207, 1097744, 1098563, 1098101, 1096672, 1095512, 1095813, 1097866, 1101248, 1105669, 1111389, 1118827, 1128043, 1138725, 1150608, 1163755, 1178461, 1195013, 1213564, 1234122, 1256472, 1280087, 1304269, 1328653, 1353697, 1380511, 1410094, 1442774, 1478522, 1517661, 1561035, 1609419, 1662812, 1720188, 1779695, 1839072]
50014A839072N7212N3873N0436M7556M5251M3215M1286L9586L8294L7276L5897
50003B328954L3002K7044J6521Q86j8554l8854n7005p1432q1991q8923r2392r2960
49991A864296r1673q9278q5695q0599p4229o7305o0374n3551m6787m0182l4101
49980A140522k9053k5218k2069j8723j4905j1277q628p031n967m958l762k284
49968I86647p01O03J554K585L985N325O171P079R174J2624J6228J8728J9957K0234
49954A110193J9199J5992J0647M642k25l295n146o578p970r603j1991j5405j9331
49941A081129k2747k4796k4976k3030j9444j5853j4138j4672j5968j6400j5788
49930H73317j4927j4149j2974j0980q378n772l678k263j190J66K106M299O265
$$ y = [1839072, 1896284, 1950157, 2000593, 2048149, 2093400, 2136615, 2177901, 2217487, 2255781, 2293057, 2328954, 2361956, 2389000, 2405521, 2406407, 2387853, 2348999, 2291994, 2220562, 2138571, 2049648, 1957256, 1864296, 1772623, 1683345, 1597650, 1517051, 1442822, 1375517, 1315143, 1261592, 1214805, 1174623, 1140522, 1111469, 1086251, 1064182, 1045459, 1030554, 1019277, 1010649, 1003618, 997651, 992693, 988931, 986647, 985946, 986549, 988103, 990688, 994673, 999998, 1006169, 1013248, 1022422, 1035046, 1051274, 1070002, 1089959, 1110193, 1129392, 1145384, 1156031, 1160673, 1160448, 1157153, 1152007, 1145429, 1137459, 1127856, 1115865, 1100460, 1081129, 1058382, 1033586, 1008610, 985580, 966136, 950283, 936145, 921473, 905505, 889105, 873317, 858390, 844241, 831267, 820287, 811909, 806137, 802459, 800196, 799006, 799172, 801278, 805577, 811842]
49917H11842P883R171R890R831R339Q972Q865Q886R381J1032J3796J6449J7527
49904I52864J6483J3826J0534P611N815N296N347M746K581j216o016j1098j5926
49891I90847j9901k2227k2436k1058j9325j8001j6769j4954j2452r734p300n545
$$ y = [811842, 819725, 828896, 838786, 848617, 857956, 866928, 875793, 884679, 894060, 905092, 918888, 935337, 952864, 969347, 983173, 993707, 1001318, 1007133, 1012429, 1017776, 1022522, 1025103, 1023887, 1017871, 1006773, 990847, 970946, 948719, 926283, 905225, 885900, 867899, 851130, 836176, 823724, 813990, 806690, 801145]
$$ [...]
##END NTUPLES=NMR SPECTRUM
##END=
