##TITLE=AC1727_3474_9208054_ibkSnlMSrY
##JCAMPDX= 6.0         $$ Bruker NMR JCAMP-DX V2.0
##DATA TYPE= NMR SPECTRUM
##DATA CLASS= NTUPLES
##ORIGIN= BRUKER
##OWNER= Administrator
$$ 1.72 TOPSPIN		Version 2.1
$$ 2015-07-09 22:12:20.628 -0700  Administrator@X
$$ Compression mode = diff/dup
##.OBSERVE FREQUENCY= 400.02188249412
##.OBSERVE NUCLEUS= ^1H
##.ACQUISITION MODE= SIMULTANEOUS (DQD)
##.ACQUISITION SCHEME= undefined
##.AVERAGES= 8
##.DIGITISER RES= 22
##SPECTROMETER/DATA SYSTEM= spect
##.PULSE SEQUENCE= zg30
##.SOLVENT NAME= COFFEE_meoh
##.SHIFT REFERENCE= INTERNAL, COFFEE_meoh, 1, 14.98509
##AUDIT TRAIL= $$ (NUMBER, WHEN, WHO, WHERE, PROCESS, VERSION, WHAT)
$$ ##TITLE= Audit trail, TOPSPIN		Version 2.1
$$ ##JCAMPDX= 5.01
$$ ##ORIGIN= Bruker BioSpin GmbH
$$ ##OWNER= Administrator
$$ $$ E:\/data/COFFEE/nmr/AC1727_3474_9208054_ibkSnlMSrY/30/pdata/1/auditp.txt
$$ ##AUDIT TRAIL=  $$ (NUMBER, WHEN, WHO, WHERE, PROCESS, VERSION, WHAT)
(   1,<2015-07-09 22:12:13.363 -0700>,<Administrator>,<X>,<go>,<TOPSPIN 2.1>,
      <created by zg
	started at 2015-07-09 22:11:06.910 -0700,
	POWCHK enabled, PULCHK disabled,
       configuration hash MD5:
       21 0F 79 D6 B3 7B B4 F6 88 20 88 DB 03 48 BD 9F
       data hash MD5: 64K
       EA 5D EA 7B 9E 1B F9 61 D9 24 63 7E 13 40 0A 3F>)
(   2,<2015-07-09 22:12:16.488 -0700>,<Administrator>,<X>,<proc1d>,<TOPSPIN 2.1>,
      <Start of raw data processing
       efp LB = 0 FT_mod = 6 PKNL = 1 PHC0 = 0 PHC1 = 0 SI = 32K 
       data hash MD5: 32K
       D3 B6 E7 B4 28 EB F7 2C 6D 68 68 57 E2 19 4A A8>)
(   3,<2015-07-09 22:12:16.800 -0700>,<Administrator>,<X>,<proc1d>,<TOPSPIN 2.1>,
      <pk PHC0 = 89.46716 PHC1 = 0 
       data hash MD5: 32K
       D4 09 5A B0 27 60 67 F0 D2 B3 D0 22 0B E6 83 84>)
(   4,<2015-07-09 22:12:16.925 -0700>,<Administrator>,<X>,<proc1d>,<TOPSPIN 2.1>,
      <abs ABSG = 1 
       data hash MD5: 32K
       7B 97 DC 4B 69 22 B1 85 08 3E 00 69 DD DD C5 B8>)
(   5,<2015-07-09 22:12:16.988 -0700>,<Administrator>,<X>,<proc1d>,<TOPSPIN 2.1>,
      <abs ABSG = 2 
       data hash MD5: 32K
       67 26 F0 30 94 38 71 FD FD 6F BE FA 66 17 9F 4A>)
(   6,<2015-07-09 22:12:17.050 -0700>,<Administrator>,<X>,<proc1d>,<TOPSPIN 2.1>,
      <abs ABSG = 3 
       data hash MD5: 32K
       7B 29 AD EF 14 34 0D 7A 29 09 5B 95 9D 8F 4C 37>)
(   7,<2015-07-09 22:12:17.113 -0700>,<Administrator>,<X>,<proc1d>,<TOPSPIN 2.1>,
      <abs ABSG = 4 
       data hash MD5: 32K
       5C D3 CE 9B E3 00 C7 F6 C3 18 F2 EE 11 C4 DF 1B>)
(   8,<2015-07-09 22:12:17.175 -0700>,<Administrator>,<X>,<proc1d>,<TOPSPIN 2.1>,
      <abs ABSG = 5 
       data hash MD5: 32K
       8B F8 89 2A D4 98 D9 08 2F 99 02 90 B3 75 53 4D>)
$$ ##END=
$$ 
$$ $$ hash MD5
$$ $$ FE 81 56 81 89 23 44 D0 23 2A 58 F1 68 87 39 13
##$RELAX= 
##$RELAX= 
##$RELAX= 
##$RELAX= 
##$RELAX= 
##$RELAX= 
##$RELAX= 
$$ Bruker specific parameters
$$ --------------------------
##$DU= <E:\>
##$EXPNO= 30
##$NAME= <AC1727_3474_9208054_ibkSnlMSrY>
##$PROCNO= 1
$$ [...]
150 150 150 150 150 150 150 150
##$TP07= 0
##$TPNAME0= <>
##$TPNAME1= <>
##$TPNAME2= <>
##$TPNAME3= <>
##$TPNAME4= <>
##$TPNAME5= <>
##$TPNAME6= <>
##$TPNAME7= <>
##$TPOAL= (0..7)
0.5 0.5 0.5 0.5 0.5 0.5 0.5 0.5
##$TPOFFS= (0..7)
0 0 0 0 0 0 0 0
##$TUNHIN= 0
##$TUNHOUT= 0
##$TUNXOUT= 0
##$USERA1= <user>
##$USERA2= <user>
##$USERA3= <user>
##$USERA4= <user>
##$USERA5= <user>
##$V9= 5
##$VALIST= <valist>
##$VCLIST= <CCCCCCCCCCCCCCC>
##$VD= 0
##$VDLIST= <DDDDDDDDDDDDDDD>
##$VPLIST= <PPPPPPPPPPPPPPP>
##$VTLIST= <TTTTTTTTTTTTTTT>
##$WBST= 2048
##$WBSW= 25
##$XGAIN= (0..3)
0 0 0 0
##$XL= 0
##$YL= 0
##$YMAX_a= 615445
##$YMIN_a= -531602
##$ZGOPTNS= <>
##$ZL1= 120
##$ZL2= 120
##$ZL3= 120
##$ZL4= 120
##$ABSF1= 14.98509
##$ABSF2= -5.573092
##$ABSG= 5
##$ABSL= 3
##$ALPHA= 0
##$AQORDER= 0
##$ASSFAC= 0
##$ASSFACI= 0
##$ASSFACX= 0
##$ASSWID= 0
##$AUNMP= <proc_prof1d_extract_pilot.lims>
##$AXLEFT= 0
##$AXNAME= <>
##$AXNUC= <1H>
##$AXRIGHT= 0
##$AXTYPE= 0
##$AXUNIT= <>
##$AZFE= 0.1
##$AZFW= 0.1
##$BCFW= 0
##$BC_mod= 0
##$BYTORDP= 0
##$COROFFS= 0
##$CY= 15
##$DATMOD= 1
##$DC= 0
##$DFILT= <>
##$DTYPP= 0
##$F1P= 0
##$F2P= 0
##$FCOR= 0.5
##$FTSIZE= 32768
##$FT_mod= 6
##$GAMMA= 0
##$GB= 0
##$INTBC= 1
##$INTSCL= 1
##$ISEN= 128
##$LB= 0
##$LEV0= 0
##$LPBIN= 0
##$MAXI= 10000
##$MC2= 0
##$MEAN= 0
##$ME_mod= 0
##$MI= 0
##$NCOEF= 0
##$NC_proc= -8
##$NLEV= 6
##$NOISF1= 0
##$NOISF2= 0
##$NSP= 0
##$NTH_PI= 0
##$NZP= 0
##$OFFSET= 14.98509
##$PC= 1
##$PHC0= 89.46716
##$PHC1= 0
##$PH_mod= 1
##$PKNL= yes
##$PPARMOD= 0
##$PPDIAG= 0
##$PPIPTYP= 0
##$PPMPNUM= 2147483647
##$PPRESOL= 1
##$PSCAL= 4
##$PSIGN= 0
##$PYNMP= <proc.py>
##$REVERSE= no
##$SF= 400.02
##$SI= 32768
##$SIGF1= 0
##$SIGF2= 0
##$SINO= 400
##$SIOLD= 32768
##$SPECTYP= <>
##$SREGLST= <1H.CDCl3>
##$SSB= 0
##$STSI= 32768
##$STSR= 0
##$SW_p= 8223.68421052631
##$SYMM= 0
##$S_DEV= 0
##$TDeff= 65536
##$TDoff= 0
##$TI= <>
##$TILT= no
##$TM1= 0
##$TM2= 0
##$TOPLEV= 0
##$USERP1= <user>
##$USERP2= <user>
##$USERP3= <user>
##$USERP4= <user>
##$USERP5= <user>
##$WDW= 1
##$XDIM= 32768
##$YMAX_p= 451803677
##$YMIN_p= -721766
##$CURPLOT= <Network HP LaserJet P1505>
##$CURPRIN= <$Network HP LaserJet P1505>
##$DFORMAT= <normdp>
##$LAYOUT= <+/1D_H.xwp>
##$LFORMAT= <normlp>
##$PFORMAT= <normpl>
##$SURQMSG= 1
$$ End of Bruker specific parameters
$$ ---------------------------------
##NTUPLES= NMR SPECTRUM
##VAR_NAME=  FREQUENCY,     SPECTRUM/REAL,   SPECTRUM/IMAG
##SYMBOL=    X,             R,               I
##VAR_TYPE=  INDEPENDENT,   DEPENDENT,       DEPENDENT
##VAR_FORM=  AFFN,          ASDF,            ASDF
##VAR_DIM=   32768,         32768,           32768
##UNITS=     HZ,            ARBITRARY UNITS, ARBITRARY UNITS
##FACTOR=    0.250966925370066, 1,           1
##FIRST=     8223.43324360094, 144649,       -103436
##LAST=      0,             -92814,          -118219
##MIN=       0,             -721766,         0
##MAX=       8223.43324360094, 451803677,    0
$$ Real data points
##PAGE= N=1
##DATA TABLE= (X++(R..R)), XYDATA
$$ [...]
23864 302856 90261 -236017 -103962 163082 -105724 -208164 80870 443361 -402867 166420
23853 -184257 409755 36927 -120326 18626 115430 -71832 -42083 35168 260261 -42387 109876
23841 -25641 152911 -230955 -14338 -54722 305352 -289806 268357 -448530 -129892 -148637
23831 -148637 185017 49014 89484 -114255 117098 22427 -15497 106668 -282124 -73941
23820 142028 384192 -185263 -99035 -162614 302788 84706 -25654 354435 15061 231202
23810 231202 -223831 19326 286387 89443 5585 226233 122174 -498 -47316 -232707 -82055
23798 -181526 33102 113048 -1811 -236486 -113503 -208200 7123 115222 98593 29135 -260860
23786 -1487 -251369 87382 -54978 -276431 150677 90342 299876 -111194 -129497 -331343 162097
23774 112502 39962 162336 -175412 -213241 -25129 74086 -342330 121850 26249 -24632 16694
23762 251864 92291 -138191 -79947 56320 -98166 231338 -35073 281669 -216572 -56284 598
23750 -256193 -59609 -206184 -77982 -221229 -76131 -233579 -283670 285774 118186 79392
23740 79392 -200731 158511 484200 -11040 46100 267958 -84896 198237 168677 67640 -428789
23728 33274 -84989 78952 -65671 145348 -143882 -161935 -1577 29156 -49348 -169826 -23318
23716 50332 287659 124485 26843 -78938 -49557 92783 209510 138771 -217004 87316 -173475
23704 231540 78887 -37053 274852 -1166 -26026 -255380 102651 35957 116179 -91714 -177633
23693 -177633 33693 -6131 -133011 211737 -332920 47501 -21649 -194878 -117826 39772 196177
23682 196177 -61515 -398057 50284 62462 187848 25516 154752 -137556 -262352 -28249
23671 -44190 -154127 -83362 -59974 31083 -27412 -172323 24277 58171 -420 -188987 -99512
23660 -99512 -114663 -7528 -312475 -86650 -17870 240716 -172486 -88251 -21376 60081 183128
23649 183128 -165505 185920 239370 -135729 271279 -144183 117722 -125366 183299 -55053
23638 -48307 -182536 -245448 -139628 62657 -20020 -219731 184265 -9732 76460 -98668 95261
23626 110276 -313885 103560 102782 -173488 205335 -261038 200249 -100646 201317 -82447
23615 240851 -193575 -47479 -118353 -147278 131719 -213076 607 1009 -421278 35326 -119251
23603 -108174 63286 118034 -188836 60501 233166 94396 -15513 -21172 191637 -59855 76566
23591 -134737 -1199 232521 109257 278212 333589 5121 61798 107433 -15362 165114 336747
23580 336747 5018 1321 -24740 -99755 74121 -17975 255190 21669 -161137 115580 44773
23568 319774 -198384 4303 56041 118333 329956 134184 77200 13487 -153588 -302980 -370812
23557 -370812 -318174 -62453 -224299 239344 240635 -50746 -201589 -287336 -72301 -210052 -51166
23545 -118191 -150631 -102061 -253535 -16226 109779 137395 -2548 174466 260050 -19234 149930
23533 -265221 -98199 -64587 244555 -193245 49602 171713 206613 112930 -250563 -269599 143036
23521 40877 76900 -27774 -28954 229282 265355 -10455 20498 -11909 31315 -144852 -165590
23510 -165590 -31498 -157152 -108931 -99052 38634 29582 260451 -271123 103058 -96539 -422
23498 -95585 -246120 -76112 -118750 -52631 76499 -419597 -42051 324560 -64503 -123489 191110
23486 18717 -20468 -124494 -241517 46523 -256277 168086 -108254 359498 -54873 194521
23475 74316 -47890 86157 -94787 138800 -75084 260121 -45033 96134 45287 251112 -175474
23463 -300811 -58681 -139226 93881 137637 23476 128300 459627 -29776 -183065 -11928 52385
23451 -96017 110144 199253 194718 -22756 215647 -171037 -128570 -461107 399931 120656 -136322
23439 -233524 101622 -388951 -50758 282259 42274 223393 1103 91506 149864 -223338 -242279
23428 -242279 -354227 -16389 67869 -44 279572 -98046 64764 62068 832 -87777 72402 67204
23416 67204 21872 -119933 -107841 177509 -307779 -178668 -15057 -128452 129545 103897
23406 103897 -27379 241941 -61943 71376 185269 187870 -75471 -342011 118713 136747 176557
23395 176557 5038 -123555 -317122 -207216 -282523 285818 217502 -73597 -84568 -79939 131012
23383 245672 47366 87012 -39945 14740 -173149 222273 95978 -80833 43349 149411 -274878
23371 -112334 203909 -280225 -389943 -192898 -391405 59293 -80115 206854 -255279 -127
23360 180735 64529 -200879 157243 -173813 -152377 -335355 -190778 -100621 45127 -172695
23349 -24297 17745 180411 289950 84242 -242144 60926 -27085 213971 23119 971 -84530
23337 155344 -68605 257889 -274568 -181597 -307774 47171 -199865 119560 27628 -155957
23326 -86401 -97236 212017 111540 312590 4624 69068 -128295 96114 8557 -100077 2357
23314 177277 -54950 111398 -172219 -97013 -3864 -131152 272136 -213119 53172 16733 204296
23303 204296 -445613 -80315 -134345 11576 -325787 76908 105101 -88493 -42208 309867 -170823
23291 -131823 61345 34276 43220 65981 -125043 -295949 295776 16871 189987 -157153 -171814
23280 -171814 -227448 65437 170579 138544 48366 -134630 48494 -197896 144805 52551 -154407
23268 44909 -299666 -89167 226643 -32044 -223760 -23540 -138844 -183511 -161838 -145355 -277555
23257 -277555 282975 -394591 -245251 105166 169208 -70639 -52392 176664 -78365 -54751
23247 -54751 62288 -16090 -11580 164854 -113017 -202390 132248 50710 -316836 99819 -57919
23235 -89289 -485054 -180597 -206606 -83653 -300402 -243401 107840 -92175 2712 241498 -175329
23223 -259418 215343 238767 -175776 128914 -46089 -220087 119821 115011 119530 -313616 -491268
23212 -491268 -208670 22756 49702 -115059 367515 122702 -168266 -19265 -481670 -51963
23201 -315998 68599 -217784 50362 35575 -979 276500 -175971 56557 87940 98865 -84555
23189 -310670 80469 -132138 52398 -172082 -120156 40224 -355384 -209361 -29225 245460
23178 -123960 33592 299059 -4922 -231127 46169 63096 -135184 181183 30465 193237 -79060
23166 -151988 83655 22955 98811 -313078 115045 31545 -149504 262443 -105381 -91079
23156 -91079 228674 88186 198533 -152371 -21590 -92725 26686 277768 -94937 -218962 100564
23144 -232341 116795 37129 -22700 1214 -383736 90369 46835 -35794 -156694 153376 142730
23133 142730 -171320 101974 1565 106860 26107 -104044 46719 306191 161802 -307135
23122 -286630 -56804 226263 -227059 -190752 -201736 168098 230090 -271014 -84597 -57142 53135
23110 158913 14131 125581 163385 -69770 166363 22309 -182047 -158139 -140185 -264069 63841
23098 -6344 4783 -179826 -30258 37602 -238023 -27182 70067 -137477 -282483 -287348 171692
23086 -98394 -134616 49133 -37823 -223992 -35050 -46833 62840 -123069 366989 134597 -318780
23074 43627 29612 219449 -183344 87760 -677 -123284 -176618 88559 94247 28678 247896
23063 247896 402756 124615 32974 43481 -83578 -91455 43915 90116 319198 109751 -73974
23051 134690 16203 -51489 71467 -127413 -192558 -44933 -16177 -68293 -124386 29507 -190389
23039 226720 285017 59134 -16824 -17679 -152604 -178332 103903 -10779 12202 -45962 -92233
23028 -92233 132750 170764 -5098 88138 48259 -365525 -124571 21226 -104409 131085 -38480
23016 289400 -241009 14140 -23925 30015 -242134 -89746 -22608 -46366 -369799 -186470 32095
23004 131294 -183629 -137713 -229404 -223849 40515 -65434 156330 -85438 -178528 -101494 -226580
22993 -226580 113478 -87255 -84094 -303228 89183 -77348 -17552 -81608 -185186 -60291 163209
22981 38719 23362 178506 71773 -286454 26172 132969 -297474 71089 -113053 158993
22970 152935 341403 -19729 193953 -137657 -44939 -65418 -167005 22635 -220755 -109117
22959 -53897 -194824 -139830 -20610 -47793 -288675 140173 80256 203487 40570 344342 -340246
22947 -81874 114133 110054 274741 -21885 140479 -336637 -29904 -40020 316363 -161179 12674
22935 384631 49524 -77045 -28842 88927 109339 112695 -240675 -77316 50076 -36174 108175
22923 -365115 -409064 -75388 198163 273091 -57613 -27777 202830 38011 -240734 -69410 35922
22911 -151887 32359 337084 -93774 -503530 272219 -106262 -34985 141026 68342 -133515
22900 -144106 -243866 -213002 -295526 -378591 -100417 -168686 13107 -170217 103863 83552 -145780
22888 -31544 72375 -12749 29303 -113936 94436 -43180 24706 19008 20455 10171 -123767 225738
22875 -111348 -157947 -30267 -204161 84567 -195119 -128122 -354803 -38433 -78492 284188 -346539
22863 -166150 -38697 135075 -256038 303368 88015 72777 -30892 -123634 -24397 268240 -142582
22851 388556 -31688 -66184 -12499 13148 12337 170509 7999 -117970 -106966 -148878 -77551 12546
22838 122309 124508 -251056 -36147 28799 -372992 15464 259422 -8291 108402 -41471 -315411
22827 -315411 193135 -30619 -99655 -186172 64656 -266567 110926 186213 -64072 94811 -158646
22815 -392011 -10386 -44768 166472 -38931 -317774 99263 201480 -171432 121607 47784
22804 64432 -391862 -25316 -221418 222654 65616 157055 -312082 97302 -213991 -88948 -173314
22793 -173314 -25573 30646 145105 -97256 -66673 185095 39517 145777 99294 -99097 24306
22781 219146 379405 50591 -276333 21166 204954 -75378 -340463 -71391 222717 248968
22771 248968 -104793 212462 -159926 -54904 69572 99782 -351630 -178940 130588 23255
22760 -96212 -10652 296694 159187 147331 -435525 24106 -44692 -110550 -197215 62587 -3005
22748 72914 93191 287264 79558 -131069 -309280 99278 -16545 -129844 -329120 82745 94036
22737 94036 87753 -37679 72622 -81379 -219643 315696 -363564 -25993 -151972 30147 -167731
22725 -92406 -170016 -105934 198584 -14510 318592 -69583 -163846 -201352 208249 215928 -122148
22713 38764 -83265 11408 93873 -181028 228384 232088 -141447 151886 73237 -85810 -65323
22702 -65323 9436 10235 -208000 35753 189378 -174008 37723 -293865 174529 245936 -28611
22690 -251215 64690 126842 44167 -30419 100364 -144914 14896 -45607 -92093 -7581 -41733
22679 -41733 -31754 -66875 -259660 -118311 76194 -238005 -68751 -40848 199894 34797 323222
22668 323222 103962 322537 -129638 139685 -141522 -63746 -201623 271854 -160798 112115
22657 77776 81323 251853 -45835 217340 -5989 397667 -369547 81158 -580513 47760 -303925
22645 165289 -14187 34650 -51655 69907 152220 86071 9396 -134122 -72583 76510 150743
22634 150743 194 -403048 -7590 -58707 -168087 63510 67030 86651 -212660 -138232 118064
22622 81389 -59481 72076 248790 74522 236814 -168264 144186 -59156 109192 -207989
22611 -481699 142437 -76980 -31714 -112664 -86 -127583 24534 -76766 -314045 -132167 -267376
22600 -267376 -126188 118477 -122272 -179499 -119271 46205 -42183 243031 -18979 -89332 -362644
22589 -362644 -58887 117352 -4168 140395 80221 25187 -428935 90100 -318172 -25066 134297
22577 -145493 -124935 16923 -19897 66767 374984 -213526 5421 -154371 237337 -68095 -98411
22566 -98411 25586 75688 -196720 -228558 -320480 413080 -71865 -139958 -72313 -196784 61232
22554 151592 142512 -128471 -577653 -156320 -186985 -54557 -121136 -49928 9464 -20478 -73461
22543 -73461 -367786 -137330 -50494 -177498 -77711 38254 -120710 -221973 -44972 -69466 374307
22531 94520 -203821 -11960 26567 296254 -355844 220954 -226523 5091 -74330 45532 91266
22520 91266 -179060 -58413 -176737 -54915 21923 -89416 -256751 104917 -112775 -182842 -133853
22509 -133853 -42340 131010 -162276 -7676 41920 -130523 -64214 70553 274670 -67989 -141542
22498 -141542 -36272 -151040 -50093 -44752 -85805 54877 254631 -295740 215746 -50364 -239756
22487 -239756 -120443 238564 182804 61194 -98900 -159162 188368 -208278 -28487 3515 -119765
22475 -359610 -118667 -21185 -396829 64176 -134497 -21232 -193971 96977 -68857 27815 -45260
22463 77303 -95497 -89568 -191006 233954 87940 -41643 -25213 -173867 25014 8030 -49832
22451 236243 20917 -180835 -117817 -189700 137628 80568 -153245 -55692 -66672 32076 -126842
22439 -43334 291956 198815 -363517 -24868 79970 5182 -199001 -10185 -85172 37859 -150365
22427 152516 -92340 -80555 153529 -162406 -23109 -164635 -16049 -431009 -39846 201780
22416 -242342 145031 -38158 -187283 73748 -281350 66402 -29757 178524 -58486 -222641
22406 -222641 -405165 228773 -193233 116841 -25194 57627 141971 210452 -464496 -146453
22395 25435 -66019 -350554 30707 66118 -347091 -211716 139835 -279140 -60197 -169850
22385 -169850 -130785 164438 -277076 196751 -126378 83340 118483 123783 -216694 144081
22374 212525 -141526 -101188 -87723 140437 -18135 -139100 -216708 -30944 -11186 -201015 -198215
22363 -198215 -34311 -98422 -106289 180129 -54185 -204607 103797 -221307 181744 -290081
22352 107599 -57055 131317 160432 -160055 -90425 -230479 130351 378694 -86742 34123
22341 -72351 93744 -213997 459930 -93399 -6637 -100802 18637 -115523 -111395 152515 17040
22329 -98767 21372 277647 -210792 -156561 -353330 -2214 100018 -18532 -65614 -176952 46565
22317 -99768 61524 -151770 -81054 -103989 -196421 -122008 -8325 55919 234155 -231168 338236
22305 -46429 322009 -145400 154971 -23998 -288762 470634 213934 39054 59331 -398625
22294 -157627 -123929 -87096 -150946 -31692 -178347 -159119 -66689 26127 115045 -22186 -194626
22283 -194626 -115424 -145983 -229407 -122730 10705 -76044 -231219 288013 -215979 -28635 93449
22271 124240 106686 335550 -180965 204808 -109832 107026 -5542 104220 36416 200689
22261 200689 35143 180848 188406 -300093 -296371 270315 -90146 -102853 79334 -200632 -123227
22250 -123227 -68722 -57666 -168718 -88989 48091 -377659 67774 -102620 -27084 -35953 -10368
22238 279793 112388 33642 -44497 209148 -213162 -193049 138490 -5618 -358410 -112591
22227 -272274 -90089 -40200 -292973 -242254 -449360 364356 -120635 -156044 171925 221927
22217 221927 -117728 6957 144746 -294915 244272 -50516 92919 -144672 164911 13795
22206 -129641 179664 -50486 -121049 168054 2989 -136187 -86446 -248963 51091 196098 -237017
22194 74017 381641 14874 69985 -243506 113113 -107181 -380899 -112256 -77895 -279344
22184 -279344 126299 124069 -348550 16092 -391710 37987 -103013 -193026 -45892 9116 -62114
22172 -88526 26006 -145967 80099 -355578 -3110 -179581 -97903 -171501 -103564 210745 7127
22160 -91243 -248838 -122782 -247304 247665 -321159 -119424 -121219 332906 -264193 -237929
22150 -237929 7305 172525 215953 195285 151246 -44111 237258 1120 61412 -39982 -158921
22139 -158921 198072 -372682 206859 -140196 123798 -5511 24207 30838 -513789 -61502 -23347
22127 -199660 202420 -216920 -63381 -163101 -48641 -114184 34478 -256582 36869 -113001 241353
22115 61373 160405 76067 114298 29838 -193801 27548 6643 -58163 -423605 -43498 66935
22103 11662 -82641 -242861 8750 -519777 -293 317786 -43063 195674 317765 -456466 -194496
22091 50162 39844 91045 -49595 172183 81850 80539 293253 -50128 54064 -292420 96918
22079 57980 -141656 -237797 -117672 -146376 -70183 34440 -13079 -231016 -263679 204641 -2783
22067 72894 -353342 -189077 -78751 -113792 -132580 -31236 -24735 -43344 -28892 -173750 -5463
22055 -8579 -35775 -105194 113626 261 -79456 -139094 -270508 170286 -74769 -223182 99432
22043 -162328 13072 -450766 -81965 129257 -59160 186425 4723 -59080 -14036 -213168 -232794
22032 -232794 104347 26776 -166284 456865 -97761 -26302 -41504 -168931 81438 202100
22022 202100 149155 -365524 -200329 1378 74574 -85235 -335025 206950 75422 -92713 -20130
22010 -106365 47081 211461 95611 -76178 107783 -42575 103492 -416771 102357 -326771
21999 -152963 14015 -140642 -156570 -359548 268839 -200577 176141 -136611 -10821 -17396
21989 -17396 -132154 32758 -27839 -68631 239928 82731 -147922 -68793 -276078 277127 -183053
21977 102738 -35520 -52364 -288607 157854 110247 -39741 -244393 -94803 87636 -114864 -98026
21966 -98026 136554 -100351 52982 58739 32592 -247192 301730 183000 -262362 46186 114097
21955 114097 -325913 92819 124651 -24534 8996 73363 -95717 156998 -119925 126133 87477
21944 87477 -74540 -179077 -120330 -42815 131322 -55404 -54204 231411 175618 153930 19113
21932 132763 -169400 -86991 -186842 -46444 51349 -263573 6037 -53942 -227323 -111573 -131845
21921 -131845 27469 -115157 -87234 -106875 185443 24741 90217 -129459 -228551 -496043 228463
21909 -171301 327888 -220477 -136335 94811 -207978 -12382 86553 -193762 142266 -222304
21898 125776 39915 -186585 59902 -146172 -185413 8812 -201234 -77159 139779 -166337 270894
21886 -41688 142244 -268390 -95963 -147987 -111095 232080 -110689 57406 -78313 -6 346824
21874 123369 -130206 35 18237 166788 -463151 186562 -188486 225289 -89322 -80751 -55943
21863 -55943 -39559 -63921 -9819 -74268 -178850 182102 -74458 256438 -279923 -93158 -77457
21852 -77457 230196 -278583 -43454 -101909 -212695 169015 232105 273121 195767 -13273 99194
21840 -15745 31863 -319497 -160212 -92734 10195 53540 -30943 -102031 57952 -521048 -68449
21828 -238429 -58830 -83697 -44734 150833 80630 -298511 132493 353211 -2201 -323579 225875
21816 -225576 -97466 -3091 -252941 -204213 -192349 -88424 102276 -163749 -242715 -112201 -146864
21805 -146864 -106289 -303738 175486 -100916 -36455 100909 235940 -189177 79488 -146173
21794 16785 -226543 233936 -154016 -191889 92368 -271346 194185 197805 -274328 -273577 149245
21782 177717 -163174 6964 132221 200445 89885 80600 -117858 -26471 -59197 -35310 92535
21770 -163057 194387 168851 155440 -179492 -63901 -102469 -352709 -90 -66696 -15369 -19778 57131
21757 -235584 5412 108052 74039 -202785 -212061 90532 -127759 -5243 256021 -86847 -244155
21746 -244155 85787 -105009 -11164 69554 75366 -106881 18690 81651 -42730 74016 -173068
21734 -74257 37231 -33408 -337727 -108615 65185 111444 61960 134930 18773 140606 144518
21723 144518 -87789 -101408 203740 -98242 182566 71622 337858 -121991 102720 51234
21712 -101212 182766 40038 25337 -233585 31643 -439156 230190 142273 117411 -102833
21701 60 -42319 -383509 -332561 -38455 -115446 283804 -31975 -8951 -287414 37818 -506392 -68375
21688 126221 -86152 22788 33367 -46415 4596 -196979 -348942 136213 29599 -126540 156072
21676 80868 47348 128252 -267246 254506 101319 43417 210416 -190739 -375271 -17219
21665 -111912 39873 -3544 43473 -161269 -150624 -82851 144146 -112787 -163788 -163093 73936
21653 75130 50791 -48249 21572 -58192 46884 -283403 64987 75909 16487 127245 -349476
21641 20806 -31150 -327784 -116203 -67709 28871 -124425 -23459 -20363 -259052 -1230 -186268
21630 -186268 -1251 51145 -39919 -57734 -104547 -452 -235328 -154698 -52390 -136148 166511 -27176
21617 201400 298824 -19567 -96577 80980 -130298 32472 43176 -228404 -8044 -169522 -146968
21606 -146968 78904 -16527 19635 274719 40044 -313487 93102 -222149 170906 -253612
21595 57531 21105 -325323 -160103 216546 -183384 -34158 125447 92647 -99858 -10436 -89172
21584 -89172 -171754 -188718 105831 -102930 -141556 71508 -88601 93547 -32042 -308695 185732
21572 287515 -12819 -390951 -75821 79013 -175571 -66174 -80340 -105973 -127774 54569 133654
21561 133654 96006 42795 111649 -430535 -81741 -27738 174046 -230176 26256 -53650 -153263
21550 -153263 209817 -191309 -9204 -80292 -81376 -194726 -218761 152830 -134484 -86495 58296
21538 20788 86802 -52929 -64816 29462 -119062 -14138 76317 81560 -195410 191989 -108117
21526 24956 220944 -313664 -181942 78619 -160600 -221992 -201753 160968 -57490 2050 -6361
21514 141579 204550 53535 -85511 23096 200856 29135 -45857 120268 -177922 -1734 85483
21502 -189072 183448 -2853 -25004 101740 -12810 75295 176587 -374709 233045 176864 30769
21490 196689 159817 -2679 73714 116696 -291850 -142196 51457 -80670 -69467 312026 303025
21479 303025 -143901 78247 253690 -69202 56025 -249932 -140204 -104506 -328264 161092
21468 2451 -102326 -90966 114946 -200563 -58976 -139319 -175835 -158035 -225528 -271640 -40724
21456 -86628 9157 144928 -374716 76230 -71384 -408069 -145067 86858 -13772 -140244 64494
21444 243322 78706 -37436 27073 -121104 -12338 355608 214053 498029 -41826 343183
21433 456072 155009 234291 190024 -231064 112153 112552 233118 41013 -396086 -297221 30038
21421 -147970 -286940 -2341 -241629 -203311 -108814 -239763 -120727 -137010 31015 -173606 -143912
21410 -143912 -630350 181640 58489 37137 106746 46091 -26118 -53303 134077 -221392 127788
21398 -49829 -249715 14691 7323 117855 -153093 -152269 -90107 -18758 -59641 -135671 -51462 -160379
21386 -160379 83248 -286373 -135989 301796 -245855 44206 -167155 31660 -50474 -1347 -90938
21375 -90938 113105 -59068 -99871 -11318 -80737 119649 -65186 -105348 -262912 246050 31741
21363 -294049 -184673 -183760 -23381 259462 221190 -379488 156154 737 207487 138275 -30803
21351 -55421 -208303 -253468 -327182 -340574 259664 -61785 -188692 -70367 -166151 66268 122096
21340 122096 -160658 76556 -184268 -163804 -179638 -62643 291547 -148784 -25309 -28209 -29057
21329 -29057 231138 767 81672 -78554 -17626 -6377 348768 47981 55431 18903 -131403 -37784
21316 -273166 -78049 -147342 281797 -506366 -12838 -88994 -105632 -373698 353154 -164165
21305 27785 -96508 32904 -176065 -80990 -279137 -184243 157922 11886 -42732 -165863 -536458
21294 -536458 210891 193357 -381265 -73198 148489 -91562 235053 -72919 5618 -200912 194448
21282 -262442 -87255 -99477 203257 -546450 -84987 -271347 -106235 -225450 44854 -80649
21271 -61660 10389 -61021 -25290 -42149 -147528 -54571 -180880 4856 -3465 139850 -311065
21259 -113501 -137631 61170 137679 -166536 86490 43634 121794 -149201 127753 20690 -213493
21247 192114 224674 -89325 -191913 -115932 154116 -46266 149260 -302599 -151587 -42570
21236 -14190 -89589 -151908 -175426 -75386 -135652 14527 -30727 110763 70282 263747 -49824
21224 -196833 27999 242917 213885 -143278 -50892 -51746 -18828 -208242 -149016 84106 46820
21213 46820 -195774 -514143 205398 -330235 -168001 -304089 189490 -212408 -212037 -29289
21202 -29207 53653 -45965 -59577 70639 69479 47935 -107286 -75185 -130877 -97485 -70149 836
21189 -97242 87939 170494 -32759 98745 -47365 -114312 -165009 -1723 -109406 -137171 -216550 -433278
21177 -433278 -292857 -133513 -29469 71919 83290 -199471 -145602 -137701 -28931 48310 97939
21166 97939 -136548 71186 -127682 11433 -166774 -170514 110655 -141006 -17575 21441 -302099
21154 -55256 11361 14354 -104034 -72349 -81204 -235442 44220 -153546 -74522 -465009 -176488
21142 337815 -311171 -91352 -51614 -124622 -25943 259220 -92369 -211122 239108 -282 -36864
21131 -36864 -122697 -63874 -61918 -178246 -163040 -76796 70897 -292728 105339 42941 -45667
21119 -183842 -5987 -268707 107550 -314346 28736 -279213 232662 -127949 4670 66777 141314
21108 141314 -120168 17328 390137 -341364 152365 -31691 -62095 5220 197252 247255 -257891
21096 -90716 -551123 56898 12401 -128557 198552 -102795 -92420 -105842 257577 114094
21085 143846 -357432 -218576 -22512 -15580 196279 347242 139856 2379 242013 133880
21075 133880 -242133 -20137 143046 30869 -37054 -64836 7728 -115976 -103467 -180704 20517
21063 -229862 -78818 -146507 -49258 -194097 -211719 -28451 -315587 -322949 19044 157374 -120583
21051 -9457 -215999 92000 29704 -17943 -87271 195955 218005 -234701 -211408 -9938 35345
21039 -87012 49083 -203286 166347 -154913 184399 -40656 148225 -125363 -175962 -206116
21029 -206116 82661 -462219 212478 13857 -178136 -319203 -157576 -227227 -153408 234526
21018 32759 204939 -185069 -138763 -20217 -125378 120378 51333 298246 -41073 125353
21007 -52274 172919 -116961 -277023 -124352 13312 -40408 -123320 -109170 10926 -365938 20299
20995 -163101 -61668 138886 -195216 158799 33530 -42417 11187 -212619 -21665 -157567
20985 -157567 -1175 -50264 34576 -25033 -376798 -15138 -154368 166791 -271462 -258151 -12408
20973 -1379 -295884 -18755 114703 15583 -361304 -333086 279244 -183225 15792 68171 -12055
20961 -125662 -107061 98314 115994 -57567 69233 -141492 -131401 109906 276881 -16131 -61069
20950 -61069 -11567 -2182 -194084 -210622 130235 127364 -102941 232975 72323 34419 -233648
20938 26165 44621 -192097 -66942 -255039 148616 257392 -280654 136722 -20495 49741
20927 -22524 -169940 -80617 -7903 -188213 -103316 -101089 113015 -185592 141734 127771 175355
20916 175355 210814 39774 195851 -205208 86521 4929 89691 -83872 7821 -121525 -201839
20905 -201839 -301976 -279832 -256822 -78685 12998 -81506 -162097 -73617 30204 118519 -138185
20893 -226856 -93043 -89824 46898 11146 31526 -1102 300695 -99072 24169 -210385 -260791
20882 -260791 116494 -158027 -122040 -43554 40469 189332 -140948 253665 131593 18862
20871 164265 4736 -109997 -150638 96601 -137813 -335345 171403 -179539 -349658 -230790
20861 -230790 81707 -196971 114616 -132131 345412 -130778 -35186 -34663 -333012 -38283 -96180
20850 -96180 -10234 -144158 -191695 -56756 -135340 -383297 131611 245605 -44342 -111333 -218962
20839 -218962 52091 -384593 -101876 -352213 -90783 -25410 69536 -115110 32296 -138005
20828 213879 -358178 131448 -101117 -110262 57478 209031 233685 51398 115914 196860 -149089
20816 133579 -16677 -95861 -75380 -134998 -112418 -199678 106092 -141271 -88309 -160453 139762
20804 -269660 -68210 -357048 151473 -17994 -339485 -7475 -505047 541934 -70689 -27837 -38688
20793 -38688 -142296 201508 58987 200315 223560 65871 96183 17820 -155723 -210733 79760
20781 -49350 -150068 -115021 290997 -165905 -157028 -381068 102376 152970 -172997 53790 -318216
20769 7583 -126464 -67238 -331404 -7931 -419000 -206475 -172969 27751 27215 -153973 17100
20757 -291875 104703 -57289 149683 62847 -21611 174260 -304357 -194072 -104647 -266149
20747 -266149 -212989 -198903 114572 -253271 -41205 -337848 147921 170241 -93725 -346284
20737 -346284 -19673 -326092 -164412 -91754 -252241 -243660 -292806 27921 -314559 64868 -20250
20725 -62041 -129691 151600 39556 -132110 -300744 118934 -30052 -322592 65793 -131957
20714 -235511 41636 -100917 35289 78909 45221 31046 -127508 -55856 -274516 -197260 -90655
20702 317096 382397 51416 100066 126893 61946 62111 -160575 -53480 -97566 8495 30421 -389119
20689 54051 -142555 -95546 -184869 85646 46330 -198995 308623 -81500 -33211 106829 -59317
20677 92575 -178459 -130451 -365509 107986 409003 36123 155546 45038 -188854 -84138
20666 -336626 -175872 -465673 -243152 -160572 -181733 -74452 7656 -355396 -112782 -154327 -95906
20655 -95906 -79603 -65143 -390160 -164648 -62948 -229116 -28498 227284 -543824 130982
20644 -332453 -140215 -159820 -59646 -286792 -131126 80920 -94402 271796 -215818 -223943 -112538
20633 -112538 153072 161429 28472 -75504 -54732 82096 -32526 -15074 -168712 -221323 87720
20621 -102974 29457 90972 -147567 116510 -35678 -27933 46528 -12010 -101361 -53692 -253771
20610 -253771 783 -200563 -191445 -229052 34491 -30125 48232 -254408 -317923 -23692 36482 30793
20598 30793 -252170 -129748 -105903 -29214 351980 150399 -216793 73865 -4829 -462242 92422
20586 -79535 56125 -39079 68336 -311764 87523 120740 266485 58925 57122 52582 -296768
20574 -130649 -43267 -293970 68679 63149 -178375 150705 55376 42292 -107817 -20753 79642
20562 -49156 74232 -60409 -130463 -115325 80252 -184694 -67669 128250 27796 32590 43470
20551 43470 15054 -133161 40999 -18755 103142 -132094 -295373 -311136 -80409 50675 163158
20540 163158 -109952 13709 -11491 535446 47546 -130582 -80951 16510 -126551 -107281 -94373
20529 -94373 -1197 -248930 291680 -110825 67036 293069 16522 -248639 -299999 -102260 107223
20517 -55294 6745 106103 -13928 -234866 -23294 -113631 29175 31889 -81908 127649 -167325
20505 12207 -70963 145529 -378275 -302647 -133408 4749 -232197 120032 219534 -46838 -79682
20494 -79682 105958 19128 -436096 -9139 32152 -239269 -64983 67109 -89701 77328 -107704
20482 -132403 -357067 -107952 -222793 121063 70996 140940 -5676 -97058 -241810 47370 -288815
20470 -7367 -72389 141682 163632 71144 12140 -136367 -71350 -383911 33876 105573 -137259
20458 49396 -116700 36450 132646 32416 129544 -16041 -71367 257692 8872 105043 -183140
20446 -162553 -149197 156002 344615 25880 -74376 -7102 -237128 -273661 84106 -243736 -96108
20434 -274136 -76225 -111886 -58243 113487 253085 -74626 112486 62148 -217149 202220
20423 -139223 39433 -240652 178895 -293157 -226064 7106 78452 -148443 -162156 -54669 -42987
20412 -42987 -300677 -78662 -54326 311071 -318493 -334287 110836 -190010 -60167 281553
20401 -234680 -393316 -101849 37239 -2712 -176184 -152356 -380848 -177687 6558 129225 -63778
20389 -295396 -64696 -74684 211293 20928 -90603 30656 -3307 -14432 -99644 190891 25516
20377 -89686 29367 90791 -112430 -196008 -45306 -60683 158236 59182 -111377 42513 -271825
20365 23224 92622 106169 -121358 -138372 -368911 106971 147437 3175 -57806 17018 -246875
20353 -170146 -228415 -264220 -37581 96678 46677 -208653 -330487 -114911 -88360 -232672 120922
20341 388456 -60565 197536 -112858 368535 59498 41150 -282513 -210511 8886 197066 -339945
20329 -324539 -3979 8245 -170907 -163061 314790 -37301 147564 71419 55952 -335332 -33165
20317 -181238 158956 148221 -119030 131570 371808 -42102 -140892 -490102 -229660 302826
20306 10141 117629 6090 -213148 -64079 -286667 78432 154800 -69294 -218875 -210866 -397912
20295 -397912 17369 88887 -180466 -46009 -32346 364839 -267836 160174 65916 -47921 -116725
20284 -116725 -26317 -71337 62408 23571 -132768 329370 -219303 -37579 -261237 -184645 -115967
20273 -115967 -133653 -68073 -108066 -21459 94001 29299 -32247 -138787 94392 -115302 102523
20261 -298910 -266194 -345347 -5549 -77506 184148 -50777 231233 -68791 -209598 -241947 196682
20249 284443 26533 -319709 -104226 98859 208869 -451052 -26569 -179040 -5595 -10122 27396
20237 15048 86813 -313769 -9086 -65536 116789 72924 -401986 -161147 10538 -144917 -109009
20226 -109009 -215227 -97822 -130397 63043 -224800 112522 97177 103349 -192455 -151256 23439
20214 -122684 -274808 146932 -91671 18863 10140 -205036 -292988 -64779 -167421 57222 -66964
20202 101224 93930 -93184 7450 -30336 198411 -62681 -12859 137848 72661 -202824 -324534
20191 -324534 -48970 -265651 -137626 181445 168116 410814 287848 70595 -106447 -99392
20181 -99392 -100253 -204887 -321210 116480 -247357 -4092 -149000 -196090 207317 -280379 86157
20169 82682 177119 -14576 -46856 -35840 329880 232777 -318993 -114744 -301007 -35454 21515
20157 140207 7371 -99285 -264920 191653 -82492 -373867 -21940 -194694 -19876 107599 -166491
20145 233641 -231455 -206810 -229511 -254032 132314 -159034 138679 10927 100105 17350 44601
20134 44601 92554 -120857 98389 134832 -329831 -93299 -191576 -143816 -242374 93570 170870
20123 170870 -204302 -9147 -325692 123803 129730 202697 132243 -196517 -166973 -78062 -110712
20112 -110712 -20457 4150 170537 -61220 115875 172960 157078 -215540 -5722 258494 -19082
20100 24585 51766 -199552 2537 -48269 -10215 33248 -47448 -169507 41838 120289 -51899
20088 -53861 -172248 -155855 -100391 -149045 -24446 -38173 77517 114106 -122801 -430981 117896
20076 95000 -231473 -117122 -149230 -570606 99544 -267824 -142248 66113 270889 -25835
20065 -135547 -258682 -48469 39729 -257966 49047 -139835 35796 -242120 -11118 183245
20054 1341 4938 -143341 -449198 92604 -138110 -84869 -211718 -188315 -360394 -75224 204078
20042 -162064 -157163 -135709 76801 35749 -197909 344871 -234516 138621 -110999 -92961 25473
20030 -22614 -152589 -246719 170495 -318600 -76259 -12518 77588 -65198 -139188 -59809 -177571
20019 -177571 -38899 -157921 -50403 -132068 -157362 -44015 -311328 -45330 148799 78011 73533
20008 73533 166607 152413 -246826 5449 -32247 -110088 -27195 -262038 -90746 -189195 6059 -11527
19995 -72642 -76514 -196262 15071 3165 11439 -293045 -460431 -209681 -26699 215240 -183163
19983 -259067 -336374 -70537 3169 -245244 -128453 -341353 -393125 -273236 -82083 14055 -31871
19971 -83058 -165358 -110494 -89108 21280 35391 102054 -193474 -168513 -147154 141242 10760
19959 -69805 -123942 51500 -59775 -361474 266667 -196482 230855 215470 190230 42344 -93366
19947 -87053 -105204 166716 -290486 -81834 221547 -19998 251398 -135379 76053 -36509 -79032
19936 -79032 -187631 32774 -58436 -125890 164056 -134340 -25272 -285249 -180323 64739 190712
19925 190712 -69591 97908 82825 4155 -166851 224626 102699 -66726 154495 91808 -171638
19913 115482 -70268 -307877 261468 -21266 -141558 63377 195449 -102570 168778 153221
19903 153221 -208758 -143153 -62472 236319 -37093 46589 -128912 175377 -12008 39416 51880
19892 51880 158235 -319373 101500 -203945 -155383 -112109 269766 18812 124646 -135367
19881 -415128 190775 -362338 -121388 -30506 -12474 -42026 -26229 -19923 -21270 231371 -218734
19869 164474 -240429 132288 -201225 -116225 -68888 -182405 408332 -150156 -77616 46210
19858 228637 351933 -116767 -65757 -252973 -74390 -225935 -115583 -33160 110001 -296606
19847 90019 -12203 -135356 149212 -248509 -84125 -15677 -37218 -37625 169768 -140305 -204890
19836 -204890 -218227 50752 355972 -168778 -253039 -185758 -59336 -258337 -125973 -198842 46749
19824 -58045 -181038 -53984 220714 -496700 106452 -480866 -15388 66148 -34499 -112635 275422
19812 220420 91586 123237 -204632 -41493 -278921 242630 -416426 56895 43456 -118669
19801 31589 -55847 -303327 -89089 -238462 -88529 -138060 -163158 -164518 -129187 156274 -10944
19789 -294731 226149 -291746 -70077 -254870 -427603 -269643 -142325 -172597 45856 62637
19779 62637 175556 -298823 -199196 -156427 107785 75309 -132197 -139977 -20110 130065 169342
19768 169342 -154735 -89811 95908 -155992 35201 46627 -84929 54074 -216354 129250 -226764
19756 -136294 -195868 -70392 -220567 149280 11776 -17860 -269729 -189953 205824 -8318 68436
19744 -50916 71898 -399721 245595 12851 -460057 -23631 148631 -199980 -155374 -37946 -261192
19733 -261192 45204 252539 180469 -187679 -79359 296097 -174484 4677 35404 246126 27063
19721 217402 98734 15434 95320 -65031 -125328 -69076 -44928 205468 -11196 84443 12625
19709 -132846 -163217 178915 -58908 -271197 -68482 -179363 -65406 -212490 66555 -48416 206688
19697 -7674 83175 -80547 -167784 -215942 -151132 -107728 69909 3108 199948 18293 -135859 -49188
19684 147939 -92061 -95654 16402 -95538 -133350 -699 -61155 89996 -380972 253859 114133
19672 -282322 -226869 -13887 -203534 71521 -179251 86414 -125493 44373 -50646 -107090 199461
19660 -114380 -114682 -40218 194012 3136 239021 -60080 -179170 139732 -134630 13534 -106928
19648 -182223 -76991 -279818 155788 26446 -283562 37542 -195275 -279064 -387970 -251979
19638 -251979 -266675 65480 -36121 -128152 7754 145445 -308287 35991 34941 -109775 -391701
19627 -391701 38850 -139805 -638474 158261 -226470 -179339 -258909 108994 -271609 78499
19616 -41304 173401 -257355 -6837 -148663 -111249 -214083 -92868 96452 50851 -80053 26695
19604 -84762 -158169 -381335 -61470 -16096 -18560 -305923 -499617 33006 74300 -62020 -158090
19593 -158090 -243284 -126891 75506 -156206 -52393 -337196 22646 374221 -63163 -41531 -122643
19582 -122643 48428 -154907 -45153 -20969 33677 376052 13775 -202306 -106341 -100008 -95949
19571 -95949 -105825 -200173 -57802 29823 -187030 131009 317940 45241 -16929 89544 -15310
19559 28559 309262 341943 -48734 -45850 -64072 -229779 63302 156120 -144809 -185911 17275
19547 -154613 128310 -246054 -89794 214015 127218 125155 -124186 176591 -100130 -143418
19537 -143418 -53796 -219369 -233589 20214 28654 143522 51278 119164 -59343 -249767 18003
19525 -121531 -297984 -126967 -57578 -251088 -189972 -194216 22815 -159480 98367 6425 -42790
19513 -27445 -82092 -265517 282774 264896 56201 125224 -289304 -178736 15791 -316848 -115150
19501 -248885 -89502 179909 -327203 -191810 111661 213933 -62441 -72797 -222642 -241115
19491 -241115 5878 248250 -208067 108703 -170104 -294682 182402 67760 -166486 -321912
19481 -321912 -321281 -30942 47184 -189080 69820 25956 -107394 -71033 -3813 111489 -411737
19469 -267864 179803 -1311 -204987 -212723 -101532 -327131 84399 -223281 103869 -383587
19458 -24907 106091 -55564 -103373 170551 -84845 -208498 -239171 57367 -16066 -52927 -19693
19446 -318319 -193482 -86190 190049 70838 -123881 81605 -167476 -311410 410954 113795
19435 -34703 -298740 24785 -116331 -302970 70625 -210689 -96650 -49576 -71049 -213870 60111
19423 -2725 -244040 -92528 -4362 -123233 -141144 -324824 -70974 -125074 133481 234622 -197519
19411 -67095 249290 -191907 -328122 -352181 202341 93126 -14172 -2646 345085 -15163 175004
19399 202353 87078 -223333 269103 233314 -67956 -194710 -70913 290772 -65023 -18411 -409007
19388 -409007 -3958 -111155 -34283 -156446 -62331 62762 -247886 -114622 -36246 59170 -16449
19376 112827 -117805 -98691 -88548 -78223 7223 -227273 44331 8649 -31457 49202 -158107
19364 60803 99033 12804 -168175 117617 -141079 -139764 -287903 -280240 -367757 152291 -174620
19352 -254085 -339670 68567 26597 -161494 107677 -54142 -13521 68810 -178426 50093 282187
19341 282187 -105484 -72738 36992 -63617 -263471 15978 -240579 54702 -147911 -405973
19331 -405973 -150233 -113383 -115058 -111208 -361430 19824 -131375 -94224 -18217 -249809 33374
19319 330956 134587 -43296 249 152119 -219340 -164676 157001 216808 -197872 -72147 -116535
19308 -116535 -428405 132794 -49611 -293727 -319024 -121765 40328 247213 -85822 195724
19297 -66866 76026 116948 26796 14721 23332 94138 -217525 74757 29720 75059 98871 -145046
19284 -326948 57818 -95828 -137918 -311065 -80867 -132614 -103833 306273 -222164 -92757 -278425
19273 -278425 -38099 100483 -191771 17465 -171639 -348258 -43605 24123 -71230 11151 -122887
19261 -85470 -154692 -92614 225680 -147338 -37163 38779 -118407 -180670 -115042 38344 -219428
19249 -249117 -140873 -118542 11678 -88722 -13707 -12230 -396135 48338 -380035 -216323 -67491
19237 110155 177865 -16515 97777 190132 -208083 25428 -206029 -7556 -15765 -14840 -214835 93239
19224 75207 -117878 21486 -479786 -112291 68771 -148559 -46678 198752 136656 -253801
19213 -46979 34742 216697 153468 -162443 67276 -1064 -161965 -15161 -87592 30061 -62321
19201 -206202 -85960 186577 80568 -96214 218415 85052 -134636 -122268 -369099 -13945 -251510
19190 -251510 2728 -185212 -218577 -150238 -10861 -58958 -54991 32553 -259657 119159 -23381
19178 110492 140878 -454536 -134148 -79437 -232003 -38398 -287326 -164251 -250737 53320
19167 -135394 342115 183548 109794 50159 -217512 -9054 23454 -69381 -176535 -133074 -201701
19156 -201701 -11553 -347233 197969 -335377 -66620 162047 -153579 -237153 -9075 -300066
19146 -300066 125917 -181117 -261487 24662 -181517 178112 -183425 -60328 -95040 318827
19135 -22733 130433 -342040 -71279 -285451 -434847 -515022 -198266 -177878 -33968 -71901 316248
19123 -177786 -30048 -208110 -246627 222097 97321 -378011 -228510 -239462 -323665 162775
19112 -111176 163147 -122050 -161539 230982 -274178 -18203 84350 232628 96816 -210366
19101 434239 -49114 55168 -234963 20876 86767 -176863 -33109 123938 -311932 146621
19090 32603 59506 -207686 25394 -137556 110267 -7572 -231717 -196806 357530 -174927 375637
19078 -146689 122588 96778 -86273 63211 -135188 101576 -165407 48337 -171816 299678
19067 -47020 -124594 342250 -333677 113323 40824 287075 -240798 -176090 -68136 -84744 75725
19055 76385 -236342 -13321 20645 -197662 -129409 52424 -234279 165615 -115925 -38111 -85690
19044 -85690 13885 -13661 -9895 22252 102019 -350654 26189 330922 299541 -169483 75173
19032 601951 -438238 47594 -167693 166192 -19915 60085 257698 32679 18885 462600
19022 462600 -77493 212065 -8130 -205816 13619 -69406 -130627 18925 255062 60339 -330797
19010 -126554 -122428 -254326 -164503 -3659 177386 -26231 -168695 110416 -491159 -266616 36710
18998 -30594 102472 -342081 147439 200095 -58485 -35784 -215905 139564 71365 258048
18988 258048 241620 18826 425331 -134171 127500 -25334 -152666 -237801 311830 80261
18977 83140 26383 -344638 -96746 -19032 61431 -147161 -412666 66153 296271 75029 109320
18966 109320 -263963 29876 -102624 142028 -213452 184987 -103805 -10677 -300299 -245351
18956 -245351 -208521 143556 -123684 -75996 -130797 -322833 -281268 -171792 -275527 166867
18945 -114324 -229589 172678 -10882 101871 174178 -108516 -81050 76032 280999 -338587
18934 96612 -304806 -8208 -352190 39985 -171939 -61272 -294684 188043 -102495 173596
18923 -130609 28055 385766 -271828 -91861 -192953 -192888 -36090 -125644 -111517 112240 131658
18912 131658 -221213 -78335 183588 -185080 -21539 -102538 -160800 -118233 -109473 -66044 19526
18900 111169 351288 -36074 -44101 -36822 -291119 -23386 -112405 -146856 145810 -173371 -243626
18889 -243626 -199639 -169025 -168659 60270 -357913 -7853 70449 53968 270697 82472 -2169 -43220
18877 -43220 54264 -139250 -94891 -306409 -59561 46685 151704 310444 -143535 -217788 226096
18865 150653 -127377 -2755 69266 475195 -41411 -95162 94994 -243964 -25973 -334376 -172835
18854 -172835 -321747 17847 300898 16256 76884 -106534 -76648 -154855 262972 -174395
18843 82993 -380798 38041 -206546 -183092 -174566 164212 -126578 -20810 -254862 137699 -192474
18831 236043 -38982 135233 -186980 85136 -39032 230897 -66192 132881 -167057 -18307
18820 99509 80092 -134459 140399 -138002 60713 112609 144497 54937 67727 257400 266138
18809 266138 -62455 137339 -36815 -149132 -130213 -217531 -598515 3158 -38024 293428 346505
18798 346505 -303438 -51334 -87070 115753 -99378 -154496 69668 61284 -152535 -96389 -36992
18786 180482 52741 -78502 -9338 -71024 -12414 46309 203609 -3736 -48794 -101842 37761 7763
18773 32426 -235439 -294008 -30325 -4866 178842 -103138 -291411 78264 266757 -115696 213540
18761 -353415 -74930 -98084 -173948 -149768 -99029 -104304 24771 -23248 -166296 93740 -176204
18749 26337 -136479 -558229 -61040 39351 214472 -294646 -27813 -40420 47081 36394 -288616
18737 -85354 44899 -326421 -267723 -88183 -358317 -82395 -36354 -4987 -128085 -64751 -315931
18726 -315931 7885 -103669 -309773 6965 -24664 -1921 18436 188822 -246275 54671 132009
18715 132009 -10829 246203 126452 111192 -201024 -220416 -295654 -137838 -110034 -55482 -394187
18704 -394187 -154806 169129 69020 254168 -181456 -19769 218202 -257517 -6429 -107206
18694 -107206 -193810 -102490 -295964 -3272 -161969 -374084 -231789 -52548 78249 31035 154766
18683 154766 -84081 -114546 270104 -232912 31288 204923 -189438 -209912 63532 282884
18673 282884 -136195 -373201 41681 -142615 324633 -113535 -278709 -325118 45929 242510
18663 242510 48282 -26592 -343150 -113887 -181762 -20265 -9138 -163823 94013 190332 -276404
18651 -291608 -54791 107957 -598764 -137928 -161336 266034 -74413 29429 193907 -19455
18640 -152607 10294 14217 -131427 298265 296136 108883 -254158 146340 -176688 295585
18629 198706 -106465 56274 -51141 22748 -398239 -140530 17813 4661 -96634 11861 329604
18618 329604 194649 -68720 -209293 21502 -177301 -40533 -157674 -216809 176617 102147
18608 102147 7524 -43477 -155743 -157717 -124783 -249320 164512 -147774 -408669 75970 40031
18597 40031 3370 32399 -222320 44007 89724 -95951 17884 -152049 -110084 178105 -168231
18585 -368008 160009 -274007 -241493 100741 231525 308705 -8514 -95032 91518 7234 -338995
18573 125227 51006 -6628 -1318 -88863 -180570 -220222 17588 -98899 -91853 -212775 -332013 -109067
18560 -223879 -202637 -68209 -42983 -49004 -10946 -442770 -72598 -41191 -78497 277308 156416
18549 156416 -86295 30646 -39646 -104353 15701 -136144 69327 3412 -170514 132567 162102
18538 162102 30454 -146028 -104040 111459 -120520 283646 350380 -242977 -39521 -116331
18528 -116331 66229 -88164 131654 242603 -105718 77378 32384 81582 -119555 -118501 -27256
18516 139834 6049 17015 -189195 44919 -77995 117843 63918 -724 93966 105316 342854
18505 342854 -114922 160466 -76170 -222031 4412 -21516 44852 -199038 -227127 -271880 -113584
18493 -221804 -149678 -201224 -297108 -138647 -46881 96818 -35095 -126823 208847 -99075 -106043
18482 -106043 -160439 -27452 24997 -102168 -46352 59293 -118258 -131499 -61792 28155 -89612
18470 240336 59346 42689 -56349 -282859 -31289 -103151 38841 -185321 84843 -106298 -32630
18458 59889 -235008 -288172 -378202 -137871 180472 -357731 -152784 -80309 -101224 -112056 -350632
18447 -350632 -312058 2071 -94137 191353 187368 -366098 162472 134877 -232152 -111689 87737
18435 -48043 -46978 -80438 43626 -142965 -277664 -31649 88515 -126627 -204000 -123282 -159676
18424 -159676 -343673 -79511 -174081 215847 -84336 -244285 -390441 -11957 139703 281473
18414 281473 180748 125132 190745 143787 135967 143014 132482 -137870 -6548 -5617 126602 72097
18402 72097 12325 294965 -24939 5202 -413205 5059 71023 -87110 -114901 -333633 191570
18390 -311046 44267 -55221 78171 420093 -354923 -121666 -100185 30079 -165515 -52067 -237323
18379 -237323 -35381 -121412 35350 -167049 -64717 -206681 198089 -23082 -126453 74842 -341208
18367 165045 -241102 29327 252271 -139267 221648 -98174 -165519 -307847 79174 -161166
18356 98252 -128269 78961 -205279 145971 -127846 58229 -159573 36610 -35721 200530
18345 -89645 86970 76077 -118022 -187275 -48311 60193 225680 -216384 67362 -51971 129609
18333 -313137 8282 132055 -188606 190053 -160982 -195739 89872 -39696 28919 -317100 72340
18321 -400998 -105992 -186335 -92965 236238 9827 -29996 36588 127899 -404333 -81469 135869
18309 199044 -113498 172870 -91346 -198954 254303 22376 -101246 3428 -129009 -32224
18298 -166110 -90507 28243 -70680 -298218 33911 -183824 -254569 -138762 -183720 32863 225551
18287 225551 -260211 112734 -622 108191 56369 -70355 -108680 220183 -85594 -68625 -35157
18276 -35157 227256 131353 -30644 186146 -281592 -17285 -356735 55686 -164458 -125449 -123210
18265 -123210 114294 177175 -45740 257905 -336442 -59768 -221448 -157180 -222998 261686
18254 -248409 -42588 -53439 -288641 -30006 -10074 223053 -25527 30942 -21211 -107263 -142246
18243 -142246 -119778 -129649 138996 -182693 50640 -128229 -96049 -7238 -125469 -8431 -40119
18232 -40119 284578 10591 272372 -242058 -134302 -120979 -268217 103545 107797 -90862 -178268
18221 -178268 149956 -38832 -142152 -84620 117145 189116 -134154 -164659 -484129 -367076
18211 -367076 64942 114621 -270568 -11137 137468 186503 347543 -314307 121294 27536
18200 44990 -55377 -342350 211145 166101 -29902 -250662 -216852 -141297 234271 280178 -72133
18188 -87088 26979 84430 -136382 149779 38198 217964 -162616 -56882 -56461 -23608 193528
18176 22411 29824 222368 41997 34725 -94123 -29882 -100840 182051 112311 129039 -138263
18164 -162160 285099 -357535 -144427 63159 -15602 -151916 213852 -127946 -199557 -255900
18154 -255900 32419 284904 -256983 -258234 125697 -228381 -49316 -154254 -343270 -61887
18143 -111425 124238 -135659 -203002 42175 -343544 -48567 -34931 156098 -169944 -13444
18132 -9481 -268650 -52237 -86853 -97044 182326 -80582 -96380 -118103 112616 -372722 257575
18120 -93243 -35343 -109278 51814 -234559 4503 86143 63379 8654 -202182 -212463 2381 102879
18108 102879 270907 -160333 208834 -15560 37789 53249 -8623 -144081 -217178 23908 250496
18097 250496 -171593 -22081 1999 -82335 -44603 97260 195674 129522 222793 -38109 199732
18085 17096 150108 90496 331856 -200808 -64835 -309840 -225946 156637 -62525 -55294 -236321
18074 -236321 -305011 180380 -144855 235586 -31350 -69173 36797 -20189 39502 436781 -65587
18062 -145263 -213790 -147113 396284 111981 151918 -224801 -101397 58117 31325 433702
18052 433702 -7001 -22607 -154203 88585 210396 -159031 189250 47260 220711 -252295
18041 138259 -213216 -191619 -106683 -212604 -34874 -72414 10948 -33931 -213431 -287862 -84001
18029 25293 -234145 13296 -264469 -23986 50871 -32165 87007 73062 -363220 35274 -40835
18017 -144864 99550 -18198 -15196 -225301 10738 291003 104559 -302110 28421 185501 -50615
18005 -138668 -83446 450503 71670 33390 -43300 79440 -45028 146537 176475 76098 136521
17994 136521 -10676 239569 -20477 -140554 -13507 62520 -3547 -116415 203913 -262202 243294
17982 41945 250822 -140412 -175053 96152 -217167 -6477 79149 -124015 221404 -255928 -87847
17970 -24 -208830 -187140 -142503 145146 -167560 250280 -117553 -120685 -118274 -134113 -142852 128399
17957 32890 -134323 -27115 148683 -184048 -181268 154471 251379 18789 -71070 34505 375323
17946 375323 -106743 -56725 -186029 69366 129660 92307 -8330 -55795 -95786 -152596 -61492
17934 -84747 -140810 67772 60057 13189 -159143 76056 223777 -68988 30997 157799 -47413
17922 -170878 -6424 -233654 14453 -70418 -189936 -133468 -136548 -73965 39271 38744 11554 3075
17909 113144 120152 -264198 -54476 216603 -85594 -44592 -183840 219881 -169496 -240509 -61063
17897 -136488 76425 199607 -44692 43537 -172376 -280895 23892 -17077 -233873 -50355 99354
17885 37622 22114 -45154 -143741 143286 -147280 -31814 -40574 -55767 149068 378959 71339
17873 3213 -38014 196106 -3388 216407 158303 -302520 49373 -300357 5246 375951 -168831
17861 -2350 -242577 154313 -430216 131726 -5851 -177699 -94963 -147139 272283 176822 -58613
17849 160945 227756 -169051 100258 30541 4318 57717 2383 -218423 207281 8995 1239
17837 -54358 -79458 -143256 -123374 -55714 -103308 149651 49154 179652 42316 -152248 -642
17825 -175059 -247363 -235953 -323863 -195700 737 44340 8368 38338 112325 -49916 709 -367197
17812 123980 -5909 137471 15951 115260 -109354 29056 45936 197382 248153 286523 -54915
17800 303212 108147 115551 99625 43266 108715 606 -184467 163137 -35879 3290 62412 81160
17788 81160 -104557 -163095 332015 214558 -2193 -48928 -20601 -185921 22112 22846 -130329
17776 -35624 36324 110308 -8717 74518 -242352 26749 -193630 98499 -96181 -35280 113073
17764 7459 -46501 200597 115358 151440 177284 -133590 148837 334998 -181342 58845 -169481
17752 -39527 250609 -15081 229825 152892 441033 -42142 219435 87097 173568 -112468 -241299
17741 -241299 -14432 -175073 -22260 -101800 188183 -3839 221757 70273 66118 -53062 167681
17729 128694 -786 -338097 175930 312086 -3222 154720 207616 -219770 31338 408835 54309
17717 -33646 79735 -60381 -127117 106605 -113160 229062 96250 -68448 15631 133424 53907
17705 -238753 6622 263290 -104465 314881 -109896 -179031 -434267 -163661 143526 -72543
17694 234717 -18123 252375 69522 -178354 -58535 127448 33167 306810 -50762 23526 -26124
17682 -170861 402127 -13257 73979 -24574 80967 54195 -27804 265937 -128407 186439 20583
17670 -217202 152350 -76080 159418 99296 94518 -165208 123072 296751 53805 108076 172480
17659 172480 35313 -87984 -11242 70391 322447 -70349 -108387 68745 112554 -156942 -61139
17647 -177591 -90900 120728 59970 -376577 165350 -2625 -195227 -365737 93487 246820
17637 246820 -249655 -312944 -73359 62254 132987 105115 -53149 208317 -34815 121502 200824
17626 200824 -65969 -42805 136230 210946 -540 153211 -101007 227969 -171090 121772 10046
17614 91090 4354 485778 364812 326343 -200887 -258435 80550 71297 25110 386730 -115168
17602 33717 135950 -2273 151946 -172726 299029 133459 355817 320660 139098 231636
17592 231636 -72393 -309889 309903 167454 67748 321458 23492 -2969 26518 -92289 -4783
17580 -18704 328664 -45923 -41903 -206229 236968 128102 136167 273174 208642 -79099 67416
17568 -84764 -157419 190507 -26921 -91003 71093 36919 -16053 -190638 100292 109645 61797
17557 61797 296859 267704 49387 -70319 -62949 27004 236551 -44724 66682 164488 213787
17546 213787 81231 249655 300609 62356 228338 321876 248259 -4525 22707 -330470 -49294
17534 92248 -25544 -126372 -33002 294939 153723 161079 -173531 218750 261547 233814 28320
17522 245723 -421188 50819 211118 248104 147110 -74089 241907 239005 235107 184126 303041
17511 303041 119567 -80955 30841 -255694 110607 236578 110577 -68428 191449 33612
17500 50002 41201 225061 64217 221701 241359 281638 2909 46363 73456 118212 146659 76493
17488 76493 156522 112278 116280 87964 -1202 426466 269980 33665 96781 392435 66681
17476 40885 253434 245065 -376102 68640 214685 136108 -128759 206421 146149 416115 191024
17464 184382 116523 126552 232566 -39565 -200302 -141258 539517 401622 133975 64295
17453 40273 92499 97416 93752 40357 140655 307206 394868 302615 298336 268582 502134 186949
17440 -96496 324005 407258 -125685 292949 476489 291018 172161 480988 144132 -100562
17429 344986 350393 221483 177014 495012 304838 216243 517511 243104 215474 -104847
17418 408018 233465 395582 631212 366489 146173 507047 177870 221553 396818 43074
17407 521972 138145 204874 180023 -108102 311268 52055 33055 23401 48181 586185 169163
17395 157372 238763 -281335 451389 -105594 138638 362123 184156 173763 205879 215710
17385 215710 113726 65443 137829 125960 -73324 -42468 72648 65186 347726 -10533 111894
17373 41715 295120 216970 244954 213111 269250 97074 -103386 -277 313319 -57841 -3788 106269
17360 150129 155131 -113928 424995 -47555 149227 140399 227751 304990 379385 137925 269152
17349 269152 126475 61511 -78528 370679 -196052 -280444 145185 -100402 91567 -37482
17338 144718 248258 22059 -286095 594680 28511 -94986 57891 -3457 224008 97411 388547
17327 388547 112633 189019 303359 -78853 351474 23539 36321 -128571 102615 48611
17316 161544 -196050 194242 248122 10806 191975 308905 -39004 138225 18747 89369
17306 89369 26616 91691 257404 99436 196986 302807 240343 387726 193039 -21404 349490
17294 288749 -19803 193416 260109 238378 71390 -171910 333514 121445 52314 38852 354261
17283 354261 -66366 34881 341276 218045 300976 -31356 73277 217491 60942 209717 480057
17272 480057 126838 105327 280172 383708 95921 298395 52560 97670 78251 -180797
17261 184193 284032 99184 -117044 150124 327340 343888 317528 226028 136094 295127 305945
17250 305945 367857 262281 88364 370048 116716 545162 478940 152481 377917 174901
17239 420531 200436 151237 170024 290257 247310 339833 373272 534677 314096 406012 220078
17228 220078 5295 99328 544150 89935 476610 282361 28713 324380 162105 133563 511922
17217 511922 423146 -3520 237877 114426 310552 177619 -137740 311063 -45865 328642
17206 479704 213928 7953 131890 124549 307995 250332 112674 174237 -110510 258839 254208
17195 254208 320194 340851 165992 158902 218740 157379 433395 268532 300232 122668 650022
17184 650022 263935 402041 80245 465547 490475 153867 244706 217348 197803 272008 394024
17173 394024 611681 260597 183008 137007 157258 527711 699705 328762 11243 354358
17163 354358 175389 296884 231323 198587 273020 418577 109584 188524 706485 144506
17152 498584 164161 385170 -6876 447771 388664 143053 445116 539246 261945 553713
17142 553713 408460 509211 282732 150840 454803 314079 475406 352855 274542 238084
17132 238084 272141 200001 383253 438554 332758 670297 235109 456094 610617 -54420
17121 308279 462483 144102 534207 620553 500711 424571 516475 294460 149913 496740
17111 496740 671773 797325 616597 629680 643974 227548 900389 536235 390411 346017
17101 346017 505350 386770 577194 414900 485553 198944 162738 552352 822370 228535
17090 669357 494498 353650 784119 277610 626496 264924 434060 461209 220677 321385
17080 321385 547146 468282 430031 472118 498615 369118 392321 657584 642686 445202 534362
17069 534362 692377 595999 481565 785709 288023 555736 376684 695176 311863 707599
17059 707599 485841 251958 535665 627942 415491 664240 515156 610790 881227 578823
17049 578823 464516 315715 596053 693156 851323 303847 435711 631076 596505 423825
17039 423825 458536 459635 683389 851104 816169 929123 470460 724115 702248 493302
17029 493302 803131 728915 480266 673859 908058 570352 685485 766996 1248641 754905
17019 754905 719020 374635 730321 936945 896550 683911 939539 736280 783866 864075
17009 864075 560601 769523 772145 908964 1174455 678195 1020116 1101065 884577 891204
16999 891204 733796 957870 661304 877998 910957 912612 1065102 741149 992553 1016022
16989 1016022 962146 1182014 717878 1040913 981462 978510 1034283 757609 933361 606127
16979 606127 754118 989951 769473 1164283 1122415 891132 946695 1162225 488441 1136144
16969 1136144 919341 955281 893486 1018875 677904 1265128 923781 1045161 1147932 1176472
16959 1176472 934411 840845 1417696 1371010 1136989 1299441 1168683 1129941 1068486 1215526
16949 1215526 930849 848861 1614022 1114287 1415247 1448314 1325601 1438498 1315803 1280733
16939 1280733 1424654 1435053 1349053 1528843 1444064 1411811 1582976 1612837 1435601 1307819
16929 1307819 1339498 1619855 1524232 1236276 1277336 1664437 1612196 1346171 1425679 1694887
16919 1694887 1811770 1648108 1726708 1828248 1560269 1857311 1585342 1708784 1866360 1799200
16909 1799200 1721750 1629895 1675307 1566341 1750111 2031033 2166283 1916294 1971918 1977126
16899 1977126 1899993 2088237 1665989 2086585 2082554 1770619 2276386 2305936 1939992 2030219
16889 2030219 2245254 2026784 2181948 2186930 2542276 2102863 2072325 2634352 2452298 2415901
16879 2415901 2641554 2209553 2364126 2675614 2545740 2816330 2714094 2578830 2876461
16870 2876461 3083631 2855560 2851916 3027796 2822616 2901040 3056564 2906269 3234869 3129438
16860 3129438 3335401 3624713 3326505 3456393 3491388 3365613 3426251 3727118 3424197 3767484
16850 3767484 3791500 3685460 3844263 3844566 3976447 4168161 4134753 4010293 4131927 4011394
16840 4011394 4244363 4414628 4694317 4238970 4403300 4513075 4512759 4537974 4883240 4747238
16830 4747238 5363425 5105083 5386868 5150225 5602568 5338779 5479782 5517316 5641985 5973816
16820 5973816 5861298 6349544 6067662 6208146 6242982 6593208 6859125 6728812 7045086 7169239
16810 7169239 7263357 7349517 7729588 7702689 7976465 7879707 8243983 8414031 8480375 9088249
16800 9088249 8672953 9192923 9239296 9648730 9921666 10225683 10523920 10691583 10912712 11024237
16790 11024237 11339871 11946172 11994401 12434236 12669032 13014269 13475030 13879835 14409681
16781 14409681 14691840 15254462 15432991 16234057 16421388 17163997 17365258 17721569 18881709
16772 18881709 19497904 19762332 20889607 21285706 22084292 22907985 23655951 24488048 25327500
16763 25327500 26519796 27514044 28339706 29372169 30173283 32459471 33064841 34468046 36005779
16754 36005779 37575622 38956232 41058799 42732040 44672125 47054686 48526796 51457399
16746 51457399 53588132 56004820 59089771 62127395 65254871 68534155 72027037 75794520
16738 75794520 79908299 83911391 88320507 93006798 97899023 102995356 107963024 113521450
16730 113521450 119044238 125088363 130858651 136623994 142327394 147895859 153215672 158063123
16722 158063123 162267091 166033901 168864938 171412082 172549100 172802027 172313652 170720464
16714 170720464 168218306 165017809 160982344 156253272 151000009 145366049 139470771 133209948
16706 133209948 127299406 121132534 114915077 109256496 103261508 98185126 92524203 87550016
16698 87550016 82879715 78241065 73908021 70037596 66232256 63074170 59349123 56567600
16690 56567600 53481043 50522253 48339029 45991727 43814822 41709603 39762308 38054057
16682 38054057 36101028 34287601 33079678 31677992 30345680 28775884 27553853 26398081
16674 26398081 25539183 24331929 23373743 22636178 21880554 20731970 20270660 19420900 18411526
16665 18411526 18131922 17686174 17126193 16554991 15828845 15225435 14759146 14796200 13777044
16656 13777044 13678964 13000026 12615654 12299255 11861541 11612867 11160969 10759474 10485052
16647 10485052 10518415 10022732 9851194 9341355 9271918 8899012 8692291 8588466 8464279 8028253
16637 8028253 7778833 7774110 7484130 7314826 7115439 6720131 6728727 6567732 6346412 6412209
16627 6412209 6367666 6140206 6128674 5943693 5838248 5694348 5706566 5378542 5376883 5272207
16617 5272207 5229855 4988208 4879117 4615265 4624173 4679722 4299080 4310960 4268017 4204489 4267243
16606 4267243 4169815 4090129 4126639 3963067 3930583 3770820 3461895 3475301 3643310 3500565
16596 3500565 3197741 3241693 3108731 3200251 3125284 2890057 2980833 2866062 2955190 2747010
16586 2747010 2855897 2499745 2538482 2822535 2842057 2533546 2361684 2628098 2529618 2388254
16576 2388254 2203976 2046813 2226540 2182388 1921575 2192547 2040722 2107889 2244691 2456153
16566 2456153 2170921 1849110 2026140 1976959 2029233 1593658 2049369 1977127 1670095 1717605
16556 1717605 1869563 1876728 1546909 1556287 1857521 1720069 1668101 1590152 1635772 1959474 1560095
16545 1560095 1361884 1380155 1528690 1500363 1564561 1450397 1347941 1137798 1407366 1633421
16535 1633421 1216391 1245690 1313054 1562020 825508 1097133 1535425 1521051 1249908 1347655
16525 1347655 1166354 997543 933671 1124729 1163468 1120037 1043070 1270989 919029 1153509
16515 1153509 1288774 1178098 814445 992681 1143779 1104795 885473 1042310 1091491 922916
16505 922916 925886 818990 925328 1328143 979040 1020901 1194460 661018 1360509 1094872
16495 1094872 939403 1143300 962173 918698 930485 806242 640219 1242082 625776 865994
16485 865994 520346 685196 748217 986855 1076646 675721 1013599 1037911 656675 816906
16475 816906 710137 730769 699709 849732 383602 754845 725340 893040 621464 545458
16465 545458 659650 706700 862639 687200 651643 461806 427907 582658 955654 543679
16455 543679 458450 429266 736434 600285 393053 396686 702345 407566 653183 546510
16445 546510 395556 608524 733328 462757 662928 845814 800625 369177 404551 779147
16435 779147 840750 550071 635163 548556 73219 136194 468727 628657 592754 509951 214671
16423 479281 215040 495308 345745 376394 357110 228052 363024 483868 177671 101784
16413 101784 604383 243782 683653 234328 383170 448806 447878 596437 431790 775283
16403 775283 181770 360233 484643 328302 459043 363741 305004 492921 212448 94347
16392 399001 333190 324859 317618 620287 642903 75075 569463 187408 285125 371540 360784
16381 360784 336795 279866 650050 704972 242806 398785 136099 231613 409723 239289
16371 239289 197482 181006 208061 116738 416725 230039 55799 468766 162153 188732 307927
16360 307927 235556 204865 437380 375327 86105 485409 718981 258371 -171980 314331
16349 249561 144345 343337 244890 35764 7319 498560 209752 78250 87897 143187 84452
16338 84452 286770 -38457 327629 -36885 151086 194537 261865 351752 119787 -75752 89788
16326 161941 157683 78532 167843 9626 46204 -120381 -181074 184632 299904 92421 -165735
16314 -82781 137612 125123 340329 327112 75558 102270 354876 198915 123299 517011 260778
16303 260778 301163 284755 77293 -17266 -89974 60265 -100870 16835 38396 -57985 -12570
16291 224560 61283 192946 209073 345874 84192 286939 163910 -79183 416438 448421
16281 448421 373121 -90011 376975 298269 211828 198721 -44062 39386 177626 59130 282770
16270 282770 -206425 92289 63259 86840 186778 71948 -215660 -210558 -50037 275165 399392
16259 399392 73281 212988 371185 115086 -113871 147919 -12276 148759 -100456 -56704
16249 -56704 59558 -23071 13363 -52756 -63835 82680 37247 141095 109670 -52614 248591
16237 -77052 -163822 63682 -46787 50649 183974 21124 238222 -10598 -7233 -28835 6121 226874
16225 226874 -170423 43526 -139396 -22873 128852 -262496 108389 -61000 -116735 172865
16214 237763 44335 153693 -297319 198110 -23542 200236 -204479 -244024 -115721 283076
16203 88930 -84549 213739 -164566 -28269 161009 118959 208717 5914 258432 -40726 116239
16191 -163488 428228 -64939 -235093 200655 -6759 126534 104194 55441 -91664 322483 -12731
16179 5629 232093 198304 -199259 -92511 -230245 7338 246632 -65867 72941 -40513 219691
16167 -173109 398184 -37877 183345 227910 -44717 93570 -36338 33595 286947 73433 175139
16156 175139 70291 151768 327965 70260 -16957 166928 -227696 231293 -34156 197923
16145 223954 201798 165458 -163608 68166 220580 110383 223575 -171933 165349 -106655
16134 -190842 309043 -215296 -185741 77991 -249683 -55578 119909 -74363 -4603 -85462 -156200
16123 -156200 51396 409320 -153262 223989 104671 216684 58363 -15113 18890 -294639
16112 -172118 -164274 92971 -87368 280624 207502 215858 -13708 267924 203042 420764 300515
16101 300515 15122 160305 290465 -202984 -95670 121078 -34197 -200832 145547 -234663
16090 -103265 -6565 -135440 427640 -307633 -63364 -219795 232975 88146 391 46095 -89225
16078 58543 23824 187856 92698 378097 142615 -259976 -86034 -106675 149773 150812 -83735
16066 -214676 256261 97245 256325 -157146 -126533 78260 -4137 34993 -139169 -163306 8696
16054 -193799 86445 270210 -213992 -222660 187614 -93745 -26963 -137736 -14081 -201851 -83107
16042 -158046 339615 35867 81363 359290 -332576 -321471 206504 -301721 -81319 78783
16031 140058 -339839 203478 124576 182867 -133720 90180 -36337 -153394 -268643 115893
16020 -41671 147293 -43651 -260658 -7093 279537 -23824 -136157 121897 308388 292136 -51793
16008 171589 -142631 99717 -34314 21071 -16593 15236 22641 28324 -157723 -4745 20692 -299380
15995 -57924 56416 80500 -150553 217883 -38320 -104968 241597 10358 86578 354486 240789
15984 240789 -230243 277674 312677 244754 464862 90656 311649 -131224 146471 -51509
15973 -125392 -23905 -312913 -169319 -346431 1528 129924 -202721 -212624 -93672 -144305 -28376
15961 210468 -244372 -49285 93198 -214705 -11607 -180347 -263795 -9250 206013 -125962 24187
15949 14032 154491 -146540 44226 255415 -115759 -302502 -68189 -55579 247615 -63955
15938 -245102 -291067 -91914 68980 -106937 -161026 -150455 344653 -178541 121412 143735 -37585
15926 192743 -15369 -4745 28567 -27071 81781 -147477 -215730 -49562 -94857 -160370 -358186
15915 -358186 -323899 143041 146494 182888 146846 -233260 212400 -256214 65744 -76824 40189
15903 -35152 -7593 -6780 209179 -58211 209283 -140281 214788 -195776 -169424 24768 -55523
15891 -261820 -6220 -164210 -190606 108453 -300523 79934 80588 -52452 -198025 -73260 -119560
15880 -119560 -170908 -59819 -215156 -72138 -20051 -14571 -129439 -179706 35964 333945 -59826
15868 -83809 -61356 -191268 69618 -170960 -37495 54995 -65268 -35306 -141344 126698 -343101
15856 -144773 -62716 -98133 -6320 -199930 -143386 148496 -18794 -305297 108392 91178 166771
15845 166771 219667 170306 153516 -164101 -360453 -36821 -401958 189642 -27595 -305230
15835 -305230 -2667 -396166 25415 33884 -20106 -226662 105728 -196933 39193 -290873 53234
15823 97084 -199836 -202431 -82679 -178328 -250066 -100588 -90774 -163365 -183916 -215190 237218
15811 169248 -144482 21802 312184 -144845 338708 -291140 147560 -133002 8974 146657
15801 146657 16660 -127222 52295 -53534 39644 -181110 141442 268459 -43661 88364 -123520
15789 -224402 158468 173469 27664 -244679 -155642 45877 -206142 188340 97006 -18875 133606
15777 187797 114950 -157240 -181990 -30889 -175337 -53078 -69536 44791 -494924 -80383 324879
15765 -227630 111597 -257174 195607 287860 -40687 186355 -16052 126110 124630 32127 123119
15754 123119 128343 96120 -96268 113671 134530 -11480 202119 33975 165325 269604 9701
15742 192231 -17439 134326 165270 -138352 167613 -15363 72104 -1185 -318331 -294540 -220901
15731 -220901 -98588 296892 -30912 -43883 -252035 -270016 124760 -190025 246696 -124615
15720 -293683 -246874 -295097 -121642 -432920 361753 -115414 -129509 -296941 -25926 35467
15709 294736 -16661 -124196 -82870 -163579 -50843 -83155 405442 -255586 30543 -196236 188082
15697 -106242 -106103 -142703 362150 96093 -56143 2660 144487 246286 -201328 9267 -153551
15685 220429 150952 47690 -304 -252670 -54570 -102584 23709 1342 32887 295596 130994
15673 -274072 -128562 47361 205816 -49778 57252 219656 -7441 102976 -73824 -62879 -287786
15662 -287786 -232330 50233 41432 -32549 -397803 25716 75992 -211599 -49358 -102163 -116906
15651 -116906 -32747 125284 72179 184856 206082 108780 115187 227438 -23919 -66445 -311737
15640 -311737 -260202 -190281 347777 -46327 161415 139177 -143563 -76849 -111346 258170 60286
15628 -253932 -316486 -41494 4132 -70021 -48382 -39484 559182 98029 310447 -81839 156552
15616 -82943 -324945 95118 -1400 86979 -555 534409 -143021 -74724 -114946 44780 -195381
15604 73051 -120026 116157 298288 57297 -7383 94518 -74872 -174127 242897 -237389 87952
15592 -115264 74617 -242257 -162275 -118237 491921 6127 140152 -132351 -31940 102839 -264630
15580 -117276 -137072 211147 86274 217736 131467 -127090 -14169 -168511 -4537 170821 22789
15568 -32541 197477 91363 80397 77327 143947 26867 55458 101892 -126649 -59647 211063
15556 21305 -243663 -46578 -81375 -126710 -150684 -79779 -19884 -244819 152814 -40041 -25365
15545 -25365 -354902 -116319 -6361 -164617 -38712 11426 -155927 -35371 44357 226653 -20335
15533 -14160 -271727 314990 -167175 402239 -20337 -118314 222405 -35184 -157257 190624
15522 -349482 -54879 253168 29744 -69863 97807 -69930 -46487 138631 -189551 -6605 159549
15510 181357 59899 -117935 -76414 -931 143185 358738 -68885 12666 -5266 256259 383647
15499 383647 197043 293024 -120971 7544 -217239 -110053 -84585 -78395 49678 -233490 215858
15487 255667 -123625 66509 38979 26869 -158971 7968 -5947 7019 295718 51009 32025
15476 32025 10311 -49335 8169 273468 -102625 150936 -227569 186672 278138 -57875 29113
15464 -25051 -140473 55335 194679 -166883 243168 -8809 85560 -123931 318529 -3309 415503
15452 -64205 -9641 55089 89605 -57135 29740 -1175 77693 -209362 -250736 32754 -76366 54524
15439 218668 309621 124384 -434796 170092 180864 -106094 -64971 -62500 268492 -35935 18032
15427 63800 32343 66743 -102604 43536 -43064 60564 -56488 -231553 5248 263387 -5281
15415 -64073 8128 -165881 66516 -46618 -293386 168901 95248 -83869 163433 -31022 302113
15403 114260 -59867 209428 34055 224760 -194404 -236611 -169165 142797 -358686 -50803
15392 143186 -110228 -25941 166475 -73693 222126 128360 -86809 118901 193832 -147148
15381 236413 -46926 -173061 -319598 -416565 354960 -26871 158979 -27207 234173 117382
15371 117382 -44829 155007 -34615 345552 -98870 133431 144534 236623 -102164 -49252 -71464
15360 -71464 78293 -97404 223518 -160060 96779 -10828 238182 -43001 -298190 -140788 -56877
15348 120104 -135735 30648 176414 -1772 188180 -173821 314062 -171853 201183 199461
15338 199461 -30075 -178065 420729 -143902 68011 -249767 -35786 35864 39818 -235213 255739
15326 -17044 303843 181738 124977 -143515 78228 -349453 -174064 21951 -3381 38473 -169962
15314 166688 -16127 88873 171187 222837 -3894 30313 -267907 -67836 163453 168410 -171903
15302 27467 34548 216490 -146352 -33669 86425 73477 230699 75892 337572 99373 134597
15291 134597 -174591 113824 329420 -131144 -34198 -322522 186130 102262 319174 -117664
15280 70873 234745 -2248 111826 -263298 180591 237177 284325 -102649 223005 -227046
15269 -66729 -16675 261896 -15751 -122741 -122623 175418 -407913 526381 75682 196800 -229212
15257 168401 300772 89583 100493 221039 286843 532323 41634 434045 -25927 309101
15246 670038 1744983 1386343 1219501 944704 593760 109956 -42810 331107 -66808 134959
15235 -102124 400361 -73324 140616 238721 302938 60356 115670 -24338 -131054 75605 182220
15224 182220 112741 417893 340157 -264276 216222 -70581 31989 -153405 52770 -122209
15213 -131001 277206 161915 26015 273061 -27414 -127185 112774 208431 2894 40430 -138368
15201 269379 73939 -174288 32401 -17721 278669 103032 -21247 37530 -149455 28448 75829
15190 75829 -141123 184177 377464 -293706 -4493 114442 192004 37488 -299464 319813
15179 16134 -99900 -25411 295741 331945 127180 72967 -191017 182858 3130 86990 135987
15168 135987 -20515 223595 70423 254246 43035 279733 -145786 92900 92914 63103 -5596
15156 24203 153815 227165 242400 171288 433567 146028 15881 51562 72690 416246 59359
15144 -20324 -51924 419122 1182 537529 -22490 -130299 357622 522866 87800 319176 18135
15132 138708 123629 -58863 129995 113365 163583 253837 -85610 43793 3545 174851 387217
15121 387217 386195 401710 388811 -16417 -52581 19285 126384 384989 464664 180913 -37674
15109 60988 78909 237432 330710 291364 333076 169351 139518 -81402 154895 -55127 68713
15097 230473 144730 107950 276316 161192 184736 -34031 478247 337524 188196 -51444
15086 158847 -2116 -201062 215980 -51584 189035 -159054 97238 77649 156531 -55737 235378
15074 -260402 303688 383251 210338 10438 -119859 296334 -90978 273909 247365 253110 226341
15063 226341 92694 279951 -72540 -59358 191201 349854 394464 390037 -240905 173321 36700
15051 122339 287666 175010 8435 554777 192537 195999 309165 161907 -50716 479546
15040 190160 87248 262084 -186661 362607 92151 199562 52789 160619 356982 358844
15030 358844 116227 146611 170308 240335 218452 112867 639384 212353 166385 54459 248830
15019 248830 521727 184630 59322 140976 232464 216655 143039 171090 296015 262609 190479
15008 190479 208598 26563 131354 123249 105761 217634 139394 52721 309534 170709 176758
14997 176758 353968 57220 296889 156461 42055 -133495 291712 196343 427227 2165
14986 323990 427084 521799 382801 85220 211497 86026 246875 153396 548332 254116
14975 230414 184370 -134530 331489 179065 82900 102162 -43287 150983 -8945 246586 75699
14963 -11525 200825 167997 284264 234906 90273 199997 454592 499473 86933 301247 113368
14951 513327 -53749 -75646 320480 443334 34993 150246 133897 336563 423244 231600
14941 231600 87343 222425 427611 434741 249413 252684 299010 150735 511122 78629 127628
14930 127628 494838 234916 529178 406007 166480 290927 346474 159685 248937 434333
14920 434333 568736 188466 381706 70500 559782 305505 299508 330295 449105 421972
14910 421972 49727 343585 517127 579938 330802 34658 259249 337180 133703 570799
14900 570799 279396 472961 551426 335069 273191 426523 390497 301859 323341 308084 351420
14889 351420 110255 -76323 463029 195186 212637 502462 372071 622856 602743 535939
14879 535939 525869 314993 290472 205245 237310 216830 236241 718929 46079 71560 189286
14868 189286 226315 208123 34947 -31499 312694 284829 551860 366146 40497 408392 521421
14857 521421 3691 319557 405330 246101 326976 447350 280438 288500 785174 292625 362231
14846 362231 598257 642105 269293 611845 670668 483150 458959 289196 816827 609060
14836 609060 554503 417730 666007 179193 571555 467976 648449 598731 567368 937470
14826 937470 454869 498422 648841 769098 382973 184359 421386 172461 585051 396888
14816 396888 437271 463697 665419 713622 394080 637038 673571 650619 541608 356001
14806 356001 569914 708447 485924 344746 940302 423578 566988 321441 612299 436888
14796 436888 461895 598020 523858 245419 707177 329125 742669 776855 463429 523602
14786 523602 465959 639543 440778 873144 320035 853869 708091 505542 393057 527815
14776 527815 609773 696015 583522 900394 688828 953551 881154 470909 639960 674448
14766 674448 483933 554647 662707 582988 714712 640237 374641 638879 754038 648718
14756 648718 801646 891887 744082 762754 592936 442233 754169 230590 504506 715921
14746 715921 631133 476228 704956 820830 921582 720129 590250 834655 841162 773169
14736 773169 427394 826674 788762 599810 630234 869421 401886 863878 952111 672705
14726 672705 606342 696602 951485 724333 567992 710947 899808 865894 816132 583031
14716 583031 706295 823281 1178809 727433 804646 766779 827455 666153 734782 923800
14706 923800 720296 1118197 890878 430950 824781 974458 950372 667379 653595 813280
14696 813280 858595 909932 832279 786777 1097710 918857 1038874 761259 956746 599634
14686 599634 909835 1047312 720294 639601 956112 795129 909093 853523 1009040 888878
14676 888878 1030736 1257513 1081586 1123006 1048686 1192939 1232464 1049847 486483 865751
14666 865751 1253037 954059 1476532 1552400 1119547 917260 848447 1119907 815587 956062
14656 956062 937728 1193399 1047620 1323729 1294431 1137032 1093199 1461264 1164786 1125744
14646 1125744 892784 1264796 1313570 1183158 1386094 1222121 1262902 1255582 1385615 1386430 1301178
14635 1301178 1191230 1166766 1157826 1024144 1181242 1598279 1252675 1251912 1467684 1452334 1547498
14624 1547498 1510557 1445436 1740934 1325528 1425465 1519012 1548428 1564077 1367825 1600200
14614 1600200 1205975 1199031 1615189 1515908 1489630 1478571 1416036 1586763 1418993 1575277
14604 1575277 1265814 1585459 1813280 1191870 1629850 1678149 1786669 1511833 1448462 1446379
14594 1446379 1584216 1527923 1562670 1592733 1568937 1829206 1764907 1742905 2024839 2036372 1875446
14583 1875446 2102856 1758634 1877283 1758544 1993203 1882270 2059367 1925412 1944454 2073539
14573 2073539 1659372 1898281 2181428 2444623 2632791 2115103 2168111 2404565 2180211 2398938
14563 2398938 2617312 2428656 2960510 2475527 2743555 2846686 3412512 3211050 3304997 3245071
14553 3245071 3543845 4221486 4763214 5667572 7176285 10969446 20881693 40447003 43110162
14544 43110162 18406164 8970351 5462447 2908386 2530322 1762402 1753679 1914094 1554419
14535 1554419 1721370 1798205 2075338 2118206 1803791 2266916 1895469 2188999 2188761 1679189
14525 1679189 2246964 2130701 2303722 2232280 2592759 2265889 2345770 2606744 2380496 2283974
14515 2283974 2830653 2658844 2564841 2726207 2878183 2400812 2888437 2719717 3030244 2971589
14505 2971589 2820240 2869713 3113928 3038363 3064065 3169376 2981346 3150696 3079496 3013581
14495 3013581 3436890 3231290 3204746 3279165 3356619 3339065 3400096 3511744 3752171 3865557
14485 3865557 3676300 3608781 3657797 3817569 3699641 3701645 4086287 4012255 4171843 4296893
14475 4296893 3807728 4217408 4380921 4234869 4454255 4198988 4265691 4451123 4491184 4460355
14465 4460355 4727817 4572783 4260197 4515990 4570411 4708884 5050354 4822371 4936632 5036582
14455 5036582 5085109 5158747 5202742 5151435 5370554 5175703 5422439 5224898 5672264 5548136
14445 5548136 5989661 5847707 6016417 5998790 6208702 6232846 6333279 6348141 6347695 6359366 5962256
14434 5962256 6578577 6339508 6751714 6773956 6972599 7158615 7276268 7487100 7387861 7465896
14424 7465896 7140819 7638478 7370667 7967062 8320743 7931147 8251291 8283857 8392977 8515595
14414 8515595 8759172 8579946 9053257 9440307 9270082 9179177 9171433 9743673 9634916 9661499
14404 9661499 10384282 10198649 10092812 10510455 10727582 10798437 11031452 10801083 11265534 11259271
14394 11259271 11355427 11858024 12119348 11906167 12534844 12868200 12911321 12760419 13372050 13091245
14384 13091245 13655470 14152387 14061211 14642821 14907881 14601744 15476850 15382851 15749880 16176217
14374 16176217 16348622 16955026 17057157 17362206 17720756 18210871 18408159 18891975 19218460
14365 19218460 19795100 20078748 20294544 20980594 21532259 22143946 22411153 23218017 23195832
14356 23195832 23837158 24383204 25023985 25417481 26221610 26871417 27659883 28277432 28942291
14347 28942291 29731976 30434642 31301660 32271021 32606655 33639790 34810533 35659397 36624505
14338 36624505 37894038 38766329 39856713 41076224 42480274 43939306 44638521 46323915
14330 46323915 47692633 49145802 50868058 52914503 54537416 56168641 57802933 60237625
14322 60237625 62412802 64611127 66672644 69479192 71694609 74729197 77308005 80470575
14314 80470575 83842096 87017682 90546558 94309474 98742856 102773392 107071969 111352164
14306 111352164 115857337 121305600 126195601 131874062 137678894 144286219 150734824 157805644
14298 157805644 164966428 172905456 181492536 190287514 199168288 209250748 219703531 230359958
14290 230359958 241346226 252982403 264268265 276937362 290215742 303552288 317614145
14283 317614145 331674734 345682196 359889825 373820585 387344097 400664303 412981413
14276 412981413 424413750 434760218 443294885 449548591 451803677 450152324 449426054 448479222
14268 448479222 443872592 439113626 431952127 422645103 411147871 398360699 384465499
14261 384465499 369602929 353960243 338519135 322960981 307577594 292584900 277887385
14254 277887385 264254367 251692131 238898272 227006867 215340596 204374485 194031956
14247 194031956 184468911 175094930 166765308 159071823 151355980 143956740 137245237 130990578
14239 130990578 125042061 119919217 114834918 109908242 104853591 100458806 96327086 92279759
14231 92279759 88979930 85723784 81802779 78834949 76028401 72856486 70167728 67675077
14223 67675077 65099561 62787288 60586806 58592553 57097540 54956574 53099299 51401993
14215 51401993 49803494 48534456 47026782 45717072 43894229 42388380 41676590 40488960
14207 40488960 39701973 38533378 37075389 36257622 35181487 34108687 33532204 32621524 31656973
14198 31656973 30893913 30196140 29085781 28571868 27939901 27517971 26717933 25569757 24992257
14189 24992257 24591826 24068403 23652235 22948761 22466553 22033367 21444599 21172828 20576313
14180 20576313 19823389 19629745 19562640 19197752 18477420 17781223 17963007 17520301 17146042
14171 17146042 16866513 16735914 16267782 15868116 15135547 15131392 14961319 14682544 14536368 14385175
14161 14385175 13858202 13626259 13173785 13130786 13127650 12841391 12593504 12468357 12069573 11821406
14151 11821406 11810084 11410242 11613922 11262152 10949338 10658547 10664140 10450162 9991530 10307521
14141 10307521 10102412 9959782 9240251 9376494 9325129 9370946 9049730 8743928 8708863 8863849
14131 8863849 8557439 8624147 8575064 8508066 8242450 7895031 7983298 7860570 7743992 7664575
14121 7664575 7763409 7369049 7501617 7032014 7033085 7065565 6880563 6441523 6549477 6529377
14111 6529377 6555040 6429939 6303995 6228382 6127081 6333392 6037439 6007081 5840617 6004343
14101 6004343 5958112 5791448 5720901 5722307 5642973 5483004 5406870 5650368 5488218 5251185
14091 5251185 5163872 5304841 4996767 5103903 5053695 5193757 4850352 4611045 4921871 4533824
14081 4533824 4521980 4856053 4446364 4757989 4755838 4492025 4455807 4393250 3973351 4297779
14071 4297779 4254581 4161092 3939274 3897314 3840445 4108555 3856705 4148662 3816937 3684857
14061 3684857 3642649 4017759 4041498 3756668 3679433 3769321 3610203 3500467 3548553 3393863
14051 3393863 3565486 3467402 3468150 3688477 3261364 3390793 3381655 3078744 3104293 3196179 3152421
14040 3152421 2926687 3019551 3012170 3133196 3082999 2878325 3124979 3064386 2762332 3167274
14030 3167274 2830008 2957625 2807158 2941556 3150400 3136903 2914215 2808254 2532565 2578636
14020 2578636 2539589 2431397 2359965 2630455 2623114 2351344 2386755 2371598 2234244 2215974 2323579
14009 2323579 2142538 2455169 2498624 2298875 2533808 2641531 2207617 2273832 2175483 2123184
13999 2123184 2333714 2234453 1864319 1862722 2213777 1953061 2279436 2478282 2067982 2554698
13989 2554698 3595051 5974337 13366326 31906361 46505725 25350450 12421803 7669268
13981 7669268 5540776 4287276 3442071 3518782 3040976 2591660 2841587 2589948 2023223
13972 2023223 2146519 2406408 2373614 2143645 2192482 2439712 2259240 2297367 1767911 2068788
13962 2068788 1994042 2262372 2121799 2044147 1830625 1967023 2049176 2444850 2199009 1899141
13952 1899141 2104125 1605069 1897923 2023397 1836657 1865619 1641486 1518884 1841314 1887623
13942 1887623 2019153 1746228 1730004 1951415 1701770 1672711 1472812 1500276 1752057 1521003
13932 1521003 1664487 1535485 1275439 1473793 1519596 1641412 1389459 1691390 1350178 1505289
13922 1505289 1469886 1477983 1592164 1432787 1353192 1290232 1533842 1105072 1310991 1546914
13912 1546914 1268824 1237424 1299217 1350106 1479541 1429593 1379722 1135208 1608258 1308245
13902 1308245 1292749 1269394 1297877 1298031 1325917 1181702 1343716 1359173 1358179 1337318 1358021 1088075
13890 1088075 1382640 1175588 1165647 1069045 1084638 1118755 1117380 1140396 1206435 1094977 1110643
13879 1110643 1134384 1324879 1294847 1142315 965122 1085671 1061941 1259515 1432022 1008168
13869 1008168 1375496 1173192 1294473 1120666 1192283 1093926 829630 1013385 1291888 670248
13859 670248 917642 1095129 844228 1107136 1010943 1039356 837333 798187 972186 764171
13849 764171 885456 891941 1260136 700108 974784 903974 1327198 827245 1089096 1098311
13839 1098311 1032723 585274 1165526 449767 1046514 843254 909845 1109104 947659 1231535
13829 1231535 902082 930627 1262140 958387 1032520 772796 837633 1100760 929028 820986
13819 820986 883755 870548 855303 1058806 687096 964184 764608 951941 713968 839972
13809 839972 685643 621425 827443 734984 631080 602954 826310 709096 738515 499214
13799 499214 947543 461809 315004 785438 698212 697638 706347 656538 741349 619446 344987
13788 344987 808629 576607 786455 895366 1117547 668358 648955 885077 469254 389396
13778 389396 735669 790458 593655 905639 669281 632624 470578 523731 801149 911439
13768 911439 759702 541184 517215 485398 756578 566874 855095 709476 652465 674949
13758 674949 733956 575392 430721 917695 676045 442689 498479 690239 526958 507682
13748 507682 485646 470092 431511 858095 453242 252706 660775 655728 690615 460288 807495
13737 807495 553937 723965 623581 551896 651350 838892 433960 630455 205295 664110
13727 664110 445197 381723 696347 291471 292807 331813 962403 452329 453034 897297 381616
13715 345428 483935 267148 636748 694149 274169 680709 516301 448679 660080 321922
13704 262141 270913 406135 459245 438247 500952 401006 449587 580918 343427 595675 867973
13693 867973 686235 448933 861029 407879 673211 243171 564128 478518 584820 284629
13682 560797 562064 708582 559281 699167 269291 528635 456641 646531 557573 328176
13672 328176 145361 -6291 514440 462381 340497 536011 302716 412516 470691 400296
13662 400296 192133 502214 377054 290828 259546 411340 664474 410746 607997 263859
13651 204547 176759 390885 544915 376670 408689 760851 435191 372448 155398 374781
13641 374781 508625 271669 530287 282067 56725 591025 606003 527952 373314 271421
13631 271421 453443 214569 329159 192292 567797 336067 244434 315486 196184 140064
13621 140064 83385 469492 388256 521222 152722 369785 363524 689815 506595 659832
13611 659832 358499 375875 512356 380523 366552 240351 70343 89887 257592 615100
13601 615100 338001 292445 274590 287897 169601 12963 472039 231553 515159 183633
13590 200535 149331 336719 495451 589894 372364 274382 518267 390093 470470 504144
13580 504144 314485 400595 428277 263133 546191 194576 292149 358088 486979 113779
13569 553587 415689 317474 264523 549783 406484 177615 407975 299527 394115 329251
13559 329251 419584 359789 371173 233141 147955 104934 278735 185935 486739 385747 428329
13548 428329 450340 168309 377252 374163 116671 99055 243195 409036 280593 238187
13538 238187 433768 267425 170815 14349 157576 279161 24742 255001 -21235 209057
13527 -66507 448781 92570 155701 169932 459484 253062 497962 416771 415620 282915 -157830
13515 -17037 185135 300445 259353 200735 174133 198955 56650 395672 34796 218537 323492
13504 323492 -3655 147157 296260 473539 321052 11724 397196 300036 695320 232716
13493 207981 169410 227700 253827 216154 154380 133593 390246 221326 250459 377020 418877
13482 418877 400676 166698 -61972 200799 284389 662277 399367 299781 239694 -87936 435461
13470 283843 416255 97742 -21920 532831 274650 239636 9392 -153885 -121203 122500 67788
13459 67788 545245 -5664 78556 439503 -128297 350614 136447 -37708 123429 205090 218522
13448 218522 199900 274610 165024 38304 -3638 30164 -240379 141027 -176722 305142 391354
13437 391354 18541 81119 -120487 533182 354401 272062 444321 96719 373592 86665
13426 59650 190270 -80711 68687 239434 101786 44957 269354 321480 240268 123788 400087
13415 400087 380726 22993 158930 225805 -3401 83577 258704 185432 269643 460799 207983
13403 277774 171051 143135 204999 -72072 194651 209015 201282 401363 231012 111179 331596
13392 331596 363376 159855 354473 217748 109843 315570 343072 -9345 -105568 181619
13381 544332 -5855 263505 359088 196239 328085 241828 107550 87260 449670 -9219 360949
13369 129131 40055 171764 150377 60410 311700 86782 74726 -147676 70050 133420 201857
13358 201857 249280 -107897 460585 240464 59587 279128 107901 216068 290425 296811
13348 296811 118654 368566 -27030 192926 423002 472831 404147 118621 237917 351595
13338 351595 412374 -30643 188701 31070 -70953 515569 -38961 256779 231219 334775 149893
13326 -66549 -274452 79006 166305 97654 432785 -39284 295662 293741 376990 2911 -23733
13314 -14457 7551 399724 -119728 44164 155700 -54364 199602 -112503 1174 28452 549481
13303 549481 105179 269763 308475 480606 70353 97116 420286 24915 -122414 63848
13292 -58795 590540 224941 41712 133744 233784 -3455 -27690 -30876 104477 238730 257713
13281 257713 199765 96065 -7214 -210636 146007 163169 356683 -330900 -48245 54146 117252
13270 117252 183907 274373 -118635 91997 263301 137835 66667 133914 -41842 44813 -225615
13258 1719 363389 343709 102230 -249553 -12424 45559 62113 -3035 -50945 -20284 -39743
13247 -39743 23846 127164 186008 -112493 298954 533027 -291589 141359 259007 -8399
13236 -53275 116668 176202 -85702 446112 268430 -21960 285048 261706 -53172 336978 1792
13224 -164311 35391 304226 121598 645502 154967 219050 -145869 15953 142892 70591
13213 135106 -72776 93430 141051 18334 49902 193834 130927 65505 -111728 38776 128576
13202 128576 -61093 65352 54221 258072 -91186 78037 259203 -260591 382701 196026
13192 196026 20163 126434 -162048 195911 -98751 67659 51142 -141413 209229 240909
13182 240909 80951 -156258 10082 167558 -8835 -74132 -12686 -37624 56514 143611 216251
13171 216251 63971 138162 223451 201822 56239 240201 171404 138548 225062 361987 -136780
13159 -177691 4447 -51149 335861 90704 129193 56369 43439 -102210 46959 8613 90007
13148 90007 -160528 -98173 382285 -81650 121178 -330516 -35891 88535 121103 390063 182639
13136 143842 -10884 115311 241844 -39176 -258658 98986 203211 80299 -4638 -69531 149352
13124 67409 206903 -74832 -146100 -10003 -294865 51676 38083 -84341 1362 -80444 -12233
13112 345176 32950 95777 132407 -209886 -234741 -92552 75835 -244461 44299 176944 48130
13100 266814 9312 90017 51963 39540 -85658 117327 -27970 89986 111232 -6302 -30934 16264
13087 112196 101017 -153372 62331 169658 -15501 91751 234980 94556 161303 -229068 44786
13075 84272 135207 -197211 30515 371859 192488 -135733 308504 52269 106149 -25937 -45075
13064 -45075 101084 170602 214128 -71819 -271212 -88953 152914 -57548 35130 280078 -5945
13052 53215 226182 199611 222969 45253 71628 242048 -200537 138254 378971 302448 253414
13041 253414 102460 -10110 244824 78091 -10507 -191743 39202 -49894 69679 9553 96209
13030 96209 -151333 112192 28629 -78890 -20064 39247 22723 -170129 232362 -12085 70066
13018 52763 -73426 129367 -251713 -262606 209355 135106 -117216 56906 302925 -11761 551685
13006 269937 -64450 -3469 345542 113861 141420 121017 281358 -248332 -93250 380254 -225317
12994 218267 -55575 15481 247792 319824 166999 45836 222248 151004 273357 -1692 339886
12982 -119199 47254 -65930 110646 211098 -202426 -4627 221706 255724 -23196 222240 -291547
12970 -175551 11223 109022 162944 -144639 124895 262445 150450 -25315 68374 -16448 208517
12958 246550 -281752 114034 64922 22203 262517 197623 172745 -275483 -165767 12752
12947 -225517 -153923 47876 -158343 -81718 -47768 111899 -52206 282398 42639 195316 -115126
12935 175665 188204 54207 87600 107662 63999 -81644 -32820 37695 -12278 -48140 -108659
12924 -108659 341764 -24713 -227989 41316 -35184 148023 43922 87522 87033 -42573 -239597
12913 -239597 59464 -119940 -10634 -83865 109468 159128 75843 172300 322747 12876 57017
12902 57017 -35161 -108727 127498 281439 -488549 -67431 -53473 251957 37253 -68439 -113904
12891 -113904 256951 71952 163551 -74221 125409 146687 322468 94709 187399 -28880 -84487
12880 -84487 -124563 31248 -39965 -159068 -58210 -29418 238484 -140885 -8457 -67612 70713
12868 233070 -78538 38654 -37684 -118419 -41111 61102 194812 -224423 234791 105339 -169117
12856 147072 -143054 39903 112739 280721 -2002 236048 -305331 -144270 129822 -6202 -124104
12845 -124104 112917 125001 87766 85525 -236791 -120273 72072 -149843 -124847 -359618 91882
12833 -139292 -320598 -82072 31164 36807 302414 104170 -170506 -227753 159720 -129302
12822 144269 -72261 -158798 -63651 74947 -35052 -49598 195774 94700 63037 -150483 -140260
12811 -140260 14561 -230271 -18310 48320 -25776 246479 -38478 188365 120820 28519 160130
12800 160130 108645 82737 53742 -190397 -210222 -57648 94556 -83558 126014 -1048 -315225
12789 -315225 -267810 -61781 56938 129730 276810 -386346 -222956 -266040 370308 214780
12779 214780 -16253 166415 -133920 -235168 -153739 133137 107770 -23764 -92975 -198394
12769 -198394 -37754 14830 56091 -201934 -135033 246221 -20676 -28518 361482 -15219 67167
12757 2247 157848 -168924 132029 -8316 102486 66406 -203248 95539 214865 -22975 21586
12745 231004 -252145 -72527 -82544 84402 -68891 -205612 188138 271793 -18097 138178 125738
12734 125738 1434 193720 361708 19888 131762 173795 317769 -176087 127128 -14354
12723 -104715 184511 127961 -315812 286007 128601 -320761 -34687 -58268 -125048 39589
12712 122605 130055 307908 -8858 320735 211928 95159 260352 126685 331236 -1533 261770
12700 63268 -157588 -51757 -62248 171943 64624 -366490 129427 254670 -127843 -81483
12690 -81483 272263 -31308 -141578 -12300 -12292 -95735 -302392 152058 -207996 -3861 -47974 135109
12677 152956 196525 -176674 335969 -53093 64814 93992 13517 47860 -46517 -215816 -57819
12665 143570 36432 -43938 241318 73789 158650 338886 126598 -23230 67977 -94674 292445
12653 207483 220405 24153 69938 231400 173765 269722 362353 -111179 -51049 355062 -400361
12641 -10627 55918 253582 -93995 -13799 -44933 133983 -208833 63589 -152025 38309 473052
12630 473052 259729 134995 122202 307685 300790 83321 -88697 223045 117559 194983 -69489
12618 6802 -268013 169688 -104403 26943 90606 -98842 -25994 46238 -177335 -9371 -213725
12607 -213725 -191896 30397 -120959 2971 10898 239236 95144 92189 338098 49147 255647
12596 255647 121456 -34606 -34358 204345 315537 181374 139819 207929 -31061 300983 -345495
12584 -86091 -49348 -23365 129784 -170639 -96807 -150308 -559457 205385 92945 63054 47996
12573 47996 200822 262758 -280849 45953 35285 -143742 -65255 -71201 75374 -100082 177203
12561 237870 182278 -33341 14131 119381 65418 52546 219178 -192186 163860 84963 169415
12550 169415 293776 29914 126095 211517 31178 -184706 368207 127092 131130 7937 -45016
12538 9419 31578 110464 -421772 189666 -259499 -135795 94771 -40697 220353 259163 -21074
12526 47406 94614 -35823 365321 123046 140998 84396 127021 194644 -42561 -60131 -11327
12514 149105 -305063 30500 -65407 249799 -80521 195981 -139427 -28984 -186099 33503
12503 216237 -307348 -147234 305430 -138381 217732 83 -307848 -99594 7964 -127199 -88471
12492 -88471 386184 114140 42703 -253593 52826 -239832 -5832 -106278 68991 -186281 112248
12480 78282 2330 -169042 41588 -132376 12307 24766 -16544 57297 65762 35001 127212 195751
12468 195751 268207 -222832 -220134 -21755 52893 153334 -38201 -10838 -53906 177303 -200816
12456 -75705 137924 12057 -49011 78939 167646 213780 -130011 75869 -21352 -163819 -335005
12445 -335005 -230 -225265 -109537 162901 38496 50912 -3688 211837 251433 93134 160020
12434 160020 -134188 215407 -167707 -43555 35500 -10735 -73642 -251023 -346021 -46119 91574
12422 188814 -145677 101613 -21505 -259115 66999 32466 -191229 250297 -43349 -220888
12412 -220888 -118485 -24127 107779 -109016 82098 277843 -20045 -38524 -39272 -377398 -76711
12400 238977 70157 134769 -74712 124175 49886 114323 -78561 21456 95058 89871 206767
12389 206767 384475 -57343 319643 -157059 60694 100729 4779 -184809 -79800 -176720 112641
12377 65292 -265273 -2564 -370087 7013 73478 -273554 134150 174119 124616 -309874 -220156
12366 -220156 -14105 -115653 -3023 46104 91445 96023 -3823 32929 -190243 153629 -35838
12354 107931 46618 -48191 -18367 79115 -54279 -136382 300091 164876 -12753 -126377 -8335
12342 -238821 -241144 156022 -65040 14231 -732 -259849 -66148 38229 -30037 -346532 245740
12330 142166 89188 89550 333499 133993 25738 38804 355707 256375 -49402 -139649 -126795
12319 -126795 293045 -53287 272330 -69683 -165203 -200094 28737 -211792 -23666 363785 -245372
12307 -195234 -215350 -60606 -206142 -93789 -255257 -103233 -63981 -57313 -60562 373478 105573
12295 -92379 51343 -35216 -64179 53657 253548 362908 -109457 -40361 -467513 -45124 174134
12283 263820 252493 354074 364193 157805 339392 -10 264634 -108733 404007 269206 16934
12271 82909 -116760 -128854 161421 -36479 140725 179323 142711 58891 88318 97006 -310624
12259 -46864 -14045 61020 -1465 -269871 -21707 -32838 -385591 335795 121895 130328 184361
12248 184361 2313 10805 -86244 272494 117584 205544 200252 -46373 9935 201522 253476 128093
12236 128093 -65642 154102 179298 -48835 179367 47738 426369 351482 150952 238084 120122
12225 120122 78201 -161294 497705 204957 202791 37219 158112 473047 365312 -149369
12214 37384 91612 322853 55997 521801 223084 62452 298150 122878 253401 443876
12204 443876 406677 157897 275321 329392 3924 333280 370967 304112 178453 96563 209515
12193 209515 275572 -57932 248497 60291 106651 -178612 214337 146998 -99557 441671 -38231
12181 18415 110019 106395 58347 91318 47382 82437 141501 -274185 164802 180712 -22075
12169 309068 175677 269323 -372462 139488 155377 -145822 377734 83872 179852 91023
12159 91023 119649 209943 226372 -14387 72489 165172 541806 49821 205067 289267 210144
12148 210144 77194 -100504 106101 98490 -65780 128078 -64672 157466 -16324 84482 76126
12137 76126 -128478 171788 55475 14056 -95379 116 -13040 -71841 -43833 23850 185474
12126 185474 -359039 148372 51047 75198 227590 33445 120144 236412 219445 152086 -193926
12114 79738 -70043 -205417 -86394 -233793 -164531 18697 -264932 -68889 -27317 -14948 236548
12102 -235056 -322834 246350 199346 165167 127448 89019 -178786 -20707 27209 198050 -367702
12090 317739 -195006 39312 227275 -62718 84953 79741 -204100 112582 207494 210828 -87328
12078 182456 158681 364860 1149151 2205804 1241358 327364 345729 -74449 100618 -8632
12067 49022 15349 200414 110851 -12320 -171163 -241708 134147 12331 -52506 -136896 -135560
12056 -135560 121716 -221504 134081 47464 31939 -105520 -47280 148482 -177023 5263
12045 516087 -141944 57672 -139087 16424 157053 -141092 -31100 -92845 158148 -143121
12034 213676 -206693 -24360 -55864 -9753 226442 -328046 82522 -100241 -111873 -327112 -7997
12022 207735 125093 -263 426545 -197562 -118013 -67512 -339117 -48735 -28042 -217241 123733
12010 -55020 42397 -66402 92954 70838 137527 55777 -129551 145570 105768 58104 -473414
11998 -8201 152531 148826 -113221 -132463 118426 -122371 213551 90382 -300446 -341951 -154202
11986 58573 -116677 -110157 199379 -427339 1480 -226454 62477 19804 -150507 111320 29334
11974 224039 166190 -60666 -170572 73075 -189750 193750 123423 -354590 153009 -127930
11963 -147272 28578 95477 -67983 -15547 75320 -205860 2997 -110894 -172755 79192 -2709
11951 -6010 -58734 -165482 46971 -3880 49234 79056 -207007 -158539 -5035 -165607 904 272220
11939 272220 -31883 21511 188294 -102566 -137517 99027 122470 -268117 6610 38632 -140728
11927 -237917 -46398 -423585 -225673 37231 -81219 -161667 -161930 -126971 -68099 -119557 -115056 -73617
11915 -73617 -118689 -174717 138931 -86788 26963 56119 -170760 -407997 127808 -320398 39136
11903 21701 -225331 -111543 85457 -94436 -284977 -41450 -178328 -175316 -278414 -124226 -82827
11892 -82827 -248876 136508 73489 268771 -106666 1100 -50576 56692 56306 -29339 73096
11880 -75039 89985 -304658 139337 86782 -185887 -371972 246459 -4424 153254 400457
11870 400457 -153225 28893 -32131 122213 28415 -26596 -19599 107763 -151013 116556 -266791
11858 -217741 -142305 -148200 -247178 156313 -74790 -130050 226875 -99880 -203097 135876 -172826
11846 171835 145101 320953 -121193 -222781 -110979 -227216 41013 -47518 55667 162964
11836 162964 174264 -214453 -19054 98150 -124875 -236728 -141714 22775 40984 98299 74320
11825 74320 11965 -51321 -15177 33866 -110327 -637464 47705 -339383 -378026 -400782 -4633
11813 9680 2435 374002 80136 -866 -38656 -182772 -36250 183215 1483 -137380 178759 371112
11801 371112 316832 11245 6256 255475 -37779 44822 -33526 -23491 -20124 214220 -105716
11789 -139912 141487 -144014 -194356 6390 17937 181082 21555 154751 -109580 -10500 10605
11777 47510 -112912 -100485 152517 56286 133812 131728 173459 169744 191640 -43396 174004
11765 132734 -25042 85072 89123 -4640 130517 -39542 127843 28924 -97958 -265134 317265
11753 -117697 -259204 -9520 166332 173068 -186992 -253199 -89978 -96034 -28492 18635 -57821
11741 34374 112688 163345 79484 34190 13067 195507 92113 -97642 55927 -188938 99956
11729 127037 16310 -20111 39356 100100 -75395 357054 -41113 89355 334672 55927 13024
11717 299245 -151628 4519 157460 -250324 -38161 -48952 77498 -137738 68741 -162146 -94099
11706 -94099 -124630 277105 307509 -427430 -62431 263698 140998 93409 -17335 229882 -33802
11694 18694 -107856 -167891 82655 -91818 30021 139905 8670 -134592 22341 -195428 163604
11682 185347 296374 323187 237652 -119297 84374 264514 36289 -346505 -38281 187746
11671 -171494 -185077 -32944 -152573 141707 262358 78373 260739 192708 -71478 206120
11660 292753 -248664 99652 -167286 -77344 -8948 -55519 56410 92518 70725 -20897 279606
11648 -150529 -66013 347163 -209689 -199335 -641074 -150382 348400 59974 -197325 219636
11637 -21245 154537 -28140 183772 107624 -59150 6755 61695 -157971 53530 75203 209247
11626 209247 -215526 -223037 -401810 -178296 -307540 66075 730 7189 301689 -117137 -349157
11615 -349157 258238 9956 -11362 74346 -10448 -224267 -220160 169571 30537 333237 115920
11603 141535 -163956 -50556 -19764 155012 -66868 265876 55356 96916 -97165 108796 149838
11592 149838 215429 41462 -13264 -53988 -61059 -223262 -160339 146675 156783 -34273 -66840
11581 -66840 146922 246193 -517 39199 292192 -66617 -28282 246015 -143028 81791 253769
11570 253769 -22867 -276958 301039 247574 101582 -35014 178481 -252202 138668 233612
11560 233612 237193 39568 -71769 116455 213302 297782 -28765 -100397 -12547 -405296 -30363
11548 294854 111437 65541 -64715 -32922 93263 -162740 42889 100561 28891 253131 113645
11536 72699 -183269 369618 118957 257523 111979 169519 32383 94477 180350 6494 277119
11525 277119 -131086 121591 -25219 100704 172843 -13560 72125 154386 108762 156262 -98388
11513 209287 -214005 102579 371019 172170 74892 -91372 -97849 71557 106613 193571 108806
11502 108806 -38921 304136 560841 386605 146181 195707 199889 -124443 80381 -33432 213682
11490 22017 75332 -175617 344673 341115 16543 284779 91522 40959 -233052 362543 -79622
11478 310644 148904 34086 32299 169762 408983 189603 77490 158261 144941 291576 -95082
11466 -75159 -15772 77931 246881 277490 -12101 164414 264731 290758 331835 -19215 -14823
11455 -14823 -79946 236088 188381 -41842 186306 90788 256000 102803 157141 38225 -26673
11443 47022 -350753 9825 227082 106535 450079 -182875 231592 -19044 -50111 246561
11432 132969 -153733 299398 -206791 -75061 -145668 -105519 -58860 -68598 30531 -2479 140417
11420 -49111 2464 -38151 229336 194097 50484 -154969 275079 -76072 36299 -21989 32397
11408 80818 -50258 364792 -112221 85129 42020 -164029 -92000 223442 85793 -216017 48261
11396 61143 -7029 265381 -30227 -24332 -69135 120179 98455 139734 -53430 13874 -83966 56497
11383 -72372 -107715 99496 -42279 165495 270444 81987 397950 -43055 233798 94420 -388327
11371 124647 -233073 -292022 144109 -293617 185343 -157607 -200049 78053 -121068 117706
11360 2764 98128 261013 -167604 397845 -40110 -112664 -435402 -279935 25428 377052 -18173
11348 -180554 309763 275808 -278974 -278596 -344763 -114729 -418888 -162521 -319617 -139911
11337 -73018 -323895 2354 -21654 184357 112303 -140056 -19261 43030 142761 169383 -7179
11325 -34225 205254 -14820 -77919 -282766 33886 258557 97155 -47666 -46163 -76959 117489
11313 -56604 -118107 -134805 -4495 -13348 85520 -73091 -200315 -38298 -56889 -369134 289124
11301 -73902 -166091 134292 -256947 -104534 -226348 -259684 -67518 44000 -332291 -35840 -86272
11290 -86272 172417 -31831 324437 -73191 12471 37698 -239274 187776 112985 43188 104055
11279 104055 -86057 -122802 -82367 43649 -92455 416634 49137 173913 130926 -58901 342841
11267 136034 117683 -32074 88177 253872 -152451 -16358 -60493 -89427 4238 -64127 67126
11255 99212 90052 111003 -491214 -137430 -75135 -112578 -67782 70375 150671 -127190 269112
11243 -458019 -135031 -81966 13548 -67990 -61630 -79382 -364968 80749 76460 183783 -87027
11231 133287 -16685 -13227 232758 -176885 280323 120977 -52424 -339731 -236264 -643075
11221 -643075 -317129 -271185 -206222 104474 -100572 263339 -33157 -168719 -132990 -59115
11210 -196340 -64826 147625 -262209 -41718 27507 -127929 -138006 31514 144143 -131504
11199 139902 -140921 156146 100819 -161270 194093 57395 -184294 38834 -86691 54651
11188 -445475 331902 -141428 61938 5955 -129490 -184373 -5585 -73269 27075 -155256 64187
11176 33565 -17346 64248 -169961 43608 106867 -478038 104314 -43106 169878 -296150 46334
11164 -81793 -98000 -34852 57950 -222763 118675 153130 -89031 -28879 -170944 -27087 -215130
11153 -215130 -236201 -54776 205634 56447 -127872 -71378 -7536 -37356 -9098 21409 213668
11142 213668 263335 170571 81425 -83651 -132739 10500 -207898 -127308 -2957 -214382 112465
11130 210478 295528 33556 -125907 -243385 -5632 -189834 -315642 113847 21931 105579 -74570
11118 -113159 -39102 42189 -73760 325678 -103121 263579 162649 -166065 -118812 29133
11107 -20975 36642 52152 154689 208828 255298 139176 214178 227583 190100 359710 139889
11095 173610 -53741 227303 189728 164608 143587 45040 244836 -16024 -190443 210277 310504
11084 310504 419777 -6143 -84396 221655 216227 344637 422329 410692 -155325 10539 461062
11073 461062 716373 706951 17538 52690 228867 220315 266154 714278 321260 522074 210880
11061 357921 328652 341159 376205 86630 635023 708315 653273 693000 506739 692192 556433
11050 556433 956054 475849 735318 428645 665594 465826 690301 843959 387991 915454
11040 915454 894592 765578 577704 540377 536557 551519 734752 843614 619801 608410 305884
11029 305884 842772 619684 601796 713854 765011 966890 905143 772323 662642 616336
11019 616336 601046 610201 644868 785670 638101 570701 634634 511721 767619 575665 388158
11008 388158 666825 562575 587968 652043 702339 156197 505593 494241 811478 331621
10997 585328 747927 626216 669351 576920 663446 711873 832692 881464 695937 822098
10987 822098 713518 861987 861426 688191 1327467 973576 968211 1104654 1116187 1316143 1249839
10976 1249839 1469357 2096375 2022233 2094774 2194803 2242650 2730940 2772062 2537595 2700335
10966 2700335 2347978 2189943 1678531 1392672 1625124 1762634 1715830 1442980 1713037 1372252
10956 1372252 1870282 1700884 1503618 1372330 1300900 1047313 1141938 819582 804644 465304
10946 465304 387394 156363 208055 466236 434009 405135 166423 377740 -55328 186547
10935 184794 106879 83845 -439 186386 203192 235400 52938 103281 142325 83078 -192846
10923 -168212 20840 328879 47183 155043 -227763 -102499 5842 370357 -45039 70760 387906
10912 387906 85630 -205500 -204026 -131563 161641 335954 76196 -5272 42137 -328964 -247439
10901 -247439 -90779 6623 191614 15078 -62738 -246278 -324329 412829 -138770 -240921 -260711
10890 -260711 -273971 -111274 -204241 -128716 119600 -38199 86876 -10811 -62757 206415 -140393
10878 86342 301131 -47493 -111420 -50429 -95438 99755 -71443 -9644 -12537 29618 81002 231461
10866 231461 -76045 124893 -958 31015 20109 -38968 -91891 168618 -269101 -124069 -114628
10855 -114628 286713 14548 69364 3721 239072 -108137 19198 205982 75307 95444 95125
10844 95125 -173830 40819 -437720 -192503 -149306 35815 -191064 -74050 -146930 -187629 307321
10832 -277226 88009 -58328 -248368 13911 -114436 86817 -441710 408715 13245 -22170 -171388
10821 -171388 299987 -282855 -29834 -143847 25403 -213679 -227149 105177 -12025 -35 -52359
10810 -52359 -55908 -144556 89655 3399 -153373 174844 -147557 -329191 149637 -24615 -33560
10799 -33560 -128504 -71780 -6727 -177318 45533 -100601 -94697 -17041 109959 49205 58052 -430722
10786 -172498 -341893 -35800 -42214 -79871 48434 359253 -121375 106657 157870 -97987 -179289
10775 -179289 170522 -210637 -243820 -233625 -64487 225540 48829 60417 -66816 -347836 4602
10763 -125192 87578 -105065 114153 8403 -199821 -187336 66549 -69118 -52150 -272386 52660
10751 -172177 -53845 43098 -6685 -8453 -207492 -72139 -102835 -349994 -168057 57142 -266410
10739 334074 -169818 -192447 63544 -360135 -179919 64301 102348 -250157 -127750 -260919
10729 -260919 -268319 -44351 54649 -232735 -129561 -46265 -163989 -53016 -145372 -31778 -135900
10718 -135900 -70987 -49216 245743 60618 -379214 182529 -102009 -293451 141145 -351314
10707 -201394 249687 -118980 -65487 -234835 22252 31842 -285979 -445937 70446 186139
10697 186139 -101691 -272537 -97108 -145557 -200146 -162268 160907 153222 169112 -149729 -172566
10686 -172566 15761 -131074 195154 4513 20708 21169 35458 -172990 96513 144834 72850
10675 72850 -130915 -44111 -30215 102472 -226195 -333716 -59723 368954 186503 -186689
10664 -107844 -36742 43159 -237072 190382 -132564 -341550 21320 -220442 285492 -3897
10653 135303 213477 -234948 -89501 -229757 108875 224700 116366 -200204 224210 533342
10643 533342 105954 -221470 -295877 -177955 -261649 63662 77227 -189276 -514057 -205872
10632 -26449 -237529 135454 -111450 104629 -158059 7127 -92853 -145812 -269900 -236170 -125630
10621 -125630 193420 -92946 107450 -65836 -151334 -81995 249304 8054 65014 -315073 23543
10609 257812 28758 118479 78181 56443 -70814 -31573 -248239 115805 -402930 -191839 235989
10597 20123 56546 55414 214900 126149 -156115 -347159 26582 89407 -175035 -50494 -145152
10586 -145152 204659 -106488 98804 -1754 -197113 149594 -7195 17875 -297062 -97943 15992
10574 53083 88100 83684 -55697 420233 -309111 -64300 36573 -327547 56113 -211139 118201
10562 15343 -32956 133643 -465277 -252240 -253202 34768 -41959 -129871 11405 40339 71969
10551 71969 -192873 -159157 -84334 101636 229195 -280625 -127536 1726 123323 -203323
10540 -99507 -435096 133355 91013 -152870 96494 -341567 -48282 -222926 -37895 152062
10529 -67340 -227910 62775 -30775 -64844 -227369 -226550 -131414 127471 -86067 -50816 -107287
10518 -107287 -83881 105355 195889 -218654 31900 -518422 50499 -154654 111531 -248816
10507 67409 -36283 -678688 39799 51869 -20433 200599 -52320 3176 -161843 -75033 -72430
10496 -72430 2639 180692 -110910 -267857 -162488 -173250 135576 -81917 -23623 29877 -295727
10484 -102513 -98431 58433 59384 95949 42678 590674 764417 515159 336875 318116 48735
10472 120974 233012 64580 103967 -34300 -377502 -82758 -15309 -116186 -114180 12282 -190570
10460 74116 33937 -130119 15959 -153405 80929 -170171 -304793 11360 -10571 -138600 -281273
10449 -281273 -273531 283703 152001 60862 -81454 -85947 -128588 340860 -77877 -20445 191439
10437 -152441 169903 43859 157175 -252335 247221 49002 -326698 380602 -228513 -180619
10427 -180619 50113 2005 97568 -245274 153316 111071 123781 73083 -284523 -287922 -64890
10415 1682 -193570 -388468 -90741 185175 -217579 -90948 93149 -82316 164601 33605 -265736
10403 -70404 61099 -68414 144692 21753 32172 -211582 -13567 49579 1433 -81655 209241
10391 -17612 324457 287623 26185 -93780 188839 219940 -107026 272444 234788 22300 230827
10380 230827 233217 12767 191283 133432 6377 463680 139430 -13651 54958 418198 342162
10369 342162 409061 613166 575413 259053 393875 353265 567998 508944 63197 280363
10359 280363 29898 89834 203751 215185 59034 -184572 258914 533940 373734 892834
10349 892834 513692 320719 328048 285868 506825 170145 91621 48067 32249 27491 410629
10338 410629 404288 83061 132779 115821 73665 167857 436952 88354 464205 -49857 24167
10326 -133890 102586 44134 243119 75243 305621 209164 164088 196898 135583 217511 -115394
10314 73915 154184 149467 -60665 133931 -19195 55646 105130 23355 -274865 326619 -273874
10302 92371 162670 81743 33337 -281113 133194 -34762 32901 73385 -141755 -69841 -144867
10291 -144867 -89596 -51077 107406 -234347 -47435 -162060 -80558 -324123 -101583 240625
10280 45050 -133672 109258 42997 44280 -238641 -9339 -127320 -71289 -117885 -87093 -770 50981
10267 -203297 -105967 222736 156274 -56308 -188819 -394334 443074 176850 132292 105169
10257 105169 328088 122701 231994 377941 224770 201095 140544 35284 361216 -91747
10246 -599200 14160 -172782 -138656 -269385 -64601 -25116 255458 88919 -166207 -38498 105168
10234 -76831 221337 92545 -165015 -219591 -87192 -162102 -296659 -76173 -190195 380892 -124173
10222 -155939 113096 174839 117394 -157419 -24459 55767 -65616 93269 64992 -119570 137711
10210 -361709 8490 -89786 -30961 41646 152093 -115558 -167297 27394 129134 -258978 -164142
10199 -164142 -162270 -248852 -174372 58596 -53937 -361466 -73300 1827 158731 -107755 -170519
10188 -170519 -98045 -243939 -292273 -140806 296404 247281 -17722 -116963 -416666 123750
10177 -200484 196119 -230451 48358 155955 -145464 -239639 -183528 181562 -147969 -128026
10167 -128026 -117772 -131737 -45898 -487197 -201376 252735 -330588 128478 -82190 118645
10156 -242608 233825 -163330 104579 390906 49440 -55163 -26645 114967 45292 -50531
10145 104324 -191239 69092 -92127 22229 -74524 -309828 -331525 -24485 102150 -312976 -70222
10133 -227336 14436 107645 25908 82971 -420013 -129653 15306 108946 -237368 -203916 66670
10121 -235087 -49174 -280126 328677 -16320 -52964 -184444 -30404 -96230 -72346 -164238 -258578
10110 -258578 53328 107353 -312196 -58174 -236828 -20971 -368504 81042 109768 -46119 -38271
10099 -38271 129140 -283715 -6215 1578 -38898 -124306 250788 -73115 278034 11109 -235520
10087 -183402 116994 -245468 -150559 227546 -64320 -215907 -134908 -236734 -342601 -201226
10077 -201226 104793 -130597 -214056 93057 -339661 -463690 238930 -559467 -386503 -206504
10067 -206504 142242 -159436 -86579 -121253 -383847 45317 130579 -8242 16102 -304954 -6265
10055 38337 -179615 -90195 138934 100864 46852 192377 -106776 118525 36181 -208863
10044 -342471 -452421 173570 -31107 148341 388590 -359993 130780 -14056 -373927 -61383
10033 -358126 -72722 -37766 -284280 -273487 146522 75965 -252909 51559 -31459 192725 -65216
10021 -124757 102390 4178 -123070 189034 26017 -50045 -329665 -52847 124731 -224196
10010 151865 -204863 -91333 139064 57070 -219670 104801 145779 -441760 127514 -44027
9999 -13843 -44666 -43599 200485 225044 189525 -110998 -96034 -90624 -117963 -73692 -241194 137267
9986 86933 30612 -342859 -38249 -38444 -13983 127340 -13007 88365 -154569 -162352 -200078 -213822
9974 -213822 157931 51908 -267211 -68673 124925 -241989 164181 -378485 87933 -45659
9963 79400 -184915 242097 20811 -222830 -232074 -147516 -119958 -93740 -256394 122882 154067
9952 154067 291976 -202123 -19894 -27997 -22567 -122924 -56275 -40261 18216 139590 169952
9941 169952 -58614 -129680 -473602 -69856 -176732 83874 110400 -24669 59062 71269 74525
9930 74525 30112 6095 243342 -186109 -63207 -331626 -359552 -39461 -155052 148932 96054
9919 96054 -99739 93454 -190793 -123659 -190162 316675 -251999 -99141 21942 -118704 15827
9907 24884 -212573 -225928 -148013 -192499 -28945 -52320 206550 -16534 -489026 -68023 -78421
9896 -78421 207601 99364 70676 -149290 156691 -48729 -174935 -177821 -244474 -307791 252824
9884 -3972 10135 -366734 -32441 236222 -182154 -334621 -97604 -136979 -212439 -117965 -109336
9873 -109336 116202 -52277 187422 -19529 -82410 56769 -196909 -46661 -163970 292764 -64084
9861 36856 -215981 -21067 44932 122933 260878 20123 -406817 -473956 -267144 -65776 27084
9849 -154864 -284027 -67392 -85314 -59294 -81062 -193058 -307313 -373789 188796 -145685 -51513
9837 -198831 246222 -77473 143210 117234 54408 82694 -219712 -315398 -346899 -201291 -46035
9825 -49558 -238816 93579 96674 -174469 -167557 -69140 -327199 217412 -87446 -50405 -319437
9814 -319437 -57358 -97495 -170178 -36204 -559262 121773 11720 -124582 -195305 -299448 -108728
9802 -141307 -64633 -300838 272890 -344769 193696 -131779 -206176 -301355 65205 -347776
9791 -110596 83476 -184398 -171211 -166726 74896 -209759 -95961 -18396 24297 -209221 -38685
9779 149057 -7852 19402 -270162 403410 335689 89013 -164338 82304 121156 22823 -7261
9767 -406317 324830 199040 -42168 -20089 76711 104278 -114819 -43305 47844 95636 120338
9756 120338 -324503 -232515 204170 -24075 -126912 70188 -80768 -7000 14677 -10056 -354807
9745 -354807 -69582 -264228 -89315 82154 -130990 25308 -43851 -167052 -170679 -83169 138077
9733 -39942 95578 -173398 180648 -196740 -285325 79953 -148643 -134166 39991 -152898 -54468
9721 -377117 -171422 144807 133137 -28021 -238736 -227537 77764 -134505 -72329 -254720 -283675
9710 -283675 121165 -264840 4079 -234560 39432 -52956 -235569 -57073 -210541 -114711 -113392
9699 -113392 672 188255 142558 -123637 -193150 240328 235923 -158985 -287087 182647 -450488
9687 -83840 53502 183079 -207556 34575 107084 -61727 177629 134668 -130482 -373556 -58976
9675 -211714 65193 -95392 197578 -177311 -92035 -147258 -206961 -202381 -297479 -116178 -20260
9663 207824 43502 -21423 77651 -173517 32174 -337013 -190714 -252799 -78295 -168717 -94225
9652 -94225 61520 -111877 -244686 -214427 -414233 -97183 -167858 -56121 -143233 -234442 290108
9640 172275 38376 134624 -24922 -225610 -242915 -103981 133932 -192387 215608 318288
9630 318288 -296157 -175334 -57071 -158744 108409 -154979 -10589 -91483 -141142 104588
9619 -193672 22168 40938 236962 -72444 6682 129792 -96769 177528 -9734 -211917 -268301
9608 -268301 80995 21033 -80227 -68862 156332 -254096 -30576 256644 -261101 -26114 21699
9596 119969 -129451 247670 32132 -68492 -171400 55563 -412311 -100712 -230693 -192031
9586 -192031 -67676 20001 27291 -58459 -150469 -57204 -43540 -366069 101964 -152349 292294
9574 -291496 -174429 -132880 87103 -14909 -276382 -301948 -235802 -210961 -128754 -181055 -108615
9563 -108615 -83347 46199 33631 -106754 -67245 -139198 -11861 -446196 7851 -36221 44340
9551 -16537 -73173 220563 -162815 -217324 -375801 -52270 52123 192130 72304 -122058 193505
9539 151352 -53758 165875 -303650 -142298 135447 82240 -47999 -232809 -262597 -69464 65120
9527 -147535 38229 114903 -31856 50007 504808 136280 -103351 32807 98561 -23259 187768
9515 -241562 -304091 -216851 -59511 -212906 278823 -484452 85519 -302706 -169687 -22180 -33392
9504 -33392 -176672 -85447 -336310 -224436 -6042 177005 -394645 116572 -282162 -15620 -269859
9493 -269859 -206308 -288114 -152415 -105146 -177091 20811 -328919 -77528 -342560 168981 -258603
9481 -113970 -243462 -169046 134183 320848 140606 34849 48045 -186900 -219494 -4447 87026
9469 -219338 73409 97653 238722 -20725 -6588 -110993 -416035 -184911 63750 78628 110960
9458 110960 -431158 124405 -66051 287289 -304806 -55250 -145340 -122221 -105779 -234049 320722
9446 -209849 -275738 -66251 -235796 17248 -372995 -231428 -67127 62801 -182747 73091 244323
9435 244323 172810 16334 -96093 89544 -106737 -201769 163834 76338 -235233 -164615 -118525
9424 -118525 227063 -125341 -101201 -263183 -199225 -42751 196753 -108816 -144948 129678
9413 -83276 -27574 -227100 -49227 -151832 -87211 188784 238349 -56319 -88822 215259 43894
9401 -44942 91712 -75165 25481 -23155 133156 14484 482710 -144643 77933 325964 129300
9389 -204440 -316609 -67485 -28605 -92749 38197 -113701 -471289 21032 -39750 -180972 -191429
9378 -191429 -169396 -241541 355046 128727 -323918 15087 -306676 -278198 -123177 -4523 36645
9366 -82117 -399701 -24692 6258 -288572 66622 -254692 13327 -155111 88044 114749 258348
9355 258348 -218257 98194 190663 -54034 31750 -36890 34915 -5416 -29595 -540294 -126254
9343 -182930 -28986 345536 123508 181713 99810 -311764 -368280 220324 -39564 -72075 -80496
9332 -80496 -412517 -25394 54435 -102095 -53548 -35447 -82506 55872 -257939 150783 -19024
9320 -134645 204972 -242440 13563 20090 -301043 243115 -200278 -367453 -264386 -119523
9309 -205103 -75493 25956 -191013 79789 -54428 284095 -126205 -262423 -238611 100508 -42260
9297 -224696 -151404 132322 179075 -158418 -266600 -260850 -392376 413071 -112073 -320103
9287 -320103 -133690 -54186 113425 294085 -219809 -153988 -116967 108858 169468 -117088
9276 -83127 -113708 -40307 20313 -17956 2862 -352633 -97855 -243119 -65422 -269758 341184
9264 -294957 -12026 -89408 -242194 215102 95407 21664 146696 54537 17049 7782 -47845
9252 -112758 6752 -249365 20160 129780 -30518 -59187 -208717 109890 -106746 -126840 -113750
9241 -113750 -165217 -325650 188186 39298 -342816 -259987 127884 18292 -263575 -153508
9231 -153508 -126938 211460 -129784 -105984 -312827 151849 -80150 -32189 30962 65320 -69011
9219 79811 122865 -366873 -98042 96998 120158 76800 -210762 -27859 -88508 5102 305902
9208 305902 44648 101948 -254562 -103580 55449 237503 -43268 67451 -137815 -62592 -30595
9196 284377 -19702 327125 -26049 -47430 48920 -117991 97138 75871 -117053 -218657 -230423
9185 -230423 -319522 55306 -262585 -195031 -181360 -424203 -441732 -4569 96608 -117742 118434
9173 72005 98030 -281617 -61118 -82846 -109784 287844 -352417 -151218 -205140 -126070 -298962
9162 -298962 10817 -348498 220255 -13013 1028 155945 -379184 -263949 -161373 231201
9151 -20600 -33553 14346 -23911 -194329 -144487 17869 23839 -196459 -249779 114114 -144705
9139 65666 -26525 -173946 -232094 -194885 -135948 33612 -83774 333601 123917 184519 -4159
9127 -65080 129470 135282 6781 -144202 -148967 -101546 -142779 -152552 -26015 82005 -101090 -25522
9114 -63612 -128995 -69406 -329077 -665976 139608 60984 -66790 34483 -71185 -140876 236141
9102 4245 77345 -298650 -214545 -211745 -224441 -99181 -46494 74547 203877 100970 76907 -75331
9089 -113987 -127259 303379 -169181 77006 -245844 -304725 -168589 -215064 -434486 -273888
9079 -273888 228282 159974 136993 -52458 150298 102017 63457 -8127 294476 -10624 -100465
9068 -100465 187816 -4794 188577 94802 -352252 201360 -36108 80956 189309 -89228 48771
9056 141592 -41623 162844 -363210 45367 33637 -134187 -337958 46573 14123 87001 -185613
9044 138396 -191315 -53546 -243055 -181108 163490 -255704 16289 29816 -39889 99711 144125
9033 144125 152418 -236673 -118157 -158516 166316 -20064 116454 -144802 -150821 -34672 -312028
9022 -312028 -338828 -22004 -98640 -48390 321192 -229336 -44953 -170674 -46945 285732 -141273
9010 -3998 -191645 134062 -177937 -116310 -171079 -182005 -209343 204962 -413898 -67896 -317963
8999 -317963 187859 174022 -67544 -193536 -245192 -280595 129089 -192267 183029 215038 -268799
8987 -64204 -6016 -187719 -316651 255057 -27702 -78841 -269129 -140383 -233043 -102255 128084
8975 -97948 -108382 147633 130251 -219046 -294482 -111306 196518 23750 -114083 -22559 -229410
8964 -229410 91864 -92973 -179774 209455 -220214 9171 298019 -212487 349795 -248281 68591
8952 -215796 -97497 -69113 -42431 -310673 -174579 73425 34178 102036 -176686 -320864 -116014
8940 -40910 364204 -26153 110207 -213598 26922 22718 72196 -166267 63360 -63749 -145291
8929 -145291 -50322 -216697 108430 -50616 -74933 -41162 148174 145923 885876 373078 33700
8917 28314 118757 -61122 137581 132502 -99176 -34313 -97978 -142067 77122 -70091 219070 693
8904 -88973 -219236 131216 57563 58904 137723 219812 43317 121137 -163952 130348 32340
8892 -216805 -298131 73787 -174110 120739 -170405 97552 -206499 50899 -95075 65284 14094
8880 3671 -88703 -63324 -209548 121082 -301620 132260 165887 111993 -213371 -89803 274078
8868 36590 68503 -262712 156376 -71995 -161599 34315 -278077 -202205 -122723 -141622 -330417
8857 -330417 -208445 -122568 -141841 239068 -9371 176150 173997 -221670 -81753 187960 -122848
8845 -121868 -77421 78031 87368 155851 148963 158881 -138090 153064 -338285 49629 69433 -257891
8832 -58965 -90388 -73926 -336901 -208618 -271203 -238803 85696 -44555 -158314 -23648 -73185
8821 -73185 -88813 -22242 7585 -241145 -175116 -31864 78937 -328035 -2849 -146005 -150689 108035
8808 94556 161976 -195283 101173 -184528 18939 34156 -89924 158462 -357 -155409 -251367
8797 -251367 -80315 26278 -89879 -267129 -14270 -125536 113866 -14161 -436520 -303699 292086
8785 -39017 -104301 -53824 15215 -88020 39715 -116205 85459 128890 50772 -196821 -306941
8774 -306941 209653 -24758 58423 183000 -45316 229623 -296106 -383766 -138550 -137681 -33546
8762 -172515 -1264 -136343 -310583 -226372 70402 68884 74299 14499 142923 -144153 -110308
8751 -110308 217882 -21891 135498 -6895 -75978 -27409 -212789 40503 -122597 43628 -293769
8739 -4775 -207586 194232 -176546 74978 6387 -295878 -156495 -38312 -112844 27300 -11100
8727 -147723 -160081 -237304 -185536 242229 -118361 53920 -198607 -75866 20071 258280 -358302
8715 -76875 374267 -183991 -165810 -114330 -62021 -35031 93890 -74751 -217191 104103 -139766
8703 -184291 -176985 172439 234303 -174596 192954 51276 -416463 46005 -237510 -58274 -101388
8692 -101388 -103885 -163860 -35365 232587 -102692 -246488 -79115 223383 68520 -107837 135619
8680 -107981 -262208 -65940 55131 -178530 -279444 -52465 -73078 186087 15943 -196423 117001
8668 142929 -131848 231011 109456 27310 -43543 -254144 169076 235561 -231595 -95981
8657 -359076 -171932 301870 -42743 -330823 -266761 -383133 -346129 -54396 -164176 54479 122382
8646 122382 -95198 93344 70585 53026 128780 6081 132668 91466 -180669 320459 46003
8634 46525 -128935 4021 -252415 -111721 -51385 -49105 -227140 22655 94840 -100338 4778
8622 -129922 -148171 127286 51029 -352426 159269 270721 -26016 166673 235622 -143724
8611 72107 206776 -141033 -74861 64521 -48105 371559 4387 -372699 -8732 -223906 170759
8599 -11803 -132229 91923 193140 79605 479520 -188431 -265638 407322 -101954 29058 -79556
8587 11707 307457 -248384 67687 -35957 331408 -147218 47081 -172040 -233955 -98168 56402
8575 -7590 293338 -172948 -258159 -9701 -27099 -47840 -284700 230691 123984 -131485 186465
8563 -215929 -296765 -176682 -271964 -34539 4773 -220844 228048 -67520 30990 -233701 2224
8551 83588 78126 158592 -122282 265485 -5245 -131520 -369778 -394630 -12678 -124831 207014
8539 -66974 -252047 39351 119104 -91665 -132237 -298769 -176980 -194707 -154601 30111 209425
8528 209425 47506 39448 -173329 2461 -21391 145693 -267543 -336828 93226 62708 46828
8517 46828 16403 -101417 -415482 -208437 -174301 67230 61241 -20357 -21833 110980 -394431
8505 -19986 -41586 26873 101552 -240059 -360576 108474 1709 -12174 -104647 -147126 -82231
8494 -82231 -47352 -173831 502252 -4905 -6303 208119 -404242 -230502 215384 -276875 307560
8482 -50457 -32982 46490 120857 -383404 -128340 -113495 94945 -222787 -51389 47768 -93841
8470 -196102 -62170 229685 -254466 156641 -82327 -213856 193551 112436 6704 9847 -280134
8458 -231112 117096 97733 177655 -253250 -146537 223520 -306097 -264804 -51209 50449 -43704
8446 108435 225008 205545 -152876 -159669 -130416 -184395 258346 132862 -167667 -90417 -231499
8435 -231499 46039 -51831 -150511 -223342 -131911 102053 -2084 -124219 217571 22406 151927
8424 151927 -9208 -51745 332006 222097 -1587 48690 -198360 12230 -23911 -26955 127651
8412 190546 -158948 103861 -33573 -55676 -93572 -18131 -267173 163595 221455 -225404 -244313
8401 -244313 15017 -177891 104275 75452 -255426 -31250 61511 171099 -140745 60163 48717
8390 48717 -27642 288104 -199082 -193042 198901 -130864 -107010 -42592 -10527 -257362 77703
8378 -77374 156235 -25232 89919 191313 -142004 -153131 -234737 -200036 61311 -53659 -18588
8366 -140431 -108082 196035 213481 -200906 -200698 -174246 243845 -431680 -94201 -131354 129605
8354 -25129 78844 -53408 59325 -75020 -12049 -245843 -336501 541 331689 -250340 -31180 -12215
8341 48186 -233087 -373690 -230483 42784 -5132 58844 -187824 -134109 312301 244916 191561
8330 191561 -192060 -74827 -72153 -49674 -137733 215039 -56934 128885 138095 308290 292740
8319 292740 -430524 55041 88455 -36646 -164766 -130537 170192 147410 18171 -160269 -31010
8307 226264 -15997 -45167 -279592 4232 45784 -341134 -41669 46407 -31899 107197 424316
8296 424316 -27383 55832 -193830 -7949 -10364 18300 -215583 -85636 -286783 218676 -134655
8284 81656 205338 -465583 -139017 93901 152577 81294 -69754 -155768 219716 42827 -43048
8272 -101307 -172138 69527 112043 -287719 -165817 -45059 -11967 -247233 -461738 -3653 -194028
8261 -194028 85392 -124433 64398 24463 5508 -160313 218067 185158 175860 -27658 92248
8249 -337587 258005 -415900 -97714 -308282 -176936 197744 -22524 -160858 -68500 -74044 -65149
8238 -65149 35876 -54819 -16435 -172751 124758 73464 149120 -372761 179955 3690 -218542
8226 -48410 211089 59391 -52825 -263961 35590 60386 -380070 339989 -37243 -49367 -163568
8215 -163568 -369213 145079 -79453 204969 -212540 6836 29884 381094 -128998 -12810 -169693
8204 -169693 316589 -87092 -274372 106996 51067 65411 -63135 -280511 -25721 -374261 -22698
8192 -206472 227895 179181 76704 140536 -88955 38470 412319 -210091 14929 142250 -134818
8180 -200170 -122102 10444 -215039 -83926 -235825 297569 -194805 -218750 47461 55458 18685
8168 -133167 102906 18530 -21008 108177 -84164 -61381 -5068 12802 -40212 103016 290593
8157 290593 -316348 144021 282140 210790 -331016 -207877 -20556 193768 41030 97358
8147 97358 -185962 -164465 -230850 -80053 -77757 50520 -65364 321562 -65783 11920 -46886 233157
8134 -303190 183521 -19081 85211 73867 -66022 47053 -243823 -177968 -54904 -84740 -146392
8123 -146392 78403 61009 9199 -39237 19181 217353 64273 75734 -275923 201345 -39886
8111 45156 -142866 27625 -273525 71323 79359 245519 -118469 78072 204697 -252814 -137038
8100 -137038 -133577 -254010 -78006 -28317 -267472 -242784 -101583 -219666 110744 -223972 -105210
8088 333915 152851 -48442 -121035 87081 63938 -42147 -32732 93332 416130 -118549 77973
8076 -295826 11500 -308739 -152505 -442834 -277231 -196 40755 -148882 187889 -217547 241038
8064 -178332 -222054 -206071 78529 -8582 -10287 178941 162080 -349863 115792 65679 -56773
8052 -240308 -176173 -161838 -223474 -19187 -108667 156274 18410 -109144 58861 -80512 130005
8040 2612 76164 -856 -729 197195 -238096 281284 147895 -325005 -302547 -125781 26438 -218786
8027 125587 70723 -28647 32650 -117288 -12239 -250626 -27537 76827 51278 97685 13513
8015 -198738 88321 -160018 -276343 115008 216455 61236 -142624 -213 -93631 197826 76017
8003 -91349 -28636 66479 -26895 -273070 -78679 -474617 301788 168652 164853 37811 -117496
7991 -71259 -561324 -94312 154683 161524 1903 -332815 143288 275 204718 -223343 144512
7979 -105905 -273842 -32088 51785 -334765 -130001 -127737 -22576 -195514 2285 -61876 -304721
7968 -304721 -119530 -27862 70930 -43673 -404641 -133664 -85266 -217619 -247193 133615 -126945
7956 111622 -404533 184139 -120440 -156247 -61873 -12359 -221541 88728 -165560 -92496 87790
7944 306949 -108746 -106808 -42692 -101955 -40818 -94091 66191 -98935 -9558 23677 -124641 134054
7931 -109564 -70061 201751 456128 -229247 9235 -80914 -33067 -119571 136952 219628 66820
7919 -171140 -260149 -6341 19936 -129595 120169 -130143 8768 35604 -322801 -111852 -108253
7908 -108253 -51286 -290455 149685 124999 84586 -67505 -187429 -11804 -43282 -288211 68989
7896 -73841 5941 -21114 -141452 -133976 115947 -186400 -201000 -275606 190577 49496 211411
7885 211411 -267545 -34956 255775 -206914 -30298 -48635 -256209 45792 -321473 251628
7874 164355 -333935 -358114 87821 1699 293199 -270939 296339 55544 90419 288571 62550
7862 128768 -90756 62976 -131286 -273208 -115426 261895 -31660 210 -146548 91088 65433
7851 65433 56344 58788 -118421 -75488 -42621 -103529 -122340 -53117 71157 -97600 11975 -220153
7838 -98952 -101093 -113173 45177 265290 -100595 -250596 -199871 -56479 76668 225521 -40627
7826 -242226 42028 -13832 81008 -61077 122408 287211 196669 -108779 125966 -99472 -157957
7815 -157957 -395897 -178172 131631 -30654 -29544 -79105 36226 257061 78623 -18496 -109667
7804 -109667 -191595 -223055 -52143 -212689 -31720 69722 -120072 -10280 210331 44426 49165
7793 49165 -15234 -104695 -252298 -411236 44924 -363166 -309144 -261883 107070 -164979 -87456
7782 -87456 -200043 320553 -149766 125814 70248 -122099 -487836 94489 4647 13745 -188693
7770 -71845 -159158 102651 -30935 -144069 -54517 -297019 25443 -74850 64540 -51700 -108033
7759 -108033 -265554 -301117 -280833 -59784 -10205 131669 267374 -105250 -13124 28640 -38261
7747 -66041 -262678 181680 311327 505848 172709 -144437 2108 44198 -189848 -14342 -166219
7736 -166219 -217628 243845 -54939 136581 313391 84115 -153154 -118800 166082 85747 -125601
7724 31755 172575 -133015 -314459 84153 -234506 -176031 196715 72741 -218399 -396609
7714 -396609 -148344 230374 276516 -76038 -43459 -90815 -158662 -10267 -355370 -222320 206262
7702 -82808 -67159 85692 18634 32969 35529 -84106 -7272 -338094 -37940 62337 -49147 60788
7689 114840 -124636 -110388 -90489 109240 -67335 -61051 13516 -235089 140756 -275478 121874
7677 -136643 41464 -33100 162538 -152989 228978 -544862 45473 -177723 -303448 117724
7666 233264 -248519 -38011 -27586 8183 -304735 86116 261032 92163 164923 1954 -98607
7654 16517 -501985 102363 236181 74484 61289 -188560 17178 83298 -389000 -363496 -211948
7643 -211948 48236 127909 -195061 -158265 143743 -258987 -61795 -104715 -136794 87715 161994
7632 161994 -77593 -116379 -91714 -43672 -199096 132389 -179658 245300 -92988 88273 -302534
7620 -346447 -71020 -165782 -83830 -155411 95625 -232176 -94257 143055 240882 38069 -150011
7608 147463 -94349 -481427 -20061 213651 -157489 -87314 -91210 -197942 -127503 90918 -195492
7596 199637 -5049 -140629 -217308 -113021 -9949 227000 42053 -42255 -2695 208899 87635
7584 -18540 139872 -14302 -160907 222281 3555 -167741 151590 216762 23529 123190 -213896
7572 -46456 -24697 -282020 -36806 25683 140365 11610 -104840 -109629 -110571 -176332 321767 15796
7559 -41468 77186 2523 -336895 136014 -270898 104639 4974 -169169 176137 87679 -440276
7547 -218230 -147062 178928 -322544 20910 -3815 -79768 -87999 -60480 -90566 4452 -5805 -6573
7535 -6573 100167 -77463 -57633 -273495 -128773 -58647 -143680 -365309 22577 169045 404511
7524 404511 22263 -33878 30612 -45355 -30542 -66538 93313 39031 8207 421095 94550 -63097
7511 -5702 83401 -73525 -78418 -29446 -366693 -33509 130294 -272116 120528 -157403 141221
7499 215650 122873 184649 29998 -143388 6837 -313386 44558 -256020 21257 -71582 9409
7487 -25810 -35909 -52431 -103238 -205399 -58581 -62915 -33468 -99060 -296282 113506 -482480
7475 -86028 15179 -47950 22877 8612 23175 321001 -7509 -274664 4340 151843 87744 28497
7462 258740 29022 -45818 72622 94657 -90685 -51779 232768 -17096 137415 -67939 -5081
7450 -34761 169305 -255249 63019 67131 117030 -67862 99073 27559 23053 -144357 -78778 -504431
7438 -504431 -158994 12831 78115 -190841 -154657 -91296 -54273 182125 129092 -68882 17126
7426 214352 728 -105330 -16776 76617 -118206 301416 -3184 52036 -102728 -297832 120854
7414 -142768 -177660 -199421 -118649 -123457 -4567 55638 -242538 -5933 -13315 65458 -37178 20211
7401 -354691 13072 -346524 -174550 -226573 -109498 129584 -165000 115937 -218414 -129961
7391 -129961 29512 -11204 -187334 537287 -17885 114144 -170556 -129766 -296502 353192
7380 -182549 -24079 32104 190650 156786 -130757 -149005 -138209 248936 78469 -395962 -112322
7368 -307282 -36611 -161358 187210 -124044 208653 -38011 -158142 -305587 -200144 -28353
7357 44048 47163 -315827 -36309 43275 -83393 143539 189243 115078 -224296 38955 -195462
7345 -294136 -175362 -78146 -162770 -8274 -242294 107134 -200832 -76027 95313 -203474 50437
7333 -201967 261983 -91223 -334725 -58758 26629 126556 205080 -118963 36655 -208893 -230601
7322 -230601 -52705 -107793 -148257 498861 135040 -107290 -153134 70342 251033 157614 -9723
7310 185226 49232 -253867 -36299 -65170 33795 -127880 -150536 -106050 -14188 50294 -26772
7298 198186 184109 -216025 28217 190778 107525 -57542 -251462 -169794 83816 -50012 171098
7286 -32590 -16781 5420 38115 -35825 -436836 -115859 84216 38755 111922 42864 -160010
7274 27995 -19884 -114566 -74227 140904 -293712 -321332 123733 -124475 -2775 68563 -4462
7262 87317 -177029 166746 -377737 -202372 -35333 112422 -2252 -196662 48181 105669 -59596
7250 216929 101000 292794 -139086 -184744 67318 64150 -306343 -55371 -149777 25313 3304
7238 -195106 247097 269122 170610 246565 21826 50715 146841 -124928 297143 -202470 -311916
7227 -311916 42614 -163406 128265 -93391 -375704 226275 64043 -5566 -207989 17124 -80545
7215 -249784 -33955 -421765 -3590 -112943 286006 18860 -296889 25960 -124983 77625 -80296
7203 -148207 168938 -26548 -132478 67806 -27030 62989 46997 3961 17792 -164721 43578
7191 -301890 -33820 -106184 -7007 66456 108694 366262 -178669 33715 -60042 -173655 -137271
7180 -137271 51184 130847 145260 52345 -42651 -27134 -23794 29474 114525 -98383 -506968 52094
7167 -185874 -83222 -218049 -15288 180893 336507 105700 -82809 205662 -33751 -117019 11747
7155 237402 -14513 -172971 438243 82628 275812 305059 251035 196254 311036 -79243 -34699
7143 184264 -205684 169337 106277 155101 122303 -320888 -269569 83780 42534 22773 -118410
7131 96961 221059 309331 105052 10567 -36932 -178973 240793 -353286 -281160 61515 15337
7119 -212935 191237 8535 80059 -3808 187556 93117 -70917 224086 74449 417403 -20546
7107 244457 -186976 -159285 -120747 -43067 -19483 -101120 -209760 31773 -62590 -14895 -86277
7096 -86277 132497 -14313 -227969 120499 -173752 -368259 10053 -108106 -80672 -113032 133780
7084 -166456 -224285 28018 283427 -84252 -134425 -91017 -40347 284793 -721766 158708 45532
7072 80756 155797 101863 -240587 -67247 -43023 -39602 -313260 -148583 -79039 106483 73204
7061 73204 -8249 -97160 -112457 55549 -303828 -110363 -113407 225695 -113162 149838 -68544
7049 -97987 -209938 -1263 -266732 55098 89790 109630 -64519 -312864 195348 168909 132553
7038 132553 -218064 -218067 -325473 -264819 -49023 187632 359338 -82759 -177679 254579 43587
7026 -180943 195350 -44652 126509 -112371 389155 -22484 115265 245706 106981 -179931
7015 -411591 -52321 -38688 -93067 71520 -216539 -200141 -204796 -113930 -241183 -364535 -41572
7003 -35128 233754 -170989 174172 104400 -10642 122213 73243 -67225 144867 212989 -228051
6991 -100355 -88572 -118926 18750 281229 -24413 410101 25963 -9285 354705 149644 -141412
6979 146369 219536 -167148 219354 200054 161579 -146971 -47961 -251541 -184274 3855 -279499
6967 -4338 98535 -71729 92806 30528 -82135 -89782 143367 -81283 42140 -190780 122464 -35580
6954 -397772 138247 246700 -170252 -32043 2996 101627 -282351 200539 56182 108473 -26159
6942 -19272 -152813 67053 -167208 7244 -2225 -115703 322907 114861 -100637 157586 -142213
6930 469607 128672 -11759 -99565 -360417 249687 -233963 -195822 6137 -118441 -31441 33569
6918 8466 -137587 39754 -161964 19978 49493 -78517 19995 12612 -210682 -74495 -63605 66170
6905 -19954 168578 63519 108307 15505 134895 192791 -139224 -440263 -148180 783 -314320
6893 -283548 34144 104599 -200568 818 -86793 -16263 -8266 -7050 -47765 -35872 -145769 -39784
6880 -224405 -301147 -15412 102865 -247799 -14679 -82485 -78252 -37528 145866 -136645 -369869
6869 -369869 -76414 91149 -135458 -107013 416334 148671 -466668 -260775 -92775 307259
6858 111747 -400074 10262 -244230 -161151 -47848 97604 -216434 -172481 26614 145909 148392
6847 148392 49054 -35360 -17007 -316494 -81080 -317874 -120708 -183532 -250405 224962 215074
6836 215074 -157556 183969 146924 -49810 32791 -101360 -52188 -64945 -50524 57094 -54104
6824 -18627 68045 18703 -53282 91945 -121390 63035 93975 -166878 -49167 -148973 170363
6812 -127119 55441 56609 15463 -223443 159092 342275 42330 95797 -324859 -177792 -25676
6800 -206555 -133899 14343 18711 -18342 -333567 201948 255260 254270 -155670 350390 -89448
6788 -5854 -27963 -103253 -69034 109165 -143609 -75502 266504 -55137 -55467 57570 -162711 -289949
6776 -289949 -153339 30005 171075 -487800 -51360 98071 355959 4146 -250115 315404 -21593
6764 132930 -170051 229804 166363 -326633 -206748 45792 -758 -230091 -22047 -269429 -229367
6753 -229367 48728 -75084 73501 23201 407330 -157631 -84139 240462 -4418 328043 -251414
6741 21893 -25951 1806 89398 -198311 -376633 88328 127522 170388 -79869 -67440 40955 213191
6729 213191 142215 251285 -175140 -139108 -152422 -309468 9604 77836 -100133 2730 -136275
6717 -10869 -153810 -356132 39200 -392970 -138263 -259020 41286 138376 123753 394134 32305
6705 251709 24000 131415 384205 -236928 -270937 201817 19159 59205 78936 232521 -67304
6693 210697 298260 -71177 184931 109071 20187 47918 -188240 263548 -177585 -10585 220924
6681 -317755 -266696 -3235 -6083 -498608 -47544 128109 134783 96732 193132 -61212 -162350 -338326
6669 -338326 -189270 -179354 314890 40467 99218 -79033 -83664 -129433 -332234 -159534 -169496
6658 -169496 -237984 -7201 69255 78271 -122682 -2751 -212354 77837 117960 -15143 -87435 103671
6645 12251 21619 173497 24824 105357 219995 -78759 53359 84922 -177212 -127547 -33891
6633 -139440 -327339 -96275 305526 153016 -21989 283679 -74119 -60343 185738 -271 -163008
6622 -163008 84181 286915 52 -154302 -292419 -192661 -35391 -145531 100521 299655 -183384
6610 84043 -157976 -90717 71676 38119 185192 -67665 -119944 16981 88324 -26846 -85605
6599 -85605 -100950 -409285 222204 469149 -197267 14308 65353 -322048 103842 -114570
6588 58082 -58682 152494 -129315 -96482 -22142 -236029 328497 104948 314321 -145333
6577 -24380 -112892 -584168 -387253 48767 -207673 -39400 -204060 -162350 -269368 -84749 -6289
6565 -98614 100389 -36601 242576 -28653 175227 -69239 -226934 57877 -14567 -352933 216274
6553 140518 264785 -111982 -122935 1853 -203845 -358790 433247 -72397 -123217 -12169 -372280
6542 -372280 282577 -232198 -165647 219693 -185881 23719 -261323 -63159 -321488 316479
6531 225111 172462 -54704 32317 -84534 -32716 -161644 -64227 -194343 60231 105378 -73230
6519 -78037 -56495 -158001 182131 76130 -17897 -229196 -78168 85433 110796 -106442 30825
6507 -15533 31617 119285 -114906 -141462 -136742 -170784 -106835 10615 137765 -250517 129011
6495 -148845 -144512 -332038 -25716 -188307 -97857 -179392 329840 -277451 87318 212540 10025
6483 163305 115263 -231396 59774 -204667 -9893 -53965 -29873 143153 -233360 -215797 209483
6471 -58644 -106600 229194 143807 -28756 293035 -50936 223040 97558 -230044 253216 6194
6459 -287245 -62262 46408 -298125 49017 86909 96429 227926 -39750 -192653 -95073 -239653
6448 -239653 -284934 -186353 -110547 -466573 -132202 -97860 -43404 -11412 15922 -169906 -224099
6437 -224099 -190019 3836 147807 211749 280178 163736 -75810 -341180 -35393 84653 -39043
6425 -245213 -48965 -147918 -98259 -67495 -151316 -135584 -30843 -3054 297861 18771 276241
6414 276241 -60110 172821 -214785 366675 -44951 -46344 298747 -179541 -180223 209888 48493
6402 54580 -176078 -280261 -76184 -56590 43022 -225099 275114 -75780 -73147 -2846 77737
6390 12822 -32028 341325 -179144 88377 186497 -104739 144098 -40560 149695 -98890 -133663
6379 -133663 -73077 -128445 69856 -182127 417249 117029 147228 31032 63459 -248789 -72599
6367 -103025 -26291 -198338 -96436 -223798 61224 39879 183784 45248 57053 -105101 -232491
6356 -232491 -223453 354436 320326 -40119 328754 -55843 226696 20056 -319785 75777 113165
6345 113165 -314339 -85713 -173245 -166965 -120957 -151571 -354581 325639 -339305 73441 54623
6334 54623 -98151 -197217 67810 -194730 -142458 -27317 7313 44006 165552 316881 -98297
6322 -11933 -88760 -196302 -1311 -179449 237966 -116260 -117161 -223381 215473 84425 157347
6311 157347 -357140 -262861 72732 2824 -24081 -50734 72220 -175723 307686 166202 -46536
6299 292897 -65787 72288 -192186 121506 -334692 -117917 -62314 190 108157 76673 286786
6288 286786 -94225 -47125 -43387 304191 -18125 167731 -264503 -76087 168116 139451 9043
6276 -175987 -209682 56438 -25430 242910 -148777 87931 -129365 -33081 -100137 170328 73151
6264 -118896 100255 197123 -158039 -208232 262593 65973 -51948 -20816 18161 -135880 -21317
6252 139048 177271 152524 47514 -165201 174068 225777 -259929 61886 208111 45572 -113188
6240 60827 101920 -278694 337772 126833 -70702 -224841 -63894 71562 278556 -228367 136970
6228 159972 16712 12028 -103648 -260872 -34819 88242 254212 379198 -57525 -91148 170498
6216 -182165 177091 98779 84030 -17347 -2211 -25733 -226863 27022 -126034 -79339 187803
6204 -192702 177678 10740 -225258 62111 21883 -60175 -247744 4402 217189 11252 38720
6193 38720 -89698 138721 -72468 -128646 129734 177986 7509 -181424 76310 33785 -35525
6181 121707 48571 337249 -408517 53704 -65757 -335665 -380384 -313963 -19470 -153318 -151764
6170 -151764 -449403 37919 78747 -252664 33705 68091 207132 52835 -114544 374043 141630
6158 -271892 32874 -88607 29579 -230971 -91707 -105189 -70684 -140191 -120431 -87669 -74812
6147 -74812 -631409 191172 -44807 181170 -193376 -28425 -80383 149045 -200541 -127982 -146168
6136 -146168 -38204 45901 248089 -117192 31437 105168 238077 -147109 -109044 -159961 63526
6124 -101242 114624 56889 149189 312565 -166535 78124 190647 -115842 123247 442868
6114 442868 295006 -286964 312140 90665 45743 46127 -73995 490163 -228792 116920 -112591
6102 -223564 -356271 -46109 -111683 -376188 110778 166482 -85355 -113176 31149 51411 -2986
6090 -58705 200830 125467 92079 -346749 -352332 60795 22197 -228691 -19092 -249625 -52189
6078 46915 151136 213756 -141904 -160149 75140 6900 -105722 220610 258769 64074 -145049
6066 160725 31505 -41030 83289 96358 -298654 -294129 -114965 89571 289997 4587 142772
6055 142772 163646 26830 105149 164291 -69909 -72694 -37297 225587 -112786 -262138 -58336
6043 174228 -7055 34306 28541 -665 28150 164527 237396 -138129 209298 -79847 244026 -20510
6030 -7624 -39687 -351076 182709 -1790 528808 73801 125946 353417 289619 307929 -119621
6018 -139555 -117414 -128936 -227894 268301 -6267 -82234 -108650 -94257 -264890 -168662 260369
6006 241182 -37527 -236871 -182411 -20484 139931 57864 -192065 -274607 -79821 8875 -115764
5994 61469 106493 -15786 -22146 28288 -143172 -207815 41857 -80065 -30361 63878 -96733 89493
5981 -328729 70001 -240152 -81086 254419 -132016 -29539 -22823 -111826 -94403 237380 13989
5969 237045 -77247 296197 -310839 236039 95076 -175948 -239 75286 -6708 -4510 38805 -132904
5956 218398 -187071 205294 -194445 162308 128897 71839 -281538 -50341 -94780 -50902 19126
5944 -135288 -100322 104216 -125960 -62026 63444 -40648 30574 162458 184367 67171 5616
5932 -50498 -4558 72782 -298936 174192 -109407 288947 -344038 46836 -161334 326867 -100688
5920 208215 -406729 194056 139215 -56499 5391 3193 210971 -47658 15647 -154641 -79025
5909 -79025 68496 -19253 256981 138464 -167407 376777 -97309 -158387 -54561 -81141 -35361
5897 -217261 -163394 156374 -104376 391179 -61332 95898 -20605 276371 -172112 92253 -12790
5885 -106756 38823 -44141 242259 35699 -60593 95690 -114375 82959 210472 252277 84949
5873 -7473 -10319 -106148 -331115 252848 -70293 69405 -234402 -51326 -119942 152332 260840
5862 260840 22189 13758 128832 -48164 -84123 -108427 -243726 -96392 60623 17469 -130790
5850 -41393 -252395 288964 470049 -18672 236354 -48486 -102147 23607 -229095 -67996 -33931
5838 -116272 353991 -211705 -88213 192500 88513 -47851 -138328 -75406 -32812 137946 314164
5827 314164 -33836 -115715 -89629 138046 114965 -46325 -203105 203337 -179557 -199516 -7638
5815 114050 -5795 43780 137520 -51069 -90585 -192138 68827 -368140 -16775 -2920 -64788 1728
5802 -83711 -177509 -73022 250988 -175540 68624 -251231 149305 -81361 15174 32620 201100
5791 201100 -43942 -64359 8900 4546 -277503 86221 -116592 -412430 -100633 320278 -298230
5779 14012 -187935 149408 -85215 338846 76352 282357 2355 -5175 64691 -69860 -128835
5768 -128835 -146725 24483 -232808 -52754 90687 5458 7183 -2088 -241209 59960 15008 180217
5756 180217 -108704 103572 -50878 -91310 15122 283815 -7318 149523 69053 142129 -167906
5744 -124344 114575 -8822 -152969 -35294 100429 148830 -141227 -154658 -142065 154234 76333
5732 -68748 -215868 -2834 -4865 -60467 -17854 81904 -74231 -102243 49095 125290 -175250 -85304
5719 -126239 -100099 -49439 84638 268117 108919 -40643 -269987 -200739 -11621 -117036 264185
5707 271632 -54883 -69958 146949 71345 -170242 18349 -160097 -27999 -117856 -99209 -9012
5695 -50140 155706 95080 120099 277922 195792 39335 -86965 -145526 -81726 -129753 223915
5683 225548 92816 12702 -269029 124400 -43802 -14477 102198 -142232 85703 -7063 159959
5671 224825 -222787 -24908 -17307 5040 -238758 -349574 -3611 135516 -139307 193619 389655
5660 389655 -109957 -425331 -134291 -45445 -205941 -140572 -102900 131755 -28525 -27212 -82858
5649 -82858 121656 -63469 -116707 191924 -16581 -216654 -5344 -116347 178339 -142374 -14955
5637 428665 -108451 225519 -62207 63726 -51594 -150484 251713 97542 -24662 63838 -61970
5625 -32280 -207289 200027 146127 180190 -215848 194282 318538 -179139 -31331 134957
5614 -251166 230107 -41757 -88037 336653 209625 324021 75542 52938 -104090 119576
5603 92946 54752 -68474 181076 16626 -191150 -100944 -130083 73605 -239268 -109019 84733
5591 66856 -31340 12511 -192227 425172 -166260 -3900 -141685 15985 -9759 16878 -305765
5579 -191059 164898 -214375 131630 -119323 192757 -350877 -67882 -120644 139791 87185
5569 87185 274902 -35374 -22090 105164 -208770 116571 -456970 10177 115418 -201032
5558 333147 281185 84963 113165 -209832 55751 -170985 352321 82890 -125873 158995 -5228
5546 195087 96397 -129133 263147 -106666 -107006 59783 50511 -103428 -175978 -71980 -480444
5535 -480444 -101591 -151795 -257348 -36577 -57279 -89393 10479 91823 53382 206029 293853
5524 293853 104418 -306893 256930 37703 -229880 262456 166479 486233 -214621 18349
5513 56750 -244257 -57211 -129367 64077 214917 61753 15825 -103545 -106285 102238 -96988
5501 62751 -20763 71671 -349469 -134724 8097 479351 -100694 -59411 150908 -125385 81951
5489 90989 -95248 -198261 167842 -198080 34301 141542 -149214 -77078 -67188 114181 -1394
5477 -145402 110556 435 -119422 10913 -86608 87897 -217450 -32607 -174255 -47479 -77928
5466 -77928 266008 -138026 92514 -126064 242824 64169 -159012 -7241 -11167 -38612 455165
5454 137948 -325672 35383 143747 127431 -103258 97002 -153620 -109717 71384 363685 72480
5442 41684 -15580 58423 -250963 -10494 19051 130921 226786 323200 -141564 -48151 -156868
5431 -156868 -2963 64865 101810 -130529 2160 280092 -173994 109602 -195406 -255 -37054
5420 -37054 -274944 -258080 181492 -21337 9053 42079 178371 -208460 161083 -152745 -155885
5409 -155885 -34991 -58750 -374615 190334 -104532 151077 -298497 35959 -94665 175231
5398 189491 322996 187156 -115339 -29276 202952 4747 209385 -87778 59589 -177067 -234753
5387 -234753 -122568 -230003 -215312 20984 -189700 112824 290878 -164149 -140858 180175
5376 231323 144479 -169864 71551 -102989 40678 94393 -6586 496 -188388 -123809 -304882
5365 -304882 4436 173544 48459 -202915 36890 -219557 114140 -94831 -66838 379263 -162757
5353 -35373 80417 83066 274871 -210340 169105 56659 -334515 -189865 5125 137965 176673
5342 176673 76518 -58118 120113 17763 98486 -127281 169906 -352479 -119444 -248585
5332 -248585 -27809 219806 175159 87028 26851 101366 15310 196685 47870 125617 84458
5321 84458 124847 327023 -1336 141295 -137334 172529 -320156 -268612 -24139 -90208 -34012
5309 -168625 -12095 -141188 385871 25764 14325 196271 239114 -196196 -47704 -67732 338713
5297 336831 -115447 -148871 -77578 406608 74004 -250319 178035 32318 -236812 372779
5286 -46100 -40661 -75766 155836 -75941 263692 -101688 161275 -237570 223721 -190751 193649
5274 -142961 -416845 101463 -95378 -221051 138725 -136961 -85263 -235860 21731 182103
5264 182103 -114656 8519 133093 131374 -190393 -98368 84987 247395 -162387 -302803 -197246
5253 -197246 42949 95551 159152 117805 -75268 -261259 -177727 290679 -26803 192979 178104
5242 178104 162180 194554 -44139 2471 -159659 -205548 -19311 34433 -145459 -48115 320019
5230 52857 275254 -90982 -114341 152678 180741 -167343 138250 89243 -132463 -24641 14127
5218 -307966 96103 31442 102888 85167 8634 102654 -399991 60323 -69280 -100717 -18390 26983
5205 -94681 -144414 80640 93857 10670 -53200 -183240 80576 -42388 84799 300929 64257
5193 -227713 -212626 16303 -69479 -84583 47291 289703 166292 304370 -123747 104957 -16211
5181 4707 -434547 -174645 -106647 -221383 -244238 59817 -314001 -114719 -112292 -168149 39441
5169 131524 8441 -208657 -54500 67345 43300 -15752 -98414 -86571 45740 -121994 106428
5157 -133745 168179 37996 -75059 -189270 -87556 9717 102222 -36370 -75328 30914 64019
5146 64019 95935 -278793 217444 -110626 -119025 44915 93442 -223266 -195587 -83293 -5824
5134 156250 -199600 -47836 58318 8111 199655 82633 256189 -84978 138792 88235 72595
5123 72595 35996 -124843 -277481 -252828 -37032 256061 -56814 94518 -256069 -6843 -135242
5112 -135242 36599 -236497 109287 -145340 -95576 -27306 -208877 -14227 95364 99314 -22678
5100 113500 185844 -26576 50149 -100217 -44873 -408831 -172625 42233 83017 -120177 42851
5088 28150 -232603 238935 29957 403031 -41588 121493 98845 107653 113642 23619 -155208
5076 -46286 -92713 -120642 109390 183025 23492 23350 -9511 38405 284563 227818 -317587 29087
5063 -165240 357005 225036 -49815 -205929 -4010 -36515 24039 -31788 -98825 -40129 -29277
5052 -29277 -30243 206198 -105527 193217 -126218 -353915 106864 -10818 4260 -41623 16549
5040 -216498 25373 250551 -265847 -100054 215185 -80654 -25767 -94404 207922 -17184 45774
5028 -129970 -442202 -160372 -138289 256072 28212 -31572 257647 35645 108574 -112506 -122754
5017 -122754 -77104 125698 94120 -261895 234978 -20474 -99329 422290 193365 -178074
5006 -188944 251877 -69983 -19828 7735 15439 328714 159664 39410 -97504 -1421 -226329
4995 -226329 -28516 417040 214847 -111422 102857 172755 -67302 145198 112149 182262 -89707
4983 198003 -280988 -84911 339614 224925 -65120 -165780 131803 -300075 19982 -196588
4972 369299 -14602 175005 99564 -68276 141413 41941 200564 -50432 74950 -162055 -31366
4960 110402 17404 378416 -84410 30534 286205 -86504 30109 -520798 -79515 -183939 136600
4948 86251 -224593 13014 -172331 281899 33737 165358 -80747 -22458 52240 -94420 -80231
4937 -80231 -28419 137961 -30133 -48576 208028 71022 -235885 -191181 -136042 89743 -296452
4925 -55681 16842 -105540 46623 45428 -29086 174832 332715 238975 -71775 46146 85250
4914 85250 -198918 -103240 -91463 216702 64001 -129957 -76943 -126620 30810 175183 181126
4903 181126 -60458 47216 -120715 -164364 245347 -65053 -353533 -172945 330239 -556 -108418
4892 -108418 -60340 -269984 239776 -199379 177686 -254337 -1645 172766 -93733 -146579 -167998
4881 -167998 -263461 -182981 306588 55706 144103 92172 32948 2305 104226 58754 267362
4870 267362 -12212 -94829 202868 -183760 43484 -130259 -56765 -208877 -233260 63208 67552
4859 67552 206687 -132343 -150840 -251874 -66650 -101174 -264145 -114284 -140240 -58067 87636
4847 -31010 29440 76932 -60532 29801 103706 -137445 242120 -88279 92683 -151047 -173421
4836 -173421 -169531 25683 -196144 -175604 -202772 128500 232075 -22144 -346667 224436 -50555
4824 -177176 23941 -132488 33716 104307 -223336 249332 -29559 80181 61234 -81914 43892
4812 161307 -138103 279369 125082 -5695 -163190 317576 192872 349875 40743 32718 -180036
4800 127150 -106650 -120090 -119715 -92410 -38325 144305 -216007 -46055 14299 -162193 85105
4788 82680 -49888 331422 -377 115768 -284189 203246 46909 125641 -142255 -91768 191567
4776 38691 -118281 54869 18543 -92228 -169936 -189137 -149928 -8592 -85183 -45344 46051 279445
4764 279445 58669 94299 -31065 -39809 70750 -103624 -143717 416909 255858 136558 -8792
4752 74266 126871 42835 182110 -211999 95228 106460 21514 -94365 -91331 -332491 182002
4740 99278 251047 111613 69389 -48614 71001 -167929 214621 180401 32788 8490 171415
4729 171415 100403 92797 56330 112495 -95363 259945 -113352 -76467 -87345 283075 120418
4717 319646 19377 -6169 -16029 82991 4886 -55461 -233052 -181975 -358379 172577 -36407 2632
4704 -227703 -58572 50624 -78188 248177 -169374 128084 -41946 120899 -165565 37428 -26835
4692 -93548 20563 167937 -77523 -285769 63146 -863 241737 -119821 303153 -80617 331731
4680 -296351 -90081 -105880 86886 224965 -8892 129470 323106 238080 -5381 154458 -112847
4668 329400 -96537 -60967 282499 -252662 -66152 256404 -293824 -11179 445425 -69180 -13807
4656 122193 270934 123474 -40637 192693 136691 -150642 114114 -178592 88262 70613
4646 70613 -22976 -11340 214565 -11334 220245 -41328 -54645 -69006 -88178 145928 -164294
4634 128166 -44442 33648 78215 214776 -48025 48054 94704 -11228 -231835 -49494 -207920
4623 -207920 -189014 -169914 77352 323465 138906 -104487 -233735 186042 -149359 263241
4612 -150377 -323198 -18103 -15397 337189 -187610 -250814 166800 -422762 -73985 -35530 119784
4600 -47495 186298 326434 -136723 271106 288940 253646 -52026 -230684 -85383 -137587 -111461
4589 -111461 -171655 251921 219922 160855 -140626 -199082 56473 138953 282178 132837 -195949
4577 -237164 11523 18566 -8470 77470 -624 14778 -208957 -94598 416 200291 13423 -82657
4564 -50164 -185918 500349 -158236 88205 125901 47213 169866 -13044 166637 73152 -125498
4552 -182718 178704 358116 -45685 -21222 40732 314989 83404 -148939 95665 120553 -117290
4540 -153850 -318870 34648 -242274 24142 313793 -268043 76302 204346 126749 191743 243783
4529 243783 -83151 123595 98140 28180 89763 -123150 -49400 58268 38529 -356190 9209
4517 205914 -8485 -117371 130952 307732 314124 154987 42146 289157 -42946 212502 -191842
4505 267935 -2787 188961 -140611 -212233 -62910 -97460 -199103 -60719 15184 3606 86884
4494 86884 -94695 -154499 13419 28070 10659 162523 -123592 -19204 -304647 87950 292343
4483 292343 157244 86572 -388468 23358 242543 -244515 144306 500317 -68723 -429237
4473 -429237 -10947 -307520 -70855 270288 -137058 -9113 115412 -229630 159752 178146 -246245
4461 -5226 -78559 37108 80300 29231 -203419 -334220 234550 77334 -36086 -131722 12100
$$ [...]
##END NTUPLES=NMR SPECTRUM
##END=
