##TITLE=AC1727_3474_9208054_ibkSnlMSrY
##JCAMPDX= 6.0         $$ Bruker NMR JCAMP-DX V2.0
##DATA TYPE= NMR SPECTRUM
##DATA CLASS= NTUPLES
##ORIGIN= BRUKER
##OWNER= Administrator
$$ 1.72 TOPSPIN		Version 2.1
$$ 2015-07-13 12:26:33.025 -0700  Administrator@X
$$ Compression mode = diff/dup
##.OBSERVE FREQUENCY= 400.02188249412
##.OBSERVE NUCLEUS= ^1H
##.ACQUISITION MODE= SIMULTANEOUS (DQD)
##.ACQUISITION SCHEME= undefined
##.AVERAGES= 64
##.DIGITISER RES= 22
##SPECTROMETER/DATA SYSTEM= spect
##.PULSE SEQUENCE= noesygpps1d.comp
##.SOLVENT NAME= COFFEE_meoh
##.SHIFT REFERENCE= INTERNAL, COFFEE_meoh, 1, 14.96134
##AUDIT TRAIL= $$ (NUMBER, WHEN, WHO, WHERE, PROCESS, VERSION, WHAT)
$$ ##TITLE= Audit trail, TOPSPIN		Version 2.1
$$ ##JCAMPDX= 5.01
$$ ##ORIGIN= Bruker BioSpin GmbH
$$ ##OWNER= Administrator
$$ $$ E:\/data/COFFEE/nmr/AC1727_3474_9208054_ibkSnlMSrY/32/pdata/1/auditp.txt
$$ ##AUDIT TRAIL=  $$ (NUMBER, WHEN, WHO, WHERE, PROCESS, VERSION, WHAT)
(   1,<2015-07-09 22:25:19.300 -0700>,<Administrator>,<X>,<go>,<TOPSPIN 2.1>,
      <created by zg
	started at 2015-07-09 22:13:49.394 -0700,
	POWCHK enabled, PULCHK disabled,
       configuration hash MD5:
       21 0F 79 D6 B3 7B B4 F6 88 20 88 DB 03 48 BD 9F
       data hash MD5: 64K
       EE 24 E4 68 45 52 3D B2 F1 74 08 B2 3B 4F 8F 16>)
(   2,<2015-07-09 22:25:22.738 -0700>,<Administrator>,<X>,<proc1d>,<TOPSPIN 2.1>,
      <Start of raw data processing
       efp LB = 0.3 FT_mod = 6 PKNL = 1 PHC0 = 0 PHC1 = 0 SI = 128K 
       data hash MD5: 128K
       BF 2A 0E 0E 6D 9D F0 D9 EA C9 D9 53 9F 75 6B A7>)
(   3,<2015-07-09 22:25:23.628 -0700>,<Administrator>,<X>,<proc1d>,<TOPSPIN 2.1>,
      <pk PHC0 = -88.02795 PHC1 = 0 
       data hash MD5: 128K
       98 3C 0C 7B 72 36 26 4E 26 36 1B A7 9B 53 F5 C6>)
(   4,<2015-07-09 22:25:24.003 -0700>,<Administrator>,<X>,<proc1d>,<TOPSPIN 2.1>,
      <abs ABSG = 1 
       data hash MD5: 128K
       6F 0C 80 D5 ED C6 F1 94 A9 78 11 45 11 FE 03 DC>)
(   5,<2015-07-09 22:25:24.113 -0700>,<Administrator>,<X>,<proc1d>,<TOPSPIN 2.1>,
      <abs ABSG = 2 
       data hash MD5: 128K
       45 26 C6 AF 4A 41 43 FC 1D 1D DA D5 37 E6 F5 9B>)
(   6,<2015-07-09 22:25:24.206 -0700>,<Administrator>,<X>,<proc1d>,<TOPSPIN 2.1>,
      <abs ABSG = 3 
       data hash MD5: 128K
       BF 73 B9 BB 24 1A 42 2C 70 A9 6D 22 44 B1 53 E4>)
(   7,<2015-07-09 22:25:24.285 -0700>,<Administrator>,<X>,<proc1d>,<TOPSPIN 2.1>,
      <abs ABSG = 4 
       data hash MD5: 128K
       B8 31 75 15 2B 3E AE 45 74 2E 46 FE BD 1F 3C 19>)
(   8,<2015-07-09 22:25:24.378 -0700>,<Administrator>,<X>,<proc1d>,<TOPSPIN 2.1>,
      <abs ABSG = 5 
       data hash MD5: 128K
       62 35 BC 1D 21 05 A7 AA FB E5 C9 AC 57 25 88 81>)
(   9,<2015-07-09 22:25:26.425 -0700>,<Administrator>,<X>,<audit>,<TOPSPIN 2.1>,
      <user comment:
       ICON-NMR User ID: COFFEE
       data hash MD5: 128K
       62 35 BC 1D 21 05 A7 AA FB E5 C9 AC 57 25 88 81>)
$$ ##END=
$$ 
$$ $$ hash MD5
$$ [...]
##$TP07= 0
##$TPNAME0= <>
##$TPNAME1= <>
##$TPNAME2= <>
##$TPNAME3= <>
##$TPNAME4= <>
##$TPNAME5= <>
##$TPNAME6= <>
##$TPNAME7= <>
##$TPOAL= (0..7)
0.5 0.5 0.5 0.5 0.5 0.5 0.5 0.5
##$TPOFFS= (0..7)
0 0 0 0 0 0 0 0
##$TUNHIN= 0
##$TUNHOUT= 0
##$TUNXOUT= 0
##$USERA1= <user>
##$USERA2= <user>
##$USERA3= <user>
##$USERA4= <user>
##$USERA5= <user>
##$V9= 5
##$VALIST= <valist>
##$VCLIST= <CCCCCCCCCCCCCCC>
##$VD= 0
##$VDLIST= <DDDDDDDDDDDDDDD>
##$VPLIST= <PPPPPPPPPPPPPPP>
##$VTLIST= <TTTTTTTTTTTTTTT>
##$WBST= 2048
##$WBSW= 25
##$XGAIN= (0..3)
0 0 0 0
##$XL= 0
##$YL= 0
##$YMAX_a= 6405405
##$YMIN_a= -12684347
##$ZGOPTNS= <>
##$ZL1= 120
##$ZL2= 120
##$ZL3= 120
##$ZL4= 120
##$ABSF1= 14.96134
##$ABSF2= -5.596842
##$ABSG= 5
##$ABSL= 3
##$ALPHA= 0
##$AQORDER= 0
##$ASSFAC= 0
##$ASSFACI= 0
##$ASSFACX= 0
##$ASSWID= 0
##$AUNMP= <proc_prof1d_extract.lims>
##$AXLEFT= 0
##$AXNAME= <>
##$AXNUC= <1H>
##$AXRIGHT= 0
##$AXTYPE= 0
##$AXUNIT= <>
##$AZFE= 0.1
##$AZFW= 0.1
##$BCFW= 0
##$BC_mod= 0
##$BYTORDP= 0
##$COROFFS= 0
##$CY= 15
##$DATMOD= 1
##$DC= 0
##$DFILT= <>
##$DTYPP= 0
##$F1P= 0
##$F2P= 0
##$FCOR= 0.5
##$FTSIZE= 131072
##$FT_mod= 6
##$GAMMA= 0
##$GB= 0
##$INTBC= 1
##$INTSCL= 1
##$ISEN= 128
##$LB= 0.3
##$LEV0= 0
##$LPBIN= 0
##$MAXI= 10000
##$MC2= 0
##$MEAN= 0
##$ME_mod= 0
##$MI= 0
##$NCOEF= 0
##$NC_proc= -2
##$NLEV= 6
##$NOISF1= 0
##$NOISF2= 0
##$NSP= 0
##$NTH_PI= 0
##$NZP= 0
##$OFFSET= 14.96134
##$PC= 1
##$PHC0= -88.02795
##$PHC1= 0
##$PH_mod= 1
##$PKNL= yes
##$PPARMOD= 0
##$PPDIAG= 0
##$PPIPTYP= 0
##$PPMPNUM= 2147483647
##$PPRESOL= 1
##$PSCAL= 4
##$PSIGN= 0
##$PYNMP= <proc.py>
##$REVERSE= no
##$SF= 400.020009502918
##$SI= 131072
##$SIGF1= 0
##$SIGF2= 0
##$SINO= 400
##$SIOLD= 131072
##$SPECTYP= <>
##$SREGLST= <1H.CDCl3>
##$SSB= 0
##$STSI= 131072
##$STSR= 0
##$SW_p= 8223.68421052631
##$SYMM= 0
##$S_DEV= 0
##$TDeff= 65536
##$TDoff= 0
##$TI= <>
##$TILT= no
##$TM1= 0
##$TM2= 0
##$TOPLEV= 0
##$USERP1= <user>
##$USERP2= <user>
##$USERP3= <user>
##$USERP4= <user>
##$USERP5= <user>
##$WDW= 1
##$XDIM= 131072
##$YMAX_p= 404159276
##$YMIN_p= -13201
##$CURPLOT= <Network HP LaserJet P1505>
##$CURPRIN= <$Network HP LaserJet P1505>
##$DFORMAT= <normdp>
##$LAYOUT= <+/1D_H.xwp>
##$LFORMAT= <normlp>
##$PFORMAT= <normpl>
##$SURQMSG= 1
$$ End of Bruker specific parameters
$$ ---------------------------------
##NTUPLES= NMR SPECTRUM
##VAR_NAME=  FREQUENCY,     SPECTRUM/REAL,   SPECTRUM/IMAG
##SYMBOL=    X,             R,               I
##VAR_TYPE=  INDEPENDENT,   DEPENDENT,       DEPENDENT
##VAR_FORM=  AFFN,          ASDF,            ASDF
##VAR_DIM=   131072,        131072,          131072
##UNITS=     HZ,            ARBITRARY UNITS, ARBITRARY UNITS
##FACTOR=    0.0627417313425164, 1,          1
##FIRST=     8223.62146879497, -713,         -56491
##LAST=      0,             369,             -56657
##MIN=       0,             -13201,          0
##MAX=       8223.62146879497, 404159276,    0
$$ Real data points
##PAGE= N=1
##DATA TABLE= (X++(R..R)), XYDATA
$$ [...]
$$ plain form
61501 427090 424841 423053 422212 422026 422126 422706 424012 425693 427086 427839 428026 428042 428491 429717 431309 432552
61485 432552 433471 434770 436668 438502 439791 440978 442666 444745 446745 448544 450235 451733 452982 454116
61471 454116 455014 455192 454625 454214 454767 455856 456326 455717 454578 453566 452861 452398 452058 451624 451057 450886 451768 453496
61453 453496 454928 455165 454514 454048 454427 455471 456799 458513 461052 464502 468333 471934 475260 478697 482359
61438 482359 485907 489121 492337 495971 499768 502868 504692 505579 506395 507622 509012 510203 511426 513305 515984
61423 515984 518850 521291 523403 525673 528238 530762 532783 533844 533568 532064 530030 527954 525454 522060
61409 522060 518366 515522 513565 511253 507837 504094 501022 498246 494545 489581 484378 480260 477853 476948
61395 476948 476777 476415 475392 474017 472917 472320 472005 471789 471777 472193 473254 475107 477556 479859 481128 481110 480515
$$ packed form
61501D27090k249j788q41j86J00N80J306J681J393P53J87J6M49J226J592J243
61485D32552R19J299J898J834J289J187J688K079K000J799J691J498J249J134
61471D54116Q98J78n67m11N53J089M70o09j139j012p05m63l40m34n67j71Q82J728
61453D53496J432K37o51m66L79J044J328J714K539L450L831L601L326L437L662
61438D82359L548L214L216L634L797L100J824Q87Q16J227J390J191J223J879K679
61423E15984K866K441K112K270K565K524K021J061k76j504k034k076k500l394
61409E22060l694k844j957k312l416l743l072k776l701m964n203m118k407r05
61395D76948j71l62j023j375j100n97l15k16j2M16J061J853K449K303J269j8n95
$$ plain form
61378 480515 480493 481772 484224 487186 490163 493159 496330 499530 502429 504967 507327 509478 511075 511940 512396
61363 512396 513091 514700 517708 522084 527116 531992 536707 542037 548599 556351 565122 575089 586448 599035
61349 599035 612562 626906 641819 656668 670762 683736 695431 705651 714185 720760 724882 726206
61337 726206 725211 722963 719987 715893 710403 703992 697041 689110 679923 670567 662720 656828 651841 646672
61323 646672 641170 635702 630657 626535 623856 622612 622245 622294 622715 623506 624505 625699 627233 629033 630962 633564
61307 633564 638078 645238 654395 664263 674245 684564 695217 705312 713590 719274 722255 722651 720517 716035
61293 716035 709798 702656 695187 687465 679378 671060 662913 655381 648895 643938 640849 639514 639458 640340 642289
61278 642289 645668 650563 656564 663028 669560 676206 683163 690405 697778 705353 713361 721650 729602 736917
$$ packed form
61378D80515k2J279K452K962K977K996L171L200K899K538K360K151J597Q65M56
61363E12396O95J609L008M376N032M876M715N330O562P752Q771R967J1359J2587
61349E99035J3527J4344J4913J4849J4094J2974J1695J0220Q534O575M122J324
61337G26206r95k248k976m094n490o411o951p931r187r356p847n892m987n169
61323F46672n502n468n045m122k679j244l67M9M21P91R99J194J534J800J929K602
61307F33564M514P160R157R868R982J0319J0653J0095Q278N684K981L96k134m482
61293G16035o237p142p469p722q087q318q147p532o486m957l089j335n6Q82J949
61278F42289L379M895O001O464O532O646O957P242P373P575Q008Q289P952P315
$$ plain form
61264 736917 744314 753076 763896 776474 790216 805023 821188 838702 856828 874278 889669 901782
61252 901782 909652 912750 911228 905795 897144 885588 871533 856137 841007 827086 814199 801878
61240 801878 790306 780118 771596 764470 758410 753279 748910 745001 741397 738287 735919 734254 733028 732202
61226 732202 732155 733284 735423 737879 740181 742539 745311 748212 750465 751696 752220 752409 752285 751966 752085 753338
61210 753338 755795 758877 761854 764280 766270 768589 772175 777311 783553 790702 799506 810990 825327 841870
61196 841870 860120 880157 902096 925539 949741 974021 997815 1020426 1040924 1058357 1072167
61185 1072167 1082513 1090125 1095749 1099660 1101629 1101284 1098585 1094099 1088732 1082903 1076038 1067145 1055886 1042735
61171 1042735 1028157 1012152 994719 976241 957110 937407 917247 897025 877008 857037 837113
$$ packed form
61264G36917P397Q762J0820J2578J3742J4807J6165J7514J8126J7450J5391J2113
61252I01782P870L098j522n433q651j1556j4055j5396j5130j3921j2887j2321
61240H01878j1572j0188q522p126o060n131m369l909l604l110k368j665j226q26
61226G32202m7J129K139K456K302K358K772K901K253J231N24J89j24l19J19J253
61210G53338K457L082K977K426J990K319L586N136O242P149Q804J1484J4337J6543
61196H41870J8250K0037K1939K3443K4202K4280K3794K2611K0498J7433J3810
61185A072167J0346P612N624L911J969l45k699m486n367n829o865q893j1259j3151
61171A042735j4578j6005j7433j8478j9131j9703k0160k0222k0017j9971j9924
$$ plain form
61160 837113 818000 800833 786270 774333 764859 757655 752321 748323 745319 743323 742635 743678 746711
61147 746711 751506 757391 763621 769380 773545 775041 773675 770203 765384 759520 753172 747618 744042 742790
61133 742790 743935 747984 755260 765037 776231 788821 803786 821652 841808 863333 885824 909213
61121 909213 933344 958040 983340 1009425 1036372 1063958 1091592 1118465 1143873 1167326 1188428
61110 1188428 1207028 1223505 1238353 1251240 1261083 1267380 1270865 1272420 1271977 1269019 1263419 1254955 1242645
61097 1242645 1225615 1204359 1180229 1154031 1126045 1097092 1068341 1040144 1012233 985189 960526
61086 960526 938961 919605 901299 883945 868087 854027 841856 831758 823670 817058 811513 807249
61074 807249 804677 803784 804231 805768 808352 812077 817094 823335 830311 837512 844994 853208 862376 872506
$$ packed form
61160H37113j9113j7167j4563j1937r474p204n334l998l004j996o88J043L033
61147G46711M795N885O230N759M165J496j366l472m819n864o348n554l576j252
61133G42790J145M049P276R777J1194J2590J4965J7866K0156K1525K2491K3389
61121I09213K4131K4696K5300K6085K6947K7586K7634K6873K5408K3453K1102
61110A188428J8600J6477J4848J2887R843O297L485J555m43k958n600q464j2310
61097A242645j7030k1256k4130k6198k7986k8953k8751k8197k7911k7044k4663
61086I60526k1565j9356j8306j7354j5858j4060j2171j0098q088o612n545m264
61074H07249k572q93M47J537K584L725N017O241O976P201P482Q214R168J0130
$$ plain form
61060 872506 883903 897003 911719 927616 944766 963760 984775 1007344 1031130 1056265 1082815
61049 1082815 1110691 1140257 1172169 1206253 1241333 1276507 1311827 1347330 1382255 1415935 1448751
61038 1448751 1481413 1513823 1545343 1575820 1605617 1634890 1663538 1691746 1719987 1748555 1777555
61027 1777555 1807221 1837807 1869235 1901338 1934480 1969694 2008069 2050048 2095202 2142622 2191723
61016 2191723 2242809 2296830 2354718 2417331 2485972 2562442 2648345 2744574 2851598 2969950 3100538
61005 3100538 3245034 3406223 3588030 3795766 4037190 4323325 4667562 5084185 5588479
60996 5588479 6197695 6930264 7803781 8834525 10036928 11417334 12961986 14627838 16342051
60987 16342051 18005594 19497411 20689630 21485959 21870149 21926341 21805663 21657905 21574795
$$ packed form
61060H72506J1397J3100J4716J5897J7150J8994K1015K2569K3786K5135K6550
61049A082815K7876K9566L1912L4084L5080L5174L5320L5503L4925L3680L2816
61038A448751L2662L2410L1520L0477K9797K9273K8648K8208K8241K8568K9000
61027A777555K9666L0586L1428L2103L3142L5214L8375M1979M5154M7420M9101
61016B191723N1086N4021N7888O2613O8641P6470Q5903R6229J07024J18352J30588
61005C100538J44496J61189J81807K07736K41424K86135L44237M16623N04294
60996E588479O09216P32569Q73517J030744J202403J380406J544652J665852J714213
60987A6342051J663543J491817J192219P96329L84190N6192j20678j47758q3110
$$ plain form
60978 21574795 21572125 21598970 21551390 21291020 20684515 19659972 18245715 16559982 14759174
60969 14759174 12983526 11330264 9853176 8571823 7481286 6562762 5793609 5152400
60961 5152400 4618945 4174129 3801653 3488971 3225787 3002375 2809744 2640595 2489591
60952 2489591 2353224 2229750 2118497 2018579 1928343 1846073 1770676 1701389 1637240 1577120 1520052
60941 1520052 1465217 1411964 1360006 1309392 1260185 1212481 1166808 1124153 1085388 1050733 1019799
60930 1019799 991897 966379 942994 922008 903688 887658 873145 859881 848372 839122 831938 826241
60918 826241 821648 817961 814882 812204 810227 809583 810463 812220 813913 815141 816206 817476 818837 819863 820302
60903 820302 820077 818855 816008 811204 804859 797788 790517 783006 774920 766001 756296 746175 736167 726660
$$ packed form
60978B1574795k670K6845m7580k60370o06505j024543j414257j685733j800808
60969A4759174j775648j653262j477088j281353j090537r18524p69153o41209
60961E152400n33455m44816l72476l12682k63184k23412j92631j69149j51004
60952B489591j36367j23474j11253r9918r0236q2270p5397o9287o4149o0120n7068
60941A520052n4835n3253n1958n0614m9207m7704m5673m2655l8765l4655l0934
60930A019799k7902k5518k3385k0986j8320j6030j4513j3264j1509r250p184n697
60918H26241m593l687l079k678j977o44Q80J757J693J228J065J270J361J026M39
60903H20302k25j222k847m804o345p071p271p511q086q919r705j0121j0008r507
$$ plain form
60889 726660 717772 709415 701386 693497 685784 678520 671786 665158 658169 650977 644226 638255 632943 628261
60875 628261 624368 621001 617382 613055 608341 603729 599347 595284 591833 589016 586430 584113 582988 583791
60861 583791 585981 588357 590466 592720 595406 598348 601433 604756 608175 611313 614057 616658 619352 622213
60847 622213 625278 628404 631232 633719 636490 639998 643511 645592 645584 643988 641342 637522 632397 626556 620869
60832 620869 615638 610585 605523 600748 596745 593638 591039 588547 586333 584893 584127 583130 581268 578989 577042
60817 577042 575207 572475 568395 563564 558822 554479 550355 546029 541040 535348 529601 524466 519796 515045
60803 515045 510410 506723 504161 501874 499239 496693 494847 493456 491876 490073 488502 487325 486408 485931 486314
60788 486314 487459 488606 489152 489244 489327 489412 489154 488584 488332 488908 490004 490861 491275 491809 492933 494376 495593 496489
$$ packed form
60889G26660q888q357q029p889p713p264o734o628o989p192o751n971n312m682
60875F28261l893l367l619m327m714m612m382m063l451k817k586k317j125Q03
60861E83791K190K376K109K254K686K942L085L323L419L138K744K601K694K861
60847F22213L065L126K828K487K771L508L513K081qj596k646l820n125n841n687
60832F20869n231n053n062m775m003l107k599k492k214j440p66r97j862k279j947
60817E77042j835k732m080m831m742m343m124m326m989n692n747n135m670m751
60803E15045m635l687k562k287k635k546j846j391j580j803j571j177r17m77L83
60788D86314J145J147N46R2Q3Q5k58n70k52N76J096Q57M14N34J124J443J217Q96
$$ plain form
60770 496489 497283 497992 498527 499118 500109 501422 502741 504147 506021 508257 510165 511314 512028 512803 513670 514381
60754 514381 514910 515388 515747 515733 515250 514511 513823 513279 512653 511677 510471 509519 509034 508471 506923 503885 499429 493829
60736 493829 487436 480839 474696 469334 464751 460947 457889 455245 452621 450140 448356 447456 446917 446133 445124
60721 445124 444477 444743 445923 447345 448109 447981 447792 448603 450471 452400 453586 454284 455308 457045 459163 461051
60705 461051 462286 462862 463170 463715 464835 466661 469144 471941 474496 476550 478466 480712 483157 485223 486655
60690 486655 487744 488883 490268 491910 493504 494384 494125 493130 492160 491402 490606 490008 490261 491313 492143 491958 491033
60673 491033 489999 488948 487710 486515 485748 485270 484449 482816 480402 477601 474863 472369 469902 467232 464651
60658 464651 462792 461868 461535 461604 462388 464126 466514 469084 471625 473922 475558 476424 477114 478299 479831 480842
$$ packed form
60770D96489P94P09N35N91R91J313J319J406J874K236J908J149P14P75Q67P11
60754E14381N29M78L59j4m83p39o88n44o26r76j206r52m85n63j548l038m456n600
60736D93829o393o597o143n362m583l804l058k644k624k481j784r00n39p84j009
60721D45124o47K66J180J422P64j28j89Q11J868J929J186O98J024J737K118J888
60705D61051J235N76L08N45J120J826K483K797K555K054J916K246K445K066J432
60690D86655J089J139J385J642J594Q80k59r95r70p58p96n98K53J052Q30j85r25
60673D91033j034j051j238j195p67m78q21j633k414k801k738k494k467k670k581
60658D64651j859r24l33O9P84J738K388K570K541K297J636Q66O90J185J532J011
$$ plain form
60642 480842 480589 478956 476302 473215 470360 468223 466874 466031 465330 464527 463572 462544 461487 460441 459747 460047
60626 460047 461557 463508 464845 465467 466200 467486 468747 469254 469011 468476 467943 467571 467524 467635 467332 466351 465226
60609 465226 464685 464835 465262 465644 465873 465845 465518 465011 464407 463657 462869 462379 462286 462304 462310 462622 463438 464451 465495 467068
60589 467068 469672 472954 476145 479105 482279 485725 488822 491044 492507 493665 494881 496413 498465 501029
60575 501029 503811 506391 508470 510101 511797 514280 517965 522800 528654 535573 543500 552135 561407 571814
60561 571814 583892 597442 611470 624703 635970 644492 650182 653535 654895 654073 651021 646533 641788
60548 641788 637375 633239 629422 626350 624454 623955 624993 627505 631063 635307 640617 647935 657823 670095
60534 670095 684406 700753 719128 738988 759304 778979 797022 812537 824799 833374 838055 838700
$$ packed form
60642D80842k53j633k654l087k855k137j349q43p01q03r55j028j057j046o94L00
60626D60047J510J951J337O22P33J286J261N07k43n35n33l72m7J11l03r81j125
60609D65226n41J50M27L82K29k8l27n07o04p50p88m90r3J8OL12Q16J013J044J573
60589D67068K604L282L191K960L174L446L097K222J463J158J216J532K052K564
60575E01029K782K580K079J631J696K483L685M835N854O919P927Q635R272J0407
60561E71814J2078J3550J4028J3233J1267Q522N690L353J360q22l052m488m745
60548F41788m413m136l817l072j896m99J038K512L558M244N310P318R888J2272
60534F70095J4311J6347J8375J9860K0316J9675J8043J5515J2262Q575M681O45
$$ plain form
60522 838700 835299 828306 818865 808473 798174 788122 778082 768258 759284 751504 744719 738829 734245
60509 734245 731346 729899 729465 730118 732356 736423 742184 749691 759469 772146 787977 806876 828819 854171
60495 854171 883547 917350 955542 997917 1044277 1093901 1145020 1195391 1243407 1288041 1327621
60484 1327621 1359517 1381456 1392622 1393030 1382487 1360828 1328725 1287665 1239456 1186323 1130955 1075608
60472 1075608 1021272 968352 917967 871821 830906 795030 763571 735972 711499 689351 669327
60461 669327 651898 637403 625447 615088 605250 595070 584467 574420 566132 559809 554692 550201
60449 550201 546391 543231 540211 536931 533470 529873 525964 522044 519125 517854 517603 517219 516358 515473 514747
60434 514747 513722 512004 509765 507417 505193 503200 501555 500313 499481 499216 499748 500935 502115 502683 502700 502717
$$ packed form
60522H38700l401o993r441j0392j0299j0052j0040r824q974p780o785n890m584
60509G34245k899j447m34O53K238M067N761P507R778J2677J5831J8899K1943K5352
60495H54171K9376L3803L8192M2375M6360M9624N1119N0371M8016M4634L9580
60484A327621L1896K1939J1166M08j0543k1659l2103m1060m8209n3133n5368n5347
60472A075608n4336n2920n0385m6146m0915l5876l1459k7599k4473k2148k0024
60461F69327j7429j4495j1956j0359r838j0180j0603j0047q288o323n117m491
60449E50201l810l160l020l280l461l597l909l920k919j271k51l84q61q85p26
60434E14747j025j718k239k348k224j993j645j242q32k65N32J187J180N68J7J7
$$ plain form
60418 502717 503052 503591 504381 506001 508947 512793 516334 518681 519903 520574 521054 521427 521831 522444 523220 523952 524641
60401 524641 525574 527014 528928 531102 533448 536109 539211 542513 545418 547458 548749 549805 551005 552400
60387 552400 553961 555704 557590 559613 561937 564585 567059 568768 569902 571352 573611 576294 578992 581948
60373 581948 585463 589180 592521 595436 598139 600405 601716 601992 601740 601625 602232 603903 606351 608730 610581
60358 610581 612448 615060 618243 621303 624245 627889 632810 638813 645457 652499 659763 667131 674724 682570
60344 682570 690018 695969 699843 701964 702923 702875 701492 698332 693343 687226 681144 675692 670397 664617 658537
60329 658537 652744 647255 641856 637106 633969 632368 631119 629458 627776 626599 625753 625009 624728 625349 626857
60314 626857 629265 632966 638101 644147 650770 658587 668418 680179 693227 707509 723652 741986 762176
$$ packed form
60418E02717L35N39P90J620K946L846L541K347J222O71M80L73M04O13P76P32O89
60401E24641R33J440J914K174K346K661L102L302K905K040J291J056J200J395
60387E52400J561J743J886K023K324K648K474J709J134J450K259K683K698K956
60373E81948L515L717L341K915K703K266J311K76k52j15O07J671K448K379J851
60358F10581J867K612L183L060K942L644M921O003O644P042P264P368P593P846
60344F82570P448N951L874K121R59m8j383l160m989o117o082n452n295n780o080
60329F58537n793n489n399m750l137j601j249j661j682j177q46p44k81O21J508
60314F26857K408L701N135O046O623P817R831J1761J3048J4282J6143J8334K0190
$$ plain form
60301 762176 783812 806740 830498 853822 874938 892216 904500 911065 911602 906311 895842 880941
60289 880941 862113 839794 814975 789410 764973 742910 723813 707929 694975 683912 673673
60278 673673 664260 656530 650767 646011 641025 635428 629594 623950 618802 614404 610738 607456 604450 602242
60264 602242 601386 601604 601954 601795 601301 601034 601266 601781 602163 602169 601843 601320 600635 599883 599399 599475 599864 599920 599298 598338
60244 598338 597665 597629 598141 598756 598934 598567 598294 598931 600506 602303 603968 606036 609091 612854 616548 619898
60228 619898 623369 627500 632365 637591 642728 647643 652670 658256 664376 670535 676430 682295 688436 694777
60214 694777 701128 707593 714360 721299 728142 734884 741627 748114 753827 758583 762687 766433 769751 772474
60200 772474 774714 776723 778469 779586 779763 778998 777389 774855 771304 766968 762267 757326 751975 746329 740961
$$ packed form
60301G62176K1636K2928K3758K3324K1116J7278J2284O565N37n291j0469j4901
60289H80941j8828k2319k4819k5565k4437k2063j9097j5884j2954j1063j0239
60278F73673r413p730n763m756m986n597n834n644n148m398l666l282l006k208
60264F02242q56K18L50j59m94k67K32N15L82Ol26n23o85p52m84P6L89N6o22r60
60244E98338o73l6N12O15J78l67k73O37J575J797J665K068L055L763L694L350
60228F19898L471M131M865N226N137M915N027N586O120O159N895N865O141O341
60214F94777O351O465O767O939O843O742O743O487N713M756M104L746L318K723
60200G72474K240K009J746J117J77p65j609k534l551m336m701m941n351n646n368
$$ plain form
60185 740961 736280 732068 727967 724061 720537 717036 712936 708265 703883 700778 699473 699973 701793 704084
60171 704084 706142 707830 709270 710425 711434 713063 716007 719792 723049 724992 726007 726767 727546 728553 730143
60156 730143 732313 734536 736443 738195 739985 741754 743689 746357 749941 753833 757428 760842 764506 768555
60142 768555 773066 778428 784917 792179 799587 806873 814062 821142 828202 835629 843697 852116 860193 867230
60128 867230 872587 875804 877030 877035 876439 875170 872957 870017 866920 864081 861693 859886 858589 857489 856387
60113 856387 855345 854289 852845 850746 847975 844272 839105 832596 825964 820427 815935 811491 806505 801379
60099 801379 797017 794175 793064 793145 793476 793594 793874 794786 796220 797901 800032 803005 806721 810731 814863 819267
60083 819267 823998 828821 833260 836591 838188 838167 837238 835569 832306 826665 818944 809891 799673 788229
$$ packed form
60185G40961m681m212m101l906l524l501m100m671m382l105j305N00J820K291
60171G04084K058J688J440J155J009J629K944L785L257J943J015P60P79J007J590
60156G30143K170K223J907J752J790J769J935K668L584L892L595L414L664M049
60142G68555M511N362O489P262P408P286P189P080P060P427Q068Q419Q077P037
60128H67230N357L217J226Nn96j269k213k940l097k839k388j807j297j100j102
60113H56387j042j056j444k099k771l703n167o509o632n537m492m444m986n126
60099H01379m362k842j111Q1L31J18K80R12J434J681K131K973L716M010M132M404
60083H19267M731M823M439L331J597k1r29j669l263n641p721r053j0218j1444
$$ plain form
60069 788229 776225 764747 754249 744520 735514 727469 720375 714093 708797 704559 700652 696126 691100
60056 691100 686663 683421 680939 678745 677115 676532 677089 678775 681790 686113 691080 695827 700012 703928 707996
60041 707996 712242 716110 718830 720068 720111 719248 717282 713996 709792 705292 700537 695165 689270 683397 677654
60026 677654 671508 664677 657663 651172 645361 639853 634148 627912 621193 614512 608451 603137 598339 594013
60012 594013 590333 587165 583995 580539 577136 574452 573027 573065 574293 575967 577305 577932 577821 577087 576271 576470
59996 576470 578469 581767 585123 588120 591535 596013 601129 606084 610639 614789 617977 619367 618851 617189
59982 617189 615085 612574 609548 606530 604417 603382 602458 600605 597939 595492 593885 592873 592217 592252 593265
59967 593265 594969 597064 599750 603180 607007 611036 615681 621030 626101 629994 633271 636983 640712 642891
$$ packed form
60069G88229j2004j1478j0498r729r006q045p094o282n296m238l907m526n026
60056F91100m437l242k482k194j630n83N57J686L015M323M967M747M185L916M068
60041G07996M246L868K720J238M3q63j966l286m204m500m755n372n895n873n743
60026F77654o146o831p014o491n811n508n705o236o719o681o061n314m798m326
60012E94013l680l168l170l456l403k684j425L8J228J674J338O27j11p34q16J99
59996E76470J999L298L356K997L415M478N116M955M555M150L188J390n16j662
59982F17189k104k511l026l018k113j035r24j853k666k447j607j012o56L5J013
59967E93265J704K095K686L430L827M029M645N349N071L893L277L712L729K179
$$ plain form
59953 642891 643025 642230 641386 640043 637597 634400 631067 627611 623932 620346 616984 613384 609341 605543 602639
59938 602639 600267 597756 595346 593891 593674 594296 595575 597727 600645 603682 606465 609490 613630 619229 625842
59923 625842 632792 639808 647042 654499 661652 667763 672417 675576 677440 678664 680453 683768 688474 693780
59909 693780 699460 705906 712943 719435 724480 728294 731546 734370 736512 737965 738920 739419 739544 739734 740525
59894 740525 742111 744333 746874 749364 751709 754407 758038 762314 766273 769671 773468 778471 784206 789675
59880 789675 794599 799238 803611 807715 812046 816930 821584 824713 825908 825635 824044 820801 816126 811013
59866 811013 806094 801047 795442 789487 783629 778091 773187 769417 766680 763884 760038 755488 751513 748938
59852 748938 747691 747557 748610 750741 753402 756186 759375 763608 769210 776072 783912 792310 800652 808467
$$ packed form
59953F42891J34p95q44j343k446l197l333l456l679l586l362l600m043l798k904
59938F02639k372k511k410j455k17O22J279K152K918L037K783L025M140N599O613
59923F25842O950P016P234P457P153O111M654L159J864J224J789L315M706N306
59909F93780N680O446P037O492N045L814L252K824K142J453R55M99J25J90P91
59894G40525J586K222K541K490K345K698L631M276L959L398L797N003N735N469
59880G89675M924M639M373M104M331M884M654L129J195k73j591l243m675n113
59866H11013m919n047n605n955n858n538m904l770k737k796l846m550l975k575
59852G48938j247j34J053K131K661K784L189M233N602O862P840Q398Q342P815
$$ plain form
59838 808467 815793 822874 829466 834813 838411 840465 841552 842278 843451 846048 850355 855248 858778 859424 856607
59823 856607 850328 840976 829576 817591 806153 795604 785836 776782 768488 760901 753800 746871 739941
59810 739941 733253 727396 722755 719182 716402 714480 713542 713266 713134 713021 713021 712846 712022 710607 709078 707493
59794 707493 705416 702754 699994 697455 694954 692373 689877 687378 684520 681515 679231 677967 676793 674608
59780 674608 671377 667855 664741 662607 661939 662477 662968 662469 661570 661665 663297 665968 669257 673243 677940 683124
59764 683124 688794 695073 701664 708076 714428 721320 728845 736470 744035 752075 760834 769639 777803 785592
59750 785592 793808 802767 812208 821835 831318 839945 846936 852206 856309 859457 861030 860349 857604 853697
59736 853697 849312 844561 839519 834641 830392 826717 823157 819405 815470 811404 807165 802827 798664 794942
$$ packed form
59838H08467P326P081O592N347L598K054J087P26J173K597M307M893L530O46k817
59823H56607o279r352j1400j1985j1438j0549r768r054q294p587p101o929o930
59810G39941o688n857m641l573k780j922r38k76j32j13%j75q24j415j529j585
59794G07493k077k662k760k539k501k581k496k499k858l005k284j264j174k185
59780F74608l231l522l114k134o68N38M91m99q99R5J632K671L289L986M697N184
59764F83124N670O279O591O412O352O892P525P625P565Q040Q759Q805Q164P789
59750G85592Q216Q959R441R627R483Q627O991N270M103L148J573o81k745l907
59736H53697m385m751n042m878m249l675l560l752l935m066m239m338m163l722
$$ plain form
59722 794942 791735 788999 786636 784477 782389 780426 778712 777156 775466 773530 771641 770326 770073 771154
59708 771154 773457 776475 779655 782746 785662 788210 790282 792199 794361 796562 798136 798836 799101 799388 799788
59693 799788 800436 801629 803203 804340 804396 803546 802295 800826 799262 798039 797340 796473 794466 791187 787347 783470
59677 783470 779381 774684 769248 763144 756466 749451 742564 736339 731075 726635 722553 718595 715233 713258
59663 713258 712819 713188 713665 714315 715525 717300 719440 722046 725291 728869 732174 734907 737097 738671 739470
59648 739470 739624 739411 738768 737273 734676 731119 726914 722396 717895 713548 709215 704863 700903 697782 695429
59633 695429 693555 692318 692047 692273 691717 689609 686528 683518 680644 676946 671760 665631 659738 654769 650679
59618 650679 647342 644886 643196 641646 639853 638431 638385 639859 642069 644489 647361 650874 654600 658154 661795
$$ packed form
59722G94942l207k736k363k159k088j963j714j556j690j936j889j315k53J081
59708G71154K303L018L180L091K916K548K072J917K162K201J574P00K65K87M00
59693G99788O48J193J574J137N6q50j251j469j564j223o99q67k007l279l840l877
59677G83470m089m697n436o104o678p015o887o225n264m440m082l958l362j975
59663G13258m39L69M77O50J210J775K140K606L245L578L305K733K190J574P99
59648G39470J54k13o43j495k597l557m205m518m501m347m333m352l960l121k353
59633F95429j874j237k71K26n56k108l081l010k874l698n186o129n893m969m090
59618F50679l337k456j690j550j793j422m6J474K210K420K872L513L726L554L641
$$ plain form
59603 661795 665811 669809 673128 675584 677365 678578 679414 680342 681577 682692 683302 683779 684659 685696 686191 685966
59587 685966 685258 683882 681414 678156 675126 672978 671557 670534 669773 668984 667715 665869 663704 661264 658438
59572 658438 655678 653948 653602 653905 654012 653945 654229 654994 655863 656483 656838 657154 657681 658442 659175 659637 659904 660144
59554 660144 660289 660360 660942 662696 665381 668013 670172 672541 675952 680533 686138 693019 701588 711892 723748
59539 723748 737101 751914 768066 785613 804658 824351 842286 855596 862878 864899 863691 861277
59527 861277 859091 857961 858232 859854 862362 864833 866113 865350 862286 857057 849889 841048 830840 819491
59513 819491 807226 794546 782158 770422 759161 748225 738014 729139 721776 715636 710388 705807
59501 705807 701680 697959 694950 693004 692004 691403 690703 689727 688576 687639 687521 688501 690096 691566 692862 694593
$$ packed form
59603F61795M016L998L319K456J781J213Q36R28J235J115O10M77Q80J037M95k25
59587F85966p08j376k468l258l030k148j421j023p61p89j269j846k165k440k826
59572F58438k760j730l46L03J07o7K84P65Q69O20L55L16N27P61P33M62K67K40
59554F60144J45P1N82J754K685K632K159K369L411M581N605O881Q569J0304J1856
59539G23748J3353J4813J6152J7547J9045J9693J7935J3310P282K021j208k414
59527H61277k186j130K71J622K508K471J280p63l064n229p168q841j0208j1349
59513H19491j2265j2680j2388j1736j1261j0936j0211q875p363o140n248m581
59501G05807m127l721l009j946j000o01p00r76j151r37j18R80J595J470J296J731
$$ plain form
59485 694593 696988 699474 701571 703660 706418 709904 713741 717887 722541 727476 732193 736806 742050 748167
59471 748167 754386 759791 764174 767711 770404 772356 774138 776276 778710 781341 784702 789414 795282 801724
59457 801724 808922 817560 827427 837250 846104 854096 861364 867316 871373 873666 874388 873111 869436 863769
59443 863769 856697 848107 837756 826424 815616 806109 797496 789216 781467 775056 770747 768856 769136 771093
59429 771093 774642 780264 788220 797912 808507 819993 833053 848022 864519 882079 900516 919595
59417 919595 938866 958012 976923 995273 1012360 1027523 1040413 1050602 1057156 1058838 1054787 1045083
59405 1045083 1030897 1014249 997582 983344 973574 969337 970358 975302 982365 989362 993543 992266 984464
59392 984464 971179 954435 935982 917257 899715 884493 871960 862070 854709 849313 844752 840288
$$ packed form
59485F94593K395K486K097K089K758L486L837M146M654M935M717M613N244O117
59471G48167O219N405M383L537K693J952J782K138K434K631L361M712N868O442
59457H01724P198Q638R867R823Q854P992P268N952M057K293P22j277l675n667
59443H63769p072q590j0351j1332j0808r507q613q280p749o411m309j891K80J957
59429G71093L549N622P956R692J0595J1486J3060J4969J6497J7560J8437J9079
59417I19595J9271J9146J8911J8350J7087J5163J2890J0189O554J682m051r704
59405A045083j4186j6648j6667j4238r770m237J021M944P063O997M181j277p802
59392I84464j3285j6744j8453j8725j7542j5222j2533r890p361n396m561m464
$$ plain form
59380 840288 836175 832732 829396 825566 821871 819536 818715 818423 817970 817446 816931 816377 816327 817691 820510 823848
59364 823848 827197 831146 836426 843168 851527 862117 875219 890083 905626 921504 938156 956164
59352 956164 975806 996859 1018539 1040030 1061197 1082360 1103264 1122795 1139895 1154209 1165606
59341 1165606 1173628 1177767 1177792 1173525 1164750 1151696 1135209 1116191 1095186 1072704 1049445 1025949 1002499
59328 1002499 979637 958299 939010 921351 904622 888806 874526 862289 852041 843249 835149 827113
59316 827113 819001 811050 803384 795853 788418 781418 775334 770481 766898 764247 761897 759417 757026 755236
59302 755236 754220 753892 754401 755987 758527 761928 766841 774229 784162 795767 808352 821716 835145 846956
59288 846956 855396 859404 858467 852828 844273 835769 829480 825594 823465 823217 825603 830952 838992 849405
$$ packed form
59380H40288m113l443l336l830l695k335q21k92m53n24n15n54n0J364K819L338
59364H23848L349L949N280O742Q359J0590J3102J4864J5543J5878J6652J8008
59352I56164J9642K1053K1680K1491K1167K1163K0904J9531J7100J4314J1397
59341A165606Q022M139K5m267q775j3054j6487j9018k1005k2482k3259k3496k3450
59328A002499k2862k1338j9289j7659j6729j5816j4280j2237j0248q792q100q036
59316H27113q112p951p666p531p435p000o084m853l583k651k350k480k391j790
59302G55236j016l28N09J586K540L401M913P388R933J1605J2585J3364J3429J1811
59288H46956Q440M008r37n639q555q504o289l886k129k48K386N349Q040J0413
$$ plain form
59274 849405 861936 876109 891251 906528 920889 933444 944186 953712 961993 968081 971432 972761
59262 972761 972964 971864 968674 963178 955802 947004 937315 927579 918454 909961 902107 895512 890792 887694
59248 887694 885557 884307 884294 885497 887679 891152 896557 903876 912310 921045 929570 937349 943897 949213 953524
59233 953524 956488 957096 954489 948513 939609 928498 915918 902140 886778 869541 851180 833279 817042
59220 817042 802650 789772 778186 767790 758439 750112 743071 737618 733715 730858 728335 725676 722963
59207 722963 720631 718967 717906 717303 717184 717653 718776 720622 723176 726141 729139 732158 735458 738994 742321
59192 742321 745248 748159 751433 755014 758711 762525 766365 769893 772965 775851 778751 781510 784111 786904
59178 786904 789963 792731 794828 796848 799783 803994 809215 815269 822149 829550 836876 843708 849919 855443
$$ packed form
59274H49405J2531J4173J5142J5277J4361J2555J0742R526Q281O088L351J329
59262I72761K03j100l190n496p376q798r689r736r125q493p854o595m720l098
59248H87694k137j250j3J203K182L473N405P319Q434Q735Q525P779O548N316M311
59233I53524K964O08k607n976q904j1111j2580j3778j5362j7237j8361j7901j6237
59220H17042j4392j2878j1586j0396r351q327p041n453l903k857k523k659k713
59207G22963k332j664j061o03j19M69J123J846K554K965K998L019L300L536L327
59192G42321K927K911L274L581L697L814L840L528L072K886K900K759K601K793
59178G86904L059K768K097K020K935M211N221O054O880P401P326O832O211N524
$$ plain form
59164 855443 860186 863998 866457 866949 865178 861286 855273 846757 835783 823444 811155 799514 788333
59151 788333 777491 767200 757568 748442 739694 731402 723807 717216 711659 706476 700716 694274 688242 683733
59137 683733 680768 678701 677227 676363 675886 675561 675714 676898 679016 681412 683764 686416 689826 694205 699700
59122 699700 706469 714408 723094 732138 741523 751659 763170 776461 791382 807393 823996 840658
59110 840658 856501 870709 883389 895367 906897 917246 925796 932773 938429 942330 944125 944344 943630
59097 943630 941741 938168 933371 928559 924453 921007 918095 915704 913575 911295 908749 906015 902977 899462
59083 899462 895511 891012 885334 877838 868587 858178 847212 836314 826218 817250 809047 801264 794167
59070 794167 788074 782738 777932 774100 771641 769921 767832 765064 762172 759630 757480 755605 753709 751328
$$ packed form
59164H55443M743L812K459M92j771l892o013q516j0974j2339j2289j1641j1181
59151G88333j0842j0291r632r126q748q292p595o591n557n183n760o442o032m509
59137F83733k965k067j474q64m77l25J53J184K118K396K352K652L410M379N495
59122F99700O769P939Q686R044R385J0136J1511J3291J4921J6011J6603J6662
59110H40658J5843J4208J2680J1978J1530J0349Q550O977N656L901J795K19p14
59097I43630j889l573m797m812m106l446k912k391k129k280k546k734l038l515
59083H99462l951m499n678p496r251j0409j0966j0898j0096q968q203p783p097
59070G94167o093n336m806l832k459j720k089k768k892k542k150j875j896k381
$$ plain form
59056 751328 748482 745933 744099 742217 739389 736074 733676 732876 733162 733636 733519 732224 729911 727726 726653
59041 726653 726354 725903 725249 725037 725475 726548 728993 733728 740376 747599 754984 763513 774033 786378 800148
59026 800148 815275 831557 848532 866076 884162 901704 916559 927130 933470 936592 937301 935905
59014 935905 932433 926910 919792 912195 905261 899365 894433 890764 888955 889295 891886 897031 904705 913906
59000 913906 923396 932777 942012 950376 957090 962682 968329 973929 978121 980215 980685 979616 976102 969650
58986 969650 961002 951131 940566 930087 920922 913676 908010 903813 901695 901873 903583 906173 909878 915036
58972 915036 921373 928635 937047 946562 956478 966385 976796 988281 1000598 1013148 1025615 1037634 1048474
58959 1048474 1057477 1064254 1068118 1068008 1063436 1054900 1043054 1028175 1010767 991921 972575 953053 933776
$$ packed form
59056G51328k846k549j834j882k828l315k398q00K86M74j17j295k313k185j073
59041G26653k99m51o54k12M38J073K445M735O648P223P385Q529J0520J2345J3770
59026H00148J5127J6282J6975J7544J8086J7542J4855J0571O340L122P09j396
59014I35905l472n523p118p597o934n896m932l669j809L40K591N145P674R201
59000I13906R490R381R235Q364O714N592N647N600M192K094M70j069l514o452
58986I69650q648r871j0565j0479r165p246n666m197k118J78J710K590L705N158
58972I15036O337P262Q412R515R916R907J0411J1485J2317J2550J2467J2019J0840
58959A048474R003O777L864j10m572q536j1846j4879j7408j8846j9346j9522j9277
$$ plain form
58946 933776 915742 899852 886275 874842 865498 858048 852125 847776 845415 844840 844876 844361 842962 840785
58932 840785 837876 834418 830742 826803 822185 816854 811310 805881 800572 795717 791904 789054 786420 783770
58918 783770 781700 780579 780150 780472 782195 785490 789647 794203 799550 805987 813148 820778 829135 838161 847409
58903 847409 857316 869373 884238 900729 917528 934844 953434 973007 992843 1013403 1036090 1061661
58891 1061661 1089764 1119763 1151259 1183951 1217480 1251142 1283399 1312129 1335794 1354020 1366858
58880 1366858 1374144 1375834 1372182 1363184 1348554 1328618 1304498 1277185 1247432 1216842 1187847 1161915
58868 1161915 1138748 1117801 1099453 1083880 1070002 1056559 1043320 1030272 1016620 1001743 986363
58857 986363 971660 957854 944574 931862 919856 908254 897116 887423 879650 872390 863561 852493
$$ packed form
58946I33776j8034j5890j3577j1433r344p450n923m349k361n75L6n15j399k177
58932H40785k909l458l676l939m618n331n544n429n309m855l813k850k634k650
58918G83770k070j121m29L22J723L295M157M556N347O437P161P630Q357R026R248
58903H47409R907J2057J4865J6491J6799J7316J8590J9573J9836K0560K2687K5571
58891A061661K8103K9999L1496L2692L3529L3662L2257K8730K3665J8226J2838
58880A366858P286J690l652q998j4630j9936k4120k7313k9753l0590k8995k5932
58868A161915k3167k0947j8348j5573j3878j3443j3239j3048j3652j4877j5380
58857I86363j4703j3806j3280j2712j2006j1602j1138r693p773p260q829j1068
$$ plain form
58845 852493 839841 826142 811642 797033 783105 769919 757275 745585 735365 726408 718441 712022
58833 712022 707668 704625 701676 698686 696232 694191 692114 690581 690724 692417 694224 695253 696008 697345 699522
58818 699522 702269 704967 706856 707872 709062 711263 713670 714695 714071 713065 712797 713364 714484 715905 717147
58803 717147 717875 718577 719993 721847 723016 722912 721810 719876 716932 713279 709831 707218 705464 704623 704951
58788 704951 706415 708822 712511 718168 725786 734480 743408 752327 761240 770175 779290 788594 797570 805620
58774 805620 812669 818676 822798 823930 822032 818113 812896 806343 798593 790531 783196 777217 772930 770491
58760 770491 769671 770023 771289 773298 775575 777568 779113 780169 780293 779065 776923 774912 773649 773094 773282
58745 773282 774590 777204 780905 785464 790869 797132 804203 812038 820553 829675 839673 851027 863703 876953
$$ packed form
58845H52493j2652j3699j4500j4609j3928j3186j2644j1690j0220q957p967o419
58833G12022m354l043k949k990k454k041k077j533J43J693J807J029P55J337K177
58818F99522K747K698J889J016J190K201K407J025o24j006k68N67J120J421J242
58803G17147P28P02J416J854J169j04j102j934k944l653l448k613j754q41L28
58788G04951J464K407L689N657P618Q694Q928Q919Q913Q935R115R304Q976Q050
58774H05620P049O007M122J132j898l919n217o553p750q062p335n979m287k439
58760G70491q20L52J266K009K277J993J545J056J24j228k142k011j263n55J88
58745G73282J308K614L701M559N405O263P071P835Q515R122R998J1354J2676J3250
$$ plain form
58731 876953 890169 903392 916611 929248 940907 951923 962427 971563 978598 984316 990332 997368
58719 997368 1005014 1012775 1020344 1027200 1032885 1037582 1041555 1044233 1044599 1042245 1037296 1029691 1019304 1006433
58705 1006433 991366 973852 953784 931877 908829 884385 858339 831878 806712 783336 761468
58694 761468 741774 725578 712881 702150 692230 683267 675583 668868 662825 657610 653306 649704 646758
58681 646758 644564 642903 641538 640834 641356 643034 645551 649247 654768 662124 671137 682471 697041 714647
58667 714647 734379 756125 780247 805804 830415 852045 869703 882425 888995 888998 883023 871683 855632
58654 855632 836664 817399 799401 782610 766863 752806 740951 730995 722587 715891 711037 707897
58642 707897 706583 707163 708697 709667 709767 710204 711814 713857 715173 715590 715583 715303 714536 713174 711366 709609 708746
$$ packed form
58731H76953J3216J3223J3219J2637J1659J1016J0504R136P035N718O016P036
58719I97368P646P761P569O856N685M697L973K678L66k354m949p605j0387j2871
58705A006433j5067j7514k0068k1907k3048k4444k6046k6461k5166k3376k1868
58694G61468j9694j6196j2697j0731r920q963p684o715o043n215m304l602k946
58681F46758k194j661j365p04N22J678K517L696N521P356R013J1334J4570J7606
58667G14647J9732K1746K4122K5557K4611K1630J7658J2722O570Ln975j1340j6051
58654H55632j8968j9265j7998j6791j5747j4057j1855r956q408o696m854l140
58642G07897j314N80J534R70J00M37J610K043J316M17pk80p67j362j808j757q63
$$ plain form
58625 708746 709317 710886 712600 714385 716967 720901 726328 733410 742023 751202 759924 768348 777153 785755
58611 785755 792371 795870 796468 794627 790591 785177 779671 774543 769250 763492 757670 752045 746578 741706
58597 741706 738066 735315 732449 729491 727697 727937 730172 734620 741995 752218 764275 777723 793008
58584 793008 809854 826754 842617 857578 871652 883977 894135 902965 911248 918732 925350 932353
58572 932353 941346 952986 967361 984844 1005816 1030267 1058254 1090053 1125258 1162307 1199285 1234573
58560 1234573 1266518 1293416 1314325 1329246 1338270 1341351 1339056 1332634 1323131 1311310 1298462 1286105
58548 1286105 1274541 1262753 1249901 1235815 1219956 1201440 1180549 1158857 1137221 1114861 1091045
58537 1091045 1066550 1042791 1020585 1000419 982916 968297 956153 946286 938985 934190 931277 929944
$$ packed form
58625G08746N71J569J714J785K582L934N427P082Q613R179Q722Q424Q805Q602
58611G85755O616L499N98j841m036n414n506n128n293n758n822n625n467m872
58597G41706l640k751k866k958j794K40K235M448P375J0223J2057J3448J5285
58584G93008J6846J6900J5863J4961J4074J2325J0158Q830Q283P484O618P003
58572I32353Q993J1640J4375J7483K0972K4451K7987L1799L5205L7049L6978L5288
58560A234573L1945K6898K0909J4921R024L081k295o422r503j1821j2848j2357
58548A286105j1564j1788j2852j4086j5859j8516k0891k1692k1636k2360k3816
58537A091045k4495k3759k2206k0166j7503j4619j2144r867p301m795k913j333
$$ plain form
58525 929944 930353 932158 934475 937004 940022 943094 945079 945689 945687 945225 943411 939943 935717 931305 926227 920238
58509 920238 913921 907469 900347 892759 885967 880488 875438 870330 865957 862695 859473 855381 850952 846942
58495 846942 843178 839524 836699 835211 834753 835537 838878 845468 854240 863936 874681 887176 901529 917749
58481 917749 936151 956317 976682 995878 1013391 1028303 1038875 1044168 1044781 1041246 1033180 1020877
58469 1020877 1006191 990829 975207 959981 947063 937824 931651 927516 925756 927177 931651 938778 948672
58456 948672 960904 973806 985940 997158 1007271 1015009 1019352 1020597 1019047 1013970 1005086 993828 982006
58443 982006 970423 959739 951271 945677 942084 939652 938784 939794 941768 943882 946589 950469 955281 961073
58429 961073 968712 978245 988278 998010 1008192 1019056 1029066 1036888 1042719 1046461 1046587 1042383 1035394
$$ packed form
58525I29944M09J805K317K529L018L072J985O10km62j814l468m226m412n078n989
58509I20238o317o452p122p588o792n479n050n108m373l262l222m092m429m010
58495H46942l764l654k825j488m58P84L341O590Q772R696J0745J2495J4353J6220
58481I17749J8402K0166K0365J9196J7513J4912J0572N293O13l535q066j2303
58469A020877j4686j5362j5622j5226j2918r239o173m135j760J421M474P127R894
58456I48672J2232J2902J2134J1218J0113P738M343J245j550n077q884j1258j1822
58443I82006j1583j0684q468n594l593k432q68J010J974K114K707L880M812N792
58429I61073P639R533J0033R732J0182J0864J0010P822N831L742J26m204o989
$$ plain form
58416 1035394 1027124 1017156 1005117 992475 980545 968571 955676 942888 931316 920193 908811 898622
58404 898622 891263 886146 882181 880163 881122 883877 886663 889856 894682 900537 905884 910549 914827 917641
58390 917641 918018 917198 916835 916165 913345 908543 903323 897983 891989 886235 882505 881365 882608 886879 894735
58375 894735 904926 915636 926552 937938 948899 958689 968570 980224 993360 1006839 1020928 1036337
58363 1036337 1052370 1068137 1084191 1100707 1115534 1126579 1134772 1142187 1148583 1152385 1153749 1153950 1152944
58350 1152944 1150350 1147797 1147630 1150094 1154141 1159823 1167585 1176588 1186252 1198075 1213342 1230631 1248219
58337 1248219 1267119 1288658 1310804 1330298 1346982 1362573 1376585 1387092 1394416 1400363 1404713 1406036
58325 1406036 1405238 1404761 1404996 1404800 1404847 1407132 1411754 1417357 1423971 1432387 1441787 1451141 1461829 1475604 1491156
$$ packed form
58416A035394q270r968j2039j2642j1930j1974j2895j2788j1572j1123j1382j0189
58404H98622p359n117l965k018R59K755K786L193M826N855N347M665M278K814
58390I17641L77q20l63o70k820m802n220n340n994n754l730j140J243M271P856
58375H94735J0191J0710J0916J1386J0961R790R881J1654J3136J3479J4089J5409
58363A036337J6033J5767J6054J6516J4827J1045Q193P415O396L802J364K01j006
58350A152944k594k553j67K464M047N682P762R003R664J1823J5267J7289J7588
58337A248219J8900K1539K2146J9494J6684J5591J4012J0507P324N947M350J323
58325A406036p98m77K35j96M7K285M622N603O614Q416R400R354J0688J3775J5552
$$ plain form
58310 1491156 1506052 1520720 1536954 1553918 1569586 1584889 1602361 1621672 1640471 1658627 1677628
58299 1677628 1696895 1714855 1732708 1752891 1774670 1795378 1815068 1835807 1857465 1878520 1899980
58288 1899980 1924057 1950021 1975794 2002390 2032170 2064008 2095111 2126246 2159999 2195217 2228761
58277 2228761 2261628 2297534 2336339 2374798 2413167 2455009 2500925 2548504 2598107 2652654 2711888
58266 2711888 2772850 2835740 2903239 2974331 3045055 3115052 3187029 3260099 3330326 3397711 3465941
58255 3465941 3535376 3603170 3670254 3741140 3816799 3894783 3976192 4065141 4161531 4261974 4367643
58244 4367643 4483111 4607665 4736347 4869600 5012913 5166661 5325691 5489637 5664067
58235 5664067 5850505 6045062 6248127 6465453 6698297 6942543 7198970 7474103 7769557
$$ packed form
58310A491156J4896J4668J6234J6964J5668J5303J7472J9311J8799J8156J9001
58299A677628J9267J7960J7853K0183K1779K0708J9690K0739K1658K1055K1460
58288A899980K4077K5964K5773K6596K9780L1838L1103L1135L3753L5218L3544
58277B228761L2867L5906L8805L8459L8369M1842M5916M7579M9603N4547N9234
58266B711888O0962O2890O7499P1092P0724O9997P1977P3070P0227O7385O8230
58255C465941O9435O7794O7084P0886P5659P7984Q1409Q8949R6390J00443J05669
58244D367643J15468J24554J28682J33253J43313J53748J59030J63946J74430
58235E664067J86438J94557K03065K17326K32844K44246K56427K75133K95454
$$ plain form
58226 7769557 8081300 8410834 8765885 9148570 9554699 9986471 10453476 10959490 11501506
58217 11501506 12084010 12720399 13417871 14175364 14999029 15904499 16901327 17992186 19191404
58208 19191404 20527346 22023362 23695765 25575538 27712730 30156266 32953992 36181372
58200 36181372 39950239 44389304 49651851 55959966 63617955 72974254 84399725 98306940
58192 98306940 115142191 135329559 159234764 187126058 218981039 254130480 290991021
58185 290991021 327071617 359132496 383408622 396189023 394991435 379812405 353418561
58178 353418561 320273549 284868245 250571972 219381035 192157596 168920962 149125006
58171 149125006 131982491 116769410 103001334 90465440 79147160 69097214 60315927
$$ packed form
58226G769557L11743L29534L55051L82685M06129M31772M67005N06014N42016
58217A1501506N82504O36389O97472P57493Q23665R05470R96828J090859J199218
58208A9191404J335942J496016J672403J879773K137192K443536K797726L227380
58200C6181372L768867M439065N262547O308115P657989R356299J1425471J3907215
58192I8306940J6835251K0187368K3905205K7891294L1854981L5149441L6860541
58185B90991021L6080596L2060879K4276126J2780401j197588j5179030k6393844
58178C53418561l3145012l5405304l4296273l1190937k7223439k3236634j9795956
58171A49125006j7142515j5213081j3768076j2535894j1318280j0049946q781287
$$ plain form
58164 60315927 52727151 46221021 40682156 35981323 31979850 28559595 25633284 23123441
58156 23123441 20952859 19061043 17409858 15965482 14690271 13556387 12550069 11655827
58148 11655827 10850381 10116866 9450774 8846529 8291156 7776160 7303155 6872441 6477208
58139 6477208 6113468 5784451 5490063 5222057 4974175 4747617 4542246 4351661 4171131
58130 4171131 4001717 3842821 3689193 3539107 3397225 3265698 3140315 3018814 2905035
58121 2905035 2801275 2704176 2611655 2526468 2449408 2376242 2304928 2238872 2179621 2123209 2067173
58110 2067173 2014411 1966517 1919880 1872100 1825985 1783504 1741819 1698956 1657479 1618895 1580155
58099 1580155 1539469 1500058 1464357 1429770 1394017 1359602 1329119 1300976 1273553 1248983 1228895
$$ packed form
58164F0315927p588776o506130n538865m700833m001473l420255k926311k509843
58156B3123441k170582j891816j651185j444376j275211j133884j006318q94242
58148A1655827q05446p33515o66092o04245n55373n14996m73005m30714l95233
58139F477208l63740l29017k94388k68006k47882k26558k05371j90585j80530
58130D171131j69414j58896j53628j50086j41882j31527j25383j21501j13779
58121B905035j03760r7099r2521q5187p7060p3166p1314o6056n9251n6412n6036
58110B067173n2762m7894m6637m7780m6115m2481m1685m2863m1477l8584l8740
58099A580155m0686l9411l5701l4587l5753l4415l0483k8143k7423k4570k0088
$$ plain form
58088 1228895 1210698 1191892 1174097 1159227 1145474 1130475 1114807 1099116 1081466 1060743 1039197
58077 1039197 1018656 997708 975443 954223 935713 917798 898582 880028 864506 850969 837631
58066 837631 825368 815477 806994 798985 792594 788210 783551 777071 770247 764138 756991 747850 739102 732552
58052 732552 726273 718351 710517 704877 700129 694380 688873 685417 682622 678132 672367 666812 660714 652753
58038 652753 644053 636476 629622 622335 615341 609605 603972 597244 590812 586389 582827 578000 572233 567131
58024 567131 562531 557480 552854 550219 549056 547526 545031 542003 538414 534528 531820 531115 531031 530034 528559
58009 528559 527466 526266 524869 525117 528168 532027 534027 534365 535000 536599 538886 542424 547537 552694 556340
57994 556340 559225 562848 566843 570078 572979 576407 579368 580124 578584 575515 570539 563050 554042 544898
$$ packed form
58088A228895j8197j8806j7795j4870j3753j4999j5668j5691j7650k0723k1546
58077A039197k0541k0948k2265k1220j8510j7915j9216j8554j5522j3537j3338
58066H37631j2263r891q483q009o391m384m659o480o824o109p147r141q748o550
58052G32552o279p922p834n640m748n749n507l456k795m490n765n555o098p961
58038F52753q700p577o854p287o994n736n633o728o432m423l562m827n767n102
58024E67131m600n051m626k635j163j530k495l028l589l886k708p05q4r97j475
58009E28559j093j200j397K48L051L859K000L38O35J599K287L538N113N157L646
57994E56340K885L623L995L235K901L428K961P56j540l069m976p489r008r144
$$ plain form
57980 544898 535433 525206 515616 508488 503525 499236 495373 492432 489853 486968 484750 484329 484655 483821 481940
57965 481940 480554 479942 479164 478114 477431 476907 475910 474797 474086 472976 470517 467476 465145 463113 460227 456959
57949 456959 454747 453631 452606 451755 451964 453030 454065 455436 458422 463253 469185 476048 484058 492685 501451
57934 501451 511220 522830 534999 545513 554009 561673 568678 573882 576720 577494 576044 572039 566346 560325
57920 560325 553960 546423 538148 530506 523674 516624 509162 502187 496069 490463 485693 482599 480985 479762
57906 479762 478666 478412 479221 480667 482821 486096 490058 493810 497379 501286 504963 507161 507821 508096 508669
57891 508669 509485 510953 513782 517618 521320 524621 528084 531399 533172 532592 530133 526548 522287 517821 513367
57876 513367 508401 502488 496352 491052 486481 481854 477170 472863 468631 464193 460736 459836 461202 463209
$$ packed form
57980E44898r465j0227r590p128m963m289l863k941k579k885k218m21L26q34j881
57965D81940j386o12p78j050o83n24r97j113p11j110k459l041k331k032k886l268
57949D56959k212j116j025q51K09J066J035J371K986M831N932O863Q010Q627Q766
57934E01451R769J1610J2169J0514Q496P664P005N204K838P74j450m005n693o021
57920E60325o365p537q275p642o832p050p462o975o118n606m770l094j614j223
57906D79762j096k54Q09J446K154L275L962L752L569L907L677K198O60K75N73
57891E08669Q16J468K829L836L702L301L463L315J773n80k459l585m261m466m454
57876E13367m966n913o136n300m571m627m684m307m232m438l457r00J366K007
$$ plain form
57862 463209 465439 468885 473731 478876 483870 489467 495903 502304 508264 514489 521440 528732 536249 544422
57848 544422 552958 560571 566521 571268 575189 577797 578706 578328 577089 574841 571420 566964 561400 554436 546289
57833 546289 537733 529346 521365 514116 507730 501564 494928 488319 482947 479169 476378 474241 472877 471913
57819 471913 470569 468760 467066 465668 464266 462890 461604 459599 455879 450807 445715 441043 436113 430692
57805 430692 425280 419846 413757 407261 401565 397033 392659 387785 383190 379909 378005 376926 376200 375415 374440
57790 374440 373994 375170 378156 382176 386718 391921 397689 403503 409270 415420 422047 428868 436124 444496
57776 444496 454084 464301 474773 485328 495256 503779 511216 518457 525254 530271 532908 533802 533474 531812
57762 531812 528988 525481 520936 514414 506134 497651 489958 482724 475693 469359 463743 457992 451906 446625
$$ packed form
57862D63209K230L446M846N145M994N597O436O401N960O225O951P292P517Q173
57848E44422Q536P613N950M747L921K608R09l78j239k248l421m456n564o964q147
57833E46289q556q387p981p249o386o166o636o609n372l778k791k137j364r64
57819D71913j344j809j694j398j402j376j286k005l720n072n092m672m930n421
57805D30692n412n434o089o496n696m532m374m874m595l281j904j079p26p85r75
57790C74440m46J176K986M020M542N203N768N814N767O150O627O821P256Q372
57776D44496R588J0217J0472J0555R928Q523P437P241O797N017K637Q94l28j662
57762E31812k824l507m545o522q280q483p693p234p031o334n616n751o086n281
$$ plain form
57748 446625 442983 440274 437355 434063 430877 428115 426138 425518 426331 427859 429285 430074 429679 427958 426037
57733 426037 425594 426953 428934 430761 432823 435290 437457 439063 440926 443521 446190 448428 450792 453706
57719 453706 456536 458653 460362 461889 462492 461497 459365 456755 453363 448662 443177 438096 434038 430810 427861
57704 427861 424402 419717 413877 407687 401613 395486 389482 384361 380260 376331 372211 368853 367122 366466
57690 366466 365769 364673 363282 361466 359406 358063 358200 359449 361153 363537 367295 372557 379075 386934 396453
57675 396453 407937 422263 441129 465966 496976 533832 576833 626658 683258 745285 809973
57664 809973 872852 927928 968794 989827 987155 960146 912841 853017 788761 725760 667329 615407
57652 615407 570650 532605 500812 475275 455377 439316 425411 413260 403026 394475 387445 382280
$$ packed form
57748D46625l642k709k919l292l186k762j977o20Q13J528J426P89l95j721j921
57733D26037m43J359J981J827K062K467K167J606J863K595K669K238K364K914
57719D53706K830K117J709J527O03r95k132k610l392m701n485n081m058l228k949
57704D27861l459m685n840o190o074o127o004n121m101l929m120l358j731o56
57690C66466o97j096j391j816k060j343J37J249J704K384L758N262O518P859R519
57675C96453J1484J4326J8866K4837L1010L6856M3001M9825N6600O2027O4688
57664H09973O2879N5076M0866K1033k672k7009m7305n9824o4256o3001n8431n1922
57652F15407m4757l8045l1793k5537j9898j6061j3905j2151j0234q551p030n165
$$ plain form
57640 382280 378895 376254 373695 371931 371714 372327 372514 372262 372424 373082 373489 373319 372886 372338 371563 370693 369859
57623 369859 368679 366767 364511 362599 361050 359407 357587 355886 354454 353384 352959 353189 353539 353738 354286
57608 354286 355452 356359 356005 354780 354033 354440 355604 356954 358131 358750 358616 358091 357624 357122 356346 355585 355274
57591 355274 355290 355239 355078 354874 354413 353679 353217 353318 353421 352985 352369 351935 351030 348950 346407 344797 344273 343708
57573 343708 342383 340616 338803 336988 335377 334304 333619 332954 332571 333071 334239 335093 335181 335098 335604 336935 338953
57556 338953 341264 343164 344184 344743 345661 347098 348666 350442 353049 356673 360758 364809 368872 373103 377400
57541 377400 381535 385160 387773 389212 390068 391085 392303 393367 394413 395860 397502 398664 399294 400093 401426
57526 401426 402841 403868 404727 406042 408289 411543 415336 418805 421463 423777 426495 429577 432340 434517
$$ packed form
57640C82280l385k641k559j764k17O13J87k52J62O58M07j70m33n48p75q70q34
57623C69859j180j912k256j912j549j643j820j701j432j070m25K30L50J99N48
57608C54286J166R07l54j225p47M07J164J350J177O19j34n25m67n02p76p61l11
57591C55274J6n1j61k04m61p34m62J01J03m36o16m34r05k080k543j610n24n65
57573C43708j325j767j813j815j611j073o85o65l83N00J168Q54Q8q3N06J331K018
57556C38953K311J900J020N59R18J437J568J776K607L624M085M051M063M231M297
57541C77400M135L625K613J439Q56J017J218J064J046J447J642J162O30P99J333
57526D01426J415J027Q59J315K247L254L793L469K658K314K718L082K763K177
$$ plain form
57512 434517 436553 438904 441668 444832 448272 451524 454174 456488 459079 461999 464760 467222 469845 472960
57498 472960 476263 479102 480923 481568 481563 481956 483307 485001 486049 486372 486731 487628 489016 490913 493544 496753
57482 496753 499923 502614 504927 507263 510043 513438 517034 520117 522689 525683 529541 533170 535167 535605
57468 535605 535688 536094 536814 538268 541216 545504 550006 553972 557450 560430 562744 564996 568410 573296 578586
57453 578586 583238 587280 591194 595133 599127 603259 607294 610872 614368 618781 624447 630611 636570 642524
57439 642524 648886 655467 661717 667200 671577 674851 677911 682098 687808 694149 700207 705913 711392 716339
57425 716339 720592 724570 728569 732276 735587 739311 744394 750760 757499 763923 770077 776548 784069 792916
57411 792916 802355 811085 818470 824971 831239 837395 843461 849797 856642 863777 871049 878701 886755 894620
$$ packed form
57512D34517K036K351K764L164L440L252K650K314K591K920K761K462K623L115
57498D72960L303K839J821O45nL93J351J694J048L23L59Q97J388J897K631L209
57482D96753L170K691K313K336K780L395L596L083K572K994L858L629J997M38
57468E35605Q3M06P20J454K948M288M502L966L478K980K314K252L414M886N290
57453E78586M652M042L914L939L994M132M035L578L496M413N666O164N959N954
57439F42524O362O581O250N483M377L274L060M187N710O341O058N706N479M947
57425G16339M253L978L999L707L311L724N083O366O739O424O154O471P521Q847
57411G92916R439Q730P385O501O268O156O066O336O845P135P272P652Q054P865
$$ plain form
57397 894620 901867 908947 916638 925129 934084 943206 952333 961342 970388 979835 989607 999075 1008069 1017526
57383 1017526 1028556 1041205 1054641 1068174 1081473 1094117 1105701 1116410 1126964 1137942 1149425
57372 1149425 1161165 1172697 1183399 1192875 1201430 1209952 1219257 1229536 1240344 1251054 1261461 1271940
57360 1271940 1282876 1294047 1304943 1315578 1326464 1337805 1349296 1360916 1373246 1386727 1401131
57349 1401131 1416101 1431697 1447999 1464684 1481398 1498177 1515101 1531972 1548695 1565527 1582500
57338 1582500 1599104 1615087 1631155 1648225 1666336 1684896 1703651 1722660 1741546 1759718 1777392
57327 1777392 1795616 1815014 1835014 1854608 1873436 1891833 1910232 1928960 1948485 1969373 1991845
57316 1991845 2015439 2039249 2062547 2085229 2107696 2130374 2153366 2176539 2199821 2223429 2247809
$$ packed form
57397H94620P247P080P691Q491Q955R122R127R009R046R447R772R468Q994R457
57383A017526J1030J2649J3436J3533J3299J2644J1584J0709J0554J0978J1483
57372A149425J1740J1532J0702R476Q555Q522R305J0279J0808J0710J0407J0479
57360A271940J0936J1171J0896J0635J0886J1341J1491J1620J2330J3481J4404
57349A401131J4970J5596J6302J6685J6714J6779J6924J6871J6723J6832J6973
57338A582500J6604J5983J6068J7070J8111J8560J8755J9009J8886J8172J7674
57327A777392J8224J9398K0000J9594J8828J8397J8399J8728J9525K0888K2472
57316A991845K3594K3810K3298K2682K2467K2678K2992K3173K3282K3608K4380
$$ plain form
57305 2247809 2273302 2299763 2326611 2353374 2380188 2407674 2436383 2466431 2497473 2528905 2560357
57294 2560357 2592175 2625154 2659554 2694751 2730167 2766140 2803289 2841388 2879639 2917931 2957025
57283 2957025 2997498 3039236 3081979 3125597 3169665 3213572 3257326 3301627 3346886 3392796 3439120
57272 3439120 3486265 3534750 3584755 3636497 3690355 3746184 3803146 3860733 3919484 3980138 4042611
57261 4042611 4106344 4171258 4237812 4306380 4377069 4449900 4524762 4601497 4680375 4762184 4847394
57250 4847394 4935514 5025603 5117162 5210232 5304998 5401702 5500647 5601853 5704890 5809173 5913988
57239 5913988 6018051 6119624 6217653 6312380 6404392 6493422 6578550 6659189 6735325 6807133 6874956
57228 6874956 6939510 7001653 7062117 7121712 7181410 7241818 7302944 7364904 7428389 7493871 7560803
$$ packed form
57305B247809K5493K6461K6848K6763K6814K7486K8709L0048L1042L1432L1452
57294B560357L1818L2979L4400L5197L5416L5973L7149L8099L8251L8292L9094
57283B957025M0473M1738M2743M3618M4068M3907M3754M4301M5259M5910M6324
57272C439120M7145M8485N0005N1742N3858N5829N6962N7587N8751O0654O2473
57261D042611O3733O4914O6554O8568P0689P2831P4862P6735P8878Q1809Q5210
57250D847394Q8120R0089R1559R3070R4766R6704R8945J01206J03037J04283J04815
57239E913988J04063J01573R8029R4727R2012Q9030Q5128Q0639P6136P1808O7823
57228F874956O4554O2143O0464N9595N9698O0408O1126O1960O3485O5482O6932
$$ plain form
57217 7560803 7628281 7696157 7764845 7834331 7904106 7973823 8043235 8111682 8178526 8244192 8310138
57206 8310138 8377795 8448096 8521909 8600043 8682638 8769110 8858740 8950669 9043352 9134912 9224311
57195 9224311 9311420 9395670 9475481 9549574 9618286 9682988 9744703 9803918 9861374 9918318 9975993
57184 9975993 10035248 10096422 10159198 10222784 10286655 10350823 10414918 10477484 10537084 10594059 10650390
57173 10650390 10707837 10767207 10829661 10897691 10973820 11058245 11147451 11234581 11312483 11379409 11442415
57162 11442415 11510920 11582318 11635245 11642849 11595861 11511007 11415802 11327685 11248702 11175013 11104961
57151 11104961 11038067 10971989 10903748 10832154 10757238 10678745 10596621 10511887 10425471 10336678 10243699
57140 10243699 10145167 10040745 9931136 9818502 9706363 9598200 9496296 9402140 9317061 9241607
$$ packed form
57217G560803O7478O7876O8688O9486O9775O9717O9412O8447O6844O5666O5946
57206H310138O7657P0301P3813P8134Q2595Q6472Q9630R1929R2683R1560Q9399
57195I224311Q7109Q4250P9811P4093O8712O4702O1715N9215N7456N6944N7675
57184I975993N9255O1174O2776O3586O3871O4168O4095O2566N9600N6975N6331
57173A0650390N7447N9370O2454O8030P6129Q4425Q9206Q7130P7902O6926O3006
57162A1442415O8505P1398N2927P604m6988q4854r5205q8117p8983p3689p0052
57151A1104961o6894o6078o8241p1594p4916p8493q2124q4734q6416q8793r2979
57140A0243699r8532j04422j09609j12634j12139j08163j01904r4156q5079p5454
$$ plain form
57130 9241607 9174613 9113371 9054298 8993066 8924999 8846511 8756295 8654769 8542765 8421338 8292592
57119 8292592 8159854 8026740 7896232 7770560 7651626 7541040 7439331 7345062 7255406 7168352
57109 7168352 7084428 7006102 6936167 6877582 6834613 6812991 6818737 6857549 6935535 7060181 7241021
57098 7241021 7490579 7825307 8265715 8836266 9565957 10488623 11641715 13064264 14794544
57089 14794544 16865333 19295500 22080505 25184607 28536329 32033756 35569467 39068549
57081 39068549 42507940 45890370 49189216 52312018 55108608 57405228 59036161 59868724
57073 59868724 59827540 58908435 57168883 54705045 51638254 48114245 44297760 40354428
57065 40354428 36431615 32648948 29095013 25825296 22864742 20216818 17872412 15813364
$$ packed form
57130I241607o6994o1242n9073o1232o8067p8488r0216j01526j12004j21427j28746
57119H292592j32738j33114j30508j25672j18934j10586j01709r4269q9656q7054
57109G168352q3924p8326o9935n8585m2969k1622N746L8812P7986J24646J80840
57098G241021K49558L34728M40408N70551P29691R22666J153092J422549J730280
57089A4794544K070789K430167K785005L104102L351722L497427L535711L499082
57081C9068549L439391L382430L298846L122802K796590K296620J630933Q32563
57073E9868724m1184r19105j739552k463838l066791l524009l816485l943332
57065D0354428l922813l782667l553935l269717k960554k647924k344406k059048
$$ plain form
57057 15813364 14014331 12447066 11084306 9900234 8870286 7972857 7190172 6506334
57049 6506334 5905944 5375700 4905802 4488475 4116355 3783363 3485549 3219526 2981007
57040 2981007 2765982 2572173 2398050 2241346 2099705 1971861 1857023 1753835 1661058 1578547
57030 1578547 1506547 1444649 1392367 1350106 1318622 1298161 1289035 1292471 1309880 1341336 1384978 1436941
57018 1436941 1490879 1537919 1568163 1572989 1547161 1490709 1409702 1314220 1214255 1117063 1027407
57007 1027407 948185 879846 820543 768325 722782 684030 651125 622583 597721 576447 558239
56996 558239 542365 528743 517709 509193 502790 498276 495481 494062 494079 496409 502029 511235 523935 539954
56982 539954 558257 576326 591032 599916 601336 594219 578678 556625 531008 504459 478888 455798
$$ packed form
57057A5813364j799033j567265j362760j184072j029948q97429p82685o83838
57049F506334o00390n30244m69898m17327l72120l32992k97814k66023k38519
57040B981007k15025j93809j74123j56704j41641j27844j14838j03188r2777q2511
57030A578547p2000o1898n2282m2261l1484k0461r126L436J7409L1456M3642N1963
57018A436941N3938M7040L0244M826k5828n6452q1007r5482r9965r7192q9656
57007A027407p9222o8339n9303n2218m5543l8752l2905k8542k4862k1274j8208
56996E58239j5874j3622j1034q516o403m514k795j419J7K330N620R206J2700J6019
56982E39954J8303J8069J4706Q884J420p117j5541k2053k5617k6549k5571k3090
$$ plain form
56970 455798 436178 420260 407875 398939 393328 390684 390705 393370 398752 407110 419337 436577 458942
56957 458942 485058 513003 540800 565525 582900 588858 581570 561925 532870 498665 463764 431230
56945 431230 402256 377430 357809 344213 336162 332327 331778 334422 340702 351372 367107 387916 413335
56932 413335 443258 477671 515083 551962 584194 608311 621050 619291 601952 571551 532892 490488
56920 490488 447676 407197 371113 340153 313990 292123 274048 259016 246387 235997 227676 220786
56908 220786 214711 209377 204858 201029 198053 196546 196676 197770 199340 201667 204749 207690 210091 213141
56894 213141 218130 224631 231459 238881 248520 261329 276986 295124 315810 338591 361973 384003
56882 384003 402654 415751 421465 419195 409689 394592 376390 358246 342749 330710 321729 315727
$$ packed form
56970D55798j9620j5918j2385q936n611k644K1K665N382Q358J2227J7240K2365
56957D58942K6116K7945K7797K4725J7375N958p288j9645k9055l4205l4901l2534
56945D31230k8974k4826j9621j3596q051l835n49K644O280J0670J5735K0809K5419
56932D13335K9923L4413L7412L6879L2232K4117J2739j759j7339l0401l8659m2404
56920D90488m2812m0479l6084l0960k6163k1867j8075j5032j2629j0390q321o890
56908B20786o075n334m519l829k976j507J30J094J570K327L082K941K401L050
56894B13141M989O501O828P422R639J2809J5657J8138K0686K2781K3382K2030
56882C84003J8651J3097N714k270r506j5097j8202j8144j5497j2039q981o002
$$ plain form
56870 315727 313286 314806 320274 329908 344347 364146 389567 420775 457810 500466 548347 600494
56858 600494 654360 705459 748465 778485 791545 785431 761403 724497 681098 636279 593649 556396
56846 556396 526926 505916 492945 487823 490520 500563 517885 543895 580458 628075 686184 754631
56834 754631 833151 919202 1007399 1090856 1161835 1211527 1231692 1218237 1173323 1104199 1020600
56823 1020600 932557 848405 773223 708922 655714 613169 580467 556923 542567 537657 541796 554407
56811 554407 575876 607266 648801 699364 757079 819074 880338 933672 971223 986222 974561
56800 974561 936659 878202 807934 734077 662800 598782 545158 502498 469239 443796 425614
56789 425614 414227 408621 408033 412529 422398 437611 457972 482963 511308 541271 571198 598723
$$ packed form
56870C15727k441J520N468R634J4439J9799K5421L1208L7035M2656M7881N2147
56858F00494N3866N1099M3006L0020J3060o114k4028l6906m3399m4819m2630l7253
56846E56396k9470k1010j2971n122K697J0043J7322K6010L6563M7617N8109O8447
56834G54631P8520Q6051Q8197Q3457P0979M9692K0165j3455m4914o9124q3599
56823A020600q8043q4152p5182o4301n3208m2545l2702k3544j4356m910M139J2611
56811E54407K1469L1390M1535N0563N7715O1995O1264N3334L7551J4999j1661
56800I74561l7902n8457p0268p3857p1277o4018n3624m2660l3259k5443j8182
56789D25614j1387n606n88M496R869J5213K0361K4991K8345K9963K9927K7525
$$ plain form
56777 598723 619690 629218 624434 605651 575229 536508 493631 450654 409961 372287 338307 309062
56765 309062 284669 264008 246234 231523 219872 210292 201811 194349 188047 182572 177671 173627 170632
56752 170632 168341 166375 164652 162999 161214 159674 158987 158857 158239 156850 155512 154757 154112 153186 152396 152143
56736 152143 152252 152632 153546 154704 155114 154447 153688 153843 154808 155988 157237 158615 159976 161327 162921 164618
56720 164618 165877 166678 167659 169014 170149 170702 170983 171049 170467 169445 169133 170194 171983 173656 175158 176610
56704 176610 177713 178299 178577 178331 176943 174652 172672 171488 170235 168408 166889 166404 166265 165690 165251 165850
56688 165850 167241 168721 170372 172397 174011 174315 173732 173399 173660 174175 174978 176326 177952 179516 181365 183869
56672 183869 186453 188316 189694 191332 193075 194079 194245 194377 194957 195649 196091 196451 197114 198265 199776 201224
$$ packed form
56777E98723K0967R528m784j8783l0422l8721m2877m2977m0693l7674l3980k9245
56765C09062k4393k0661j7774j4711j1651r580q481p462o302n475m901m044k995
56752A70632k291j966j723j653j785j540o87j30o18j389j338p55o45r26p90k53
56736A52143J09L80R14J158M10o67p59J55R65J180J249J378J361J351J594J697
56720A64618J259Q01R81J355J135N53K81O6n82j022l12J061J789J673J502J452
56704A76610J103N86K78k46j388k291j980j184j253j827j519m85j39n75m39N99
56688A65850J391J480J651K025J614L04n83l33K61N15Q03J348J626J564J849K504
56672A83869K584J863J378J638J743J004J66J32N80O92M42L60O63J151J511J448
$$ plain form
56656 201224 202184 202758 203500 204639 205848 206897 207857 208435 208016 206728 205588 205096 204646 203880 203573 204344 205496
56639 205496 205988 205711 204879 203140 200350 197427 195249 193360 190907 188172 186048 184573 183155 181726 180509
56624 180509 179150 177263 175422 174393 173794 172697 171251 170494 170787 171570 172414 173183 173384 172552 171248 170599
56608 170599 170831 171196 171215 171049 170774 170328 170175 171043 172883 174892 176612 178247 179907 181295 182150 182434 182166
56591 182166 181599 181329 181610 181890 181689 181572 182438 184184 185876 186963 187535 187727 187687 187934 188857 190064 190951 191653
56573 191653 192700 194094 195543 197264 199670 202549 205406 208332 211800 216010 221315 228737 238934 250985
56559 250985 263252 275183 287126 298635 308126 314330 317159 317305 315811 313798 311684 308841 304803
56546 304803 300379 296622 293244 289286 284894 281054 277832 274435 270913 268264 266668 265053 262708 260036
$$ packed form
56656B01224R60N74P42J139J209J049R60N78m19j288j140m92m50p66l07P71J152
56639B05496M92k77q32j739k790k923k178j889k453k735k124j475j418j429j217
56624A80509j359j887j841j029n99j097j446p57K93P83Q44P69K01q32j304o49
56608A70599K32L65J9j66k75m46j53Q68J840K009J720J635J660J388Q55K84k68
56591A82166n67k70K81K80k01j17Q66J746J692J087N72J92m0K47R23J207Q87P02
56573A91653J047J394J449J721K406K879K857K926L468M210N305P422J0197J2051
56559B50985J2267J1931J1943J1509R491O204K829J46j494k013k114k843m038
56546C04803m424l757l378l958m392l840l222l397l522k649j596j615k345k672
$$ plain form
56532 260036 257370 254293 250630 247104 244484 242869 242115 242146 242534 242503 241735 240595 239410 238109 236593 234877
56516 234877 232905 230796 229065 227933 226680 224504 221757 219458 217899 216713 215948 215854 215833 214925 213301 212064
56500 212064 211545 211054 210403 210275 210764 210730 209139 206242 203202 201318 201600 204019 207015 208696 208682 207989 207263
56483 207263 206315 205314 205076 205869 207058 208184 209331 210292 210581 210450 210743 211492 211841 211610 211662 212386 213108 213450
56465 213450 214003 215103 216119 216601 217020 217688 217963 217294 216186 215401 214921 214359 213779 213500 213599 214008 214601 214954
56447 214954 214657 214103 214264 215443 216926 218017 218641 218824 218442 217711 217131 216735 216157 215499 215262 215426 215610 216104
56429 216104 217561 219578 220909 221386 222290 224318 226487 227692 228174 228686 229153 229024 228254 227284 226581 226597 227602
56412 227602 229218 230684 231742 232641 233355 233732 234321 235917 238149 239718 240252 240729 241819 242965 243467 243289
$$ packed form
56532B60036k666l077l663l526k620j615p54L1L88l1p68j140j185j301j516j716
56516B34877j972k109j731j132j253k176k747k299j559j186p65r4k1r08j624j237
56500B12064n19m91o51j28M89l4j591k897l040j884K82K419K996J681j4o93p26
56483B07263r48j001k38P93J189J126J147R61K89j31K93P49L49k31N2P24P22L42
56465B13450N53J100J016M82M19O68K75o69j108p85m80n62n80k79R9M09N93L53
56447B14954k97n54J61J179J483J091O24J83l82p31n80l96n78o58k37J64J84M94
56429B16104J457K017J331M77R04K028K169J205M82N12M67j29p70r70p03J6J005
56412B27602J616J466J058Q99P14L77N89J596K232J569N34M77J090J146N02j78
$$ plain form
56396 243289 242487 241059 239728 239663 240999 242721 244291 246079 247928 248805 248436 247903 248012 248410 248866 249901
56380 249901 251420 252243 251897 251547 252216 253421 254468 255726 257455 258673 258572 258056 258562 260130 261781 263100
56364 263100 264302 265390 266274 267228 268381 269279 269648 269970 270628 271188 271217 271115 271450 272118 272755 273339 273904 274385
56346 274385 275081 276409 277883 278406 278046 278350 280325 283248 286069 288795 291770 294755 297570 300640 304221
56331 304221 308002 312032 316893 322413 327462 331583 335507 339470 342561 344472 346234 348260 349279 348344
56317 348344 346375 344480 342319 339496 337055 336008 335645 334903 334318 335022 336758 338426 339741 341007 342124
56302 342124 343211 345284 348986 353471 357740 362065 366866 371313 374518 377076 379923 382704 384753 386687
56288 386687 389342 392081 393861 395252 397713 401519 405943 410747 415946 420804 424728 428557 433430 438905
$$ packed form
56396B43289q02j428j331o5J336J722J570J788J849Q77l69n33J09L98M56J035
56380B49901J519Q23l46l50O69J205J047J258J729J218j01n16N06J568J651J319
56364B63100J202J088Q84R54J153Q98L69L22O58N60K9j02L35O68O37N84N65M81
56346B74385O96J328J474N23l60L04J975K923K821K726K975K985K815L070L581
56331C04221L781M030M861N520N049M121L924L963L091J911J762K026J019r35
56317C48344j969j895k161k823k441j047l63p42n85P04J736J668J315J266J117
56302C42124J087K073L702M485M269M325M801M447L205K558K847K781K049J934
56288C86687K655K739J780J391K461L806M424M804N199M858L924L829M873N475
$$ plain form
56274 438905 443735 447820 451831 455592 458542 461386 465588 471470 478230 485499 493541 502301 511615 522000
56260 522000 533988 547173 561097 576492 594395 614710 637003 662035 690981 723685 759194
56249 759194 797570 839754 886065 936108 989717 1046704 1106095 1166808 1228456 1290419 1350912
56238 1350912 1408262 1462249 1512760 1557991 1595473 1624133 1643838 1653830 1653401 1643501 1625935 1601483
56226 1601483 1570352 1533871 1494014 1451725 1407236 1361522 1315856 1270455 1225116 1180605 1137902
56215 1137902 1096618 1055808 1015809 977721 941626 906869 873616 842629 814065 787850 764465
56204 764465 743907 724694 705507 687071 670905 657128 645062 634877 626766 619507 611885 604725
56192 604725 599581 596244 593487 591292 590218 589468 587850 585951 585151 585147 584649 583818 583785 584441 584911 585545 587167
$$ packed form
56274D38905M830M085M011L761K950K844M202N882O760P269Q042Q760R314J0385
56260E22000J1988J3185J3924J5395J7903K0315K2293K5032K8946L2704L5509
56249G59194L8376M2184M6311N0043N3609N6987N9391O0713O1648O1963O0493
56238A350912N7350N3987N0511M5231L7482K8660J9705R992m29r900j7566k4452
56226A601483l1131l6481l9857m2289m4489m5714m5666m5401m5339m4511m2703
56215A137902m1284m0810l9999l8088l6095l4757l3253l0987k8564k6215k3385
56204G64465k0558j9213j9187j8436j6166j3777j2066j0185q111p259p622p160
56192F04725n144l337k757k195j074p50j618j899q00mm98q31l3O56M70O34J622
$$ plain form
56175 587167 589054 589978 590580 592423 595404 598518 602307 607934 614530 620184 625057 630816 637568 644114 650757
56160 650757 658972 668602 678228 688052 699587 712699 725811 738964 753825 770697 788266 806289
56148 806289 825823 846922 868874 892665 920375 952195 986912 1025401 1070925 1125968 1191560
56137 1191560 1269521 1362136 1469213 1588059 1716250 1851538 1989186 2122726 2247756 2362261
56127 2362261 2463583 2548682 2617901 2675170 2723844 2765086 2800130 2830321 2854018 2866822 2866069
56116 2866069 2852783 2829079 2796669 2758023 2715221 2666529 2606942 2532935 2444334 2341821 2226364
56105 2226364 2101841 1974817 1850699 1732589 1623819 1527985 1445897 1375804 1317090 1270364
56095 1270364 1233740 1203086 1176756 1156379 1142196 1131537 1122877 1117465 1115727 1115745 1116542 1119272 1123986
$$ packed form
56175E87167J887R24O02J843K981L114L789N627O596N654M873N759O752O546O643
56160F50757Q215R630R626R824J1535J3112J3112J3153J4861J6872J7569J8023
56148H06289J9534K1099K1952K3791K7710L1820L4717L8489M5524N5043O5592
56137A191560P7961R2615J07077J18846J28191J35288J37648J33540J25030J14505
56127B362261J01322Q5099O9219N7269M8674M1242L5044L0191K3697J2804p53
56116B866069j3286k3704l2410l8646m2802m8692n9587p4007q8601j02513j15457
56105B226364j24523j27024j24118j18110j08770r5834q2088p0093n8714m6726
56095A270364l6624l0654k6330k0377j4183j0659q660n412j738J8P97K730M714
$$ plain form
56082 1123986 1128779 1133316 1139607 1148181 1157102 1165852 1176409 1189302 1202371 1214701 1228017 1242962
56070 1242962 1257804 1272058 1287541 1304542 1320785 1335425 1350167 1365298 1378797 1390613 1403516
56059 1403516 1418256 1432216 1444279 1456679 1470572 1484314 1497735 1513491 1532418 1552071 1571636
56048 1571636 1593566 1618564 1643739 1667684 1692543 1719152 1745121 1769813 1796114 1825093 1854084
56037 1854084 1882249 1912661 1946472 1980534 2013443 2048408 2087399 2128079 2169431 2214669 2265348
56026 2265348 2318218 2371147 2426486 2485336 2544315 2601602 2660438 2723191 2787721 2853082 2922654
56015 2922654 2997967 3075576 3153789 3236190 3324717 3415891 3507923 3604648 3708180 3814816 3922853
56004 3922853 4037263 4161652 4292772 4427997 4570821 4723682 4882973 5046745 5219683
$$ packed form
56082A123986M793M537O291Q574Q921Q750J0557J2893J3069J2330J3316J4945
56070A242962J4842J4254J5483J7001J6243J4640J4742J5131J3499J1816J2903
56059A403516J4740J3960J2063J2400J3893J3742J3421J5756J8927J9653J9565
56048A571636K1930K4998K5175K3945K4859K6609K5969K4692K6301K8979K8991
56037A854084K8165L0412L3811L4062L2909L4965L8991M0680M1352M5238N0679
56026B265348N2870N2929N5339N8850N8979N7287N8836O2753O4530O5361O9572
56015B922654P5313P7609P8213Q2401Q8527R1174R2032R6725J03532J06636J08037
56004C922853J14410J24389J31120J35225J42824J52861J59291J63772J72938
$$ plain form
55995 5219683 5404781 5598061 5797444 6008619 6235881 6475634 6725449 6990828 7276303
55986 7276303 7578943 7897640 8239260 8608225 9000109 9413451 9857476 10339995 10858960
55977 10858960 11415067 12020834 12687267 13413717 14201490 15064799 16017262 17061628 18205839
55968 18205839 19475566 20898088 22489401 24272265 26291794 28598953 31238347 34272572
55960 34272572 37803779 41957884 46876535 52755844 59878409 68586487 79247109 92264463
55952 92264463 108087661 127162541 149889903 176618302 207525121 242283578 279706956
55945 279706956 317628737 352975057 381883998 400115129 404159276 392764023 367763123
55938 367763123 333396230 294592967 255472242 218776061 185995461 157675431 133716798
$$ packed form
55995E219683J85098J93280J99383K11175K27262K39753K49815K65379K85475
55986G276303L02640L18697L41620L68965L91884M13342M44025M82519N18965
55977A0858960N56107O05767O66433P26450P87773Q63309R52463J044366J144211
55968A8205839J269727J422522J591313J782864K019529K307159K639394L034225
55960C4272572L531207M154105M918651N879309P122565Q708078J0660622J3017354
55952I2264463J5823198J9074880K2727362K6728399L0906819L4758457L7423378
55945B79706956L7921781L5346320K8908941J8231131M044147j1395253k5000900
55938C67763123l4366893l8803263l9120725l6696181l2780600k8320030k3958633
$$ plain form
55931 133716798 113686571 97057534 83299974 71901264 62410015 54473486 47813354
55924 47813354 42187093 37394939 33296481 29786411 26763240 24137843 21851815 19862326
55916 19862326 18119615 16576419 15205605 13989704 12903477 11922370 11037087 10243982
55908 10243982 9529938 8880085 8290715 7760905 7279903 6835546 6427016 6057170 5719888
55899 5719888 5406542 5117506 4855732 4615592 4389093 4177029 3983604 3805740 3637581
55890 3637581 3479983 3335935 3201829 3072555 2950436 2840251 2740021 2645106 2556830 2478738
55880 2478738 2408721 2342939 2283349 2233404 2190124 2147948 2106536 2067389 2026643 1978927 1925188
55869 1925188 1869631 1812201 1751114 1689537 1632497 1579657 1527701 1477298 1431318 1388687 1346303
$$ packed form
55931A33716798k0030227j6629037j3757560j1398710r491249p936529o660132
55924D7813354n626261m792154m098458l510070l023171k625397k286028j989489
55916A9862326j742711j543196j370814j215901j086227r81107q85283p93105
55908A0243982p14044o49853n89370n29810m81002m44357m08530l69846l37282
55899E719888l13346k89036k61774k40140k26499k12064j93425j77864j68159
55890C637581j57598j44048j34106j29274j22119j10185j00230r4915q8276p8092
55880B478738p0017o5782n9590m9945m3280m2176m1412l9147m0746m7716n3739
55869A925188n5557n7430o1087o1577n7040n2840n1956n0403m5980m2631m2384
$$ plain form
55858 1346303 1304782 1266439 1229958 1192831 1156759 1124888 1095933 1066569 1037396 1011049 986571
55847 986571 961125 935266 911249 888115 863669 839453 818647 800759 783138 765916 750755
55836 750755 736678 721879 707749 696445 686422 675034 663580 655007 648573 641604 634686 630203
55824 630203 627477 624149 620789 619238 617949 613936 608035 603429 600166 595965 591337 589022 589154 589674 590890
55809 590890 595066 602016 609397 616845 625647 634891 642113 647309 652220 656077 656062 651703 644997 636456 624748
55794 624748 610024 594050 577327 559433 541797 526767 514349 503068 493390 486945 483039 479355
55782 479355 475522 472567 469518 464117 456472 448632 441055 432846 424870 419044 414988 410848 406986 405288
55768 405288 405110 403551 399608 394727 389418 382815 375471 369159 363851 358089 352301 348516 346857 345501
$$ packed form
55858A346303m1521l8343l6481l7127l6072l1871k8955k9364k9173k6347k4478
55847I86571k5446k5859k4017k3134k4446k4216k0806j7888j7621j7222j5161
55836G50755j4077j4799j4130j1304j0023j1388j1454q573o434o969o918m483
55824F30203k726l328l360j551j289m013n901m606l263m201m628k315J32N20J216
55809E90890M176O950P381P448Q802R244P222N196M911L857j5m359o706q541j1708
55794F24748j4724j5974j6723j7894j7636j5030j2418j1281r678o445l906l684
55782D79355l833k955l049n401p645p840p577q209p976n826m056m140l862j698
55768D05288j78j559l943m881n309o603p344o312n308n762n788l785j659j356
$$ plain form
55754 345501 344037 343584 343650 342262 339382 336917 335130 332126 327127 321158 314331 305639 295725 286808 279431
55739 279431 272155 264711 258519 253884 249668 246027 244440 244649 244573 243669 243491 244491 245247 245302 245757 246448 245502
55722 245502 242453 239010 236071 232729 228951 226339 225366 224483 222936 221917 222072 222339 222152 222393 223267 223623
55706 223623 223255 223543 224944 226082 226239 226488 227449 228047 227428 226088 224344 221695 218477 216071 214751 213310
55690 213310 211465 210542 211131 212251 213503 215798 219104 221781 223126 224513 227055 230101 232964 236050 239305
55675 239305 241548 242369 242841 243356 242698 240350 237854 236792 237091 238282 240681 244323 248388 252701 258206
55660 258206 265011 271631 277033 281787 286247 289357 290370 290115 289396 287570 283777 278267 271584 263776 255298
55645 255298 247340 240413 233786 226995 220621 215113 210259 206259 203644 201703 198836 195133 192626 192231
$$ packed form
55754C45501j464m53O6j388k880k465j787l004m999n969o827q692r914q917p377
55739B79431p276p444o192m635m216l641j587K09p6r04j78J000P56N5M55O91r46
55722B45502l049l443k939l342l778k612r73q83j547j019J55K67j87K41Q74L56
55706B23623l68K88J401J138J57K49R61N98o19j340j744k649l218k406j320j441
55690B13310j845r23N89J120J252K295L306K677J345J387K542L046K863L086L255
55675B39305K243Q21M72N15o58k348k496j062K99J191K399L642M065M313N505
55660B58206O805O620N402M754M460L110J013k55p19j826l793n510o683p808q478
55645B55298p958o927o627o791o374n508m854m000k615j941k867l703k507l95
$$ plain form
55631 192231 192386 191675 190738 190370 189725 187927 185816 184530 183678 182333 180580 178754 176374 173165 170115 168230
55615 168230 167175 166206 165477 165416 165757 166120 166600 166963 166300 164321 162010 160240 158846 157676 157288 157758 158023
55598 158023 157313 156131 155098 153968 152512 151121 149813 147901 145353 143199 141942 141003 140392 141262 143892
55583 143892 146737 148542 149844 151319 152359 152607 153227 155055 156883 157259 156826 157174 158389 159418 160049 160874
55567 160874 161837 162285 162068 161475 160559 159525 159167 159968 161292 162280 162821 162965 162375 161189 160406 160484 160582 160155
55549 160155 160103 161228 162721 163516 164101 165530 167471 168775 169393 170279 171787 173329 174293 174326 173182 171213
55533 171213 169464 168434 167372 165580 163568 162025 160529 158435 156191 154563 153231 151341 148924 146637
55519 146637 144678 142971 141907 141780 141974 141695 141054 140570 140158 139493 138741 138052 136993 135400 134098 133799 134051
$$ packed form
55631A92231J55p11r37l68o45j798k111j286q52j345j753j826k380l209l050j885
55615A68230j055r69p29o1L41L63M80L63o63j979k311j770j394j170l88M70K65
55598A58023p10j182j033j130j456j391j308j912k548k154j257r39o11Q70K630
55583A43892K845J805J302J475J040K48O20J828J828L76m33L48J215J029O31Q25
55567A60874R63M48k17n93r16j034l58Q01J324R88N41J44n90j186p83P8R8m27
55549A60155n2J125J493P95N85J429J941J304O18Q86J508J542R64L3j144j969
55533A71213j749j030j062j792k012j543j496k094k244j628j332j890k417k287
55519A46637j959j707j064j27J94k79o41m84m12o65p52o89j059j593j302k99K52
$$ plain form
55502 134051 134140 134222 134495 134217 132877 131566 131671 132753 133136 132266 131138 130674 130968 131924 133434 134956 135989
55485 135989 136855 138101 139368 139826 139547 139471 140082 140926 141372 141129 140192 138869 137721 137010 136529 136276 136655 137520
55467 137520 137882 137236 136356 135940 135374 133898 132246 131884 133074 134756 135944 136268 135625 134336 133302 133058
55451 133058 133035 132512 131791 131508 131422 130926 130286 130244 130761 131128 131032 130635 130003 129318 129187 129835 130451 130217 129501 129159
55431 129159 129237 129340 129630 130355 130940 130723 130118 129912 129922 129525 129022 129210 129925 130294 130186 130247 130740 131482 132614
55412 132614 134271 135718 135987 135217 134294 133461 132401 131471 131547 132705 134127 135251 136050 136398 136163 135788 135769
55395 135769 135770 135216 134441 134189 134332 134199 133844 133756 133647 132832 131616 131022 131262 131727 132267 133188 134128 134328 133962
55376 133962 133873 134066 133865 133397 133409 133581 132733 130934 129743 129901 130309 129870 128927 128211 127707 127323 127499 128337 129123
$$ packed form
55502A34051Q9Q2K73k78j340j311J05J082L83q70j128m64K94R56J510J522J033
55485A35989Q66J246J267M58k79p6O11Q44M46k43r37j323j148p11m81k53L79Q65
55467A37520L62o46q80m16n66j476j652l62J190J682J188L24o43j289j034k44
55451A33058k3n23p21k83q6m96o40m2N17L67r6l97o32o85j31O48O16k34p16l42
55431A29159P8J03K90P25N85k17o05k06J0l97n03J88P15L69j08O1M93P42J132
55412A32614J657J447K69p70r23q33j060r30P6J158J422J124P99L48k35l75j9
55395A35769Jn54p75k52J43j33l55q8j09q15j216n94K40M65N40R21R40K00l66
55376A33962q9J93k01m68J2J72q48j799j191J58M08m39r43p16n04l84J76Q38P86
$$ plain form
55357 129123 129451 129858 130594 130747 129518 127604 126362 126091 125988 125462 124728 124321 124658 125971 128179 130747 132916
55340 132916 134130 134361 134126 134037 134076 133617 132436 131283 130953 131231 131501 131941 133111 134639 135455 135365 135330 136011
55322 136011 137007 137762 138314 138782 138926 138626 138227 138062 138058 137981 137663 136976 136092 135702 136374 137701 138683 138857 138485
55303 138485 137795 136851 136044 135836 135927 135483 134279 132963 132158 131983 132433 133410 134384 134728 134475 134163 134086 134352 135338
55284 135338 137161 138922 139514 139040 138468 138099 137555 137074 137394 138269 138558 138037 137743 138126 138229 137307 136042 135396
55266 135396 135376 135667 136536 138229 140236 141860 142959 143567 143478 142817 142338 142531 142976 143076 142827 142439 141850 141174
55248 141174 140960 141383 141680 141019 139546 138089 137194 136834 136677 136266 135302 134119 133474 133654 134140 134389 134483 134786
55230 134786 135418 136226 136882 136924 136208 135361 135233 135872 136669 137396 138274 139068 139191 138892 139256 140623 142014 142592
$$ packed form
55357A29123L28M07P36J53j229j914j242k71j03n26p34m07L37J313K208K568K169
55340A32916J214K31k35q9L9m59j181j153l30K78K70M40J170J528Q16r0l5O81
55322A36011R96P55N52M68J44l00l99j65mp7l18o87q84l90O72J327R82J74l72
55303A38485o90r44q07k08R1m44j204j316q05j75M50R77R74L44k53l12p7K66R86
55284A35338J823J761N92m74n72l69n44m81L20Q75K89n21k94L83J03r22j265o46
55266A35396k0K91Q69J693K007J624J099O08q9o61m79J93M45J00k49l88n89o76
55248A41174k14M23K97o61j473j457q95l60j57m11r64j183o45J80M86K49R4L03
55230A34786O32Q08O56M2p16q47j28O39P97P27Q78P94J23k99L64J367J391N78
$$ plain form
55212 142592 142656 142661 142295 141384 140773 141334 142632 143470 143344 142598 141573 140416 139457 139027 138946 138789 138515 138402 138481
55193 138481 138489 138320 138196 138415 139107 140137 141148 141832 142145 142129 141672 140750 139712 138866 138025 137018 136438 137116
55175 137116 138917 140852 142376 143710 144883 145448 145342 145164 145304 145575 145878 146323 146539 145877 144618 143945 144264
55158 144264 144597 144154 143509 143535 144093 144555 144847 145172 145401 145467 145772 146442 146761 146055 144669 143418 142601 142165 142278
55139 142278 142995 143799 144181 144308 144537 144704 144493 144061 143743 143519 143284 143210 143340 143343 143212 143585 144688 145518 144903
55120 144903 143047 141252 140443 140583 141236 141905 142031 141413 140626 140495 141170 142109 142833 143297 143679 144172 144862 145650
55102 145650 146489 147784 150063 152981 155221 155803 155097 154210 153803 153834 153967 153754 152850 151506 150513 150373 150911
55085 150911 151900 153378 155050 156128 156312 156250 156481 156592 156032 155099 154376 153773 152893 151873 151095 150524 150103 150338
$$ packed form
55212A42592O4Nl66r11o11N61J298Q38j26p46j025j157r59m30q1j57k74j13P9
55193A38481Qj69j24K19O92J030J011O84L13j6m57r22j038q46q41j007n80O78
55175A37116J801J935J524J334J173N65j06j78J40K71L03M45K16o62j259o73L19
55158A44264L33m43o45K6N58M62K92L25K29O6L05O70L19p06j386j251q17m36J13
55139A42278P17Q04L82J27K29J67k11m32l18k24k35p4J30Lj31L73J103Q30o15
55120A44903j856j795q09J40O53O69J26o18p87j31O75R39P24M64L82M93O90P88
55102A45650Q39J295K279K918K240N82p06q87m07L1J33k13r04j344r93j40N38
55085A50911R89J478J672J078J84o2K31J11n60r33p23o03q80j020p78n71m21K35
$$ plain form
55067 150338 151638 153341 154276 154108 153470 152977 152813 153118 153996 155078 155682 155461 154606 153481 152359 151274 149939
55050 149939 148179 146675 146688 148554 150991 152476 152846 152979 153416 154055 154796 155669 156483 157025 157499 158204 158978
55033 158978 159468 159764 160231 160888 161403 161519 161076 159865 157949 155937 154575 154190 154693 155714 156543 156548 155995 155944
55015 155944 156855 157900 158078 157444 156765 156582 157077 158215 159447 159958 159821 160084 161105 161684 160744 159008 157962
54998 157962 157867 157956 157966 158231 158680 159013 159544 160677 161825 162025 161475 161252 161649 161942 161715 161285 160802 160043 159192
54979 159192 158787 158819 158812 158851 159568 161081 162861 164653 166553 168159 168767 168571 168578 169145 169599 169583 169718 170543 171710
54960 171710 172683 173409 173846 173632 172764 171920 171623 171618 171479 171300 171356 171638 172114 173046 174561 176202 177279 177497 177061
54941 177061 176384 175872 175783 176224 177256 178848 180567 181751 182435 183724 186597 190670 194890 199172 204426 211033
$$ packed form
55067A50338J300J703R35j68o38m93j64L05Q78J082O04k21q55j125j122j085j335
55050A49939j760j504J3J866K437J485L70J33M37O39P41Q73Q14N42M74P05P74
55033A58978M90K96M67O57N15J16m43j211j916k012j362l85N03J021Q29Nn53n1
55015A55944R11J045J78o34o79j83M95J138J232N11j37K63J021N79r40j736j046
54998A57962r5Q9J0K65M49L33N31J133J148K00n50k23L97K93k27m30m83p59q51
54979A59192m05L2pL9P17J513J780J792J900J606O08j96PN67M54j6J35Q25J167
54960A71710R73P26M37k14q68q44k97nj39j79N6K82M76R32J515J641J077K18m36
54941A77061o77n12q9M41J032J592J719J184O84J289K873M073M220M282N254O607
$$ plain form
54925 211033 218258 225343 232218 238840 244588 248775 251179 251745 250253 246621 241196 234558 227323 220210
54911 220210 213830 208286 203311 198803 194864 191463 188549 186446 185494 185333 185134 184555 183920 183467 183042 182619
54895 182619 182501 182881 183682 184840 186292 187779 189267 191484 195387 201056 207645 214292 220446 225626 229830
54880 229830 234139 239775 246258 251379 253389 252443 249638 245473 239846 232905 225258 217563 210267 203526
54866 203526 197286 191675 187218 184212 182046 179811 177521 176043 175734 175937 175906 175503 174862 174098 173514 173366
54850 173366 173252 172455 171054 169929 169442 168920 167740 166160 164738 163604 162707 162131 161852 161707 161840 162562 163594
54833 163594 164135 163930 163614 163829 164628 165851 167265 168211 168067 167268 166899 166980 166369 164785 163626 163993 165035
54816 165035 165327 164926 164916 165574 166228 166563 166956 167643 168406 169001 169243 168893 168109 167817 168923 171247 173673 175190
$$ packed form
54925B11033P225P085O875O622N748M187K404N66j492l632n425o638p235p113
54911B20210o380n544m975m508l939l401k914k103r52j61j99n79o35m53m25m23
54895A82619j18L80Q01J158J452J487J488K217L903N669O589O647O154N180M204
54880B29830M309N636O483N121K010r46k805m165n627o941p647p695p296o741
54866B03526o240n611m457l006k166k235k290j478l09K03l1m03o41p64n84j48
54850A73366j14p97j401j125m87n22j180j580j422j134q97n76k79j45J33P22J032
54833A63594N41k05l16K15P99J223J414R46j44p99l69Q1o11j584j159L67J042
54816A65035K92m01j0O58O54L35L93O87P63N95K42l50p84k92J106K324K426J517
$$ plain form
54798 175190 175454 174749 173917 173967 175096 176339 176673 176167 175573 175190 174828 174618 175088 176450 178312 180120 181521
54781 181521 182503 183496 185153 187696 190778 194263 198683 204445 211057 217698 224219 230966 237927 244683 250913
54766 250913 256208 259584 259991 257392 252793 247228 241203 235117 229600 225197 221988 219538 217029 213653
54752 213653 209282 204705 200880 198062 195911 194097 192337 190194 187602 185500 185199 186879 189230 190833
54738 190833 191523 192245 193932 196770 200224 203523 206246 208619 211257 214643 218951 224214 230330 236791 242685
54723 242685 247174 249960 251184 250975 249210 245780 241000 235606 230245 225059 219871 214708 209961 206058
54709 206058 203079 200603 197868 194343 190410 187314 186033 186319 187155 187938 188683 189292 189374 188910 188417 188204 187965
54692 187965 187310 186249 185021 183935 183463 183896 184730 185075 184889 185052 185872 186324 185399 183565 182149 181682 181616
$$ packed form
54798A75190K64p05q32N0J129J243L34n06n94l83l62k10M70J362J862J808J401
54781A81521R82R93J657K543L082L485M420N762O612O641O521O747O961O756O230
54766B50913N295L376M07k599m599n565o025o086n517m403l209k450k509l376
54752B13653m371m577l825k818k151j814j760k143k592k102l01J680K351J603
54738A90833O90P22J687K838L454L299K723K373K638L386M308N263O116O461N894
54723B42685M489K786J224k09j765l430m780n394n361n186n188n163m747l903
54709B06058k979k476k735l525l933l096j281K86Q36P83P45O09Q2m64m93k13k39
54692A87965o55j061j228j086m72M33Q34L45j86J63Q20M52r25j834j416m67o6
$$ plain form
54675 181616 181342 180793 180122 179406 178685 177918 176977 175975 175391 175555 176256 177154 178238 179476 180401 180588 180300 180120
54657 180120 180108 179874 179364 178961 178785 178448 177683 176869 176704 177485 178804 179902 180348 180435 180788 181520 182053 181916 181434
54638 181434 181331 181807 182329 182299 181667 180873 180321 179966 179438 178562 177654 177168 177211 177626 178357 179387 180483 181425 182367
54619 182367 183482 184367 184402 183694 183068 183058 183510 184172 184945 185482 185309 184590 184059 183964 183773 183201 182717 182617 182391
54600 182391 181513 180228 179091 178318 178001 178357 179236 179992 180278 180410 180618 180654 180540 180860 181738 182385 182297 182116 182578
54581 182578 183407 184079 184819 185891 186587 186029 184546 183239 182615 182536 183056 184219 185407 185942 186086 186498 186976
54564 186976 186810 186119 185818 186272 186955 187417 187764 188204 188861 189933 191300 192185 191975 191181 190814 191107 191694 192643
54546 192643 194212 195848 196632 196734 197246 198544 199940 201073 202434 204179 205506 205718 205060 204076 202905 201617
$$ packed form
54675A81616k74n49o71p16p21p67r41j002n84J64P01Q98J084J238R25J87k88j80
54657A80120j2k34n10m03j76l37p65q14j65P81J319J098M46Q7L53P32N33j37m82
54638A81434j03M76N22l0o32p94n52l55n28q76r08m86M3M15P31J030J096R42R42
54619A82367J115Q85L5p08o26j0M52O62P73N37j73p19n31r5j91n72m84j00k26
54600A82391q78j285j137p73l17L56Q79P56K86J32K08L6j14L20Q78O47q8j81M62
54581A82578Q29O72P40J072O96n58j483j307o24p9N20J163J188N35J44M12M78
54564A86976j66o91l01M54O83M62L47M40O57J072J367Q85k10p94l67K93N87R49
54546A92643J569J636P84J02N12J298J396J133J361J745J327K12o58r84j171j288
$$ plain form
54530 201617 200616 200205 200232 200449 200762 200967 200764 200215 199743 199642 199998 200947 202322 203222 202799 201530 200781 200949
54512 200949 200967 199940 198365 197240 196767 196557 196547 197011 197922 198803 199173 198946 198507 198411 198836 199424 199884 200484 201505
54493 201505 202564 203093 203265 203702 204465 205153 205820 206872 208063 208640 208573 208687 209340 209954 210124 210167 210184 209575 208144
54474 208144 206923 207166 208992 211498 213744 215192 215746 215852 216246 217217 218391 219374 220117 220575 220619 220567 221124
54457 221124 222434 223733 224244 223883 222880 221329 219537 218211 217829 218194 218862 219553 219946 219651 218702 217518
54441 217518 216197 214410 212260 210584 210076 210680 212049 213884 215579 216366 216299 216315 216870 217282 216982 216564 216833
54424 216833 217477 217569 216946 216289 216138 216516 217273 218248 219246 220226 221202 221765 221258 219808 218476 217871 217294 215935
54406 215935 214268 213461 213898 215113 216735 218643 220455 221748 222598 223259 223577 223410 223309 223948 225093 225959
$$ packed form
54530B01617j001m11K7K17L13K05k03n49m72j01L56R49J375R00m23j269p49J68
54512B00949J8j027j575j125m73k10j0M64R11Q81L70k27m39r6M25N88M60O00J021
54493B01505J059N29J72M37P63O88O67J052J191N77o7J14O53O14J70M3J7o09j431
54474B08144j221K43J826K506K246J448N54J06L94R71J174R83P43M58M4n2N57
54457B21124J310J299N11l61j003j551j792j326l82L65O68O91L93k95r49j184
54441B17518j321j787k150j676n08O04J369J835J695P87o7J6N55M12l00m18K69
54424B16833O44R2o23o57j51L78P57R75R98R80R76N63n07j450j332o05n77j359
54406B15935j667q07M37J215J622J908J812J293Q50O61L18j67j01O39J145Q66
$$ plain form
54390 225959 226462 227314 228945 231012 232960 234337 234675 233819 232410 231330 230614 229585 228031 226491 225269
54375 225269 224002 222494 221286 220922 221168 221443 221673 222293 223551 225236 227007 228711 230301 231625 232497 233071
54359 233071 233964 235694 237951 239776 240635 240910 241066 240832 239693 237858 236111 234850 233828 232770 231684
54344 231684 230580 229378 228196 227276 226561 225722 224647 223545 222506 221379 220190 219276 218871 218818 218825 218770 218658
54327 218658 218545 218516 218491 218016 216643 214715 213417 213734 215383 217006 217394 216429 214891 213543 212566 211809 211286
54310 211286 211080 210916 210317 209398 209052 209963 211657 212982 213330 212981 212378 211632 210812 210204 209996 210014 210007 209977 210043 210215
54290 210215 210529 211204 212331 213490 214049 213900 213624 213792 214315 214718 214818 214766 214475 213555 211997 210557 210077 210646
54272 210646 211692 212747 213705 214501 214976 215152 215330 215866 217045 219052 221736 224452 226502 227692 228219 228156
$$ packed form
54390B25959N03Q52J631K067J948J377L38q56j409j080p16j029j554j540j222
54375B25269j267j508j208l64K46K75K30O20J258J685J771J704J590J324Q72N74
54359B33071Q93J730K257J825Q59K75J56k34j139j835j747j261j022j058j086
54344B31684j104j202j182r20p15q39j075j102j039j127j189r14m05n3Pn5j12
54327B18658j13k9k5m75j373j928j298L17J649J623L88r65j538j348r77p57n23
54310B11286k06j64n99r19l46R11J694J325L48l49o03p46q20o08k08J8pl0O6J72
54290B10215L14O75J127J159N59j49k76J68N23M03J00n2k91r20j558j440m80N69
54272B10646J046J055R58P96M75J76J78N36J179K007K684K716K050J190N27o3
$$ plain form
54256 228156 227502 226616 226074 226035 226182 226225 226004 225185 223551 221705 220819 221411 222905 224488 225777 226460 226054 224554
54238 224554 222774 221615 221289 221545 222103 222595 222659 222573 223226 225009 227195 228850 229866 230598 231047 231081 231066 231529
54220 231529 232409 233198 233691 234087 234566 235148 235686 235688 234578 232635 231175 231147 231908 232099 231379 230501 229995 229652 229248
54201 229248 228951 228864 228828 228814 228971 229207 229179 228786 228227 227561 226617 225355 223952 222584 221524 221315 222304 224008
54183 224008 225403 225851 225432 224509 223510 223017 223435 224439 225186 225165 224530 223594 222490 221370 220484 219954 219741 219857
54165 219857 220244 220459 219917 218511 216707 215032 213769 213117 213197 213811 214514 215033 215456 216053 217098 218746 220783
54148 220783 222551 223442 223366 222641 221615 220667 220229 220385 220648 220566 220329 220384 220736 221121 221614 222468 223520 224384 225088
54129 225088 225955 226928 227593 227812 227768 227521 227129 227116 228077 229843 231670 233269 234925 236615 237889 238815 240240
$$ packed form
54256B28156o54q86n42l9J47M3k21q19j634j846q86N92J494J583J289O83m06j500
54238B24554j780j159l26K56N58M92O4q6O53J783K186J655J016P32M49L4j5M63
54220B31529Q80P89M93L96M79N82N38Kj110j943j460k8P61J91p20q78n06l43m04
54201B29248k97q7l6j4J57K36k8l93n59o66r44j262j403j368j060k09R89J704
54183B24008J395M48m19r23r99m93M18J004P47k1o35r36j104j120q86n30k13J16
54165B19857L87K15n42j406j804j675j263o52Q0O14P03N19M23N97J045J648K037
54148B20783J768Q91p6p25j026r48m38J56K63q2k37N5L52L85M93Q54J052Q64P04
54129B25088Q67R73O65K19m4k47l92j3R61J766J827J599J656J690J274R26J425
$$ plain form
54112 240240 242683 245605 248150 250109 251814 253514 255266 257133 259163 261367 263808 266524 269378 272389
54098 272389 276175 281528 288548 296718 305817 316009 326834 336807 344408 348986 350454 348807 344361 337919
54084 337919 330122 321055 310991 301108 292828 286634 282051 278640 276437 275463 275392 275928 277200 279555 283093
54069 283093 287530 292498 297757 302991 307540 310672 312258 312789 312530 311027 307879 303599 299133 294774 290240
54054 290240 285643 281560 278158 275161 272887 272355 273849 276132 277700 278350 278965 280266 282429 285550 289639
54039 289639 294218 298586 302643 307025 312291 318281 324325 329847 334638 338755 342441 346118 350309 355238
54025 355238 360430 364896 367953 369775 370975 371929 372804 373894 375277 376202 375587 373332 370591 368426 366653
54010 366653 364294 360715 355950 350297 344128 337932 332097 326663 321533 316915 313243 310617 308525 306236
$$ packed form
54112B40240K443K922K545J959J705J700J752J867K030K204K441K716K854L011
54098B72389L786N353P020Q170R099J0192J0825R973P601M578J468j647m446o442
54084C37919p797r067j0064r883q280o194m583l411k203r74p1N36J272K355L538
54069B83093M437M968N259N234M549L132J586N31k59j503l148m280m466m359m534
54054B90240m597m083l402k997k274n32J494K283J568O50O15J301K163L121M089
54039B89639M579M368M057M382N266N990O044N522M791M117L686L677M191M929
54025C55238N192M466L057J822J200R54Q75J090J383R25o15k255k741k165j773
54010C66653k359l579m765n653o169o196n835n434n130m618l672k626k092k289
$$ plain form
53996 306236 303534 300968 299231 298266 297221 295413 293050 290855 289286 288446 288306 288406 287695 285471 282414
53981 282414 280005 278879 278399 277871 277331 276985 276665 276232 275879 275676 275354 274865 274603 274694 274637 274106 273626 273968 275226
53962 275226 276912 278668 280448 282260 284118 286097 288242 290617 293575 297551 302438 307645 313013 319252
53948 319252 327160 336886 348236 361209 375720 391096 406221 419948 431166 438873 442580 442444 438945
53935 438945 432812 425282 417722 410684 403946 397736 393092 390511 389114 387892 387131 387737 389723 392324 395267
53920 395267 398947 403536 408800 414743 421559 428954 436225 443093 449809 456467 462864 469074 475431 481755
53906 481755 487224 491208 493820 495444 496154 495826 494475 492271 489426 486167 482640 478804 474569 469972 464985
53891 464985 459334 452806 445635 438292 430972 423622 416315 409196 402176 395112 388279 382205 377028 372364
$$ packed form
53996C06236k702k566j737r65j045j808k363k195j569q40j40J00p11k224l057
53981B82414k409j126m80n28n40l46l20m33l53k03l22m89k62R1n7n31m80L42J258
53962B75226J686J756J780J812J858J979K145K375K958L976M887N207N368O239
53948C19252P908R726J1350J2973J4511J5376J5125J3727J1218P707L707j36l499
53935D38945o133p530p560p038o738o210m644k581j397j222p61O06J986K601K943
53920C95267L680M589N264N943O816P395P271O868O716O658O397O210O357O324
53906D81755N469L984K612J624P10l28j351k204k845l259l527l836m235m597m987
53891D64985n651o528p171p343p320p350p307p119p020p064o833o074n177m664
$$ plain form
53877 372364 367832 363378 359025 354676 350261 345869 341626 337565 333675 330016 326850 324571 323182 321843
53863 321843 319404 315696 311848 308961 306941 305059 303135 301449 299847 297827 295456 293423 292109 291154
53849 291154 290017 288430 286366 284128 282470 282001 282382 282661 282437 282117 282045 282083 282260 282999 284351 285611 286158
53832 286158 286192 286171 285961 285082 283536 281913 280756 280221 280252 280810 281918 283647 285947 288388 290326 291544 292580
53815 292580 294170 296450 298896 301010 302871 305017 307861 311283 314776 318049 321351 325078 329193 333296
53801 333296 337221 341265 345798 350944 356684 362884 369071 374526 378922 382711 386590 390634 394195 396649
53787 396649 398042 398912 399537 399509 398165 395416 391961 388577 385319 381652 377237 372386 367690 363430 359369
53772 359369 354998 349967 344454 339115 334522 330590 326704 322414 317955 314059 311378 309957 309140 307975
$$ packed form
53877C72364m532m454m353m349m415m392m243m061l890l659l166k279j389j339
53863C21843k439l708l848k887k020j882j924j686j602k020k371k033j314r55
53849B91154j137j587k064k238j658m69L81K79k24l20p2L8J77P39J352J260N47
53832B86158L4k1k10q79j546j623j157n35L1N58J108J729K300K441J938J218J036
53815B92580J590K280K446K114J861K146K844L422L493L273L302L727M115M103
53801C33296L925M044M533N146N740O200O187N455M396L789L879M044L561K454
53787C96649J393Q70O25k8j344k749l455l384l258l667m415m851m696m260m061
53772C59369m371n031n513n339m593l932l886m290m459l896k681j421q17j165
$$ plain form
53758 307975 305898 303054 300008 297223 294885 293019 291575 290460 289602 288930 288240 287319 286278 285499 285044 284420
53742 284420 283267 281992 281354 281604 282420 283485 284691 285884 286917 287873 288798 289249 288662 287221 285840 285133
53726 285133 284858 284559 284355 284765 286050 287951 289932 291473 292363 292895 293743 295487 298219 301527 304781 307569
53710 307569 310058 312818 316094 319408 322179 324507 326859 329157 330837 331917 333353 336002 339627 343282
53696 343282 346362 348916 351214 353457 355841 358539 361485 364251 366230 367015 366704 365842 364969 364297 363921 364072
53680 364072 364820 365662 365901 365498 365129 365286 365783 366302 366924 367732 368286 368005 366976 365933 365431 365339 365237 365009
53662 365009 364873 364973 365140 365129 364934 364655 364108 362877 360944 359054 358127 358422 359465 360708 361888 362875 363562
53645 363562 363952 364057 363695 362743 361597 360950 361024 361446 362049 363363 365909 369297 372431 374523 375632 376287 376906
$$ packed form
53758C07975k077k844l046k785k338j866j444j115q58o72o90r21j041p79m55o24
53742B84420j153j275o38K50Q16J065J206J193J033R56R25M51n87j441j381p07
53726B85133k75k99k04M10J285J901J981J541Q90N32Q48J744K732L308L254K788
53710C07569K489K760L276L314K771K328K352K298J680J080J436K649L625L655
53696C43282L080K554K298K243K384K698K946K766J979P85l11q62q73o72l76J51
53680C64072P48Q42K39m03l69J57M97N19O22Q08N54k81j029j043n02r2j02k28
53662C65009j36J00J67j1j95k79n47j231j933j890r27K95J043J243J180R87O87
53645C63562L90J05l62r52j146o47P4M22O03J314K546L388L134K092J109O55O19
$$ plain form
53628 376906 377651 378636 380003 381745 383564 385160 386689 388732 391650 395186 398886 402638 406486 410165 413331
53613 413331 416203 419524 423826 429093 435096 441604 448257 454755 461275 468206 475318 481708 486838 491089
53599 491089 495014 498474 500982 502525 503540 504298 504725 504744 504372 503538 502134 500275 498247 496209 494090 491759
53583 491759 489199 486575 484180 482265 480806 479533 478158 476489 474395 471966 469654 467843 466202 463923
53569 463923 460825 457833 456037 455543 455539 455178 454041 452012 449287 446523 444635 444232 445250 446969 448342 448671
53553 448671 448312 448531 450267 453105 455768 457506 458635 459756 460925 461724 461824 461262 460388 459745 459908 461186
53537 461186 463455 466351 469597 473119 476905 480924 485241 490137 495934 502631 509785 516892 523875 531177
53523 531177 539454 549203 560569 573281 586749 600393 613934 627378 640859 654644 669176 684825
$$ packed form
53628C76906P45R85J367J742J819J596J529K043K918L536L700L752L848L679L166
53613D13331K872L321M302N267O003O508O653O498O520O931P112O390N130M251
53599D91089L925L460K508J543J015P58M27J9l72q34j404j859k028k038k119k331
53583D91759k560k624k395j915j459j273j375j669k094k429k312j811j641k279
53569D63923l098k992j796m94ml61j137k029k725k764j888m03J018J719J373L29
53553D48671l59K19J736K838K663J738J129J121J169P99J00n62q74o43J63J278
53537D61186K269K896L246L522L786M019M317M896N797O697P154P107O983P302
53523E31177Q277R749J1366J2712J3468J3644J3541J3444J3481J3785J4532J5649
$$ plain form
53511 684825 701570 719085 737101 755553 774461 793943 814262 835525 857313 878880 899792
53500 899792 920135 940109 959729 979009 998113 1017189 1036284 1055539 1075223 1095468 1116191
53489 1116191 1137292 1158641 1179763 1199893 1218609 1236217 1253331 1270209 1286690 1302661 1318383
53478 1318383 1334319 1350626 1366825 1382162 1396477 1410533 1425123 1439922 1453563 1464833 1473524
53467 1473524 1480146 1485221 1488800 1490321 1488905 1484246 1477148 1468788 1459564 1449184 1437692 1425584 1412847
53454 1412847 1398880 1383697 1368349 1353576 1338741 1322729 1305345 1287224 1268858 1250430 1232174
53443 1232174 1214162 1195963 1177192 1158221 1139807 1122264 1105583 1090118 1076462 1064776 1054849
53432 1054849 1046717 1040559 1036016 1032239 1028761 1025869 1024121 1023942 1025689 1029547 1035213 1042088 1049883 1058765
$$ packed form
53511F84825J6745J7515J8016J8452J8908J9482K0319K1263K1788K1567K0912
53500H99792K0343J9974J9620J9280J9104J9076J9095J9255J9684K0245K0723
53489A116191K1101K1349K1122K0130J8716J7608J7114J6878J6481J5971J5722
53478A318383J5936J6307J6199J5337J4315J4056J4590J4799J3641J1270Q691
53467A473524O622N075L579J521j416m659p098q360r224j0380j1492j2108j2737
53454A412847j3967j5183j5348j4773j4835j6012j7384j8121j8366j8428j8256
53443A232174j8012j8199j8771j8971j8414j7543j6681j5465j3656j1686r927
53432A054849q132o158m543l777l478k892j748j79J747L858N666O875P795Q882
$$ plain form
53418 1058765 1068950 1080539 1093712 1108599 1124855 1141759 1158872 1176330 1194486 1213597 1233848
53407 1233848 1255275 1277639 1300757 1325046 1351351 1380121 1411072 1443772 1478202 1514528 1552617
53396 1552617 1592015 1632408 1674041 1717724 1764222 1813399 1864057 1914949 1965878 2017452 2069879
53385 2069879 2122511 2174605 2225981 2276704 2326541 2375078 2422094 2467541 2511304 2553193 2593005
53374 2593005 2630398 2664911 2696356 2724990 2751017 2773952 2792804 2806904 2816321 2821265 2821197 2814822
53362 2814822 2801080 2779989 2752371 2718956 2680113 2636470 2589287 2539884 2488964 2436815 2383970
53351 2383970 2331234 2279092 2227539 2176583 2126639 2078252 2031605 1986452 1942488 1899650 1857958
53340 1857958 1817074 1776248 1735005 1693797 1653642 1615112 1578118 1542787 1509939 1480277 1453580
$$ packed form
53418A058765J0185J1589J3173J4887J6256J6904J7113J7458J8156J9111K0251
53407A233848K1427K2364K3118K4289K6305K8770L0951L2700L4430L6326L8089
53396A552617L9398M0393M1633M3683M6498M9177N0658N0892N0929N1574N2427
53385B069879N2632N2094N1376N0723M9837M8537M7016M5447M3763M1889L9812
53374B593005L7393L4513L1445K8634K6027K2935J8852J4100R417M944o8o375
53362B814822j3742k1091k7618l3415l8843m3643m7183m9403n0920n2149n2845
53351B383970n2736n2142n1553n0956m9944m8387m6647m5153m3964m2838m1692
53340A857958m0884m0826m1243m1208m0155l8530l6994l5331l2848k9662k6697
$$ plain form
53329 1453580 1429208 1407046 1387349 1369886 1353898 1338849 1324695 1311397 1298686 1286317 1274095
53318 1274095 1261713 1249020 1236436 1224642 1213808 1203569 1193731 1184534 1176246 1169068 1163447 1159857
53306 1159857 1158089 1157321 1157074 1157585 1159121 1161587 1165147 1170524 1178187 1187693 1198344 1210138 1223506 1238439
53292 1238439 1254518 1271661 1290216 1310244 1331226 1352692 1374820 1398150 1422800 1448055 1472650
53281 1472650 1495494 1516209 1535140 1552958 1570269 1587392 1604136 1619687 1632924 1642995 1649635
53270 1649635 1653032 1653607 1651827 1647915 1641681 1632864 1621595 1608186 1592543 1574295 1553592 1531243 1507721
53257 1507721 1482544 1455081 1425660 1395420 1365238 1335263 1305382 1275649 1246194 1217086 1188462
53246 1188462 1160651 1134065 1108956 1085173 1062100 1038965 1015333 991251 966891 942373 917993
$$ packed form
53329A453580k4372k2162j9697j7463j5988j5049j4154j3298j2711j2369j2222
53318A274095j2382j2693j2584j1794j0834j0239r838r197q288p178n621l590
53306A159857j768p68k47N11J536K466L560N377P663R506J0651J1794J3368J4933
53292A238439J6079J7143J8555K0028K0982K1466K2128K3330K4650K5255K4595
53281A472650K2844K0715J8931J7818J7311J7123J6744J5551J3237J0071O640
53270A649635L397N75j780l912o234q817j1269j3409j5643j8248k0703k2349k3522
53257A507721k5177k7463k9421l0240l0182k9975k9881k9733k9455k9108k8624
53246A188462k7811k6586k5109k3783k3073k3135k3632k4082k4360k4518k4380
$$ plain form
53235 917993 894274 871476 849339 827695 807073 788302 771555 756297 742139 729289 717998
53224 717998 708025 698889 690416 682719 675764 669151 662303 654685 645940 636004 625169 613868 602324
53211 602324 590447 578276 566422 555806 546683 538111 528801 518594 508736 500511 493960 488265 483063
53198 483063 478736 475359 472010 467522 461647 455084 448469 441773 434766 427726 421358 416052 411473 406970
53184 406970 402286 397677 393440 389498 385584 381705 378206 375306 372760 370147 367474 365236 363786 362813
53170 362813 361657 360063 358312 356626 354814 352747 350839 349655 349133 348579 347554 346406 345793 345855 346063 345741
53154 345741 344583 342773 340775 338975 337448 335999 334444 332797 331177 329693 328425 327438 326728 326273 326118
53139 326118 326264 326416 326060 325020 323793 323188 323671 325223 327610 330459 333133 334988 336036 337077 338913
$$ packed form
53235I17993k3719k2798k2137k1644k0622j8771j6747j5258j4158j2850j1291
53224G17998r973r136q473p697o955o613o848p618q745r936j0835j1301j1544
53211F02324j1877j2171j1854j0616r123q572r310j0207r858q225o551n695n202
53198D83063m327l377l349m488n875o563o615o696p007p040o368n306m579m503
53184D06970m684m609m237l942l914l879l499k900k546k613k673k238j450r73
53170C62813j156j594j751j686j812k067j908j184n22n54j025j148o13O2K08l22
53154C45741j158j810j998j800j527j449j555j647j620j484j268r87p10m55j55
53139C26118J46J52l56j040j227o05M83J552K387K849K674J855J048J041J836
$$ plain form
53124 338913 341566 344515 347498 350669 353988 356975 359312 361353 363717 366554 369540 372407 375094 377427
53110 377427 379027 379620 379192 377844 375754 373258 370590 367525 363716 359458 355622 352650 350116 347625 345576
53095 345576 344463 343828 342691 340893 339259 338368 337809 336949 335841 334960 334426 333997 333672 333783 334361 334779 334343
53078 334343 333151 332039 331603 331560 331370 331161 331457 332044 331883 330473 328682 327611 327151 326355 324909 323372 322095
53061 322095 320800 319375 318266 317784 317719 317950 318751 320070 321106 321245 320969 321235 322196 323184 323722 323892 323809 323463
53043 323463 323203 323728 325164 326551 326637 325085 322691 320597 319572 319814 321030 322618 324059 325277 326454
53028 326454 327459 327750 326997 325545 323968 322408 320750 319278 318587 318826 319597 320753 322704 325604 328794
53013 328794 331483 333487 334833 335178 334413 333446 333490 334645 335975 336878 337470 337627 336774 334989 333397 332900 333188
$$ packed form
53124C38913K653K949K983L171L319K987K337K041K364K837K986K867K687K333
53110C77427J600N93m28j348k090k496k668l065l809m258l836k972k534k491k049
53095C45576j113o35j137j798j634q91n59q60j108q81n34m29l25J11N78M18m36
53078C34343j192j112m36m3j90k09K96N87j61j410j791j071m60p96j446j537j277
53061C22095j295j425j109m82o5K31Q01J319J036J39k76K66R61R88N38J70q3l46
53043C23463k60N25J436J387Q6j552k394k094j025K42J216J588J441J218J177
53028C26454J005K91p53j452j577j560j658j472o91K39P71J156J951K900L190
53013C28794K689K004J346L45p65r67M4J155J330R03N92J57q53j785j592m97K88
$$ plain form
52996 333188 333486 333544 333341 332562 331270 330525 331340 333227 334751 335451 336330 338367 341351 344456 347207 349503
52980 349503 351275 352582 353669 354515 354699 354091 353370 353311 353815 354186 354262 354677 355908 357665 359465 361294 363318
52963 363318 365355 367138 368839 370704 372316 372895 372366 371420 370303 368224 364456 359490 354558 350396 347043
52948 347043 344462 342626 341135 339528 337993 337168 337154 337292 336989 336232 335189 333905 332551 331462 330701 330056
52932 330056 329582 329638 330165 330492 330190 329597 329171 328836 328421 328278 328832 329783 330331 330099 329409 328779 328535 328890 329886
52913 329886 331159 332022 332002 331233 330335 329897 330004 330225 330136 329865 329896 330437 331210 331852 332196 332128 331566 330700 329920 329387
52893 329387 329021 328955 329513 330633 331826 332882 334035 335151 335430 334446 332981 332246 332637 333788 335456 337598
52877 337598 339819 341486 342439 343074 343734 344484 345479 347050 349359 352223 355295 358101 360062 360902 361043 361294
$$ packed form
52996C33188K98N8k03p79j292p45Q15J887J524P00Q79K037K984L105K751K296
52980C49503J772J307J087Q46J84o08p21n9N04L71P6M15J231J757J800J829K024
52963C63318K037J783J701J865J612N79n29r46j117k079l768m966m932m162l353
52948C47043k581j836j491j607j535q25j4J38l03p57j043j284j354j089p61o45
52932C30056m74N6N27L27l02n93m26l35m15j43N54R51N48k32o90o30k44L55R96
52913C29886J273Q63k0p69q98m38J07K21q9k71L1N41P73O42L44o8n62q66p80n33
52893C29387l66o6N58J120J193J056J153J116K79r84j465p35L91J151J668K142
52877C37598K221J667R53O35O60P50R95J571K309K864L072K806J961Q40J41K51
$$ plain form
52861 361294 362143 363530 365104 366363 366705 365809 363969 361693 359041 355718 351784 347884 344757 342722 341564
52846 341564 340590 338952 336271 332966 329671 326550 323540 321082 319928 320085 320544 320338 319569 319132 319647 320878
52830 320878 322103 322855 323276 323752 324267 324336 323637 322426 321098 319623 317809 315932 314662 314373 314914 316071
52814 316071 317919 320676 324407 328825 333192 336555 338432 339198 339483 339311 338209 336078 333482 331017 328798
52799 328798 326660 324523 322376 320159 317852 315590 313647 312343 311820 311787 311655 311183 310816 311070 311782 312339
52783 312339 312527 312667 312988 313337 313598 313972 314701 315771 316941 317813 317884 316927 315423 314329 314250 314973 315794 316171
52765 316171 316115 316191 317017 318542 319939 320487 320393 320431 320988 321908 323076 324600 326415 328197 329742 331017 331891
52748 331891 332302 332656 333516 334823 335915 336369 336349 336078 335575 335073 335083 335702 336344 336507 336434 336717 337564 338750 340017
$$ packed form
52861C61294Q49J387J574J259L42q96j840k276k652l323l934l900l127k035j158
52846C41564r74j638k681l305l295l121l010k458j154J57M59k06p69m37N15J231
52830C20878J225P52M21M76N15O9o99j211j328j475j814j877j270k89N41J157
52814C16071J848K757L731M418M367L363J877P66K85j72j102k131k596k465k219
52799C28798k138k137k147k217k307k262j943j304n23l3j32m72l67K54P12N57
52783C12339J88J40L21L49K61L74P29J070J170Q72P1r57j504j094p9P23Q21L77
52765C16171n6P6Q26J525J397N48r4L8N57R20J168J524J815J782J545J275Q74
52748C31891M11L54Q60J307J092M54k0k71n03n02J0O19O42J63p3K83Q47J186J267
$$ plain form
52729 340017 341253 342469 343784 345181 346204 346270 345372 344133 343042 342022 340896 339788 338829 337919 337057 336470
52713 336470 336055 335159 333371 331200 329513 328574 328028 327563 327047 326263 325054 323726 322826 322519 322543 322808 323648
52696 323648 325367 327835 330549 332836 334010 333686 332193 330503 329504 329380 329706 330134 330889 332530 335200 338132
52680 338132 340044 340210 339090 337821 337115 336806 336444 336032 335936 336232 336519 336513 336500 336958 337892 338929 339906 340920
52662 340920 341808 342113 341789 341415 341489 341955 342793 344526 347569 351391 354934 357684 359776 361282 362045 362120 361760
52645 361760 360942 359457 357502 355655 354271 353401 353251 354075 355543 356862 357697 358464 359582 361008 362593 364322
52629 364322 366020 367442 368823 370720 372978 374442 374027 371621 367787 363263 359101 356501 355756 355747 355063 353414
52613 353414 351543 350187 349659 350051 351146 352212 352480 351945 351369 351478 352286 353157 353389 352877 352255 352193 352608 352876
$$ packed form
52729C40017J236J216J315J397J023O6q98j239j091j020j126j108r59r10q62n87
52713C36470m15q96j788k171j687r39n46m65n16p84j209j328r00l07K4K65Q40
52696C23648J719K468K714K287J174l24j493j690r99j24L26M28P55J641K670K932
52680C38132J912J66j120j269p06l09l62m12r6K96K87oj3M58R34J037R77J014
52662C40920Q88L05l24l74P4M66Q38J733L043L822L543K750K092J506P63P5l60
52645C61760q18j485j955j847j384q70j50Q24J468J319Q35P67J118J426J585J729
52629C64322J698J422J381J897K258J464m15k406l834m524m162k600p45ro84j649
52613C53414j871j356n28L92J095J066K68n35n76J09Q08Q71K32n12o22o2M15K68
$$ plain form
52595 352876 352803 352812 353132 353493 353921 355115 357484 360385 362843 364608 365936 366820 367138 367206 367425 367558 367024 365848
52577 365848 364775 364508 365286 367038 369371 371500 372737 373068 372858 372136 370675 368641 366615 364971 363698
52562 363698 362793 362266 361765 360791 359453 358580 358877 360222 361876 363046 363234 362433 361145 359974 359107 358320 357462
52545 357462 356649 356072 355931 356502 357844 359363 360130 359867 359363 359708 361262 363492 365630 367327 368725 370079
52529 370079 371382 372374 372850 372881 372742 372750 373190 374151 375334 376204 376535 376704 377313 378667 380622 382732 384485 385682
52511 385682 386717 388205 390190 392042 393230 393826 394075 393933 393289 392151 390273 387142 382812 378357 374893
52496 374893 372523 370730 369405 368765 368571 368231 367589 366946 366371 365651 364864 364320 363916 363241 362398 362116 362887 364487
52478 364487 366429 368345 369861 370644 370796 370768 370861 371209 372244 374480 377737 381210 384472 387768 391085 393627
$$ packed form
52595C52876p3RL20L61M28J194K369K901K458J765J328Q84L18O8K19J33n34j176
52577C65848j073k67P78J752K333K129J237L31k10p22j461k034k026j644j273
52562C63698r05n27n01r74j338q73K97J345J654J170J88q01j288j171q67p87q58
52545C57462q13n77j41N71J342J519P67k63n04L45J554K230K138J697J398J354
52529C70079J303R92M76L1j39QM40R61J183Q70L31J69O09J354J955K110J753J197
52511C85682J035J488J985J852J188N96K49j42o44j138j878l131m330m455l464
52496C74893k370j793j325o40j94l40o42o43n75p20p87n44m04o75q43k82P71J600
52478C64487J942J916J516P83J52k8R3L48J035K236L257L473L262L296L317K542
$$ plain form
52462 393627 394696 394519 393748 392622 391165 389692 388401 386644 383417 378684 373679 369709 367003 364900 362852
52447 362852 360917 359398 358352 357610 357094 356900 357045 357359 357746 358341 359219 360067 360391 360011 359220 358493 358156 358240
52429 358240 358507 358686 358781 359007 359405 359857 360557 361985 364030 365652 365976 365445 365239 365824 366855 368400 371249
52412 371249 375700 380792 385327 389341 394207 401436 411533 423772 436862 449936 462871 475502 486756
52399 486756 495008 499212 499194 495016 486839 475619 463177 451120 440059 430084 421457 414446 408990 405020
52385 405020 402787 402419 403383 404799 406108 407105 407618 407608 407455 407745 408795 410626 413296 416913 421323 425993
52369 425993 430243 433508 435496 436264 436072 435098 433397 431175 428907 427059 425876 425476 425909 426916 427844 428065
52353 428065 427461 426463 425716 425738 426704 428375 430337 432347 434377 436401 438374 440393 442631 445073 447565 450094
$$ packed form
52462C93627J069j77p71j126j457j473j291j757l227m733n005l970k706k103k048
52447C62852j935j519j046p42n16j94J45L14L87N95Q78Q48L24l80p91p27l37Q4
52429C58240K67J79R5K26L98M52P00J428K045J622L24n31k06N85J031J545K849
52412C71249M451N092M535M014M866P229J0097J2239J3090J3074J2935J2631J1254
52399D86756Q252M204j8m178q177j1220j2442j2057j1061r975q627p011n456l970
52385D05020k233l68R64J416J309R97N13j0j53K90J050J831K670L617M410M670
52369D25993M250L265J988P68j92r74j701k222k268j848j183m00M33J007R28K21
52353D28065o04r98p47K2R66J671J962K010K030K024J973K019K238K442K492K529
$$ plain form
52337 450094 452733 455382 457976 460957 465099 470684 477241 484178 491262 498455 505868 514114 523987 535328
52323 535328 546668 556564 564980 572853 580724 588466 596193 604627 614373 625347 637148 649609 662771
52310 662771 676561 690782 705366 720438 736116 752385 769299 787245 806749 827766 849315
52299 849315 870145 889754 908427 926337 943009 957770 970269 980452 988487 995020 1001027 1007020
52287 1007020 1012674 1017527 1021674 1025392 1028448 1030347 1031074 1031088 1030724 1030055 1029251 1028530 1027787 1026747 1025577 1024889
52271 1024889 1025016 1025631 1026227 1026673 1027122 1027689 1028456 1029591 1031231 1033370 1036097 1039914 1045549 1053330 1062859 1073433
52255 1073433 1084797 1097189 1110634 1124432 1137683 1150180 1162390 1174538 1186091 1196321 1205029
52244 1205029 1212541 1219250 1225440 1231357 1237171 1242880 1248396 1253517 1257734 1260359 1261157 1260697 1259833 1258880 1257478
$$ packed form
52337D50094K639K649K594K981M142N585O557O937P084P193P413Q246R873J1341
52323E35328J1340R896Q416P873P871P742P727Q434R746J0974J1801J2461J3162
52310F62771J3790J4221J4584J5072J5678J6269J6914J7946J9504K1017K1549
52299H49315K0830J9609J8673J7910J6672J4761J2499J0183Q035O533O007N993
52287A007020N654M853M147L718L056J899P27J4l64o69q04p21p43j040j170o88
52271A024889J27O15N96M46M49N67P67J135J640K139K727L817N635P781R529J0574
52255A073433J1364J2392J3445J3798J3251J2497J2210J2148J1553J0230Q708
52244A205029P512O709O190N917N814N709N516N121M217K625P98m60q64r53j402
$$ plain form
52229 1257478 1255186 1251985 1248228 1244210 1239747 1234215 1227236 1219367 1211843 1205485 1200153 1195334 1190909 1186991
52215 1186991 1183427 1179884 1176334 1173063 1170333 1168338 1167353 1167523 1168597 1170183 1172199 1174763 1177749 1180834
52201 1180834 1184022 1187766 1192517 1198416 1205374 1213162 1221350 1229445 1237200 1244548 1251197 1256542 1260174 1262287
52187 1262287 1263407 1263789 1263203 1261285 1258033 1253931 1249615 1245451 1241467 1237588 1233761 1229843 1225577 1220880
52173 1220880 1216032 1211425 1207161 1203030 1198877 1194922 1191678 1189535 1188350 1187541 1186727 1186162 1186334 1187212 1188226
52158 1188226 1188956 1189456 1189791 1189706 1189053 1188260 1188136 1189260 1191665 1194860 1198101 1200912 1203520 1206532 1210122 1213822
52142 1213822 1217085 1219544 1220720 1220190 1218355 1216393 1215002 1213809 1212514 1211886 1212835 1215063 1217672 1220820 1225696
52127 1225696 1232848 1241500 1250733 1260518 1271237 1282880 1295204 1308183 1321798 1335544 1348548 1360162
$$ packed form
52229A257478k292l201l757m018m463n532o979p869p524o358n332m819m425l918
52215A186991l564l543l550l271k730j995r85J70J074J586K016K564K986L085
52201A180834L188L744M751N899O958P788Q188Q095P755P348O649N345L632K113
52187A262287J120L82n86j918l252m102m316m164l984l879l827l918m266m697
52173A220880m848m607m264m131m153l955l244k143j185q09q14n65J72Q78J014
52158A188226P30N00L35q5o53p93j24J124K405L195L241K811K608L012L590L700
52142A213822L263K459J176n30j835j962j391j193j295o28R49K228K609L148M876
52127A225696P152Q652R233R785J0719J1643J2324J2979J3615J3746J3004J1614
$$ plain form
52115 1360162 1370409 1380025 1390068 1401284 1413749 1427174 1441418 1456490 1472312 1488836 1506280
52104 1506280 1524856 1544342 1564287 1584458 1604617 1623989 1641502 1656540 1668966 1678466 1684616 1687662
52092 1687662 1688644 1688460 1687338 1685427 1683263 1681250 1679122 1676400 1673118 1669711 1666357 1662726 1658243 1652444
52078 1652444 1645262 1637093 1628456 1619500 1610086 1600342 1590793 1581836 1573601 1566483 1561359 1558836 1558561 1559616
52064 1559616 1561487 1564440 1569170 1576294 1585929 1597515 1610107 1623012 1635941 1648480 1659828 1669373
52052 1669373 1677258 1684067 1690089 1695162 1699028 1701610 1703121 1704191 1705671 1707945 1710521 1712630 1714141 1715565
52038 1715565 1717190 1718538 1718735 1717204 1713951 1709377 1703843 1697326 1689555 1680509 1670674 1660623 1650508 1640256
52024 1640256 1630134 1620743 1612361 1604662 1597326 1590663 1585333 1581506 1578641 1576152 1573982 1572293 1570740 1568385
$$ packed form
52115A360162J0247R616J0043J1216J2465J3425J4244J5072J5822J6524J7444
52104A506280J8576J9486J9945K0171K0159J9372J7513J5038J2426R500O150L046
52092A687662R82j84j122j911k164k013k128k722l282l407l354l631m483n799
52078A652444p182q169q637q956r414r744r549q957q235p118n124k523k75J055
52064A559616J871K953M730P124R635J1586J2592J2905J2929J2539J1348R545
52052A669373P885O809O022N073L866K582J511J070J480K274K576K109J511J424
52038A715565J625J348J97j531l253m574n534o517p771r046r835j0051j0115j0252
52024A640256j0122r391q382p699p336o663n330l827k865k489k170j689j553k355
$$ plain form
52010 1568385 1564317 1558120 1549679 1538794 1525168 1508625 1489321 1468003 1446077 1424987 1405175 1385931
51998 1385931 1366497 1346920 1327452 1307593 1286482 1263996 1240665 1216567 1191164 1164441 1137424
51987 1137424 1111206 1086060 1061787 1038258 1015190 991934 968165 944449 921685 900364 880822
51976 880822 863753 849749 838485 829074 821203 815496 812691 812887 815532 819699 824292 828341 831239 832625
51962 832625 832202 829877 825807 819951 811891 801562 790033 778972 769395 761393 754934 750263 747425 746164
51948 746164 746570 749315 754862 762801 772330 783054 795039 808378 823019 838753 854981 870606 884505
51935 884505 896104 905454 912972 919283 925060 930712 936315 941963 947891 954046 959773 964224 966772 966687
51921 966687 962759 953866 939872 921540 899736 875382 850158 826425 805953 789081 775370 764571
$$ packed form
52010A568385m068o197q441j0885j3626j6543j9304k1318k1926k1090j9812j9244
51998A385931j9434j9577j9468j9859k1111k2486k3331k4098k5403k6723k7017
51987A137424k6218k5146k4273k3529k3068k3256k3769k3716k2764k1321j9542
51976H80822j7069j4004j1264r411p871n707k805J96K645M167M593M049K898J386
51962H32625m23k325m070n856q060j0329j1529j1061r577q002o459m671k838j261
51948G46164M06K745N547P939R529J0724J1985J3339J4641J5734J6228J5625J3899
51935H84505J1599R350P518O311N777N652N603N648N928O155N727M451K548q5
51921I66687l928q893j3994j8332k1804k4354k5224k3733k0472j6872j3711j0799
$$ plain form
51909 764571 756570 750833 746565 743279 740788 738730 736512 733574 729266 722555 712516 699385 684706
51896 684706 670159 656416 643236 630344 617879 606217 595787 587108 580763 577129 576110 577265
51884 577265 580293 585378 592848 602480 613460 625222 637976 652004 666614 680311 691856 700619
51872 700619 706000 707327 704657 699026 691521 682600 672759 663283 655658 650413 647036 644800 643212 641938
51858 641938 640910 640412 640509 640434 639095 636193 632372 628286 623955 619018 613099 605886 597376 588233 579457
51843 579457 571537 564314 557743 552314 548515 546312 545478 546087 548272 551651 555253 558097 559826 560920 562239
51828 562239 564178 566273 567799 568592 568969 569079 568917 568913 569790 571616 573617 575227 576747 578540 580070 580314
51812 580314 578794 575753 571554 566483 561017 555819 551369 547860 545375 543928 543350 543342 543631 544024 544504 545390
$$ packed form
51909G64571q001n737m268l286k491k058k218k938m308o711j0039j3131j4679
51896F84706j4547j3743j3180j2892j2465j1662j0430q679o345l634j019J155
51884E77265L028N085P470R632J0980J1762J2754J4028J4610J3697J1545Q763
51872G00619N381J327k670n631p505q921r841r476p625n245l377k236j588j274
51858F41938j028m98R7p5j339k902l821m086m331m937n919p213q510r143q776
51843E79457p920p223o571n429l799k203q34O09K185L379L602K844J729J094J319
51828E62239J939K095J526P93L77J10j62mQ77J826K001J610J520J793J530K44
51812E80314j520l041m199n071n466n198m450l509k485j447n78qK89L93M80Q86
$$ plain form
51796 545390 547117 549658 552380 554654 556300 557235 557136 555886 554051 552330 550692 548530 545592 542309 539318
51781 539318 537232 536754 538318 541458 545210 549476 555438 564150 575116 586782 598129 609137 619789
51768 619789 629359 636925 641996 644225 643013 638087 630350 621508 612627 603539 593854 583994 574774 566429
51754 566429 558668 551464 545098 539488 534196 529300 525650 523917 523820 524618 525973 528028 530950 534752 539297
51739 539297 544186 548903 553410 558326 564170 570645 576996 582873 588418 593694 598429 602292 605121 607002
51725 607002 608470 610508 613928 618683 623990 628943 632713 634431 633560 630532 626600 622885 619784 617269
51711 617269 615348 614058 613353 613153 613328 613609 613814 614307 615873 618834 622458 625415 626736 626279 624544 622368
51695 622368 620720 620438 621893 624806 628297 631146 632226 630949 627414 622178 615884 609140 602636 597208
$$ packed form
51796E45390J727K541K722K274J646R35r9j250j835j721j638k162k938l283k991
51781E39318k086m78J564L140L752M266N962Q712J0966J1666J1347J1008J0652
51768F19789R570P566N071K229j212m926p737q842q881r088r685r860r220q345
51754E66429p761p204o366n610n292m896l650j733r7P98J355K055K922L802M545
51739E39297M889M717M507M916N844O475O351N877N545N276M735L863K829J881
51725F07002J468K038L420M755N307M953L770J718q71l028l932l715l101k515
51711F17269j921j290p05k00J75K81K05M93J566K961L624K957J321m57j735k176
51695F22368j648k82J455K913L491K849J080j277l535n236o294o744o504n428
$$ plain form
51681 597208 593541 591587 590344 588461 585287 581252 577219 573647 570543 568013 566541 566784 569327 574578
51667 574578 582582 592944 605200 619257 635122 652049 668294 681963 691951 697874 699447 696498
51655 696498 689673 680604 671017 661831 653374 646198 641131 638391 637083 635799 633475 629456 623182 614399
51641 614399 603637 591977 580302 569107 558961 550567 544122 539131 535165 532452 531392 531770 532869
51628 532869 534131 535312 536186 536561 536623 536794 537099 536898 535398 532393 528479 524620 521443 518856 516337 513572
51612 513572 510682 507909 505327 502987 501052 499643 498724 498302 498498 499308 500599 502504 505576 510319 516873
51597 516873 525331 535933 548490 561969 575166 587568 598920 608126 613310 613346 609002 602451 595867
51584 595867 590514 586853 585200 586204 590593 598531 609589 623494 640500 660611 682786 705488 727901
$$ packed form
51681E97208l667j954j243j883l174m035m033l572l104k530j472K43K543N251
51667E74578Q004J0362J2256J4057J5865J6927J6245J3669R988N923J573k949
51655F96498o825r069r587r186q457p176n067k740j308j284k324m019o274q783
51641F14399j0762j1660j1675j1195j0146q394o445m991l966k713j060L78J099
51628E32869J262J181Q74L75O2J71L05k01j500l005l914l859l177k587k519k765
51612E13572k890k773k582k340j935j409r19m22J96Q10J291J905L072M743O554
51597E16873Q458J0602J2557J3479J3197J2402J1352R206N184L6m344o551o584
51584E95867n353l661j653J004M389P938J1058J3905J7006K0111K2175K2702K2413
$$ plain form
51571 727901 750192 772793 796004 820043 844694 868902 891525 912816 934648 959145 987600
51560 987600 1020741 1059106 1102325 1148376 1194114 1236488 1273022 1301529 1319970 1326764 1321181 1303625
51548 1303625 1275676 1239508 1196979 1149426 1098410 1046160 994861 945738 899298 856217 817487
51537 817487 783702 754753 730346 710368 694521 681964 671696 663237 656665 652001 648742 646045
51525 646045 643209 639843 635695 630543 624388 617628 610921 604792 599371 594426 589610 584735 579856 575173
51511 575173 570891 567193 564149 561439 558261 553909 548562 543212 538638 534769 531192 527885 525111 522900
51497 522900 521100 519726 518836 518196 517502 516845 516537 516584 516743 516994 517414 517627 517011 515586 514144 513253 512616 511701
51479 511701 510575 509718 509264 508803 507889 506555 505300 504593 504259 503459 501521 498739 496049 493981 492338 490849
$$ packed form
51571G27901K2291K2601K3211K4039K4651K4208K2623K1291K1832K4497K8455
51560I87600L3141L8365M3219M6051M5738M2374L6534K8507J8441O794n583j7556
51548A303625k7949l6168m2529m7553n1016n2250n1299m9123m6440m3081l8730
51537H17487l3785k8949k4407j9978j5847j2557j0268q459o572m664l259k697
51525F46045k836l366m148n152o155o760o707o129n421m945m816m875m879m683
51511E75173m282l698l044k710l178m352n347n350m574l869l577l307k774k211
51497E22900j800j374q90o40o94o57l08M7J59K51M20K13o16j425j442q91o37r15
51479E11701j126q57m54m61r14j334j255p07l34q00j938k782k690k068j643j489
$$ plain form
51463 490849 489570 488514 487455 486405 485812 485893 486170 486047 485507 484882 484287 483839 484245 486546 491212 497902 506159
51446 506159 515935 527323 540146 554116 569168 585219 601428 615972 626953 633733 637296 639289
51434 639289 640949 643006 645945 649519 652060 651145 645517 636106 624968 613591 602437 591625 581414
51421 581414 572133 564150 557926 553721 551167 549396 547767 546318 545436 545195 545176 544907 544320 543612 542792 541649
51405 541649 540329 539592 540172 541973 544264 546581 549154 552500 557005 562915 570314 579020 588745 599418
51391 599418 611135 623960 638171 654585 674059 696732 722414 751816 786647 828129 876002
51380 876002 929339 987736 1051120 1118696 1188544 1258028 1324234 1384339 1435913 1476746 1504320
51369 1504320 1516116 1510999 1490102 1455991 1411233 1357969 1298244 1234050 1167240 1099847 1034223
$$ packed form
51463D90849j279j056j059j050n93Q1K77j23n40o25n95m48M06K301M666O690Q257
51446E06159R776J1388J2823J3970J5052J6051J6209J4544J0981O780L563J993
51434F39289J660K057K939L574K541r15n628r411j1138j1377j1154j0812j0211
51421E81414r281p983o224m205k554j771j629j449q82k41j9k69n87p08q20j143
51405E41649j320p37N80J801K291K317K573L346M505N910P399Q706R725J0673
51391E99418J1717J2825J4211J6414J9474K2673K5682K9402L4831M1482M7873
51380H76002N3337N8397O3384O7576O9848O9484O6206O0105N1574M0833K7574
51369A504320J1796n117k0897l4111m4758n3264n9725o4194o6810o7393o5624
$$ plain form
51358 1034223 972305 914973 862522 815385 773825 737247 704658 675719 650718 629535 611309
51347 611309 595200 580915 568374 557352 547577 538808 530757 523360 517043 512200 508342 504373 499896
51334 499896 495728 492828 491166 490050 489230 489124 490019 491477 492775 493811 495308 498029 501870 505899 509232
51319 509232 511604 513083 513667 513427 512696 511757 510585 509200 508000 507333 506947 506325 505379 504363 503221 501586
51303 501586 499393 497005 494646 492136 489274 486079 482601 478857 475079 471691 468981 466991 465730 465223
51289 465223 465324 465814 466729 468349 470966 474870 480428 487746 496292 505210 513926 522120 529327 535092 539478
51274 539478 542851 545178 546066 545590 544495 543478 542802 542728 543761 546165 549697 553932 558409 562310 564631
51259 564631 565012 563926 561758 558281 553463 548235 543788 540343 537133 533437 529142 524432 519485 514595
$$ packed form
51358A034223o1918n7332n2451m7137m1560l6578l2589k8939k5001k1183j8226
51347F11309j6109j4285j2541j1022r775q769q051p397o317m843l858l969m477
51334D99896m168k900j662j116q20j06Q95J458J298J036J497K721L841M029L333
51319E09232K372J479N84k40p31r39j172j385j200o67l86o22r46j016j142j635
51303E01586k193k388k359k510k862l195l478l744l778l388k710j990j261n07
51289D65223J01M90R15J620K617L904N558P318Q546Q918Q716Q194P207N765M386
51274E39478L373K327Q88m76j095j017o76p4J033K404L532M235M477L901K321
51259E64631L81j086k168l477m818n228m447l445l210l696m295m710m947m890
$$ plain form
51245 514595 510195 506554 503554 500839 498175 495636 493421 491472 489458 487353 485810 485552 486473 487844 489335
51230 489335 491239 493582 495750 497355 498883 501007 503711 506527 509201 511605 513360 514219 514584 515130 515985
51215 515985 516735 517023 516764 516030 515266 515377 516928 519321 521372 522722 524156 526508 529812 533578 537271 540287
51199 540287 542032 542454 542222 542113 542438 543105 543934 544663 545035 545135 545422 546170 547122 547959 548869 550282 552183 554039
51181 554039 555342 555909 555667 554563 552865 551251 550250 549638 548690 547100 545472 544690 544933 545548 545883 545970 546293
51164 546293 547175 548655 550772 553569 556783 559757 561770 562327 561183 558402 554501 550284 546324 542663 539136
51149 539136 535805 532908 530522 528499 526729 525197 523718 521858 519301 516309 513680 512230 512290 513591 515456
51134 515456 517147 518228 518789 519317 520262 521784 523948 526993 531145 536154 541253 545723 549380 552459 555152
$$ packed form
51245E14595m400l641l000k715k664k539k215j949k014k105j543k58R21J371J491
51230D89335J904K343K168J605J528K124K704K816K674K404J755Q59L65N46Q55
51215E15985P50K88k59p34p64J11J551K393K051J350J434K352L304L766L693L016
51199E40287J745M22k32j09L25O67Q29P29L72J00K87P48R52Q37R10J413J901J856
51181E54039J303N67k42j104j698j614j001o12r48j590j628p82K43O15L35Q7L23
51164E46293Q82J480K117K797L214K974K013N57j144k781l901m217l960l661l527
51149E39136l331k897k386k023j770j532j479j860k557k992k629j450O0J301J865
51134E15456J691J081N61N28R45J522K164L045M152N009N099M470L657L079K693
$$ plain form
51119 555152 557473 559411 561072 562612 564116 565522 566651 567403 568003 568869 570031 570795 570330 568638 566688
51104 566688 565425 564832 564119 562773 561211 560391 560885 562374 563960 564878 564919 564205 562809 560780 558523 556843
51088 556843 556391 557140 558572 560267 562115 563990 565529 566387 566554 566326 566069 566104 566633 567622 568839 570169 571784
51071 571784 573885 576420 579281 582694 587119 592761 599453 607072 615841 626175 638419 652787 669259
51058 669259 687485 707030 727773 749619 771613 791746 808182 820674 830541 839334 847815 856017
51046 856017 863763 870813 876674 880557 881695 879819 875355 869039 861329 852369 842495 832526 823483 816278
51032 816278 811621 809574 808839 806989 802069 793917 783684 772520 761287 751009 742596 736057 730743
51019 730743 726470 723774 723026 724100 727146 732881 741666 752879 765651 779706 795020 811175 827600
$$ packed form
51119E55152K321J938J661J540J504J406J129P52O00Q66J162P64m65j692j950
51104E66688j263n93p13j346j562q20M94J489J586R18M1p14j396k029k257j680
51088E56843m52P49J432J695J848J875J539Q58J67k28k57L5N29R89J217J330J615
51071E71784K101K535K861L413M425N642O692P619Q769J0334J2244J4368J6472
51058F69259J8226J9545K0743K1846K1994K0133J6436J2492R867Q793Q481Q202
51046H56017P746P050N861L883J138j876m464o316p710q960r874r969r043p205
51032H16278m657k047p35j850m920q152j0233j1164j1233j0278q413o539n314
51019G30743m273k696p48J074L046N735Q785J1213J2772J4055J5314J6155J6425
$$ plain form
51006 827600 844057 860299 875494 888537 898857 906548 911923 915302 916937 916730 914227 909361 902951
50993 902951 896004 888756 880943 872795 865082 858276 852459 848154 846537 848447 853643 861362 871210 883200
50979 883200 897218 912866 929711 947422 965758 984638 1004149 1024451 1045870 1069158 1095397
50968 1095397 1125365 1159119 1196394 1237189 1281674 1329684 1380695 1434376 1490747 1549594 1609869
50957 1609869 1669952 1728383 1784130 1836250 1883744 1925936 1962792 1994580 2021397 2043318 2060892
50946 2060892 2075068 2086636 2096150 2104467 2112798 2121769 2130643 2137838 2142096 2142852 2139788 2132657 2121634
50933 2121634 2107374 2090488 2071147 2049276 2024812 1997544 1966926 1932305 1893346 1850162 1803183
50922 1803183 1753039 1700532 1646583 1592159 1538229 1485628 1434885 1386252 1340032 1296854 1257449
$$ packed form
51006H27600J6457J6242J5195J3043J0320P691N375L379J635k07k503m866o410
50993I02951o947p248p813q148p713o806n817m305j617J910N196P719R848J1990
50979H83200J4018J5648J6845J7711J8336J8880J9511K0302K1419K3288K6239
50968A095397K9968L3754L7275M0795M4485M8010N1011N3681N6371N8847O0275
50957A609869O0083N8431N5747N2120M7494M2192L6856L1788K6817K1921J7574
50946B060892J4176J1568R514Q317Q331Q971Q874P195M258P56l064p131j1023
50933B121634j4260j6886j9341k1871k4464k7268l0618l4621l8959m3184m6979
50922A803183n0144n2507n3949n4424n3930n2601n0743m8633m6220m3178l9405
$$ plain form
50911 1257449 1222078 1190235 1161076 1134168 1109666 1087684 1067709 1048946 1031205 1015041 1000906
50900 1000906 988521 977359 967393 958939 951903 945735 940193 935671 932557 930561 929015 927658 926857 927061
50886 927061 928266 930148 932576 935838 940299 945904 952197 958838 965961 973965 983150 993684 1005677 1018968
50872 1018968 1032938 1046903 1060799 1075236 1090840 1107714 1125668 1144778 1165618 1189061 1215833
50861 1215833 1246074 1279313 1315108 1353805 1396414 1443707 1495775 1552671 1615167 1684466 1761303
50850 1761303 1845646 1937182 2035723 2141101 2253044 2371218 2495022 2623180 2753817 2885175
50840 2885175 3015948 3144529 3268089 3382835 3485242 3572859 3644160 3698356 3735711 3757653
50830 3757653 3766066 3762558 3748773 3727277 3701631 3675377 3651160 3630802 3615755 3607027 3604648 3607389
$$ packed form
50911A257449l5371l1843k9159k6908k4502k1982j9975j8763j7741j6164j4135
50900A000906j2385j1162r966q454p036o168n542m522l114j996j546j357q01K04
50886I27061J205J882K428L262M461N605O293O641P123Q004R185J0534J1993J3291
50872A018968J3970J3965J3896J4437J5604J6874J7954J9110K0840K3443K6772
50861A215833L0241L3239L5795L8697M2609M7293N2068N6896O2496O9299P6837
50850A761303Q4343R1536R8541J05378J11943J18174J23804J28158J30637J31358
50840B885175J30773J28581J23560J14746J02407Q7617P1301N4196L7355K1942
50830C757653Q413l508j3785k1496k5646k6254k4217k0358j5047q728k379K741
$$ plain form
50818 3607389 3612960 3618509 3621063 3617727 3605637 3581966 3544333 3491446 3423401 3341366 3247067 3142390
50806 3142390 3029145 2909031 2784025 2656863 2530855 2408973 2293219 2184953 2085586 1996556
50796 1996556 1918687 1851758 1794761 1746518 1706211 1673558 1648521 1630782 1619500 1613485 1611464 1612231
50784 1612231 1614906 1619178 1624953 1631496 1637252 1640809 1641810 1640575 1637121 1631055 1622260 1611124 1598024
50771 1598024 1583003 1565988 1546916 1525629 1502068 1476628 1449880 1421925 1392636 1362754 1334087
50760 1334087 1308121 1284759 1262907 1242063 1222820 1206016 1192044 1181020 1173070 1168184 1166076 1166441
50748 1166441 1169229 1174585 1182696 1193751 1207889 1225044 1245046 1268107 1295079 1326967 1364130 1406028
50736 1406028 1451765 1500772 1553043 1608831 1668210 1730722 1795389 1861146 1927498 1994698 2063099
$$ packed form
50818C607389N571N549K554l336j2090k3671l7633n2887o8045q2035r4299j04677
50806C142390j13245j20114j25006j27162j26008j21882j15754j08266r9367q9030
50796A996556p7869o6929n6997m8243m0307l2653k5037j7739j1282o015k021P67
50784A612231K675M272N775O543N756L557J001j235l454o066q795j1136j3100
50771A598024j5021j7015j9072k1287k3561k5440k6748k7955k9289k9882k8667
50760A334087k5966k3362k1852k0844j9243j6804j3972j1024p950m886k108L65
50748A166441K788N356Q111J1055J4138J7155K0002K3061K6972L1888L7163M1898
50736A406028M5737M9007N2271N5788N9379O2512O4667O5757O6352O7200O8401
$$ plain form
50725 2063099 2132222 2200551 2266302 2328266 2385755 2437817 2482781 2518702 2544128 2558342 2561084
50714 2561084 2552503 2533625 2506702 2474751 2440726 2407188 2376491 2350645 2330725 2316803 2308815 2307071
50702 2307071 2311424 2320163 2330393 2339506 2345726 2347213 2341487 2326251 2300468 2264311 2218490 2164101
50690 2164101 2102846 2036946 1968897 1901411 1837103 1777700 1723814 1675889 1635034 1602284 1577372
50679 1577372 1559070 1546871 1541662 1544604 1555954 1575205 1601696 1634621 1672905 1715623 1762298 1812288
50667 1812288 1863911 1914591 1961939 2004603 2042194 2074794 2102657 2126198 2145940 2162344 2175660
50656 2175660 2186001 2193479 2198102 2199640 2197923 2193503 2187672 2181527 2175254 2168692 2162358 2157405 2154810 2155295
50642 2155295 2159935 2169895 2185172 2204241 2225491 2248531 2273621 2300295 2327330 2353910 2380138 2406296
$$ packed form
50725B063099O9123O8329O5751O1964N7489N2062M4964L5921K5426J4214K742
50714B561084q581j8878k6923l1951l4025l3538l0697k5846j9920j3922p988j744
50702B307071M353Q739J0230R113O220J487n726j5236k5783l6157m5821n4389
50690B164101o1255o5900o8049o7486o4308n9403n3886m7925m0855l2750k4912
50679A577372j8302j2199n209K942J1350J9251K6491L2925L8284M2718M6675M9990
50667A812288N1623N0680M7348M2664L7591L2600K7863K3541J9742J6404J3316
50656B175660J0341P478M623J538j717m420n831o145o273o562o334m953k595M85
50642B155295M640R960J5277J9069K1250K3040K5090K6674K7035K6580K6228K6158
$$ plain form
50630 2406296 2432172 2457301 2481426 2504418 2525880 2544973 2560463 2570618 2573019 2564762 2543459 2508686
50618 2508686 2462805 2410327 2356267 2304881 2259401 2222043 2193677 2173699 2160757 2153695 2151654 2153492
50606 2153492 2157534 2161992 2165323 2166121 2162907 2154192 2138673 2115424 2084209 2045754 2001567 1953250 1901954
50593 1901954 1848512 1793940 1739654 1687157 1637538 1591208 1547932 1507067 1467927 1430247 1394389
50582 1394389 1360962 1330095 1301173 1273515 1247254 1223418 1203194 1187314 1176019 1169162 1166124 1165914
50570 1165914 1167733 1171419 1177263 1185455 1195859 1208215 1222362 1238266 1255968 1275556 1297169 1321064
50558 1321064 1347608 1377069 1409349 1444041 1480758 1519236 1559154 1600190 1642414 1686268 1731777
50547 1731777 1777836 1822568 1864511 1903483 1940528 1977185 2014583 2052921 2091809 2131283 2172357
$$ packed form
50630B406296K5876K5129K4125K2992K1462J9093J5490J0155K401q257k1303l4773
50618B508686m5881n2478n4060n1386m5480l7358k8366j9978j2942p062k041J838
50606B153492M042M458L331P98l214q715j5519k3249l1215l8455m4187m8317n1296
50593A901954n3442n4572n4286n2497m9619m6330m3276m0865l9140l7680l5858
50582A394389l3427l0867k8922k7658k6261k3836k0224j5880j1295o857l038k10
50570A165914J819L686N844Q192J0404J2356J4147J5904J7702J9588K1613K3895
50558A321064K6544K9461L2280L4692L6717L8478L9918M1036M2224M3854M5509
50547A731777M6059M4732M1943L8972L7045L6657L7398L8338L8888L9474M1074
$$ plain form
50536 2172357 2216325 2263561 2313250 2364292 2416257 2469547 2525044 2583788 2646785 2714841 2788443
50525 2788443 2867654 2951981 3040392 3131611 3224296 3316775 3406794 3492023 3570848 3642226 3704557
50514 3704557 3755133 3791060 3810526 3812963 3798355 3766977 3719703 3657965 3583257 3497169 3402141
50503 3402141 3301731 3199813 3099731 3004472 2917178 2840859 2777613 2728701 2695348 2678825 2679310
50492 2679310 2695034 2722917 2759786 2802579 2847588 2890111 2925177 2948511 2956800 2947444 2918584 2869690
50480 2869690 2802192 2719260 2624712 2521982 2414140 2304575 2196995 2094421 1998409 1909459
50470 1909459 1827872 1753893 1687276 1627210 1572689 1522746 1476504 1433429 1393503 1356801 1322992
50459 1322992 1291656 1263055 1238073 1217259 1200303 1186602 1175871 1167955 1162468 1159075 1158042 1160132
$$ packed form
50536B172357M3968M7236M9689N1042N1965N3290N5497N8744O2997O8056P3602
50525B788443P9211Q4327Q8411R1219R2685R2479R0019Q5229P8825P1378O2331
50514C704557N0576L5927J9466K437j4608l1378m7274o1738p4708q6088r5028
50503C402141j00410j01918j00082r5259q7294p6319o3246m8912l3353j6523M85
50492B679310J5724K7883L6869M2793M5009M2523L5066K3334Q289r356k8860m8894
50480B869690o7498q2932r4548j02730j07842j09565j07580j02574r6012q8950
50470A909459q1587p3979o6617o0066n4521m9943m6242m3075l9926l6702l3809
50459A322992l1336k8601k4982k0814j6956j3701j0731p916n487l393j033K090
$$ plain form
50447 1160132 1165807 1174553 1185061 1196202 1207983 1221440 1237330 1254989 1272719 1289166 1303951 1317078
50435 1317078 1328355 1337650 1345262 1351727 1357490 1362988 1368804 1375469 1383209 1391971 1401508 1411429 1421537
50422 1421537 1432248 1444404 1458586 1474979 1493942 1516230 1542382 1572309 1605771 1642854 1683678
50411 1683678 1728005 1775503 1826089 1879564 1935140 1991693 2048244 2103929 2157769 2208865 2256571
50400 2256571 2300135 2338374 2370075 2394460 2410860 2418143 2414946 2400404 2374464 2337753 2291538 2237526
50388 2237526 2177341 2112435 2044898 1977907 1914663 1856959 1805334 1760392 1723214 1694474 1673988
50377 1673988 1661352 1656435 1658870 1667480 1680538 1696358 1713349 1729658 1742973 1750836 1751365 1743948 1729153
50364 1729153 1707773 1680090 1646320 1607465 1565299 1521641 1478087 1436210 1397303 1361747 1329107
$$ packed form
50447A160132N675Q746J0508J1141J1781J3457J5890J7659J7730J6447J4785J3127
50435A317078J1277R295P612O465N763N498N816O665P740Q762R537R921J0108
50422A421537J0711J2156J4182J6393J8963K2288K6152K9927L3462L7083M0824
50411A683678M4327M7498N0586N3475N5576N6553N6551N5685N3840N1096M7706
50400B256571M3564L8239L1701K4385J6400P283l197j4542k5940l6711m6215n4012
50388B237526o0185o4906o7537o6991o3244n7704n1625m4942l7178k8740k0486
50377A673988j2636m917K435Q610J3058J5820J6991J6309J3315P863N29p417j4795
50364A729153k1380k7683l3770l8855m2166m3658m3554m1877l8907l5556l2640
$$ plain form
50353 1329107 1299024 1271730 1247651 1226887 1209154 1193973 1180931 1170024 1161493 1154793 1147801 1137659
50341 1137659 1122558 1102524 1078774 1053029 1027245 1003043 980979 960898 943072 928284 916687
50330 916687 907451 899940 894426 891174 889558 888826 889167 891255 895064 899860 905137 910908 917215 923960 931265
50315 931265 939507 948899 959259 970097 980872 991437 1002500 1015222 1030016 1046102 1062643 1079795
50303 1079795 1098040 1116997 1135771 1154330 1173576 1194021 1215224 1236722 1258583 1280610 1301573
50292 1301573 1319727 1333463 1341002 1340185 1329733 1310887 1287133 1262047 1237749 1215346 1196029 1180998
50280 1180998 1170595 1164119 1160603 1159374 1159935 1161904 1165457 1171391 1180292 1191746 1204732 1218583 1233225
50267 1233225 1248717 1265127 1282757 1301917 1322451 1344081 1367261 1393015 1421797 1453260 1487448
$$ packed form
50353A329107l0083k7294k4079k0764j7733j5181j3042j0907q531o700o992j0142
50341A137659j5101k0034k3750k5745k5784k4202k2064k0081j7826j4788j1597
50330I16687r236p511n514l252j616p32L41K088L809M796N277N771O307O745P305
50315I31265Q242R392J0360J0838J0775J0565J1063J2722J4794J6086J6541J7152
50303A079795J8245J8957J8774J8559J9246K0445K1203K1498K1861K2027K0963
50292A301573J8154J3736P539q17j0452j8846k3754k5086k4298k2403j9317j5031
50280A180998j0403o476l516j229N61J969L553N934Q901J1454J2986J3851J4642
50267A233225J5492J6410J7630J9160K0534K1630K3180K5754K8782L1463L4188
$$ plain form
50256 1487448 1525378 1567771 1613767 1661575 1709887 1757914 1804407 1847713 1886923 1922294 1954439
50245 1954439 1983711 2010427 2035035 2057684 2077858 2094443 2105827 2110071 2105539 2091562 2068250 2035837
50233 2035837 1994882 1947148 1895641 1843456 1792959 1746038 1704273 1668266 1637248 1609755 1584281
50222 1584281 1558928 1531190 1499143 1463009 1424953 1387274 1351148 1316986 1285233 1256375 1230455
50211 1230455 1206946 1185096 1164369 1144727 1126564 1110186 1095202 1080615 1065726 1050831 1036822
50200 1036822 1024150 1012423 1001052 990028 979819 970670 962307 954422 947181 941019 936042 931901 928310
50187 928310 925495 923994 924055 925318 927117 929050 931191 933740 936616 939568 942686 946501 951502 957690 964778
50172 964778 972605 981126 990144 999334 1008441 1017275 1025672 1033731 1041941 1050661 1059529 1067766 1075079 1081895
$$ packed form
50256A487448L7930M2393M5996M7808M8312M8027M6493M3306L9210L5371L2145
50245A954439K9272K6716K4608K2649K0174J6585J1384M244m532j3977k3312l2413
50233B035837m0955m7734n1507n2185n0497m6921m1765l6007l1018k7493k5474
50222A584281k5353k7738l2047l6134l8056l7679l6126l4162l1753k8858k5920
50211A230455k3509k1850k0727j9642j8163j6378j4984j4587j4889j4895j4009
50200A036822j2672j1727j1371j1024j0209r149q363p885p241o162m977m141l591
50187I28310k815j501O1J263J799J933K141K549K876K952L118L815N001O188P088
50172I64778P827Q521R018R190R107Q834Q397Q059Q210Q720Q868Q237P313O816
$$ plain form
50158 1081895 1088746 1095901 1103706 1112774 1123537 1135957 1149947 1165701 1183388 1202830 1223806 1246331
50146 1246331 1270355 1295675 1322772 1353493 1390196 1434133 1485061 1542426 1606392 1677578 1756276
50135 1756276 1842086 1933865 2029632 2126742 2222625 2315589 2405029 2490998 2573556 2652272 2726057
50124 2726057 2793280 2851826 2898900 2931065 2944971 2938327 2910244 2861010 2792119 2706598 2608741
50113 2608741 2502995 2393043 2281867 2172262 2066914 1968065 1877281 1795324 1722006 1656273
50103 1656273 1596739 1542177 1491603 1444207 1399552 1357734 1319148 1284134 1252916 1225676 1202339
50092 1202339 1182332 1164776 1148990 1134699 1121876 1110509 1100400 1090993 1081454 1071193 1060296 1049390
50080 1049390 1039133 1029926 1021947 1015217 1009708 1005574 1003206 1002908 1004632 1008162 1013318 1019796 1027093 1034956
$$ packed form
50158A081895O851P155P805R068J0763J2420J3990J5754J7687J9442K0976K2525
50146A246331K4024K5320K7097L0721L6703M3937N0928N7365O3966P1186P8698
50135A756276Q5810R1779R5767R7110R5883R2964Q9440Q5969Q2558P8716P3785
50124B726057O7223N8546M7074L2165J3906o644k8083m9234o8891q5521r7857
50113B608741j05746j09952j11176j09605j05348r8849r0784q1957p3318o5733
50103A656273n9534n4562n0574m7396m4655m1818l8586l5014l1218k7240k3337
50092A202339k0007j7556j5786j4291j2823j1367j0109r407r539j0261j0897j0906
50080A049390j0257r207p979o730n509m134k368k98J724L530N156O478P297P863
$$ plain form
50066 1034956 1043623 1053170 1062853 1071681 1079543 1087152 1094809 1101934 1108007 1113327 1118429 1123251 1127311 1130351
50052 1130351 1132370 1133272 1132952 1131625 1129776 1127872 1126364 1125816 1126739 1129382 1133835 1140135 1148122 1157476 1168125
50037 1168125 1180344 1194151 1208890 1223861 1239219 1255893 1274701 1295792 1318796 1343181 1368572
50026 1368572 1395062 1423210 1453626 1486752 1523188 1563746 1608654 1656982 1707437 1759517 1813250
50015 1813250 1867874 1921533 1972580 2020706 2066574 2110715 2152992 2192850 2229787 2263654 2294465
50004 2294465 2321751 2344133 2359628 2366098 2361150 2342112 2307113 2256469 2192574 2118457 2036937 1951028
49992 1951028 1864045 1778644 1696152 1617189 1542503 1472823 1408398 1349197 1295387 1247271 1205048
49981 1205048 1168901 1138955 1114720 1094868 1077958 1063218 1050430 1039406 1029978 1022170 1015866 1010532
$$ packed form
50066A034956Q667R547R683Q828P862P609P657P125O073N320N102M822M060L040
50052A130351K019R02l20j327j849j904j508n48R23K643M453O300P987R354J0649
50037A168125J2219J3807J4739J4971J5358J6674J8808K1091K3004K4385K5391
50026A368572K6490K8148L0416L3126L6436M0558M4908M8328N0455N2080N3733
50015A813250N4624N3659N1047M8126M5868M4141M2277L9858L6937L3867L0811
50004B294465K7286K2382J5495O470m948j9038l4999n0644o3895p4117q1520q5909
49992A951028q6983q5401q2492p8963p4686o9680o4425n9201n3810m8116m2223
49981A205048l6147k9946k4235j9852j6910j4740j2788j1024r428p808o304n334
$$ plain form
49969 1010532 1005716 1001728 999394 999295 1001551 1006076 1012502 1019974 1027633 1035446 1044272 1055065 1068178 1083244
49955 1083244 1099280 1114905 1128804 1140119 1148291 1152827 1153554 1150934 1145694 1138195 1128514 1116906 1103668
49942 1103668 1088672 1071635 1052853 1033190 1013323 993610 974694 957442 941959 927264 912360
49931 912360 897205 882349 868218 855278 844375 836119 830093 825344 821587 819281 818555 818810 819707 821945
49917 821945 826509 833368 841371 849396 857282 865643 875108 885824 897441 909434 921549 934043 947349
49904 947349 961326 974983 987087 997008 1004834 1010777 1014841 1017092 1017824 1017047 1013899 1006934 995214 979145
49890 979145 960281 940440 920976 902652 885876 870839 857497 845716 835601 827473 821235 815980
49878 815980 810686 805293 800554 796687 792856 788371 783905 780770 779303 778763 778821 780329 784310 790738 798810
$$ packed form
49969A010532m816l988k334r9K256M525O426P472P659P813Q826J0793J3113J5066
49955A083244J6036J5625J3899J1315Q172M536P27k620n240p499r681j1608j3238
49942A103668j4996j7037j8782j9663j9867j9713j8916j7252j5483j4695j4904
49931I12360j5155j4856j4131j2940j0903q256o026m749l757k306p26K55Q97K238
49917H21945M564O859Q003Q025P886Q361R465J0716J1617J1993J2115J2494J3306
49904I47349J3977J3657J2104R921P826N943M064K251P32p77l148o965j1720j6069
49890I79145j8864j9841j9464j8324j6776j5037j3342j1781j0115q128o238n255
49878H15980n294n393m739l867l831m485m466l135j467n40N8J508L981O428Q072
$$ [...]
##END NTUPLES=NMR SPECTRUM
##END=
