##TITLE=AC1727_3474_9208054_ibkSnlMSrY
##JCAMPDX= 6.0         $$ Bruker NMR JCAMP-DX V2.0
##DATA TYPE= NMR SPECTRUM
##DATA CLASS= NTUPLES
##ORIGIN= BRUKER
##OWNER= Administrator
$$ 1.72 TOPSPIN		Version 2.1
$$ 2015-07-13 12:26:43.166 -0700  Administrator@X
$$ Compression mode = diff/dup
##.OBSERVE FREQUENCY= 400.02188249412
##.OBSERVE NUCLEUS= ^1H
##.ACQUISITION MODE= SIMULTANEOUS (DQD)
##.ACQUISITION SCHEME= undefined
##.AVERAGES= 64
##.DIGITISER RES= 22
##SPECTROMETER/DATA SYSTEM= spect
##.PULSE SEQUENCE= noesygpps1d.comp
##.SOLVENT NAME= COFFEE_meoh
##.SHIFT REFERENCE= INTERNAL, COFFEE_meoh, 1, 14.96141
##AUDIT TRAIL= $$ (NUMBER, WHEN, WHO, WHERE, PROCESS, VERSION, WHAT)
$$ ##TITLE= Audit trail, TOPSPIN		Version 2.1
$$ ##JCAMPDX= 5.01
$$ ##ORIGIN= Bruker BioSpin GmbH
$$ ##OWNER= Administrator
$$ $$ E:\/data/COFFEE/nmr/AC1727_3474_9208054_ibkSnlMSrY/42/pdata/1/auditp.txt
$$ ##AUDIT TRAIL=  $$ (NUMBER, WHEN, WHO, WHERE, PROCESS, VERSION, WHAT)
(   1,<2015-07-10 21:33:55.238 -0700>,<Administrator>,<X>,<go>,<TOPSPIN 2.1>,
      <created by zg
	started at 2015-07-10 21:22:25.597 -0700,
	POWCHK enabled, PULCHK disabled,
       configuration hash MD5:
       21 0F 79 D6 B3 7B B4 F6 88 20 88 DB 03 48 BD 9F
       data hash MD5: 64K
       89 3E 13 51 98 65 7A F8 A0 F8 24 B1 29 4D 10 51>)
(   2,<2015-07-10 21:33:58.503 -0700>,<Administrator>,<X>,<proc1d>,<TOPSPIN 2.1>,
      <Start of raw data processing
       efp LB = 0.3 FT_mod = 6 PKNL = 1 PHC0 = 0 PHC1 = 0 SI = 128K 
       data hash MD5: 128K
       08 19 BF 38 9D 44 14 3B F8 8A A1 8E 3A E2 73 0D>)
(   3,<2015-07-10 21:33:59.394 -0700>,<Administrator>,<X>,<proc1d>,<TOPSPIN 2.1>,
      <pk PHC0 = -84.79248 PHC1 = 0 
       data hash MD5: 128K
       38 48 EF 58 9C 07 39 10 7F 04 C6 D2 77 25 A1 47>)
(   4,<2015-07-10 21:33:59.800 -0700>,<Administrator>,<X>,<proc1d>,<TOPSPIN 2.1>,
      <abs ABSG = 1 
       data hash MD5: 128K
       44 93 F1 C8 BD 7E DA 56 DE 35 04 C8 C7 C4 9A 1E>)
(   5,<2015-07-10 21:33:59.910 -0700>,<Administrator>,<X>,<proc1d>,<TOPSPIN 2.1>,
      <abs ABSG = 2 
       data hash MD5: 128K
       9A F6 23 D3 04 2D 6A CB 26 66 05 C6 3F 49 8E 0D>)
(   6,<2015-07-10 21:34:00.003 -0700>,<Administrator>,<X>,<proc1d>,<TOPSPIN 2.1>,
      <abs ABSG = 3 
       data hash MD5: 128K
       EC 91 3E 62 B1 35 B5 B6 F1 1A 72 57 57 00 B2 07>)
(   7,<2015-07-10 21:34:00.081 -0700>,<Administrator>,<X>,<proc1d>,<TOPSPIN 2.1>,
      <abs ABSG = 4 
       data hash MD5: 128K
       CD 57 11 05 9F C0 D2 19 28 97 8E 45 9F 01 2A 88>)
(   8,<2015-07-10 21:34:00.238 -0700>,<Administrator>,<X>,<proc1d>,<TOPSPIN 2.1>,
      <abs ABSG = 5 
       data hash MD5: 128K
       7E A1 DD 18 B1 3E 39 97 87 00 F0 C8 94 87 92 DE>)
(   9,<2015-07-10 21:34:02.206 -0700>,<Administrator>,<X>,<audit>,<TOPSPIN 2.1>,
      <user comment:
       ICON-NMR User ID: COFFEE
       data hash MD5: 128K
       7E A1 DD 18 B1 3E 39 97 87 00 F0 C8 94 87 92 DE>)
$$ ##END=
$$ 
$$ $$ hash MD5
$$ [...]
##$TP07= 0
##$TPNAME0= <>
##$TPNAME1= <>
##$TPNAME2= <>
##$TPNAME3= <>
##$TPNAME4= <>
##$TPNAME5= <>
##$TPNAME6= <>
##$TPNAME7= <>
##$TPOAL= (0..7)
0.5 0.5 0.5 0.5 0.5 0.5 0.5 0.5
##$TPOFFS= (0..7)
0 0 0 0 0 0 0 0
##$TUNHIN= 0
##$TUNHOUT= 0
##$TUNXOUT= 0
##$USERA1= <user>
##$USERA2= <user>
##$USERA3= <user>
##$USERA4= <user>
##$USERA5= <user>
##$V9= 5
##$VALIST= <valist>
##$VCLIST= <CCCCCCCCCCCCCCC>
##$VD= 0
##$VDLIST= <DDDDDDDDDDDDDDD>
##$VPLIST= <PPPPPPPPPPPPPPP>
##$VTLIST= <TTTTTTTTTTTTTTT>
##$WBST= 2048
##$WBSW= 25
##$XGAIN= (0..3)
0 0 0 0
##$XL= 0
##$YL= 0
##$YMAX_a= 6152352
##$YMIN_a= -13012189
##$ZGOPTNS= <>
##$ZL1= 120
##$ZL2= 120
##$ZL3= 120
##$ZL4= 120
##$ABSF1= 14.96141
##$ABSF2= -5.596772
##$ABSG= 5
##$ABSL= 3
##$ALPHA= 0
##$AQORDER= 0
##$ASSFAC= 0
##$ASSFACI= 0
##$ASSFACX= 0
##$ASSWID= 0
##$AUNMP= <proc_prof1d_extract.lims>
##$AXLEFT= 0
##$AXNAME= <>
##$AXNUC= <1H>
##$AXRIGHT= 0
##$AXTYPE= 0
##$AXUNIT= <>
##$AZFE= 0.1
##$AZFW= 0.1
##$BCFW= 0
##$BC_mod= 0
##$BYTORDP= 0
##$COROFFS= 0
##$CY= 15
##$DATMOD= 1
##$DC= 0
##$DFILT= <>
##$DTYPP= 0
##$F1P= 0
##$F2P= 0
##$FCOR= 0.5
##$FTSIZE= 131072
##$FT_mod= 6
##$GAMMA= 0
##$GB= 0
##$INTBC= 1
##$INTSCL= 1
##$ISEN= 128
##$LB= 0.3
##$LEV0= 0
##$LPBIN= 0
##$MAXI= 10000
##$MC2= 0
##$MEAN= 0
##$ME_mod= 0
##$MI= 0
##$NCOEF= 0
##$NC_proc= -2
##$NLEV= 6
##$NOISF1= 0
##$NOISF2= 0
##$NSP= 0
##$NTH_PI= 0
##$NZP= 0
##$OFFSET= 14.96141
##$PC= 1
##$PHC0= -84.79248
##$PHC1= 0
##$PH_mod= 1
##$PKNL= yes
##$PPARMOD= 0
##$PPDIAG= 0
##$PPIPTYP= 0
##$PPMPNUM= 2147483647
##$PPRESOL= 1
##$PSCAL= 4
##$PSIGN= 0
##$PYNMP= <proc.py>
##$REVERSE= no
##$SF= 400.020009472527
##$SI= 131072
##$SIGF1= 0
##$SIGF2= 0
##$SINO= 400
##$SIOLD= 131072
##$SPECTYP= <>
##$SREGLST= <1H.CDCl3>
##$SSB= 0
##$STSI= 131072
##$STSR= 0
##$SW_p= 8223.68421052631
##$SYMM= 0
##$S_DEV= 0
##$TDeff= 65536
##$TDoff= 0
##$TI= <>
##$TILT= no
##$TM1= 0
##$TM2= 0
##$TOPLEV= 0
##$USERP1= <user>
##$USERP2= <user>
##$USERP3= <user>
##$USERP4= <user>
##$USERP5= <user>
##$WDW= 1
##$XDIM= 131072
##$YMAX_p= 439653127
##$YMIN_p= -14280
##$CURPLOT= <Network HP LaserJet P1505>
##$CURPRIN= <$Network HP LaserJet P1505>
##$DFORMAT= <normdp>
##$LAYOUT= <+/1D_H.xwp>
##$LFORMAT= <normlp>
##$PFORMAT= <normpl>
##$SURQMSG= 1
$$ End of Bruker specific parameters
$$ ---------------------------------
##NTUPLES= NMR SPECTRUM
##VAR_NAME=  FREQUENCY,     SPECTRUM/REAL,   SPECTRUM/IMAG
##SYMBOL=    X,             R,               I
##VAR_TYPE=  INDEPENDENT,   DEPENDENT,       DEPENDENT
##VAR_FORM=  AFFN,          ASDF,            ASDF
##VAR_DIM=   131072,        131072,          131072
##UNITS=     HZ,            ARBITRARY UNITS, ARBITRARY UNITS
##FACTOR=    0.0627417313425164, 1,          1
##FIRST=     8223.62146879497, -2084,        -57461
##LAST=      0,             -141,            -57860
##MIN=       0,             -14280,          0
##MAX=       8223.62146879497, 439653127,    0
$$ Real data points
##PAGE= N=1
##DATA TABLE= (X++(R..R)), XYDATA
$$ [...]
$$ plain form
63820 675828 646190 619042 594838 573194 553424 535435 519708 506431 495107 485158 476348 468301
63808 468301 460058 450785 440783 431272 423091 415958 409073 402023 394881 387751 380604 373492 366584 359921
63794 359921 353320 346679 340268 334605 330081 326775 324454 322578 320470 317883 315348 313598 312555 311332
63780 311332 309359 307032 304917 302824 300261 297466 295284 294102 293520 293109 292906 293075 293569 294277 295031 295320
63764 295320 294491 292527 290242 288460 287237 286066 284587 282929 281599 281158 281694 282543 282868 282640 282662 283538
63748 283538 285080 286958 289414 292910 297370 302138 306490 309940 312358 314126 315946 318182 320587 322853
63734 322853 325108 327554 329943 331844 333226 334455 335920 337985 341038 345127 349744 354378 359148 364462
63720 364462 370223 375906 381352 386908 392684 398135 402557 405642 407371 407658 406372 403619 399881 395854
$$ packed form
63820F75828k9638k7148k4204k1644j9770j7989j5727j3277j1324r949q810q047
63808D68301q243r273j0002r511q181p133o885p050p142p130p147p112o908o663
63794C59921o601o641o411n663m524l306k321j876k108k587k535j750j043j223
63780C11332j973k327k115k093k563k795k182j182n82m11k03J69M94P08P54K89
63764B95320q29j964k285j782j223j171j479j658j330m41N36Q49L25k28K2Q76
63748B83538J542J878K456L496M460M768M352L450K418J768J820K236K405K266
63734C22853K255K446K389J901J382J229J465K065L053M089M617M634M770N314
63720C64462N761N683N446N556N776N451M422L085J729K87j286k753l738m027
$$ plain form
63706 395854 392078 388625 385202 381690 378425 375778 373689 371926 370652 370336 371188 373031 375678 378926 382142
63691 382142 384385 385243 385273 385375 385990 387022 388171 389013 389057 388234 387252 387033 387709 388467 388487 387823 387247 387484 388773
63672 388773 390989 393854 396985 400039 402945 405926 409176 412550 415662 418181 419944 420785 420440 418678 415519
63657 415519 411270 406291 400745 394636 388168 381920 376449 371767 367489 363485 360035 357209 354572 351865
63643 351865 349646 348751 349300 350731 352636 355016 357715 360239 362342 364367 366797 369781 373232 377066 381187
63628 381187 385526 390307 395969 402742 410516 419129 428485 438395 448789 460199 473512 489023 506169
63615 506169 524390 543802 564767 587294 611297 636943 664240 692502 720644 747730 772816
63604 772816 794590 811735 823690 830752 833583 832929 829681 824833 819269 813626 808108 802336 795689 787988
$$ packed form
63706C95854l776l453l423l512l265k647k089j763j274l16Q52J843K647L248L216
63691C82142K243Q58L0J02O15J032J149Q42M4q23r82k19O76P58K0o64n76K37J289
63672C88773K216K865L131L054K906K981L250L374L112K519J763Q41l45j762l159
63657D15519m249m979n546o109o468o248n471m682m278m004l450k826k637k707
63643C51865k219q95N49J431J905K380K699K524K103K025K430K984L451L834M121
63628C81187M339M781N662O773P774Q613R356R910J0394J1410J3313J5511J7146
63615E06169J8221J9412K0965K2527K4003K5646K7297K8262K8142K7086K5086
63604G72816K1774J7145J1955P062K831o54l248m848n564n643n518n772o647p701
$$ plain form
63590 787988 779508 770169 759199 745940 730562 713659 695646 677049 658822 641708 625585 610136
63578 610136 595848 583654 573834 566001 559971 555856 553371 551884 551173 551427 552481 553859 555651 558480
63564 558480 562333 566237 569550 572979 577806 584589 593077 602964 614213 626949 641553 658752 679238
63551 679238 703244 730720 761864 797249 837383 881904 928653 973375 1010832 1036998 1050530
63540 1050530 1052437 1044806 1030084 1011101 990895 971991 955647 941784 929645 918644 908590 899108
63528 899108 889098 877086 862145 844322 824249 802603 779864 756187 731442 705690 679704
63517 679704 654709 631510 610117 590267 571917 555111 539764 525878 513659 503175 493997 485434
63505 485434 477065 468982 461689 455745 451216 447419 443528 439547 436279 434118 432340 429952 426935 424173
$$ packed form
63590G87988q480r339j0970j3259j5378j6903j8013j8597j8227j7114j6123j5449
63578F10136j4288j2194r820p833o030m115k485j487p11K54J054J378J792K829
63564E58480L853L904L313L429M827O783Q488R887J1249J2736J4604J7199K0486
63551F79238K4006K7476L1144L5385M0134M4521M6749M4722L7457K6166J3532
63540A050530J907p631j4722j8983k0206j8904j6344j3863j2139j1001j0054r482
63528H99108j0010j2012j4941j7823k0073k1646k2739k3677k4745k5752k5986
63517F79704k4995k3199k1393j9850j8350j6806j5347j3886j2219j0484r178q563
63505D85434q369q083p293n944m529l797l891l981l268k161j778k388l017k762
$$ plain form
63491 424173 422349 421348 420657 419896 418932 417938 417484 418237 420333 423234 426337 429602 433421 438030 443191 448399
63475 448399 453217 457463 461223 464693 467816 470059 470717 469640 467505 465182 462829 459828 455652 450576
63461 450576 445487 441141 437740 435089 433002 431530 430841 430946 431670 432982 435195 438591 442974 447942 453529
63446 453529 460206 468179 477173 487000 497954 510492 524988 542041 562655 587840 618313 654520
63434 654520 696093 740780 784468 822924 853356 874324 885260 887065 882538 875046 866853 859370
63422 859370 854426 853960 858573 867609 880823 898826 921482 946853 972180 995252 1014497 1028688
63410 1028688 1037258 1040506 1039120 1033894 1026071 1017248 1008442 999682 990707 981380 971043 958255 941934
63397 941934 922390 900689 877352 852190 825159 796860 768358 740833 715110 691202 668590
$$ packed form
63491D24173j824j001o91p61r64r94m54P53K096K901L103L265L819M609N161N208
63475D48399M818M246L760L470L123K243O58j077k135k323k353l001m176n076
63461D50576n089m346l401k651k087j472o89J05P24J312K213L396M383M968N587
63446D53529O677P973Q994R827J0954J2538J4496J7053K0614K5185L0473L6207
63434F54520M1573M4687M3688L8456L0432K0968J0936J805m527p492q193p483
63422H59370m944m66M613R036J3214J8003K2656K5371K5327K3072J9245J4191
63410A028688Q570L248j386n226p823q823q806q760q975r327j0337j2788j6321
63397I41934j9544k1701k3337k5162k7031k8299k8502k7525k5723k3908k2612
$$ plain form
63386 668590 647191 627681 610641 595919 583253 572948 565309 559836 555714 552852 551762 552526 554649
63373 554649 557948 562927 569998 578767 588451 598781 610180 623067 637252 652276 668299 686283
63361 686283 707024 730273 755238 781691 809967 839926 870597 900871 929768 955862 977354
63350 977354 993236 1003764 1009433 1010222 1006434 999541 991358 982740 973771 964687 955740 946399 935516 922266
63336 922266 906376 887758 866641 844003 821117 798616 776502 754984 734786 716699 701438
63325 701438 689835 682656 680199 682444 689233 699502 710375 717827 718668 711740 697610 677885 654814
63312 654814 630593 606515 583064 560868 540967 523988 509646 497365 486956 478389 471319 465261
63300 465261 460015 455658 452207 449465 447140 445038 443176 441583 439865 437219 433244 428565 424213 420524
$$ packed form
63386F68590k1399j9510j7040j4722j2666j0305p639n473m122k862j090P64K123
63373E54649L299M979P071Q769R684J0330J1399J2887J4185J5024J6023J7984
63361F86283K0741K3249K4965K6453K8276K9959L0671L0274K8897K6094K1492
63350I77354J5882J0528N669P89l788o893q183q618q969r084q947r341j0883j3250
63336I22266j5890j8618k1117k2638k2886k2501k2114k1518k0198j8087j5261
63325G01438j1603p179k457K245O789J0269J0873P452Q41o928j4130j9725k3071
63312F54814k4221k4078k3451k2196j9901j6979j4342j2281j0409q567p070o058
63300D65261n246m357l451k742k325k102j862j593j718k646l975m679m352l689
$$ plain form
63286 420524 417096 413693 410552 407785 405150 402667 400898 400265 400423 400604 400286 399435 398426 397872 398103 398579
63270 398579 398217 396617 394641 393459 393301 393544 393811 394490 396185 398984 402418 405950 409330 412507 415355
63255 415355 417677 419524 421303 423407 425836 428383 431051 434034 437379 440989 444948 449484 454624 460170
63241 460170 466079 472565 479782 487720 496544 506745 518804 532825 548565 565611 583508 601946
63229 601946 620988 640964 662074 684157 706789 729481 751827 773641 794917 815557 835350
63218 835350 854465 873730 894040 915562 937866 960714 984285 1008635 1033301 1057335 1079304
63207 1079304 1097319 1109708 1115869 1116106 1110706 1099668 1083411 1063063 1039682 1013650 985232 955409
63195 955409 925756 897649 871801 848398 827416 808889 792991 779936 769897 763201 760338 761346
$$ packed form
63286D20524l428l403l141k767k635k483j769o33J58J81l18q51j009n54K31M76
63270C98579l62j600j976j182j58K43K67O79J695K799L434L532L380L177K848
63255D15355K322J847J779K104K429K547K668K983L345L610L959M536N140N546
63241D60170N909O486P217P938Q824J0201J2059J4021J5740J7046J7897J8438
63229F01946J9042J9976K1110K2083K2632K2692K2346K1814K1276K0640J9793
63218H35350J9115J9265K0310K1522K2304K2848K3571K4350K4666K4034K1969
63207A079304J8015J2389O161K37n400j1038j6257k0348k3381k6032k8418k9823
63195I55409k9653k8107k5848k3403k0982j8527j5898j3055j0039o696k863J008
$$ plain form
63183 761346 765355 771307 779141 789660 803182 819017 836458 855443 875794 896513 916618 936261
63171 936261 956298 977014 997932 1018717 1039511 1060209 1079974 1097697 1112677 1124650 1133398 1138518
63159 1138518 1139480 1135840 1127392 1114110 1095992 1073093 1045842 1015191 982388 948636 914929 881954
63147 881954 850078 819565 790882 764575 740846 719462 700141 682816 667522 654363 643534
63136 643534 634982 627996 621615 615590 610488 606731 604102 602367 601736 602278 603489 605028 607394 611265 616537
63121 616537 622577 629007 635520 641326 645705 648992 652168 655450 658099 659679 660642 661420 661696 661039 659665
63106 659665 658072 656348 654292 651933 649486 647020 644536 642190 640078 637896 635192 631964 628741 626029
63092 626029 623867 621954 620087 618387 617139 616501 616442 616955 618129 619881 621828 623681 625648 628124 631061
$$ packed form
63183G61346M009N952P834J0519J3522J5835J7441J8985K0351K0719K0105J9643
63171I36261K0037K0716K0918K0785K0794K0698J9765J7723J4980J1973Q748N120
63159A138518R62l640q448j3282j8118k2899k7251l0651l2803l3752l3707l2975
63147H81954l1876l0513k8683k6307k3729k1384j9321j7325j5294j3159j0829
63136F43534q552o986o381o025n102l757k629j735o31N42J211J539K366L871N272
63121F16537O040O430O513N806M379L287L176L282K649J580R63P78K76o57j374
63106F59665j593j724k056k359k447k466k484k346k112k182k704l228l223k712
63092F26029k162j913j867j700j248o38n9N13J174J752J947J853J967K476K937
$$ plain form
63077 631061 634030 636918 640075 643625 647111 650143 653130 656980 662243 668806 676235 684166 692571 702022
63063 702022 713460 727248 742542 758092 773744 790629 809768 831055 853916 878462 905410
63052 905410 935117 967382 1002189 1039979 1080940 1124483 1169826 1216738 1265256 1314864 1364537
63041 1364537 1413675 1462532 1511505 1560303 1608115 1654395 1699197 1742879 1785838 1828537 1871452
63030 1871452 1914636 1957363 1998276 2035894 2068928 2096163 2116281 2127970 2130234 2122522 2104634 2076710
63018 2076710 2039398 1993856 1941406 1883293 1820919 1756159 1691116 1627524 1566643 1509667 1457821
63007 1457821 1411918 1372212 1338968 1312881 1294499 1283477 1278855 1280010 1286858 1299074 1315718 1335920
62995 1335920 1359521 1386620 1416835 1449583 1484904 1523175 1563777 1604651 1643827 1681150 1717952
$$ packed form
63077F31061K969K888L157L550L486L032K987L850N263O563P429P931Q405R451
63063G02022J1438J3788J5294J5550J5652J6885J9139K1287K2861K4546K6948
63052I05410K9707L2265L4807L7790M0961M3543M5343M6912M8518M9608M9673
63041A364537M9138M8857M8973M8798M7812M6280M4802M3682M2959M2699M2915
63030A871452M3184M2727M0913L7618L3034K7235K0118J1689K264p712j7888k7924
63018B076710l7312m5542n2450n8113o2374o4760o5043o3592o0881n6976n1846
63007A457821m5903l9706l3244k6087j8382j1022m622J155O848J2216J6644K0202
62995A335920K3601K7099L0215L2748L5321L8271M0602M0874L9176L7323L6802
$$ plain form
62984 1717952 1755136 1792118 1827658 1860877 1890953 1916342 1935067 1945861 1948530 1943171 1929472 1906917
62972 1906917 1875331 1835049 1786873 1732135 1672553 1609716 1544766 1478792 1413339 1350201 1290606
62961 1290606 1234742 1182142 1132421 1085642 1042019 1001406 963210 926931 892757 861399 833315
62950 833315 808238 785475 764419 744646 725833 707887 691055 675594 661375 648036 635463
62939 635463 623791 612936 602564 592679 583884 576700 570772 565114 559138 553178 547937 543691 540200
62926 540200 537174 534571 532445 530712 529112 527278 524864 521764 518334 515287 513221 512206 511763 511220 510074
62911 510074 508189 505853 503685 502345 502193 503130 504732 506531 508214 509625 510770 511938 513647 516086 518480
62896 518480 519373 517980 515087 512223 510045 507976 505415 502692 500644 499720 499842 500730 502028 503395 504797
$$ packed form
62984A717952L7184L6982L5540L3219L0076K5389J8725J0794K669n359j3699k2555
62972A906917l1586m0282m8176n4738n9582o2837o4950o5974o5453o3138n9595
62961A290606n5864n2600m9721m6779m3623m0613l8196l6279l4174l1358k8084
62950H33315k5077k2763k1056j9773j8813j7946j6832j5461j4219j3339j2573
62939F35463j1672j0855j0372r885q795p184n928n658n976n960n241m246l491
62926E40200l026k603k126j733j600j834k414l100l430l047k066j015m43n43j146
62911E10074j885k336k168j340j52R37J602J799J683J411J145J168J709K439K394
62896E18480Q93j393k893k864k178k069k561k723k048r24J22Q88J298J367J402
$$ plain form
62881 504797 506427 508090 509096 509132 508754 508467 507760 505850 503065 500602 498945 497442 495552 493625 492067
62866 492067 490569 488732 486882 485671 485213 485200 485519 486156 486656 486390 485496 485055 486122 488762 492132 495290
62850 495290 497744 499417 500426 501104 502050 503745 505906 507465 507537 506322 504789 503616 502855 502484 502693 503380
62834 503380 503912 503737 503024 502458 502647 503877 506156 509134 512170 514755 516811 518459 519742 520794 522073
62819 522073 524049 526691 529525 532238 535038 538356 542277 546376 550204 553834 557708 561916 566018 569828
62805 569828 573972 579183 585322 591709 598215 605287 612959 620672 628266 636301 645138 654507 664518 676267
62791 676267 690804 708044 727430 749162 773939 801804 832096 864491 899342 936977 977253
62780 977253 1019970 1065316 1113812 1166100 1222694 1283623 1348416 1416676 1488415 1563421 1640507
$$ packed form
62881E04797J630J663J006L6l78k87p07j910k785k463j657j503j890j927j558
62866D92067j498j837j850j211m58j3L19O37N00k66q94m41J067K640L370L158
62850D95290K454J673J009O78R46J695K161J559P2j215j533j173p61l71K09O87
62834E03380N32j75p13n66J89J230K279K978L036K585K056J648J283J052J279
62819E22073J976K642K834K713K800L318L921M099L828L630L874M208M102L810
62805E69828M144N211O139O387O506P072P672P713P594Q035Q837R369J0011J1749
62791F76267J4537J7240J9386K1732K4777K7865L0292L2395L4851L7635M0276
62780I77253M2717M5346M8496N2288N6594O0929O4793O8260P1739P5006P7086
$$ plain form
62769 1640507 1717865 1793933 1867306 1935917 1997003 2048069 2087501 2114251 2127500 2126799 2112198 2084115
62757 2084115 2043453 1991880 1931514 1864124 1790991 1713633 1634215 1554933 1477298 1402263 1330777
62746 1330777 1263740 1201481 1143598 1089504 1039014 992352 949660 910722 875207 843039 814272
62735 814272 788734 766108 746339 729547 715403 703017 691693 681408 672374 664574 658104 653440
62723 653440 650732 649186 647833 646801 647133 649362 652937 657144 661974 667818 674801 682808 691910 702440
62709 702440 714750 728992 745101 762951 782673 804788 829902 858307 890024 925090 963593
62698 963593 1005541 1050983 1100234 1153778 1211968 1274890 1342258 1413232 1486558 1561095 1635876
62687 1635876 1709331 1778847 1841642 1895838 1940181 1973018 1992342 1996904 1986750 1962807 1926544
$$ packed form
62769A640507P7358P6068P3373O8611O1086N1066L9432K6750J3249p01j4601k8083
62757B084115m0662n1573o0366o7390p3133p7358p9418p9282p7635p5035p1486
62746A330777o7037o2259n7883n4094n0490m6662m2692l8938l5515l2168k8767
62735H14272k5538k2626j9769j6792j4144j2386j1324j0285r034p800o470m664
62723F53440k708j546j353j032L32K229L575M207M830N844O983Q007R102J0530
62709G02440J2310J4242J6109J7850J9722K2115K5114K8405L1717L5066L8503
62698I63593M1948M5442M9251N3544N8190O2922O7368P0974P3326P4537P4781
62687A635876P3455O9516O2795N4196M4343L2837J9324M562j0154k3943l6263
$$ plain form
62676 1926544 1879966 1825128 1763377 1695605 1623304 1548747 1473916 1399836 1327245 1257288 1191147
62665 1191147 1129359 1071974 1019109 971055 928006 889878 856181 825991 798373 773000 750015
62654 750015 729224 709843 691331 674027 658581 645022 632828 621788 612320 604866 599235 594719
62642 594719 590773 587409 584839 582912 581220 579701 578615 577696 575900 572554 568344 564509 561320 558182
62628 558182 554991 552415 550698 549158 547245 545328 543993 543270 543004 543382 544486 545788 546706 547329 548049 548759
62612 548759 548993 548685 548350 548553 549555 551353 553815 556923 561096 566983 574648 583290 592220 601884 613470
62597 613470 627677 644366 663390 685151 710188 738572 769942 803870 839980 877812 916784
62586 916784 956248 995421 1033239 1068466 1100064 1127315 1149373 1164918 1172812 1173169 1167246 1155957
$$ packed form
62676A926544m6578n4838o1751o7772p2301p4557p4831p4080p2591o9957o6141
62665A191147o1788n7385n2865m8054m3049l8128l3697l0190k7618k5373k2985
62654G50015k0791j9381j8512j7304j5446j3559j2194j1040r468p454n631m516
62642E94719l946l364k570j927j692j519j086r19j796l346m210l835l189l138
62628E58182l191k576j717j540j913j917j335p23k66L78J104J302R18O23P20P10
62612E48759K34l08l35K03J002J798K462L108M173N887P665Q642Q930R664J1586
62597F13470J4207J6689J9024K1761K5037K8384L1370L3928L6110L7832L8972
62586I16784L9464L9173L7818L5227L1598K7251K2058J5545P894L57n923j1289
$$ plain form
62574 1155957 1139077 1116333 1088647 1057518 1023683 987398 949819 912862 877538 843493 810522
62563 810522 779538 751503 726269 703135 681944 662992 646392 632087 619964 609413 599318
62552 599318 589104 579386 571043 564147 558338 553612 549917 546541 542914 539740 538266 538499 539104 539122 538839
62537 538839 538770 538740 538488 538451 539289 540969 542901 544873 547391 551026 555725 561008 566794 573753 582639 593417
62521 593417 605481 618717 633846 651450 671219 692627 716006 742361 772302 805704 842321
62510 842321 882277 925878 973262 1024192 1077879 1133084 1188624 1243633 1297150 1347865 1394757
62499 1394757 1437821 1477743 1515045 1550080 1583654 1616971 1650938 1685960 1722336 1760316 1799942
62488 1799942 1841614 1886768 1936852 1990786 2043812 2089606 2123841 2145901 2157672 2160868 2155009 2137264
$$ packed form
62574A155957j6880k2744k7686l1129l3835l6285l7579l6957l5324l4045l2971
62563H10522l0984k8035k5234k3134k1191j8952j6600j4305j2123j0551j0095
62552E99318j0214r718q343o896n809m726l695l376l627l174j474K33O05J8k83
62537E38839o9l0k52l7Q38J680J932J972K518L635M699N283N786O959Q886J0778
62521E93417J2064J3236J5129J7604J9769K1408K3379K6355K9941L3402L6617
62510H42321L9956M3601M7384N0930N3687N5205N5540N5009N3517N0715M6892
62499A394757M3064L9922L7302L5035L3574L3317L3967L5022L6376L7980L9626
62488A799942M1672M5154N0084N3934N3026M5794L4235K2060J1771L196n859j7745
$$ plain form
62476 2137264 2104230 2054383 1989275 1912546 1827814 1737403 1642696 1545226 1447169 1350849 1258056
62465 1258056 1170030 1087942 1013028 946155 887496 836687 793064 755728 723833 697036 675291
62454 675291 657927 643327 629969 617503 606400 596859 588591 581491 575885 572000 569616 568223 567243
62441 567243 566201 565083 564459 564794 565710 566364 566460 566394 566359 565916 564622 562665 560596 558656 556520 553586 549492
62424 549492 544547 539575 535050 530502 525138 518951 512778 507282 502349 497549 492774 488304 484589 482024
62410 482024 480601 479690 478504 476851 475168 473902 473273 473552 474941 477063 479136 480926 483076 486201 490109
62395 490109 494239 498455 502988 507803 512475 516681 520560 524577 529102 534178 539687 545765 552764 560609
62381 560609 568528 575882 582980 590433 597866 604163 609122 613936 619589 625599 630993 635922 641547 648748
$$ packed form
62476B137264l3034m9847o5108p6729q4732r0411r4707r7470r8057r6320r2793
62465A258056q8026q2088p4914o6873n8659n0809m3623l7336l1895k6797k1745
62454F75291j7364j4600j3358j2466j1103r541q268p100n606l885k384j393r80
62441E67243j042j118o24L35R16O54R6o6l5m43j294j957k069j940k136k934m094
62424E49492m945m972m525m548n364o187o173n496m933m800m775m470l715k565
62410D82024j423r11j186j653j683j266o29K79J389K122K073J790K150L125L908
62395D90109M130M216M533M815M672M206L879M017M525N076N509O078O999P845
62381E60609P919P354P098P453P433O297M959M814N653O010N394M929N625P201
$$ plain form
62367 648748 657786 669063 683367 701232 722566 747018 774292 804102 836333 871414 910147 952953
62355 952953 999502 1049124 1101141 1154422 1206803 1255396 1297772 1332907 1361047 1382809 1398515
62344 1398515 1408251 1412157 1410343 1402674 1389064 1370050 1346707 1319817 1289406 1255310 1217981 1178569
62332 1178569 1138377 1098514 1059872 1023047 988245 955420 924552 895686 868757 843542 819774
62321 819774 797220 775725 755304 736158 718532 702571 688244 675285 663258 651968 641843
62310 641843 633531 626910 620890 614631 608665 604278 601869 600528 599347 598510 598725 600101 602226 605140 609491
62295 609491 615553 622617 629726 636699 644090 652309 661186 670320 679479 688626 697873 707451 717429 727450
62281 727450 737019 746120 755100 763866 771700 778154 783629 788626 792837 795616 797122 798322 799902 801774
$$ packed form
62367F48748R038J1277J4304J7865K1334K4452K7274K9810L2231L5081L8733M2806
62355I52953M6549M9622N2017N3281N2381M8593M2376L5135K8140K1762J5706
62344A398515R736L906j814p669j3610j9014k3343k6890l0411l4096l7329l9412
62332A178569m0192l9863l8642l6825l4802l2825l0868k8866k6929k5215k3768
62321H19774k2554k1495k0421j9146j7626j5961j4327j2959j2027j1290j0125
62310F41843q312o621o020o259n966m387k409j341j181q37K15J376K125K914M351
62295F09491O062P064P109O973P391Q219Q877R134R159R147R247R578R978J0021
62281G27450R569R101Q980Q766P834O454N475M997M211K779J506J200J580J872
$$ plain form
62267 801774 803757 806216 809904 815623 824260 836659 853172 873610 897837 926144 958878 995975
62255 995975 1037025 1081493 1128582 1177099 1225676 1272911 1317091 1356115 1388121 1412156 1428012
62244 1428012 1435580 1434776 1426094 1410768 1390078 1364564 1334120 1298842 1259565 1217492 1173502 1128159
62232 1128159 1082419 1037907 996170 957830 922758 890920 862597 837823 816035 796469 778628
62221 778628 762330 747615 734798 724261 715917 709048 702925 697427 692848 689183 685948 682746 679788
62208 679788 677687 676743 676618 676781 677183 678217 680024 682230 684565 687425 691406 696411 701622 706375 710770
62193 710770 715477 721229 728458 736982 745950 754379 761950 769154 776701 784923 793583 801970 809312 815480
62179 815480 821199 827127 832852 837321 840224 842368 844661 847500 851502 858112 868866 884303 904052
$$ packed form
62267H01774J983K459L688N719Q637J2399J6513K0438K4227K8307L2734L7097
62255I95975M1050M4468M7089M8517M8577M7235M4180L9024L2006K4035J5856
62244A428012P568q04q682j5326k0690k5514l0444l5278l9277m2073m3990m5343
62232A128159m5740m4512m1737l8340l5072l1838k8323k4774k1788j9566j7841
62221G78628j6298j4715j2817j0537q344o869o123n498m579l665l235l202k958
62208F79788k101r44j25J63M02J034J807K206K335K860L981N005N211M753M395
62193G10770M707N752P229Q524Q968Q429P571P204P547Q222Q660Q387P342O168
62179H15480N719N928N725M469K903K144K293K839M002O610J0754J5437J9749
$$ plain form
62166 904052 927681 955019 985825 1019573 1055481 1092453 1129012 1163583 1194819 1221582 1242842
62155 1242842 1257932 1266902 1270456 1269445 1264388 1255348 1242178 1224899 1203776 1179033 1150823 1119838
62143 1119838 1087716 1056336 1026727 999012 973238 949613 928026 908166 890400 875834 865053
62132 865053 857305 851273 846233 842094 838894 836752 835952 836551 838223 840885 845105 851354 859191 867730 876640
62117 876640 886107 895982 905572 914300 922134 929364 936322 943258 950061 956077 960416 962418 961697 958070
62103 958070 951850 944131 936432 930091 926097 925069 926875 930466 934596 938705 942747 946398 949080 950810
62089 950810 952507 955191 959141 963917 968980 974180 979863 986570 994586 1003860 1014492 1027088 1042314
62076 1042314 1060226 1080306 1102102 1125459 1150033 1174886 1198799 1220996 1241583 1261299 1280806
$$ packed form
62166I04052K3629K7338L0806L3748L5908L6972L6559L4571L1236K6763K1260
62155A242842J5090Q970L554j011n057r040j3170j7279k1123k4743k8210l0985
62143A119838l2122l1380k9609k7715k5774k3625k1587j9860j7766j4566j0781
62132H65053p748o032n040m139l200k142q00N99J672K662M220O249P837Q539Q910
62117H76640R467R875R590Q728P834P230O958O936O803O016M339K002p21l627
62103I58070o220p719p699o341l994j028J806L591M130M109M042L651K682J730
62089I50810J697K684L950M776N063N200N683O707Q016R274J0632J2596J5226
62076A042314J7912K0080K1796K3357K4574K4853K3913K2197K0587J9716J9507
$$ plain form
62065 1280806 1300221 1319362 1338222 1356902 1375117 1392193 1407522 1420542 1430260 1435558 1436424 1434337
62053 1434337 1430937 1426685 1421250 1414622 1407095 1398423 1387677 1373866 1356225 1334172 1307735 1278008
62041 1278008 1246549 1214194 1180795 1146080 1110342 1074309 1038707 1003877 969585 935429 901863
62030 901863 870473 842658 818295 796290 776142 758094 741942 726773 712180 698821 687273
62019 687273 676995 666937 656701 646594 636854 627467 618617 610864 604717 600215 597026 594927 594086
62006 594086 594791 597039 600695 605978 613218 621939 630840 639125 647248 655675 663551 669610 673947 677603
61992 677603 680500 681182 678917 674785 670053 664574 657608 649387 640872 632449 623807 614854 605965 597436
61978 597436 589373 582110 576105 571323 567098 562731 558020 553274 549034 545676 543082 540763 538459 536409
$$ packed form
62065A280806J9415J9141J8860J8680J8215J7076J5329J3020R718N298Q66k087
62053A434337l400m252n435o628p527q672j0746j3811j7641k2053k6437k9727
62041A278008l1459l2355l3399l4715l5738l6033l5602l4830l4292l4156l3566
62030I01863l1390k7815k4363k2005k0148j8048j6152j5169j4593j3359j1548
62019F87273j0278j0058j0236j0107r740r387q850p753o147m502l189k099q41
62006E94086P05K248L656N283P240Q721Q901Q285Q123Q427P876O059M337L656
61992F77603K897O82k265m132m732n479o966q221q515q423q642q953q889q529
61978E97436q063p263o005m782m225m367m711m746m240l358k594k319k304k050
$$ plain form
61964 536409 534829 533426 531777 530050 528941 528907 529726 530852 532012 533437 535646 539014 543501 548846 554990
61949 554990 562156 570505 579935 590388 602133 615572 630825 647675 665846 685266 706062 728346
61937 728346 751986 776663 802178 828477 855202 881449 906277 929311 950548 969800 986793
61926 986793 1001566 1014092 1023530 1028595 1028880 1025264 1018918 1010535 1000747 990581 981063 972940 967229 965431
61912 965431 968596 976494 988222 1003273 1021483 1042259 1064493 1087068 1108914 1128754 1145311 1157757
61900 1157757 1165590 1168316 1165773 1158603 1147834 1134002 1117126 1097523 1076050 1053438 1029876 1005470
61888 1005470 980783 956719 934106 913510 895112 878524 862883 847406 831917 816784 802425
61877 802425 788938 776237 764470 754169 745822 739334 734161 729999 727096 725693 725468 725845 726785 729019
$$ packed form
61964E36409j580j403j649j727j109l4Q19J126J160J425K209L368M487N345O144
61949E54990P166Q349R430J0453J1745J3439J5253J6850J8171J9420K0796K2284
61937G28346K3640K4677K5515K6299K6725K6247K4828K3034K1237J9252J6993
61926I86793J4773J2526R438N065K85l616o346q383r788j0166r518q123n711j798
61912I65431L165P898J1728J5051J8210K0776K2234K2575K1846J9840J6557J2446
61900A157757P833K726k543p170j0769j3832j6876j9603k1473k2612k3562k4406
61888A005470k4687k4064k2613k0596j8398j6588j5641j5477j5489j5133j4359
61877H02425j3487j2701j1767j0301q347o488n173m162k903j403k25L77R40K234
$$ plain form
61863 729019 733531 740907 751065 763451 777567 793422 811477 832192 855851 882797 913370 947376
61851 947376 983941 1022253 1062229 1104162 1147827 1192228 1236037 1278012 1317078 1352293 1382688
61840 1382688 1407055 1424206 1433736 1436302 1432906 1424252 1411252 1395835 1380563 1367371 1357117 1350283
61828 1350283 1347490 1349170 1355208 1365170 1378539 1394445 1411350 1427228 1440028 1448002 1449923 1445247 1434051
61815 1434051 1416759 1393864 1365789 1332915 1295915 1256165 1215542 1175430 1136017 1096975 1058710
61804 1058710 1022520 989516 959840 932995 908462 885852 864907 845664 828402 813200 799754
61793 799754 787798 777393 768624 761180 754503 748170 742012 736046 730477 725578 721373 717605 714094 710864
61779 710864 707744 704238 700142 696093 693040 691257 690224 689334 688310 686971 685173 683145 681503 680664 680521
$$ packed form
61863G29019M512P376J0158J2386J4116J5855J8055K0715K3659K6946L0573L4006
61851I47376L6565L8312L9976M1933M3665M4401M3809M1975L9066L5215L0395
61840A382688K4367J7151R530K566l396q654j3000j5417j5272j3192j0254o834
61828A350283k793J680O038R962J3369J5906J6905J5878J2800P974J921m676j1196
61815A434051j7292k2895k8075l2874l7000l9750m0623m0112l9413l9042l8265
61804A058710l6190l3004k9676k6845k4533k2610k0945j9243j7262j5202j3446
61793G99754j1956j0405q769p444o677o333o158n966n569m899m205l768l511l230
61779G10864l120l506m096m049l053j783j033q90j024j339j798k028j642q39j43
$$ plain form
61764 680521 680843 681660 683034 684779 686796 689357 692561 695666 697571 698027 697859 697807 697625 696593 694442 691384
61748 691384 687578 683163 678672 674842 671912 669444 666939 664287 661566 658830 656268 654270 653059 652376
61734 652376 651693 650647 649232 647779 646843 646878 647817 649088 650205 651228 652584 654578 657202 660204 663185
61719 663185 665758 667821 669595 671246 672542 672966 672100 669836 666326 661866 656745 651146 645215 639134 632987
61704 632987 626588 619801 612995 606843 601486 596261 590454 584028 577399 570904 564881 559930 556474 554135
61690 554135 551997 549574 547170 545205 543508 541430 538475 534709 530638 526775 523265 520025 517200 515283
61676 515283 514571 514640 514603 513873 512546 511140 510093 509402 508607 507283 505692 504691 504767 505421 505867 506081 506653 507716
61658 507716 508641 508884 508658 508545 508818 509417 510279 511413 512771 514342 516326 519087 522876 527597 532733 537605
$$ packed form
61764F80521L22Q17J374J745K017K561L204L105J905M56j68n2j82j032k151l058
61748F91384l806m415m491l830k930k468k505k652k721k736k562j998j211o83
61734F52376o83j046j415j453r36L5R39J271J117J023J356J994K624L002K981
61719F63185K573K063J774J651J296M24q66k264l510m460n121n599n931o081o147
61704F32987o399o787o806o152n357n225n807o426o629o495o023m951l456k339
61690E54135k138k423k404j965j697k078k955l766m071l863l510l240k825j917
61676E15283p12O9l7p30j327j406j047o91p95j324j591j001P6O54M46K14N72J063
61658E07716R25K43k26j13K73N99Q62J134J358J571J984K761L789M721N136M872
$$ plain form
61642 537605 541839 545540 548846 551470 552961 553436 553621 554030 554363 553924 552309 549506 545564 540598 535037
61627 535037 529501 524279 519160 513917 508828 504520 501354 499192 497816 497355 497997 499410 500756 501360 501118
61612 501118 500148 498361 495565 491770 487145 481829 476085 470436 465340 460781 456450 452245 448314 444716
61598 444716 441402 438500 436247 434574 433074 431450 429761 428174 426728 425366 423937 422135 419732 416919
61584 416919 414235 412117 410761 410308 410746 411553 411913 411504 410764 410204 409803 409289 408641 407990 407320 406655 406325 406657
61566 406657 407533 408580 409712 411144 412925 414744 416204 417096 417449 417555 417918 418921 420480 422168 423585
61551 423585 424519 424909 424919 424961 425338 426004 426934 428543 431209 434425 437073 438789 440532 443432 447537 452108
61535 452108 456686 461147 464945 467205 467829 467886 468567 470091 471877 473337 474106 473877 472579 470670 468819 467308
$$ packed form
61642E37605M234L701L306K624J491M75J85M09L33m39j615k803l942m966n561
61627E35037n536n222n119n243n089m308l166k162j376m61O42J413J346O04k42
61612E01118r70j787k796l795m625n316n744n649n096m559m331m205l931l598
61598D44716l314k902k253j673j500j624j689j587j446j362j429j802k403k813
61584D16919k684k118j356m53M38Q07L60m09p40n60m01n14o48o51o70o65l30L32
61566D06657Q76J047J132J432J781J819J460Q92L53J06L63J003J559J688J417
61551D23585R34L90J0M2L77O66R30J609K666L216K648J716J743K900M105M571
61535D52108M578M461L798K260O24N7O81J524J786J460P69k29j298j909j851j511
$$ plain form
61519 467308 465987 464680 463271 461529 459337 457104 455470 454490 453539 452186 450719 449562 448595 447497 446432
61504 446432 445888 445848 445589 444426 442476 440598 439690 440061 441344 442923 444396 445630 446540 447096 447549 448355 449755
61487 449755 451629 453835 456385 459142 461659 463535 464696 465224 465287 465482 466743 469401 472625 475235 476838
61472 476838 477700 477884 477279 476324 475835 475909 475706 474601 473040 471903 471514 471621 471930 472180 472038 471453 471023 471540
61454 471540 473118 475074 476697 477873 478884 479848 480585 481023 481548 482745 484786 487233 489611 492032 495032
61439 495032 498848 503116 507319 511256 514999 518614 522081 525368 528459 531389 534286 537213 539900 541830
61425 541830 542720 542910 543218 544391 546623 549409 551935 553737 554979 555965 556517 556142 554728 552697 550403 547743
61409 547743 544526 540931 537296 533692 529996 526318 523022 520273 517739 514861 511425 507839 504853 502982
$$ packed form
61519D67308j321j307j409j742k192k233j634r80r51j353j467j157r67j098j065
61504D46432n44m0k59j163j950j878r08L71J283J579J473J234R10N56M53Q06J400
61487D49755J874K206K550K757K517J876J161N28O3J95J261K658L224K610J603
61472D76838Q62J84o05r55m89P4k03j105j561j137l89J07L09K50j42n85m30N17
61454D71540J578J956J623J176J011R64P37M38N25J197K041K447K378K421L000
61439D95032L816M268M203L937L743L615L467L287L091K930K897K927K687J930
61425E41830Q90J90L08J173K232K786K526J802J242R86N52l75j414k031k294k660
61409E47743l217l595l635l604l696l678l296k749k534k878l436l586k986j871
$$ plain form
61395 502982 502168 501903 501553 500604 498932 496971 495384 494366 493502 492572 492186 493109 495145 497273 498855 500140
61379 500140 501489 502828 504155 505997 508786 512165 515419 518401 521478 524679 527444 529381 530925 533029
61365 533029 536275 540346 544261 547163 549034 550774 553544 558017 564100 571231 578841 586682 594930 604102
61351 604102 614901 627991 643622 661229 679481 696963 712850 726856 738767 748337 755572 760749
61339 760749 764073 765519 764995 762478 758049 752112 745377 738238 730258 720844 710402 700231 691167 683011
61325 683011 675457 668835 663495 659142 655365 652276 649998 647973 645589 643211 641797 641620 642154 643173 645129
61310 645129 648262 652144 656475 661797 668965 678239 689264 701574 714673 727773 739856 749989 757358
61297 757358 761192 761127 757702 752143 745404 737607 728630 719051 710124 702756 696805 691586 686798 682688 679471
$$ packed form
61395E02982q14k65l50r49j672j961j587j018q64r30l86R23K036K128J582J285
61379E00140J349J339J327J842K789L379L254K982L077L201K765J937J544K104
61365E33029L246M071L915K902J871J740K770M473O083P131P610P841Q248R172
61351F04102J0799J3090J5631J7607J8252J7482J5887J4006J1911R570P235N177
61339G60749L324J446n24k517m429n937o735p139p980r414j0442j0171r064q156
61325F83011p554o622n340m353l777l089k278k025k384k378j414j77N34J019J956
61310F45129L133L882M331N322P168R274J1025J2310J3099J3100J2083J0133P369
61297G57358L834o5l425n559o739p797q977r579q927p368n951n219m788m110l217
$$ plain form
61282 679471 677022 675169 673972 673648 674471 676793 680860 686469 693059 700256 708096 716627 725659 735081 745070
61267 745070 755612 766115 775860 784816 793776 803813 815837 830466 847893 867703 888894 910034
61255 910034 929487 945760 957890 965401 967903 965102 957369 945918 932084 916675 900277 883776
61243 883776 868101 853617 840240 828034 817325 808298 800849 794721 789512 784719 780134 776085 772945
61230 772945 770629 768916 768032 768413 770090 772774 776345 780629 784843 788028 790111 791865 793688 795040 795325
61215 795325 794754 794054 793759 794062 794935 796133 797361 798643 800252 802295 804844 808483 814041 821596 830482
61200 830482 840586 852864 868073 885731 905129 926774 951732 979737 1008907 1037413 1064532
61189 1064532 1089898 1112586 1131632 1147026 1159586 1169852 1177493 1181873 1183039 1181948 1179651 1176265
$$ packed form
61282F79471k449j853j197l24Q23K322M067N609O590P197P840Q531R032R422R989
61267G45070J0542J0503R745Q956Q960J0037J2024J4629J7427J9810K1191K1140
61255I10034J9453J6273J2130P511K502k801p733j1451j3834j5409j6398j6501
61243H83776j5675j4484j3377j2206j0709r027p449o128n209m793m585m049l140
61230G72945k316j713q84L81J677K684L571M284M214L185K083J754J823J352K85
61215G95325n71p00k95L03Q73J198J228J282J609K043K549L639N558P555Q886
61200H30482J0104J2278J5209J7658J9398K1645K4958K8005K9170K8506K7119
61189A064532K5366K2688J9046J5394J2560J0266P641M380J166j091k297l386
$$ plain form
61177 1176265 1170939 1162882 1152168 1139378 1124792 1108355 1090277 1071062 1050894 1029410 1006348 982118
61165 982118 957582 933501 910351 888434 867910 848871 831530 816243 803219 792390 783672 777076
61153 777076 772351 768864 766292 765326 767169 772159 779277 787123 794899 802094 807659 810306 809671 806640 802335
61138 802335 797287 791913 787256 784654 784802 787679 793295 801897 813363 826974 842147 859059 878179
61125 878179 899487 922525 947056 973253 1001154 1030149 1059143 1087253 1114495 1141773 1169895
61114 1169895 1198367 1225400 1249392 1270259 1289030 1306337 1321705 1334263 1343608 1349862 1353267 1353930
61102 1353930 1351717 1346191 1336891 1323787 1307200 1287153 1263147 1235021 1203801 1171243 1138457 1105414
61090 1105414 1071969 1039049 1008372 981077 956934 935059 915143 897665 882980 870596 859569
$$ packed form
61177A176265n326q057j0714j2790j4586j6437j8078j9215k0168k1484k3062k4230
61165I82118k4536k4081k3150k1917k0524j9039j7341j5287j3024j0829q718o596
61153G77076m725l487k572r66J843M990P118P846P776P195N565K647o35l031m305
61138H02335n048n374m657k602J48K877N616Q602J1466J3611J5173J6912J9120
61125H78179K1308K3038K4531K6197K7901K8995K8994K8110K7242K7278K8122
61114A169895K8472K7033K3992K0867J8771J7307J5368J2558R345O254L405O63
61102A353930k213n526r300j3104j6587k0047k4006k8126l1220l2558l2786l3043
61090A105414l3445l2920l0677k7295k4143k1875j9916j7478j4685j2384j1027
$$ plain form
61079 859569 849445 840532 833343 828066 824631 822969 822992 824425 826856 830004 833870 838671 844570 851455
61065 851455 859005 867081 876029 886406 898358 911438 925129 939480 955141 972863 992980 1015272
61053 1015272 1039332 1065135 1093160 1123753 1156441 1190196 1224383 1259024 1294098 1329172 1364081
61042 1364081 1399372 1435428 1471490 1506224 1539178 1570980 1602129 1632334 1661233 1689027 1715958
61031 1715958 1741673 1765645 1787939 1809181 1830011 1850967 1872672 1895644 1920001 1945805 1973625
61020 1973625 2004289 2038001 2074107 2111894 2151280 2192523 2235661 2280771 2328752 2381482 2440988
61009 2440988 2508626 2585170 2671328 2767733 2874555 2991867 3120989 3265592 3431600 3626657
60999 3626657 3860114 4143045 4487508 4906070 5412945 6025613 6765005 7655866 8730603
$$ packed form
61079H59569j0124q913p189n277l435j662K3J433K431L148L866M801N899O885
61065H51455P550Q076Q948J0377J1952J3080J3691J4351J5661J7722K0117K2292
61053A015272K4060K5803K8025L0593L2688L3755L4187L4641L5074L5074L4909
61042A364081L5291L6056L6062L4734L2954L1802L1149L0205K8899K7794K6931
61031A715958K5715K3972K2294K1242K0830K0956K1705K2972K4357K5804K7820
61020A973625L0664L3712L6106L7787L9386M1243M3138M5110M7981N2730N9506
61009B440988O7638P6544Q6158R6405J06822J17312J29122J44603J66008J95057
60999C626657K33457K82931L44463M18562N06875O12668P39392Q90861J074737
$$ plain form
60990 8730603 10032735 11606462 13463389 15539830 17678259 19658977 21273467 22398783
60982 22398783 23032475 23278111 23301289 23279597 23354242 23584075 23915206 24190510 24208234 23804583
60972 23804583 22914854 21582869 19924685 18078079 16167103 14290146 12521412 10912688
60964 10912688 9492058 8264863 7220522 6341319 5607406 4997851 4491694 4070243 3718115
60955 3718115 3422142 3170468 2953345 2763865 2597113 2448894 2315653 2194953 2085265
60946 2085265 1985372 1894214 1811009 1735139 1665971 1602776 1544419 1489065 1434810 1380918 1328179
60935 1328179 1277880 1230811 1187306 1147488 1111064 1077408 1046329 1018357 993896 972540 953715
60924 953715 937492 924217 913597 904792 897216 890774 885480 881306 878330 876565 875680 875249 875229 875885 877280
$$ packed form
60990H730603J302132J573727J856927K076441K138429J980718J614490J125316
60982B2398783O33692K45636K3178k1692P4645K29833L31131K75304J7724m03651
60972B3804583q89729j331985j658184j846606j910976j876957j768734j608724
60964A0912688j420630j227195j044341q79203p33913o09555n06157m21451l52128
60955C718115k95973k51674k17123j89480j66752j48219j33241j20700j09688
60946B085265r9893r1158q3205p5870o9168o3195n8357n5354n4255n3892n2739
60935A328179n0299m7069m3505l9818l6424l3656l1079k7972k4461k1356j8825
60924I53715j6223j3275j0620q805p576o442n294m174k976j765q85m31k0O56J395
$$ plain form
60909 877280 879078 880766 881876 882072 881212 879185 875663 870350 863580 856257 848918 841245 832783 823693 814340
60894 814340 804594 794064 782818 771340 759974 748901 738454 728990 720526 712888 706047 699946 694309
60881 694309 689032 684480 680797 677207 672654 667050 661273 656017 651278 646963 643274 640252 637448 634347
60867 634347 630850 627276 624192 622236 621696 622210 623176 624431 626213 628541 631105 633774 636727 640065 643736
60852 643736 647879 652718 657965 662755 666403 668926 670826 672724 675254 678758 682842 686578 689334 691029
60838 691029 691431 689727 685260 678475 670755 663433 657066 651496 646227 640835 635282 629968 625478 622188
60824 622188 619990 618282 616308 613682 610563 607215 603591 599517 595136 590800 586552 582068 577118 571819
60810 571819 566395 560983 555706 550674 545895 541380 537318 533885 530867 527753 524271 520630 517264 514522
$$ packed form
60909H77280J798J688J110J96q60k027l522n313o770p323p339p673q462r090r353
60894H14340r746j0530j1246j1478j1366j1073j0447r464q464p638o841o101n637
60881F94309n277m552l683l590m553n604n777n256m739m315l689l022k804l101
60867F34347l497l574l084j956n40N14R66J255J782K328K564K669K953L338L671
60852F43736M143M839N247M790L648K523J900J898K530L504M084L736K756J695
60838F91029M02j704m467o785p720p322o367n570n269n392n553n314m490l290
60824F22188k198j708j974k626l119l348l624m074m381m336m248m484m950n299
60810E71819n424n412n277n032m779m515m062l433l018l114l482l641l366k742
$$ plain form
60796 514522 512542 511136 509831 508330 506929 506200 506260 506640 506855 506766 506400 505843 505452 505789 507063 508805 510309
60779 510309 511323 512246 513691 515900 518540 521066 523236 525109 526560 527192 526943 526466 526567 527477 528906 530559
60763 530559 532252 533808 535252 536871 538716 540258 540938 540774 540033 538684 536815 535159 534440 534358 534058 533495
60747 533495 533466 534250 535078 535110 534193 532420 529682 525934 521363 516052 510055 503937 498601 494325 490543 486833
60731 486833 483424 480482 477607 474534 471756 469970 469247 469162 469273 469154 468405 467186 466407 466922 468671 470878
60715 470878 472914 474739 476692 479007 481401 483109 483686 483769 484611 486766 489644 492415 494830 497016 499008
60700 499008 500720 501981 502559 502634 503186 505203 508399 511442 513567 515112 516276 516445 515323 513843 513169 513346
60684 513346 513616 513502 512962 511982 510707 509570 508733 507820 506732 506214 506986 508711 510408 511508 511955 511719 510801
$$ packed form
60796E14522j980j406j305j501j401p29O0L80K15q9l66n57l91L37J274J742J504
60779E10309J014R23J445K209K640K526K170J873J451O32k49m77J01R10J429J653
60763E30559J693J556J444J619J845J542O80j64p41j349j869j656p19q2l00n63
60747E33495k9P84Q28L2r17j773k738l748m571n311n997o118n336m276l782l710
60731D86833l409k942k875l073k778j786p23q5J11j19p49j219p79N15J749K207
60715D70878K036J825J953K315K394J708N77Q3Q42K155K878K771K415K186J992
60700D99008J712J261N78P5N52K017L196L043K125J545J164J69j122j480o74J77
60684E13346K70j14n40r80j275j137q37r13j088n18P72J725J697J100M47k36r18
$$ plain form
60667 510801 509350 507263 504098 499946 495812 492523 489821 487255 485389 485168 486511 488464 490431 492371
60653 492371 494060 495195 496092 497334 498754 499692 500245 501239 502808 503881 503401 501412 498694 495946 493552
60638 493552 491604 489885 488176 486652 485606 484859 483982 483054 482620 482871 483436 484024 484686 485386 485946 486527 487614
60621 487614 489306 491104 492561 493688 494601 495277 495839 496575 497433 497837 497287 495813 493753 491411 489109 487197
60605 487197 485827 484928 484470 484468 484609 484246 482987 481191 479808 479747 481261 483717 486081 487899 489704 492314
60589 492314 495925 500139 504513 508625 511930 514163 515747 517219 518361 518554 517898 517322 517469 518147 518957 519885
60573 519885 521078 522595 524610 527430 531132 535551 540794 547339 555505 565146 575956 587692 600073
60560 600073 612946 626562 641122 655862 669129 679577 686872 691153 692449 691013 687645 683155 677834
$$ packed form
60667E10801j451k087l165m152m134l289k702k566j866k21J343J953J967J940
60653D92371J689J135Q97J242J420R38N53R94J569J073m80j989k718k748k394
60638D93552j948j719j709j524j046p47q77r28m34K51N65N88O62P00N60N81J087
60621D87614J692J798J457J127R13O76N62P36Q58M04n50j474k060k342k302j912
60605D87197j370q99m58kJ41l63j259j796j383o1J514K456K364J818J805K610
60589D92314L611M214M374M112L305K233J584J472J142J93o56n76J47O78Q10R28
60573E19885J193J517K015K820L702M419N243O545Q166R641J0810J1736J2381
60560F00073J2873J3616J4560J4740J3267J0448P295M281J296j436l368m490n321
$$ plain form
60547 677834 671882 666038 661280 657982 655730 653971 652637 652217 653430 656811 662495 670376 680451 692900
60533 692900 707860 725296 745084 766982 790426 814436 837698 858661 875796 888117 895490 898259
60521 898259 896701 891143 882419 871785 860295 848473 836546 824712 813240 802566 793198 785313
60509 785313 778664 773150 769212 767241 766906 767618 769428 772921 778415 785949 795935 809125 825954 846642
60495 846642 871877 902608 939030 980505 1026629 1077529 1132790 1190690 1248795 1304788 1356524
60484 1356524 1402046 1439922 1469112 1488280 1495889 1491222 1474759 1447346 1409800 1363674 1311519 1255682
60472 1255682 1197460 1137970 1079179 1023248 971252 923342 879782 841009 806856 776534 749461
60461 749461 725545 704650 686271 669856 655082 641800 629965 619538 610255 601668 593641 586521
$$ packed form
60547F77834n952n844m758l298k252j759j334m20J213L381N684P881J0075J2449
60533F92900J4960J7436J9788K1898K3444K4010K3262K0963J7135J2321P373K769
60521H98259j558n558q724j0634j1490j1822j1927j1834j1472j0674r368p885
60509G85313o649n514l938j971l35P12J810L493N494P534R986J3190J6829K0688
60495H46642K5235L0731L6422M1475M6124N0900N5261N7900N8105N5993N1736
60484A356524M5522L7876K9190J9168P609m667j6463k7413l7546m6126n2155n5837
60472A255682n8222n9490n8791n5931n1996m7910m3560l8773l4153l0322k7073
60461G49461k3916k0895j8379j6415j4774j3282j1835j0427r283q587q027p120
$$ plain form
60449 586521 580467 574879 569007 562975 557710 553867 551274 549408 547940 546662 545239 543378 541137 538931
60435 538931 537177 535927 534804 533330 531353 529098 526879 524932 523505 522812 522774 522975 523027 522875 522688 522674 523043
60418 523043 524010 525724 528293 531743 535724 539360 541825 543097 543778 544160 543956 543016 541814 541000 540896 541670
60402 541670 543529 546451 550013 553717 557231 560178 562180 563395 564583 566300 568374 570418 572482 574827
60388 574827 577423 580080 582798 585660 588643 591781 595169 598508 601089 602643 603857 605551 607731 609941
60374 609941 612273 615358 619440 623991 628234 631632 633991 635525 636800 638200 639463 640076 640111 640230 640853
60359 640853 641731 642546 643665 646087 650574 656823 663462 669092 673502 677807 683359 690658 699331 708746 718262
60344 718262 727128 734567 740163 744017 746523 747888 747766 745430 740600 734065 727120 720383 713578 706520
$$ packed form
60449E86521o054n588n872o032n265l843k593j866j468j278j423j861k241k206
60435E38931j754j250j123j474j977k255k219j947j427o93l8K01N2j52j87j4L69
60418E23043R67J714K569L450L981L636K465J272O81L82k04r40j202q14j04P74
60402E41670J859K922L562L704L514K947K002J215J188J717K074K044K064K345
60388E74827K596K657K718K862K983L138L388L339K581J554J214J694K180K210
60374F09941K332L085M082M551M243L398K359J534J275J400J263O13L5J19O23
60359F40853Q78Q15J119K422M487O249O639N630M410M305N552P299Q673R415R516
60344G18262Q866P439N596L854K506J365j22k336m830o535o945o737o805p058
$$ plain form
60330 706520 699670 693434 687495 681362 675219 669757 665341 661724 658442 655279 652564 651132 651582 653347
60316 653347 655051 656073 657256 659605 662985 666804 671476 678201 687434 698501 710800 724679 740883
60303 740883 759737 781166 805072 831323 859362 887891 914964 938591 957457 970960 978498 979195
60291 979195 972626 959447 940927 918225 892595 865876 840013 816091 794294 774611 757032 741247
60279 741247 726827 713736 702149 691866 682513 674234 667549 662425 658098 653926 649909 646240 642918
60266 642918 639982 637682 636135 635160 634570 634276 634038 633565 633029 633067 634024 635414 636322 636132 634871 633132 631713
60249 631713 630965 630475 629696 628876 628882 630004 631393 631952 631434 630434 629630 629320 629496 630112 631293 633317 636278
60232 636278 639871 643813 648336 653826 659954 665732 670654 675315 680591 686625 692934 699200 705514 712079
$$ packed form
60330G06520o850o236n939o133o143n462m416l617l282l163k715j432M50J765
60316F53347J704J022J183K349L380L819M672O725R233J1067J2299J3879J6204
60303G40883J8854K1429K3906K6251K8039K8529K7073K3627J8866J3503P538O97
60291I79195o569j3179j8520k2702k5630k6719k5863k3922k1797j9683j7579j5785
60279G41247j4420j3091j1587j0283r353q279o685n124m327m172m017l669l322
60266F42918k936k300j547r75n90k94k38m73n36L8R57J390R08j90j261j739j419
60249F31713p48m90p79q20OJ122J389N59n18j000q04l10J76O16J181K024K961
60232F36278L593L942M523N490O128N778M922M661N276O034O309O266O314O565
$$ plain form
60218 712079 719025 726368 733861 741080 747983 755237 763581 772870 782069 790164 796832 802295 806958 811290
60204 811290 815680 820107 824089 827174 829358 830874 831716 831681 830775 829216 826896 823202 817711 810946 804132
60189 804132 798156 792962 787951 782681 777139 771592 766361 761648 757429 753608 750302 747807 746205 745129
60175 745129 744047 742777 741709 741516 742568 744542 746757 749024 751932 755961 760498 764233 766509 767774
60161 767774 768651 769144 769059 768707 768776 769688 771317 773164 774699 775865 777319 779855 783443 787313 791117 795428
60145 795428 800831 807118 813789 820783 828164 835540 842462 849062 855712 862343 868748 875299 882707 891155
60131 891155 900271 909704 919033 927151 932627 934988 935167 934427 933191 931154 928210 924951 922331 920958 920734
60116 920734 921103 921534 921607 920799 918691 915495 911833 907782 902691 896290 889433 883197 877649 872072 866016
$$ packed form
60218G12079O946P343P493P219O903P254Q344R289R199Q095O668N463M663M332
60204H11290M390M427L982L085K184J516Q42l5r06j559k320l694n491o765o814
60189H04132n976n194n011n270n542n547n231m713m219l821l306k495j602j076
60175G45129j082j270j068j93J052J974K215K267K908M029M537L735K276J265
60161G67774Q77M93q5l52O9R12J629J847J535J166J454K536L588L870L804M311
60145G95428N403O287O671O994P381P376O922O600O650O631O405O551P408Q448
60131H91155R116R433R329Q118N476K361J79p40j236k037k944l259k620j373k24
60116I20734L69M31P3q08k108l196l662m051n091o401o857o236n548n577o056
$$ plain form
60101 866016 859636 853357 847873 844124 842532 842404 842645 842855 843230 843845 844780 846596 849750 853681 857345 860576
60085 860576 864133 868487 873396 878601 883983 888959 892588 894427 894485 892286 886923 878342 867712 856187
60071 856187 844036 831317 818535 806118 793945 781929 770605 760648 752244 745281 739666 735029
60059 735029 730589 725842 721114 717141 714399 713065 713168 714426 716244 718293 720823 724195 728374 733139
60045 733139 738439 744204 750020 755285 759559 762684 764701 765680 765413 763374 759363 754135 748822 743712 738081
60030 738081 731307 723619 715682 708057 701245 695584 690755 685900 680517 674788 668875 662540 655784 649183
60016 649183 643095 637071 630623 624162 618616 614346 610885 607579 604117 600674 597852 596278 596042 596760 598291
60001 598291 600944 604714 608811 612332 615081 617402 619553 621659 623930 626528 629467 632946 637393 642772
$$ packed form
60101H66016o380o279n484l749j592j28K41K10L75O15R35J816L154L931L664L231
60085H60576L557M354M909N205N382M976L629J839N8k199n363q581j0630j1525
60071H56187j2151j2719j2782j2417j2173j2016j1324r957q404o963n615m637
60059G35029m440m747m728l973k742j334J03J258J818K049K530L372M179M765
60045G33139N300N765N816N265M274L125K017R79k67k039m011n228n313n110n631
60030G38081o774p688p937p625o812n661m829m855n383n729n913o335o756o601
60016F49183o088o024o448o461n546m270l461l306l462l443k822j574k36P18J531
60001E98291K653L770M097L521K749K321K151K106K271K598K939L479M447N379
$$ plain form
59987 642772 648155 652442 655279 656886 657323 656450 654410 651564 648018 643686 638833 634121 630048 626680 624048
59972 624048 622533 622550 623952 625888 627466 628560 629885 632225 635803 640514 646360 653148 660033 666005 670885
59957 670885 675244 679309 682526 684333 684740 683956 682081 679439 676637 673875 670682 666718 662395 658316 654517
59942 654517 650704 646824 642950 638949 634723 630621 627234 625010 624254 625136 627368 630172 632970 635871 639258
59927 639258 643216 647731 653056 659447 666705 674339 681958 689283 696008 701958 707187 711748 715638 719199
59913 719199 723192 728211 734241 740905 747796 754434 760421 765866 771178 776226 780249 782869 784588 785949
59899 785949 786890 787388 788019 789227 790576 791420 791863 792364 792930 793533 794872 797787 802056 806661 811173 816150
59883 816150 822098 828793 835674 842341 848592 854435 860109 865652 870466 873749 875301 875525 874748 872981 870191
$$ packed form
59987F42772N383M287K837J607M37q73k040k846l546m332m853m712m073l368k632
59972F24048j515J7J402J936J578J094J325K340L578M711N846O788O885N972M880
59957F70885M359M065L217J807M07p84j875k642k802k762l193l964m323m079l799
59942F54517l813l880l874m001m226m102l387k224p56Q82K232K804K798K901L387
59927F39258L958M515N325O391P258P634P619P325O725N950N229M561L890L561
59913G19199L993N019O030O664O891O638N987N445N312N048M023K620J719J361
59899G85949R41M98O31J208J349Q44M43N01N66O03J339K915M269M605M512M977
59883H16150N948O695O881O667O251N843N674N543M814L283J552K24p77j767k790
$$ plain form
59868 870191 866343 861299 855204 848817 842892 837353 831601 825559 819678 814051 808319 802637 797957 794927
59854 794927 793051 791390 789716 788562 788406 789248 790910 793417 796934 801434 806546 811818 817192 823053 829731
59839 829731 837155 845141 853708 862692 871224 878099 882869 886337 889867 894348 899782 905602 911143 915816
59825 915816 918919 919470 916523 909797 899894 887863 874638 860915 847263 834213 822280 811864 802926
59812 802926 794838 786954 779373 772753 767364 762835 758930 755966 754184 753323 753138 753754 754994 755894 755539
59797 755539 754019 752039 749925 747617 745291 743240 741253 738772 735700 732511 729541 726605 723394 719931
59783 719931 716554 713640 711283 709142 706847 704722 703727 704325 705725 706674 706772 706641 707004 708007 709304 710545
59767 710545 711972 714629 719509 726205 733002 738872 744816 752547 762269 772638 782672 792731 803541
$$ packed form
59868H70191l848n044o095o387n925n539n752o042n881n627n732n682m680l030
59854G94927j876j661j674j154j56Q42J662K507L517M500N112N272N374N861O678
59839H29731P424P986Q567Q984Q532O875M770L468L530M481N434N820N541M673
59825I15816L103N51k947o726r903j2031j3225j3723j3652j3050j1933j0416q938
59812H02926q088p884p581o620n389m529l905k964j782q61j85O16J240R00l55
59797G55539j520j980k114k308k326k051j987k481l072l189k970k936l211l463
59783G19931l377k914k357k141k295k125r95N98J400R49R8j31L63J003J297J241
59767G10545J427K657M880O696O797N870N944P731R722J0369J0034J0059J0810
$$ plain form
59754 803541 815061 826639 837810 848653 859580 870840 882039 892251 900851 908058 914426 919941
59742 919941 923928 925660 924832 921704 917136 912186 907290 902035 896005 889551 883445 878110 873484 869236
59728 869236 864774 859543 853696 848051 843055 838341 833687 829581 826280 823129 819617 816328 813895 811834
59714 811834 809575 807988 808420 810612 813063 815265 818067 821752 825297 827924 830097 832465 834912 837218
59700 837218 839681 842456 845048 847073 848908 851125 853770 856549 859204 861325 862330 861991 860657 858809
59686 858809 856790 855035 853961 853488 853168 852837 852452 851231 847886 842115 835169 828430 821993 815130 807635
59671 807635 800059 792923 786328 780339 775289 771421 768393 765466 762457 760361 760473 762777 765777 768258
59657 768258 770512 773322 776542 779599 782808 786953 791795 796052 798761 799751 798944 796314 792520 788491 784289
$$ packed form
59754H03541J1520J1578J1171J0843J0927J1260J1199J0212Q600P207O368N515
59742I19941L987J732q28l128m568m950m896n255o030o454o106n335m626m248
59728H69236m462n231n847n645m996m714m654m106l301l151l512l289k433k061
59714H11834k259j587M32K192K451K202K802L685L545K627K173K368K447K306
59700H37218K463K775K592K025J835K217K645K779K655K121J005l39j334j848
59686H58809k019j755j074m73l20l31l85j221l345n771o946o739o437o863p495
59671H07635p576p136o595n989n050l868l028k927l009k096J12K304L000K481
59657G68258K254K810L220L057L209M145M842M257K709R90q07k630l794m029m202
$$ plain form
59642 784289 779376 773971 768971 764438 759454 753814 748682 745094 742825 741207 740052 739255 738332 736887 734813
59627 734813 731700 726968 720887 714510 708241 701582 694750 689293 686239 684737 683412 682173 681689 681943 682436
59612 682436 683237 684758 686924 689469 692674 696809 701246 705028 708129 711244 714555 717460 719466 720602
59598 720602 721107 721345 721933 723319 725222 726915 727968 728318 727881 726602 724734 722560 720003 716976 713985
59583 713985 711902 711124 711191 711092 709784 706777 702550 698190 694373 690975 687828 685284 683596 682292 680803
59568 680803 679360 678665 678909 679704 680813 682378 684451 686803 689176 691393 693269 694693 695729 696471 697005
59553 697005 697698 699144 701499 704122 706261 707886 709582 711864 714958 719056 724370 731061 739405 749945
59539 749945 763324 780070 800476 824185 849534 873685 893879 908658 918016 922940 925031 926027
$$ packed form
59642G84289m913n405n000m533m984n640n132l588k269j618j155p97r23j445k074
59627G34813l113m732o081o377o269o659o832n457l054j502j325j239m84K54M93
59612F82436Q01J521K166K545L205M135M437L782L101L115L311K905K006J136
59598G20602N05K38N88J386J903J693J053L50m37j279j868k174k557l027k991
59583G13985k083p78O7r9j308l007m227m360l817l398l147k544j688j304j489
59568F80803j443o95K44P95J109J565K073K352K373K217J876J424J036P42N34
59553F97005O93J446K355K623K139J625J696K282L094M098N314O691Q344J0540
59539G49945J3379J6746K0406K3709K5349K4151K0194J4779R358M924K091R96
$$ plain form
59527 926027 927037 928233 929376 930338 930946 930727 929134 925737 920070 911756 901112 889231 877118 864991
59513 864991 852601 839782 826466 812722 799229 787199 777299 768979 761348 754355 748580 744153 740547
59500 740547 737401 734952 733490 732746 732038 730927 729633 728742 728500 728608 728843 729558 731109 733044 734484 735298
59484 735298 736300 738230 741165 744955 749516 754529 759526 764516 769984 776131 782727 789748 797335 804948
59470 804948 811437 816323 820199 823573 826183 827947 829646 832059 835160 838844 843767 850736 859765 870237
59456 870237 881455 892527 902353 910426 917162 922994 927677 930897 932853 933610 932521 928928 922942 915061
59442 915061 905652 895286 884856 874779 864828 855260 847219 841331 836876 833193 830954 831028 832937 835689
59428 835689 839436 845136 853108 863165 875680 891189 909164 928344 948051 968087 987662 1005757
$$ packed form
59527I26027J010J196J143R62O08k19j593l397n667q314j0644j1881j2113j2127
59513H64991j2390j2819j3316j3744j3493j2030r900q320p631o993n775m427l606
59500G40547l146k449j462p44p08j111j294q91k42J08K35P15J551J935J440Q14
59484G35298J002J930K935L790M561N013M997M990N468O147O596P021P587P613
59470H04948O489M886L876L374K610J764J699K413L101L684M923O969R029J0472
59456H70237J1218J1072R826Q073O736N832M683L220J956P57j089l593n986p881
59442I15061r409j0366j0430j0077r951r568q041n888m455l683k239P4J909K752
59428H35689L747N700P972J0057J2515J5509J7975J9180J9707K0036J9575J8095
$$ plain form
59416 1005757 1022558 1039355 1056882 1074677 1092042 1108516 1123063 1133631 1137994 1134974 1125065 1110421
59404 1110421 1093993 1078123 1064111 1053345 1047979 1049476 1056730 1066398 1074737 1078634 1075860 1065893 1050480
59391 1050480 1032285 1012906 992830 972827 954170 937603 923123 910702 900260 891139 882712 875438
59379 875438 870265 867006 864367 861590 859038 857141 855815 855036 854980 855451 856088 857229 859635 863264 867342
59364 867342 871764 877429 884927 893927 904184 916232 930599 947102 965308 985090 1006405 1029034
59352 1029034 1052723 1077144 1101730 1126110 1150557 1175268 1199238 1220694 1238585 1252774 1262873
59341 1262873 1268046 1268143 1263964 1256029 1243994 1227658 1207755 1185364 1161205 1135809 1109667 1082965
59329 1082965 1055865 1029206 1004185 981172 959762 940189 923628 910545 899616 889019 878199
$$ packed form
59416A005757J6801J6797J7527J7795J7365J6474J4547J0568M363l020r909j4644
59404A110421j6428j5870j4012j0766n366J497P254R668Q339L897k774r967j5413
59391A050480j8195j9379k0076k0003j8657j6567j4480j2421j0442r121q427p274
59379H75438n173l259k639k777k552j897j326p79n6M71O37J141K406L629M078
59364H67342M422N665P498R000J0257J2048J4367J6503J8206J9782K1315K2629
59352A029034K3689K4421K4586K4380K4447K4711K3970K1456J7891J4189J0099
59341A262873N173R7m179p935j2035j6336j9903k2391k4159k5396k6142k6702
59329A082965k7100k6659k5021k3013k1410j9573j6561j3083j0929j0597j0820
$$ plain form
59318 878199 867830 858629 850803 844218 838459 832918 827224 821472 815883 810534 805478 800787 796374 792155
59304 792155 788373 785397 783248 781835 781458 782438 784391 786692 789662 794418 801479 810436 821226 834742
59290 834742 851544 870515 889156 904759 915264 919893 919598 916489 912395 908210 904565 902431 902803
59277 902803 906321 913421 924265 938197 953752 969518 984734 999082 1012358 1024421 1034915 1043037
59265 1043037 1048157 1050654 1051509 1051093 1049022 1045147 1039775 1032841 1023842 1012941 1001387 990522 980983 973017
59251 973017 966738 961818 957721 954592 953195 953714 955445 957988 961888 967570 974427 981592 988984 996933
59237 996933 1005118 1012395 1017435 1019342 1018062 1014428 1009369 1002881 994161 982755 968979 953198 935562
59224 935562 916747 898172 880976 865239 850513 836635 823751 812055 801707 792618 784278 776357
$$ packed form
59318H78199j0369r201p826o585n759n541n694n752n589n349n056m691m413m219
59304G92155l782k976k149j413l77R80J953K301K970M756P061Q957J0790J3516
59290H34742J6802J8971J8641J5603J0505M629k95l109m094m185l645k134L72
59277I02803L518P100J0844J3932J5555J5766J5216J4348J3276J2063J0494Q122
59265A043037N120K497Q55m16k071l875n372o934q999j0901j1554j0865r539p966
59251I73017o279m920m097l129j397N19J731K543L900N682O857P165P392P949
59237I96933Q185P277N040J907j280l634n059o488q720j1406j3776j5781j7636
59224I35562j8815j8575j7196j5737j4726j3878j2884j1696j0348r089q340p921
$$ plain form
59212 776357 769417 764347 761091 758758 756966 756169 756498 757293 758026 758743 759342 759501 759704 761243 764574 768585
59196 768585 772078 775126 778379 781896 785380 788854 792388 795754 798910 802238 805778 808925 811389 813738
59182 813738 816417 818994 821015 822853 825018 827347 829673 832652 836994 842455 848403 855003 862952 872346
59168 872346 882579 893071 903272 912184 918695 922415 923612 922360 918367 911663 902949 893038 882214
59155 882214 870294 857309 844010 831507 820291 809918 799895 790441 781836 773449 764368 754851
59143 754851 746187 739060 732985 727421 722430 718001 713747 709714 706652 705045 704600 704933 705964 707432 708991
59128 708991 711082 714700 719892 725489 730844 736768 744212 753012 762610 773064 784579 796846 809652
59115 809652 823460 838800 855674 873973 893579 913543 932233 948960 964557 979567 992901
$$ packed form
59212G76357o940n070l256k333j792p97L29P95P33P17N99J59K03J539L331M011
59196G68585L493L048L253L517L484L474L534L366L156L328L540L147K464K349
59182H13738K679K577K021J838K165K329K326K979M342N461N948O600P949R394
59168H72346J0233J0492J0201Q912O511L720J197j252l993o704q714r911j0824
59155H82214j1920j2985j3299j2503j1216j0373j0023r454q605q387r081r517
59143G54851q664p127o075n564m991m429m254m033l062j607m45L33J031J468J559
59128G08991K091L618N192N597N355N924P444Q800R598J0454J1515J2267J2806
59115H09652J3808J5340J6874J8299J9606J9964J8690J6727J5597J5010J3334
$$ plain form
59104 992901 1003135 1010243 1015013 1017581 1017621 1015434 1011802 1007183 1001816 996123 990302 984100 977732 972422
59090 972422 969284 968156 968099 968317 967927 965719 961185 955191 948744 941623 933026 922955 912121 901048
59076 901048 890122 879996 871100 863201 856060 849887 844527 839040 832961 827205 822762 819244 815700 812178
59062 812178 809328 807054 804736 802389 800513 799057 797499 795673 793778 791884 790128 788907 788201 787353 786149
59047 786149 785331 785198 784664 782846 780700 779755 779911 779961 779858 780904 783770 787680 791727 796006 801353 808683
59031 808683 818487 830414 843573 857737 873660 891626 910407 928500 945549 961585 975692 986706
59019 986706 994546 999592 1001324 999010 993350 986100 978382 970626 963770 958987 956265 954518 953177 952745
59005 952745 953992 957591 964199 973721 984704 995540 1006016 1016666 1027061 1036096 1043660 1050557 1056783
$$ packed form
59104I92901J0234P108M770K568M0k187l632m619n367n693n821o202o368n310
59090I72422l138j128n7K18l90k208m534n994o447p121q597j0071j0834j1073
59076I01048j0926j0126q896p899p141o173n360n487o079n756m443l518l544l522
59062H12178k850k274k318k347j876j456j558j826j895j894j756j221p06q48j204
59047G86149q18j33n34j818k146r45J56N0j03J046K866L910M047M279N347P330
59031H08683R804J1927J3159J4164J5923J7966J8781J8093J7049J6036J4107J1014
59019I86706P840N046J732k314n660p250p718p756o856m783k722j747j341m32
59005I52745J247L599O608R522J0983J0836J0476J0650J0395R035P564O897O226
$$ plain form
58992 1056783 1061155 1062801 1061923 1059055 1054497 1048408 1040613 1030582 1018563 1006405 996217 988532 982772
58979 982772 978875 977081 976653 976487 976913 979378 984380 991115 999092 1008575 1019372 1030689 1042490 1055692
58965 1055692 1070748 1087129 1104278 1121758 1138317 1152172 1162554 1169857 1174007 1173878 1168670 1158833
58953 1158833 1145291 1128720 1109872 1089671 1068712 1047360 1026405 1006862 989178 973470 960292
58942 960292 950172 942632 936783 932720 931120 931595 932755 933822 934887 935528 934622 931797 927868 923542 918759
58927 918759 913453 907871 902001 895759 889857 885439 882729 881002 879822 879308 879389 879947 881525 884702 889028
58912 889028 893923 900289 909581 921496 934264 947190 961064 976003 990889 1005404 1020695 1037447
58900 1037447 1054902 1072440 1090496 1109239 1127958 1146561 1166345 1188502 1213069 1239992 1269905
$$ packed form
58992A056783M372J646q78k868m558o089p795j0031j2019j2158j0188p685n760
58979I82772l897j794m28j66M26K465N002O735P977R483J0797J1317J1801J3202
58965A055692J5056J6381J7149J7480J6559J3855J0382P303M150j29n208r837
58953A158833j3542j6571j8848k0201k0959k1352k0955j9543j7684j5708j3178
58942I60292j0120p540n849m063j600M75J160J067J065O41r06k825l929m326m783
58927I18759n306n582n870o242n902m418k710j727j180n14Q1N58J578L177M326
58912H89028M895O366R292J1915J2768J2926J3874J4939J4886J4515J5291J6752
58900A037447J7455J7538J8056J8743J8719J8603J9784K2157K4567K6923K9913
$$ plain form
58889 1269905 1303132 1338962 1376295 1413781 1448985 1479041 1502901 1521679 1536164 1545263 1547432 1542209
58877 1542209 1529753 1510443 1485773 1458312 1429886 1400955 1372290 1345640 1321920 1300260 1279801
58866 1279801 1260895 1243447 1225713 1206270 1185946 1166356 1147572 1128697 1109820 1091828 1074885
58855 1074885 1058545 1042922 1028469 1014833 1000952 986099 970154 953286 936115 919651 904259
58844 904259 889067 873053 856348 839902 824360 809815 796217 783522 771834 761723 753834 747958
58832 747958 743179 739159 736363 734736 733263 731390 729883 729648 730527 731941 733893 736600 739809 743097 746332
58817 746332 749379 751969 754158 756275 758210 759536 760455 761648 763083 764048 764559 765493 767044 768296 768714
58802 768714 768816 768975 768935 768877 769484 770371 770018 767929 765404 763454 761604 759695 759134 761064 764649 768547 772866
$$ packed form
58889A269905L3227L5830L7333L7486L5204L0056K3860J8778J4485R099K169n223
58877A542209j2456j9310k4670k7461k8426k8931k8665k6650k3720k1660k0459
58866A279801j8906j7448j7734j9443k0324j9590j8784j8875j8877j7992j6943
58855A074885j6340j5623j4453j3636j3881j4853j5945j6868j7171j6464j5392
58844I04259j5192j6014j6705j6446j5542j4545j3598j2695j1688j0111p889n876
58832G47958m779m020k796j627j473j873j507k35Q79J414J952K707L209L288L235
58817G46332L047K590K189K117J935J326R19J193J435R65N11R34J551J252M18
58802G68714J02J59m0n8O07Q87l53k089k525j950j850j909n61J930L585L898M319
$$ plain form
58785 772866 778399 785027 792220 800141 808964 817955 826428 834816 843756 852917 861664 869864 876924 881077
58771 881077 880870 876669 869771 860985 851077 841464 833176 826016 819872 815892 814967 815963 816870 817034 816982 816786
58755 816786 816028 814863 813787 812742 811563 810814 811109 812099 813164 814633 817322 821409 826669 833217 841007
58740 841007 849226 857232 865599 875394 887010 900503 916200 933871 952002 969026 984766 999719
58728 999719 1013539 1025301 1034750 1042418 1049012 1055442 1062774 1071343 1080522 1089925 1099849 1109825 1117980 1122938
58714 1122938 1125358 1126529 1126502 1124646 1120890 1115030 1105851 1092441 1075615 1056675 1035666 1012192 987019
58701 987019 961252 934704 906817 878584 851934 827587 805062 784387 766176 750277 735873
58690 735873 722886 711981 703220 695817 689159 683055 677265 671730 667052 663765 661435 659368 657873 657931
$$ packed form
58785G72866N533O628P193P921Q823Q991Q473Q388Q940R161Q747Q200P060M153
58771H81077k07m201o898q786r908r613q288p160o144l980r25R96R07J64n2j96
58755H16786p58j165j076j045j179p49K95R90J065J469K689M087N260O548P790
58740H41007Q219Q006Q367R795J1616J3493J5697J7671J8131J7024J5740J4953
58728I99719J3820J1762R449P668O594O430P332Q569R179R403R924R976Q155M958
58714A122938K420J171k7j856l756n860r179j3410j6826j8940k1009k3474k5173
58701I87019k5767k6548k7887k8233k6650k4347k2525k0675j8211j5899j4404
58690G35873j2987j0905q761p403o658o104n790n535m678l287k330k067j495N8
$$ plain form
58676 657931 659971 663833 669563 677455 687639 700233 715421 732907 752058 773124 797333 824995
58664 824995 854349 882826 908301 928471 940698 943878 939369 928936 912988 892101 868845 846296
58652 846296 825598 806458 789137 774396 762330 752750 746011 742117 739857 738114 737192 737658 738943
58639 738943 740386 742407 745197 747510 748365 748635 749236 749134 747123 744277 742450 741456 740074 738827 739348 741672
58623 741672 744594 748145 753402 760261 767695 775924 786123 798156 810506 822159 832653 840758 845190
58610 845190 846333 845397 842347 836606 829229 822108 815433 808122 800402 793656 787964 782044 775628 769779
58596 769779 764932 760661 757367 756244 757573 760901 766626 775592 787406 801077 816868 835473 855848
58583 855848 876073 895932 916308 936387 953943 968244 980272 990265 997600 1003145 1009234 1017205
$$ packed form
58676F57931K040L862N730P892J0184J2594J5188J7486J9151K1066K4209K7662
58664H24995K9354K8477K5475K0170J2227L180m509j0433j5948k0887k3256k2549
58652H46296k0698j9140j7321j4741j2066r580o739l894k260j743r22M66J285
58639G38943J443K021K790K313Q55K70O01j02k011k846j827r94j382j247N21K324
58623G41672K922L551N257O859P434Q229J0199J2033J2350J1653J0494Q105M432
58610H45190J143r36l050n741p377p121o675p311p720o746n692n920o416n849
58596G69779m847m271l294j123J329L328N725Q966J1814J3671J5791J8605K0375
58583H55848K0225J9859K0376K0079J7556J4301J2028R993P335N545O089P971
$$ plain form
58571 1017205 1027275 1040797 1059972 1085052 1114301 1146980 1183875 1224546 1266526 1307693 1347032
58560 1347032 1382630 1411459 1431984 1444958 1451208 1450801 1444840 1435751 1425031 1412641 1399029 1385595
58548 1385595 1372616 1358789 1343376 1326842 1308969 1288463 1264944 1239385 1212297 1183517 1154032
58537 1154032 1125772 1099297 1073950 1050497 1031046 1015929 1003246 992178 984175 980067 978513 978327
58525 978327 979941 983486 987641 991500 995551 999742 1002604 1003307 1002701 1001354 998408 993356 987147 980649 973680
58510 973680 966237 958967 951830 944133 936384 930195 925788 921548 916464 910966 904987 897595 889244 882112
58496 882112 877408 874339 872239 871493 871848 872320 873502 877540 885085 894652 905701 919723 937361 957090
58482 957090 977788 1000063 1023806 1046929 1067754 1086302 1102018 1112679 1116898 1115498 1109282 1097869
$$ packed form
58571A017205J0070J3522J9175K5080K9249L2679L6895M0671M1980M1167L9339
58560A347032L5598K8829K0525J2974O250m07n961r089j0720j2390j3612j3434
58548A385595j2979j3827j5413j6534j7873k0506k3519k5559k7088k8780k9485
58537A154032k8260k6475k5347k3453j9451j5117j2683j1068q003m108j554j86
58525I78327J614L545M155L859M051M191K862P03o06j347k946n052o209o498o969
58510I73680p443p270p137p697p749o189m407m240n084n498n979p392q351p132
58496H82112m704l069k100p46L55M72J182M038P545R567J1049J4022J7638J9729
58482I57090K0698K2275K3743K3123K0825J8548J5716J0661M219j400o216j1413
$$ plain form
58470 1097869 1082057 1064838 1048512 1032860 1017573 1004298 994791 989043 986544 987534 991832 998354 1006846
58457 1006846 1018108 1031654 1045328 1058006 1070164 1080910 1087283 1087759 1083899 1077325 1067765 1055430
58445 1055430 1042509 1030630 1019314 1008392 999374 992954 987854 983733 982442 984643 988001 990659 993824
58432 993824 998900 1004726 1009882 1015334 1022567 1031285 1040921 1052057 1064213 1074450 1080328 1082283 1081369 1077043
58418 1077043 1069199 1059968 1051211 1042167 1031461 1019342 1006209 991304 974842 959042 945160 931796
58406 931796 918064 905812 896680 889567 883240 878891 877730 878513 879753 882010 885660 888946 890609 892015
58392 892015 894267 895804 895330 894519 895064 895577 894268 892371 892114 893506 895915 900505 908179 917201 925720
58377 925720 934711 945829 958432 971243 984700 999011 1012201 1022922 1033046 1044815 1057703 1070739
$$ packed form
58470A097869j5812j7219j6326j5652j5287j3275r507n748k499R90M298O522Q492
58457A006846J1262J3546J3674J2678J2158J0746O373M76l860o574r560j2335
58445A055430j2921j1879j1316j0922r018o420n100m121j291K201L358K658L165
58432I93824N076N826N156N452P233Q718R636J1136J2156J0237N878J955r14m326
58418A077043p844r231q757r044j0706j2119j3133j4905j6462j5800j3882j3364
58406I31796j3732j2252r132p113o327m349j161P83J240K257L650L286J663J406
58392H92015K252J537m74q11N45N13j309j897k57J392K409M590P674R022Q519
58377I25720Q991J1118J2603J2811J3457J4311J3190J0721J0124J1769J2888J3036
$$ plain form
58365 1070739 1085346 1102858 1121509 1138890 1155179 1171009 1184495 1193482 1198722 1201877 1202514 1199865
58353 1199865 1195369 1190663 1185286 1179039 1174108 1172091 1171556 1171364 1173536 1179855 1188640 1198156 1210170 1226545
58339 1226545 1245205 1263193 1280968 1300031 1319061 1336198 1352380 1368592 1382526 1391853 1398060 1403234
58327 1403234 1405982 1404657 1401681 1400296 1399833 1398478 1397842 1400200 1403912 1406355 1408878 1414246 1421673 1428998
58313 1428998 1437223 1448215 1460437 1471560 1482774 1495943 1509379 1521182 1533750 1549838 1567081
58302 1567081 1581657 1594496 1608476 1622477 1633968 1644650 1657617 1671503 1683430 1695199 1710510
58291 1710510 1728452 1745797 1763395 1784190 1807236 1829802 1853112 1880014 1909338 1938522 1969150
58280 1969150 2003752 2040072 2074970 2110937 2151846 2195189 2235634 2273445 2312213 2351320 2388402
$$ packed form
58365A070739J4607J7512J8651J7381J6289J5830J3486Q987N240L155O37k649
58353A199865m496m706n377o247m931k017n35j92K172O319Q785R516J2014J6375
58339A226545J8660J7988J7775J9063J9030J7137J6182J6212J3934R327O207N174
58327A403234K748j325k976j385m63j355o36K358L712K443K523N368P427P325
58313A428998Q225J0992J2222J1123J1214J3169J3436J1803J2568J6088J7243
58302A567081J4576J2839J3980J4001J1491J0682J2967J3886J1927J1769J5311
58291A710510J7942J7345J7598K0795K3046K2566K3310K6902K9324K9184L0628
58280A969150L4602L6320L4898L5967M0909M3343M0445L7811L8768L9107L7082
$$ plain form
58269 2388402 2426492 2470742 2520378 2571401 2624525 2682571 2742957 2800976 2857714 2916390 2973973
58258 2973973 3025288 3072468 3121312 3171311 3218781 3266758 3321738 3383186 3446313 3512503 3586722
58247 3586722 3667425 3749761 3836056 3932196 4036422 4142996 4253955 4375452 4505598 4638375
58237 4638375 4776488 4927288 5088984 5254675 5427084 5614878 5817121 6026368 6244523
58228 6244523 6480104 6732516 6995438 7273237 7576786 7905529 8251880 8620894 9026318
58219 9026318 9469501 9942797 10451922 11013196 11630447 12297864 13024529 13831677 14727014
58210 14727014 15708340 16792074 18010432 19381754 20915546 22647873 24639444 26940747
58202 26940747 29600244 32712941 36424276 40890260 46288265 52874631 60974786 70907681
$$ packed form
58269B388402L8090M4250M9636N1023N3124N8046O0386N8019N6738N8676N7583
58258B973973N1315M7180M8844M9999M7470M7977N4980O1448O3127O6190P4219
58247C586722Q0703Q2336Q6295R6140J04226J06574J10959J21497J30146J32777
58237D638375J38113J50800J61696J65691J72409J87794K02243K09247K18155
58228F244523K35581K52412K62922K77799L03549L28743L46351L69014M05424
58219I026318M43183M73296N09125N61274O17251O67417P26665Q07148Q95337
58210A4727014R81326J083734J218358J371322J533792J732327J991571K301303
58202B6940747K659497L112697L711335M465984N398005O586366Q100155R932895
$$ plain form
58194 70907681 82989628 97635653 115397909 136924854 163032254 194811635 233241112
58187 233241112 278008407 326246440 372422696 409869388 433118212 439653127 430257738
58180 430257738 408085403 377205401 341457617 304026256 267506610 233940922 204615880
58173 204615880 179888101 159319169 142042611 127112628 113739045 101432464 90023023
58166 90023023 79524288 69964584 61336379 53637474 46875207 41019046 35989581 31696928
58158 31696928 28057330 24975173 22346957 20092400 18159080 16496654 15051544 13787480
58150 13787480 12686149 11724157 10869842 10103557 9419817 8807274 8245963 7726167 7251205
58141 7251205 6819115 6418836 6046488 5708283 5404410 5125604 4868116 4637052 4432102
$$ packed form
58194G0907681J2081947J4646025J7762256K1526945K6107400L1779381L8429477
58187B33241112M4767295M8238033M6176256L7446692K3248824O534915r395389
58180D30257738k2172335l0880002l5747784l7431361l6519646l3565688k9325042
58173B04615880k4727779k0568932j7276558j4929983j3373583j2306581j1409441
58166I0023023j0498735r559704q628205p698905o762267n856161n029465m292653
58158C1696928l639598l082157k628216k254557j933320j662426j445110j264064
58150A3787480j101331r61992q54315p66285o83740o12543n61311n19796m74962
58141G251205m32090m00279l72348l38205l03873k78806k57488k31064k04950
$$ plain form
58132 4432102 4244078 4068115 3906859 3758258 3613485 3469739 3332747 3204071 3077914
58123 3077914 2952891 2835175 2727266 2624712 2526364 2436925 2356695 2279330 2202603 2131534
58113 2131534 2068305 2008758 1951305 1899694 1854276 1809687 1763861 1720608 1680834 1639935 1596420
58102 1596420 1554605 1516088 1476717 1434609 1393228 1354014 1313874 1272602 1235153 1203788 1175244
58091 1175244 1148212 1126330 1111038 1098404 1085765 1074823 1065700 1054662 1040394 1026053 1012504
58080 1012504 995917 974659 952379 931649 910581 888260 867471 849366 831223 812092 795089
58069 795089 781674 769231 756616 746375 739077 731212 721371 712906 707726 702960 696528 690542 686177
58056 686177 680487 671597 662192 654709 647654 639662 632621 627715 622745 616414 611007 607843 604230 597965
$$ packed form
58132D432102j88024j75963j61256j48601j44773j43746j36992j28676j26157
58123C077914j25023j17716j07909j02554r8348q9439q0230p7365p6727p1069
58113B131534o3229n9547n7453n1611m5418m4589m5826m3253l9774m0899m3515
58102A596420m1815l8517l9371m2108m1381l9214m0140m1272l7449l1365k8544
58091A175244k7032k1882j5292j2634j2639j0942r123j1038j4268j4341j3549
58080A012504j6587k1258k2280k0730k1068k2321k0789j8105j8143j9131j7003
58069G95089j3415j2443j2615j0241p298p865r841q465n180m766o432n986m365
58056F86177n690q890r405p483p055p992p041m906m970o331n407l164l613o265
$$ plain form
58042 597965 590921 585160 579300 571609 563178 555221 546735 537469 529725 524576 519606 512874 505791 499705
58028 499705 493120 484773 476199 468796 461525 453804 447411 443243 439317 434268 429653 426676 423861 420167
58014 420167 417138 415713 414144 411381 409308 409353 410025 410057 410795 413085 415003 415155 415218 416784 418745 420299
57998 420299 423454 429761 437348 443990 450612 459139 469257 479829 491159 503357 514620 523397 530156
57985 530156 535130 536727 534247 529667 524666 518344 509974 501384 494344 488020 481253 474973 470089 465408
57971 465408 459902 454784 451205 448215 445039 442900 442358 441337 438090 433795 430011 425997 420768 415307
57957 415307 410375 404724 397940 392431 389904 388360 385433 382303 381246 381581 381313 380922 382166 384603 386474
57942 386474 387884 390313 394074 398735 404861 412936 421815 430537 440306 452377 465424 477275 487757
$$ packed form
58042E97965p044n761n860p691q431p957q486r266p744n149m970o732p083o086
58028D99705o585q347q574p403p271p721o393m168l926n049m615k977k815l694
58014D20167l029j425j569k763k073M5O72L2P38K290J918J52O3J566J961J554
57998D20299L155O307P587O642O622Q527J0118J0572J1330J2198J1263Q777O759
57985E30156M974J597k480m580n001o322q370q590p040o324o767o280m884m681
57971D65408n506n118l579k990l176k139n42j021l247m295l784m014n229n461
57957D15307m932n651o784n509k527j544k927l130j057L35k68l91J244K437J871
57942C86474J410K429L761M661O126Q075Q879Q722R769J2071J3047J1851J0482
$$ plain form
57929 487757 497484 505483 510572 513689 516224 517370 515615 511581 506818 501061 493361 484808 477371 470898
57915 470898 463773 455849 448379 441801 435842 431035 427955 425725 423369 421807 422505 424970 427671 430484
57901 430484 434105 437886 440467 441895 443173 444441 445436 446873 449461 452332 454330 455971 458370 461194
57887 461194 463530 465743 468546 471225 472744 473576 474458 474414 472110 468243 464385 460373 454972 448339 441665
57872 441665 435106 428209 421667 416533 412294 407738 403195 399997 398347 397611 398056 400411 404258 408632 413537
57857 413537 419238 424966 430157 436041 443980 453116 461692 469825 478830 488554 497574 505406 512407 518120
57843 518120 521800 524065 525977 526998 525764 522226 517120 510156 500872 490572 481161 472608 463699 454606
57829 454606 446434 438843 430583 421991 414586 408503 402659 397160 393142 390365 387324 383701 380545 378095
$$ packed form
57929D87757R727P999N089L117K535J146j755m034m763n757p700q553p437o473
57915D70898p125p924p470o578n959m807l080k230k356j562O98K465K701K813
57901D30484L621L781K581J428J278J268R95J437K588K871J998J641K399K824
57887D61194K336K213K803K679J519Q32Q82m4k304l867l858m012n401o633o674
57872D41665o559o897o542n134m239m556m543l198j650p36M45K355L847M374M905
57857D13537N701N728N191N884P939R136Q576Q133R005R724R020P832P001N713
57843E18120L680K265J912J021j234l538n106o964r284j0300r411q553q909r093
57829D54606q172p591q260q592p405o083n844n499m018k777l041l623l156k450
$$ plain form
57815 378095 375590 373099 371324 369639 366606 362507 359157 357052 354787 351429 347296 342253 335460 327251
57801 327251 319313 312493 306148 299873 294120 288848 283405 278076 274102 271864 270646 270312 271540 274240
57787 274240 277469 281140 286122 292446 299066 305646 313027 321660 331115 341256 352303 363595 373907
57774 373907 383272 393014 403769 414836 425487 435404 443789 449644 453029 454648 454270 451108 445585 439018
57760 439018 431667 422852 412951 403408 394690 386003 377091 368481 359955 350793 341644 334207 328788 324139
57746 324139 319925 317247 316324 315802 314968 314648 315189 315508 314979 314498 314732 314920 314307 313433 313167 313727 315178 317614
57728 317614 320321 322122 323054 324344 326420 328376 329816 331559 333970 336211 337762 339142 340484 340878 339854
57713 339854 338082 336005 333175 329487 325558 321279 315623 308613 301886 296414 291173 285031 278558 272918
$$ packed form
57815C78095k505k491j775j685l033m099l350k105k265l358m133n043o793q209
57801C27251p938o820o345o275n753n272n443n329l974k238j218l34J228K700
57787B74240L229L671M982O324O620O580P381Q633R455J0141J1047J1292J0312
57774C73907R365R742J0755J1067J0651R917Q385N855L385J619l78l162n523o567
57760D39018p351q815r901r543q718q687q912q610q526r162r149p437n419m649
57746C24139m214k678r23n22q34l20N41L19n29m81K34J88o13q74k66N60J451K436
57728C17614K707J801R32J290K076J956J440J743K411K241J551J380J342L94j024
57713C39854j772k077k830l688l929m279n656p010o727n472n241o142o473n640
$$ plain form
57699 272918 268184 263785 259539 255318 250659 245573 240863 237000 233555 230231 227329 224728 221654 218097
57685 218097 215235 213794 213135 212667 212984 214933 218646 224143 231805 241629 253215 267140 285227 308831
57671 308831 337974 372838 414902 465998 527229 599012 680074 764935 843414 904225 939296
57660 939296 945337 923472 878798 818917 751014 680082 609774 543533 483908 431789 387245 350371
57648 350371 320678 296618 276595 259792 245607 233262 222558 214035 207769 202908 198806 195512
57636 195512 192721 189565 186048 183362 182021 181000 179567 178622 179128 180392 181065 180900 180434 179774 178760 177567
57620 177567 176187 174033 170846 167318 164112 161094 158140 155719 153949 152053 149591 147269 145750 144600
57606 144600 143224 141904 141081 140533 140017 139804 139802 139203 137817 136658 136310 135763 133886 131045 128227 125545 122716
$$ packed form
57699B72918m734m399m246m221m659n086m710l863l445l324k902k601l074l557
57685B18097k862j441o59m68L17J949L713N497P662R824J1586J3925J8087K3604
57671C08831K9143L4864M2064N1096O1231P1783Q1062Q4861P8479O0811L5071
57660I39296O041k1865m4674n9881o7903p0932p0308o6241n9625n2119m4544l6874
57648C50371k9693k4060k0023j6803j4185j2345j0704q523o266m861m102l294
57636A95512k791l156l517k686j341j021j433r45N06J264O73j65m66o60j014j193
57620A77567j380k154l187l528l206l018k954k421j770j896k462k322j519j150
57606A44600j376j320q23n48n16k13kn99j386j159l48n47j877k841k818k682k829
$$ plain form
57589 122716 120071 117942 115783 113067 110320 108294 106788 105210 103503 101553 98542 94044 89072 85028
57575 85028 82174 79947 77993 76009 73422 70259 67541 65853 64381 62308 60219 58942 57917 56089
57561 56089 53742 52103 51600 51712 52070 52515 52545 51779 50709 50045 49785 49722 50272 51841 53998 56221 58858
57544 58858 62320 65977 68938 71390 74087 77031 79608 81511 82537 82036 79669 76259 72928 69834 66643
57529 66643 63632 61338 59700 58490 57975 58169 58161 57325 56533 56981 58382 59535 60141 60841 61956 63430 65575
57512 65575 68623 71828 74162 75571 76568 77098 76902 76519 76668 77013 76732 75925 75247 74551 73131 70973 68559
57495 68559 65717 61916 57485 53310 49548 45785 42195 39350 37074 34665 32063 29709 27473 24910
57481 24910 22392 20826 20345 20340 20617 21394 22294 22490 21807 20716 19436 17924 16477 15253 13595 10921 8001
$$ packed form
57589A22716k645k129k159k716k747k026j506j578j707j950l011m498m972m044
57575H5028k854k227j954j984k587l163k718j688j472k073k089j277j025j828
57561E6089k347j639n03J12L58M45L0p66j070o64k60o3N50J569K157K223K637
57544E8858L462L657K961K452K697K944K577J903J026n01k367l410l331l094l191
57529F6643l011k294j638j210n15J94qq36p92M48J401J153O06P00J115J474K145
57512F5575L048L205K334J409R97N30j96l83J49L45k81q07o78o96j420k158k414
57495F8559k842l801m431m175l762l763l590k845k276k409k602k354k236k563
57481B4910k518j566m81nK77P77R00J96o83j091j280j512j447j224j658k674k920
$$ plain form
57464 8001 6152 5487 5195 5201 6077 7513 8385 8383 8224 8202 7860 7218 6993 7327 7506 7173 6716 6272 5465 4324
57444 4324 3343 2410 782 -1539 -3438 -3999 -3340 -1904 92 2228 3761 4422 4644 4733 4398 3299 1528 -550
57425 -2486 -3842 -4560 -5077 -5584 -5642 -5169 -5150 -6407 -8183 -9073 -8944 -8685 -8491 -7771 -6593 -5696 -5008 -3595
57407 -3595 -1299 780 1726 1565 532 -1281 -3290 -4535 -4864 -5074 -5703 -6541 -7363 -8121 -8379 -7645 -6439 -5887
57389 -5887 -6083 -5838 -4295 -1802 979 3799 6424 8613 10722 13441 16713 19799 22508 25334 28226
57374 28226 30315 31164 31329 31404 31431 31444 31716 32296 33132 34684 37393 40521 42622 43285 43348 43332 42910 42106 41711
57355 41711 42148 42945 43651 44193 44189 43154 41667 41043 41463 41730 41273 40996 41526 41962 41216 39586 38147 37455
57337 37455 37534 38311 39398 40161 40514 40932 41378 41158 40214 39522 39688 40163 40416 40796 41544 41904 41073 39310 37385
$$ packed form
57464H001j849o65k92OQ76J436Q72kj59k2l42o42k25L34J79l33m57m44q07j141
57444D324r81r33G82a539j899n61O59J436I2K136J533O61K22Q9l35j099A528e50
57425b486j356p18n17n07n8M73J9j257j776q90J29K59J94P20J178Q97O88J413
57407c595a299G80R46j61E32a281k009j245l29k10o29q38q22p58k58P34J206N52
57389e887j96K45J543a802I79K820K625K189K109K719L272L086K709K826K892
57374B8226K089Q49J65P5K7J3K72N80Q36J552K709L128K101O63O3j6m22q04l95
57355D1711M37P97P06N42mj035j487o24M20K67m57k77N30M36p46j630j439o92
57337C7455P9P77J087P63L53M18M46k20r44o92J66M75K53L80P48L60q31j763j925
$$ plain form
57318 37385 35637 34225 33622 34103 35253 36503 37693 38811 39821 41033 42916 45215 47073 48294 49613
57303 49613 51442 53337 55101 57367 60528 64059 67422 70729 73944 76559 78697 81549 85872 90898
57289 90898 95534 99796 104249 108797 112976 116864 120903 125271 130090 135712 142159 148756 154839 160380
57275 160380 165532 170235 174757 179874 185964 192570 199362 206814 215326 224387 233225 241745 250262 258909
57261 258909 267859 277500 287833 298214 308223 318287 329055 340646 352834 365389 378000 390507
57249 390507 403432 417475 432292 446651 460090 473467 487612 502500 518046 534551 551845
57238 551845 569162 586404 604384 623311 642340 661323 681547 703733 726630 748782 770592
57227 770592 793338 817117 841081 864963 889043 913171 937038 961030 985752 1011182 1037128
$$ packed form
57318C7385j748j412o03M81J150J250J190J118J010J212J883K299J858J221J319
57303D9613J829J895J764K266L161L531L363L307L215K615K138K852M323N026
57289I0898M636M262M453M548M179L888M039M368M819N622O447O597O083N541
57275A60380N152M703M522N117O090O606O792P452Q512R061Q838Q520Q517Q647
57261B58909Q950R641J0333J0381J0009J0064J0768J1591J2188J2555J2611J2507
57249C90507J2925J4043J4817J4359J3439J3377J4145J4888J5546J6505J7294
57238E51845J7317J7242J7980J8927J9029J8983K0224K2186K2897K2152K1810
57227G70592K2746K3779K3964K3882K4080K4128K3867K3992K4722K5430K5946
$$ plain form
57216 1037128 1063997 1092237 1121674 1152290 1184991 1220607 1258785 1298917 1341513 1387540 1436900
57205 1436900 1488622 1542035 1596649 1651327 1704832 1756954 1808058 1857744 1905008 1949550 1991937
57194 1991937 2032547 2071340 2108797 2146383 2185885 2228603 2275034 2324978 2378152 2434885 2495750
57183 2495750 2560437 2627791 2697435 2770412 2847499 2927576 3008447 3088735 3168340 3247693 3327274
57172 3327274 3407200 3486488 3563276 3636432 3706396 3773901 3838695 3900258 3958913 4015304 4069541
57161 4069541 4121765 4172797 4223177 4272146 4318567 4362242 4403321 4441035 4474100 4501876 4524058
57150 4524058 4539611 4547082 4545767 4535788 4517452 4491502 4459743 4424632 4388508 4353916 4324178 4302724
57138 4302724 4291900 4292810 4305800 4330358 4364842 4406723 4452779 4498847 4540227 4572900 4593921 4600745
$$ packed form
57216A037128K6869K8240K9437L0616L2701L5616L8178M0132M2596M6027M9360
57205A436900N1722N3413N4614N4678N3505N2122N1104M9686M7264M4542M2387
57194A991937M0610L8793L7457L7586L9502M2718M6431M9944N3174N6733O0865
57183B495750O4687O7354O9644P2977P7087Q0077Q0871Q0288P9605P9353P9581
57172C327274P9926P9288P6788P3156O9964O7505O4794O1563N8655N6391N4237
57161D069541N2224N1032N0380M8969M6421M3675M1079L7714L3065K7776K2182
57150D524058J5553P471j315r979j8336k5950l1759l5111l6124l4592k9738k1454
57138D302724j0824R10J2990K4558L4484M1881M6056M6068M1380L2673K1021O824
$$ plain form
57126 4600745 4591591 4567135 4530725 4486180 4436199 4383246 4330388 4280107 4233340 4190516 4152452
57115 4152452 4119315 4089976 4063521 4040486 4021818 4007862 3999329 3997993 4005355 4021789 4047954 4085889
57103 4085889 4137907 4206065 4293960 4408018 4556652 4750356 5003949 5337206 5772744 6335585
57093 6335585 7055168 7963793 9089968 10454021 12068453 13934258 16029145 18298668
57085 18298668 20660542 23018166 25278381 27377828 29311102 31130532 32899901 34635487
57077 34635487 36289515 37784838 39054327 40045683 40702864 40957075 40737954 39993981 38712647
57068 38712647 36934729 34753114 32292396 29681552 27035461 24447217 21984823 19691509
57060 19691509 17591657 15697565 14011131 12523521 11218872 10079863 9089076 8227432
$$ packed form
57126D600745r154k4456l6410m4545m9981n2953n2858n0281m6767m2824l8064
57115D152452l3137k9339k6455k3035j8668j3956q533j336P362J6434K6165L7935
57103D085889N2018O8158Q7895J14058J48634J93704K53593L33257M35538N62841
57093F335585P19583R08625J126175J364053J614432J865805K094887K269523
57085A8298668K361874K357624K260215K099447J933274J819430J769369J735586
57077C4635487J654028J495323J269489R91356O57181K54211k19121p43973j281334
57068C8712647j777918k181615k460718k610844k646091k588244k462394k293314
57060A9691509k099852j894092j686434j487610j304649j139009r90787q61644
$$ plain form
57052 8227432 7475388 6816496 6238183 5729494 5279981 4880615 4524159 4204779 3918351
57043 3918351 3662538 3435167 3232832 3051918 2890079 2745565 2616007 2499091 2393520
57034 2393520 2298093 2210790 2130080 2056175 1989655 1929745 1875245 1826294 1783793 1747932 1718638
57023 1718638 1696615 1682574 1676446 1678943 1692797 1720119 1758355 1800047 1836246 1859189 1863023 1844718
57011 1844718 1805165 1748379 1679335 1602992 1524493 1448454 1377573 1312616 1253647 1200603 1153102
57000 1153102 1110732 1073447 1041055 1012728 987735 966188 948331 933585 921017 910185 900754
56989 900754 892077 884194 878670 877304 880393 887057 896495 907633 918014 924458 924957 919184 907578 890916
56975 890916 870564 848112 824727 801384 779307 759431 741783 726135 712885 702602 695239 690612
$$ packed form
57052H227432p52044o58892n78313n08689m49513l99366l56456l19380k86428
57043C918351k55813k27371k02335j80914j61839j44514j29558j16916j05571
57034B393520r5427q7303q0710p3905o6520n9910n4500m8951m2501l5861k9294
57023A718638k2023j4041o128K497J3854K7322L8236M1692L6199K2943L834j8305
57011A844718l9553n6786o9044p6343p8499p6039p0881o4957n8969n3044m7501
57000A153102m2370l7285l2392k8327k4993k1547j7857j4746j2568j0832r431
56989I00754q677p883n524j366L089O664R438J1138J0381O444M99n773j1606j6662
56975H90916k0352k2452k3385k3343k2077j9876j7648j5648j3250j0283p363m627
$$ plain form
56963 690612 689183 691582 697909 708458 724514 747195 775523 806295 835454 858899 872782 874700
56951 874700 865035 846515 822405 795356 767284 739325 711996 686065 663078 644500 630695 621313
56939 621313 616287 615789 619654 627570 639650 656466 678922 708246 744959 786855 828495 863488
56927 863488 887072 896588 891097 871867 842382 806464 766605 724703 683376 645158 610969 580596
56915 580596 554179 532004 513346 496928 482427 470436 461082 453629 447306 441603 436057 430553 425565
56902 425565 421309 417142 412629 408654 406478 406221 407299 409783 414132 420019 426790 434883 445637 459906
56888 459906 477853 499717 525374 553158 580136 603530 621172 631268 633237 628660 620129 609152
56876 609152 596233 582609 570267 560088 551457 544121 539222 538022 540644 546652 556128 569667 587885
$$ packed form
56963F90612j429K399O327J0549J6056K2681K8328L0772K9159K3445J3883J918
56951H74700r665j8520k4110k7049k8072k7959k7329k5931k2987j8578j3805r382
56939F21313n026m98L865P916J2080J6816K2456K9324L6713M1896M1640L4993
56927H63488K3584R516n491j9230k9485l5918l9859m1902m1327l8218l4189l0373
56915E80596k6417k2175j8658j6418j4501j1991r354p453o323n703n546n504m988
56902D25565m256m167m513l975k176k57J078K484M349N887O771Q093J0754J4269
56888D59906J7947K1864K5657K7784K6978K3394J7642J0096J969m577q531j0977
56876F09152j2919j3624j2342j0179q631p336m899j200K622O008R476J3539J8218
$$ plain form
56863 587885 611430 641203 678196 722903 774158 827867 877283 915513 938194 943986 933614 909461
56851 909461 875493 836181 795152 755237 719145 689002 665443 648157 637256 633457 637261 648924
56839 648924 669049 698495 738097 789351 854712 935528 1028896 1126685 1217316 1288592 1330795
56828 1330795 1339796 1318093 1272268 1209227 1134875 1054897 974791 898849 829998 770417 721410
56817 721410 683014 654821 636946 629363 631060 641274 661232 693352 738964 797723 868004 945459
56805 945459 1021097 1083160 1122338 1135105 1122851 1089652 1040990 982708 919913 856976 797981
56794 797981 745777 700738 661915 629392 604186 586023 573075 564279 560416 562628 571433 587545
56782 587545 611784 643164 678040 711682 739682 757847 762738 753576 732743 703618 668718 630233
$$ packed form
56863E87885K3545K9773L6993M4707N1255N3709M9416L8230K2681N792j0372k4153
56851I09461l3968l9312m1029l9915l6092l0143k3559j7286j0901l799L804J1663
56839F48924K0125K9446L9602N1254O5361Q0816R3368R7789R0631P1276M2203
56828A330795R001k1703m5825o3041p4352p9978q0106p5942o8851n9581m9007
56817G21410l8396k8193j7875p583J697J0214J9958L2120M5612N8759P0281P7455
56805I45459P5638O2063L9178J2767j2254l3199m8662n8282o2795o2937n8995
56794G97981n2204m5039l8823l2523k5206j8163j2948q796l863K212Q805J6112
56782E87545K4239L1380L4876L3642K8000J8165M891r162k0833k9125l4900l8485
$$ plain form
56770 630233 590878 553107 518219 486932 459953 437262 417677 400009 384246 371048 360561
56759 360561 352127 344745 337570 330486 324263 319576 315894 312053 307815 303987 301057 298795 297188 296587
56745 296587 296694 296530 295691 294617 293423 291629 289279 287238 286008 285276 284870 285019 285417 285242 284545 284405 285218
56728 285218 286009 286004 285744 285995 286611 287212 288100 289705 291797 293813 295414 296403 296834 297438 299108 301623 303673
56711 303673 304422 304242 303788 303295 302970 303081 303433 303637 303936 304706 305225 304356 302501 301305 301157 300685 299138 297516
56693 297516 296627 295790 294521 293899 294961 296962 298460 299090 299134 298369 296568 294371 292583 291191 289995 289444
56677 289444 290020 291451 293280 295482 297847 299671 300822 302223 304468 306874 308716 310389 312358 313853
56663 313853 313813 312496 311177 310758 311506 313473 316260 318930 321050 323299 326288 329358 331392 332267 332656 332924
$$ packed form
56770F30233l9355l7771l4888l1287k6979k2691j9585j7668j5763j3198j0487
56759C60561q434p382p175p084o223m687l682l841m238l828k930k262j607o01
56745B96587J07j64q39j074j194j794k350k041j230p32m06J49L98j75o97j40Q13
56728B85218P91nk60K51O16O01Q88J605K092K016J601R89M31O04J670K515K050
56711C03673P49j80m54m93l25J11L52K04K99P70N19q69j855j196j48m72j547j622
56693B97516q89q37j269o22J062K001J498O30M4p65j801k197j788j392j196n51
56677B89444N76J431J829K202K365J824J151J401K245K406J842J673J969J495
56663C13853m0j317j319m19P48J967K787K670K120K249K989L070K034Q75L89K68
$$ plain form
56647 332924 332990 332848 332473 331569 330046 328320 326648 324653 321973 318852 315681 312559 309696 307478 305655
56632 305655 303275 299985 296603 293864 291452 288897 286568 285031 284136 283439 282896 282492 281853 280823 279832 279186
56616 279186 278620 277919 277239 276504 275381 274198 273828 274284 274539 274214 274203 275062 276047 276492 276827 277388 277481 276663 275812
56597 275812 275860 276485 277080 277916 279272 280416 280651 280577 281174 282333 283330 284060 284842 285637 286272 286847 287280 287285 287306
56578 287306 288388 290510 292207 292588 292442 292612 292768 292777 293683 296052 298782 300926 303342 307108 311726 316506
56562 316506 322470 331051 341990 354158 367403 381677 395294 406034 413375 418003 419995 419331 417394
56549 417394 415871 414568 412068 408090 403478 398442 392748 387219 383053 379835 376052 371457 367177 363649
56535 363649 360219 356782 354012 351856 349368 346301 343461 341255 339134 336622 333779 330678 327505 325082
$$ packed form
56647C32924O6j42l75r04j523j726j672j995k680l121l171l122k863k218j823
56632C05655k380l290l382k739k412k555k329j537q95o97n43m04o39j030r91o46
56616B79186n66p01o80p35j123j183l70M56K55l25j1Q59R85M45L35N61R3q18q51
56597B75812M8O25N95Q36J356J144K35p4N97J159R97P30P82P95O35N75M33NK1
56578B87306J082K122J697L81j46J70J56RR06K369K730K144K416L766M618M780
56562C16506N964Q581J0939J2168J3245J4274J3617J0740P341M628J992o64j937
56549D17394j523j303k500l978m612n036n694n529m166l218l783m595m280l528
56535C63649l430l437k770k156k488l067k840k206k121k512k843l101l173k423
$$ plain form
56521 325082 324168 324298 324306 323759 322912 321731 320171 318948 318646 318352 316596 313465 310482 308577 307433 306641 306111
56504 306111 305474 304302 302852 301574 300150 298135 296144 295165 295084 295153 295464 296542 297878 298401 298211 298387 299245
56487 299245 300177 301023 302172 303386 303892 303646 303289 302997 302507 302081 302255 302842 303277 303602 304043 304180 303802 303918
56469 303918 305415 307319 308037 307756 307815 308198 307632 305990 304585 303972 303316 302162 301138 300644 300332 300212 300861
56452 300861 302279 303649 304355 304291 303359 301828 300813 301141 302075 302447 302508 303188 304133 304227 303658 303636 304360 304991 305367
56433 305367 305950 306386 305997 305471 306119 307692 308847 309500 310672 312196 312908 313077 314294 316692 318504 318701
56417 318701 317971 316786 314768 312443 311400 311994 312802 313009 313479 314802 316175 316943 317550 318273 318603 318544 318983
56400 318983 320213 321526 322638 323952 325138 325123 323954 323034 323131 323725 324568 326109 328051 329254 329505 329683
$$ packed form
56521C25082r14J30Qn47q47j181j560j223l02k94j756l131k983j905j144p92n30
56504C06111o37j172j450j278j424k015j991r79q1O9L11J078J336N23j90J76Q58
56487B99245R32Q46J149J214N06k46l57k92m90m26J74N87M35L25M41J37l78J16
56469C03918J497J904P18k81N9L83n66j642j405o13o56j154j024m94l12j20O49
56452C00861J418J370P06o4r32j531j015L28R34L72O1O80R45R4n69k2P24O31L76
56433C05367N83M36l89n26O48J573J155O53J172J524P12J69J217K398J812J97
56417C18701p30j185k018k325j043N94Q08K07M70J323J373P68O07P23L30n9M39
56400C18983J230J313J112J314J186j5j169r20R7N94Q43J541J942J203K51J78
$$ plain form
56384 329683 329940 329583 329019 329810 332285 335013 337080 339006 340898 341765 341310 340572 340190 339806 339566 340275 341607
56367 341607 342208 342077 342712 344399 345587 345645 345966 347444 349051 349833 350189 350266 349280 347504 346835 348146 349996
56350 349996 351007 351604 352417 353030 353457 354793 357187 359162 360187 361919 365561 369983 373847 377634 381993
56335 381993 385954 388467 390208 392263 394411 396109 397746 399595 400928 401531 402638 405093 407960 410180
56321 410180 412151 414374 415993 416040 414893 413295 411104 408085 404816 401863 399223 397206 396469 396572 396173
56306 396173 395249 395352 397025 398983 400611 403055 406894 410950 414581 418915 424464 429683 433311 436108 438918
56291 438918 441130 442511 444439 447724 451230 454208 457849 462894 467828 471302 474325 478187 482147 485105
56277 485105 487750 491084 494545 497397 500287 503684 506628 508821 512042 517519 523790 529185 534552 541446
$$ packed form
56384C29683K57l57n64P91K475K728K067J926J892Q67m55p38l82l84k40P09J332
56367C41607O01j31O35J687J188N8L21J478J607P82L56P7r86j776o69J311J850
56350C49996J011N97Q13O13M27J336K394J975J025J732L642M422L864L787M359
56335C81993L961K513J741K055K148J698J637J849J333O03J107K455K867K220
56321D10180J971K223J619M7j147j598k191l019l269k953k640k017p37J03l99
56306C96173r24J03J673J958J628K444L839M056L631M334N549N219L628K797K810
56291D38918K212J381J928L285L506K978L641N045M934L474L023L862L960K958
56277D85105K645L334L461K852K890L397K944K193L221N477O271N395N367O894
$$ plain form
56263 541446 549407 557304 565737 575922 587624 600260 614615 631521 650385 670911 694601 722591
56251 722591 753711 786703 822569 862616 906036 951774 1001038 1055462 1114275 1175594 1238973
56240 1238973 1304218 1369197 1431369 1490203 1545756 1596176 1639009 1673692 1700457 1718088 1725188
56229 1725188 1722465 1711532 1692650 1665834 1632816 1595645 1554595 1509693 1462862 1416279 1369958
56218 1369958 1323279 1277447 1234062 1192606 1151686 1111455 1072652 1034863 998104 964402 935173
56207 935173 908619 882367 857073 834650 814535 794804 775661 758729 743899 729771 716337
56196 716337 704580 694386 685300 678124 673237 668702 662717 656511 652076 648563 643931 638727 635044 632900
56182 632900 630850 629055 628608 628775 628043 627033 627396 628689 629283 629368 630175 631266 631499 631672 633286 635766 637773
$$ packed form
56263E41446P961P897Q433J0185J1702J2636J4355J6906J8864K0526K3690K7990
56251G22591L1120L2992L5866M0047M3420M5738M9264N4424N8813O1319O3379
56240A238973O5245O4979O2172N8834N5553N0420M2833L4683K6765J7631P100
56229A725188k723j0933j8882k6816l3018l7171m1050m4902m6831m6583m6321
56218A369958m6679m5832m3385m1456m0920m0231l8803l7789l6759l3702k9229
56207I35173k6554k6252k5294k2423k0115j9731j9143j6932j4830j4128j3434
56196G16337j1757j0194r086p176m887m535n985o206m435l513m632n204l683k144
56182F32900k050j795m47J67p32j010L63J293N94Q5Q07J091K33J73J614K480K007
$$ plain form
56165 637773 640065 644022 648601 651893 654542 658453 663299 667631 672330 679579 689291 699706 710566 722639
56151 722639 735317 747795 761453 777867 795904 814075 834375 860311 892610 930334 974512
56140 974512 1026782 1086047 1150813 1223635 1309106 1408557 1520675 1645682 1783917 1931025 2079107
56129 2079107 2222293 2357308 2479950 2586174 2676618 2755751 2826550 2889467 2945290 2994274
56119 2994274 3033057 3057005 3065623 3062013 3048133 3024811 2995019 2961808 2923153 2873309 2808818 2729200
56107 2729200 2633231 2520002 2393266 2259891 2124446 1989717 1861068 1744531 1641134 1548453
56097 1548453 1467039 1399648 1344870 1297774 1256811 1224180 1199457 1178995 1161859 1150295 1143803
56086 1143803 1138725 1134272 1133148 1135615 1138662 1141644 1146911 1154272 1160666 1165971 1173314 1182949 1191715 1199187
$$ packed form
56165F37773K292L957M579L292K649L911M846M332M699P249R712J0415J0860J2073
56151G22639J2678J2478J3658J6414J8037J8171K0300K5936L2299L7724M4178
56140I74512N2270N9265O4766P2822Q5471R9451J12118J25007J38235J47108J48082
56129B079107J43186J35015J22642J06224R0444P9133P0799O2917N5823M8984
56119B994274L8783K3948Q618l610j3880k3322k9792l3211l8655m9844o4491p9618
56107B729200r5969j13229j26736j33375j35445j34729j28649j16537j03397r2681
56097A548453q1414o7391n4778m7096m0963l2631k4723k0462j7136j1564o492
56086A143803n078m453j124K467L047K982N267P361O394N305P343R635Q766P472
$$ plain form
56072 1199187 1208428 1219984 1231107 1241594 1254184 1268437 1280398 1289211 1297927 1307092 1313969 1318878
56060 1318878 1325652 1334775 1342674 1348786 1356683 1367162 1377108 1386355 1398645 1414481 1430033 1444439 1461080
56047 1461080 1480374 1498685 1515803 1536002 1560086 1583959 1606680 1632158 1661067 1689104 1715294
56036 1715294 1743982 1776252 1807288 1834577 1860947 1887531 1911935 1935550 1964163 1998893 2034859
56025 2034859 2070825 2111305 2156967 2202458 2246345 2293679 2345956 2398322 2449595 2504931 2565452
56014 2565452 2625665 2684588 2748760 2820499 2893989 2966829 3044393 3128738 3214701 3301318 3395226
56003 3395226 3498086 3602794 3707088 3818480 3940566 4067349 4196638 4335692 4487633
55994 4487633 4645914 4808430 4982919 5171920 5367333 5566891 5780588 6013339 6257526
$$ packed form
56072A199187R241J1556J1123J0487J2590J4253J1961Q813Q716R165O877M909
56060A318878O774R123P899O112P897J0479R946R247J2290J5836J5552J4406J6641
56047A461080J9294J8311J7118K0199K4084K3873K2721K5478K8909K8037K6190
56036A715294K8688L2270L1036K7289K6370K6584K4404K3615K8613L4730L5966
56025B034859L5966M0480M5662M5491M3887M7334N2277N2366N1273N5336O0521
56014B565452O0213N8923O4172P1739P3490P2840P7564Q4345Q5963Q6617R3908
56003C395226J02860J04708J04294J11392J22086J26783J29289J39054J51941
55994D487633J58281J62516J74489J89001J95413J99558K13697K32751K44187
$$ plain form
55985 6257526 6510791 6784077 7083249 7400622 7734500 8098446 8500532 8932832 9393104
55976 9393104 9896658 10454243 11059693 11713454 12436021 13243019 14130910 15104312 16192655
55967 16192655 17422050 18798767 20342389 22107625 24151958 26516099 29266827 32529654
55959 32529654 36454910 41196951 46968248 54071964 62835552 73562093 86608975 102472647
55951 102472647 121756171 145175876 173725943 208598893 250299100 297200787 344763872
55944 344763872 386414969 415777996 428887043 425175209 406988802 378216212 342908780
55937 342908780 304517558 265782785 228843446 195205179 165639920 140271338 118841652
55930 118841652 100931988 86045648 73666387 63346318 54739755 47556347 41529090
$$ packed form
55985F257526K53265K73286K99172L17373L33878L63946M02086M32300M60272
55976I393104N03554N57585O05450O53761P22567Q06998Q87891R73402J088343
55967A6192655J229395J376717J543622J765236K044333K364141K750728L262827
55959C2529654L925256M742041N771297P103716Q763588J0726541J3046882J5863672
55951A02472647J9283524K3419705K8550067L4872950M1700207M6901687M7563085
55944C44763872M1651097K9363027J3109047l711834j8186407k8772590l5307432
55937C42908780l8391222l8734773l6939339l3638267k9565259k5368582k1429686
55930A18841652j7909664j4886340j2379261j0320069q606563p183408o027257
$$ plain form
55923 41529090 36441666 32142196 28505436 25407886 22750605 20472046 18518559 16825575
55915 16825575 15340310 14037036 12894606 11880239 10968117 10152301 9427246 8773877 8176775
55906 8176775 7636689 7153547 6713622 6305206 5931210 5594781 5286957 4999380 4735356
55897 4735356 4497674 4278381 4070695 3878788 3706106 3545784 3391838 3248396 3118797
55888 3118797 2996682 2876901 2764652 2664854 2572502 2482212 2397705 2323340 2255393 2190070 2131443
55877 2131443 2083417 2042078 2003463 1970427 1944205 1917379 1882960 1842931 1800823 1753819 1699631
55866 1699631 1643476 1590479 1538172 1483708 1431415 1385742 1343347 1299501 1256020 1215768 1175787
55855 1175787 1133348 1092952 1059836 1031753 1004146 978169 956594 936827 915073 893015 873735
$$ packed form
55923D1529090n087424m299470l636760l097550k657281k278559j953487j692984
55915A6825575j485265j303274j142430j014367r12122q15816p25055o53369n97102
55906H176775n40086m83142m39925m08416l73996l36429l07824k87577k64024
55897D735356k37682k19293k07686j91907j72682j60322j53946j43442j29599
55888C118797j22115j19781j12249r9798r2352r0290q4507p4365o7947o5323n8627
55877B131443m8026m1339l8615l3036k6222k6826l4419m0029m2108m7004n4188
55866A699631n6155n2997n2307n4464n2293m5673m2395m3846m3481m0252l9981
55855A175787m2439m0396l3116k8083k7607k5977k1575j9767k1754k2058j9280
$$ plain form
55844 873735 855294 834665 813862 796036 779540 761773 744847 731690 720439 708245 696649
55833 696649 687822 679604 669686 660585 655013 650482 643976 637855 635404 634437 631105 626310 622665 618708
55819 618708 611984 604545 599653 596150 591663 588269 589311 593490 597659 602671 610906 620736 629086 637091
55805 637091 647572 658964 667135 671351 673395 672711 667549 659219 650271 639929 625838 608804 591394
55792 591394 573605 554261 535010 518540 504417 490903 479318 472388 469674 468515 467976 468139 467239
55779 467239 463381 457613 451817 445396 437413 429713 424130 418847 411475 403571 397947 393677 388022 381267
55765 381267 375241 368963 360343 350610 342544 335734 328023 320276 315234 312779 310764 309541 311313 315792
55751 315792 320707 325947 333124 341567 348618 353448 357036 359027 358148 355069 351531 347388 341679 335489
$$ packed form
55844H73735j8441k0629k0803j7826j6496j7767j6926j3157j1251j2194j1596
55833F96649q827q218r918r101n572m531o506o121k451r67l332m795l645l957
55819F18708o724p439m892l503m487l394J042M179M169N012Q235R830Q350Q005
55805F37091J0481J1392Q171M216K044o84n162q330q948j0342j4091j7034j7410
55792E91394j7789j9344j9251j6470j4123j3514j1585o930k714j159n39J63r00
55779D67239l858n768n796o421p983p700n583n283p372p904n624m270n655o755
55765C81267o026o278q620r733q066o810p711p747n042k455k015j223J772M479
55751C15792M915N240P177Q443P051M830L588J991q79l079l538m143n709o190
$$ plain form
55737 335489 330370 325182 318159 310855 306209 303761 300766 297158 295249 295058 294009 291099 287678 284335
55723 284335 280427 276416 273330 270284 265771 260861 257831 256301 254145 251524 250362 250405 249550 247765 246982
55708 246982 247329 247116 246421 247112 249239 250933 251876 253415 255109 254694 251846 248700 246251 243344 239592 236277
55692 236277 233953 231950 230534 230812 232352 233602 234713 237170 240707 243501 245461 248378 252660 256853
55678 256853 260562 264893 269694 273218 274869 275648 275660 273997 271348 269942 270522 271915 273786 277110 281637
55663 281637 285719 289100 293341 299119 305504 312124 319451 326681 331965 335015 336893 337111 333745 326850
55649 326850 318909 311311 303009 293312 283375 274125 265151 256431 248987 243134 238102 233797 230815 228496
55635 228496 225305 221522 219209 219032 219383 219034 218370 217618 216244 214559 213610 213013 211170 208071 205558 204391
$$ packed form
55737C35489n119n188p023p304m646k448k995l608j909j91j049k910l421l343
55723B84335l908m011l086l046m513m910l030j530k156k621j162M3q55j785p83
55708B46982L47k13o95O91K127J694R43J539J694m15k848l146k449k907l752l315
55692B36277k324k003j416K78J540J250J111K457L537K794J960K917M282M193
55678B56853L709M331M801L524J651P79J2j663k649j406N80J393J871L324M527
55663B81637M082L381M241N778O385O620P327P230N284L050J878K18l366o895
55649C26850p941p598q302r697r937r250q974q720p444n853n032m305k982k319
55635B28496l191l783k313j77L51l49o64p52j374j685r49n97j843l099k513j167
$$ plain form
55619 204391 203409 201987 200902 200226 198818 196486 194348 192547 190004 186966 185250 185329 185658 185614 186516 188876
55603 188876 191099 191937 191932 191483 189877 187272 185303 184542 183493 181246 179013 177846 176883 175208 173617 173173
55587 173173 173539 173829 173739 173035 171452 169826 169740 171405 173407 174896 176272 177399 177315 176290 176017 177112 178505
55570 178505 179900 182492 186442 189967 191961 193329 194753 195469 195354 195855 197472 198494 197696 196211 195264
55555 195264 194068 191644 188898 187208 186488 186177 186583 187724 188431 188122 188093 189500 191438 192517 193039 194110
55539 194110 195728 197211 198534 199883 200771 200720 200069 199262 198284 197386 197124 196966 195324 191749 187678 184284
55523 184284 181149 177912 175409 174079 172888 171065 169332 168271 167087 165281 163918 163750 163578 162073 159934
55508 159934 158657 158276 157819 157066 156488 156312 156738 158128 159984 160872 160295 159430 159104 158587 157438 156861 157738
$$ packed form
55619B04391r82j422j085o76j408k332k138j801k543l038j716P9L29m4R02K360
55603A88876K223Q38nm49j606k605j969p61j049k247k233j167r63j675j591m44
55587A73173L66K90r0p04j583j626q6J665K002J489J376J127q4j025k73J095J393
55570A78505J395K592L950L525J994J368J424P16j15N01J617J022p98j485r47
55555A95264j196k424k746j690p20l11M06J141P07l09k9J407J938J079N22J071
55539A94110J618J483J323J349Q88n1o51q07r78q98k62j58j642l575m071l394
55523A84284l135l237k503j330j191j823j733j061j184j806j363j68j72j505k139
55508A59934j277l81m57p53n78j76M26J390J856Q88n77q65l26n17j149n77Q77
$$ plain form
55491 157738 158861 158795 158158 158326 159029 159085 158537 158270 158304 158139 158198 159264 160964 162294 163224 164468 166061 167357
55473 167357 168098 168479 168569 168462 168475 168483 167727 165997 164168 162911 161851 160693 159998 159995 159833 159000 158228 157976 157365
55454 157365 155851 154638 154983 156260 157140 157626 158402 159127 158970 158143 157467 157084 156860 157179 158057 158388 157518 156670
55436 156670 157276 158766 159630 159925 160919 162757 164260 164863 165146 165564 166007 166596 167652 168880 169555 169439 168837
55419 168837 168065 167540 167808 168700 169104 168442 167653 167869 168900 169933 170799 171427 171028 169115 166614 164722 163366
55402 163366 161988 160957 160822 160964 160476 159709 159468 159386 158631 157696 157790 158881 159887 160515 161306 162132 162223 161670
55384 161670 161460 162030 162948 163941 165022 165782 165737 165248 165015 164939 164559 164172 164242 164073 162620 160459 159456 160387
55366 160387 162239 163913 165285 166338 166496 165339 163183 160674 158423 157066 156953 157735 158750 159629 160063
$$ packed form
55491A57738J123o6o37J68P03N6n48k67L4j65N9J066J700J330R30J244J593J296
55473A67357P41L81R0j07J3Qp56j730j829j257j060j158o95lj62q33p72k52o11
55454A57365j514j213L45J277Q80M86P76P25j57q27o76l83k24L19Q78L31q70q48
55436A56670O06J490Q64K95R94J838J503O03K83M18M43N89J056J228O75j16o02
55419A68837p72n25K68Q92M04o62p89K16J031J033Q66O28l99j913k501j892j356
55402A63366j378j031j35J42m88p67k41q2p55r35R4J091J006O28P91Q26R1n53
55384A61670k10N70R18R93J081P60m5m89k33p6l80l87P0j69j453k161j003R31
55366A60387J852J674J372J053J58j157k156k509k251j357j13P82J015Q79M34
$$ plain form
55351 160063 159546 158126 156923 156942 157781 158391 158540 158574 158351 157641 157092 157426 158041 157811 156998 156893 157705 158321 158256
55332 158256 158352 159235 160415 161327 162100 162720 162408 160553 157768 155504 154863 155866 157575 158897 159492 159740 159741
55315 159741 158961 157250 155418 154196 153401 152927 153660 156181 159280 161159 161698 162152 162905 163018 161937 160336
55299 160336 159078 158458 158558 159306 160114 160362 160304 160660 161416 162000 162524 163770 165805 167597 168147 167300 165489
55282 165489 163469 162203 162136 162541 162335 161493 160936 161281 162412 164015 165630 166485 166272 165907 166495 167750 168425
55265 168425 168130 167702 167908 168769 170026 171217 171466 170312 168726 168181 168758 169273 169230 169383 170244 171277 171917
55248 171917 172336 172736 172753 172023 170716 169227 167878 167002 166772 166865 166821 166659 166584 166339 165529 164462 163914 164186 164944
55229 164944 165748 166111 165470 163911 162495 162046 162037 161555 160806 160588 160750 160499 159849 159504 159530 159459 159502 160331 161793
$$ packed form
55351A60063n17j420j203J9Q39O10J49L4k23p10n49L34O15k30q13j05Q12O16o5
55332A58256R6Q83J180R12P73O20l12j855k785k264o41J003J709J322N95K48J
55315A59741p80j711j832j222p95m74P33K521L099J879N39M54P53J13j081j601
55299A60336j258o20J00P48Q08K48n8L56P56N84N24J246K035J792N50q47j811
55282A65489k020j266o7M05k06q42n57L45J131J603J615Q55k13l65N88J255O75
55265A68425k95m28K06Q61J257J191K49j154j586n45N77N15m3J53Q61J033O40
55248A71917M19M00J7p30j307j489j349q76k30R3m4j62p5k45q10j067n48K72P58
55229A64944Q04L63o41j559j416m49rm82p49k18J62k51o50l45K6p1M3Q29J462
$$ plain form
55210 161793 163101 164160 165393 166433 166481 165924 166079 167193 168120 168163 167774 167210 166000 164194 162764 162228 162008
55193 162008 161628 161445 161739 162137 162352 162551 162755 162876 163510 165440 168047 169527 169094 167828 166919 166359 165889
55176 165889 165972 166955 168276 169250 169903 170427 170638 170511 170400 170231 169316 167545 165987 165662 166414 167483 168576
55159 168576 169820 171273 172902 174555 175720 175896 175361 174932 174868 174797 174753 175253 176149 176529 176111 175695 175774 175703 174823
55140 174823 173538 172636 172234 171950 171500 170702 169532 168572 168729 170109 171754 172759 173041 172846 172259 171484 170815
55123 170815 170076 168777 167056 165731 165216 165146 165124 165048 164673 163850 163254 163792 165172 166249 166929 168352 170812
55106 170812 172976 173835 174088 174756 175611 175933 175814 175737 175675 175512 175674 176445 177287 177629 177776 178328 179175 179754 179874
55087 179874 179754 179626 179698 180045 180306 180034 179507 179501 180112 180643 180811 181039 181325 180995 180075 179768 180876 182700 184115
$$ packed form
55210A61793J308J059J233J040M8n57J55J114R27M3l89n64j210j806j430n36k20
55193A62008l80j83K94L98K15J99K04J21O34J930K607J480m33j266r09n60m70
55176A65889Q3R83J321R74O53N24K11j27j11j69r15j771j558l25P52J069J093
55159A68576J244J453J629J653J165J76n35m29o4p1m4N00Q96L80m18m16P9p1q80
55140A74823j285r02m02k84m50p98j170r60J57J380J645J005K82j95n87p75o69
55123A70815p39j299j721j325n15p0k2p6l75q23n96N38J380J077O80J423K460
55106A70812K164Q59K53O68Q55L22j19p7o2j63J62P71Q42L42J47N52Q47N79J20
55087A79874j20j28P2L47K61k72n27oO11N31J68K28K86l30r20l07J108J824J415
$$ plain form
55068 184115 184760 184581 183301 181190 179427 178806 178757 178385 177637 176799 175708 174354 173491 173692 174420 174787 174681
55051 174681 174436 174035 173412 172979 173150 173829 174856 176304 177865 178755 178830 178984 179822 180785 181289 181734 182584 183363
55033 183363 183489 183313 183320 183074 181995 180582 179757 179519 179242 178881 178899 179353 179963 180756 181807 182651 182751 182334 182116
55014 182116 182392 182969 183643 184275 184738 185211 186076 187206 187940 188076 188112 188169 187637 186418 185472 185424 185645 185481 185371
54995 185371 185793 186080 185418 184220 183451 183299 183506 184170 185170 185653 185291 185218 186395 187840 187937 186931 186517 187361
54977 187361 188554 189331 189891 190584 191559 193161 195458 197454 197970 197340 197104 197982 199207 199884 199991 199911 199928 200281
54959 200281 200958 201427 201298 201090 201536 202389 202846 202931 203407 204364 204990 204853 204480 204460 204755 205048 205129 204888 204510 204654
54939 204654 205787 207416 208578 209000 209233 209866 211214 213539 216913 221068 225964 232140 239855 248336 256592
$$ packed form
55068A84115O45j79j280k111j763o21m9l72p48q38j091j354q63K01P28L67j06
55051A74681k45m01o23m33J71O79J027J448J561Q90P5J54Q38R63N04M45Q50P79
55033A83363J26j76Pk46j079j413q25k38k77l61J8M54O10P93J051Q44J00m17k18
55014A82116K76N77O74O32M63M73Q65J130P34J36L6N7n32j219r46m8K21j64j10
54995A85371M22K87o62j198p69j52K07O64J000M83l62p3J177J445R7j006m14Q44
54977A87361J193P77N60O93R75J602K297J996N16o30k36Q78J225O77J07q0J7L53
54959B00281O77M69j29k08M46Q53M57Q5M76R57O26j37l73k0K95K93Q1k41l78J44
54939B04654J133J629J162M22K33O33J348K325L374M155M896O176P715Q481Q256
$$ plain form
54924 256592 264440 271932 278348 282758 285105 285664 283992 279711 273893 268201 262871 256977 250590 245056
54910 245056 240930 237160 232789 228234 224324 221193 218659 216751 215276 213652 211674 209839 208535 207572
54896 207572 206810 206620 207404 209178 211809 215068 218413 221424 224567 228817 234389 240615 247188 254599 262987
54881 262987 271333 278303 283415 286946 289130 289733 288209 284173 278017 270909 263771 256471 248575 240672
54867 240672 234119 229502 226081 222803 219202 215373 211765 208969 206996 204885 201812 198460 196320 195704
54853 195704 195531 195149 195080 195621 195908 195101 193586 192265 191320 190346 189197 188006 186705 185131 183407 181884
54837 181884 180929 180966 182364 184929 187730 189723 190493 190394 190183 190466 191200 191754 191671 191211 190875 190691 190462 190366 190668
54818 190668 191091 191182 191126 191503 192354 193298 194402 196038 197923 199273 200003 200854 202125 203183 203521 203445 203352 203113
$$ packed form
54924B56592P848P492O416M410K347N59j672m281n818n692n330n894o387n534
54910B45056m126l770m371m555l910l131k534j908j475j624j978j835j304r63
54896B07572p62j90P84J774K631L259L345L011L143M250N572O226O573P411Q388
54881B62987Q346O970N112L531K184O03j524m036o156p108p138p300p896p903
54867B40672o553m617l421l278l601l829l608k796j973k111l073l352k140o16
54853A95704j73l82o9N41K87q07j515j321r45r74j149j191j301j574j724j523
54837A81884r55L7J398K565K801J993P70r9k11K83P34N54q3m60l36j84k29r6L02
54818A90668M23R1n6L77Q51R44J104J636J885J350P30Q51J271J058L38p6r3k39
$$ plain form
54800 203113 202655 202459 202937 203709 203999 203525 202706 202200 202325 202790 203019 202923 203127 204091 205432 206609 207816 209402
54782 209402 210924 211806 212734 215162 219425 224455 229459 234779 240830 247327 253948 260843 267967 274757 280780
54767 280780 285948 289834 291674 291401 289798 287244 283244 277661 271465 265658 260243 254825 249471 244309
54753 244309 239072 233816 229494 227022 226121 225709 225106 224260 223159 221660 219826 218025 216773 216624 217865
54738 217865 220101 222470 224479 226382 228691 231736 235687 240459 245519 250405 255526 261759 269078 276275
54724 276275 282179 286415 288760 288697 286142 281872 276701 270797 264231 257550 251276 245428 240055 235740 232988
54709 232988 231520 230639 229954 229343 228554 227272 225364 222833 219889 217146 215277 214268 213514 212724 212161 211873
54693 211873 211453 210797 210343 210221 209894 209039 208081 207459 207058 206791 206950 207484 207648 207027 206272 206188 206605 206773 206414
$$ packed form
54800B03113m58j96M78P72K90m74q19n06J25M65K29r6K04R64J341J177J207J586
54782B09402J522Q82R28K428M263N030N004N320O051O497O621O895P124O790O023
54767B80780N168L886J840k73j603k554m000n583o196n807n415n418n354n162
54753B44309n237n256m322k472r01m12o03q46j101j499j834j801j252j49J241
54738B17865K236K369K009J903K309L045L951M772N060M886N121O233P319P197
54724B76275N904M236K345o3k555m270n171n904o566o681o274n848n373m315k752
54709B32988j468q81o85o11p89j282j908k531k944k743j869j009p54p90n63k88
54693B11873m20o56m54j22l27q55r58o22m01k67J59N34J64o21p55q4M17J68l59
$$ plain form
54674 206414 205759 204989 204258 203984 204501 205572 206595 207121 207087 206864 207096 207965 208557 207726 205692 204003 203682 204306
54656 204306 205157 206172 207274 207897 207923 208146 208958 209505 209063 208397 208658 209593 210000 209499 208765 208333 208203 208383
54638 208383 208891 209347 209347 209049 208738 208179 207164 206254 206052 206001 204965 202928 201189 200787 201496 202438 203001 203093 203052
54619 203052 203431 204352 205164 205164 204522 203992 203930 204201 204870 206256 208216 209973 210773 210386 209065 207444 206379 206326
54601 206326 206877 207259 207216 207026 206803 206300 205410 204429 203779 203736 204391 205618 207074 208440 209551 210274 210558 210722
54583 210722 211242 212023 212335 211813 211007 210474 209839 208413 206466 205176 205425 207077 209384 211625 213398 214648
54567 214648 215517 216092 216433 216807 217487 218233 218462 218068 217557 217210 216784 216296 216312 217004 217608 217422 216738 216287 216356
54548 216356 217009 218436 220398 221949 222537 222862 223910 225626 227287 228574 229464 229668 229192 228984 229920 231438
$$ packed form
54674B06414o55p70p31k74N17J071J023N26l4k23K32Q69N92q31k034j689l21O24
54656B04306Q51J015J102O23K6K23Q12N47m42o66K61R35M07n01p34m32j30J80
54638B08383N08M56%k98l11n59j015r10k02n1j036k037j739m02P09R42N63R2m1
54619B03052L79R21Q12%o42n30o2K71O69J386J960J757Q00l87j321j621j065n3
54601B06326N51L82m3j90k23n03q90r81o50m3O55J227J456J366J111P23K84J64
54583B10722N20P81L12n22q06n33o35j426j947j290K49J652K307K241J773J250
54567B14648Q69N75L41L74O80P46K29l94n11l47m26m88J6O92O04j86o84m51O9
54548B16356O53J427J962J551N88L25J048J716J661J287Q90K04m76k08R36J518
$$ plain form
54532 231438 232136 231519 230197 228655 226876 225114 223973 223605 223654 223987 224712 225506 225772 225551 225587 226292 227224 227626
54514 227626 227043 225537 223774 222700 222580 222590 221881 220711 219891 219521 219088 218483 218090 218108 218516 219423 220667 221485
54496 221485 221521 221698 222949 224445 224464 222864 221299 220926 221268 221652 222318 223534 224777 225505 225911 226377 226945
54479 226945 227725 228999 230469 231233 231040 230873 231714 233416 235353 237495 240164 243149 245751 247478 248276 248361
54463 248361 248203 248411 249253 250450 251535 252199 252264 251765 251129 250796 250533 249590 247702 245476 243654 242446 241694
54446 241694 241155 240473 239307 237717 236044 234447 232979 232056 232159 233034 233878 234418 235011 235562 235264 233849 232279
54429 232279 231645 231981 232638 233226 233620 233610 233242 233153 233910 235243 236428 237228 237932 238665 239203 239448 239661 240100 240645
54410 240645 240878 240495 239704 239156 239382 240321 241540 242755 243857 244594 244709 244358 243953 243604 243171 242836 243009 243609
$$ packed form
54532B31438O98o17j322j542j779j762j141l68M9L33P25P94K66k21L6P05R32M02
54514B27626n83j506j763j074j20J0p09j170q20l70m33o05l93J8M08R07J244Q18
54496B21485L6J77J251J496J9j600j565l73L42L84O66J216J243P28M06M66N68
54479B26945P80J274J470P64j93j67Q41J702J937K142K669K985K602J727P98Q5
54463B48361j58K08Q42J197J085O64O5m99o36l33k63r43j888k226j822j208p52
54446B41694n39o82j166j590j673j597j468r23J03Q75Q44N40N93N51k98j415j570
54429B32279o34L36O57N88L94j0l68q9P57J333J185Q00P04P33N38K45K13M39N45
54410B40645K33l83p91n48K26R39J219J215J102P37J15l51m05l49m33l35J73O00
$$ plain form
54392 243609 244014 243922 243722 243821 244171 244658 245407 246345 246967 246894 246325 245635 244893 244064 243356 243011 242996 243098 243116 242824
54372 242824 242094 241285 241182 242282 244301 246497 248226 249188 249558 250038 251370 253543 255772 257418 258635 259984
54356 259984 261759 263826 265742 266880 266834 265931 265017 264512 263991 262884 261261 259622 258189 256677 254668 252040
54340 252040 249115 246473 244530 243340 242881 243319 244654 246323 247606 248367 248944 249390 249257 248208 246453 244638
54324 244638 243602 244002 245582 246990 247000 245837 244678 244007 243354 242603 242407 242945 243253 242449 240947 239778 239211
54307 239211 238674 237765 236735 236080 236038 236459 236964 237281 237430 237480 237289 236781 236257 235999 235806 235448 235314 235870 236691
54288 236691 236931 236655 236702 237218 237417 237017 236765 237094 237332 236891 236294 236341 236931 237441 237664 237719 237573 237227 236915 236699
54268 236699 236383 236191 236879 238688 240858 242641 244078 245325 246081 246360 247034 248723 250829 252461 253687 254978
$$ packed form
54392B43609M05r2k00R9L50M87P49R38O22p3n69o90p42q29p08l45j5J02J8k92
54372B42824p30q09j03J100K019K196J729R62L70M80J332K173K229J646J217J349
54356B59984J775K067J916J138m6r03r14n05n21j107j623j639j433j512k009k628
54340B52040k925k642j943j190m59M38J335J669J283P61N77M46j33j049j755j815
54324B44638j036M00J580J408J0j163j159o71o53p51j96N38L08q04j502j169n67
54307B39211n37r09j030o55m2M21N05L17J49N0j91n08n24k58j93l58j34N56Q21
54288B36691K40k76M7N16J99m00k52L29K38m41n97M7N90N10K23N5j46l46l12k16
54268B36699l16j92O88J809K170J783J437J247P56K79O74J689K106J632J226J291
$$ plain form
54252 254978 255998 256022 255180 254311 253831 253587 253522 253581 253200 251780 249633 247697 246435 245718 245555 246123 247041 247412
54234 247412 246803 245750 245267 246141 248439 251264 253234 253687 253213 252681 252264 251908 252125 253370 255060 256139
54218 256139 256417 256434 256261 255425 253994 252753 252125 251771 251404 251232 251372 251514 251419 251219 251070 251025 251288 252027 252802
54199 252802 252781 251720 250326 249515 249659 250491 251248 250998 249516 247863 247482 248544 249754 249875 248911 247674 246826
54182 246826 246492 246295 245620 244335 243298 243518 244705 245462 245175 244903 245891 247912 249759 250855 251552 252051 251905
54165 251905 250704 248752 246840 245584 245111 245195 245578 246177 246977 247799 248307 248327 247974 247434 246737 245850 244848 243941
54147 243941 243369 243257 243456 243614 243600 243772 244587 245928 247128 247701 247722 247443 246920 246253 245899 246361 247659 249307
54129 249307 250750 251653 251916 251704 251480 251770 252760 254156 255497 256570 257515 258614 259991 261499 262828 263791
$$ packed form
54252B54978J020K4q42q69m80k44o5N9l81j420k147j936j262p17j63N68R18L71
54234B47412o09j053m83Q74K298K825J970M53m74n32m17l56K17J245J690J079
54218B56139K78J7j73q36j431j241o28l54l67j72J40J42r5k00j49m5K63P39P75
54199B52802k1j061j394q11J44Q32P57k50j482j653l81J062J210J21r64j237q48
54182B46826l34j97o75j285j037K20J187P57k87k72R88K021J847J096O97M99j46
54165B51905j201j952j912j256m73Q4L83N99Q00Q22N08K0l53n40o97q87j002r07
54147B43941n72j12J99J58j4J72Q15J341J200N73K1k79n23o67l54M62J298J648
54129B49307J443R03K63k12k24K90R90J396J341J073R45J099J377J508J329R63
$$ plain form
54113 263791 264550 265494 266764 268001 268786 269343 270501 272769 275722 278550 281032 283637 286885 291060 296433
54098 296433 303208 311146 319739 328953 339404 351455 364330 376270 385405 390428 390832 386895 379464
54085 379464 369656 358703 347776 337641 328517 320546 314147 309531 306157 303372 301521 301651 304040 307902
54071 307902 312699 318794 326322 334224 341123 346513 350479 352799 353171 351942 349810 346879 342647 336895
54057 336895 330174 323517 317952 314002 311269 308721 305680 302340 299168 296369 294243 293447 294287 296153 298200
54042 298200 300219 302377 304682 307320 310935 315836 321305 326483 331523 337105 343174 349087 354697 360350
54028 360350 365997 371241 376189 381292 386360 390594 393705 396178 398348 399999 400991 401531 401658 401152 400070
54013 400070 398723 397032 394599 391531 388445 385480 382007 377563 372448 367177 361954 356903 352215 347768
$$ packed form
54113B63791P59R44J270J237P85N57J158K268K953K828K482K605L248M175N373
54098B96433O775P938Q593R214J0451J2051J2875J1940R135N023M04l937p431
54085C79464r808j0953j0927j0135r124p971o399m616l374k785j851J30K389L862
54071C07902M797O095P528P902O899N390L966K320L72j229k132k931m232n752
54057C36895o721o657n565l950k733k548l041l340l172k799k126p96Q40J866K047
54042B98200K019K158K305K638L615M901N469N178N040N582O069N913N610N653
54028C60350N647N244M948N103N068M234L111K473K170J651R92N40J27n06j082
54013D00070j347j691k433l068l086k965l473m444n115n271n223n051m688m447
$$ plain form
53999 347768 343152 338334 333816 329931 326513 323468 321093 319503 318226 316728 314905 312830 310457 307935
53985 307935 305837 304659 304266 304092 303708 303052 302295 301673 301291 301066 300963 301126 301534 301719 301269 300483 300034 300010
53967 300010 299851 299232 298465 297890 297430 296961 296668 296785 297267 297891 298566 299607 301798 305910 311752 318010 323562
53950 323562 328709 334536 341444 349134 357833 368454 381471 396541 413317 431547 449926 465749
53938 465749 476437 481111 480556 476276 469836 462392 454356 445875 437695 430930 425842 421669 417946 415198
53924 415198 414011 414219 415524 418068 421796 425980 430080 434487 439723 445491 451227 457129 463796 471195
53910 471195 478752 486238 493823 501360 508236 513926 518268 521320 523374 524860 525766 525369 523068 519366 515516
53895 515516 512241 509232 505771 501405 496045 489870 483211 476318 469174 461709 454041 446350 438682 431134
$$ packed form
53999C47768m616m818m518l885l418l045k375j590j277j498j823k075k373k522
53985C07935k098j178l93j74l84o56p57o22l82k25j03J63M08J85m50p86m49k4
53967C00010j59o19p67n75m60m69k93J17M82O24O75J041K191M112N842O258N552
53950C23562N147N827O908P690Q699J0621J3017J5070J6776J8230J8379J5823
53938D65749J0688M674n55m280o440p444q036q481q180o765n088m173l723k748
53924D15198j187K08J305K544L728M184M100M407N236N768N736N902O667P399
53910D71195P557P486P585P537O876N690M342L052K054J486R06l97k301l702l850
53895E15516l275l009l461m366n360o175o659o893p144p465p668p691p668p548
$$ plain form
53881 431134 423966 417211 410384 402944 395052 387632 381706 377746 375373 373484 370907 367261 363065 358858
53867 358858 354514 349717 344794 340516 337167 334233 331090 327677 324369 321433 318747 315994 313057 310194
53853 310194 307823 306158 305184 304854 305113 305684 306062 305835 304988 303883 303059 302856 303082 303138 302766 302427 302647 303208
53835 303208 303451 303200 302829 302527 302123 301602 301152 300695 299997 299388 299661 301043 302836 304304 305353 306170 306812
53818 306812 307402 308201 309233 310362 311792 313786 315862 317155 317840 319214 321939 325149 327924 330772 334814
53803 334814 340203 346159 352011 357425 362135 366329 370925 376673 383239 389793 396063 402146 407740 412380
53789 412380 416161 419448 422163 424016 425149 425816 425756 424644 422875 421056 418985 416025 412234 408201 403875
53774 403875 398598 392373 386175 380772 376047 371682 367685 363912 359764 354891 349789 345323 341864 339101
$$ packed form
53881D31134p168o755o827p440p892p420n926l960k373j889k577l646m196m207
53867C58858m344m797m923m278l349k934l143l413l308k936k686k753k937k863
53853C10194k371j665r74l30K59N71L78k27q47j105q24k03K26N6l72l39K20N61
53835C03208K43k51l71l02m04n21m50m57o98o09K73J382J793J468J049Q17O42
53818C06812N90P99J032J129J430J994K076J293O85J374K725L210K775K848M042
53803C34814N389N956N852N414M710M194M596N748O566O554O270O083N594M640
53789D12380L781L287K715J853J133O67o0j112j769j819k071k960l791m033m326
53774D03875n277o225o198n403m725m365l997l773m148m873n102m466l459k763
$$ plain form
53760 339101 336486 333692 330839 328343 326399 324708 322861 320849 318951 317297 315823 314431 312912 311031
53746 311031 308995 307458 306651 306010 305203 304952 306022 307793 308815 308580 307750 306776 305436 303839 302783 302673
53730 302673 302937 302994 303096 303778 305054 306633 308411 310265 311779 312620 312973 313306 313970 315141 316836 318722
53714 318722 320252 321221 321992 323086 324814 327307 330454 333715 336435 338541 340561 342855 345291 347808 350812
53699 350812 354710 359415 364520 369623 374291 378155 381290 384139 386755 388525 388959 388404 387587 386788 385891
53684 385891 385030 384664 384995 385709 386364 386846 387332 387891 388227 387957 387241 386972 387964 389936 391614 391972 391123 389868
53666 389868 388734 387709 386696 385836 385331 385174 385149 385086 385055 385254 385670 385979 385870 385320 384468 383369 382102 380921
53648 380921 380078 379567 379259 379152 379301 379733 380646 382341 384622 386593 387575 387940 388442 389072 389363 389616 390716
$$ packed form
53760C39101k615k794k853k496j944j691j847k012j898j654j474j392j519j881
53746C11031k036j537q07o41q07k51J070J771J022k35q30r74j340j597j056j10
53730C02673K64N7J02O82J276J579J778J854J514Q41L53L33O64J171J695J886
53714C18722J530R69P71J094J728K493L147L261K720K106K020K294K436K517L004
53699C50812L898M705N105N103M668L864L135K849K616J770M34n55q17p99q97
53684C85891q61l66L31P14O55M82M86N59L36k70p16k69R92J972J678L58q49j255
53666C89868j134j025j013q60n05j57k5o3l1J99M16L09j09n50q52j099j267j181
53648C80921q43n11l08j07J49M32R13J695K281J971R82L65N02O30K91K53J100
$$ plain form
53631 390716 392608 393999 394079 393717 394339 396272 398825 401419 403839 405747 406842 407519 408683 410768 413375
53616 413375 416030 418876 422389 426641 431156 435468 439677 444359 449909 456134 462595 469221 476337 484161
53602 484161 492520 501069 509474 517366 524441 530659 536030 540151 542311 542262 540587 538135 535397 532581 529926
53587 529926 527629 525652 523815 521941 519816 517230 514253 511209 508243 505180 501977 498983 496473 494210
53573 494210 491789 489121 486305 483254 479945 476851 474682 473634 473235 472943 472597 472236 471771 470996 469848 468608
53557 468608 467836 467972 468852 469748 470067 469963 470059 470654 471479 472161 472648 473121 473798 474907 476542 478329 479506 479691
53539 479691 479474 479894 481317 483124 484597 485781 487253 489406 492349 496307 501554 507864 514476 520884 527410
53524 527410 534828 543617 553701 564625 575777 586693 597425 608493 620323 632904 646143 660216
$$ packed form
53631C90716J892J391Q0l62O22J933K553K594K420J908J095O77J164K085K607
53616D13375K655K846L513M252M515M312M209M682N550O225O461O626P116P824
53602D84161Q359Q549Q405P892P075O218N371M121K160m9j675k452k738k816k655
53587E29926k297j977j837j874k125k586k977l044k966l063l203k994k510k263
53573D94210k421k668k816l051l309l094k169j048l99k92l46l61m65p75j148j240
53557D68608p72J36Q80Q96L19j04R6N95Q25O82M87M73O77J109J635J787J177J85
53539D79691k17M20J423J807J473J184J472K153K943L958N247O310O612O408O526
53524E27410P418Q789J0084J0924J1152J0916J0732J1068J1830J2581J3239J4073
$$ plain form
53512 660216 675340 691474 708540 726557 745228 763790 781826 800015 819459 840369 861933
53501 861933 883395 904655 925789 946616 966964 986903 1006523 1025853 1045122 1064773 1085038
53490 1085038 1105790 1126818 1147913 1168699 1188777 1208175 1227247 1246076 1264374 1282075 1299498
53479 1299498 1316769 1333533 1349583 1365379 1381619 1398513 1415682 1432491 1448277 1462540 1475200
53468 1475200 1486513 1496586 1505214 1512292 1517975 1522180 1524221 1523254 1518881 1511205 1500638 1487979 1474402
53455 1474402 1460886 1447671 1434430 1420791 1406500 1391248 1374737 1356922 1338021 1318287 1297925
53444 1297925 1277219 1256607 1236552 1217275 1198554 1179882 1160979 1142136 1123941 1106854 1091260
53433 1091260 1077693 1066566 1057685 1050428 1044384 1039413 1035210 1031424 1028341 1026809 1027286 1029426 1032911 1038105
$$ packed form
53512F60216J5124J6134J7066J8017J8671J8562J8036J8189J9444K0910K1564
53501H61933K1462K1260K1134K0827K0348J9939J9620J9330J9269J9651K0265
53490A085038K0752K1028K1095K0786K0078J9398J9072J8829J8298J7701J7423
53479A299498J7271J6764J6050J5796J6240J6894J7169J6809J5786J4263J2660
53468A475200J1313J0073Q628P078N683M205K041r67m373p676j0567j2659j3577
53455A474402j3516j3215j3241j3639j4291j5252j6511j7815j8901j9734k0362
53444A297925k0706k0612k0055j9277j8721j8672j8903j8843j8195j7087j5594
53433A091260j3567j1127q881p257o044m971m203l786l083j532M77K140L485N194
$$ plain form
53419 1038105 1045547 1055175 1066497 1079176 1093081 1108053 1123992 1140918 1158613 1176511 1194342 1212632
53407 1212632 1232169 1253141 1275165 1297993 1321792 1346904 1373648 1402284 1432862 1465211 1499326
53396 1499326 1535591 1574386 1615628 1658983 1704238 1751160 1799220 1847971 1897581 1948557 2000938
53385 2000938 2054146 2107621 2161228 2214947 2268478 2321258 2372648 2422043 2469048 2513742 2556706
53374 2556706 2598598 2639539 2678788 2715026 2747117 2774713 2798154 2817912 2834227 2847016 2855659
53363 2855659 2858898 2855475 2845061 2828153 2804985 2775150 2738644 2696658 2650755 2601780 2550242 2497378
53351 2497378 2444792 2393003 2341164 2288542 2235730 2184135 2134767 2087824 2042957 1999394 1956039
53340 1956039 1912042 1867411 1822838 1778910 1735782 1693650 1653153 1614972 1579098 1544877 1511901
$$ packed form
53419A038105P442R628J1322J2679J3905J4972J5939J6926J7695J7898J7831J8290
53407A212632J9537K0972K2024K2828K3799K5112K6744K8636L0578L2349L4115
53396A499326L6265L8795M1242M3355M5255M6922M8060M8751M9610N0976N2381
53385B000938N3208N3475N3607N3719N3531N2780N1390M9395M7005M4694M2964
53374B556706M1892M0941L9249L6238L2091K7596K3441J9758J6315J2789Q643
53363B855659L239l423j0414j6908k3168k9835l6506m1986m5903m8975n1538n2864
53351B497378n2586n1789n1839n2622n2812n1595m9368m6943m4867m3563m3355
53340A956039m3997m4631m4573m3928m3128m2132m0497l8181l5874l4221l2976
$$ plain form
53329 1511901 1480641 1452023 1426592 1404317 1385027 1368626 1354771 1342659 1331315 1320002 1308325
53318 1308325 1296156 1283577 1270820 1258236 1246279 1235336 1225266 1215263 1204659 1193922 1184482
53307 1184482 1177449 1172869 1170245 1169244 1169547 1170494 1171474 1172648 1174957 1179377 1186231 1195127 1205411 1216784
53293 1216784 1229495 1243829 1259509 1275959 1293154 1311762 1332339 1354768 1378625 1403583 1429211
53282 1429211 1454839 1479931 1504262 1527482 1549035 1568915 1587963 1606810 1624871 1640939 1654488
53271 1654488 1665695 1674399 1679898 1682003 1681662 1680074 1677414 1672695 1664736 1653093 1638083 1620166 1599532
53258 1599532 1576385 1551307 1525001 1497691 1469154 1439365 1408693 1377419 1345623 1313735 1282608
53247 1282608 1252709 1223716 1195320 1167921 1142056 1117521 1093567 1069630 1045436 1020810 995975
$$ packed form
53329A511901l1260k8618k5431k2275j9290j6401j3855j2112j1344j1313j1677
53318A308325j2169j2579j2757j2584j1957j0943j0070j0003j0604j0737r440
53307A184482p033m580k624j001L03R47R80J174K309M420O854Q896J0284J1373
53293A216784J2711J4334J5680J6450J7195J8608K0577K2429K3857K4958K5628
53282A429211K5628K5092K4331K3220K1553J9880J9048J8847J8061J6068J3549
53271A654488J1207Q704N499K105l41j588k660m719p959j1643j5010j7917k0634
53258A599532k3147k5078k6306k7310k8537k9789l0672l1274l1796l1888l1127
53247A282608k9899k8993k8396k7399k5865k4535k3954k3937k4194k4626k4835
$$ plain form
53236 995975 971687 948412 925631 902589 879500 857334 836657 817436 799814 784091 769836
53225 769836 755980 742252 729852 720146 713017 706936 700466 693228 685497 677267 668059 657647 646683
53212 646683 636180 626355 616443 605803 594764 584038 573862 564188 555269 547329 539972 532665 525602
53199 525602 519284 513423 507170 500468 494256 489064 484226 478881 473076 467388 461979 456507 450609 444049
53185 444049 436718 428917 421456 415136 410241 406632 404026 401910 399545 396487 393004 389709 386861 384220
53171 384220 381553 379097 377514 377347 378370 379493 379533 378185 376103 374114 372610 371649 371195 371010 370610 369602
53155 369602 367992 366070 364175 362634 361685 361248 360922 360344 359454 358365 357168 356007 355134 354645 354233 353385
53139 353385 351929 350321 349322 349317 349987 350760 351511 352517 353670 354232 353758 352968 353176 354911 357590 360487 363492
$$ packed form
53236I95975k4288k3275k2781k3042k3089k2166k0677j9221j7622j5723j4255
53225G69836j3856j3728j2400r706p129o081o470p238p731q230r208j0412j0964
53212F46683j0503r825r912j0640j1039j0726j0176r674q919p940p357p307p063
53199E25602o318n861o253o702o212n192m838n345n805n688n409n472n898o560
53185D44049p331p801p461o320m895l609k606k116k365l058l483l295k848k641
53171C84220k667k456j583j67J023J123M0j348k082j989j504r61m54j85m00j008
53155C69602j610j922j895j541r49m37l26n78q90j089j197j161q73m89m12q48
53139C53385j456j608r99nO70P73P51J006J153N62m74p90K08J735K679K897L005
$$ plain form
53122 363492 366772 370222 373633 377149 381195 385956 391100 396025 400324 403958 406992 409255 410473 410739
53108 410739 410476 409796 408255 405571 402170 398569 394562 389685 384315 379535 375899 373094 370932 369827 369787
53093 369787 369625 368009 365124 362586 361646 361935 362194 361833 361333 361188 360997 359986 358154 356355 355208 354463
53077 354463 353729 353233 353369 353866 354008 353501 352630 351747 351111 351058 351671 352351 352348 351670 350904 350162 348888 346821 344457
53058 344457 342416 340954 340315 340836 342254 343475 343559 342679 341734 341326 341437 341838 342411 343175 344212 345407 346192
53041 346192 345892 344584 343295 343065 343973 345323 346497 347303 347706 347664 347302 346946 346915 347310 348028 348852 349480 349563
53023 349563 348890 347678 346591 346232 346615 347406 348650 350740 353529 356030 357458 358135 358892 359971 361140 362408
53007 362408 363848 364909 364776 363426 361665 360190 359227 358939 359319 359782 359715 359422 359648 360194 360048 359046 358260
$$ packed form
53122C63492L280L450L411L516M046M761N144M925M299L634L034K263J218K66
53108D10739k63o80j541k684l401l601m007m877n370m780l636k805k162j105m0
53093C69787j62j616k885k538r40K89K59l61n00j45j91j011j832j799j147p45
53077C54463p34m96J36M97J42n07q71q83o36n3O13O80lo78p66p42j274k067k364
53058C44457k041j462o39N21J418J221Q4q80r45m08J11M01N73P64J037J195P85
53041C46192l00j308j289k30R08J350J174Q06M03m2l62l56l1L95P18Q24O28Q3
53023C49563o73j212j087l59L83P91J244K090K789K501J428O77P57J079J169J268
53007C62408J440J061j33j350j761j475r63k88L80M63o7k93K26N46j46j002p86
$$ plain form
52990 358260 358354 358649 358397 358009 358334 359497 361154 363222 365610 367822 369509 370947 372359 373318 373449 373216
52974 373216 373297 373665 373990 374557 375968 378148 380350 382012 383105 383870 384675 385877 387331 388376 388732 388966
52958 388966 389469 389518 388176 385779 383600 382140 380697 378664 376414 374657 373523 372603 371468 369903 367957
52943 367957 365933 364198 362947 362210 361949 361978 362002 361972 362126 362376 362010 360468 358227 356471 355952 356487 357332 357749
52925 357749 357415 356647 356049 355689 354951 353573 352371 352369 353542 355002 356199 357288 358486 359729 360962 362210
52909 362210 363374 364326 365088 365522 365169 363949 362764 362663 363516 364170 363886 362935 361828 360806 360217 360586 361862
52892 361862 363168 363691 363445 362834 361906 360469 358735 357439 357261 358237 359698 360735 360867 360387 360093 360718 362565
52875 362565 365425 368667 371583 373816 375439 376635 377625 378839 380649 382730 384242 384947 385583 386775 388208
$$ packed form
52990C58260R4K95k52l88L25J163J657K068K388K212J687J438J412R59J31k33
52974C73216Q1L68L25N67J411K180K202J662J093P65Q05J202J454J045L56K34
52958C88966N03M9j342k397k179j460j443k033k250j757j134r20j135j565j946
52943C67957k024j735j251p37k61K9K4l0J54K50l66j542k241j756n19N35Q45M17
52925C57749l34p68n98l60p38j378j202kJ173J460J197J089J198J243J233J248
52909C62210J164R52P62M34l53j220j185j01Q53O54k84r51j107j022n89L69J276
52892C61862J306N23k46o11r28j437j734j296j78R76J461J037J32m80k94O25J847
52875C62565K860L242K916K233J623J196R90J214J810K081J512P05O36J192J433
$$ plain form
52860 388208 389391 390549 392022 393308 393634 393074 392185 390819 388308 384691 380762 376894 372785 368454 364535
52845 364535 361346 358457 355467 352556 350110 348380 347549 347414 346999 345326 342743 340652 339800 339688 339879 340816
52829 340816 342881 345543 348043 350158 351671 351901 350552 348501 346952 346143 345559 345060 345090 345952 347556 349795
52813 349795 352685 356131 359906 363777 367421 370359 372158 372522 371133 367813 363107 358261 354246 351100
52799 351100 348473 346378 345019 344312 344049 344209 344633 344723 343987 342673 341372 340214 338935 337554 336467 335919
52783 335919 335835 336158 336951 338123 339322 340178 340506 340353 340029 339916 340107 340338 340422 340528 340851 341349 341976 342871 344018
52764 344018 345019 345609 346117 347023 348216 349066 349103 348291 346870 345313 344284 344220 344978 346126 347438 348812 350012
52747 350012 350904 351778 353023 354569 356011 357077 357686 357791 357705 358248 359939 362096 363465 363776 364027 365074
$$ packed form
52860C88208J183J158J473J286L26n60q89j366k511l617l929l868m109m331l919
52845C64535l189k889k990k911k446j730q31j35m15j673k583k091q52j12J91R37
52829C40816K065K662K500K115J513K30j349k051j549q09n84m99L0Q62J604K239
52813C49795K890L446L775L871L644K938J799L64j389l320m706m846m015l146
52799C51100k627k095j359p07k63J60M24R0p36j314j301j158j279j381j087n48
52783C35919q4L23P93J172J199Q56L28j53l24j13J91K31Q4J06L23M98O27Q95J147
52764C44018J001N90N08R06J193Q50L7q12j421j557j029o4P58J148J312J374J200
52747C50012Q92Q74J245J546J442J066O09J05q6N43J691K157J369L11K51J047
$$ plain form
52731 365074 366676 368214 369777 371937 374716 377239 378423 377850 376086 374209 372911 371959 370622 368543 365984
52716 365984 363335 360794 358551 356840 355604 354506 353482 352937 353169 353877 354480 354624 354192 353195 352012 351367
52700 351367 351608 352218 352508 352584 353078 354066 354931 355354 355786 356681 357844 358943 360176 361884 363777 365114 365573
52683 365573 365465 365080 364276 362846 360930 358964 357455 356874 357408 358665 359908 360774 361526 362513 363682 364829
52667 364829 365941 366968 367519 367277 366588 366200 366380 366702 366761 366756 367187 368247 369719 371355 373180 375394 378021
52650 378021 380614 382446 383119 382955 382648 382582 382638 382541 382123 381300 380108 378860 377978 377584 377446 377452 377905 379210 381428
52631 381428 384367 388032 392724 398523 404653 409521 411607 410525 407199 402995 398797 394887 391344 388185
52617 388185 385258 382403 379757 377682 376413 376022 376576 377977 379640 380744 380974 380772 380743 381026 381309 381215 380586
$$ packed form
52731C65074J602J538J563K160K779K523J184n73j764j877j298r52j337k079k559
52716C65984k649k541k243j711j236j098j024n45K32P08O03J44m32r97j183o45
52700C51367K41O10K90P6M94R88Q65M23M32Q95J163J099J233J708J893J337M59
52683C65573j08l85q04j430j916j966j509n81N34J257J243Q66P52R87J169J147
52667C64829J112J027N51k42o89l88J80L22N9nM31J060J472J636J825K214K627
52650C78021K593J832O73j64l07o6N6r7m18q23j192j248q82l94j38OM53J305K218
52631C81428K939L665M692N799O130M868K086j082l326m204m198l910l543l159
52617C88185k927k855k646k075j269l91N54J401J663J104K30k02k9K83K83r4o29
$$ plain form
52600 380586 379593 378669 378137 377873 377476 376807 376147 375860 376207 377405 379520 382144 384577 386430 387875 389224
52584 389224 390585 392014 393629 395366 396875 397858 398303 398297 397947 397620 397900 398944 400035 400075 398469 395522 392157
52567 392157 389436 388046 387951 388501 388938 388778 387823 386196 384433 383226 382869 383064 383303 383231 382672 381671 380544
52550 380544 379539 378428 376939 375593 375483 376891 378712 379768 380210 381052 382628 384177 384952 385135 385511 386520
52534 386520 387844 388888 389566 390442 391948 393680 394941 395831 397105 398869 400214 400540 400513 401111 402300 403362
52518 403362 404093 404899 406008 407398 409301 411989 415138 418124 420915 423890 426771 428498 428351 426636 424106
52503 424106 421290 418473 415664 412404 408254 403724 400090 397993 396803 395742 394909 394668 394609 393911 392447
52488 392447 390834 389563 388749 388586 389317 390624 391704 392199 392551 393165 393741 393849 393734 393971 394569 395059 395478
$$ packed form
52600C80586r93r24n32k64l97o69o60k87L47J198K115K624K433J853J445J349
52584C89224J361J429J615J737J509R83M45ol50l27K80J044J091M0j606k947l365
52567C92157k721j390r5N50M37j60r55j627j763j207l57J95K39p2n59j001j127
52550C80544j005j111j489j346j10J408J821J056M42Q42J576J549P75J83L76J009
52534C86520J324J044O78Q76J506J732J261Q90J274J764J345L26k7N98J189J062
52518D03362P31Q06J109J390J903K688L149K986K791K975K881J727j47j715k530
52503D24106k816k817k809l260m150m530l634k097j190j061q33k41n9o98j464
52488C92447j613j271q14j63P31J307J080M95L52O14N76J08j15K37N98M90M19
$$ plain form
52471 395478 396626 399079 402439 405916 409274 412740 416275 419557 422601 425745 428862 431111 431764 430880 428834
52456 428834 425646 421281 416343 411799 407973 404284 400201 396040 392601 390313 389078 388751 389260 390127 390308
52441 390308 388982 386497 384136 382814 382313 381944 381550 381496 382000 383052 384755 387003 388865 389178 388079 387207
52425 387207 387824 389304 390120 389915 389757 390525 391863 392895 393347 393677 394394 395576 396942 398270 399782 402091
52409 402091 405728 410839 417391 425522 435531 447701 462163 478621 495849 511673 523867 531108
52397 531108 533054 529920 522405 511833 499840 487741 476276 465792 456385 448062 441029 435656 431887
52384 431887 429028 426517 424672 424130 424732 425578 426110 426552 427234 428110 429145 430768 433563 437709 442734 447632
52368 447632 451315 453269 453844 453673 452960 451635 449980 448486 447168 445692 444248 443658 444349 445778 447143
$$ packed form
52471C95478J148K453L360L477L358L466L535L282L044L144L117K249O53q84k046
52456D28834l188m365m938m544l826l689m083m161l439k288j235l27N09Q67J81
52441C90308j326k485k361j322n01l69l94n4N04J052J703K248J862L13j099q72
52425C87207O17J480Q16k05j58P68J338J032M52L30P17J182J366J328J512K309
52409D02091L637N111O552Q131J0009J2170J4462J6458J7228J5824J2194P241
52397E31108J946l134p515j0572j1993j2099j1465j0484r407q323p033n373l769
52384D31887k859k511j845n42O02Q46N32M42O82Q76J035J623K795M146N025M898
52368D47632L683J954N75j71p13j325j655j494j318j476j444n90O91J429J365
$$ plain form
52353 447143 448195 449059 449758 450385 451322 452808 454465 455663 456217 456439 456641 456967 457622 458871 460727 462881
52337 462881 465051 467334 470168 473927 478557 483628 488814 494288 500537 507816 515894 524334 532856 541461
52323 541461 550291 559343 568190 576133 582830 588752 594873 602028 610595 620432 630787 640692 650064 660220
52309 660220 672625 687234 702763 718579 735379 753745 772957 791975 810973 831001 852265
52298 852265 873489 893122 910636 926471 941118 954667 967212 979241 991171 1002470 1011799 1018483
52286 1018483 1023579 1028898 1035062 1041188 1046423 1050961 1055183 1058676 1060820 1061908 1062898 1064177 1065181 1065251 1064401
52271 1064401 1063162 1062040 1061217 1060564 1059874 1059152 1058626 1058412 1058371 1058458 1059016 1060452 1062802 1065925 1070033 1075674 1083162
52254 1083162 1092291 1102682 1114155 1126556 1139363 1151736 1163149 1173868 1184579 1195526 1206304
$$ packed form
52353D47143J052Q64O99O27R37J486J657J198N54K22K02L26O55J249J856K154
52337D62881K170K283K834L759M630N071N186N474O249P279Q078Q440Q522Q605
52323E41461Q830R052Q847P943O697N922O121P155Q567R837J0355R905R372J0156
52309F60220J2405J4609J5529J5816J6800J8366J9212J9018J8998K0028K1264
52298H52265K1224J9633J7514J5835J4647J3549J2545J2029J1930J1299R329O684
52286A018483N096N319O164O126N235M538M222L493K144J088R90J279J004P0q50
52271A064401j239j122q23o53o90p22n26k14m1Q7N58J436K350L123M108N641P488
52254A083162R129J0391J1473J2401J2807J2373J1413J0719J0711J0947J0778
$$ plain form
52243 1206304 1216578 1226526 1236210 1244946 1252014 1257803 1263423 1269182 1274245 1278010 1280922 1283536 1285591 1286662
52229 1286662 1287035 1287118 1286498 1284430 1280992 1276943 1272640 1267913 1262880 1258013 1253324 1248251 1242580 1236799 1231353
52214 1231353 1226162 1221163 1216722 1213156 1210311 1207982 1206341 1205567 1205390 1205441 1205822 1206916 1208784 1211179 1214115
52199 1214115 1218098 1223707 1231126 1240039 1249789 1259591 1268741 1276734 1283212 1287956 1290988 1292531 1292659 1291101
52185 1291101 1287656 1282861 1277983 1274139 1271445 1269152 1266543 1263606 1260849 1258631 1256744 1254610 1251735 1248136
52171 1248136 1244339 1240937 1237995 1234965 1231354 1227364 1223730 1220964 1219057 1217872 1217410 1217548 1217883 1218077 1218111
52156 1218111 1217989 1217502 1216666 1216057 1216177 1216633 1216609 1216214 1216752 1219275 1223375 1227790 1231839 1235693 1239443 1242583
52140 1242583 1244558 1245307 1245034 1243868 1242172 1240879 1240999 1242742 1245468 1248568 1252076 1256359 1261574 1267660 1274628
$$ packed form
52243A206304J0274R948R684Q736P068N789N620N759N063L765K912K614K055J071
52229A286662L73Q3o20k068l438m049m303m727n033m867m689n073n671n781n446
52214A231353n191m999m441l566k845k329j641p74j77N1L81J094J868K395K936
52199A214115L983N609P419Q913R750R802R150P993O478M744L032J543J28j558
52185A291101l445m795m878l844k694k293k609k937k757k218j887k134k875l599
52171A248136l797l402k942l030l611l990l634k766j907j185m62J38L35J94L4
52156A218111j22m87q36o09J20M56k4l95N38K523M100M415M049L854L750L140
52140A242583J975P49k73j166j696j293J20J743K726L100L508M283N215O086O968
$$ plain form
52125 1274628 1282595 1291643 1301739 1312636 1323676 1334006 1343259 1351840 1360288 1368597 1376525 1384332 1392665
52112 1392665 1401783 1411407 1421373 1431977 1443549 1456171 1469961 1485260 1502352 1521334 1542317 1565148
52100 1565148 1588651 1610651 1629322 1644394 1656772 1667245 1675906 1682582 1687389 1690889 1693952 1697301
52088 1697301 1700919 1704053 1706117 1707437 1708795 1710368 1711471 1711263 1709382 1705887 1700885 1694337 1686130 1676375
52074 1676375 1665679 1654996 1644960 1635488 1626224 1617241 1609056 1602148 1596702 1592802 1590568 1590148 1591749
$$ packed form
52125A274628P967R048J0096J0897J1040J0330R253Q581Q448Q309P928P807Q333
52112A392665R118R624R966J0604J1572J2622J3790J5299J7092J8982K0983K2831
52100A565148K3503K2000J8671J5072J2378J0473Q661O676M807L500L063L349
52088A697301L618L134K064J320J358J573J103k08j881l495n002o548q207r755
52074A676375j0696j0683j0036r472r264q983q185o908n446l900k234m20J601
$$ [...]
##END NTUPLES=NMR SPECTRUM
##END=
