##TITLE=AC1728_SEN00001_9274204_Mng1pFnGc1
##JCAMPDX= 6.0         $$ Bruker NMR JCAMP-DX V2.0
##DATA TYPE= NMR SPECTRUM
##DATA CLASS= NTUPLES
##ORIGIN= BRUKER
##OWNER= Administrator
$$ 1.72 TOPSPIN		Version 2.1
$$ 2015-07-14 17:57:31.838 -0700  Administrator@X
$$ Compression mode = diff/dup
##.OBSERVE FREQUENCY= 400.02188249412
##.OBSERVE NUCLEUS= ^1H
##.ACQUISITION MODE= SIMULTANEOUS (DQD)
##.ACQUISITION SCHEME= undefined
##.AVERAGES= 64
##.DIGITISER RES= 22
##SPECTROMETER/DATA SYSTEM= spect
##.PULSE SEQUENCE= noesygpps1d.comp
##.SOLVENT NAME= COFFEE_meoh
##.SHIFT REFERENCE= INTERNAL, COFFEE_meoh, 1, 14.96083
##AUDIT TRAIL= $$ (NUMBER, WHEN, WHO, WHERE, PROCESS, VERSION, WHAT)
$$ ##TITLE= Audit trail, TOPSPIN		Version 2.1
$$ ##JCAMPDX= 5.01
$$ ##ORIGIN= Bruker BioSpin GmbH
$$ ##OWNER= Administrator
$$ $$ E:\/data/COFFEE/nmr/AC1728_SEN00001_9274204_Mng1pFnGc1/12/pdata/1/auditp.txt
$$ ##AUDIT TRAIL=  $$ (NUMBER, WHEN, WHO, WHERE, PROCESS, VERSION, WHAT)
(   1,<2015-07-14 17:57:26.744 -0700>,<Administrator>,<X>,<go>,<TOPSPIN 2.1>,
      <created by zg
	started at 2015-07-14 17:45:56.963 -0700,
	POWCHK enabled, PULCHK disabled,
       configuration hash MD5:
       21 0F 79 D6 B3 7B B4 F6 88 20 88 DB 03 48 BD 9F
       data hash MD5: 64K
       3F 7C CE FE 1C E8 0E 16 FB 93 00 00 1B 51 C4 8D>)
(   2,<2015-07-14 17:57:29.994 -0700>,<Administrator>,<X>,<proc1d>,<TOPSPIN 2.1>,
      <Start of raw data processing
       efp LB = 0.3 FT_mod = 6 PKNL = 1 PHC0 = 0 PHC1 = 0 SI = 128K 
       data hash MD5: 128K
       BF 10 0C 36 3D 23 31 27 84 57 2A 4D 3F 04 CF 98>)
(   3,<2015-07-14 17:57:30.885 -0700>,<Administrator>,<X>,<proc1d>,<TOPSPIN 2.1>,
      <pk PHC0 = -88.54431 PHC1 = 0 
       data hash MD5: 128K
       34 A0 49 9B B6 E2 76 53 04 AD 14 8A FA 65 C8 0E>)
(   4,<2015-07-14 17:57:31.291 -0700>,<Administrator>,<X>,<proc1d>,<TOPSPIN 2.1>,
      <abs ABSG = 1 
       data hash MD5: 128K
       06 37 DF BE 3E FC 3D 83 D2 61 FD BC 6B CA 70 05>)
(   5,<2015-07-14 17:57:31.385 -0700>,<Administrator>,<X>,<proc1d>,<TOPSPIN 2.1>,
      <abs ABSG = 2 
       data hash MD5: 128K
       D9 0E 7A 18 32 E1 1E 7A 9E 4E A4 9C 14 E8 5E 2E>)
(   6,<2015-07-14 17:57:31.463 -0700>,<Administrator>,<X>,<proc1d>,<TOPSPIN 2.1>,
      <abs ABSG = 3 
       data hash MD5: 128K
       07 57 D6 91 B9 3E 41 79 96 F5 74 DC 59 D0 5B B2>)
(   7,<2015-07-14 17:57:31.572 -0700>,<Administrator>,<X>,<proc1d>,<TOPSPIN 2.1>,
      <abs ABSG = 4 
       data hash MD5: 128K
       C4 20 CB 00 06 BB C5 51 0F 41 1D 9D 77 30 9A A0>)
(   8,<2015-07-14 17:57:31.682 -0700>,<Administrator>,<X>,<proc1d>,<TOPSPIN 2.1>,
      <abs ABSG = 5 
       data hash MD5: 128K
       31 30 33 84 3C 7F C2 B8 B8 89 11 07 0D 72 7A 00>)
$$ ##END=
$$ 
$$ $$ hash MD5
$$ $$ D9 09 22 2A 9E 6D F2 BE 79 00 DD F8 11 03 05 4B
##$RELAX= 
##$RELAX= 
##$RELAX= 
##$RELAX= 
##$RELAX= 
##$RELAX= 
##$RELAX= 
##$RELAX= 
$$ Bruker specific parameters
$$ --------------------------
##$DU= <E:\>
##$EXPNO= 12
$$ [...]
##$TP07= 0
##$TPNAME0= <>
##$TPNAME1= <>
##$TPNAME2= <>
##$TPNAME3= <>
##$TPNAME4= <>
##$TPNAME5= <>
##$TPNAME6= <>
##$TPNAME7= <>
##$TPOAL= (0..7)
0.5 0.5 0.5 0.5 0.5 0.5 0.5 0.5
##$TPOFFS= (0..7)
0 0 0 0 0 0 0 0
##$TUNHIN= 0
##$TUNHOUT= 0
##$TUNXOUT= 0
##$USERA1= <user>
##$USERA2= <user>
##$USERA3= <user>
##$USERA4= <user>
##$USERA5= <user>
##$V9= 5
##$VALIST= <valist>
##$VCLIST= <CCCCCCCCCCCCCCC>
##$VD= 0
##$VDLIST= <DDDDDDDDDDDDDDD>
##$VPLIST= <PPPPPPPPPPPPPPP>
##$VTLIST= <TTTTTTTTTTTTTTT>
##$WBST= 2048
##$WBSW= 25
##$XGAIN= (0..3)
0 0 0 0
##$XL= 0
##$YL= 0
##$YMAX_a= 6569506
##$YMIN_a= -12184580
##$ZGOPTNS= <>
##$ZL1= 120
##$ZL2= 120
##$ZL3= 120
##$ZL4= 120
##$ABSF1= 14.96083
##$ABSF2= -5.597352
##$ABSG= 5
##$ABSL= 3
##$ALPHA= 0
##$AQORDER= 0
##$ASSFAC= 0
##$ASSFACI= 0
##$ASSFACX= 0
##$ASSWID= 0
##$AUNMP= <proc_prof1d_extract.lims>
##$AXLEFT= 0
##$AXNAME= <>
##$AXNUC= <1H>
##$AXRIGHT= 0
##$AXTYPE= 0
##$AXUNIT= <>
##$AZFE= 0.1
##$AZFW= 0.1
##$BCFW= 0
##$BC_mod= 0
##$BYTORDP= 0
##$COROFFS= 0
##$CY= 15
##$DATMOD= 1
##$DC= 0
##$DFILT= <>
##$DTYPP= 0
##$F1P= 0
##$F2P= 0
##$FCOR= 0.5
##$FTSIZE= 131072
##$FT_mod= 6
##$GAMMA= 0
##$GB= 0
##$INTBC= 1
##$INTSCL= 1
##$ISEN= 128
##$LB= 0.3
##$LEV0= 0
##$LPBIN= 0
##$MAXI= 10000
##$MC2= 0
##$MEAN= 0
##$ME_mod= 0
##$MI= 0
##$NCOEF= 0
##$NC_proc= -2
##$NLEV= 6
##$NOISF1= 0
##$NOISF2= 0
##$NSP= 0
##$NTH_PI= 0
##$NZP= 0
##$OFFSET= 14.96083
##$PC= 1
##$PHC0= -88.54431
##$PHC1= 0
##$PH_mod= 1
##$PKNL= yes
##$PPARMOD= 0
##$PPDIAG= 0
##$PPIPTYP= 0
##$PPMPNUM= 2147483647
##$PPRESOL= 1
##$PSCAL= 4
##$PSIGN= 0
##$PYNMP= <proc.py>
##$REVERSE= no
##$SF= 400.020009702907
##$SI= 131072
##$SIGF1= 0
##$SIGF2= 0
##$SINO= 400
##$SIOLD= 131072
##$SPECTYP= <>
##$SREGLST= <1H.CDCl3>
##$SSB= 0
##$STSI= 131072
##$STSR= 0
##$SW_p= 8223.68421052631
##$SYMM= 0
##$S_DEV= 0
##$TDeff= 65536
##$TDoff= 0
##$TI= <>
##$TILT= no
##$TM1= 0
##$TM2= 0
##$TOPLEV= 0
##$USERP1= <user>
##$USERP2= <user>
##$USERP3= <user>
##$USERP4= <user>
##$USERP5= <user>
##$WDW= 1
##$XDIM= 131072
##$YMAX_p= 398083871
##$YMIN_p= -12864
##$CURPLOT= <Network HP LaserJet P1505>
##$CURPRIN= <$Network HP LaserJet P1505>
##$DFORMAT= <normdp>
##$LAYOUT= <+/1D_H.xwp>
##$LFORMAT= <normlp>
##$PFORMAT= <normpl>
##$SURQMSG= 1
$$ End of Bruker specific parameters
$$ ---------------------------------
##NTUPLES= NMR SPECTRUM
##VAR_NAME=  FREQUENCY,     SPECTRUM/REAL,   SPECTRUM/IMAG
##SYMBOL=    X,             R,               I
##VAR_TYPE=  INDEPENDENT,   DEPENDENT,       DEPENDENT
##VAR_FORM=  AFFN,          ASDF,            ASDF
##VAR_DIM=   131072,        131072,          131072
##UNITS=     HZ,            ARBITRARY UNITS, ARBITRARY UNITS
##FACTOR=    0.0627417313425164, 1,          1
##FIRST=     8223.62146879497, 1614,         -57144
##LAST=      0,             2671,            -57197
##MIN=       0,             -12864,          0
##MAX=       8223.62146879497, 398083871,    0
$$ Real data points
##PAGE= N=1
##DATA TABLE= (X++(R..R)), XYDATA
$$ [...]
63939B697993K43696K56740K68115K75486K77002K72251K61654K45303K22818
63930E021058J94318J60862J23715Q3699M1740n95m1918q2038j21335j59138j93433
63919E026935k22132k43989k58601k66405k68790k67192k61817k52097k38550
63910B747362k23068k06942j89795j71236j52517j35426j20257j06125r2892q1404
63900A267700p1860o3315n5079m7606m1529l6675l2609k9447k7397k5990k4513
63889H11680k2973k2001k1744k1520k0666j9240j7690j6123j4338j2306j0282
63878F12797q409o540m558k568n80J681M341O940Q872J0193J1521J3073J4348
63865F61111J4970J5272J5630J5639J4697J3137J2043J1857J1784J0829Q920O667
$$ y = [2697993, 2941689, 3198429, 3466544, 3742030, 4019032, 4291283, 4552937, 4798240, 5021058, 5215376, 5376238, 5499953, 5583652, 5625392, 5624797, 5582879, 5500841, 5379506, 5220368, 5026935, 4804803, 4560814, 4302213, 4035808, 3767018, 3499826, 3238009, 2985912, 2747362, 2524294, 2317352, 2127557, 1956321, 1803804, 1668378, 1548121, 1441996, 1349104, 1267700, 1195840, 1132525, 1077446, 1029840, 988311, 951636, 919027, 889580, 862183, 836193, 811680, 788707, 766706, 744962, 723442, 702776, 683536, 665846, 649723, 635385, 623079, 612797, 604388, 597848, 593290, 590722, 590142, 591823, 596164, 603104, 611976, 622169, 633690, 646763, 661111, 676081, 691353, 706983, 722622, 737319, 750456, 762499, 774356, 786140, 796969, 805889, 812556]
63853H12556M415K036n08k919m962o782q654j0600j2403j3945j5343j6766j8257
63840G07868j9754k1130k2147k2559k2400k2017k1650k1161k0462j9907j9829
63829D74852j9744j8740j6742j4801j3750j3214j2430j1422j0662j0009q907p498
63817C16933o641o643o778o290n289m373l857l618l268k345p81O50J003M38J29
63802B69270N95R17J48j250k207k626l151l796l894l395l056l213l275k805k268
63787B35994k269k649k845k628k104j383p09n09q55j173r32l52j6m2j26j33j30
63770B17139J8M89R98R47K33n33p22l11K78N76K60o55j612j854j185k01M35O88
63752B14988Q85J049Q41J75m87n74K9R08J535J698J573J454J406J259R10N50N14
$$ y = [812556, 816971, 819007, 818499, 815580, 810618, 803836, 795182, 784582, 772179, 758234, 742891, 726125, 707868, 688114, 666984, 644837, 622278, 599878, 577861, 556211, 535050, 514588, 494681, 474852, 455108, 436368, 419626, 404825, 391075, 377861, 365431, 354009, 343347, 333338, 324431, 316933, 310292, 303649, 296871, 290581, 285292, 280919, 277062, 273444, 270176, 267831, 267050, 267700, 268703, 269141, 269270, 269865, 270782, 270930, 269680, 267473, 264847, 261696, 257900, 254006, 250611, 247555, 244342, 241067, 238262, 235994, 233725, 231076, 228231, 225603, 223499, 222116, 221407, 220898, 220043, 218870, 217938, 217586, 217570, 217528, 217402, 217269, 217139, 217157, 217646, 218644, 219591, 219824, 219291, 218569, 218258, 218536, 219112, 219372, 218717, 217105, 215251, 214066, 213865, 214300, 214988, 215873, 216922, 217763, 217938, 217451, 216877, 216906, 217814, 219349, 221047, 222620, 224074, 225480, 226739, 227649, 228199, 228713]
63735B28713R50J701K449K933L086L034K911K693K303J916J918K452L107L341
63721B63507L101K805K740K869L152L703M397M690M147K938J562K60r01j627j633
63706B95710j256j292j977k600k452j738j179j001p28Q1J286K281K460J689O37
63691B89921M37J546L111L846L454K707K212J793J193P11O75Q65Q50N55J21m93
63675C13504j227j597j136l4J092J803J922J331L07k57L52J628K267J669L80r41
63659C21063k199l289l697l299k902l294m128m403l857l164k890k904k877k747
63645B75413k469j832q50N5N71R33J474J941J780J055O16J124K223L041L413M056
63629B92544N457P005P635P174O506O398O663O730O637O947P924R207J0376J1447
$$ y = [228713, 229663, 231364, 233813, 236746, 239832, 242866, 245777, 248470, 250773, 252689, 254607, 257059, 260166, 263507, 266608, 269413, 272153, 275022, 278174, 281877, 286274, 290964, 295111, 298049, 299611, 299871, 298970, 297343, 295710, 294454, 293162, 291185, 288585, 286133, 284395, 283216, 282215, 281487, 281568, 282854, 285135, 287595, 289284, 289921, 290358, 291904, 295015, 298861, 302315, 305022, 307234, 309027, 310220, 310931, 311606, 312471, 313321, 313876, 313997, 313504, 312277, 310680, 309544, 309510, 310602, 312405, 314327, 315658, 315965, 315708, 316060, 317688, 319955, 321624, 322004, 321063, 318864, 315575, 311878, 308579, 305677, 302383, 298255, 293852, 289995, 286831, 283941, 281037, 278160, 275413, 272944, 271112, 270262, 270317, 270888, 271821, 273295, 275236, 277016, 278071, 278687, 279811, 282034, 285075, 288488, 292544, 298001, 305006, 312641, 319815, 326321, 332719, 339382, 346112, 352749, 359696, 367620, 376827, 387203, 398650]
63615C98650J2740J4442J6427J8314J9679K0470K1254K2802K5256K7890K9850
63604F27774L0906L1300L1085K9862K7117K2602J6490R552L145j446l912n066
63592H19409n881o653p171p464p938q937j0558j2929j6213k0048k3322k4967k5017
63579F42311k4547k4428k4298k2972j9876j5838j2351j0108q590o993n230l680
63567D63400k325o93J282K947L799M214M903N906O661O923P138P739Q607R426
63553E29927J0293J1635J3648J6050J8430K0715K3225K6337L0135L4348L8385
63542G73128M1249M1505L7972L0759K1456J1976L435l676q761j1327j1767j1150
63530I14799j0104q597o948o261p352r924j3310j7485k2579k7823l1868l4045
$$ y = [398650, 411390, 425832, 442259, 460573, 480252, 500722, 521976, 544778, 570034, 597924, 627774, 658680, 689980, 721065, 750927, 778044, 800646, 817136, 826688, 829833, 828387, 824475, 819409, 813528, 806875, 799704, 792240, 784302, 775365, 764807, 751878, 735665, 715617, 692295, 667328, 642311, 617764, 593336, 569038, 546066, 526190, 510352, 498001, 487893, 479303, 472310, 467080, 463400, 461075, 460382, 461664, 464611, 468410, 472624, 477527, 483433, 490094, 497017, 504155, 511894, 520501, 529927, 540220, 551855, 565503, 581553, 599983, 620698, 643923, 670260, 700395, 734743, 773128, 814377, 855882, 893854, 924613, 946069, 958045, 961480, 957804, 949043, 937716, 925949, 914799, 904695, 896098, 889150, 882889, 875537, 865613, 852303, 834818, 812239, 784416, 752548, 718503]
63518G18503l4655l4096l2545l0507k8755k7317k5263k2046j8499j5881j4325
63507D34614j2965j1375j0089r583r422q823p650o467n744n416n118m603l835
63494C33524k937k124j558j178p51j53M98J015J322J393J133N39m3l7Q69K324
63478C33836L529L846L348K755K753L261L504K891J645M08o10j649k680l255l219
63463C50363l096l400l885l936l442k840k394j904j126r4R65J726J835J338R94
63448C31104J631L051M161M422M544N353O523P123P079P304Q449J0250J2220J4321
63434D27535J6654J9087K1547K4134K6474K7315K5537K1504J6946J3374J1034
63423F51141R457Q440Q257R203J1370J4760J9266K4475K9633L3893L6668L7892
$$ y = [718503, 683848, 649752, 617207, 586700, 557945, 530628, 505365, 483319, 464820, 448939, 434614, 421649, 410274, 400185, 390602, 381180, 372357, 364707, 358240, 352496, 347080, 341962, 337359, 333524, 330587, 328463, 326905, 325727, 324976, 324823, 325321, 326336, 327658, 329051, 330184, 330723, 330680, 330643, 331512, 333836, 337365, 341211, 344559, 347314, 350067, 353328, 356832, 359723, 361368, 361776, 361166, 359517, 356837, 353582, 350363, 347267, 343867, 339982, 336046, 332604, 329764, 327370, 325466, 324340, 324246, 325211, 326937, 328772, 330110, 331104, 332735, 335786, 339947, 344369, 348913, 354266, 360789, 367912, 374991, 382295, 390744, 400994, 413214, 427535, 444189, 463276, 484823, 508957, 535431, 562746, 588283, 609787, 626733, 640107, 651141, 660598, 669038, 677295, 686498, 697868, 712628, 731894, 756369, 786002, 819895, 856563, 894455]
63411H94455L7891L6834L4210K9193K1709J2988M787j742o341r134j0393j0709
63399A033748j0830j1164j1753j2880j5169j8844k3251k7484l1180l4279l6234
63388H00680l6233l4334l1848l0137k9235k7990k5494k2023j8580j5785j3446
63377E15575j1056q464n946l802k040m12J396L558N937Q017R318R992J0865J2569
63363E45507J4807J6756J8215J9841K2111K4545K6415K7832K9600L2021L4491
63352H12141L6288L7135L6730L4409K9881K3857J7397J0850M120k283p295j0430
63340A022800j2124j2789j2393j1334j0898j2107j4672j7725k1080k4943k8822
63329H43913l1725l3389l4298l4384l2814k9438k5538k2437j9881j6622j2271
$$ y = [894455, 932346, 969180, 1003390, 1032583, 1054292, 1067280, 1072067, 1070325, 1063984, 1054850, 1044457, 1033748, 1022918, 1011754, 1000001, 987121, 971952, 953108, 929857, 902373, 871193, 836914, 800680, 764447, 730113, 698265, 668128, 638893, 610903, 585409, 563386, 544806, 529021, 515575, 504519, 496055, 490109, 486307, 484267, 483855, 485251, 488809, 494746, 502763, 512081, 522073, 532938, 545507, 560314, 577070, 595285, 615126, 637237, 661782, 688197, 716029, 745629, 777650, 812141, 848429, 885564, 922294, 956703, 986584, 1010441, 1027838, 1038688, 1042808, 1040525, 1033230, 1022800, 1010676, 997887, 985494, 974160, 963262, 951155, 936483, 918758, 897678, 872735, 843913, 812188, 778799, 744501, 710117, 677303, 647865, 622327, 599890, 580009, 563387, 551116]
63318E51116p888m837l672m228o233r362j2902j5784j7263j7458j6997j6112j4439
63305D03941j1920r443p986p344o406m689k886j767j233q53o46q43j296j705k130
63290C42794k765l422l698l447k797j911j110q56j294j968k393k554k505j920
63276C10154o16P65J326J027O17O12Q90J220J563J810J845J796J810J632R82K26
63260C27659J4L35P02J193K364M008M996M776M187M158M500M596M631N152N939
63245C79210O225N969N963O650P590Q298Q986J0158J1872J3687J5136J6054J6618
63232E12416J7270J8455K0238K2118K3329K3417K2609K1649K1136K0964K0566
63221G44167J9691J8745J8319J8610J9432K0526K1595K2183K1899K0731J8900
$$ y = [551116, 543228, 538391, 534719, 530491, 524258, 514896, 501994, 486210, 468947, 451489, 434492, 418380, 403941, 392021, 382578, 374592, 367248, 360842, 356153, 353267, 351500, 350267, 349414, 348768, 347925, 346629, 344924, 342794, 340029, 336607, 332909, 329462, 326665, 324754, 323644, 322788, 321494, 319526, 317133, 314579, 312074, 310154, 309538, 310303, 311629, 312656, 313273, 313885, 314775, 315995, 317558, 319368, 321213, 323009, 324819, 326451, 327433, 327659, 327673, 328008, 328710, 329903, 332267, 336275, 341271, 346047, 350234, 354392, 358892, 363488, 368119, 373271, 379210, 385435, 391404, 397367, 404017, 411607, 419905, 428891, 439049, 450921, 464608, 479744, 495798, 512416, 529686, 548141, 568379, 590497, 613826, 637243, 659852, 681501, 702637, 723601, 744167, 763858, 782603, 800922, 819532, 838964, 859490, 881085, 903268, 925167, 945898, 964798]
63210I64798J6415J3014Q597L570j407n947j0172j4344j8247k1170k2588k2728
63198H89791k2225k1270j9575j7081j4205j1206p856m053l24K804N550Q490J1628
63185H00468J4501J7059J9846K3129K6452K9211L1293L2894L4079L4754L4853
63174A098539L4357L3317L1951L0512K8972K7097K4964K2978K1082J8364J3917
63163A386050P881J148n815j3228k0976k8076l3636l7966m2116m6339m9603n0825
63151A066499n0172m8830m7628m6243m3734l9711l4851l0356k6902k4207k1677
63140F52188j9228j7166j5390j3316j0841q802p919p683o950n481m083l238k402
63127E29689j031N08J569K220K924L610L835L699L867M571N247N340M969M572
$$ y = [964798, 981213, 994227, 1002824, 1006394, 1004987, 999040, 988868, 974524, 956277, 935107, 912519, 889791, 867566, 846296, 826721, 809640, 795435, 784229, 776373, 772320, 771996, 774800, 780350, 788840, 800468, 814969, 832028, 851874, 875003, 901455, 930666, 961959, 994853, 1028932, 1063686, 1098539, 1132896, 1166213, 1198164, 1228676, 1257648, 1284745, 1309709, 1332687, 1353769, 1372133, 1386050, 1393931, 1395079, 1389264, 1376036, 1355060, 1326984, 1293348, 1255382, 1213266, 1166927, 1117324, 1066499, 1016327, 967497, 919869, 873626, 829892, 790181, 755330, 724974, 698072, 673865, 652188, 632960, 615794, 600404, 587088, 576247, 567445, 559526, 551843, 544893, 539412, 535329, 532091, 529689, 528658, 529166, 530735, 532955, 535879, 539489, 543324, 547023, 550890, 555461, 560708, 566048, 571017, 575589]
63113E75589M299M045L722L277K677K080J766J633J185L19k73M1P76Q91K31k80
63097F01978j09O0m98j261j174l13J66k57p27m03K18P0r08j661j379k33J137K313
63079E97019L128L560L728L782L685L460L547M464O043P477Q313Q897R676J0512
63065F77291J1062J1438J2065J3133J4527J6092J7686J9225K1001K3590K7063
63054H64173L0607L3413L5707L8306M1357M4230M6553M8619N0580N1993N2566
63043A338104N2686N2817N2772N2135N1024M9980M9285M8914M8970M9444M9722
63032A895853M8930M6928M4308M1198L6730L0158K1928J3061L809o266j7104k7766
63020B131767l7332m5480n1990n6370n8462n8781n7785n5193n0598m4358l7295
$$ y = [575589, 579888, 583933, 587655, 590932, 593609, 595689, 597455, 599088, 600273, 600592, 600319, 600360, 601136, 602027, 602258, 601978, 601869, 601929, 601431, 600170, 598996, 598683, 598849, 598592, 597865, 597462, 597680, 597750, 596842, 595181, 593802, 593569, 594706, 597019, 600147, 603707, 607435, 611217, 614902, 618362, 621909, 626373, 632416, 639893, 648206, 657103, 666779, 677291, 688353, 699791, 711856, 724989, 739516, 755608, 773294, 792519, 813520, 837110, 864173, 894780, 928193, 963900, 1002206, 1043563, 1087793, 1134346, 1182965, 1233545, 1285538, 1338104, 1390790, 1443607, 1496379, 1548514, 1599538, 1649518, 1698803, 1747717, 1796687, 1846131, 1895853, 1944783, 1991711, 2036019, 2077217, 2113947, 2144105, 2166033, 2179094, 2182903, 2176637, 2159533, 2131767, 2094435, 2048955, 1996965, 1940595, 1882133, 1823352, 1765567, 1710374, 1659776, 1615418, 1578123]
63009A578123k9729k1495j2767m145M112J2314K0642K8730L6080M2449M7734N1958
62997A754006N5495N8784O1639O3297O3412O2531O1430O0400N9394N8261N6590
62986B415239N3802M9870M5375M0485L4318K5898J5277L194r967k4164l8931n3309
62974B557087o6462p7872q7096r3897r8535j01386j02332j01000r7524r2576q6776
62963A551631q0571p4446o8693o3037n7148n1417m6575m2601l8835l5225l2568
62952I60515l1204l0290k8887k7080k5479k4141k2699k1212k0155j9633j9170
62941F90565j8263j6830j5076j3314j1904j1055j0582j0001q987p681o491n684
62929E54697n223m941m762m582m053k795j017L56N57k40j254k024k567k854k757
$$ y = [1578123, 1548394, 1526899, 1514132, 1509987, 1514099, 1526413, 1547055, 1575785, 1611865, 1654314, 1702048, 1754006, 1809501, 1868285, 1929924, 1993221, 2056633, 2119164, 2180594, 2240994, 2300388, 2358649, 2415239, 2469041, 2518911, 2564286, 2604771, 2639089, 2664987, 2680264, 2683458, 2673491, 2649327, 2610396, 2557087, 2490625, 2412753, 2325657, 2231760, 2133225, 2031839, 1929507, 1828507, 1730983, 1638407, 1551631, 1471060, 1396614, 1327921, 1264884, 1207736, 1156319, 1109744, 1067143, 1028308, 993083, 960515, 929311, 899021, 870134, 843054, 817575, 793434, 770735, 749523, 729368, 709735, 690565, 672302, 655472, 640396, 627082, 615178, 604123, 593541, 583540, 574553, 566872, 560381, 554697, 549474, 544533, 539771, 535189, 531136, 528341, 527324, 527680, 528237, 527997, 526743, 524719, 522152, 519298, 516541]
62914E16541k549k780l490m045m001l628l393l329l258l197l224l297l420l645
62900D69285l710l161k099j313j228j301q48r3L12K68J37m4m12o12j63N49N28
62883D56095m03j291j404j080q21l60O62J647J619O28k15k23J03j4n27q36p26
62866D52854n18m87o45j019j618k044j655m54N80N90l9j37P19J765K140J901J634
62849D53567J618J734J866J883J520O64k63o69m77j24ok26p76j502j926j646j001
62832D54236q53j494k215k200j530q34l28K64R68J375J338J392K043K985L420
62817D58567L109K652K729L315L886M035L704L057K472K459L190M151M671M789
62803E06786N126N889O559O778O979P640Q426Q710Q648R021J0130J1534J2888
$$ y = [516541, 513992, 511212, 507722, 503677, 499676, 496048, 492655, 489326, 486068, 482871, 479647, 476350, 472930, 469285, 465575, 462414, 460315, 459002, 457774, 456473, 455625, 455532, 455844, 456112, 456249, 456205, 455793, 455181, 455018, 455567, 456095, 455692, 454401, 452997, 451917, 451096, 450736, 451398, 453045, 454664, 455292, 455077, 454854, 454957, 454943, 454416, 453580, 452854, 452336, 451849, 451204, 450185, 448567, 446523, 444868, 444414, 444994, 445584, 445545, 445408, 446127, 447892, 450032, 451933, 453567, 455185, 456919, 458785, 460668, 462188, 462852, 462589, 461920, 461443, 461319, 461313, 461087, 460311, 458809, 456883, 455237, 454236, 453383, 451889, 449674, 447474, 445944, 445110, 444782, 445046, 446014, 447389, 448727, 450119, 452162, 455147, 458567, 461676, 464328, 467057, 470372, 474258, 478293, 481997, 485054, 487526, 489985, 493175, 497326, 501997, 506786, 511912, 517801, 524360, 531138, 538117, 545757, 554183, 562893, 571541, 580562, 590692, 602226, 615114]
62790F15114J4342J5984J7597J9322K1876K5621K9886L3766L7265M1043M5353
62779I17169M9877N4523N9648O5310P0852P5434P8685Q0584Q1078P9997P7087
62768A690244P1940O4173N3973M2218K9809J6957L377j0971k5470l9025n0540
62757A846685n9454o6034p0925p4352p5962p5730p4417p2737p0470o7091o2956
62746A076557n8992n5309n1084m6028m1005l6792l3139k9585k6439k4064k1857
62735F52263j8910j5383j2277j0040q304o874n937n198l889j969l84L25Q68K093
62721E66384L755N053N862O687P731Q843J0146J1971J4195J6290J8110K0087K2626
62708G17740K5789K9602L4126L9074M3887M8404N3168N8757O5136P1847P8600
$$ y = [615114, 629456, 645440, 663037, 682359, 704235, 729856, 759742, 793508, 830773, 871816, 917169, 967046, 1021569, 1081217, 1146527, 1217379, 1292813, 1371498, 1452082, 1533160, 1613157, 1690244, 1762184, 1826357, 1880330, 1922548, 1952357, 1969314, 1972691, 1961720, 1936250, 1897225, 1846685, 1787231, 1721197, 1650272, 1575920, 1499958, 1424228, 1349811, 1277074, 1206604, 1139513, 1076557, 1017565, 962256, 911172, 865144, 824139, 787347, 754208, 724623, 698184, 674120, 652263, 633353, 617970, 605693, 595653, 587349, 580475, 574538, 569340, 565451, 563482, 563098, 563423, 564291, 566384, 570139, 575192, 581054, 587741, 595472, 604315, 614461, 626432, 640627, 656917, 675027, 695114, 717740, 743529, 773131, 807257, 846331, 890218, 938622, 991790, 1050547, 1115683, 1187530, 1266130]
62697A266130Q5380R2153R8792J05179J11109J16052J19201J19866J17715J12629
62687B344206J04413R2799P7781N9879L9923J8634l443k5603m6856o6291q3366
62676B512076r7670j08639j15851j19584j20705j19930j17386j12974j06871r9613
62666A392853r1863q4248p7180p0674o4448n8321n2441m7014m1992l7251l2913
62655G34508k9264k6340k3868k1646j9743j8190j6734j5190j3894j3384j3492
62644E22763j3158j1487q960p053o567o710o128m555k975k254k163j996j569j184
62630D46004r50p23o67j185k136k705k465k045k183k458j813j85J201J429J031
62615D30150J142K077L276M176M564M424M096M314N427O731P213O935P015Q175
$$ y = [1266130, 1351510, 1443663, 1542455, 1647634, 1758743, 1874795, 1993996, 2113862, 2231577, 2344206, 2448619, 2541418, 2619199, 2679078, 2719001, 2737635, 2734192, 2708589, 2661733, 2595442, 2512076, 2414406, 2305767, 2189916, 2070332, 1949627, 1829697, 1712311, 1599337, 1492466, 1392853, 1300990, 1216742, 1139562, 1068888, 1004440, 946119, 893678, 846664, 804672, 767421, 734508, 705244, 678904, 655036, 633390, 613647, 595457, 578723, 563533, 549639, 536255, 522763, 509605, 498118, 489158, 482105, 475538, 468828, 462700, 458145, 455170, 452916, 450753, 448757, 447188, 446004, 445054, 444331, 443664, 442479, 440343, 437638, 435173, 433128, 430945, 428487, 426674, 426489, 427690, 429119, 430150, 431292, 433369, 436645, 440821, 445385, 449809, 453905, 458219, 463646, 470377, 477590, 484525, 491540, 499715]
62601D99715J0033J1929J3770J5695J7607J9475K1700K4665K8179L1615L4450
62590G28833L6453L7663L8361L8706L8314L6553L3370K9279K4381J8194J0796
62579A070903L355l199r295j5701k1976k7020l0720l3884l6627l8051l7753l6561
62567G83471l5352l3998l1969k9259k6219k3066k0073j7691j6002j4442j2548
62556E22852j0601r118q122p381o865o455n628m128k574j720j354o95K90Q49P14
62541D60064N39R00J604K315L079L832M048L531K991L130L570L484L120L773O095
62526E06075R134J1403J2404J2836J3749J5855J9269K3424K7417L0813L4041L7752
62514G54172M1997M6381N0767N5335N9944O3983O6928O8647O8979O7498O3926
$$ y = [499715, 509748, 521677, 535447, 551142, 568749, 588224, 609924, 634589, 662768, 694383, 728833, 765286, 802949, 841310, 880016, 918330, 954883, 988253, 1017532, 1041913, 1060107, 1070903, 1074258, 1071059, 1061764, 1046063, 1024087, 997067, 966347, 932463, 895836, 857785, 820032, 783471, 748119, 714121, 682152, 652893, 626674, 603608, 583535, 565844, 549842, 535400, 522852, 512251, 503133, 495011, 487630, 480765, 474310, 468682, 464554, 461980, 460260, 458906, 458211, 458501, 459350, 460064, 460603, 461503, 463107, 465422, 468501, 472333, 476381, 479912, 482903, 486033, 489603, 493087, 496207, 499980, 506075, 515209, 526612, 539016, 551852, 565601, 581456, 600725, 624149, 651566, 682379, 716420, 754172, 796169, 842550, 893317, 948652, 1008596, 1072579, 1139507, 1208154, 1277133, 1344631, 1408557]
62503A408557N8519N1696M3553L4027K3396J2268J127r806k0239k9499l6637m0829
62491A496133m1860m0306l7163l3115k8219k2300j5468q079m01P335J4673K1078
62479A312308K6443L1151L5465L8860M0101L8086L2731K5128J6737Q369j05r086
62467A596188j8623k8415l8094m7147n4806o0446o4109o6298o7237o6640o4299
62456A020074o0654n6513n2355m7958m2788l6750l0570k5280k1299j8103j4938
62445F12866j1695q875o845n419m129k604p26J303L013M079M655N057N159M496
62431F00335L025J341r3j565l524n777p680r038j0234j1460j2279j2240j1492
62418E19319j0491r321p820o278n453n629o082n837m811l803l468l712m072m228
$$ y = [1408557, 1467076, 1518772, 1562325, 1596352, 1619748, 1632016, 1633143, 1623337, 1603098, 1573599, 1536962, 1496133, 1454273, 1413967, 1376804, 1343689, 1315470, 1293170, 1277702, 1269623, 1269222, 1276557, 1291230, 1312308, 1338751, 1369902, 1405367, 1444227, 1484328, 1522414, 1555145, 1580273, 1597010, 1605379, 1605274, 1596188, 1577565, 1549150, 1511056, 1463909, 1409103, 1348657, 1284548, 1218250, 1151013, 1084373, 1020074, 959420, 902907, 850552, 802594, 759806, 723056, 692486, 667206, 645907, 627804, 612866, 601171, 592296, 585451, 580032, 575903, 573299, 572573, 573876, 576889, 580968, 585623, 590680, 595839, 600335, 603360, 604701, 604608, 603043, 599519, 593742, 586062, 577024, 566790, 555330, 543051, 530811, 519319, 508828, 499507, 491687, 485409, 479956, 474327, 468245, 462408, 457597, 453794, 450326, 446614, 442542, 438314]
62404D38314m008l261k120j138q40j109j301r28r0P29J152J206J208J376J627
62389D30817J809K058K573L124L177K706K385K755L500L999M241M704N499O230
62375D79577O686P135P776Q356Q602Q748R357J0647J2244J3541J4292J4839J5768
62362F17568J7412J9676K2375K5477K9029L3023L7421M2131M6792N0865N4014
62351I95783N6138N6932N5788N2432M7302M0944L3402K4715J5633P229j46o925
62339A379227j3408j9383k4667k9471l4000l8036m1027m2418m1931l9916l7307
62328A017663l4841l2320k9104k5296k1893j9707j8598j7958j7492j7315j7616
62317G65523j8439j9571k0465k0597k0003j9258j8799j8494j7938j6899j5442
$$ y = [438314, 434306, 431045, 428925, 427787, 426947, 425838, 424537, 423609, 423519, 424248, 425400, 426606, 427814, 429190, 430817, 432626, 434684, 437257, 440381, 443558, 446264, 448649, 451404, 454904, 458903, 463144, 467848, 473347, 479577, 486263, 493398, 501174, 509530, 518132, 526880, 536237, 546884, 559128, 572669, 586961, 601800, 617568, 634980, 654656, 677031, 702508, 731537, 764560, 801981, 844112, 890904, 941769, 995783, 1051921, 1108853, 1164641, 1217073, 1264375, 1305319, 1338721, 1363436, 1379069, 1386298, 1386152, 1379227, 1365819, 1346436, 1321769, 1292298, 1258298, 1220262, 1179235, 1136817, 1094886, 1054970, 1017663, 982822, 950502, 921398, 896102, 874209, 854502, 835904, 817946, 800454, 783139, 765523, 747084, 727513, 707048, 686451, 666448, 647190, 628391, 609897, 591959, 575060, 559618]
62306E59618j3819j2306j0947r525p935o424n276m465l891l602l388k633j183
62293D74224O4K83J53J073L103M783N183M952M967N051M653L941L510L621M338
62278E23899N732P457Q720R259R771J0783J1813J2267J2515J3207J4116J4639
62266F54178J4974J5860J7339J8715J9734K0913K2670K4870K7340L0222L3628
62255I00443L7423M1446M5586M9551N2823N4845N5101N3163M9007M3082L5877
62244A418347K7667J8890J0248K008o301j4940k3201l0345l6795m3485n0118n5138
62232A216837n7526n7827n7127n5766n3394m9792m5246m0395l5885l1981k8402
62221G03496k4791k1287j8346j6087j4196j2433j0852r551q576p974p562o779
$$ y = [559618, 545799, 533493, 522546, 513021, 505086, 498662, 493386, 488921, 485030, 481428, 478040, 475407, 474224, 474288, 474571, 474724, 475797, 478900, 483683, 488866, 493818, 498785, 503836, 508489, 512430, 515940, 519561, 523899, 529631, 537088, 545808, 555067, 564838, 575621, 587434, 599701, 612216, 625423, 639539, 654178, 669152, 685012, 702351, 721066, 740800, 761713, 784383, 809253, 836593, 866815, 900443, 937866, 979312, 1024898, 1074449, 1127272, 1182117, 1237218, 1290381, 1339388, 1382470, 1418347, 1446014, 1464904, 1475152, 1477160, 1470859, 1455919, 1432718, 1402373, 1365578, 1322093, 1271975, 1216837, 1159311, 1101484, 1044357, 988591, 935197, 885405, 840159, 799764, 763879, 731898, 703496, 678705, 657418, 639072, 622985, 608789, 596356, 585504, 575953, 567377, 559403, 551841, 545062]
62209E45062n282l563k466k170k128j960j742j415o09P32K110L081L662L979M040
62194E41331M105M725O065P476Q117P900P506P633Q361R245R884J0323J0845J1403
62180F54919J1598J1287J0768J0118Q864O847M944M202M566N245O110P827J0638
62167G57933J4010J7612K1738K6424L0988L4891L8380M1766M4573M5866M5043
62156A119224M1962L6744K9927K2426J4979P831J113m880j0041j4713j9272k3745
62144A201555k7935l1574l4215l5434l5347l4444l2829l0167k6608k3037k0038
62133H69927j7216j4071j0923q480o907n966n618n841o191o136n668n035m162
62120G67713k821j156M91K134L985N877P281P787P171N271K307q53l268m622n009
$$ y = [545062, 539780, 536217, 533751, 531581, 529453, 527493, 525751, 524336, 523727, 524459, 526569, 529650, 533312, 537291, 541331, 545436, 550161, 556226, 563702, 571819, 579719, 587225, 594858, 603219, 612464, 622348, 632671, 643516, 654919, 666517, 677804, 688572, 698690, 707554, 714401, 719345, 723547, 728113, 733358, 739468, 747295, 757933, 771943, 789555, 811293, 837717, 868705, 903596, 941976, 983742, 1028315, 1074181, 1119224, 1161186, 1197930, 1227857, 1250283, 1265262, 1273093, 1274206, 1269326, 1259285, 1244572, 1225300, 1201555, 1173620, 1142046, 1107831, 1072397, 1037050, 1002606, 969777, 939610, 913002, 889965, 869927, 852711, 838640, 827717, 819237, 812330, 806364, 800746, 794905, 788714, 782578, 776910, 771875, 767713, 764892, 763736, 764227, 766361, 770346, 776223, 783504, 791291, 798462, 803733, 806040, 805187, 801919, 797297, 792288]
62105G92288m374k860j435j413l105n547p631r028r882j0168r617q037n609l048
62091G10534j285o01j89R53K728M187M980N825P314R020J0279J1289J2726J4635
62077G92395J6325J7368J8099J9077K0425K1821K2874K3385K3397K3149K2895
62066A021210K2745K2717K2864K3251K3842K4601K5567K6617K7217K6698K4848
62055A292177K1929J8017J2823O522K85m602q114j1328j4991j8972k3208k8236
62043A242302l4121l9646m3438m5459m6551m6827m5705m3394m1110l9410l7374
62032G79267l4114l0264k7195k5224k3409k0884j7750j4801j2882j2296j2393
62021E48055j1923j0285q284p167p101p169o622n555m375l343k687k556k650k338
$$ y = [792288, 787914, 785054, 783619, 782206, 779101, 773554, 765923, 756895, 747013, 736845, 727228, 719191, 713582, 710534, 709249, 708648, 708459, 709412, 712140, 716327, 721307, 727132, 734446, 743466, 753745, 765034, 777760, 792395, 808720, 826088, 844187, 863264, 883689, 905510, 928384, 951769, 975166, 998315, 1021210, 1043955, 1066672, 1089536, 1112787, 1136629, 1161230, 1186797, 1213414, 1240631, 1267329, 1292177, 1314106, 1332123, 1344946, 1351468, 1351753, 1347151, 1339037, 1327709, 1312718, 1293746, 1270538, 1242302, 1208181, 1168535, 1125097, 1079638, 1033087, 986260, 940555, 897161, 856051, 816641, 779267, 745153, 714889, 687694, 662470, 639061, 618177, 600427, 585626, 572744, 560448, 548055, 536132, 525847, 517563, 510396, 503295, 496126, 489504, 483949, 479574, 476231, 473544, 470988, 468338, 466000]
62007D66000j413l55L61Q60J453K007K134J879J834K489L671M697M958M304L000
61992D97879J479J44p50j208j513k014k824l776m660n427o217p226q457r483r609
61977D36338q575p004n850n430n319n099m721m160l280k262j591j397j281j054
61963C79315j033j313j314o08K77N40K16k0J49N20R39J357J509J251J124J823
61947C84732L105L915L801L511L988N246O608P620Q441R453J0747J2021J2942
61934D76130J3584J4256J4811J4521J3041J1070R612Q896Q474Q058P578O708N108
61921F11847L049J101o56k447m009m788m875m860m750m007k682j470l83J456M253
61906E86779O818Q086Q464Q944R581R645Q705O853M310J499q99k606m098n748
$$ y = [466000, 464587, 464232, 464593, 465453, 466906, 468913, 471047, 472926, 474760, 477249, 480920, 485617, 490575, 494879, 497879, 499358, 499502, 498752, 497544, 496031, 494017, 491193, 487417, 482757, 477330, 471113, 463887, 455430, 445947, 436338, 427763, 420759, 414909, 409479, 404160, 399061, 394340, 390180, 386900, 384638, 383047, 381650, 380369, 379315, 378282, 376969, 375655, 375047, 375324, 375864, 376080, 376060, 376209, 376729, 377668, 379025, 380534, 381785, 382909, 384732, 387837, 391752, 395553, 399064, 403052, 408298, 414906, 422526, 430967, 440420, 451167, 463188, 476130, 489714, 503970, 518781, 533302, 546343, 557413, 567025, 575921, 584395, 592453, 600031, 606739, 611847, 614896, 615997, 615341, 612894, 608885, 604097, 599222, 594362, 589612, 585605, 582923, 581453, 581070, 582526, 586779, 593597, 601683, 610147, 619091, 628672, 638317, 647022, 653875, 658185, 659684, 658785, 656179, 652081, 646333]
61892F46333p168p954q493r286r958r834r122q602q400p969p132o330n931o014
61878E34140o706p956r136r616r584r517r072p588n544m300m229m188l304k077
61864D41323j209l75R86K490L370L739M426N805P548R305J0989J2482J3671J4738
61850E29288J5961J7314J8615J9922K1293K2336K2431K1430J9724J7720J5553
61839G41587J3227J0634P474L658k74l524n852p640r082r791r368p974o022l602
61825G13451n91K777N812P966R299J0131J0349R404P078L958P37k692o843j1337
61811G59499j4814j6462j6987j7509j8050j7985j7464j7307j7536j7090j5431
61800E72864j3452j2271j1772j1013r662q282p411o957o491n748m753l748k970
$$ y = [646333, 639165, 631211, 622718, 613432, 603474, 593640, 584518, 575916, 567516, 559547, 552415, 546085, 540154, 534140, 527434, 519478, 510342, 500726, 491142, 481625, 472553, 464965, 459421, 455121, 450892, 446704, 443400, 441323, 440114, 439739, 440725, 443215, 446585, 450324, 454750, 460555, 468103, 477408, 488397, 500879, 514550, 529288, 545249, 562563, 581178, 601100, 622393, 644729, 667160, 688590, 708314, 726034, 741587, 754814, 765448, 772922, 776580, 776306, 772782, 766930, 759290, 750208, 740417, 731049, 723075, 717053, 713451, 712860, 715637, 721449, 729415, 738714, 748845, 759194, 768598, 775676, 779634, 780371, 777679, 770836, 759499, 744685, 728223, 711236, 693727, 675677, 657692, 640228, 622921, 605385, 588295, 572864, 559412, 547141, 535369, 524356, 514694, 506412, 499001, 492044, 485553, 479805, 475052, 471304, 468334]
61787D68334k425j992j753j964k469k629k109j377j028r89q89q13j033j230q46
61772D44788j56j72j200k227k133j027P4N33N53O42J033J683K415L024L335L284
61756D54449L000K819L035L508L645L102K277J729J254J83j432k679l062l218
61742D68610l882m701m729l743k463j663j542j800j950j614r15l33j0M88J357
61727D41110K015J941J592J643J798J330O39J026K689M100L922K661J764J774
61713D70004K127K264K103J661R36J23n60j234k108l025l645l902l935l670l000
61698D54139k206j782j828k061k365k830l335l602l756m253n057n438m851l681
61684D07094k753k409k417k516k684k916l072k996k660k182j824j778j916j841
$$ y = [468334, 465909, 463917, 462164, 460200, 457731, 455102, 452993, 451616, 450588, 449599, 448710, 447897, 446864, 445634, 444788, 444632, 444460, 443260, 441033, 438900, 437873, 437947, 438480, 439033, 439675, 440708, 442391, 444806, 447830, 451165, 454449, 457449, 460268, 463303, 466811, 470456, 473558, 475835, 477564, 478818, 479001, 477569, 474890, 471828, 468610, 464728, 460027, 455298, 451555, 449092, 447429, 445887, 444087, 442137, 440523, 439608, 439275, 439265, 439753, 441110, 443125, 445066, 446658, 448301, 450099, 451429, 452068, 453094, 455783, 459883, 463805, 466466, 468230, 470004, 472131, 474395, 476498, 478159, 479095, 479218, 478658, 477424, 475316, 472291, 468646, 464744, 460809, 457139, 454139, 451933, 450151, 448323, 446262, 443897, 441067, 437732, 434130, 430374, 426121, 421064, 415626, 410775, 407094, 404341, 401932, 399515, 396999, 394315, 391399, 388327, 385331, 382671, 380489, 378665, 376887, 374971, 373130]
61670C73130j361p92o23r85j529j771j430n84M03J235J987K907L748L745K551
61655C80631R94L57R99K057K526K200J514R37P36R06J141J098R47J288K249L037
61639D03617K787J623M93Q2L28Q64J365J471Q93j81j178j766k083k232k005j382
61623D02696r25j185j943k451k370k036j793j532j069o47p26j382k189k701k815
61608C76932k696k562k717l473m771n927o193n599m915m687m653m351l889l673
61594C16826l628l282k606k116k098k147j787j132o38m95n21m90l15p7J7k18o73
61577B94620j047j169j089q08l13J24J12k70m90l31j50j62o4K68K97l72j182j232
61559B86742m38N94J469K161K488K190J447P22J76j59O5R95J775J281j78r66k01
$$ y = [373130, 371769, 370977, 370354, 369369, 367840, 366069, 364639, 364055, 364458, 365693, 367680, 370587, 374335, 378080, 380631, 381625, 381982, 382981, 385038, 387564, 389764, 391278, 392215, 392951, 393857, 394998, 396096, 397043, 398331, 400580, 403617, 406404, 408027, 408520, 408602, 408930, 409794, 411159, 412630, 413523, 413342, 412164, 410398, 408315, 406083, 404078, 402696, 401771, 400586, 398643, 396192, 393822, 391786, 389993, 388461, 387392, 386745, 386019, 384637, 382448, 379747, 376932, 374236, 371674, 368957, 365484, 360713, 354786, 348593, 342994, 338079, 333392, 328739, 324388, 320499, 316826, 313198, 309916, 307310, 305194, 303096, 300949, 299162, 298030, 297392, 296897, 296376, 295886, 295571, 295494, 295511, 295293, 294620, 293573, 292404, 291315, 290507, 290194, 290318, 290430, 290160, 289670, 289339, 289189, 289027, 288963, 289231, 289528, 289156, 287974, 286742, 286304, 286898, 288367, 290528, 293016, 295206, 296653, 297375, 297551, 297392, 297457, 298452, 300227, 301508, 301330, 300364, 300163]
61542C00163J124J608J178P28P21R47J216J473J424Q65K92N10J503K283K060J127
61526C19222L75J30n4n91j193j285r13p85j285j857j761j147q20j035j196p82
61510C05023o3L53K28k12n36l33L96R80O43m86j406j430p65J52J122J756J430
61493C06852K79n39k11O32R18O43N21O58N95L69N24J155J789K193K494K576K233
61476C23681J842J997K435K312J606J208J384J281M12m57n63l44n21p94m52K84
61460C35311N72K98R6K23K81J49K16O15R07Q41P29Q45R30O51J25l73q33j325j656
61441C38602j517q90o0O95J282J748K168K458K335J635P37K92M42O12L46k9J19
61424C50975P19J035O65R5O5P17J526J899J594P83m4k93K54J108J436R15M0m91
$$ y = [300163, 301287, 302895, 304073, 304801, 305522, 306469, 307685, 309158, 310582, 311447, 311739, 312249, 313752, 316035, 318095, 319222, 319597, 319727, 319673, 319082, 317889, 316604, 315691, 314906, 313621, 311764, 310003, 308856, 308036, 307001, 305805, 305023, 304960, 305313, 305541, 305329, 304793, 304460, 304856, 305836, 306479, 305993, 304587, 303157, 302392, 302544, 303666, 305422, 306852, 307131, 306592, 306381, 307013, 307931, 308574, 309095, 309753, 310348, 310717, 311241, 312396, 314185, 316378, 318872, 321448, 323681, 325523, 327520, 329955, 332267, 333873, 335081, 336465, 337746, 338158, 337701, 337138, 336794, 336273, 335479, 335027, 335311, 335883, 336181, 336277, 336500, 336781, 336930, 337146, 337761, 338668, 339509, 340238, 341083, 342013, 342664, 342789, 342416, 341583, 340258, 338602, 337085, 336195, 336135, 336830, 338112, 339860, 342028, 344486, 346821, 348456, 349193, 349485, 349927, 350539, 350885, 350856, 350975, 351694, 352729, 353394, 353489, 353554, 354271, 355797, 357696, 359290, 360073, 360029, 359736, 359990, 361098, 362534, 363449, 363489, 362998]
61406C62998n62n62o80o67l66j26l75j002j452j408j026n32P6P48J181J133P74
61389C58152M93M61O08Q61J158J241Q50J27m46n56k71L06J218K324L091L100K598
61372C75315K262K409K729K814K632K410K245J990J550J060P93R24J372J892K225
61357D04622K232J983J850K324L485M733N308N164M985N295N884O192N883M859
61343D64799L184J427N79J027J902K075J613J489J986K302J880J144N53k03j444
61328D84313k600k946k717k748l168l322k923k443k282k124j478k93J146K543
61314D58958L587M009L999M270N381P053Q472R207R665J0593J2261J4103J5170
61301E66728J4893J3425J1254Q750O187L968K354J041n64k505m127m939n324o042
$$ y = [362998, 362436, 361874, 361194, 360527, 360161, 360035, 359660, 358658, 357206, 355798, 354772, 354240, 354316, 355064, 356245, 357378, 358152, 358645, 359106, 359714, 360575, 361733, 362974, 363824, 363951, 363505, 362949, 362678, 362984, 364202, 366526, 369617, 372717, 375315, 377577, 379986, 382715, 385529, 388161, 390571, 392816, 394806, 396356, 397416, 398209, 399133, 400505, 402397, 404622, 406854, 408837, 410687, 413011, 416496, 421229, 426537, 431701, 436686, 441981, 447865, 454057, 459940, 464799, 467983, 469410, 469989, 471016, 472918, 474993, 476606, 478095, 480081, 482383, 484263, 485407, 485960, 485757, 484313, 481713, 478767, 476050, 473302, 470134, 466812, 463889, 461446, 459164, 457040, 455562, 455269, 456415, 458958, 462545, 466554, 470553, 474823, 480204, 487257, 495729, 504936, 514601, 525194, 537455, 551558, 566728, 581621, 595046, 606300, 615050, 621237, 625205, 627559, 628600, 628036, 625531, 621404, 616465, 611141, 605099]
61287F05099p258q402q900q761q374q012p681p315o986o768o472n579l788j558
61273E09245J20P31P50J030J817K688L218L324K985K162J177P90J511L061M691
61258E39300N923O686O942O609N813M865L909K848J747R74P07N46j06j317k523
61243E82923l131l043k574k057j629j365j413j949k892l792m097l591k483j111
61229E47796K35J287J867K155K627L557M752N865O716P173P039O451O045O323
61215F09888P009P464P542P524P378O710N533M446L852L557L325L250L290L035
61201F83803K405K161L077M899O646P813Q754R932J1392J2933J4268J4881J4110
61188G97074J1776Q457N042K063l61k177l188l296k797k392k715l823n214o428
$$ y = [605099, 597841, 589439, 580539, 571778, 563404, 555392, 547711, 540396, 533410, 526642, 520170, 514591, 510803, 509245, 509365, 510096, 510846, 511876, 513693, 516381, 519599, 522923, 525908, 528070, 529247, 530037, 531548, 534609, 539300, 545223, 551909, 558851, 565460, 571273, 576138, 580047, 582895, 584642, 585616, 586323, 586869, 586763, 585446, 582923, 579792, 576749, 574175, 572118, 570489, 569124, 567711, 565762, 562870, 559078, 554981, 551390, 548907, 547796, 548031, 549318, 551185, 553340, 555967, 559524, 564276, 570141, 576857, 584030, 591069, 597520, 603565, 609888, 616897, 624361, 631903, 639427, 646805, 653515, 659048, 663494, 667346, 670903, 674228, 677478, 680768, 683803, 686208, 688369, 691446, 696345, 702991, 710804, 719558, 729490, 740882, 753815, 768083, 782964, 797074, 808850, 817307, 822349, 824412, 824051, 821874, 818686, 815390, 812593, 810201, 807486, 803663, 798449, 792021]
61174G92021p455q460r308r648r425r000q759q821r145r685j0271j0543j0235
61161F71266r536q993r021r529j0042j0148r698q691p170n388l845k891k305j519
61147E72490l29P65J132O52l29j482k708l943n011n744o117o092n494m137k172
61132E31481j68J301K176K852L638M464N204N967O876P848Q850J0186J2086J4223
61118F16984J6040J7413J8573J9542K0188K0755K1675K2781K3329K2965K2128
61107H42373K1302K0445J9351J8061J6591J4873J3089J1511R775O997L046j055
61095I96359m442p392j0411j3135j4929j6037j7114j8052j8305j8070j8088j8316
61083H22068j7912j6680j5536j5145j4939j3932j1989r795p994o768n960n258
$$ y = [792021, 784566, 776106, 766798, 757150, 747725, 738725, 729966, 721145, 712000, 702315, 692044, 681501, 671266, 661730, 652737, 643716, 634187, 624145, 613997, 604299, 595608, 588438, 583050, 579205, 576314, 574009, 572490, 572161, 572926, 574058, 574710, 574381, 572899, 570191, 566248, 561237, 555493, 549376, 543284, 537790, 533653, 531481, 531313, 532614, 534790, 537642, 541280, 545744, 550948, 556915, 563791, 571639, 580489, 590675, 602761, 616984, 633024, 650437, 669010, 688552, 708740, 729495, 751170, 773951, 797280, 820245, 842373, 863675, 884120, 903471, 921532, 938123, 952996, 966085, 977596, 987371, 994368, 997414, 996359, 991917, 984525, 974114, 960979, 946050, 930013, 912899, 894847, 876542, 858472, 840384, 822068, 804156, 787476, 771940, 756795, 741856, 727924, 715935, 706140, 698146, 691378, 685418, 680160]
61071F80160m357l161j795l98J014K470L998N515O696P109O836O673P331Q637
61057G26728R911J0958J2167J3706J5235J6463J7554J8771K0093K1328K2380K3391
61045I28685K4665K6418K8405L0066L1273L2569L4367L6326L7951L9449M1271
61034A291445M3116M4168M4305M4394M5308M7225M9840N2743N5465N7620N9074
61023A834703N9711N9292N7923N6431N5833N6680N9322O4282P1638Q0540R0057
61012B546412J00189J11334J23669J38324J58492J87816K27755K77764L37498
61003D209253M07345M87967N82039O96193Q38145J012140J220919J470029J757263
60994A2681293K045010K245409K250750J998357J517547R19364L43861q9539l05643
$$ y = [680160, 675803, 672642, 670847, 670449, 671463, 673933, 677931, 683446, 690142, 697251, 704087, 710760, 718091, 726728, 736639, 747597, 759764, 773470, 788705, 805168, 822722, 841493, 861586, 882914, 905294, 928685, 953350, 979768, 1008173, 1038239, 1069512, 1102081, 1136448, 1172774, 1210725, 1250174, 1291445, 1334561, 1378729, 1423034, 1467428, 1512736, 1559961, 1609801, 1662544, 1718009, 1775629, 1834703, 1894414, 1953706, 2011629, 2068060, 2123893, 2180573, 2239895, 2304177, 2375815, 2456355, 2546412, 2646601, 2757935, 2881604, 3019928, 3178420, 3366236, 3593991, 3871755, 4209253, 4616598, 5104565, 5686604, 6382797, 7220942, 8233082, 9454001, 10924030, 12681293, 14726303, 16971712, 19222462, 21220819, 22738366, 23657730, 24001591, 23912052, 23606409]
60985B3606409k85325q0216J85332L51198K91189k8408n41004j120411j635994
60976B0742770j993368k153433k132008j981657j763340j524060j291521j080346
60968F823037q97587p44070o16192n09692m21762l50222k92637k46831k11095
60959B532949j83454j61611j43781j28881j15901j03911r2588q1976p1862o2184
60949A386800n3763m7548m3300m0003l7407l6070l5878l5758l5035l4044l3040
60938I54954l1568k9326k6806k4651k2983k1665k0596j9529j8206j6840j5850
60927G06934j5011j3658j1849j0440r792r189p994o615n816n725n962o182o087
60914E92614n378m184l175k812k850k814k618k406k169j834j453j061o09j85m8
$$ y = [23606409, 23321084, 23240868, 23426200, 23777398, 24068587, 24040179, 23499175, 22378764, 20742770, 18749402, 16595969, 14463961, 12482304, 10718964, 9194904, 7903383, 6823037, 5925450, 5181380, 4565188, 4055496, 3633734, 3283512, 2990875, 2744044, 2532949, 2349495, 2187884, 2044103, 1915222, 1799321, 1695410, 1602822, 1520846, 1448984, 1386800, 1333037, 1285489, 1242189, 1202186, 1164779, 1128709, 1092831, 1057073, 1022038, 987994, 954954, 923386, 894060, 867254, 842603, 819620, 797955, 777359, 757830, 739624, 722784, 706934, 691923, 678265, 666416, 655976, 646184, 636995, 629001, 622386, 616570, 610845, 604883, 598701, 592614, 587236, 583052, 579877, 577065, 574215, 571401, 568783, 566377, 564208, 562374, 560921, 559860, 559251, 559066, 559018]
60899E59018k75o97j125j348j033k07K84m91k263l711m040l710l496l632m160
60884E29114n252o670p631p696p298p000o835o704o774o889o346m869l307k653
60870D43190k835l082l015k676j939p31L96P47M38K60O36J327K032K753L488M101
60854D45090M481M567M223L466K672K233K188K407K861L349L351K660J900J766
60840D87214J992J686N69p78j840k729l696m691n545o133o270n798m900l993l324
60825D41764k933k861k972k791k110j580j965k889l182k660k537l644n100n503
60811C99037m792m061l925m000l860l622l424l092k524j997j761j745j823k036
60797C56375k316k322j811j012l86j42j62k19j02K70O38N54ll97j05N35P56M92
$$ y = [559018, 558743, 558046, 556921, 555573, 554540, 554333, 554617, 554126, 551863, 548152, 544112, 540402, 536906, 533274, 529114, 523862, 517192, 509561, 501865, 494567, 487567, 480732, 474028, 467254, 460365, 454019, 449150, 445843, 443190, 440355, 437273, 434258, 431582, 429643, 428912, 429308, 430055, 430493, 430753, 431389, 432716, 434748, 437501, 440989, 445090, 449571, 454138, 458361, 461827, 464499, 466732, 468920, 471327, 474188, 477537, 480888, 483548, 485448, 487214, 489206, 490892, 491461, 490683, 488843, 486114, 482418, 477727, 472182, 466049, 459779, 453981, 449081, 445088, 441764, 438831, 435970, 432998, 430207, 428097, 426517, 424552, 421663, 418481, 415821, 413284, 409640, 404540, 399037, 394245, 390184, 386259, 382259, 378399, 374777, 371353, 368261, 365737, 363740, 361979, 360234, 358411, 356375, 354059, 351737, 349926, 348914, 348528, 348386, 348224, 348005, 347903, 348173, 348811, 349365, 349362, 348965, 348860, 349395, 350151, 350643]
60779C50643N12J299K349K836K632K261K130K246K532K991L514L765L459K651
60765C85820J738J133R03O98K06l97o78n60l73k52%K72J8q42j522j474j390k212
60747C81088l475l701k422q44k07m11o51o65p76j248k105l253m313m734m473m167
60731C43643m245m214l413k068j079q88j112j182q97m39j92m30r11q93l4R82J176
60714C23804N11r1R1Q82J680K114K157K027K029K234K269J779J059P72J050J391
60698C45758J504J649J930J885J189L35L6K96N80P08R93J529J873J581P10l20
60682C62236j072j239p79n7L89M24M79R71J757K315K323J857J183N47J00k00n32
60665C70702r16j101j022j152j976l120l537k743j496r06j210j694j676j054r4
$$ y = [350643, 351155, 352454, 354803, 357639, 360271, 362532, 364662, 366908, 369440, 372431, 375945, 379710, 383169, 385820, 387558, 388691, 389594, 390292, 390498, 390101, 389423, 388863, 388490, 388238, 388238, 388510, 388528, 387686, 386164, 384690, 383300, 381088, 377613, 373912, 371490, 370646, 370439, 370028, 369377, 368712, 367936, 366688, 364583, 361330, 357017, 352283, 347810, 343643, 339398, 335184, 331771, 329703, 328624, 327736, 326624, 325442, 324545, 324106, 323914, 323484, 322573, 321680, 321646, 322628, 323804, 324315, 324224, 324315, 325197, 326877, 328991, 331148, 333175, 335204, 337438, 339707, 341486, 342545, 343317, 344367, 345758, 347262, 348911, 350841, 352726, 353915, 354250, 354286, 354582, 355162, 355870, 356863, 358392, 360265, 361846, 362556, 362236, 361164, 359925, 359146, 359089, 359478, 359902, 360381, 361352, 363109, 365424, 367747, 369604, 370787, 371334, 371434, 371234, 370702, 369786, 368685, 367663, 366511, 364535, 361415, 357878, 355135, 353639, 352733, 351523, 349829, 348153, 347099, 347005]
60650C47005R43J872K568K989L091K790K149J472R46L20p23j942k693k744k543
60635C55500k533k592k382j921j525j420j576j813j813j231j06R95J542J666J888
60620C42679K251K118J078l37j123r48m25k04j84Q2N07N18m4n50m22P6K48k7k31
60601C45062k2L27M47M33O25J025J243J018O50Q12J850L264M049L670K597J706
60585C68756J310J029M87j71n03k41N22J448K164K488K475K257J963J885K383
60570C88252L469M696N780O989Q599J0261J1450J2249J2973J3216J2166R907P538
60557E07545N675L651P09k744n669p652q868r196q191n971l396j192O00K226L668
60542D71195M747N562O493P776R247J0612J1950J3768J6355J9117K0856K0801
$$ y = [347005, 347948, 349820, 352388, 355377, 358468, 361258, 363407, 364879, 365825, 366145, 365422, 363480, 360787, 358043, 355500, 352967, 350375, 347993, 346072, 344547, 343127, 341551, 339738, 337925, 336694, 336588, 337583, 339125, 340791, 342679, 344930, 347048, 348126, 347789, 346666, 345718, 345293, 345089, 344905, 344987, 345494, 346012, 345968, 345418, 344996, 345072, 345320, 345293, 345062, 345040, 345367, 345814, 346247, 346872, 347897, 349140, 350158, 350808, 351620, 353470, 356734, 360783, 364453, 367050, 368756, 370066, 371095, 371582, 371411, 370908, 370667, 371189, 372637, 374801, 377289, 379764, 382021, 383984, 385869, 388252, 391721, 396417, 402197, 409186, 417785, 428046, 439496, 451745, 464718, 477934, 490100, 500007, 507545, 513220, 516871, 517580, 514836, 509167, 501515, 492647, 483451, 475260, 469289, 465893, 464701, 465301, 467527, 471195, 475942, 481504, 487997, 495773, 505020, 515632, 527582, 541350, 557705, 576822, 597678, 618479]
60530F18479J9252J7017J4443J1176O818J713l049o441q323r391j0290j1050j1448
60517F28906j1515j1360j0711r267p291n428l948k684j588q20k02P91K366M262
60503E71511O351Q830J1703J4699J7897K1812K6538L1330L5470L9024M2342M5229
60491H72736M7053M7375M6114M3387L9558L5167L0501K5371J9390J2216L611o257
60479A216222j6497k6045l4562m2167m8318n1982n3133n3018n2394n0522m6681
60468G40903m1707l7069l3121k9369k5814k2915k0526j8040j5424j3185j1427
60457D72306r847q458p501o752n841n072n038n434n257m228l155k762k920l114
60443C96927k951k160q74J07J37k53L8R27J119L4j288j673j303j089j316j594
$$ y = [618479, 637731, 654748, 669191, 680367, 687185, 688898, 685849, 679408, 671085, 661694, 651404, 640354, 628906, 617391, 606031, 595320, 586053, 578762, 573334, 569386, 566702, 565114, 564294, 564092, 564883, 567249, 571511, 577862, 586692, 598395, 613094, 630991, 652803, 679341, 710671, 746141, 785165, 827507, 872736, 919789, 967164, 1013278, 1056665, 1096223, 1131390, 1161891, 1187262, 1206652, 1218868, 1222479, 1216222, 1199725, 1173680, 1139118, 1096951, 1048633, 996651, 943518, 890500, 838106, 787584, 740903, 699196, 662127, 629006, 599637, 573823, 550908, 530382, 512342, 496918, 483733, 472306, 462459, 454001, 446500, 439748, 433907, 428835, 423797, 418363, 413106, 408878, 405723, 402961, 400041, 396927, 393976, 391816, 390942, 391049, 391186, 390933, 390971, 391898, 393017, 393051, 391763, 390090, 388787, 387698, 386382, 384788]
60427C84788j669j554j194m89L91J060J157M95o93j622j536n35O14J490K235K726
60411C85664K391J223K20K25Q95J311J160P68L93J42K31P50J358J667J808K148
60395D02354K644K940K971K991L062K993K785K751L062L468L587L328K940K728
60381D44604K769K883K943L065L358L556L278K674K423K840L376L304K604J812
60367D85489J185N16k04n24j08O94J223J348J502J889K063J662J307K099M188
60352E04329O445P819Q543R493J0799J1642J1264R625P154M430J968j59k457n232
60338E85663p809r082q837p958p322p077p021p008o822o270n596n272n219m894
60324D89476m266m013m414m792m498l757l079k383j325J0J370K906M782O617P923
$$ y = [384788, 383119, 381565, 380371, 379882, 380273, 381333, 382490, 382985, 382292, 380670, 379134, 378599, 379213, 380703, 382938, 385664, 388055, 389278, 389498, 389723, 390618, 391929, 393089, 393857, 394250, 394392, 394623, 395373, 396731, 398398, 400206, 402354, 404998, 407938, 410909, 413900, 416962, 419955, 422740, 425491, 428553, 432021, 435608, 438936, 441876, 444604, 447373, 450256, 453199, 456264, 459622, 463178, 466456, 469130, 471553, 474393, 477769, 481073, 483677, 485489, 486674, 487190, 486986, 486462, 486354, 487048, 488271, 489619, 491121, 493010, 495073, 496735, 498042, 500141, 504329, 510774, 518593, 527136, 536629, 547428, 559070, 570334, 579959, 587113, 591543, 593511, 593352, 590895, 585663, 577854, 568772, 559935, 551977, 544655, 537578, 530557, 523549, 516727, 510457, 504861, 499589, 494370, 489476, 485210, 481197, 476783, 471991, 467493, 463736, 460657, 458274, 456949, 456959, 458329, 461235, 466017, 472634, 480557]
60309D80557Q973J0549J2822J5071J6558J7189J7308J7187J6828J6011J4429J1936
60297F55418Q650M717J67m788r505j3310j6057j8030j9306j9560j8515j6398j3827
60284E19656j1331r050o834m694l022k285k481l094l587l772l697l456l200l056
60270D56097k947k668k252k031k235k727l225l524l472k973k207j583j308j190
60256D21755r74o66m56m74o57p27l64L80R58R49O84P83J256J626J782K038K303
60239D30196J992J006N1l17l29l52k25K48P84J073J265J583J935K303K961L847
60223D48021M257L761K951K685L019L476L882M283M484M398M512N201O001O330
60209E07261O582P520Q778R123Q230P188O863O797O228N471N451O229O707N929
$$ y = [480557, 489530, 500079, 512901, 527972, 544530, 561719, 579027, 596214, 613042, 629053, 643482, 655418, 664068, 668785, 668952, 664164, 654659, 641349, 625292, 607262, 587956, 568396, 549881, 533483, 519656, 508325, 499275, 492441, 487747, 484725, 482440, 479959, 476865, 473278, 469506, 465809, 462353, 459153, 456097, 453150, 450482, 448230, 446199, 443964, 441237, 438012, 434488, 431016, 428043, 425836, 424253, 422945, 421755, 420781, 420115, 419659, 419185, 418528, 417801, 417437, 417817, 418775, 419724, 420408, 421191, 422447, 424073, 425855, 427893, 430196, 432188, 433194, 433245, 432928, 432599, 432247, 432022, 432270, 433054, 434127, 435392, 436975, 438910, 441213, 444174, 448021, 452278, 456039, 458990, 461675, 464694, 468170, 472052, 476335, 480819, 485217, 489729, 494930, 500931, 507261, 513843, 521363, 530141, 539264, 547494, 554682, 561545, 568342, 574570, 580041, 585492, 591721, 598428, 604357]
60195F04357M225K830K506K779K649J839R55M85J74l64r77j364j734k519l697
60180F12144m877n837o478o545n961n204m712m247l403k502k174k270k121j783
60166E54030j998k751k989k212j416j705k696l084k364j216l88Q7N29J064J598
60151E34489K003K159J951J323L97m54p12k06N20O59J53j26N71J870K775K927
60135E50299K938L441M333N163N889O780P756Q209P634O127M182K235O13l97p36
60120F14466p14o04k38O28J727K480K741K797K709K215J423Q99P81N30j68q97
60104F30775j350j963l047l941l923l437l483m055m225l655l025k791k584k090
60090E87206j704j785j912j464n21L07O44N44J29m96j033j068m82K88O13L01j75
$$ y = [604357, 608582, 611412, 613918, 616697, 619346, 621185, 622140, 622625, 622799, 622435, 621458, 620094, 618360, 615841, 612144, 607267, 601430, 594952, 588407, 582446, 577242, 572530, 568283, 564880, 562378, 560204, 557934, 555813, 554030, 552032, 549281, 546292, 544080, 542664, 540959, 538263, 535179, 532815, 531599, 531211, 531298, 531827, 532891, 534489, 536492, 538651, 540602, 541925, 542322, 541868, 541156, 540950, 541470, 542129, 542282, 542156, 542727, 544597, 547372, 550299, 553237, 556678, 561011, 566174, 572063, 578843, 586599, 594808, 602442, 608569, 612751, 614986, 615599, 615202, 614466, 613752, 613148, 612910, 613538, 615265, 617745, 620486, 623283, 625992, 628207, 629630, 630529, 631310, 631840, 631672, 630775, 629425, 627462, 624415, 620474, 616551, 613114, 609631, 605576, 601351, 597696, 594671, 591880, 589296, 587206, 585502, 583717, 581805, 580341, 579820, 580127, 580771, 581315, 581444, 580948, 579915, 578847, 578365, 578653, 579266, 579567, 579392]
60073E79392l38n19j565l577n501o388o587o988p574p557o798o093n912n736m988
60058E03271l911l116k807k853l139l421l219k295r90J47Q79J222J243J181J439
60043D83631K201L265M353N322N923N869N327M923M919M789L997K794J846J267
60029E40426O05m04j515k399l039l619m238m867n441n975o556p167p612p742p667
60014D72790p514p072o127n041m440m246l675k485j560j660k241k249j741j713
60000D21026k402k763j928m48N17P49J020J807K625K829K534K415K759L158L134
59985D37032K723K316K116K015J833J479R49L44j47m99r84j793k631k970k740
59970D39043k400k276k169j767j102l68M11J232J878K111K080K206K657L232L658
$$ y = [579392, 579054, 578535, 576970, 573393, 567892, 561504, 554917, 547929, 540355, 532798, 526000, 519907, 513995, 508259, 503271, 499360, 496244, 493437, 490584, 487445, 484024, 480805, 478510, 477520, 477667, 478546, 479768, 481011, 482192, 483631, 485832, 489097, 493450, 498772, 504695, 510564, 515891, 520814, 525733, 530522, 534519, 537313, 539159, 540426, 541031, 540627, 539112, 536713, 533674, 530055, 525817, 520950, 515509, 509534, 502978, 495811, 488199, 480457, 472790, 465276, 458204, 452077, 447036, 442596, 438350, 434675, 432190, 430630, 428970, 426729, 424480, 422739, 421026, 418624, 415861, 413933, 413485, 414002, 414751, 415771, 417578, 420203, 423032, 425566, 427981, 430740, 433898, 437032, 439755, 442071, 444187, 446202, 448035, 449514, 450463, 450807, 450660, 450161, 449177, 447384, 444753, 441783, 439043, 436643, 434367, 432198, 430431, 429329, 428961, 429372, 430604, 432482, 434593, 436673, 438879, 441536, 444768, 448426]
59955D48426L864L856L561K917J994R64n3r87j681j863j395n84p1l31j186j930
59939D55501k005j591j438k020k840k845j714m16q3n08l84Q40K162K493K251K715
59923D50118M176N591N986N425M427L273K151J366R23L92m30r94o49M67J583K201
59907D86006K450K652K938L328L788M082L788K717J213q1p32p40l50J72O12R02
59891E12745J301K251L763N111N532N199N051N609O406O815O882O981P144P207
59877E87997P309P650Q011P999P628P026N823L553O38j658k557k522k557l137
59863F31203m027m792n190n264n188n012m615m028l572l407l171k461j404l26
59849E78746Q74K454M123N332O142P109Q194Q582P671N666L052K05k264l496l128
$$ y = [448426, 452290, 456146, 459707, 462624, 464618, 465582, 465529, 464542, 462861, 460998, 459603, 459019, 458948, 458617, 457431, 455501, 453496, 451905, 450467, 448447, 445607, 442762, 441048, 440632, 440549, 440041, 439657, 440497, 442659, 445152, 447403, 450118, 454294, 459885, 465871, 471296, 475723, 478996, 481147, 482513, 483436, 483828, 483398, 482404, 481755, 482222, 483805, 486006, 488456, 491108, 494046, 497374, 501162, 505244, 509032, 511749, 512962, 512881, 512149, 511409, 511059, 511231, 511843, 512745, 514046, 516297, 520060, 525171, 530703, 535902, 540953, 546562, 552968, 559783, 566665, 573646, 580790, 587997, 595306, 602956, 610967, 618966, 626594, 633620, 639443, 642996, 643634, 641976, 639419, 636897, 634340, 631203, 627176, 622384, 617194, 611930, 606742, 601730, 597115, 593087, 589515, 586108, 582937, 580476, 579072, 578746, 579620, 582074, 586197, 591529, 597671, 604780, 612974, 621556, 629227, 634893, 637945, 638150, 635886, 632390, 629262]
59834F29262j621L29K224L430L163J243j500m000n795o866p121o451n106l709
59820E97482k957l271m390n415n700n640o032o737o840o104n385n280n351n095
59806E23285m771m625m143k838j201j65k7n51j516k473k573j543l70j42n74o56
59790D95117m17q24j989k661j900l14Q36J109R29O68L28l1n2N74J646K497K584
59773D98100K035J509J510J957K446K695K640K417K385K798L318L206K342J603
59759E30961J848K891L853M321M614N138N942O839P588Q025Q251Q566Q974R045
59745F16856Q546P932P701P634P148O231N442N062M775M183L215K065J035M17
59731F88242J98m9o23j252j473j315j131r87p26n56r44j888k772l147l215l380
$$ y = [629262, 627641, 627970, 630194, 633624, 636787, 638030, 636530, 632530, 626735, 619869, 612748, 606297, 601191, 597482, 594525, 591254, 586864, 581449, 575749, 570109, 564077, 557340, 550500, 544396, 539011, 533731, 528380, 523285, 518514, 513889, 509746, 506908, 505707, 505542, 505515, 504964, 503448, 500975, 498402, 496859, 496489, 496347, 495773, 495117, 494700, 493876, 491887, 489226, 487326, 487012, 487848, 488957, 489886, 490554, 490882, 490851, 490799, 491373, 493019, 495516, 498100, 500135, 501644, 503154, 505111, 507557, 510252, 512892, 515309, 517694, 520492, 523810, 527016, 529358, 530961, 532809, 535700, 539553, 543874, 548488, 553626, 559568, 566407, 573995, 582020, 590271, 598837, 607811, 616856, 625402, 633334, 641035, 648669, 655817, 662048, 667490, 672552, 677327, 681510, 684725, 686790, 687825, 688242, 688440, 688391, 687768, 686516, 685043, 683728, 682597, 681610, 680884, 680328, 679384, 677496, 674724, 671577, 668362, 664982]
59715F64982l709l986m014l709l133k594k513k925l288k942j869p81m24o93p17
59700F27685O1J093J371P34N5J11P84J532K034K111J621P88J97l5m98j502k383
59683F35759k474k214k475l142l321k852k629l283m354n045n208n242n448n732
59669E82340n783n418m910m832n279n418m329k209k76N63M88K05J47L73Q09J371
59653E47842J986K628L141L263L040L004L384L415K127j14j714j780j312j955
59639E66955l960o000o787o303n415m760m299l802l350l174l247l270l061k751
59625E06776k529k492k751l371m061m340m158m003m144m175l686k939k457k249
59611D59421j966j556j215q64j88Q57J995K960L505L328K506J768J755K083J772
$$ y = [664982, 661273, 657287, 653273, 649564, 646431, 643837, 641324, 638399, 635111, 632169, 630300, 629519, 629095, 628402, 627685, 627746, 628839, 630210, 630944, 630999, 631110, 631894, 633426, 635460, 637571, 639192, 639980, 640177, 640142, 639644, 638142, 635759, 633285, 631071, 628596, 625454, 622133, 619281, 616652, 613369, 609015, 603970, 598762, 593520, 588072, 582340, 576557, 571139, 566229, 561397, 556118, 550700, 546371, 544162, 543886, 544449, 544937, 545142, 545289, 545662, 546471, 547842, 549828, 552456, 555597, 558860, 561900, 564904, 568288, 571703, 573830, 573716, 572002, 570222, 568910, 566955, 562995, 556995, 550208, 543905, 538490, 533730, 529431, 525629, 522279, 519105, 515858, 512588, 509527, 506776, 504247, 501755, 499004, 495633, 491572, 487232, 483074, 479071, 474927, 470752, 467066, 464127, 461670, 459421, 457455, 455899, 454684, 453820, 453632, 454489, 456484, 459444, 462949, 466277, 468783, 470551, 472306, 474389, 476161]
59596D76161N85o78j236j098o61r5N23R28R17O38L73R4m50j230j732j497p94m43
59578D70305q80j669k255k728l337l620k996j986j732k203k136j105l16o39j197
59563D41506q58PM98Q04J406J589M49j195j617o37L69P05R07J189J084Q05J282
59546D48293K443L072K820K799L641M515M855N612P828J1157J4713J8174K0939
59533E50861K1295J7805J1080L259l754q793j1051j0424p998n225k790p58P11
59520E54218J506J916K133J842R78K42L3n48k504n168o789o811o446o882p874
59505E19846q431q128p296o428n786n413n191m955m583l959k949j556j8J262J822
59490D58237J367J61q22p10K42R66R94R17J245J606J543J395J756K557L337L926
$$ y = [476161, 476746, 476068, 474832, 473734, 473073, 472978, 473501, 474429, 475346, 475984, 476357, 476451, 476001, 474771, 473039, 471542, 470748, 470305, 469425, 467756, 465501, 462773, 459436, 455816, 452820, 450834, 449102, 446899, 444763, 443658, 443342, 442703, 441506, 440648, 440655, 441153, 441957, 443363, 444952, 445401, 444206, 442589, 441952, 442321, 443026, 443933, 445122, 446206, 447011, 448293, 450736, 453808, 456628, 459427, 463068, 467583, 472438, 478050, 485878, 497035, 511748, 529922, 550861, 572156, 589961, 601041, 604300, 600546, 591753, 580702, 570278, 562280, 557055, 554265, 553507, 554218, 555724, 557640, 559773, 561615, 562593, 562835, 562868, 562320, 559816, 554648, 547859, 541048, 534602, 527720, 519846, 511415, 503287, 495991, 489563, 483777, 478364, 473173, 468218, 463635, 459676, 456727, 455171, 455153, 456415, 458237, 459604, 459765, 458943, 458233, 458475, 459441, 460435, 461352, 462597, 464203, 465746, 467141, 468897, 471454, 474791, 478717]
59474D78717M273M112L442K967L214L603L188K072J236J084J056P28M14M56O68
59459E11230P92J000J544K282K902L411M092N043N976O523O690O867P253P365
59445E72970O532M854L265K333J484j87k661n029o491o837o186m862l556k997
59431E52632l237l565l335k531j537m84Q53K632M539N945O529O685P152Q308J0008
59416E90594J2031J4253J6396J8053J9255K0540K2061K2808K1184J6356R036J066
59404G83633n602r886j1845j2027j0548p086j775M179Q904J0714Q770L542l232
59391G57741r566j4418j7606j8786j7475j4221j0765q350o620m775k967j752q40
59378F29600M95K082K974K841K364K245K516K910L183L013K217J192O22O45P48
$$ y = [478717, 482990, 487102, 490544, 493511, 496725, 500328, 503516, 505588, 506824, 507908, 508964, 509692, 510106, 510562, 511230, 512022, 513022, 514566, 516848, 519750, 523161, 527253, 532296, 538272, 544795, 551485, 558352, 565605, 572970, 579502, 584356, 587621, 589954, 591438, 591251, 588590, 583561, 577070, 570233, 564047, 559185, 555629, 552632, 549395, 545830, 542495, 539964, 538427, 537943, 538796, 541428, 545967, 551912, 558441, 565126, 572278, 580586, 590594, 602625, 616878, 633274, 651327, 670582, 691122, 713183, 735991, 757175, 773531, 782567, 783633, 778031, 768145, 756300, 744273, 733725, 726639, 724864, 729043, 737947, 748661, 757431, 760973, 757741, 748175, 733757, 716151, 697365, 679890, 665669, 654904, 646554, 639934, 635159, 632192, 630440, 629600, 630095, 632177, 635151, 637992, 640356, 642601, 645117, 648027, 651210, 654223, 656440, 657632, 658254, 658899, 659647]
59363F59647N00Ml58k54N16J751K780L096L011L197L768M412N294O977R300J1218
59347G14859J2115J2548J3211J3818J3701J3067J2768J2918J2588J1100Q967P155
59335H58815N833M312K102n35l057n273p205q705r515r632r426r440j0062j1180
59321G87032j2028j1738j0325q821q112p989p800p577p799q305q384p853p243
59308F73058o775o079n115m465m291l823k388l43J593L294N100P235R781J2536
59294F79318J4370J3477R114K643l807r248j3680j6761j7759j6723j4638j2270
59282F14036r634o746m184k546j748j082K20K445N186P620R208J0044J0519J0914
59268F44252J1416J2112J2633J2277J0910R343Q333P604O311M205J719p42l013
$$ y = [659647, 660147, 660151, 659793, 659539, 660055, 661806, 664586, 667682, 670693, 673890, 677658, 682070, 687364, 694341, 703641, 714859, 726974, 739522, 752733, 766551, 780252, 793319, 806087, 819005, 831593, 842693, 851660, 858815, 864648, 868960, 871062, 870527, 867470, 862197, 854992, 846287, 836772, 827140, 817714, 808274, 798212, 787032, 775004, 763266, 752941, 744120, 736008, 728019, 720219, 712642, 704843, 696538, 688154, 680301, 673058, 666283, 660204, 655089, 650624, 646333, 642510, 640122, 639779, 641372, 644666, 649766, 657001, 666782, 679318, 693688, 707165, 716279, 718922, 715115, 705867, 692187, 675426, 657667, 640944, 626306, 614036, 604402, 597656, 593472, 590926, 589178, 588096, 588316, 590761, 595947, 603567, 612775, 622819, 633338, 644252, 655668, 667780, 680413, 692690, 703600, 712943, 721276, 728880, 735191, 739396, 741115, 740373, 737360]
59255G37360m801n819o303o872p740q419q224o964n133l549k622j947q62N96J745
59240F70446K281K624L075L393L491L777M383M797M800M855N025M395K451K07
59226G20000j116j793k881m342n249n428n608o077o387o387o428o524o298n851
59212F49631n678n725n437m817m495m717n078n295n325m839l534k016j320j451
59198E89904j445r53o11o57m51K15N56K24K46J645L908N603O033N579M882M428
59182F19106M576N348O283O863O941O671O301O151O329O328N448L818K431J889
59168F94483J737J373R82J022J348J444J251J173J335J317O37p28k324l604m444
59153F97002n259o495q017r258r901j0109j0092r853r358q660p783o850o243o234
$$ y = [737360, 732559, 726740, 720437, 713565, 705825, 697406, 689182, 682218, 677085, 673536, 670914, 668967, 668105, 668701, 670446, 672727, 675351, 678426, 681819, 685310, 689087, 693470, 698267, 703067, 707922, 712947, 717342, 719793, 720000, 718884, 717091, 714210, 709868, 704619, 699191, 693583, 687506, 681119, 674732, 668304, 661780, 655482, 649631, 643953, 638228, 632791, 627974, 623479, 618762, 613684, 608389, 603064, 598225, 594691, 592675, 591355, 589904, 588459, 587506, 586895, 586238, 585787, 586002, 586558, 586782, 587028, 588673, 592581, 598184, 604217, 609796, 614678, 619106, 623682, 629030, 635313, 642176, 649117, 655788, 662089, 668240, 674569, 680897, 686345, 690163, 692594, 694483, 696220, 697593, 698575, 699597, 700945, 702389, 703640, 704813, 706148, 707465, 708102, 707374, 705050, 701446, 697002, 691743, 685248, 677231, 667973, 658072, 647963, 637871, 628018, 618660, 610000, 602217, 595367, 589124, 582890]
59139E82890o428o078n074m169m096m776n478n476m441k653q86J64N27Q13J471
59124E36310K387L190L667L929M397N437O829P890Q355Q741R452J0033R872R221
59110F29710Q767Q574Q252P837P589P117N772L895K650K476K606K271J534O79
59096F99729l85j691k886l677m142m344m148l574k873k193j545j087r56r58r45
59081F64325j281k263l353l852m075m896o257p174p208o891o608o192n758n804
59067E92713o225o205n464m616m046l432k663k226k289k343k149k142k492k748
59053E43673k683k562k328j557n38j86m82l69L50L96q66k132k045j165q12r67
59037E25727o66K64J190J894K626L319L777M296N143N818N802N640O334P927R606
$$ y = [582890, 576462, 570384, 565310, 561141, 557045, 552269, 546791, 541315, 536874, 534221, 533335, 533499, 534026, 534839, 536310, 538697, 541887, 545554, 549483, 553880, 559317, 566146, 574036, 582391, 591132, 600584, 610617, 620489, 629710, 638477, 647051, 655303, 663140, 670729, 677846, 683618, 687513, 690163, 692639, 695245, 697516, 699050, 699729, 699344, 697653, 694767, 691090, 686948, 682604, 678456, 674882, 672009, 669816, 668271, 667184, 666228, 665270, 664325, 663044, 660781, 657428, 653576, 649501, 644605, 638348, 631174, 623966, 617075, 610467, 604275, 598517, 592713, 586488, 580283, 574819, 570203, 566157, 562725, 560062, 557836, 555547, 553204, 551055, 548913, 546421, 543673, 540990, 538428, 536100, 534543, 534005, 533819, 533337, 532968, 533318, 533714, 532848, 530716, 528671, 527506, 526694, 525727, 525061, 525325, 526515, 528409, 531035, 534354, 538131, 542427, 547570, 553388, 559190, 564830, 571164, 579091, 588697]
59022E88697J0927J2029J2827J2928J2310J1397J0517R816R400Q957P532M454
59010G11791M17l023m941n595n675n557n181m260k664q72L33Q44J471K757M084
58995F83929M526M125L639L377K986K265J428O62j31j097k245l399m113l934k962
58980F89056j917j354j081n38N41K043L687N197O559Q125J0013J1570J2096J2010
58966G56007J2301J2909J2765J1704J0969J1222J1340J0088P936O166M957L463
58954H71827J170j772n092q362j0856j2260j3119j3964j4521j4367j3836j3453
58942G51395j3084j2336j1309j0219q882p264n898n076m248k981j757j021k79
58929F67041R27J969K118J845J938K070J507O50M25O61M78j2R3P71J074P94P42
$$ y = [588697, 599624, 611653, 624480, 637408, 649718, 661115, 671632, 681448, 690848, 699805, 707337, 711791, 712208, 709185, 704244, 698649, 692974, 687417, 682236, 677976, 675312, 674440, 674773, 675617, 677088, 679845, 683929, 688455, 692580, 696219, 699596, 702582, 704847, 706275, 706937, 706806, 705709, 703464, 700065, 695952, 692018, 689056, 687139, 685785, 684704, 684166, 684707, 686750, 690437, 695634, 702193, 710318, 720331, 731901, 743997, 756007, 768308, 781217, 793982, 805686, 816655, 827877, 839217, 849305, 857241, 863407, 868364, 871827, 872997, 871225, 866133, 857771, 846915, 834655, 821536, 807572, 793051, 778684, 764848, 751395, 738311, 725975, 714666, 704447, 695565, 688301, 682403, 677327, 673079, 670098, 668341, 667320, 667041, 667968, 669937, 672055, 673900, 675838, 677908, 679415, 680065, 680490, 681151, 681629, 681617, 681710, 682481, 683555, 684349, 685091]
58912F85091J202J487J336J520K564L862M616M966N617O879Q401R544R922R787
58898G56794R859J0464J1078J1031J0310R289Q150P153O980Q072R945J1792J3407
58885H84324J4842J5686J5501J4600J3607J2521J0954Q879O469L662O72j697l063
58872I96957m211n899p599q491q990r932j0904j0874j0111r907j0535j0991j0779
58859H77734j0437j0244r812r246r337j0276j1257j1667j1695j1547j1067j0326
58847G50823r685r059q000o590n494n150n650p119r193j0506j0049q772q421q942
58833F38193q712p319o194n994n424l559j677j392k237k453j407J56J582K891
58819E96454M065M877N411O002O609O759O179N146M188L595L207K696J985J297
$$ y = [685091, 686293, 687780, 689116, 690636, 693200, 697062, 701678, 706644, 712261, 719140, 727541, 737085, 747007, 756794, 766653, 777117, 788195, 799226, 809536, 818825, 826975, 834128, 841108, 849180, 859125, 870917, 884324, 899166, 914852, 930353, 944953, 958560, 971081, 982035, 990914, 997383, 1001045, 1001717, 1000020, 996957, 992746, 986847, 979248, 970757, 961767, 951835, 940931, 930057, 919946, 910039, 899504, 888513, 877734, 867297, 857053, 847241, 837995, 828658, 818382, 807125, 795458, 783763, 772216, 761149, 750823, 741138, 732079, 724079, 717489, 711995, 706845, 701195, 694076, 684883, 674377, 664328, 655556, 647135, 638193, 629481, 622162, 615968, 609974, 604550, 600991, 599314, 597922, 595685, 593232, 591825, 591981, 593563, 596454, 600519, 605396, 610807, 616809, 623418, 630177, 636356, 641502, 645690, 649285, 652492, 655188, 657173, 658470]
58805F58470P22O4o74j163j453k211l685n007n349n167n391n884n879n516n664
58790F06213o303o423n602m513l706k961j994q26P08K728M570N262M987M986N848
58775F02974O845P140O639N411L361P30j913m399o804q617r054q320p477o992
58761E79524o497n964n860n933n235l683k338j718j116l1R95J505J938K644L157
58746E51388L095K760K367J660Q56Q94K131L735M949N942O894P230O525N321M363
58731F10110L797L582L807M133L924L315L202L628L417K016N18N4L20N77R45J676
58715F49021K156J902J702K549M006M734M219K962J474J3j068j714k564m117n856
58700F59419p038p975r609j1973j3953j4652j4273j3548j2809j1861j0486q924
$$ y = [658470, 659192, 659256, 658582, 657419, 655966, 653755, 650070, 645063, 639714, 634547, 629156, 623272, 617393, 611877, 606213, 599910, 593487, 587885, 583372, 579666, 576705, 574711, 573885, 574593, 577321, 581891, 587153, 592140, 597126, 602974, 609819, 616959, 623598, 629009, 632370, 633100, 631187, 626788, 619984, 611367, 602313, 593993, 586516, 579524, 573027, 567063, 561203, 555270, 550035, 546352, 544014, 542296, 541180, 541149, 542144, 543649, 545587, 548231, 551388, 554483, 557243, 559610, 561270, 562126, 563020, 565151, 568886, 573835, 579777, 586671, 593901, 600426, 605747, 610110, 613907, 617489, 621296, 625429, 629353, 632668, 635870, 639498, 642915, 644931, 645449, 645503, 645823, 646400, 647345, 649021, 651177, 653079, 654781, 657330, 661336, 666070, 670289, 673251, 674725, 674738, 673670, 671956, 669392, 665275, 659419, 652381, 644406, 634797, 622824, 608871, 594219, 579946, 566398, 553589, 541728, 531242, 522318]
58688E22318p702o902n945m476l196l070l851m283l788k975k356j661q31n38j009
58673D69735j245k79J347K268K060J651K132L678N613P205Q353R472J0594J0978
58659E33562R985P912N381K371j224m558o518p207p576p762p178o100n649n989
58645D99450o072n440m823m542l876k515j288p29k68N81J422K018K841L946M420
58630D85125L778K747K096J661J107N63Lq70j727j735r66l40R6J239K923L678
58614D99378L159K960M078N402N716N454N268M601L083J692J130N32o67j192M7
58599E40641J792K097J039K7n40j141j549j148k49M70J222K441L618M164M670
58584E57554N922P435Q320Q865R822J0873J1233J1004J0549R312O738L771J978
$$ y = [522318, 514616, 507714, 501769, 497293, 494097, 491027, 487176, 482893, 479105, 476130, 473774, 472113, 471282, 470744, 469735, 468490, 468211, 469558, 471826, 473886, 475537, 477669, 481347, 486960, 494165, 502518, 511990, 522584, 533562, 543547, 551459, 556840, 559211, 557987, 553429, 546911, 539704, 532128, 524366, 517188, 511088, 505439, 499450, 493378, 487938, 483115, 478573, 474697, 472182, 470894, 470165, 469897, 470478, 471900, 473918, 476759, 480705, 485125, 488903, 491650, 493746, 495407, 496514, 497077, 497080, 496210, 494483, 492748, 491782, 491442, 491538, 492777, 495700, 499378, 502537, 505497, 509575, 514977, 520693, 526147, 531415, 536016, 539099, 540791, 541921, 542453, 541786, 540594, 540641, 542433, 544530, 545569, 545596, 545056, 543915, 542366, 541218, 540969, 541439, 542661, 545102, 548720, 552884, 557554, 563476, 570911, 579231, 588096, 597918, 608791, 620024, 631028, 641577, 650889, 657627, 661398, 663376]
58571F63376J723K398L728N592P344Q615J0129J2457J4836J6501J8155K0643K3146
58558H08643K4327K4331K3983K2818J9786J5297J0851P065L650P47j343l147n089
58545I51919o206n557m257m255n640o969p940r676j2505j5422j7767j9784k1349
58532H14592k1765k1020j9951j8942j7550j5399j2599r465o661n105m848m705
58520F56582l921l258l397l453k547j656k052k989k919k088j811j960j384l33
58506F22814o0l98l1J024J451J061R63J293R62j32p91o47o27r30n37Q51K142K632
58488F31040K834L206L584M176N604P567Q924R427R977J1033J2164J3259J4720
58475G37515J6254J6910J6448J5322J3361R961N721K157l54k832n681p933q859
$$ y = [663376, 665099, 667497, 671225, 676817, 684161, 692776, 702905, 715362, 730198, 746699, 764854, 785497, 808643, 832970, 857301, 881284, 904102, 923888, 939185, 950036, 957101, 960751, 961498, 960155, 957008, 951919, 945713, 940156, 935899, 931644, 926004, 919035, 911095, 901419, 888914, 873492, 855725, 835941, 814592, 792827, 771807, 751856, 732914, 715364, 699965, 687366, 677901, 671240, 666135, 661287, 656582, 652661, 649403, 646006, 642553, 640006, 638350, 636298, 633309, 630390, 628302, 626491, 624531, 623147, 622814, 622754, 622356, 622325, 623349, 624800, 625861, 626824, 628117, 629079, 628947, 628156, 627509, 626882, 625952, 625415, 626266, 628408, 631040, 633874, 637080, 640664, 644840, 650444, 658011, 666935, 676362, 686339, 697372, 709536, 722795, 737515, 753769, 770679, 787127, 802449, 815810, 825771, 831492, 833649, 833295, 830463, 824782, 816849, 807990]
58462H07990q815q169o673m363j864M93K904N313P375R189J1009J2405J2730J2203
58448H51727J1326R686O628K759o50l472o436r386j1314j1984j2013j1568j0423
58435H04880r014p972o858m844k315l32J120K801M642O086P453R314J0977J1381
58421H27319J0902J0575J0117Q564O170L811J232k046m873n895n999o926q204
58408H44747q098o994o882p804p785o213m421k942j081P66J289J009J973M374
58394H01938O225O642O742P013O611N702N635O360O325N346M795M650L383J228
58380H78595M13J427K148J481Q26R90P63k33k71J546L728N066O300P906Q807Q575
58364I28067Q534R418J0211J0405J1046J2525J3621J3756J3851J4103J3348J1444
$$ y = [807990, 799175, 791006, 784333, 779970, 778106, 778599, 781503, 786816, 794191, 803380, 814389, 826794, 839524, 851727, 863053, 872739, 879367, 882126, 881476, 878004, 871568, 862182, 850868, 838884, 826871, 815303, 804880, 795866, 787894, 781036, 776192, 773877, 773545, 774665, 777466, 782108, 788194, 795647, 804961, 815938, 827319, 838221, 848796, 858913, 867477, 873647, 877458, 878690, 876644, 871771, 865876, 859877, 852951, 844747, 836649, 829655, 822773, 814969, 807184, 800971, 796550, 793608, 792527, 793293, 794582, 795591, 797564, 801938, 808163, 814805, 821547, 828560, 835171, 840873, 846508, 852868, 859193, 864539, 869334, 873984, 877367, 878595, 879008, 880435, 882583, 884064, 884890, 885880, 886643, 886410, 886139, 887685, 891413, 896479, 902779, 910685, 919492, 928067, 936601, 946019, 956230, 966635, 977681, 990206, 1003827, 1017583, 1031434, 1045537, 1058885, 1070329]
58352A070329R833Q814O953M063K047J748J742J302J745L569N116N447N914P516
58338A136138R253J0420J1871J3769J4689J4363J4719J6762J8896J9625J9499
58327A300004J9182J8159J6516J5463J4898J3036R631O898O137O153O051O655
58315A438783Q045Q648Q115Q277J0008J1846J2806J3726J4892J5333J5337J6572
58303A582388J8827J9945J9661K0063K1459K1725K0618K0643K2476K3696K3310
58292A814811K3386K4790K5651K5433K6089K7758K7934K6550K7026L0385L3233
58281B113046L3564L3636L4980L5748L5415L7000M1979M7803N2702N7733O1993
58270B585599O1731N7051N3556N4187N5367N4408N4348N7634O1283O2732O4633
$$ y = [1070329, 1080162, 1088976, 1095929, 1099992, 1102039, 1103787, 1105529, 1106831, 1108576, 1112145, 1117261, 1122708, 1128622, 1136138, 1145391, 1155811, 1167682, 1181451, 1196140, 1210503, 1225222, 1241984, 1260880, 1280505, 1300004, 1319186, 1337345, 1353861, 1369324, 1384222, 1397258, 1406889, 1413787, 1419924, 1426077, 1432128, 1438783, 1446828, 1455476, 1463591, 1471868, 1481876, 1493722, 1506528, 1520254, 1535146, 1550479, 1565816, 1582388, 1601215, 1621160, 1640821, 1660884, 1682343, 1704068, 1724686, 1745329, 1767805, 1791501, 1814811, 1838197, 1862987, 1888638, 1914071, 1940160, 1967918, 1995852, 2022402, 2049428, 2079813, 2113046, 2146610, 2180246, 2215226, 2250974, 2286389, 2323389, 2365368, 2413171, 2465873, 2523606, 2585599, 2647330, 2704381, 2757937, 2812124, 2867491, 2921899, 2976247, 3033881, 3095164, 3157896, 3222529]
58259C222529O9308P4104P6595P8897Q2514Q4682Q4052Q4093Q6608Q8189Q7443
58248D119014Q8975R5322J01983J05656J10250J18971J27821J33198J38735J48044
58238E287969J57826J64897J72778J84381J95632K03550K13051K28165K44334
58229G052583K57325K71589K91498L12720L31153L51678L78727M07261M33056
58220A0087590M62524N01671N44924N86369O32133O89542P54299Q21497Q98714
58211A5979263R94335J104038J223677J364114J537602J742159J976878K259681
58203B8181747K611701L039218L552135M183271M963548N893410O966203Q205358
58195F7596591R654860J1359836J3391227J5856688J8835481K2327807K6300612
$$ y = [3222529, 3291837, 3365941, 3442536, 3521433, 3603947, 3688629, 3772681, 3856774, 3943382, 4031571, 4119014, 4207989, 4303311, 4405294, 4510950, 4621200, 4740171, 4867992, 5001190, 5139925, 5287969, 5445795, 5610692, 5783470, 5967851, 6163483, 6367033, 6580084, 6808249, 7052583, 7309908, 7581497, 7872995, 8185715, 8516868, 8868546, 9247273, 9654534, 10087590, 10550114, 11051785, 11596709, 12183078, 12815211, 13504753, 14259052, 15080549, 15979263, 16973598, 18077636, 19301313, 20665427, 22203029, 23945188, 25922066, 28181747, 30793448, 33832666, 37384801, 41568072, 46531620, 52425030, 59391233, 67596591, 77251451, 88611287, 102002514, 117859202, 136694683, 159022490, 185323102]
58188A85323102L0660117L4947748L7991324L8071895L3760193K4827638J2501854
58181C98083871j041473j3495809k3120952k9153042l1840828l2079928l0859582
58174B36492257k8889344k6557664k4055697k1475431j8870804j6317908j3928582
58167H6396827j1793657r937409q344627p003378n898337m990186m233817l605397
58159C0590019l091498k666932k304734j996161j741300j529621j346613j189966
58151A4723194j062600r57506q64056p81701p13797o54953n97347n42808m96507
58142H051919m55132m12784l72329l39597l12124k84510k59352k42238k30877
58133E142976k19430k08727k02343j97037j87094j74279j64124j55926j45409
$$ y = [185323102, 215983219, 250930967, 288922291, 326994186, 360754379, 385582017, 398083871, 397042398, 383546589, 360425637, 331272595, 299431767, 267351839, 236492257, 207602913, 181045249, 156989552, 135514121, 116643317, 100325409, 86396827, 74603170, 64665761, 56321134, 49317756, 43419419, 38429233, 34195416, 30590019, 27498521, 24831589, 22526855, 20530694, 18789394, 17259773, 15913160, 14723194, 13660594, 12703088, 11839032, 11057331, 10343534, 9688581, 9091234, 8548426, 8051919, 7596787, 7184003, 6811674, 6472077, 6159953, 5875443, 5616091, 5373853, 5142976, 4923546, 4714819, 4512476, 4315439, 4128345, 3954066, 3789942, 3634016, 3488607]
58124C488607j33792j25371j19114j11109j02595r7513r4608q9736q3523p9350
58114B451896p6152p0533o3843o0019n8412n5509n1770n0179m9892m7849m4981
58103A822757m4481m5484m4567m2032m0762m0205l7322l2439k8642k6426k4046
58092A416351k2038k2284k3682k3532k2213k1938k2273k1334k0086k0766k2375
58081A173830k2239k0814k0540k1234k0990k0280k0860k1820k0998j9084j8196
58070I46775j7818j6222j4414j4431j5183j4252j2352j1728j1672j0169q429r008
58058G91097j0720j0285q094p435q755r491r115r546j0812j0840r592r058r219
58045F68135q119n891m715m766m137k779k588l603l887l274l492m504m454l413
$$ y = [3488607, 3354815, 3229444, 3110330, 2999221, 2896626, 2799113, 2704505, 2614769, 2531246, 2451896, 2375744, 2305211, 2241368, 2181349, 2122937, 2067428, 2015658, 1965479, 1915587, 1867738, 1822757, 1778276, 1732792, 1688225, 1646193, 1605431, 1565226, 1527904, 1495465, 1466823, 1440397, 1416351, 1394313, 1372029, 1348347, 1324815, 1302602, 1280664, 1258391, 1237057, 1216971, 1196205, 1173830, 1151591, 1130777, 1110237, 1089003, 1068013, 1047733, 1026873, 1005053, 984055, 964971, 946775, 928957, 912735, 898321, 883890, 868707, 854455, 842103, 830375, 818703, 808534, 800105, 791097, 780377, 770092, 761998, 754563, 745808, 736317, 727202, 717656, 706844, 696004, 686412, 677354, 668135, 660016, 654125, 649410, 644644, 640507, 637728, 635140, 631537, 627650, 624376, 620884, 616380, 611926, 608513]
58031F08513l460m847n630n350n656o956p839p985q431q853p913o390o489p961
58017E14753q239o718n437n243m758l658l449m365m674l812l148l044k220o80
58003D55308j97j147j759j250q77j192j078l11k79j386k399l030m428o401o991
57988D22583n788m836n296n711m814l503k879k522j915j536j528j173n04n43j277
57973C78758j395o28k07m16LJ301J896R97j14l59k70k47M00J586J765L36j094
57956C82312j076k91p4n32j147j737k003j515q53j204k284k342r01M22N48N33
57940C67856J553L068M103M768N393N568N178N095N859O746O906O348N185L204
57926D36830P87r45j581j880k368k756l097m012n340n986n669n385n617n588m818
$$ y = [608513, 605053, 600206, 594576, 589226, 583570, 576614, 568775, 560790, 552359, 543506, 535593, 529203, 522714, 514753, 506514, 499796, 494359, 489116, 484358, 480700, 477251, 472886, 468212, 464400, 461252, 458208, 455988, 455308, 455111, 453964, 452205, 450955, 450078, 448886, 447808, 447497, 447218, 445832, 443433, 440403, 435975, 429574, 422583, 416795, 411959, 406663, 400952, 396138, 392635, 389756, 387234, 385319, 383783, 382255, 381082, 380578, 380035, 378758, 377363, 376735, 376528, 376112, 376115, 377416, 379312, 380309, 380195, 379836, 379566, 379319, 379719, 381305, 383070, 383406, 382312, 381236, 380945, 380871, 380339, 379192, 377455, 375452, 373937, 373084, 371880, 369596, 367254, 366353, 366775, 367323, 367856, 369409, 372477, 376580, 381348, 386741, 392309, 397487, 402582, 408441, 415187, 422093, 428441, 433626, 436830, 437617, 436672, 435091, 433211, 430843, 428087, 424990, 420978, 415638, 409652, 403983, 398598, 392981, 387393, 382575]
57911C82575l918l297k551j662j327j511j246m12r1n81p46l4N33K40q2L19Q29
57894C67038Q00P88J404K210K684L169L933M452M412M382M692M717L957K770J457
57879D12865j46j711k293j799j356j637k109k390k910l656l709k821k038k095
57865C82195k445k529k597k633j980o96J98M88J231K676L547L260L131M194N498
57850C93538N797N440N213M769L632K521K234K302K020J738J893J886J159L33
57836D34475L6l15j267k000j642r02r00j363j399j158j215j106j23J052J110J24
57820D23407o98r15j093j436j520j304j287j557j689j572j680k430l800n441o778
57805C90207p365p390p415p426o852n692m699m085l171j806r31j027j169n41K33
$$ y = [382575, 378657, 375360, 372809, 371147, 369820, 368309, 367063, 366651, 366560, 365979, 365233, 365199, 365732, 365972, 365890, 366209, 367038, 367838, 368626, 370030, 372240, 374924, 378093, 382026, 386478, 390890, 395272, 399964, 404681, 408638, 411408, 412865, 412719, 411008, 408715, 406916, 405560, 403923, 401814, 399424, 396514, 392858, 389149, 386328, 384290, 382195, 379750, 377221, 374624, 371991, 370011, 369315, 369513, 370001, 371232, 373908, 377455, 380715, 383846, 388040, 393538, 399335, 404775, 409988, 414757, 418389, 420910, 423144, 425446, 427466, 429204, 431097, 432983, 434142, 434475, 434511, 434196, 432929, 430929, 429287, 428385, 427485, 426122, 424723, 423565, 422350, 421244, 421121, 422173, 423283, 423407, 422709, 421794, 420701, 419265, 417745, 416441, 415154, 413597, 411908, 410336, 408656, 406226, 402426, 396985, 390207, 382842, 375452, 368037, 360611, 353759, 348067, 343368, 339283, 336112, 334306, 333375, 332348, 331179, 330638, 330871]
57790C30871K41j98k34K07P99J651K789L617L870M287N359O246O059N325N056
57775C75945N133M821M230M004M136M125L876L432K444Q16p01j472j867k337k436
57760D04149j790j139j224j481j085m89n07o16K91J932K929K796K268J883J589
57745D09506J503J829K106J692Q49L01L5m08q17o61k73l95p89n99O3K12l62p79
57727D13013n07J22Q94K039L293L756L097K094J625J759K057K129J760J027M49
57712D38607M95Q75Q82L16l36o19n62m69o96j391k112k052j081j00J52J07M82
57695D32498J009R16K56k11k41l25q12j579k456l298l753l584l071k523j722l48
57679D10756J400L224N362Q121J1160J3956J6640J9681K3186K7203L2345L9258
$$ y = [330871, 331112, 330914, 330680, 330887, 331686, 333337, 336126, 339743, 343613, 347900, 353259, 359505, 365564, 370889, 375945, 381078, 385899, 390129, 394133, 398269, 402394, 406270, 409702, 412146, 412962, 412261, 410789, 408922, 406585, 404149, 402359, 401220, 399996, 398515, 397430, 396941, 396434, 395818, 396109, 398041, 400970, 403766, 406034, 407917, 409506, 411009, 412838, 414944, 416636, 417485, 417786, 417821, 417413, 416596, 415935, 415662, 415267, 414478, 413879, 413942, 414154, 413792, 413013, 412506, 412628, 413522, 415561, 418854, 422610, 425707, 427801, 429426, 431185, 433242, 435371, 437131, 438158, 438607, 439102, 439977, 440859, 441175, 440839, 440220, 439658, 439189, 438493, 437102, 434990, 432938, 431857, 431757, 431909, 432016, 432498, 433507, 434423, 434679, 434468, 434227, 433902, 433090, 431511, 429055, 425757, 422004, 418420, 415349, 412826, 411104, 410756, 412156, 415380, 420742, 428863, 440023, 453979, 470619, 490300, 513486, 540689, 573034, 612292]
57667F12292M7687N6391O3436O6045O1235M7799K7495L739k0121m0735n4637o0179
57655H10447n9223n5260n0086m3522l5858k8652k3050j8831j5402j2581j0182
57644D57800p967o155n057m223k942j486o97m48K25J467K399K705L007L379K947
57629D44954J469J22j00K95K73k44o22o16m84m30m74o39q34p86l76J82N65N51
57611D42806J00m97o90k68K98M71L18J17k81j006j529j281o31m08o11n84k86m12
57593D35626j194j978k141j762j252r29r40j151j161q81p61r27o71M25J507J595
57577D23405J155J280J787J549N51K6M47Q46M43k84n50l02J27N43Q01Q77J131
57560D33832J778K291K155J932K521L577L960L573L384L668L720L451L677M513
$$ y = [612292, 659979, 716370, 779806, 845851, 907086, 954885, 982380, 986119, 965998, 925263, 870626, 810447, 751224, 695964, 645878, 602356, 566498, 537846, 514796, 495965, 480563, 467982, 457800, 449833, 443678, 438621, 434398, 431456, 429970, 429273, 428825, 429050, 430517, 432916, 435621, 438628, 442007, 444954, 446423, 446545, 446445, 446740, 447013, 446769, 446147, 445531, 445047, 444617, 444143, 443504, 442670, 441884, 441508, 441690, 442255, 442806, 442906, 442409, 441719, 441451, 441749, 442220, 442538, 442655, 442374, 441368, 439839, 438558, 437927, 437519, 436908, 436324, 436038, 435626, 434432, 432454, 430313, 428551, 427299, 426370, 425430, 424279, 423118, 422237, 421476, 420549, 419878, 420303, 421810, 423405, 424560, 425840, 427627, 429176, 429727, 429753, 430200, 431046, 431489, 431205, 430655, 430353, 430480, 431023, 431824, 432701, 433832, 435610, 437901, 440056, 441988, 444509, 448086, 452046, 455619, 459003, 462671, 466391, 469842, 473519, 478032]
57546D78032M927M317L224K121Q62j95k3J472K975L569L809M343M723M360L559
57531E22075K804K090J591J881K782L144K549K088K617L436L613L496L794M256
57517E62216M350M385M799N143M916M606M803N058M741M357M684N260N032M089
57503F28439L442L403L374L093K897K857K614K122J665J287R26R75J806K918L418
57488F65236L294L314L759M090L943L624L472L428L461L819M604N498O078O147
57474G23767N734N056M443M094L939L869L889L871L510K882K673L444M884O194
57460G82249O920P131P015O845O940P335P546P178O520O227O518P073P537P802
57446H80836P966Q191Q523Q688Q380P784P472P620P786P683P608P886Q382Q897
$$ y = [478032, 482959, 487276, 490500, 492621, 493483, 493288, 493265, 494737, 497712, 501281, 505090, 509433, 514156, 518516, 522075, 524879, 526969, 528560, 530441, 533223, 536367, 538916, 541004, 543621, 547057, 550670, 554166, 557960, 562216, 566566, 570951, 575750, 580893, 585809, 590415, 595218, 600276, 605017, 609374, 614058, 619318, 624350, 628439, 631881, 635284, 638658, 641751, 644648, 647505, 650119, 652241, 653906, 655193, 656119, 657094, 658900, 661818, 665236, 668530, 671844, 675603, 679693, 683636, 687260, 690732, 694160, 697621, 701440, 706044, 711542, 717620, 723767, 729501, 734557, 739000, 743094, 747033, 750902, 754791, 758662, 762172, 765054, 767727, 771171, 776055, 782249, 789169, 796300, 803315, 810160, 817100, 824435, 831981, 839159, 845679, 851906, 858424, 865497, 873034, 880836, 888802, 896993, 905516, 914204, 922584, 930368, 937840, 945460, 953246, 960929, 968537, 976423, 984805, 993702]
57432I93702R556J0355J0884J0882J0611J0304R763Q995Q627R094R874J0187J0051
57419A122885J0054J0368J0643J0752J0907J1174J1321J1183J0868J0644J0744
57408A241543J1185J1698J2017J2267J2591J2577J1734J0596J0400J1384J2323
57397A370315J2228J1577J1249J1230J1264J1852J3443J5150J5601J4832J4285
57386A513026J4949J6410J7795J8708J9110J8936J8236J7370J6843J7001J7710
57375A706094J8257J7922J6872J6025J5780J5503J4667J3843J3905J4801J5774
57364A879443J6397J6702J6789J6922J7599J8840J9859K0114K0174K0774K1559
57353B085172K1752K1574K1912K2834K3604K3986K4452K5093K5370K5159K5046
$$ y = [993702, 1003258, 1013613, 1024497, 1035379, 1045990, 1056294, 1066057, 1075052, 1083679, 1092773, 1102647, 1112834, 1122885, 1132939, 1143307, 1153950, 1164702, 1175609, 1186783, 1198104, 1209287, 1220155, 1230799, 1241543, 1252728, 1264426, 1276443, 1288710, 1301301, 1313878, 1325612, 1336208, 1346608, 1357992, 1370315, 1382543, 1394120, 1405369, 1416599, 1427863, 1439715, 1453158, 1468308, 1483909, 1498741, 1513026, 1527975, 1544385, 1562180, 1580888, 1599998, 1618934, 1637170, 1654540, 1671383, 1688384, 1706094, 1724351, 1742273, 1759145, 1775170, 1790950, 1806453, 1821120, 1834963, 1848868, 1863669, 1879443, 1895840, 1912542, 1929331, 1946253, 1963852, 1982692, 2002551, 2022665, 2042839, 2063613, 2085172, 2106924, 2128498, 2150410, 2173244, 2196848, 2220834, 2245286, 2270379, 2295749, 2320908, 2345954]
57342B345954K5344K5587K5316K4650K3906K3255K2962K3384K4421K5420K5883
57331B616082K5924K5968K6273K6813K7324K7525K7526K7809K8540K9150K9062
57320B917996K8514K8207K8466K9145L0009L0657L0603L0056L0158L1550L3182
57309C248543L3478L2428L1418L1244L1502L1916L2922L4515L5698L5701L5041
57298C614406L4764L5186L5858L6336L6525L6548L6596L6730L6796L6747L6908
57287D013400L7609L8618L9440L9954M0292M0244L9554L8734L8770L9862M1206
57276D447683M2127M2796M3522M4042M3914M3137M2088M1064M0220L9645L9381
57265D909619L9444L9808M0188M0084L9365L8606L8440L8828L9372M0036M0941
$$ y = [2345954, 2371298, 2396885, 2422201, 2446851, 2470757, 2494012, 2516974, 2540358, 2564779, 2590199, 2616082, 2642006, 2667974, 2694247, 2721060, 2748384, 2775909, 2803435, 2831244, 2859784, 2888934, 2917996, 2946510, 2974717, 3003183, 3032328, 3062337, 3092994, 3123597, 3153653, 3183811, 3215361, 3248543, 3282021, 3314449, 3345867, 3377111, 3408613, 3440529, 3473451, 3507966, 3543664, 3579365, 3614406, 3649170, 3684356, 3720214, 3756550, 3793075, 3829623, 3866219, 3902949, 3939745, 3976492, 4013400, 4051009, 4089627, 4129067, 4169021, 4209313, 4249557, 4289111, 4327845, 4366615, 4406477, 4447683, 4489810, 4532606, 4576128, 4620170, 4664084, 4707221, 4749309, 4790373, 4830593, 4870238, 4909619, 4949063, 4988871, 5029059, 5069143, 5108508, 5147114, 5185554, 5224382, 5263754, 5303790, 5344731]
57254E344731M1783M2179M2339M2615M2612M1683M0201L9323L9446L9750L9428
57243E796090L8427L6895L4869L2851L1701L1514L1359L0593K9725K9521K9971
57232F153516L0631L1371L2261L3161L3979L4914L6017L6928L7400L7676L7984
57221F535838L8043L7485L6425L5248L4104L2912L1577K9963K7923K5606K3445
57210F888569K1653K0007J8187J6026J3382J0263P235N130M171L760L358L028
57198G014769K929K839K565K327K312K236J709Q22n6p67j344j759j997k229k589
57183G021767k959l099k881k186q80Q91K543L486L674L657M078N150O554P726
57169G047521Q254P986O880M968K458m03l645p341j1023j3943j6112j8514k1780
$$ y = [5344731, 5386514, 5428693, 5471032, 5513647, 5556259, 5597942, 5638143, 5677466, 5716912, 5756662, 5796090, 5834517, 5871412, 5906281, 5939132, 5970833, 6002347, 6033706, 6064299, 6094024, 6123545, 6153516, 6184147, 6215518, 6247779, 6280940, 6314919, 6349833, 6385850, 6422778, 6460178, 6497854, 6535838, 6573881, 6611366, 6647791, 6683039, 6717143, 6750055, 6781632, 6811595, 6839518, 6865124, 6888569, 6910222, 6930229, 6948416, 6964442, 6977824, 6988087, 6995322, 7000452, 7004623, 7008383, 7011741, 7014769, 7017698, 7020537, 7023102, 7025429, 7027741, 7029977, 7031686, 7032508, 7032452, 7031685, 7030341, 7028582, 7026585, 7024356, 7021767, 7018808, 7015709, 7012828, 7010642, 7009762, 7010653, 7013196, 7016682, 7020356, 7024013, 7028091, 7033241, 7039795, 7047521, 7055775, 7063761, 7070641, 7075609, 7078067, 7077664, 7074019, 7066678, 7055655, 7041712, 7025600, 7007086, 6985306]
57156F985306k5305k8189l0483l2758l4980l6591l7327l7153l5848l3513l1066
57145F622093k9186k7140k3759j9347j5417j2618j0201p636n519m592m951o582
57133F455145r777j4533k0239k6147l1615l5868l8277l8856l7791l4644k8912
57122F138486k1273j3205n595J270O684R990J2107J5074J9953K6449L4739M5941
57110F270620O0459P7464R6619J18893J45155J75520K10834K53604L06807L73047
57100H089022M55330N57134O81011Q28171R99667J196142J415891J654878J909561
57091A7786807K178178K458815K747517L037510L316807L565722L759383L871517
57083D2722256L869232L703053L315066K674760J815149Q31840j56598j052667
$$ y = [6985306, 6960001, 6931812, 6901329, 6868571, 6833591, 6797000, 6759673, 6722520, 6686672, 6653159, 6622093, 6592907, 6565767, 6542008, 6522661, 6507244, 6494626, 6484425, 6476789, 6471270, 6466678, 6461727, 6455145, 6445368, 6430835, 6410596, 6384449, 6352834, 6316966, 6278689, 6239833, 6202042, 6167398, 6138486, 6117213, 6104008, 6098413, 6099683, 6106367, 6116357, 6128464, 6143538, 6163491, 6189940, 6224679, 6270620, 6331079, 6408543, 6505162, 6624055, 6769210, 6944730, 7155564, 7409168, 7715975, 8089022, 8544352, 9101486, 9782497, 10610668, 11610335, 12806477, 14222368, 15877246, 17786807, 19964985, 22423800, 25171317, 28208827, 31525634, 35091356, 38850739, 42722256, 46591488, 50294541, 53609607, 56284367, 58099516, 58931356, 58774758, 57722091]
57075E7722091j799938k380794k805917l100885l291477l394608l419831l375578
57067C4153063l271926l119710k930178k715190k485840k251005k018052j793884
57059A3567278j584001j391287j216922j061771r25899q07635p04581o15108n38026
57050D722048m71526m13692l63584l20673k83643k50877k21790j96581j74765
57041B024917j55101j36938j20727j06973r5379q5162p5658o6510n7690m9412
57031A075367m1697l4074k6062j7773r463o03R829K1693L2672L9233L8624K9858
57019A117604J3485q640l3067n5101p0794p9041q1393p9746p4904o7489n9157
57008E21757n1788m5861m0626l5686l1479k8209k5328k2345j9400j6757j4339
$$ y = [57722091, 55922153, 53541359, 50735442, 47634557, 44343080, 40948472, 37528641, 34153063, 30881137, 27761427, 24831249, 22116059, 19630219, 17379214, 15361162, 13567278, 11983277, 10591990, 9375068, 8313297, 7387398, 6579763, 5875182, 5260074, 4722048, 4250522, 3836830, 3473246, 3152573, 2868930, 2618053, 2396263, 2199682, 2024917, 1869816, 1732878, 1612151, 1505178, 1409799, 1324637, 1248979, 1182469, 1124779, 1075367, 1033670, 999596, 973534, 955761, 946298, 945695, 955524, 977217, 1009889, 1049122, 1087746, 1117604, 1131089, 1122449, 1089382, 1034281, 963487, 884446, 803053, 723307, 648403, 580914, 521757, 469969, 424108, 383482, 347796, 316317, 288108, 262780, 240435, 221035, 204278, 189939]
56997A89939j2098j0231q753p226n264k924m38K096M582O891R132J1585J4218
56984A91509J6609J8337J9049J8167J5154J0297M816j02m019p029r248j0687j1267
56971B51586j0849r569q029o728n434l642j579OJ096K614N156Q221J1028J3423
56957B47300J5513J6933J6933J4898J0569M219l042r577j4251j6911j7837j7246
56945B47501j5559j3518j1525r265o456l562j300L54K198N004Q903J3411J7813
56932B33999K1636K4803K7159K7827K5493J9520J0548K0j0373j8878k4103k5855
56920C11796k5258k3708k1922k0092j8355j6732j4996j3021j1052r334p771o241
56908A23314m945m150l762l423k830j864o96J28J12m62n96L58J986L387M173M618
$$ y = [189939, 177841, 167610, 158857, 151631, 146367, 143443, 143005, 145101, 149683, 156574, 165706, 177291, 191509, 208118, 226455, 245504, 263671, 278825, 289122, 293938, 293836, 289817, 282788, 273540, 262853, 251586, 240737, 231168, 223139, 216411, 210977, 207335, 205756, 205762, 206858, 209472, 214628, 222849, 233877, 247300, 262813, 279746, 296679, 311577, 322146, 326365, 323323, 313746, 299495, 282584, 264747, 247501, 231942, 218424, 206899, 197634, 191178, 187616, 186316, 186670, 188868, 193872, 202775, 216186, 233999, 255635, 280438, 307597, 335424, 360917, 380437, 390985, 391005, 380632, 361754, 337651, 311796, 286538, 262830, 240908, 220816, 202461, 185729, 170733, 157712, 146660, 137326, 129555, 123314, 118369, 114219, 110457, 107034, 104204, 102340, 101644, 101772, 101884, 101422, 100826, 101184, 103170, 106557, 110730, 115348]
56892A15348N154O020P208Q589J0137J2080J4451J6512J7082J5565J2246P611
56880B48003K044l607p981j0288j1004j0944j0173q377n846l348j168J077L700
56867A82088O610R778J3517J8070K3187K8229L2716L6567L9743M1454L9991L3743
56855E05693K2740R009m639j6046k4162k8736l0022k8615k5264k0787j5968j1203
56843C32000o229o13N515J1636J7713K4301L1686L9637M8069N7054O5430P0172
56831F96371O8084N8092M1482K0506k424k4370m1989n2846n6615n4861m9882m3662
56819E57886l7421l1523k5632j9206j2148n111J059O300J1585J7934K5362L2990
56807E22075L9755M4444M5246M0197K8549J1640p613k5778l9901m8352n1233m9838
$$ y = [115348, 120502, 126522, 133730, 142319, 152456, 164536, 178987, 195499, 212581, 228146, 240392, 248003, 250047, 246440, 238459, 228171, 217167, 206223, 196050, 187673, 181827, 178479, 177311, 178388, 182088, 188698, 198476, 211993, 230063, 253250, 281479, 314195, 350762, 390505, 431959, 471950, 505693, 528433, 537442, 532803, 516757, 492595, 463859, 433837, 405222, 379958, 359171, 343203, 332000, 325771, 325158, 330673, 342309, 360022, 384323, 416009, 455646, 503715, 560769, 626199, 696371, 764455, 822547, 864029, 884535, 882111, 857741, 815752, 762906, 706291, 651430, 601548, 557886, 520465, 488942, 463310, 444104, 431956, 426845, 427904, 434204, 445789, 463723, 489085, 522075, 561830, 606274, 651520, 691717, 720266, 731906, 724293, 698515, 658614, 610262, 559029, 509191]
56795E09191m5742m0468l5403l1075k6712k1373j5529j0555o695k714K172P244
56783B82341J1745J6089K0677K4383K5320K2692J6947Q768j112j1291k0031k6227
56771C70301k9659l0470k9139k6651k3968k1297j8429j5599j3368j1770j0278
56760A39673q639p234o448o113n725m924l765k601j752j189p27m89p88j392j461
56745H6426n62O47J175Q24J65l28o21q16q74o42MQ58J323J022M93O18J320J559
56727I2591R29L28N92J296J625J637J790J861J344M97J01L24O60P51N73M1p58
56710A06182j233r38l18r5r5M08J372J880J460O74K70L63O52R08J056J101J120
56693A14767J112R34O04L99M03L39J30J56N25O23N3n10j64R63K055K784L286L331
$$ y = [509191, 463449, 422981, 387578, 356503, 329791, 308418, 292889, 282334, 275639, 272925, 275097, 282341, 294086, 310175, 330852, 355235, 380555, 403247, 420194, 428962, 427850, 416559, 396528, 370301, 340642, 310172, 281033, 254382, 230414, 209117, 190688, 175089, 161721, 149951, 139673, 131034, 123800, 117352, 111239, 105514, 100590, 96825, 94224, 92472, 91283, 90556, 90067, 89279, 87887, 86426, 85864, 86511, 87686, 88510, 88675, 88347, 87726, 86910, 86036, 85394, 85398, 86256, 87579, 88601, 89094, 89712, 91032, 92591, 93520, 93848, 94440, 95736, 97361, 98998, 100788, 102649, 103993, 104490, 104591, 104915, 105575, 106326, 106899, 106940, 106182, 104949, 104011, 103693, 103598, 103503, 103911, 105283, 107163, 108623, 109297, 109567, 109930, 110582, 111490, 112546, 113647, 114767, 115879, 116813, 117417, 117816, 118219, 118558, 118688, 118844, 119369, 119992, 120045, 119535, 119371, 120334, 122389, 125173, 128459, 131790]
56675A31790K567J437P81O13K01o47j329j533j576j596j303p29l57k55P1O80R01
56658A29716L86k67m09j88o3J9L96J004J382J265Q52N52O01Q57R45P08L64J33
56640A38253m9j77O6P93J447J392P24Rn00q30q04l19J15j12p76j140j073j085
56622A35934j270j093l29M89P72M82n0m83o00n65q60j526j830j239l81k21n98
56605A26632o13j72m7m01m58J95R89J271R51J36r56j586j075K5M01j04j86R12
56587A25914K188K322J384M17J14N10J301J865J579O73J58M83R81J067J128J609
56571A43693K040J834J392J590K522L559M313M863N308N719O346P366Q626R932
56557B09103J1220J2018J1306Q492M295J55k938m695n146m664m009l638l195k329
$$ y = [131790, 134357, 135794, 136575, 137188, 137389, 136742, 135413, 133880, 132304, 130708, 129405, 128676, 128319, 128064, 128135, 128815, 129716, 130102, 129835, 129426, 129238, 129175, 129194, 129590, 130594, 131976, 133241, 134093, 134645, 135246, 136103, 137048, 137756, 138120, 138253, 138204, 138027, 138093, 138886, 140333, 141725, 142449, 142458, 141958, 141128, 140324, 140005, 140120, 140008, 139232, 138092, 137019, 135934, 134664, 133571, 133242, 133731, 134503, 134985, 134935, 134452, 133852, 133287, 132427, 130901, 129071, 127832, 127451, 127230, 126632, 126019, 125847, 125800, 125399, 124941, 125136, 126125, 127396, 128347, 128483, 127527, 125941, 124866, 124891, 125292, 125188, 125002, 125914, 128102, 130424, 131808, 132225, 132339, 132849, 134150, 136015, 137594, 138267, 138425, 138908, 139889, 140956, 142084, 143693, 145733, 147567, 148959, 150549, 153071, 156630, 160943, 165806, 171114, 176833, 183179, 190545, 199171, 209103, 220323, 232341, 243647, 252139, 256434, 256589, 253651, 248956, 243810, 239146, 235137, 231499, 228304, 225975]
56543B25975j656k131l510m381l879k727k140k307k459k178j888j992k139j787
56529A90801j123q44j126j428j387j222j034n11K66M63k89j033p13K63O69L06
56513A82058J4J07L0m39q42j016j323j618j153J13J175J372J143R97O85J0m78
56496A80835l04J26K39J80L45M92R7q12j658j994j786j278p99n04k05J85L04o3
56478A73400k89L06J183J204N27N43J631K380J706M42k0L42O55O09N15M82N09
56461A86125P85J143Q16l94j343r08L67R85N51N6L39J126J697J748J439J097J033
56444A96662J340J792K075J988J460N98k13n74m90k48J5K11Ro55j038m38M80L29
56426B03303j007k150k169j540r18k35M31M43k15n35M5P95J103J463K173K267
$$ y = [225975, 224319, 222188, 218678, 214297, 210418, 207691, 205551, 203244, 200785, 198607, 196719, 194727, 192588, 190801, 189678, 188834, 187708, 186280, 184893, 183671, 182637, 182126, 182392, 182855, 182566, 181533, 180820, 181083, 181752, 182058, 182072, 182179, 182209, 181770, 180928, 179912, 178589, 176971, 175818, 175931, 177106, 178478, 179621, 180618, 181303, 181313, 180835, 180531, 180657, 180896, 181076, 181421, 181913, 182010, 181198, 179540, 177546, 175760, 174482, 173683, 173179, 172974, 173159, 173463, 173400, 173111, 173417, 174600, 175804, 176331, 176874, 178505, 180885, 182591, 183033, 183013, 183355, 184010, 184619, 185134, 185616, 186125, 186910, 188053, 188869, 188475, 187132, 186224, 186591, 187576, 188127, 188183, 188522, 189648, 191345, 193093, 194532, 195629, 196662, 198002, 199794, 201869, 203857, 205317, 205915, 205702, 205128, 204638, 204390, 204405, 204616, 204625, 203970, 202932, 202494, 202974, 203303, 202296, 200146, 197977, 196437, 195519, 195284, 195715, 196158, 195943, 195408, 195453, 196248, 197351, 198814, 200987, 203254]
56410B03254R89o07q85J73J185J307Q50M17L42P05J141R93K65j19L84J095J188
56393B12677Q59O87O12M28N14J148J743J674J186P51K42m16o68k62P4r6O2J236
56375B22451K503K581J728J093Q78N44K68O23J301J549J497J721J864J146j8l78
56359B41351L30J173J549J746K029K249K381K463K179J370O96P76J141R92O01
56344B63026P21J116R99N89Q29J669K052J664J417J945K739L058K787K286K015
56329B88912K350L180L796L742L470L565L847L883L700L336K407J067M36J012
56315C28703J565R17j75m03j78p00j486r82P55K054K239K260K700L006L030L503
56299C46808M634N689O312O869P250O712N285M048L641L716L914M272M523M271
$$ y = [203254, 204243, 203636, 202751, 202924, 204109, 205416, 206266, 206683, 207025, 207730, 208871, 209864, 210129, 210010, 210394, 211489, 212677, 213536, 214223, 214835, 215263, 215777, 216925, 218668, 220342, 221528, 222279, 222521, 222105, 221437, 221175, 221249, 221153, 221215, 222451, 224954, 227535, 229263, 230356, 231234, 231778, 232046, 232669, 233970, 235519, 237016, 238737, 240601, 241747, 241729, 241351, 241681, 242854, 244403, 246149, 248178, 250427, 252808, 255271, 257450, 258820, 259516, 260292, 261433, 262425, 263026, 263747, 264863, 265862, 266451, 267280, 268949, 271001, 272665, 274082, 276027, 278766, 281824, 284611, 286897, 288912, 291262, 294442, 298238, 301980, 305450, 309015, 312862, 316745, 320445, 323781, 326188, 327255, 327691, 328703, 330268, 331185, 331010, 330607, 330429, 329729, 328243, 327261, 328016, 330070, 332309, 334569, 337269, 340275, 343305, 346808, 351442, 357131, 363443, 370312, 377562, 384274, 389559, 393607, 397248, 400964, 404878, 409150, 413673, 417944]
56285D17944L966M518N880P113P888Q630R328R516R466R956J0876J1402J1603
56272E28086J2381J3789J4861J5267J5724J6608J7619J8867K0831K3124K4884
56261G22041K6506K9336L3409L7253M0325M4012M9520N6370O3676P1486Q0103
56250A254037Q9219R8479J07980J17705J27301J36673J45808J53870J59513J62235
56240B552820J62329J59565J53078J42640J28711J11225Q9763O5024L8738J1924
56230C615817j5297m1991o6092q6219j02606j16038j26993j35807j42375j45705
56220B636694j45115j41722j37275j31876j24628j16231j08740j02634r6343q8973
56210A443157q1474p4716o8399o2391n7209n2641m7708m2499l8217l5075l2015
$$ y = [417944, 421910, 426428, 432308, 439421, 447309, 455939, 465267, 474783, 484249, 494205, 505081, 516483, 528086, 540467, 554256, 569117, 584384, 600108, 616716, 634335, 653202, 674033, 697157, 722041, 748547, 777883, 811292, 848545, 888870, 932882, 982402, 1038772, 1102448, 1173934, 1254037, 1343256, 1441735, 1549715, 1667420, 1794721, 1931394, 2077202, 2231072, 2390585, 2552820, 2715149, 2874714, 3027792, 3170432, 3299143, 3410368, 3500131, 3565155, 3603893, 3615817, 3600520, 3558529, 3492437, 3406218, 3303612, 3187574, 3060581, 2924774, 2782399, 2636694, 2491579, 2349857, 2212582, 2080706, 1956078, 1839847, 1731107, 1628473, 1532130, 1443157, 1361683, 1286967, 1218568, 1156177, 1098968, 1046327, 998619, 956120, 917903, 882828, 850813]
56199H50813k8844k6583k5219k3246k0069j6881j4543j2507j0478r072q210o917
56187F48244n294m702n299n545m707l699k895j517J52N01o11j278p07l49q08m62
56171F11024J423K963K693J925K282L184L620M194N532O714P131P917R701J1000
56157F81303J0707J0240J1205J2848J3800J4609J6392J8637K0406K2252K5070
56146H57469K8391L1676L5885M1997M9341N6909O4771P2670P9047Q3022Q5587
56135A486765Q7051Q5298P8631O8640N8301M8910M0858L5341L2837L1229K7837
56124B081698K2289J5598Q014k20p462j2378j6015k0296k5748l2399m1303n2968
56112A918810o5442p5879q2941q6272q5203p9892p2271o4146n5664m6950l9258
$$ y = [850813, 821969, 795386, 770167, 746921, 726852, 709971, 695428, 682921, 672443, 663371, 655161, 648244, 642950, 638248, 632949, 627404, 622697, 618998, 616103, 614586, 614738, 615239, 614628, 613350, 612643, 612294, 611486, 611024, 612447, 615410, 618103, 620028, 622310, 625494, 629114, 633308, 638840, 645554, 652685, 660602, 670303, 681303, 692010, 702250, 713455, 726303, 740103, 754712, 771104, 789741, 810147, 832399, 857469, 885860, 917536, 953421, 995418, 1044759, 1101668, 1166439, 1239109, 1318156, 1401178, 1486765, 1573816, 1659114, 1737745, 1806385, 1864686, 1913596, 1954454, 1989795, 2022632, 2053861, 2081698, 2103987, 2119585, 2127599, 2127379, 2119917, 2107539, 2091524, 2071228, 2045480, 2013081, 1971778, 1918810, 1853368, 1777489, 1694548, 1608276, 1523073, 1443181, 1370910, 1306764, 1251100, 1204150, 1164892]
56101A164892l2962k6530j9369j3505j0398q386n528k692j401p63P69K610L669
56088A050406M795O886Q556Q404P828Q717J0204J0544J0322J0930J1573J0954
56076A160119J0229J1199J3087J4055J4482J5675J6893J6772J6308J7327J9242
56065A325388K0239K0360K0705K1004K0691K0867K2414K3762K3357K2465K2834
56054A564086K3513K2936K2071K2396K2851K2034K1317K2445K4189K4765K5260
56043A817863K7148K8766K8136K7017K8169L0778L2617L4556L8742M4346M9162
56032B187300N3366N7636N9919N8337N5116N3426N2725N1327N0673N2424N4332
56021B786581N4046N4080N7773O3254O6932O9864P4737P9711Q1621Q2528Q6431
$$ y = [1164892, 1131930, 1105400, 1086031, 1072526, 1062128, 1053742, 1048214, 1045522, 1044121, 1043358, 1044127, 1046737, 1050406, 1055201, 1062087, 1070643, 1079047, 1086875, 1095592, 1105796, 1116340, 1126662, 1137592, 1149165, 1160119, 1170348, 1181547, 1194634, 1208689, 1223171, 1238846, 1255739, 1272511, 1288819, 1306146, 1325388, 1345627, 1365987, 1386692, 1407696, 1428387, 1449254, 1471668, 1495430, 1518787, 1541252, 1564086, 1587599, 1610535, 1632606, 1655002, 1677853, 1699887, 1721204, 1743649, 1767838, 1792603, 1817863, 1845011, 1873777, 1901913, 1928930, 1957099, 1987877, 2020494, 2055050, 2093792, 2138138, 2187300, 2240666, 2298302, 2358221, 2416558, 2471674, 2525100, 2577825, 2629152, 2679825, 2732249, 2786581, 2840627, 2894707, 2952480, 3015734, 3082666, 3152530, 3227267, 3306978, 3388599, 3471127, 3557558]
56010C557558R1978R5213R7039J01037J06306J09629J12428J18327J26015J31753
56000D647283J36729J44499J53614J60436J66657J76172J87243J96035K04878
55991F173546K18286K33880K46655K59101K77075K98654L17728L35775L59017
55982H719717L86681M13583M41585M76519N16618N56530N99718O53695P16288
55973A3480934P80936Q52003R39515J042579J154876J282946J440837J630684
55965B2605310J848814K107592K429944K826933L305423L893102M626356N514844
55957D9158318O548387P738463R124315J0748307J2667245J4977684J7772648
55950A28735367K1073894K4854052K9051422L3331180L6687435L7440508L3972976
$$ y = [3557558, 3649536, 3744749, 3841788, 3942825, 4049131, 4158760, 4271188, 4389515, 4515530, 4647283, 4784012, 4928511, 5082125, 5242561, 5409218, 5585390, 5772633, 5968668, 6173546, 6391832, 6625712, 6872367, 7131468, 7408543, 7707197, 8024925, 8360700, 8719717, 9106398, 9519981, 9961566, 10438085, 10954703, 11511233, 12110951, 12764646, 13480934, 14261870, 15113873, 16053388, 17095967, 18250843, 19533789, 20974626, 22605310, 24454124, 26561716, 28991660, 31818593, 35124016, 39017118, 43643474, 49158318, 55706705, 63445168, 72569483, 83317790, 95985035, 110962719, 128735367, 149809261, 174663313, 203714735, 237045915, 273733350, 311173858, 345146834]
55943C45146834K5739118J3699368j07499j3382092k4223192l1498513l4992813
55936B80381211l5287979l3370041l0198037k6495606k2756877j9289217j6230136
55929I6753318j3597651j1369503r516783p990060o724800n673126m808398m100218
55921C2972779l510403l014285k603037k263316j974252j724963j515891j341368
55913A5025264j187965j050727r34626q38519p52751o73804o06935n52662n03976
55904G923299m58404m20366l89973l61094l32083l07450k87672k67830k47349
55895D851078k30831k18151k03705j86746j72689j62877j52429j39816j29353
55886C254481j22429j14897j05175r6796r0864q3832p4840o8076o5698o5028o4441
$$ y = [345146834, 370885952, 384585320, 384477821, 371095729, 346872537, 315374024, 280381211, 245093232, 211723191, 181525154, 155029548, 132272671, 112983454, 96753318, 83155667, 71786164, 62269381, 54279321, 47554521, 41881395, 37072997, 32972779, 29462376, 26448091, 23845054, 21581738, 19607486, 17882523, 16366632, 15025264, 13837299, 12786572, 11851946, 11013427, 10260676, 9586872, 8979937, 8427275, 7923299, 7464895, 7044529, 6654556, 6293462, 5961379, 5653929, 5366257, 5098427, 4851078, 4620247, 4402096, 4198391, 4011645, 3838956, 3676079, 3523650, 3383834, 3254481, 3132052, 3017155, 2911980, 2815184, 2724320, 2640488, 2565648, 2497572, 2431874, 2366846, 2302405]
55875B302405o5581o8223o9273o8348o8328o9208o7528o2999n9493n8216n6073
55864A589135n2063m9197m8500m7043m3607m0617l8826l5608l0320k6000k4017
55853A153337k2070j9224j7930j9253k0881k1579k3018k5469k6397k5041k4035
55842I08440k4635k4663k2926k1451k1466k1142j9218j7166j6046j4704j2657
55831F92366j1335j1125j0496r187q865r569r165p349o508p515q332p960q019
55818E76941r200r873r471r637j0623j0354q332o868p009o821n263l988l790k927
55804D72785p02Q53P60J088L203N347N886N830O031N138K456r6j065j776l515
55789E02223n092n330n303n926n856m089k311k429l889n463p613j0924j4101j5550
$$ y = [2302405, 2236824, 2168601, 2099328, 2030980, 1962652, 1893444, 1825916, 1762917, 1703424, 1645208, 1589135, 1537072, 1487875, 1439375, 1392332, 1348725, 1308108, 1269282, 1233674, 1203354, 1177354, 1153337, 1131267, 1112043, 1094113, 1074860, 1053979, 1032400, 1009382, 983913, 957516, 932475, 908440, 883805, 859142, 836216, 814765, 793299, 772157, 752939, 735773, 719727, 705023, 692366, 681031, 669906, 659410, 650223, 641358, 631789, 622624, 615275, 608767, 601252, 592920, 584960, 576941, 567741, 557868, 548397, 538760, 528137, 517783, 509451, 502583, 495574, 488753, 483490, 479502, 475712, 472785, 472083, 472936, 473696, 474784, 477987, 483334, 489220, 495050, 501081, 506219, 508675, 508579, 507514, 505738, 502223, 497131, 491801, 486498, 480572, 474716, 470627, 468316, 465887, 461998, 456535, 448922, 437998, 423897, 408347]
55775D08347j5415j4411j2383r548p336o427n649m222l170l217l297k604k060
55762C18608k297k151p74O33P30j42j330l157n414o652o449o467p780r125r238
55747B58995q891r023q861p639o289n723n154l841k679k467k338j578j168j829
55733A91515k334j588o05n58o15L09J241P64n20j191j426k153k983l026k732l015
55717A71083l369k765j625j095j056n97J61L36r6l53j43K69P57J197J237R41R36
55700A65818J267J146M11q5j51q04k237k986k240j339j560k103j759j044q86o38
55684A50810P86K792L995M311M558M885N035N314N834N675M328L024L078L800
55670B08225L574K198O14p59j911k216j277j73k23j011j117m17p0n06q56l22R30
$$ y = [408347, 392932, 378521, 366138, 356590, 349254, 342827, 337178, 332956, 329786, 326569, 323272, 320668, 318608, 316311, 314160, 313386, 314019, 314749, 314607, 313277, 310120, 304706, 298054, 291605, 285138, 277358, 268233, 258995, 250104, 241081, 232220, 224581, 218292, 212569, 207415, 203574, 200895, 198428, 196090, 194512, 193344, 191515, 189181, 187593, 186988, 186430, 185815, 186124, 187365, 188129, 187609, 186418, 184992, 182839, 179856, 176830, 174098, 171083, 167714, 164949, 163324, 162229, 161173, 160576, 160737, 161073, 160977, 160624, 160481, 160750, 161507, 162704, 163941, 164882, 165818, 167085, 168231, 168642, 168557, 168406, 167602, 165365, 162379, 160139, 158800, 157240, 155137, 153378, 152334, 151448, 150810, 151596, 154388, 158383, 162694, 167252, 172137, 177172, 182486, 188320, 193995, 198323, 201347, 204425, 208225, 211799, 213997, 214611, 213852, 211941, 209725, 208448, 208275, 208052, 207041, 205924, 205507, 205437, 204931, 204075, 203753, 204683]
55653B04683K143K446J360m60j618j738j981l106m042l497k018j202j640k771
55639A86559m069n157n452m833m093l859l676l057k466k362k267j812j690k327
55625A39439k704j824m03K57K31L47N07P4o31q28o65q49j323j655k112l105m038
55608A20718m042l319k670k170j540j143j341j459o71N20R60N53R7j35m26p19
55592A03213p83r05j300j361n39N37Q98O21L54J62o1K42J411K532K567J991J985
55575A11564K595L035L312M110N407O542P345Q020Q239P561O414N412M167J924
55561A85647q75k962l924m450n117n946o821p429p162o002m955m737m620l666
55547A16981k292j505j272r63o57p09o35J44J063J249J059J370J933J915J517
$$ y = [204683, 206826, 209272, 210632, 210172, 208554, 206816, 204835, 201729, 197687, 194190, 192172, 190970, 189330, 186559, 182490, 177333, 171881, 167048, 162955, 159096, 155420, 152363, 149897, 147535, 145268, 143456, 141766, 139439, 136735, 134911, 134508, 134765, 134996, 135343, 135850, 135924, 135293, 134465, 133800, 132951, 131628, 129973, 127861, 124756, 120718, 116676, 113357, 110687, 108517, 106977, 105834, 104493, 103034, 102363, 102883, 103843, 104396, 104493, 104358, 103932, 103213, 102430, 101525, 100225, 98864, 98325, 98862, 99760, 100381, 100735, 100897, 100836, 101078, 102489, 105021, 107588, 109579, 111564, 114159, 117194, 120506, 124616, 130023, 136565, 143910, 151930, 160169, 167730, 174144, 179556, 183723, 185647, 184772, 181810, 177886, 173436, 168319, 162373, 155552, 148123, 140961, 134959, 130004, 125267, 120647, 116981, 114689, 113184, 111912, 110949, 110292, 109583, 108948, 109092, 110155, 111404, 112463, 113833, 115766, 117681, 119198]
55532A19198J521J683J170J80m41p84j533k353k279j503j138j427j683j852k469
55517A06290l231l232k595k302k453k210j520j274j631j747j341j101j290j343
55503G9020j091j057j290j129l87L14N99P13P46N39L45N36P58M58J8K28P78O40
55485H0738k47j002j337j626j671r31O0J69m18m67R1kr40j237j89Q15M00p72j158
55466G0276n00K17K52k88q63r61m99Rjm11p19q29q83o58kN05K92j35L8M60K55
55445F5555k49N4J081J530R21J32j78l04n50q61j369j961j563M79K539K255K8
55428F7539j252l45Q18M74m49l90K49L18J10O13J551J802J122J89n44r24o32L85
55410G0634J335J367N82l39j036j450j418r05k91L0L1j66m31m80j22K80K34pK01
$$ y = [119198, 120719, 122402, 123572, 123752, 123311, 122527, 120994, 118641, 116362, 114859, 113721, 112294, 110611, 108759, 106290, 103059, 99827, 97232, 94930, 92477, 90267, 88747, 87473, 85842, 84095, 82754, 81653, 80363, 79020, 77929, 76872, 75582, 74453, 74066, 74380, 74979, 75692, 76438, 76977, 77322, 77858, 78616, 79074, 79092, 79320, 80098, 80738, 80491, 79489, 78152, 76526, 74855, 73924, 73984, 74153, 73735, 73268, 73359, 73357, 72417, 71180, 70991, 71806, 72206, 71434, 70276, 69776, 69993, 70245, 69957, 69094, 68133, 67634, 67643, 67642, 67231, 66512, 65683, 64800, 64142, 64140, 64645, 64937, 64802, 64840, 65300, 65555, 65306, 65360, 66441, 67971, 68892, 69024, 68846, 68542, 67992, 67131, 65762, 63801, 62238, 62717, 65256, 67511, 67539, 66287, 65942, 66760, 67234, 66785, 66395, 66644, 66962, 67072, 67685, 69236, 71038, 72160, 72349, 71805, 70881, 70249, 70634, 71969, 73336, 73918, 73579, 72543, 71093, 69675, 68770, 68479, 68509, 68540, 68374, 67943, 67463, 67341, 67621, 67855, 67848, 68049]
55391F8049P54R30O26M41M98L41Q8L74R94Q81k26j316j646j483j059j26R80J288
55373G0388P53M90R28J086L74l17j57L09K93j0k33p24j623k148j724r56n49k66
55355F5914K11M50J53o2K85O34M52K30M10L79m47j327j167o9J057J790K165J981
55337G3039J164J86n63j251j798j497k39Q29Q14L28K93L47l73j649k527k614k060
55320F2429q73O59J565J275N79M80P24N05l1j52J11J83P0J79M25M65N02Q01R22
55301G0818M30p8K24J001J261Q23K32l98j216j687j079J71P82L20m43p80p00l34
55283F9347K79Q18Q88O53N87O35L56k54q22j266j621j482n19O17Q63J96m12m29
55265F8434k72k46pO78J399J724J751J724J565J145O69M72N39M46j41j011j494
$$ y = [68049, 68803, 69733, 70359, 70800, 71298, 71639, 71727, 72101, 73095, 73976, 73750, 72434, 70788, 69305, 68246, 68120, 69100, 70388, 71141, 71631, 72559, 73645, 74019, 73702, 73545, 73854, 74147, 74137, 73904, 73180, 71557, 69409, 67685, 66729, 66180, 65914, 66125, 66575, 66728, 66666, 66951, 67585, 68037, 68267, 68677, 69056, 68609, 67282, 66115, 66046, 67103, 68893, 71058, 73039, 74203, 74389, 73826, 72575, 70777, 69280, 69041, 69870, 70684, 71012, 71305, 71652, 71279, 69630, 67103, 64489, 62429, 61556, 62215, 63780, 65055, 65634, 66114, 66838, 67343, 67312, 67160, 67271, 67454, 67524, 67703, 68128, 68593, 69095, 69896, 70818, 71248, 71170, 71394, 72395, 73656, 74479, 74711, 74313, 73097, 71410, 70331, 70502, 71284, 71604, 71161, 70381, 69681, 69347, 69626, 70444, 71332, 71985, 72572, 73207, 73563, 73309, 72487, 71221, 69600, 68118, 67599, 68216, 69079, 69275, 68863, 68434, 68162, 67916, 67909, 68587, 69986, 71710, 73461, 75185, 76750, 77895, 78564, 79036, 79575, 80021, 79880, 78869, 77375]
55248G7375j230o41l51l30j86j30p32j706j944j159l51k00q0N69J048N92j71j96
55230G0177K84K91j78k90Q4K40p3l37k27P4M98J127J656J591R88L79P1O5L48O95
55210G7463N81Jk26L81J021P55Lk14Pj94p67q72m86m54q15n63O30J704J674Q18
55190H0447j12q74j453j525q91L1N92M74k35j090j351n36R27K046K292J882J195
55173H1819M58n5j86k32n42q64p26l45l76q01q76l34K07J88j66l46j93J85O25
55154G7440Q80Q06O58P41Q20L89m06q14n04oJ10j29l60l44J9O30R82N51m85j282
55134G9696j333r73p13n00J2P18J042N99k65p61m71K16O17O39P32J054J221J019
55116H2549Q18Q92Q98M48k16o18o86n69k75J18K49L5m7L38Q34J043J177J539J828
$$ y = [77375, 76145, 75504, 75153, 74823, 74637, 74507, 73775, 72069, 70125, 68966, 68615, 68415, 68335, 68904, 69952, 70544, 70373, 70177, 70461, 70752, 70574, 70284, 70368, 70608, 70535, 70198, 69971, 70045, 70543, 71670, 73326, 74917, 75905, 76284, 76355, 76420, 76768, 77463, 78044, 78045, 77819, 78200, 79221, 79976, 79979, 79765, 79772, 79578, 78811, 77939, 77453, 76999, 76184, 75621, 76251, 77955, 79629, 80447, 80335, 79461, 78008, 76483, 75592, 75623, 76215, 76689, 76454, 75364, 74013, 73477, 74404, 76450, 78742, 80624, 81819, 82277, 82222, 82036, 81804, 81262, 80398, 79672, 79327, 78951, 78150, 77274, 76940, 77147, 77335, 77169, 76823, 76630, 76815, 77440, 78320, 79126, 79784, 80525, 81345, 81734, 81328, 80514, 80010, 80004, 80114, 79985, 79625, 79281, 79300, 79930, 80912, 81463, 80978, 79696, 78363, 77390, 76677, 76177, 76189, 76907, 77949, 78548, 78283, 77522, 77051, 77267, 77884, 78523, 79255, 80309, 81530, 82549, 83367, 84259, 85157, 85605, 85389, 84771, 84085, 83516, 83241, 83359, 83608, 83643, 83596, 83934, 84768, 85811, 86988, 88527, 90355]
55097I0355J625J040L50m64j192j162j91Q68J308J520J956K001J062n4k27J22
55081I8917k35j189j440o49J61L42L01L09K8m70m90J56P80R52R25Q18L20m77r37
55062I8122q29n72l81q6J88J08n4K31N91R8j021j394n27M05L54k21m34m01p31
55043I3446j355j666j380o42K70R25Q90K81k37k61j0K14M12N49L88j19p06j099
55025H9900j136o77N6L52j30p07o38l31n70r81n74M38Q51M21J11L01K65j92k68
55006H6491K55M61l0l44pJ54l57n83K30J165J053K94mJ95J87QK62R07J355J461
54986I3153J488J377R47N31O11J085J462J460R51j80j483j889r19N38J368J530
54970A02030J487J037j96j558j834q49L09P55O09L30K2l05m47k93q7j11k67k20
$$ y = [90355, 91980, 93020, 93370, 92906, 91714, 90552, 90361, 91229, 92537, 94057, 96013, 98014, 99076, 99022, 98795, 98917, 98682, 97493, 96053, 95404, 95565, 95907, 96208, 96517, 96545, 96075, 95585, 95741, 96521, 97473, 98398, 99216, 99536, 99059, 98122, 97293, 96721, 96340, 96254, 96442, 96550, 96496, 96727, 97318, 97416, 96395, 95001, 94474, 94879, 95233, 95012, 94578, 94177, 93446, 92091, 90425, 89045, 88403, 88673, 89598, 90488, 90769, 90532, 90271, 90261, 90475, 90887, 91436, 91824, 91705, 90999, 89900, 88764, 88087, 88143, 88495, 88365, 87658, 87020, 86689, 86119, 85138, 84564, 85002, 85853, 86274, 86385, 86686, 86951, 86759, 86491, 86746, 87207, 87177, 86833, 86826, 86980, 86623, 86040, 86270, 87435, 88488, 88782, 88778, 88973, 89160, 89168, 89430, 90337, 91692, 93153, 94641, 96018, 96965, 97496, 98107, 99192, 100654, 102114, 103065, 102885, 101402, 99513, 98594, 99132, 100500, 102030, 103517, 104554, 104358, 102800, 100966, 100117, 100426, 101181, 101790, 102120, 102142, 101837, 101390, 101097, 101010, 100899, 100632, 100412]
54952A00412J42N16O21O72J063J526J160k53j581j711j029o61o48j12R61J507
54936A02585J044K93j94p04j254j167k71O40J116J634K283K171J042J81P30K118
54920A12247L201L963M964O036O691P120P581P489O260M379K621Q02j492l617
54906A68245m601m737n147o062o671o498n778m735l451k362j896j780j499j124
54892A11904r38o41J04P06L63n23p43P1J135J791K091K191K149K283K913L752
54876A28608M282M613N149N722N878N822O055O193N241L068O27j365l027m442
54862A72424n208n232n181n718o658p161o500m680k605j457j487j787j633j524
54848A15593k166l023k955k030j418j596j703r84J46P92O39M0m38l93j8p1r65
$$ y = [100412, 100554, 101070, 101691, 102363, 103426, 104952, 106112, 105859, 104278, 102567, 101538, 100877, 100229, 100117, 101078, 102585, 103629, 103922, 103728, 103024, 101770, 100603, 100332, 100972, 102088, 103722, 106005, 108176, 109218, 109399, 110129, 112247, 115448, 119411, 124375, 130411, 137102, 144222, 151803, 159292, 165552, 169931, 172552, 173354, 171862, 168245, 163644, 158907, 153760, 147698, 141027, 134529, 128751, 124016, 120565, 118203, 116307, 114527, 113028, 111904, 110966, 110325, 110429, 111135, 111498, 110975, 110232, 110303, 111438, 113229, 115320, 117511, 119660, 121943, 124856, 128608, 132890, 137503, 142652, 148374, 154252, 160074, 166129, 172322, 177563, 180631, 181258, 179893, 176866, 172424, 167216, 161984, 156803, 151085, 144427, 137266, 130766, 126086, 123481, 122024, 120537, 118750, 117117, 115593, 113427, 110404, 107449, 105419, 104001, 102405, 100702, 99718, 99864, 100656, 101295, 101335, 100897, 100504, 100486, 100415, 99450]
54831I9450k043k318j676p21K35J182J743J481P76L78K24l15j079j131k88N10
54815I6408O16M48N42Q16J033J174J016K66n95n54N06J465J485J000O97M61l4
54798A06750m54l24J74N91R26J315J460R99J21p09j279j472j009Q4J124J468J277
54781A11042J044P14l0q03o55O10J923K141J383Q22J261K315L050L094K915L148
54765A33974L994N158O098O302N751N155N305N959N901M350J852n85k625m365
54751A82224n564n928n818n857o016n813n256m740m179l202k094j658j963k127
54737A22009j627j027j010j339j254m32Q03J861K189J570M40k96o4R48K124L027
54721A27922L615M134M852N687O258O347O098N527M294K313J72j623l310n160
$$ y = [99450, 97407, 95089, 93413, 92692, 92927, 94109, 95852, 97333, 98109, 98487, 98711, 98396, 97317, 96186, 95898, 96408, 97024, 97472, 98014, 98830, 99863, 101037, 102053, 102319, 101724, 101170, 101676, 103141, 104626, 105626, 106323, 106784, 106750, 106296, 105972, 106146, 106737, 107663, 108978, 110438, 111437, 111558, 110849, 109570, 108098, 107089, 107173, 108297, 109765, 111042, 112086, 112800, 112770, 111967, 111312, 111922, 113845, 115986, 117369, 118191, 119452, 121767, 124817, 127911, 130826, 133974, 137968, 143126, 149224, 155526, 161277, 166432, 171737, 177696, 183597, 187947, 189799, 189214, 186589, 182224, 176660, 170732, 164914, 159057, 153041, 147228, 141972, 137232, 133053, 129851, 127757, 126099, 124136, 122009, 120382, 119355, 118345, 117006, 115752, 115320, 116123, 117984, 120173, 121743, 122183, 121887, 121823, 122771, 124895, 127922, 131537, 135671, 140523, 146210, 152468, 158815, 164913, 170440, 174734, 177047, 177219, 175596, 172286, 167126]
54707A67126o575o763o010n262m717l854k719k008j845j604j101q68r44o10K11
54692A22457M45n81j937k292j594q12n62p43j160j738k246k325j784o83O44J571
54676A06660J548P43j6r8L91R60J207R06J18o85j085j316j863k504k420j423k60
54659A00863M25P75J079J217J107R95R57O94J36k94l37k16rN46J326J606J030
54642A11900J71l04m10m09k60k0p5m97o95l05J96K79J50K34M25M65M62M35jq36
54622A10905j198n55K60J64m92m70M00R75N64j90l71O8O15R77J152J128Q78M85
54604A15295M8l48n51l90R1O04Q29O23L6o75j177j322j202r07m22J38M68M09J90
54585A11737J17J72J25j07l54l92j65J35K95L60O03R48Q24p9j119j363p80j48
$$ y = [167126, 160551, 153788, 147778, 142516, 137799, 133945, 131226, 129218, 127373, 125769, 124668, 123800, 122856, 122246, 122457, 122902, 122321, 120384, 118092, 116498, 115686, 115124, 114381, 113221, 111483, 109237, 106912, 105128, 104445, 105089, 106660, 108208, 108951, 108935, 108837, 109228, 110188, 111395, 112301, 112419, 111734, 110649, 109333, 107470, 104966, 102546, 101123, 100863, 101288, 102063, 103142, 104359, 105466, 106461, 107418, 108112, 108248, 107954, 107617, 107401, 107392, 107938, 109264, 110870, 111900, 112071, 111767, 111357, 110948, 110688, 110668, 110593, 110096, 109401, 109096, 109292, 109571, 109721, 109955, 110380, 110845, 111307, 111742, 111741, 110905, 109707, 109152, 109412, 109576, 109084, 108614, 109014, 109989, 110553, 110363, 109992, 110060, 110675, 111652, 112804, 113932, 114810, 115295, 115343, 114995, 114444, 114054, 114145, 114749, 115578, 116201, 116237, 115562, 114385, 113063, 111861, 110954, 110532, 110670, 111138, 111547, 111737, 111854, 112026, 112151, 112044, 111690, 111298, 111133, 111268, 111563, 111923, 112526, 113474, 114298, 114219, 113100, 111737, 110957, 110809]
54567A10809J17L23P05R58P74K33m49r93r17kJ096J514J433J710K215J763P7j424
54549A19942j443m15M69Q29R13P27L24K91R47J569J351O02K06K99L74K60J56k4
54531A27377m88r98j215j263j376j344r73o36o40n30J73R40Q77Q4n41n66l19j47
54513A18415k26p93j731k208j590m81M4j3K18R69J562J609J415J212Q60M24J89
54496A19875O5k37m94k56J78O8m79n55P2N57L33o7N8O17J113J285J029K61o85
54477A22738j139q80l75LM52J180J896K192K058J761J530J459J412R96Q1p73q73
54460A33718l16K47O17J072J489J358P86N36Q19R04K95n57j071j320j496j389
54444A35692r21n79o96q35m58K55P51Q65P22L19k81p02p07n74n95n61k25J48J92
$$ y = [110809, 110926, 111249, 111954, 112912, 113686, 113919, 113470, 112477, 111560, 111558, 112654, 114168, 115601, 117311, 119526, 121289, 121366, 119942, 118499, 118084, 118553, 119382, 120295, 121022, 121346, 121637, 122584, 124153, 125504, 126106, 126312, 126611, 126985, 127245, 127401, 127377, 126889, 125891, 124676, 123413, 122037, 120693, 119720, 119084, 118444, 117914, 118087, 119027, 119904, 119988, 119447, 118881, 118562, 118415, 118189, 117396, 115665, 113457, 111867, 111386, 111430, 111417, 111635, 112604, 114166, 115775, 117190, 118402, 119262, 119686, 119875, 119940, 119703, 119209, 118953, 119131, 119199, 118720, 118165, 118237, 118794, 119127, 119060, 119118, 119735, 120848, 122133, 123162, 123423, 122738, 121599, 120719, 120344, 120347, 120799, 121979, 123875, 126067, 128125, 129886, 131416, 132875, 134287, 135283, 135364, 134591, 133718, 133402, 133649, 134266, 135338, 136827, 138185, 138971, 139507, 140326, 141230, 141525, 140968, 139897, 138577, 137081, 135692, 134771, 134192, 133496, 132661, 132203, 132458, 133209, 134074, 134796, 135115, 134834, 134132, 133425, 132851, 132256, 131695, 131470, 131618, 131810]
54425A31810J19L65P58P31K35r0K47R66J407J247P58M31M06L46l7m75n04k65l93
54406A38062j030j476j171n12k48m27m26J50J049J762K010J842J526J282J069
54391A43462P07K89J16J63Nn16r02o31R3N88M81o9p34j261j437j113k98Q19J829
54372A41591K142J451K73m00j35N78J256K064L182M087M099L374K646K195J735
54357A70138J178P99N79Q3p96j570j903k103k493k775k479j790j409j622j966
54342A51871j884j404r69q44q66p63n21l51l61m47m69m26l32j09K43M20N6p20
54324A42124j214q75N0P36O56J8o15q74p33l76j24k43o23p84m28J09K69k7m23
54305A36623p42j091j348j097k71N91R90R81P97M24r8l93k46o8k76n33j41Q69
$$ y = [131810, 131929, 132294, 133052, 133783, 134018, 133928, 134175, 135141, 136548, 137795, 138553, 138984, 139390, 139736, 139699, 139224, 138720, 138455, 138062, 137032, 135556, 134385, 133873, 133625, 133198, 132772, 132922, 133971, 135733, 137743, 139585, 141111, 142393, 143462, 144169, 144458, 144574, 144737, 144742, 144226, 143324, 142693, 142786, 143374, 143855, 143786, 143052, 141791, 140354, 139241, 138943, 139762, 141591, 143733, 145184, 145457, 145057, 144922, 145500, 146756, 148820, 152002, 156089, 160188, 163562, 166208, 168403, 170138, 171316, 172115, 172694, 172777, 171981, 170411, 168508, 166405, 163912, 161137, 158658, 156868, 155459, 153837, 151871, 149987, 148583, 147614, 146770, 145904, 145141, 144620, 144269, 143908, 143461, 142992, 142566, 142234, 142125, 142368, 142788, 142844, 142124, 140910, 140035, 140085, 140821, 141477, 141495, 140880, 140006, 139273, 138897, 138773, 138530, 137907, 137123, 136695, 136804, 137073, 137046, 136623, 135881, 134790, 133442, 132345, 132074, 132665, 133655, 134636, 135433, 135857, 135759, 135366, 135120, 135052, 134776, 134243, 134102, 134971]
54287A34971J708J830J422Q55K45l26o73p46o79m62J04R39J600J767J530J045
54271A45130L05o07j296j409r86l68J25L33L02K84N07R01J225J462J774K122K190
54254A51994J822J219O61K81R3k9l76j023j462j050Q3J004J074N57Km60r33j282
54236A52175j353j335j472j563j169k81O06J012Q48K79m47j041j235r91n33j66
54220A43334m9p1L1L94P91Q11L42k20l38K1K69k15j290k045j764p95m2K66P47
54201A40177J603J987J186j71q99q32o60n16R2R37Q90l72j565j384j75P56Q93
54184A41947P47P18O31L62J61K53N80J023J539J994K152J891J312O27J6m99j047
54167A54407j622j838j367o21m45q79r21N0J168J198K81l16o2K19j83p21m75L81
$$ y = [134971, 136679, 138509, 139931, 140786, 141031, 140705, 140032, 139286, 138607, 138145, 138249, 139188, 140788, 142555, 144085, 145130, 145435, 144828, 143532, 142123, 141137, 140769, 140894, 141227, 141529, 141813, 142320, 143221, 144446, 145908, 147682, 149804, 151994, 153816, 155035, 155696, 155977, 156070, 156041, 155665, 154642, 153180, 152130, 152213, 153217, 154291, 154848, 154850, 154390, 153457, 152175, 150822, 149487, 148015, 146452, 145283, 145002, 145608, 146620, 147468, 147747, 147300, 146259, 145024, 144033, 143500, 143334, 143285, 143214, 143245, 143639, 144430, 145241, 145583, 145363, 145025, 145046, 145315, 145100, 143810, 141765, 140001, 139206, 139164, 139430, 140177, 141780, 143767, 144953, 144782, 143883, 143051, 142391, 141875, 141967, 142904, 143794, 143422, 141857, 140473, 140298, 141054, 141947, 142694, 143412, 144043, 144405, 144566, 144819, 145399, 146422, 147961, 149955, 152107, 153998, 155310, 155937, 155953, 155454, 154407, 152785, 150947, 149580, 148959, 148514, 147635, 146714, 146764, 147932, 149130, 149411, 149095, 149033, 149252, 149069, 148348, 147873, 148254]
54149A48254P29l7j259j823j339l79K57L08Q7n4j31l44o14n14K28J249J794J485
54131A47897P35K68K82L35N3l68m80j74L06P64J101J158Q28L50J53L88Q32J234
54113A55662J494J557J444J394J622J934J871J323O39J55j08j74J9M36R08J380
54097A71556J877K249K303K203K307K500K217J249J5j094k089k867k956k207j299
54082A75964r58j053r29m09J03L06L28L77N33Q33J283J763K135K445K760K939
54066A88420K769K291J806J546J433J099K37r70j829j846j352j086j173j069n31
54051A89745K8L18O07J033J228J125J483K775M148M372L546K902L070L538L902
54036B23820M581N891P205P746P644P575P659P393O604N820N535N564N382M772
$$ y = [148254, 148983, 148946, 147687, 145864, 144525, 144146, 144403, 144711, 144798, 144744, 144613, 144269, 143655, 143141, 143369, 144618, 146412, 147897, 148632, 148900, 149182, 149517, 149570, 149202, 148722, 148548, 148854, 149618, 150719, 151877, 152705, 153055, 153208, 153596, 154428, 155662, 157156, 158713, 160157, 161551, 163173, 165107, 166978, 168301, 168940, 169095, 168987, 168813, 168832, 169268, 170176, 171556, 173433, 175682, 177985, 180188, 182495, 184995, 187212, 188461, 188476, 187382, 185293, 182426, 179470, 177263, 175964, 175006, 173953, 173024, 172615, 172718, 173024, 173352, 173729, 174262, 175095, 176378, 178141, 180276, 182721, 185481, 188420, 191189, 193480, 195286, 196832, 198265, 199364, 199601, 198631, 196802, 194956, 193604, 192518, 191345, 190276, 189745, 189773, 190091, 190698, 191731, 192959, 194084, 195567, 198342, 202490, 206862, 210408, 213310, 216380, 219918, 223820, 228401, 234292, 241497, 249243, 256887, 264462, 272121, 279514, 286118, 291938, 297473, 303037, 308419, 313191]
54022C13191L834K655J355L66J13L27J77p01j751k383k807l490m222m424m165
54007B98075m119m562n096n387n525n563n428n316n470n491m685l246k255k244
53993B33688k650k955l326l664l139j502N5K90n03j227j560j805j741q81L84J065
53977B10529Q77L33k83j044j546j063K88J491J878J702J372R77P45J150K173L113
53961B22692L492L643M161N224O605P846Q265P301N115K481J6k120l761m548m436
53946B61976l821l044k099r49K36J318K237K800K873K764K966L472L806L771L616
53931B81922L406K930K383K438L280M162M312L878L614L958M763N645O272O527
53917C39490O640O983P664Q513R413J0281J0721J0271R105Q036P535P218O494
$$ y = [313191, 317025, 319680, 321035, 321401, 321514, 321841, 322018, 321317, 319566, 317183, 314376, 310886, 306664, 302240, 298075, 293956, 289394, 284298, 278911, 273386, 267823, 262395, 257079, 251609, 246118, 241433, 238187, 235932, 233688, 231038, 228083, 224757, 221093, 217954, 216452, 216507, 216797, 216294, 215067, 213507, 211702, 209961, 209080, 209464, 210529, 211406, 211739, 211456, 210412, 208866, 207803, 208091, 209582, 211460, 213162, 214534, 215511, 216256, 217406, 219579, 222692, 226184, 229827, 233988, 239212, 245817, 253663, 261928, 269229, 274344, 276825, 276841, 274721, 270960, 266412, 261976, 258155, 255111, 253012, 252063, 252299, 253617, 255854, 258654, 261527, 264291, 267257, 270729, 274535, 278306, 281922, 285328, 288258, 290641, 293079, 296359, 300521, 304833, 308711, 312325, 316283, 321046, 326691, 332963, 339490, 346130, 353113, 360777, 369290, 378703, 388984, 399705, 409976, 419081, 427117, 434652, 441870, 448364]
53904D48364N244L657J887J90j053j839k679l792m573m407l741l786n120p077
53890D21275q530r024q966q972r158r153q709q156p969q051p831p063o173n640
53876C07880n429n278n171n164m973m198k963k010k019k917l939m395m319m211
53862B50894m216l877k934j988j843k358k627k303k082k582l358l459k689j766
53848B12812j376j475j528j223p66n97q39j131j060o37j33L27Q05J196J238Q71
53832B06484L15k20o03o55k87K45O01Q23J207J679J826J492R43M13LL5Q43K042
53814B17186K653K276J620J512J928K365K709L132L566L821M031M475N126N738
53800B62138O261O733O950O708O261O043N963N420M141K678J847J953K650L362
$$ y = [448364, 453608, 457265, 459152, 459342, 458289, 456450, 453771, 449979, 445406, 440999, 437258, 433472, 428352, 421275, 412745, 403721, 394755, 385783, 376625, 367472, 358763, 350607, 342638, 334587, 326756, 319693, 313520, 307880, 302451, 297173, 292002, 286838, 281865, 277667, 274704, 272694, 270675, 267758, 263819, 259424, 255105, 250894, 246678, 242801, 239867, 237879, 236036, 233678, 231051, 228748, 226666, 224084, 220726, 217267, 214578, 212812, 211436, 209961, 208433, 207210, 206444, 205847, 205008, 203877, 202817, 202180, 202047, 202374, 203179, 204375, 205613, 206484, 206799, 206579, 205976, 205321, 205034, 205279, 205880, 206703, 207910, 209589, 211415, 212907, 213850, 214263, 214266, 214301, 215144, 217186, 219839, 222115, 223735, 225247, 227175, 229540, 232249, 235381, 238947, 242768, 246799, 251274, 256400, 262138, 268399, 275132, 282082, 288790, 295051, 301094, 307057, 312477, 316618, 319296, 321143, 323096, 325746, 329108]
53786C29108L675L393K566J490N73l0n81j420k493l419m103m865n811o497o591
53771C04995o485o727p048o654n442m230l659l519l376l301l533l832l697l028
53757B40464k244j748j545j402j274j441k057k642k452j577j109j699k443k076
53743B14755q64k69p63j192o85K4j56r42j156l91N92R22M74k00l68L21J430K152
53725B13684K230K098J998J589P69J75L20Q44J226J648K423L034K698J671J033
53710B37440J236J682J818J875K242K766L060L117L177L217K889K059J130P37
53696B68445J085J788K414L009L806M611M967M797M355L544J949k32j985k589
53682B99964k390k125k019j972k012k034j579n17M50N97J82L8M56R41R76M82k27
$$ y = [329108, 332783, 336176, 338742, 340232, 340805, 340775, 340194, 338774, 336281, 332862, 328759, 323894, 318083, 311586, 304995, 298510, 291783, 284735, 278081, 272639, 268409, 264750, 261231, 257855, 254554, 251021, 247189, 243492, 240464, 238220, 236472, 234927, 233525, 232251, 230810, 228753, 226111, 223659, 222082, 220973, 219274, 216831, 214755, 213891, 213622, 212859, 211667, 210982, 211006, 210850, 209908, 208752, 208361, 208953, 209875, 210349, 210149, 209781, 210102, 211532, 213684, 215914, 218012, 220010, 221599, 222368, 222543, 222863, 223707, 224933, 226581, 229004, 232038, 234736, 236407, 237440, 238676, 240358, 242176, 244051, 246293, 249059, 252119, 255236, 258413, 261630, 264519, 266578, 267708, 268445, 269530, 271318, 273732, 276741, 280547, 285158, 290125, 294922, 299277, 302821, 304770, 304538, 302553, 299964, 297574, 295449, 293430, 291458, 289446, 287412, 285833, 285316, 285766, 286363, 286545, 286583, 287039, 287980, 288956, 289438, 289211]
53665B89211n77p4J010J688J318L52m27q92j295j513j240n74J80R23J436J151
53649B90677L9q98q40l63m91r77p29L82J367J711J852K076K146K155K598L284
53633C03989L349K685K259K588K985K834K608K917L478L755L819L855L551K826
53619C47498K441K997L827L866L207K809K868K617J768J171J685L011M164M607
53605C88536M549M348M050L623L298L416L870M015L413K439J732J222L19r30j598
53590D26302j144k38J69M4o7j68p37j787k727l199l393l410k995k150j452j349
53574D01699j529j430j062q45q64q37p52r46j369j389p14o7k68r25q68J03P40
53557C88677rj561k467k147j181k13O07J209J393J224J103J245J471J618J792
$$ y = [289211, 288634, 288560, 289570, 291258, 292576, 292928, 292501, 291609, 290314, 288801, 287561, 286987, 287167, 288090, 289526, 290677, 290716, 289818, 288978, 288615, 288124, 287147, 286418, 286800, 288167, 289878, 291730, 293806, 295952, 298107, 300705, 303989, 307338, 310023, 312282, 314870, 317855, 320689, 323297, 326214, 329692, 333447, 337266, 341121, 344672, 347498, 349939, 352936, 356763, 360629, 363836, 366645, 369513, 372130, 373898, 375069, 376754, 379765, 383929, 388536, 393085, 397433, 401483, 405106, 408404, 411820, 415690, 419705, 423118, 425557, 427289, 428511, 428830, 427900, 426302, 425158, 424920, 425089, 425133, 425066, 424898, 424161, 422374, 419647, 416448, 413055, 409645, 406650, 404500, 403048, 401699, 400170, 398740, 397678, 396833, 395969, 395132, 394380, 393434, 392065, 390676, 389962, 389895, 389627, 388702, 387834, 387937, 388677, 388668, 387107, 384640, 382493, 381312, 381099, 381706, 382915, 384308, 385532, 386635, 387880, 389351, 390969, 392761]
53542C92761K053K278K410K513K576K569K759L535M779N888O511O881P279P664
53528D52456Q016Q542R274R851J0085J0328J0941J1758J2464J3213J4288J5445
53516E86661J6146J6396J6828J7898J9339K0566K1315K1807K2429K3427K4682
53505H07494K5757K6217K6054K5679K5434K5165K4386K2910K1214J9981J9350
53494A069641J8838J8102J7565J7904J9079K0201K0487K0044J9558J9394J9262
53483A280075J8701J7733J6875J6582J6793J7169J7445J7406J6592J4634J1892
53472A461897R259P145N095K637n6k716n519q527j1081j2561j3287j3954j4486
53459A403846j4377j3913j4007j4828j5656j6157j6882j8137j9371k0011k0223
$$ y = [392761, 394814, 397092, 399502, 402015, 404591, 407160, 409919, 413454, 418233, 424121, 430632, 437513, 444792, 452456, 460472, 469014, 478288, 488139, 498224, 508552, 519493, 531251, 543715, 556928, 571216, 586661, 602807, 619203, 636031, 653929, 673268, 693834, 715149, 736956, 759385, 782812, 807494, 833251, 859468, 885522, 911201, 936635, 961800, 986186, 1009096, 1030310, 1050291, 1069641, 1088479, 1106581, 1124146, 1142050, 1161129, 1181330, 1201817, 1221861, 1241419, 1260813, 1280075, 1298776, 1316509, 1333384, 1349966, 1366759, 1383928, 1401373, 1418779, 1435371, 1450005, 1461897, 1471156, 1478301, 1483396, 1486033, 1485977, 1483261, 1477742, 1469215, 1458134, 1445573, 1432286, 1418332, 1403846, 1389469, 1375556, 1361549, 1346721, 1331065, 1314908, 1298026, 1279889, 1260518, 1240507, 1220284]
53448A220284k0310k0104j9365j8240j7005j5832j5032j4841j4780j3913j2099
53437A038763j0165q615p050n284l962l429k903j633o0J064J949L097M146M522
53423A010440M736N748P444Q969J0354J2466J5319J7788J9233K0264K1501K2695
53411A176957K3566K4647K6543K8945L1012L2423L3582L5041L7008L9229M1188
53400A530141M2616M3826M5328M7128M8838N0295N1587N2579N3081N3437N4247
53389B073103N5391N6091N6035N5661N5114N3769N1333M8581M6401M4634M2549
53378B638662L9935L6970L3445K8972K3865J9034J4874J0853O290J124m290r781
53366B839953j5566k1978k8957l5757m1287m5003m7239m8539m9003m8657m8117
$$ y = [1220284, 1199974, 1179870, 1160505, 1142265, 1125260, 1109428, 1094396, 1079555, 1064775, 1050862, 1038763, 1028598, 1019983, 1012933, 1007649, 1003687, 1000258, 997355, 995722, 995662, 996726, 998675, 1001772, 1005918, 1010440, 1015176, 1020924, 1028368, 1037337, 1047691, 1060157, 1075476, 1093264, 1112497, 1132761, 1154262, 1176957, 1200523, 1225170, 1251713, 1280658, 1311670, 1344093, 1377675, 1412716, 1449724, 1488953, 1530141, 1572757, 1616583, 1661911, 1709039, 1757877, 1808172, 1859759, 1912338, 1965419, 2018856, 2073103, 2128494, 2184585, 2240620, 2296281, 2351395, 2405164, 2456497, 2505078, 2551479, 2596113, 2638662, 2678597, 2715567, 2749012, 2777984, 2801849, 2820883, 2835757, 2846610, 2852900, 2854024, 2849734, 2839953, 2824387, 2802409, 2773452, 2737695, 2696408, 2651405, 2604166, 2555627, 2506624, 2457967, 2409850]
53355B409850m8153m8661m8677m7591m5785m3944m2251m0640l9339l8647l8444
53344A927718l8422l8653l9393m0321m0530l9509l7750l6096l4734l3166l1038
53333A518106k8549k6103k3891k1925k0223j8818j7749j7181j7286j7896j8476
53322A290009j8641j8505j8314j7925j6967j5378j3518j1815j0567r928r629q791
53310A120031o601l398n41J082J994L216M832O128O872P765R438J1633J3660J5246
53296A191357J6618J8010J9513K1218K3092K4747K5703K5971K6049K6221K6125
53285A444624K5188K3430K1475J9896J8676J7325J5395J2780R707O555L612Q90
53273A619553j821m658p415r686j1362j2869j4815j7303j9770k1580k2653k3441
$$ y = [2409850, 2361697, 2313036, 2264359, 2216768, 2170983, 2127039, 2084788, 2044148, 2004809, 1966162, 1927718, 1889296, 1850643, 1811250, 1770929, 1730399, 1690890, 1653140, 1617044, 1582310, 1549144, 1518106, 1489557, 1463454, 1439563, 1417638, 1397415, 1378597, 1360848, 1343667, 1326381, 1308485, 1290009, 1271368, 1252863, 1234549, 1216624, 1199657, 1184279, 1170761, 1158946, 1148379, 1138451, 1128822, 1120031, 1113430, 1110032, 1109491, 1110573, 1112567, 1115783, 1120615, 1126743, 1133615, 1141380, 1150818, 1162451, 1176111, 1191357, 1207975, 1225985, 1245498, 1266716, 1289808, 1314555, 1340258, 1366229, 1392278, 1418499, 1444624, 1469812, 1493242, 1514717, 1534613, 1553289, 1570614, 1586009, 1598789, 1608496, 1615051, 1618663, 1619553, 1617732, 1613074, 1605659, 1595973, 1584611, 1571742, 1556927, 1539624, 1519854, 1498274, 1475621, 1452180]
53261A452180k4346k5330k6111k6478k6452k6245k6134k6199k6145k5591k4545
53250A168604k3452k2735k2526k2856k3734k4795k5285k4828k3968k3592k3889
53239I06944k4253k4070k3233k1940k0497j9306j8617j8134j7177j5359j2931
53228F91427j0504q780q358r304j0748j1480j1219j0924j1643j3338j5034j5843
53216E54252j5651j5071j4855j5114j5029j3735j1554r820r270r253q818q028
53204D08054p565p599p737p792p838p698p094o302n966o190o410o255n992n893
53190C11723n771n384m951m780m724m340l542k715k214j959j663j341j398k084
53176B64857k957l193k466j361p92j152k101k891k786j539K15J338J296O97L77
$$ y = [1452180, 1427834, 1402504, 1376393, 1349915, 1323463, 1297218, 1271084, 1244885, 1218740, 1193149, 1168604, 1145152, 1122417, 1099891, 1077035, 1053301, 1028506, 1003221, 978393, 954425, 930833, 906944, 882691, 858621, 835388, 813448, 792951, 773645, 755028, 736894, 719717, 704358, 691427, 680923, 672143, 663785, 654481, 643733, 632253, 621034, 610110, 598467, 585129, 570095, 554252, 538601, 523530, 508675, 493561, 478532, 464797, 453243, 443423, 434153, 424900, 416082, 408054, 400489, 392890, 385153, 377361, 369523, 361825, 354731, 348429, 342463, 336273, 329863, 323608, 317616, 311723, 305952, 300568, 295617, 290837, 286113, 281773, 278231, 275516, 273302, 271343, 269680, 268339, 266941, 264857, 261900, 258707, 256241, 254880, 254088, 252936, 250835, 247944, 245158, 243619, 243834, 245172, 246468, 247165, 247542]
53161B47542L09j15r57j570j516j103q36q44r51r58p28l23q6k47m91l46L1Kn17
53142B36296q15m26J28J20k86l13K50P52N91O7L1Q25J822K075J388N20K38M41
53124B43704N00J99j16k03k04j92J2M29P63R20J203J691J877J346M41j64l37m80
53106B51389q00j067j093j005r69r89j038j168j373j530j560j491j286p75Q1R17
53090B36243J172O42k00o56n19k01p8m9N7k4n98j307j383p18r4j64o79r98r12
53071B29534o21k61J04K63J23k2J57M91N05J3p32j372j601j214l60L34L53q4l41
53052B25269j52K77Q15J499K145K412K355K343K318J723M19q38j289j098j009
53037B37189j342j732j704j099j57N64N72lm03k11J5m44j255j350m09O42Q41L15
$$ y = [247542, 247851, 247736, 246779, 245209, 243693, 242590, 241754, 240910, 239959, 239001, 238273, 237950, 237864, 237617, 237126, 236780, 236811, 236813, 236296, 235481, 235055, 235183, 235303, 235017, 234704, 234954, 235706, 236297, 236364, 236395, 237220, 239042, 241117, 242505, 243025, 243263, 243704, 244204, 244403, 244287, 244084, 243880, 243688, 243700, 244129, 244892, 245812, 247015, 248706, 250583, 251929, 252370, 252206, 251869, 251389, 250589, 249522, 248429, 247424, 246455, 245466, 244428, 243260, 241887, 240357, 238797, 237306, 236020, 235245, 235326, 236243, 237415, 238057, 237857, 237201, 236682, 236481, 236403, 236354, 236411, 236387, 235789, 234482, 233099, 232381, 232287, 232123, 231444, 230446, 229534, 228913, 228652, 228756, 229019, 229142, 229120, 229277, 229768, 230273, 230286, 229554, 228182, 226581, 225367, 225007, 225341, 225694, 225610, 225269, 225117, 225394, 226209, 227708, 229853, 232265, 234620, 236963, 239281, 241004, 241423, 240585, 239296, 238198, 237189, 235847, 234115, 232411, 231312, 231155, 231719, 232291, 232288, 231885, 231674, 231689, 231245, 229990, 228640, 228231, 228873, 229714, 230029]
53019B30029j37p3L50Q20J129J163J041J054J186R54J09p68q83k91J64Jl76l74
53001B35098K9M64O29M30o3n19n15n8L31K50n4n2M18J047J375J055J43o43l51
52982B39014J109K607K979K334J703J635J783J748J611J555J575J743K145K378
52968B65919J740K86q72q43n2M39L15P7Nj32l69l57l0R5l52j016j379j449j543
52949B60482j645j478j113r62j148j310j173r59r85j174j208j039r03r23r71q64
52933B42627n77k21l5k86r64j523j321l44O56R12L50m79r62q70m29j14j98m12
52915B35810k87J54L94K22R5L86P31N97K23L08Q62J083M85l96p57n26k18r2O1
52896B39135L67N12J21o85j311j328r44p01p28n66R5Q63J089P10J83k73p86j171
$$ y = [230029, 229892, 229819, 230169, 230989, 232118, 233281, 234322, 235376, 236562, 237516, 237625, 236857, 235974, 235683, 235847, 235848, 235472, 235098, 235127, 235591, 236220, 236650, 236587, 236068, 235553, 235495, 235826, 236076, 236022, 235970, 236388, 237435, 238810, 239865, 240008, 239365, 239014, 240123, 242730, 245709, 248043, 249746, 251381, 253164, 254912, 256523, 258078, 259653, 261396, 263541, 265919, 267659, 267945, 267073, 266230, 266178, 266617, 266932, 267009, 267014, 266882, 266513, 266156, 266126, 266221, 265869, 264853, 263474, 262025, 260482, 258837, 257359, 256246, 255284, 254136, 252826, 251653, 250694, 249709, 248535, 247327, 246288, 245385, 244462, 243491, 242627, 242050, 241829, 241794, 241508, 240544, 239021, 237700, 237356, 238012, 238924, 239274, 238795, 237833, 236963, 236534, 236420, 236222, 235810, 235523, 235677, 236071, 236293, 236388, 236774, 237505, 238102, 238325, 238633, 239495, 240578, 241063, 240667, 239910, 239384, 239166, 239074, 239135, 239502, 240014, 240135, 239450, 238139, 236811, 235867, 235166, 234438, 233872, 233967, 234830, 235919, 236629, 236812, 236539, 235753, 234582]
52878B34582q11M34J704K030J501J021J097J358J330J093R68R30P62N86P55J235
52862B50575J473J152P21Q95J674K265J968Q64n22j866l084l951m140l680l078
52847B41266k803k821k794k662k771l269l591k920j326J5J25n31o88m9M19J13
52831B15713k53J40Q40Q22J39j54L82J048J196J073J090R93L61n62j089j025q79
52814B19835j086j377j135k37O85R90Q51R67J541J983J850J536J593J840J687
52799B31523J021J84o59j470j937j831j567j707k003j731q74r4L50P70J120R08
52783B22003K11k02j2K71L27M21N19J39n73p05j41pq81j668j255k04K74J61J76
52764B18854K91K9l49k86j03l39m07N72J835J598k53j718j358K8R31J076J040
$$ y = [234582, 233771, 234205, 235909, 237939, 239440, 240461, 241558, 242916, 244246, 245339, 246307, 247237, 247999, 248585, 249340, 250575, 252048, 253200, 253921, 254816, 256490, 258755, 260723, 261587, 261065, 259199, 256115, 252164, 248024, 244344, 241266, 238463, 235642, 232848, 230186, 227415, 224146, 220555, 217635, 216309, 216324, 216449, 215918, 215230, 215181, 215600, 215713, 215460, 215600, 216440, 217262, 217401, 217247, 217629, 218677, 219873, 220946, 222036, 223029, 223390, 222828, 221739, 220714, 219835, 218749, 217372, 216237, 216000, 216685, 217675, 218526, 219493, 221034, 223017, 224867, 226403, 227996, 229836, 231523, 232544, 232728, 232069, 230599, 228662, 226831, 225264, 223557, 221554, 219823, 218949, 218855, 219205, 219975, 221095, 222003, 222214, 222012, 222000, 222271, 222598, 223019, 223538, 223677, 223104, 222399, 222258, 222251, 221370, 219702, 218447, 218243, 218517, 218678, 218854, 219145, 219174, 218825, 218539, 218436, 218097, 217690, 218262, 220097, 221695, 221442, 219724, 218366, 218394, 219325, 220401, 221441]
52747B21441J065J080J279J805K299K403K315K401K638K776K687K259J478P79
52733B48705P65J266J387Q08L90Q83J782K038J471P30K07k55q24j425j957k265
52717B53706k106j498r24p78q46p72o68p87q64m63J95L96j04q06j218j341j313
52700B39809j145q33l81L82J525K472K336J043l60q64o12m69q05j164j058n66
52684B39310j42r2l78p75j061j161j160j126r91o95l49j38o9j1K5q6k50j13M14
52665B31152Q80Q27M49L86Q65J428J559J279R61Q97J200J881K671L028K642J905
52649B54010J528J642J635Q47o90k300l297l478l138k701k337j908j305o10M2
52634B37940O30J145J436J401J179R49P23M78L81N95R58J140J007O20l4r61j868
$$ y = [221441, 222506, 223586, 224865, 226670, 228969, 231372, 233687, 236088, 238726, 241502, 244189, 246448, 247926, 248705, 249470, 250736, 252123, 252931, 253321, 254204, 255986, 258024, 259495, 260225, 260432, 260177, 259353, 257928, 255971, 253706, 251600, 250102, 249178, 248400, 247554, 246782, 246114, 245327, 244463, 244000, 244195, 244591, 244487, 243681, 242463, 241122, 239809, 238664, 237831, 237450, 237832, 239357, 241829, 244165, 245208, 244848, 243984, 243372, 242903, 242098, 240934, 239876, 239310, 239168, 239076, 238698, 237923, 236862, 235701, 234541, 233415, 232424, 231729, 231380, 231242, 231173, 231162, 231187, 231101, 230851, 230738, 231152, 232032, 232859, 233308, 233694, 234559, 235987, 237546, 238825, 239786, 240683, 241883, 243764, 246435, 249463, 252105, 254010, 255538, 257180, 258815, 259662, 258972, 256672, 253375, 249897, 246759, 244058, 241721, 239813, 238508, 237898, 237940, 238570, 239715, 241151, 242552, 243731, 244680, 245403, 245881, 246262, 246857, 247815, 248955, 249962, 250582, 250548, 249587, 247719]
52617B47719k324k185j612p51K33Q97P74J7o01n38M2O76J109J215Q10n4q64j086
52599B43477p49k86P8N01J150J833K144J845J116M36J55J61J00j41l01j42J80
52582B51557L06J24n8J83Q96J580J629J025M01K54L32J00m13p12o37n36o04n71
52564B54856k35J81L65K46k07r98j742j730q23K18O14M40J80r8n49q78o00J33
52546B49373O22N69L65L25K64lk47k26j05j51k71j99P5L78O53R45J147J098R04
52527B55516R21J266J592J418O94r9m38l02j45k95n50m71l2L32L62L76Q56J791
52509B62792K717L286L510L455L056K358J646J090M89l97j408k161k602l008l451
52494B71372l618l256k519j707r43l13k8j52l56k18K05M21J35l56m50Q0P59Q98
$$ y = [247719, 245395, 243210, 241598, 240847, 241080, 241977, 242751, 242768, 242167, 241629, 241671, 242347, 243456, 244671, 245481, 245427, 244563, 243477, 242728, 242442, 242520, 243021, 244171, 246004, 248148, 249993, 251109, 251545, 251700, 251861, 251961, 251820, 251519, 251377, 251557, 251863, 251987, 251929, 252112, 253008, 254588, 256217, 257242, 257643, 257897, 258229, 258329, 257916, 257204, 256567, 256031, 255427, 254856, 254621, 254802, 255167, 255413, 255206, 254208, 252466, 250736, 249913, 250131, 250745, 251185, 251365, 251267, 250718, 249840, 249240, 249373, 249995, 250564, 250929, 251254, 251518, 251515, 251268, 251042, 250937, 250786, 250515, 250316, 250391, 250769, 251422, 252367, 253514, 254612, 255516, 256437, 257703, 259295, 260713, 261407, 261308, 260870, 260568, 260423, 260128, 259578, 259107, 259075, 259407, 259769, 260145, 261001, 262792, 265509, 268795, 272305, 275760, 278816, 281174, 282820, 283910, 284399, 284002, 282594, 280433, 277831, 274823, 271372, 267754, 264498, 261979, 260272, 259329, 259016, 258988, 258836, 258480, 258262, 258467, 258888, 259023, 258667, 258217, 258297, 259056, 259954]
52476B59954M64L48J300K724L076J733j12q23j45Q58J307J255J121J156J508K231
52460B77955L026L392L160K552J739P72j73r51j790k923l911m067l514l109l158
52445B69000k973k070r45k49J02M11M38j40r96j536j681j615j179k35O20O14p5
52428B57491m50qP37J113J014P33N50O97J193J633J500Q95N12P52J327J844K346
52411B73879K954L396L274K688K231K455L510N168O961Q281Q577P622N651L265
52397C39912J107m97j675k768l933n019n766o004n688m859l612k172q87o4L22
52382B98397N78Q65R90Q67R39J604K370K326J594J481K752M447N138M804M535
52367C33687M774M866M296L434K755K155J372M93l00j023j563j553r04q3N02R49
$$ y = [259954, 260418, 260766, 262066, 264790, 267866, 269599, 269487, 268664, 268519, 269377, 270684, 271939, 273060, 274216, 275724, 277955, 280981, 284373, 287533, 290085, 291824, 292596, 292423, 291472, 289682, 286759, 282848, 278781, 275267, 272158, 269000, 266027, 263957, 263012, 262763, 262865, 263276, 263714, 263574, 262578, 261042, 259361, 257746, 256567, 256332, 256952, 257566, 257491, 257041, 257033, 257770, 258883, 259897, 260630, 261180, 261877, 263070, 264703, 266203, 267098, 267610, 268362, 269689, 271533, 273879, 276833, 280229, 283503, 286191, 288422, 290877, 294387, 299555, 306516, 314797, 323374, 330996, 336647, 339912, 341019, 340522, 338847, 336079, 332146, 327127, 321361, 315357, 309669, 304810, 301198, 299026, 298139, 298075, 298397, 298975, 299840, 300830, 301697, 302636, 304240, 306610, 308936, 310530, 312011, 314763, 319210, 324348, 329152, 333687, 338461, 343327, 347623, 351057, 353812, 355967, 357339, 357832, 357532, 356509, 354946, 353393, 352489, 352406, 352908, 353857]
52351C53857J417J628J362J011J118J543J672J398J267J641K255K820L533M610
52337C81132N666O022N602N126N404O621Q326R928J1094J1853J2515J3393J4526
52324D97208J5697J6690J7414J7811J7911J7993J8414J9072J9385J9115J8831
52313F95541J9106J9565J9454J8940J9011J9954K0796K0638J9730J8726J7627
52302I09088J6214J4960J4547J4701J4431J3323J1856J0389Q675O515M235K196
52290A041130L42j496l244m828o337p748q683q757q013o939o114n705n193l785
52276I64630j426Q94K287L185M680O849Q618R453J0099J1287J2567J3117J3047
52263A059287J3088J3406J3540J3341J3214J3419J3759J4081J4506J5088J5592
$$ y = [353857, 355274, 356902, 358264, 359275, 360393, 361936, 363608, 365006, 366273, 367914, 370169, 372989, 376522, 381132, 386798, 392820, 398422, 403548, 408952, 415573, 423899, 433827, 444921, 456774, 469289, 482682, 497208, 512905, 529595, 547009, 564820, 582731, 600724, 619138, 638210, 657595, 676710, 695541, 714647, 734212, 753666, 772606, 791617, 811571, 832367, 853005, 872735, 891461, 909088, 925302, 940262, 954809, 969510, 983941, 997264, 1009120, 1019509, 1028184, 1034699, 1038934, 1041130, 1041472, 1039976, 1036732, 1031904, 1025567, 1017819, 1009136, 1000379, 992366, 985427, 979313, 973608, 968415, 964630, 963204, 964098, 966385, 969570, 974250, 981099, 989717, 999170, 1009269, 1020556, 1033123, 1046240, 1059287, 1072375, 1085781, 1099321, 1112662, 1125876, 1139295, 1153054, 1167135, 1181641, 1196729, 1212321]
52252A212321J5817J5777J5396J4336J2413J0064Q032O518M857K303r28l777n517
52239A307612o393o871o803n984n083n115n983o494o044n382n281n351m826l831
52225A228171l012k395j538n21Q7J83K33M85Q32J422K618M190N366N829O057O420
52209A254427O687O758P110P982Q708Q553P790P269P225P158O774O303N919N543
52195A354206N370N872P009P906P834P113O554O313N871N005M069L183J834l26
52181A427813k710m399n316o250p746r497j0920j1803j2152j1843j0858r601q549
52168A316169p715o800n787m925m163l056j431J53J015J176J279J696K117K130
52154A291858J822J513J104K02j042j784j505p86o31j187j709j695j510j674k147
$$ y = [1212321, 1228138, 1243915, 1259311, 1273647, 1286060, 1296124, 1304156, 1310674, 1315531, 1317834, 1316906, 1313129, 1307612, 1301219, 1294348, 1287545, 1281561, 1276478, 1271363, 1265380, 1258886, 1252842, 1247460, 1242179, 1236828, 1232002, 1228171, 1225159, 1222764, 1221226, 1220705, 1220792, 1220975, 1221208, 1221693, 1222525, 1223947, 1226565, 1230755, 1236121, 1241950, 1248007, 1254427, 1261114, 1267872, 1274982, 1282964, 1291672, 1300225, 1308015, 1315284, 1322509, 1329667, 1336441, 1342744, 1348663, 1354206, 1359576, 1365448, 1372457, 1380363, 1388197, 1395310, 1401864, 1408177, 1414048, 1419053, 1423122, 1426305, 1428139, 1427813, 1425103, 1420704, 1415388, 1409138, 1401392, 1391895, 1380975, 1369172, 1357020, 1345177, 1334319, 1324718, 1316169, 1308454, 1301654, 1295867, 1290942, 1286779, 1283723, 1282292, 1282445, 1283460, 1284636, 1285915, 1287611, 1289728, 1291858, 1293680, 1295193, 1296297, 1296499, 1295457, 1293673, 1292168, 1291382, 1290751, 1289564, 1287855, 1286160, 1284650, 1282976, 1280829]
52139A280829k543k698k663k486k267k234k314j954p21J068K718M018N381P277
52125A281411R869J3067J6520J9611K1934K3702K5303K6567K7015K6823K6818
52114A518640K7358K7770K7281K5970K4372K2612K0512J8267J6372J4920J3479
52103A757553J1778J0067Q633P337N873M316L141K632K446J810J67k308m938p286
$$ y = [1280829, 1278286, 1275588, 1272925, 1270439, 1268172, 1265938, 1263624, 1261670, 1260949, 1262017, 1264735, 1268753, 1274134, 1281411, 1291280, 1304347, 1320867, 1340478, 1362412, 1386114, 1411417, 1437984, 1464999, 1491822, 1518640, 1545998, 1573768, 1601049, 1627019, 1651391, 1674003, 1694515, 1712782, 1729154, 1744074, 1757553, 1769331, 1779398, 1788031, 1795368, 1801241, 1805557, 1808698, 1811330, 1813776, 1815586, 1815753, 1813445, 1808507, 1801221]
$$ [...]
##END NTUPLES=NMR SPECTRUM
##END=
