##TITLE=AC1728_SEN00001_9274204_Mng1pFnGc1
##JCAMPDX= 6.0         $$ Bruker NMR JCAMP-DX V2.0
##DATA TYPE= NMR SPECTRUM
##DATA CLASS= NTUPLES
##ORIGIN= BRUKER
##OWNER= Administrator
$$ 1.72 TOPSPIN		Version 2.1
$$ 2015-07-18 23:16:27.572 -0700  Administrator@X
$$ Compression mode = diff/dup
##.OBSERVE FREQUENCY= 400.02188249412
##.OBSERVE NUCLEUS= ^1H
##.ACQUISITION MODE= SIMULTANEOUS (DQD)
##.ACQUISITION SCHEME= undefined
##.AVERAGES= 8
##.DIGITISER RES= 22
##SPECTROMETER/DATA SYSTEM= spect
##.PULSE SEQUENCE= zg30
##.SOLVENT NAME= COFFEE_meoh
##.SHIFT REFERENCE= INTERNAL, COFFEE_meoh, 1, 14.98509
##AUDIT TRAIL= $$ (NUMBER, WHEN, WHO, WHERE, PROCESS, VERSION, WHAT)
$$ ##TITLE= Audit trail, TOPSPIN		Version 2.1
$$ ##JCAMPDX= 5.01
$$ ##ORIGIN= Bruker BioSpin GmbH
$$ ##OWNER= Administrator
$$ $$ E:\/data/COFFEE/nmr/AC1728_SEN00001_9274204_Mng1pFnGc1/20/pdata/1/auditp.txt
$$ ##AUDIT TRAIL=  $$ (NUMBER, WHEN, WHO, WHERE, PROCESS, VERSION, WHAT)
(   1,<2015-07-18 23:16:20.260 -0700>,<Administrator>,<X>,<go>,<TOPSPIN 2.1>,
      <created by zg
	started at 2015-07-18 23:15:14.322 -0700,
	POWCHK enabled, PULCHK disabled,
       configuration hash MD5:
       21 0F 79 D6 B3 7B B4 F6 88 20 88 DB 03 48 BD 9F
       data hash MD5: 64K
       C2 DA D7 45 D2 77 5B 2A AE 81 0F A6 EA CF F2 88>)
(   2,<2015-07-18 23:16:23.400 -0700>,<Administrator>,<X>,<proc1d>,<TOPSPIN 2.1>,
      <Start of raw data processing
       efp LB = 0 FT_mod = 6 PKNL = 1 PHC0 = 0 PHC1 = 0 SI = 32K 
       data hash MD5: 32K
       AE 3D D2 E5 01 72 23 BF BA 85 86 C0 EA 03 38 BC>)
(   3,<2015-07-18 23:16:23.682 -0700>,<Administrator>,<X>,<proc1d>,<TOPSPIN 2.1>,
      <pk PHC0 = 89.08813 PHC1 = 0 
       data hash MD5: 32K
       C2 E9 63 89 AE B6 27 B2 3E A4 2C E8 BE 7B 63 61>)
(   4,<2015-07-18 23:16:23.807 -0700>,<Administrator>,<X>,<proc1d>,<TOPSPIN 2.1>,
      <abs ABSG = 1 
       data hash MD5: 32K
       28 26 84 A3 F9 42 81 43 62 5D 3A CA 4C E8 40 0B>)
(   5,<2015-07-18 23:16:23.869 -0700>,<Administrator>,<X>,<proc1d>,<TOPSPIN 2.1>,
      <abs ABSG = 2 
       data hash MD5: 32K
       61 CC 13 85 1E EB EA 59 9D 78 09 17 17 1C D8 5B>)
(   6,<2015-07-18 23:16:23.947 -0700>,<Administrator>,<X>,<proc1d>,<TOPSPIN 2.1>,
      <abs ABSG = 3 
       data hash MD5: 32K
       15 10 AE 8F BA 0A D0 E5 CB 84 F1 C9 9D E1 68 83>)
(   7,<2015-07-18 23:16:24.010 -0700>,<Administrator>,<X>,<proc1d>,<TOPSPIN 2.1>,
      <abs ABSG = 4 
       data hash MD5: 32K
       A8 B7 10 76 78 94 19 DA AA 1E C2 64 B5 22 97 B2>)
(   8,<2015-07-18 23:16:24.072 -0700>,<Administrator>,<X>,<proc1d>,<TOPSPIN 2.1>,
      <abs ABSG = 5 
       data hash MD5: 32K
       15 00 AA 7F 45 E1 11 76 1F 3B 65 A8 44 3B 99 14>)
$$ ##END=
$$ 
$$ $$ hash MD5
$$ $$ B9 63 40 3E 78 1A 45 44 1B 2D C5 25 A3 BC A4 B3
##$RELAX= 
##$RELAX= 
##$RELAX= 
##$RELAX= 
##$RELAX= 
##$RELAX= 
##$RELAX= 
$$ Bruker specific parameters
$$ --------------------------
##$DU= <E:\>
##$EXPNO= 20
##$NAME= <AC1728_SEN00001_9274204_Mng1pFnGc1>
$$ [...]
##$TP= (0..7)
150 150 150 150 150 150 150 150
##$TP07= 0
##$TPNAME0= <>
##$TPNAME1= <>
##$TPNAME2= <>
##$TPNAME3= <>
##$TPNAME4= <>
##$TPNAME5= <>
##$TPNAME6= <>
##$TPNAME7= <>
##$TPOAL= (0..7)
0.5 0.5 0.5 0.5 0.5 0.5 0.5 0.5
##$TPOFFS= (0..7)
0 0 0 0 0 0 0 0
##$TUNHIN= 0
##$TUNHOUT= 0
##$TUNXOUT= 0
##$USERA1= <user>
##$USERA2= <user>
##$USERA3= <user>
##$USERA4= <user>
##$USERA5= <user>
##$V9= 5
##$VALIST= <valist>
##$VCLIST= <CCCCCCCCCCCCCCC>
##$VD= 0
##$VDLIST= <DDDDDDDDDDDDDDD>
##$VPLIST= <PPPPPPPPPPPPPPP>
##$VTLIST= <TTTTTTTTTTTTTTT>
##$WBST= 2048
##$WBSW= 25
##$XGAIN= (0..3)
0 0 0 0
##$XL= 0
##$YL= 0
##$YMAX_a= 607434
##$YMIN_a= -528782
##$ZGOPTNS= <>
##$ZL1= 120
##$ZL2= 120
##$ZL3= 120
##$ZL4= 120
##$ABSF1= 14.98509
##$ABSF2= -5.573092
##$ABSG= 5
##$ABSL= 3
##$ALPHA= 0
##$AQORDER= 0
##$ASSFAC= 0
##$ASSFACI= 0
##$ASSFACX= 0
##$ASSWID= 0
##$AUNMP= <proc_prof1d_extract_pilot.lims>
##$AXLEFT= 0
##$AXNAME= <>
##$AXNUC= <1H>
##$AXRIGHT= 0
##$AXTYPE= 0
##$AXUNIT= <>
##$AZFE= 0.1
##$AZFW= 0.1
##$BCFW= 0
##$BC_mod= 0
##$BYTORDP= 0
##$COROFFS= 0
##$CY= 15
##$DATMOD= 1
##$DC= 0
##$DFILT= <>
##$DTYPP= 0
##$F1P= 0
##$F2P= 0
##$FCOR= 0.5
##$FTSIZE= 32768
##$FT_mod= 6
##$GAMMA= 0
##$GB= 0
##$INTBC= 1
##$INTSCL= 1
##$ISEN= 128
##$LB= 0
##$LEV0= 0
##$LPBIN= 0
##$MAXI= 10000
##$MC2= 0
##$MEAN= 0
##$ME_mod= 0
##$MI= 0
##$NCOEF= 0
##$NC_proc= -8
##$NLEV= 6
##$NOISF1= 0
##$NOISF2= 0
##$NSP= 0
##$NTH_PI= 0
##$NZP= 0
##$OFFSET= 14.98509
##$PC= 1
##$PHC0= 89.08813
##$PHC1= 0
##$PH_mod= 1
##$PKNL= yes
##$PPARMOD= 0
##$PPDIAG= 0
##$PPIPTYP= 0
##$PPMPNUM= 2147483647
##$PPRESOL= 1
##$PSCAL= 4
##$PSIGN= 0
##$PYNMP= <proc.py>
##$REVERSE= no
##$SF= 400.02
##$SI= 32768
##$SIGF1= 0
##$SIGF2= 0
##$SINO= 400
##$SIOLD= 32768
##$SPECTYP= <>
##$SREGLST= <1H.CDCl3>
##$SSB= 0
##$STSI= 32768
##$STSR= 0
##$SW_p= 8223.68421052631
##$SYMM= 0
##$S_DEV= 0
##$TDeff= 65536
##$TDoff= 0
##$TI= <>
##$TILT= no
##$TM1= 0
##$TM2= 0
##$TOPLEV= 0
##$USERP1= <user>
##$USERP2= <user>
##$USERP3= <user>
##$USERP4= <user>
##$USERP5= <user>
##$WDW= 1
##$XDIM= 32768
##$YMAX_p= 448804261
##$YMIN_p= -765387
##$CURPLOT= <Network HP LaserJet P1505>
##$CURPRIN= <$Network HP LaserJet P1505>
##$DFORMAT= <normdp>
##$LAYOUT= <+/1D_H.xwp>
##$LFORMAT= <normlp>
##$PFORMAT= <normpl>
##$SURQMSG= 1
$$ End of Bruker specific parameters
$$ ---------------------------------
##NTUPLES= NMR SPECTRUM
##VAR_NAME=  FREQUENCY,     SPECTRUM/REAL,   SPECTRUM/IMAG
##SYMBOL=    X,             R,               I
##VAR_TYPE=  INDEPENDENT,   DEPENDENT,       DEPENDENT
##VAR_FORM=  AFFN,          ASDF,            ASDF
##VAR_DIM=   32768,         32768,           32768
##UNITS=     HZ,            ARBITRARY UNITS, ARBITRARY UNITS
##FACTOR=    0.250966925370066, 1,           1
##FIRST=     8223.43324360094, -72007,       -46293
##LAST=      0,             -77435,          69491
##MIN=       0,             -765387,         0
##MAX=       8223.43324360094, 448804261,    0
$$ Real data points
##PAGE= N=1
##DATA TABLE= (X++(R..R)), XYDATA
$$ [...]
19564b59521e8771A23706b62285j62310a43002e971m7057k66342h8526j32090
19554b20616R803B37939a46059j27416J22621F9426O1411K77909a1768k48138
19544b59906J17571j22385m2988C36026a54230A68181e3700C9214a54779c8780
19533f0617j84252l2700R8852K841E2441b45778N5169j11834b1542k28993G6514
19521F7549b30617D5712a86533D7126K436a60112P8747E2394a76800g2751C5184
19509C8407J0604K4595A6326a66512P8852j61788A52522o0241D2825K1269d0063
19497d27001e4604H4680a50122O6609A56962b94047j26135J41357J38321q0722
19487b21226B8906c599m597p1847A61541A6330b58373p630a32807O4172B0344
$$ y = [-259521, -58771, 123706, -262285, -424595, -143002, -5971, -53028, -319370, -88526, -220616, -210813, 237939, -146059, -273475, -150854, 69426, 130837, 408746, -11768, -259906, -142335, -264720, -307708, 336026, -154230, 168181, -53700, 39214, -154779, -38780, -60617, -244869, -277569, -178717, -175876, 52441, -245778, -190609, -302443, -21542, -250535, 76514, 67549, -230617, 45712, -186533, 47126, 49562, -160112, -81365, 52394, -176800, -72751, 35184, 38407, 49011, 73606, 16326, -166512, -87660, -249448, 152522, 92281, 42825, 64094, -40063, -427001, -54604, 84680, -150122, -83513, 156962, -294047, -420182, -278825, -140504, -221226, 28906, -3599, -8196, -80043, 161541, 16330, -258373, -266003, -132807, -68635, 20344]
19475b88745i5258p7300B90107h0040q8916F1157K51969A08032b47475k1705H3378
19463A55906D3156R3460M160h7281K7663F4216a71974B35523a27968H4324a65103
19451b00607A48121C1565b09349B94752j22291b64583a30165l326A02263P951
19441A10214a89967F1183d2990j2329M153k45917g4948J1695j9872A64849a69650
19429a06485A49570A1923f3506D1015j6747a87068D9125N9884C4612b0408j72297
19418a92705l7056M8455p6494B41323i0083J8386H9552a60871M08B07130B4051
19406h8110A41111i7892j16812d1729A32899C9915g2970m3489j61477I873b35187
19394a41670N3185p406j32500B05014D5245a45042O3532H7791b79652n1531A03713
$$ y = [-288745, -95258, -172558, 290107, -80040, -168956, 61157, 313126, 108032, -247475, -269180, 83378, 155906, 43156, 136616, 140776, -87281, -59618, 64216, -171974, 235523, -127968, 84324, -165103, -200607, 148121, 31565, -209349, 294752, 172461, -264583, -130165, -133491, 102263, 110214, -189967, 61183, -42990, -55319, -51166, -297083, -74948, -63253, -83125, 164849, -169650, -106485, 149570, 11923, -63506, 41015, 24268, -187068, 49125, 109009, 34612, -20408, -192705, -229761, -181306, -257800, 241323, -90083, -71697, 89552, -160871, -160463, 207130, 24051, -88110, 141111, -97892, -214704, -41729, 132899, 39915, -72970, -116459, -277936, 9873, -235187, -141670, -88485, -95891, -228391, 205014, 45245, -145042, -81510, 87791, -279652, -331183, 103713]
19382a11811A15799b9995I1824k2862c28027A97618e0223i950A69356f09755C7145
19370d6010A46707c84661i2487a9528B47557a87436f5347j46014A13790l1859
19360H1931e8704A11033A0712a56658P3136A94130J34484k3675a36663L6659I1410
19348b65261B24592a6109j48316B88393a35691B03696C0997g3794j69968A22564
19337a45740p1014J00435M506E0112b26596h1056q4547L1969b5708k22855G1103
19325a14837A0132b03469A50726h3189A10584b72934A78453a57344E401b93477
19314b5621k53496a819j89023a2469k88088J635H6799J15343b4110D58447B00158
19302a67520D0426g1144j98292j14992i8308k3085j03896G0163c39009A48305
$$ y = [-111811, 115799, -29995, 91824, 68962, -328027, 197618, -50223, -9950, 169356, -609755, 37145, -46010, 146707, -384661, -92487, -19528, 247557, -187436, -65347, -211361, 113790, 81931, -58704, 111033, 10712, -156658, -83522, 194130, 328614, 304939, -136663, -100004, 91410, -265261, 224592, -16109, -164425, 288393, -135691, 203696, 30997, -73794, -243762, 122564, -145740, -216754, -116319, -111813, 50112, -226596, -81056, -165603, -133634, -25708, -248563, 71103, -114837, 10132, -203469, 150726, -83189, 110584, -272934, 178453, -157344, 5401, -293477, -25621, -279117, -1819, -190842, -12469, -300557, -298922, 86799, 202142, -24110, 458447, 200158, -167520, 40426, -71144, -269436, -384428, -98308, -121393, -225289, 70163, -339009, 148305]
19291C5582b3277B6518c12028b7950i773k30258l8406L7910H1669J31378o4376
19280A48671a80522A88869a53378B48051e4841i020j53734B20704F778a6171g876
19268b23612f0644A2612c41528d4200j61247G440a5356H8763b0888R296j95278
19257b06870A98251b99000g7492j11753B5069M598b83041b9115q3299H6538k8963
19246E7575J07968c18315J40004A39259c5646g932m38788A10928M6942m5870b97062
19234c4620I19J04199E2264c1471A23902a26167e6295A04018a59298g3061H6207
19222b88373G7823N1852a39632j0042r0943I3904e0403q3822B311i0794l3083
19211a23877B57182j27506a57255l94696e3996q7067k12474O0255b17j15391c4987
$$ y = [35582, -23277, 26518, -312028, -27950, -9773, -240031, -278437, -240527, 81669, 213047, 148671, -180522, 188869, -153378, 248051, -54841, -9020, -162754, 220704, 6778, -16171, -7876, -223612, -60644, 12612, -341528, -44200, -205447, 7440, -15356, 88763, -20888, -11592, -206870, 198251, -299000, -77492, -189245, 25069, 29667, -283041, -29115, -112414, 86538, 57575, 165543, -318315, -178311, 139259, -35646, -7932, -446720, 110928, 157870, 112000, -297062, -34620, 919, 105118, 52264, -31471, 123902, -126167, -56295, 104018, -159298, -73061, 86207, -288373, 77823, 129675, -139632, -149674, -240617, 93904, -50403, -134225, 2311, -90794, -123877, 257182, 129676, -157255, -551951, -53996, -141063, -353537, -293282, -217, -115608, -34987]
19199a16703l9360e3450j71761e0632B2512a90266A08948d3935k12133c9146l03033
19188c42179J68115P0432j448j8913l8086j0292g0082K7022A05487b89957J22994
19177a66963H8314a78796O9801A7433b9878I5773b41666G029a24707C0639g7082
19165a03452n33866b9980J222l4628b5295j53898o3523A0248O4748d1199k03D51677
19152H8218c36939d7668B23455C6091P4633b68808h2399K1137E3697a52892A09330
19140e3717E1787R577B6474K6473N6561k2756b42610I4991a58849D0933a43378
19128d43667b04901J00588B1167a10130J3305l13327A40027a89878a8984l27000
19118c45984A7393a1645o2204n2497K4246I1595a07908O148B32324a01542q291
$$ y = [-116703, -156063, -53450, -225211, -50632, 22512, -190266, 108948, -43935, -256068, -39146, -342179, -174064, -103632, -105080, -123993, -162079, -172371, -70082, -43060, 105487, -289957, -166963, 88314, -178796, -108995, 17433, -29878, 95773, -241666, 7029, -124707, 30639, -77082, -103452, -637318, -29980, -28758, -63386, -25295, -179193, -242716, 10248, 74996, -41199, -41402, 451677, 88218, -336939, -47668, 223455, 36091, 110724, -268808, -82399, -61262, 53697, -152892, 109330, -53717, 51787, 61364, 26474, 52947, 109508, 86752, -242610, 94991, -158849, 40933, -143378, -443667, -204901, -104313, 21167, -110130, -96825, -410152, 140027, -189878, -18984, -345984, 17393, -11645, -73849, -126346, -102100, 91595, -107908, -101760, 232324, -101542, -109833]
19107a09833K3733E4210e7410k94475a58082r8596g5486I2429c39471a12969L4470
19096g8499A2960c75846B32221e1014p9093C44217A00304L6866a45797I4944d14041
19084c16894B927h8567L0677o449d89A64973J4951m2615K014a00631d5931A62234
19071b02032b3832A37801i4316A01613a17807A66189E2034R5036A4718a32803
19060A49781a28035p2853A15345j329h7526J110m6620B15739O9167c46067B84458
19048d0133o7357a8017m4825c733j34156A20975f0965A34843b81330J39625k53056
19037c94761b1968D5963f5375o5777B16693A4719J72190B4270a1544m628C02485
19025B51012a15314q8731p2790O4456b9918l4812j27689e5909l99970G8233b97806
$$ y = [-109833, -86100, 54210, -57410, -351885, -158082, -256678, -75486, 92429, -339471, -112969, -78499, 12960, -375846, 232221, -51014, -130107, 344217, 100304, 137170, -145797, 94944, -414041, -316894, 2927, -88567, -57890, -64339, -489, 164973, 179924, 137309, 139323, -100631, -45931, 162234, -202032, -23832, 137801, -94316, 101613, -117807, 166189, 52034, 147070, 14718, -132803, 149781, -128035, -200888, 115345, 114016, -87526, -86416, -133036, 215739, 284906, -346067, 284458, -40133, -107490, -18017, -62842, -3733, -137889, 120975, -60965, 134843, -281330, -141705, -394761, -21968, 45963, -65375, -131152, 216693, 14719, 186909, 24270, -11544, -16172, 302485, 251012, -115314, -204045, -276835, -212379, -29918, -64730, -192419, -55909, -455879, 78233, -297806]
19013a10122D00528D3969a50118k0951J5336B3699b2437j6081F2510b59450C7585
19001A49188b16212A38106m5480f803I7489e80291a68486A63709K1605d9453l0440
18990g9893A25756D8878A3603J06638l3950K32401d12290i7405j5880d9888k0509
18979g0397A38780g2921A0344a60250c2133o6412j01158L2000D0651K48433f7000
18967B1254J24915F9369c10293h9081q1188A72010K52713g0960c3961o1997A0829
18955A25827a41546B4066a65687P258G6784c4789B9420c32035A60319b4175D9104
18943d0168A16210d1443B13301a7327j34380A67088p0405J82383b46695J01802
18933a44893p8910C4289b45815g0420j66574J06147j96195J00931B28272b0851
$$ y = [-110122, 400528, 43969, -150118, -171069, -155733, 23699, -22437, -38518, 62510, -259450, 37585, 149188, -216212, 138106, 92626, -6803, 97489, -580291, -168486, 163709, 185314, -49453, -79893, 125756, 48878, 13603, 120241, 86291, 318692, -412290, -97405, -113285, -49888, -70397, 138780, -72921, 10344, -160250, -32133, -98545, -199703, -167703, 40651, 289084, -67000, 21254, 146169, 69369, -310293, -89081, -170269, 172010, 424723, -70960, -33961, -95958, 10829, 125827, -141546, 24066, -165687, -158429, 76784, -34789, 29420, -332035, 160319, -24175, 49104, -40168, 116210, -41443, 213301, -17327, -151707, 167088, 96683, 279066, -246695, -144893, -223803, 34289, -245815, -70420, -236994, -130847, -327042, -226111, 228272, -20851]
18922D0403a75010D19176F5671i4217H3748f71618D3185N9364b11983g2779B3963
18910B5225a43910K9064l5466k29684a05831q5666E9503B5401D976c0593l5979
18899f6572J9890D3853e7773C0020C864i0993E0543J6144J34870p1831c36740
18887f7718j00139j29867r3944P0055a12413j39938i1853c1468k6568o3639k0404
18876a42079K3424e5848l98702A94845a32612j55670J02832o429P7956j32322
18866b46245I9041c07146g5068k19140A79644a7729k89642A31291a77420Q1615
18856i5805A18671a2785I7574b17947H8205f5204j9484F3979k0490I418J77556
18845A86974b93858R6918a1892l360p2857A5503g7195D2291b88883c207E017a06080
$$ y = [40403, -175010, 419176, 65671, -94217, 83748, -671618, 43185, 102549, -211983, -72779, 23963, 25225, -143910, -114846, -150312, -379996, -105831, -191497, 59503, 25401, 4976, -30593, -66572, -46682, 43853, -57773, 30020, 3864, -90993, 50543, 66687, 201557, 129726, -336740, -67718, -167857, -297724, -391668, -321613, -112413, -252351, -91853, -31468, -58036, -121675, -142079, -118655, -55848, -454550, 194845, -132612, -288282, -185450, -191879, -113923, -246245, 99041, -307146, -75068, -294208, 179644, -17729, -307371, 131291, -177420, -95805, 118671, -12785, 97574, -217947, 88205, -65204, -84688, 63979, 43489, 9418, 186974, -293858, -196940, -11892, -15252, -88109, 15503, -77195, 42291, -288883, -3207, 5017, -106080]
18832C9259L4357c35887H6207e5921D0567a1005l3962B3893b3340A85804E9561
18820b4091A46931a06336B40442i128G0326P5263e8526I7148C2742L3002J20833
18809A86577R2549R6755A02135J24627A00630O2666D2392a95055P9772d6520A58103
18797b5696A02279b32172C3525b2307j88717c8174E1854a15220d5717j22235F1896
18785A08201i8904q9834D4377a33527A72487b86900A85906K51147E7228b20060
18774a65781n3108i1553k08777h9n0243m7115k81833h2499B5513a65167A8483
18762E4456L7720O376b5553A21393a90161h9470a82j68595J2298j59999E5809
18750c84l27715l8511j4831A32574f214A81717h3377A85809b53030p846A77348
$$ y = [39259, 73616, -335887, 86207, -55921, 40567, -11005, -44967, 23893, -23340, 185804, 59561, -24091, 146931, -106336, 240442, -9128, 70326, 145589, -58526, 97148, 32742, 65744, 186577, 279126, 375881, 102135, 226762, 100630, 163296, 42392, -195055, -115283, -46520, 158103, -25696, 102279, -232172, 33525, -22307, -211024, -38174, 51854, -115220, -45717, -167952, 61896, 108201, -98904, -188738, 44377, -133527, 172487, -286900, 185906, 437053, 57228, -220060, -165781, -218889, -91553, -300330, -89, -50332, -97447, -379280, -82499, 25513, -165167, 18483, 54456, 92176, 98552, -25553, 121393, -190161, -89470, -182, -168777, -156479, -316478, 55809, -384, -328099, -366610, -381441, 132574, -6214, 181717, -83377, 185809, -253030, -260876, 177348]
18738E8003a86209b6002A75657J8761j3873F0366m125K28749a34229M0659j22130
18727b15700j1260M7572B5691a50593f1020r9170H2652m0654c76403M0702H1906
18715A67540b88288F6524D127Q7870a68919N2458e5362l7833B427b0220E8149
18703a39780A56106c55900B081J16105b14747A14435a12028B02474B8092J5612
18693D3704a56780J9026d5312r6247E3998B309Q9439a64518d2768A800c5116B24513
18680B5419N6572J57558b5044B9991a33401k4546g1080j4397E9969k795b41627
18668h5104n5059b0022F1786Q0212a87026A47720n6058a54235A70263G0019b00787
18656e6871n8957j66270B3399P0602c50953g6411j57621G0526a40432F8869a2674
$$ y = [58003, -186209, -26002, 175657, 194418, 180545, 60366, 56241, 284990, -134229, -93570, -215700, -226960, -179388, 25691, -150593, -61020, -160190, 82652, 41998, -376403, -335701, 81906, 167540, -288288, 66524, 4127, 91997, -168919, -116461, -55362, -93195, 2427, -20220, 58149, -139780, 156106, -355900, 2081, 118186, -214747, 114435, -112028, 202474, 28092, 43704, -156780, -137754, -45312, -141559, 53998, 2309, 91748, -164518, -42768, 1800, -35116, 224513, 25419, 81991, 239549, -25044, 29991, -133401, -157947, -71080, -85477, 59969, 57174, -241627, -85104, -140163, -20022, 61786, 141998, -187026, 147720, 91662, -154235, 170263, 70019, -200787, -56871, -115828, -282098, 23399, 94001, -350953, -76411, -234032, 70526, -140432, 68869, -12674]
18644a12456I4375e6430l26940J76004C27919a01298o964n1833l6969k7679B43662
18632c4m32076a03465J2165K9112m5564H3859a87279g1952C13604d1053k02337
18621b43390A67229b2791D110a4439k43458A82742O4706d03898A6575E021K01140
18610B06161b86462b3279n8407A88627d02395a30555d1611C8534Q1801m5553i1686
18598a93260j13188H2428h4986j5818k03363A52948a27352E3252K39935b94430
18587e0712C10364A01208h3314c5453H6072l4355e6942E127K58258b0037k50348
18576b70385A47275e4273A54165b71961a21532j10772d5569m8401B3762K4583
18566D8345P8380g7639j21577A57324a72904d3395A25323b43966C6108b75025
$$ y = [-112456, 94375, -56430, -383370, -207366, 327919, -101298, -108262, -160095, -197064, -224743, 243662, -34, -432110, -103465, -91300, -62188, -107752, 83859, -187279, -71952, 313604, -41053, -243390, 167229, -22791, 4110, -14439, -257897, 182742, 247448, -403898, 16575, 5021, 206161, -286462, -23279, -81686, 188627, -402395, -130555, -41611, 38534, 120335, 74782, -91686, -193260, -306448, 82428, -84986, -100804, -304167, 152948, -127352, 53252, 293187, -294430, -50712, 310364, 101208, -83314, -35453, 86072, 51717, -56942, 5127, 263385, -20037, -270385, 147275, -54273, 154165, -271961, -121532, -232304, -45569, -93970, 23762, 48345, 126725, -77639, -199216, 157324, -172904, -43395, 125323, -243966, 36108, -275025]
18555b07545L6615e0404j48789R4703F3270a01298C59812a08701j04902M7044
18545a66559A82491d70614b15614G8689b05274C64268D3688b58144A28617a22314
18534a35864L7084m518j21326e7938B80315b64347g8687j26820Q5577A02597m6346
18523E6251b57596M2609E2367a58157B28887A05707D6016a46841J8153L5520g179
18511B40380E4469P9391B5983c82835c6298o4338j7131A25975a17994F7830d7009
18499F6196M1767j892c8954j39208A35820e5033H8619J19046a61888G5668a00640
18487c18348a33103H7977c5239l0332m7229p6228J9060A44360b53334a08838E0668
18475c4085j60137c8729r077k9878B92909A12545b02300c2674k43686G5972c8685
$$ y = [-207545, -170930, -50404, -199193, -104490, 63270, -101298, 359812, -108701, -213603, -166559, 182491, -470614, -215614, 78689, -205274, 364268, 43688, -258144, 128617, -122314, -135864, -98780, -103298, -224624, -57938, 280315, -264347, -78687, -205507, -119930, 102597, 56251, -257596, -214987, 52367, -158157, 228887, 105707, 46016, -146841, -128688, -93168, -7179, 240380, 54469, 133860, 25983, -382835, -36298, -100636, -117767, 125975, -117994, 67830, -47009, 66196, 107963, 106071, -38954, -178162, 135820, -55033, 88619, 207665, -161888, 75668, -100640, -318348, -133103, 87977, -35239, -65571, -112800, -189028, -169968, 144360, -253334, -108838, 50668, -34085, -194222, -38729, -47806, -77684, 292909, 112545, -202300, -32674, -276360, 75972, -38685]
18463A83565c5783k34230A27653e0440a5328B45998b08816o2301a431k09937A84936
18451A26253c19771L2029b3841n4791b2391p4730j09092R2994K8457j40944L5281
18440a90425K8480j51283A2203a31361o1854E1695b57668k4687g0071m13035F028
18428A9277K18715c05288a40121A06902B4683a75199Q3479b9696A49506a2103
18417a16253A28222b43727h7456a2069H7393A9496a4393j67026B42613d4713A78421
18405a51970l26341B39981j04992a8314o7080H4946f2219j42694J7587p611l3800
18394b28737A33524m8245D2360a17507A63997a06295e261B30441p0856e7489j6897
18383g4386j2898E7354b53918A77823B6318J45088a03930k42898B77916c7782
$$ y = [183565, -35783, -270013, 127653, -50440, -15328, 245998, -208816, -271117, -1431, -211368, 184936, 126253, -319771, -287742, -23841, -78632, -22391, -97121, -206213, -113219, -84762, -225706, -190425, -161945, -313228, 12203, -131361, -193215, 51695, -257668, -282355, -70071, -483106, 6028, 19277, 237992, -305288, -140121, 106902, 24683, -175199, -91720, -29696, 149506, -12103, -116253, 128222, -243727, -87456, -12069, 87393, 19496, -14393, -181419, 242613, -44713, 178421, -151970, -478311, 239981, 134989, -18314, -85394, 84946, -62219, -204913, -187326, -194937, -228737, 133524, 85279, 42360, -117507, 163997, -106295, -5261, 230441, 159585, -57489, -74386, -87284, 57354, -253918, 177823, 26318, 171406, -103930, -346828, 277916, -37782]
18372d42711K11087E1269K42235A03986b212k7919j52816h3990m5446q756j3075
18361a51267o9501D41964G6319g3230G9343a8753j36247j6395L5555e7442l4922
18350i2364c8144j19331f6667D541a73160C2918b46639h5041K4057k95352d6515
18338b40751j9637O8624B27804c6818C0003R0753b0703j15964c9923k68298b145
18326A32396b42371j1912J23214E6980a13071A59928c26764J29384O0945b3169
18315B08258b48611G6152R8140h4490A00936N3047p5598A4352b6921c95j843j46864
18303a49102C8114d42505c4199A15645P8497C8023d5782j00756G0575R753a77042
18291c27905k4764a7481l9462C126i154l25162f3760C2426J50891a46265A10962
$$ y = [-442711, -231624, 51269, 293504, 103986, -2212, -30131, -182947, -83990, -129436, -138192, -151267, -220768, 441964, 76319, -73230, 79343, -18753, -155000, -171395, -135840, -57442, -92364, -38144, -157475, -66667, 4541, -173160, 32918, -246639, -85041, -60984, -356336, -46515, -240751, -260388, -191764, 227804, -36818, 30003, 120756, -20703, -136667, -39923, -308221, -2145, 132396, -242371, -254283, -131069, 56980, -113071, 159928, -326764, -197380, -136435, -23169, 208258, -248611, 76152, 174292, -84490, 100936, 153983, 78385, 14352, -26921, -395, -2238, -149102, 38114, -442505, -34199, 115645, 194142, 38023, -45782, -146538, 70575, 80328, -177042, -327905, -352669, -17481, -56943, 3126, -9154, -334316, -63760, 32426, 183317, -146265, 110962]
18279b8522B14828l8482o0700P6407e2460r1161A27703D490K2127J60488D0343
18267E3091e2805j58451P9184K9733A55559P7940J7636f6286l6222j33666A28031
18255a22093j355j8442A08110K8826E2511a27466j94485H1843a65670m6234C7451
18243b30434E7738J03150b1660A57050d0378A23468c67949c4331q1990B06871
18232a05196A65220e304A03806d5613F2090L35193a84393J9734B0025J97768J56254
18221C74047h966j81398A39732i3005J0240j3849r7597I1342f8962a1419l34996
18210c46415M2563A24487h7845G611b0359D8993a171F4715C1242A851J52860d09291
18197e2926A44850g9040l3619j01375I0321f8016J3462A51768i8226l3246A64950
$$ y = [-28522, 214828, 176346, 115646, 192053, -52460, -143621, 127703, 4490, 26617, 187105, 40343, 53091, -52805, -211256, -132072, -102339, 155559, 233499, 251135, -66286, -102508, -236174, 128031, -122093, -123448, -141890, 108110, 136936, 52511, -127466, -321951, 81843, -165670, -211904, 37451, -230434, 57738, 160888, -21660, 157050, -40378, 123468, -367949, -34331, -116321, 206871, -105196, 165220, -5304, 103806, -45613, 62090, 397283, -184393, -164659, 20025, 217793, 374047, -8966, -190364, 139732, -93005, -82765, -96614, -194211, 91342, -68962, -11419, -346415, -303852, 124487, -87845, 7611, -20359, 48993, -1171, 64715, 31242, 1851, 154711, -409291, -52926, 144850, -79040, -112659, -214034, 90321, -68016, -54554, 151768, -98226, -131472, 164950]
18185c3528D7472e489l9788D202c0635A72555c03896i4957a6303l57741A7282
18173A346J08547b35665A02182a06957A60142M1814i4181k78557A3180J55797
18163A68977F9020A2966L1263b17698e1002j17133F03b60350h7106A13478l3788
18152G9690h1669A37283a52495k8634H9339L79373b73302g5324D72J37669a79075
18140d8620E1177M2682a54439A56270a36172A02263i3951p5961f1788j67086B30244
18128B599f1847A348b78734a5783j43527k21320j29201a86253A3261c71619A76978
18116b33522N8320C23298h4268j60655R8298A56070B1409J04096K46887a54289
18105H9237c329j3328A49513p486c16554h8812k55471a12542A13016c0601p0247
$$ y = [-33528, 47472, -5489, -45277, 4202, -30635, 172555, -303896, -94957, -16303, -374044, 17282, 1346, 109893, -235665, 102182, -106957, 160142, 201956, -94181, -372738, 13180, 168977, 69020, 12966, 44229, -217698, -51002, -168135, 603, -260350, -87106, 113478, 79690, -81669, 137283, -152495, -181129, 89339, 468712, -273302, -75324, 472, 138141, -179075, -48620, 51177, 93859, -154439, 156270, -136172, 102263, -93951, -169912, -61788, -228874, 230244, 2599, -61847, 1348, -278734, -15783, -159310, -380630, -509831, -186253, 13261, -371619, 176978, -233522, -175202, 323298, -84268, -244923, -146625, 156070, 21409, 125505, 372392, -154289, 89237, -3329, -16657, 149513, 142027, -316554, -88812, -344283, -112542, 113016, -30601, -100848]
18094a00848B17086b17603G9685a56060E3221d9389C93024F6421f7760k73468
18084c41228C01136g136K853o7095G0781k4985g5199k05873a11772B52311a50906
18072d1394k97169c9885r4510J4983a863j6450j92892E952b4648r6579j86868
18061c08095d6302j30484D4404a27755E5494K93636h8434A60581a73458n3951
18051b27409J10580F2139J80586a30586A03895m5337K36454F6430L6671a78886
18040G8168c36849B34629C1362b82728G1357a13452k46020F3501c1516A02307
18029a4003B63273H0198j1680A5777h6655n0848j14632F2034b09568K3852F2760
18017A40006P3798a8927C2772i8043D9167O0842a26399j1085A07522N1558i4807
$$ y = [-100848, 217086, -217603, 79685, -156060, 53221, -49389, 393024, 66421, -67760, -341228, 301136, -7136, -4283, -71378, 70781, 45796, -75199, -281072, -111772, 252311, -150906, -41394, -338563, -39885, -134395, -119412, -1863, -18313, -211205, 5952, -24648, -121227, -308095, -46302, -176786, 44404, -127755, 55494, 349130, -88434, 160581, -173458, -227409, -116829, 62139, 242725, -130586, 103895, 58558, 295012, 66430, 103101, -178886, 78168, -336849, 234629, 31362, -282728, 71357, -113452, -359472, 63501, -31516, 102307, -14003, 263273, 80198, 68518, 15777, -86655, -137503, -252135, 62034, -209568, -185716, 62760, 140006, 213804, -18927, 32772, -98043, 49167, 110009, -126399, -137484, 107522, 159080, -94807]
18005I398K75181a3901j35861A63195a0330j15993J7059e066B49360d21294B6251
17993d63196B07743R9802a47947d1427B9680a16149A99959g8166B6467a13050
17982H2101c531A61747B9787f6164j23572G3801a45203j72566E9189a56819d9181
17970B3797L39107a23779e6803j21570p2127b2021j359C99977A30810b05201C65871
17958c47635j85267A51096e0820m0953A56537a50684A5544a35666C98211A56592
17947e778k77096A24590D3121f2957p0745F575i888A73119c60496C40107d12087
17935a7099c652j69562A95145b0380j88573A69559a26609r2953A09365J13518
17925B22883c9049j30219I8877b27420j9118B5894K40449a40313f0743l98494
$$ y = [9398, 284579, -13901, -149762, 163195, -10330, -126323, -109264, -5066, 249360, -421294, 26251, -463196, 207743, 307545, -147947, -41427, 29680, -116149, 199959, -78166, 26467, -113050, 82101, -3531, 161747, 29787, -66164, -189736, 73801, -145203, -317769, 59189, -156819, -49181, 23797, 362904, -123779, -56803, -178373, -250500, -22021, -23380, 399977, 130810, -205201, 365871, -347635, -532902, 151096, -50820, -91773, 156537, -150684, 15544, -135666, 398211, 156592, -5778, -282874, 124590, 43121, -62957, -133702, 6575, -9888, 173119, -360496, 340107, -412087, -17099, -3652, -173214, 195145, -20380, -208953, 169559, -126609, -219562, 109365, 222883, -39049, -169268, 98877, -227420, -246538, 25894, 266343, -140313, -60743, -459237]
17915d59237c1660D8429l332J98400I2466b70190J32030A34681b77289B31827
17904E8100a99893h5789j09164e7235a5055k93787A97004a21953J2204E8259a18640
17892a00065m4980C1921a26167A11932a41977A6242K14501e4779a0611j91604
17882b02215a2259q5244A48293C2950L8395a64937L5368N7326A22466N9532a56360
17870E0254B2119g7751k92888A36827b3323j94290g9462B10400a84670I8500H160
17858e0343k07154j05354C5945L6058c41878a51434m880f8229E57217c6502l0733
17847f7235a7688n1996H1644L40953A77201C7081L55225A42519J06769A7554N4682
17836G2236L04783j57402F3831h1741b526B74418q7679d27536B77044A17841C766
$$ y = [-459237, -31660, 48429, 45097, 243497, 92466, -270190, -138160, 134681, -277289, 231827, 58100, -199893, -85789, -194953, -57235, -15055, -308842, 197004, -121953, -109749, 58259, -118640, -100065, -145045, 31921, -126167, 111932, -141977, 16242, 230743, -54779, -10611, -202215, -12259, -97503, 148293, 32950, 71345, -164937, -129569, -72243, 122466, 181998, -156360, 50254, 22119, -77751, -370639, 136827, -23323, -217613, -79462, 210400, -184670, 98500, 8160, -50343, -257497, -362851, 35945, 72003, -341878, -151434, -156314, -68229, 557217, -36502, -67235, -17688, -69684, 81644, 422597, 177201, 37081, 392306, 142519, 249288, 17554, 72236, 377019, 219617, 63831, -81741, -2526, 274418, 186739, -427536, 277044, 117841, 3766]
17824e2590C61232A03230d0753k44688a00995j49643j61676G8590a60969j52485
17814c13454E1416b22867e3548p9709A18493a11455A55680h514q8888c1301j34589
17803a65890A90487N1559f8083n3426A02711h7762o337q2357I0003j0559M9526
17792A28970a84745d3018B83583F0701b32142H9485k9195j4264k117A7720P105
17781B4825P1343K609d214G8054f6376A87233a17430B36001Q5981f3522A38119
17769H4242a48406q3014d9991E2341j418g130A07213J23569d0270k14524F0034
17757A3572a36590L7679c9832D0088K9400a89056B06352b12742B15805F1068N5252
17746A16320D3340J44467D0841c61208H4659i4568j28791b6592l4429F07a08865
$$ y = [-52590, 361232, 103230, -40753, -285441, -100995, -250638, -412314, 78590, -160969, -313454, 51416, -222867, -53548, -133257, 118493, -111455, 155680, -8514, -97402, -31301, -165890, 190487, 242046, -68083, -121509, 102711, -87762, -94099, -176456, 90003, 79444, 128970, -184745, -43018, 283583, 60701, -232142, 89485, 60290, 46026, 43909, 17720, 24825, 96168, 98777, -4214, 78054, -66376, 187233, -117430, 236001, 321982, -63522, 138119, 84242, -148406, -231420, -49991, 52341, 50923, -7130, 107213, 230782, -40270, -254794, 60034, 13572, -136590, -98911, -39832, 40088, 69488, -189056, 206352, -212742, 215805, 61068, 116320, 43340, 187807, 40841, -361208, 84659, -94568, -223359, -26592, -61021, 607, -108865]
17734E4884J36761b02728o198A68318e0502E8955a05203N1762r857B18401O7355
17723B85756E7863A1094f535j72229C3138J08274R7899I5267c215A85566F1657
17711H38i8672F9042q143f8833H4485J66518A14560g4564C16824b76160b4241
17699B31139a17013F0601b4309o5016G6575a40155G5720L1140b1623N064L512
17688a3047j14347A68436g8723r1353C05143c4234F8727K05954i5145L5696B49538
17676e22710e9463h236n275G4070J10479J19565a40286N7484H6150i0225J5352
17665g4873k24673A18470f8356A18880a07058a2159B01194h797k27988A05274
17654H0603l87c0751A47111J1294a57014G1491Q1362d4723L621G5807c6843j94915
$$ y = [54884, 191645, -202728, -208926, 168318, -50502, 58955, -105203, -53441, -63298, 218401, 285756, 57863, 11094, -6535, -178764, 33138, 141412, 239311, 95267, -3215, 185566, 61657, 838, -98672, 69042, 60899, -68833, 84485, 251003, 114560, -74564, 316824, -276160, -24241, 231139, -117013, 60601, -24309, -89325, 76575, -140155, 75720, 106860, -21623, -16559, -13047, -127394, 168436, -78723, -170076, 305143, -34234, 68727, 274681, -95145, -59449, 249538, -522710, -59463, -8236, -13511, 74070, 184549, 304114, -140286, -82802, 86150, -90225, -74873, -299546, 118470, -68356, 118880, -107058, -12159, 201194, -8797, -236785, 105274, 80603, 80216, -30751, 147111, 158405, -157014, 71491, 152853, -44723, -41102, 75807, -36843, -231758]
17642b31758A65194o8324l6686J46631f6391A08824k1324j3223e4067B12640G2875
17630H8806i9612C70766E2288R9271C2810J38575l8706J78473A35373a29515D7388
17618H9269D0912a20202j73456A08664a11770C3728J88072p1019o8158b9275h361
17606E02266C072b32461a0920k41314P7162B83405j10860b30502e2107j36566
17596a88673A05664O8748H0169A8425L45435f5092J6540p7D2695d2053A14578
17584a16980A05914J99968m0571I1474a97602N3979A24770F0885j7747P4516i1235
17572a00074F8073K49645n3006A08278a32001C42033a01066p4315B8002M5420
17562G3422a1002B6867K51253c41838a09387j83528i1616k12167f465m211C05692
$$ y = [-231758, 165194, 96870, 60184, 206815, -66391, 108824, 87500, 74277, -54067, 212640, 72875, 88806, -99612, 370766, 52288, 151559, 32810, 171385, 132679, 311152, 135373, -129515, 47388, 89269, 40912, -120202, -293658, 108664, -111770, 33728, 221800, 150781, 82623, -29275, -8361, 502266, 3072, -232461, -10920, -252234, -175072, 283405, 172545, -230502, -52107, -188673, 105664, 174412, 80169, 18425, 363860, -65092, -48552, -48629, 42695, -42053, 114578, -116980, 105914, 305882, 265311, 91474, -197602, -143623, 124770, 60885, 43138, 117654, -91235, -100074, 68073, 317718, 264712, 108278, -132001, 342033, -101066, -175381, 28002, 73422, -11002, 26867, 278120, -341838, -109387, -292915, -91616, -303783, -6465, -10676, 305692]
17550A13800L82558A71572b22069C39367h9911L9686I6570m0248g1799D60714
17539d9435A89345A0544f9256r0522A86248a31292B21483q8101J71895P8130b8674
17527a30142H7078l0692a87816B1388K1634h9132d743l036I1619a5177B62018
17515A61274c46512J16496f1919R130C51497d9070A56690j8952P3913g7294A64146
17503d7889A10319J33067a6894F0044K52906D5784a0294A405K51602a81934C94496
17491A00643L32308A11588j5636m5438J79781l3550g8979K0871A09227K60922
17481C70149H1118J39163n5481a16942F9419f0673f837n0547p354C0577g8606
17469B38530J88679a389F5458J64409p5444J30272A09191b3243B1544M92412A20973
$$ y = [113800, 496358, 171572, -222069, 339367, -89911, -50225, 96570, 56322, -71799, 460714, -49435, 189345, 10544, -69256, -159778, 186248, -131292, 221483, 133382, 305277, 383407, -28674, -130142, 87078, 56386, -187816, 21388, 43022, -89132, -4743, -7779, 91619, -15177, 262018, 161274, -346512, -230016, -61919, -52789, 351497, -49070, 156690, 137738, 211651, -77294, 164146, -47889, 110319, 243386, -16894, 60044, 312950, 45784, -10294, 1405, 253007, -181934, 394496, 100643, 432951, 111588, 95952, 50514, 230295, 196745, -78979, -58108, 109227, 370149, 81118, 220281, 164800, -116942, 69419, -60673, -6837, -57384, -64738, 30577, -78606, 238530, 427209, -1389, 65458, 229867, 154423, 284695, 109191, -23243, 21544, 513956, 120973]
17457C348Q3666K69740b49819c8176D11694A05330p838K47508o6483L4282a19703
17445E4413K64425j27639J56714A20596M03957A75569a06735B54983K49941j97895
17435C07029M8529r008n4119H4567K687J56489J95430b2563D1328L89772A8265
17423A02339M46341A56249J99762J58655F8035L78987R0178B32095I3653L18714
17413D12367j10332A16147J21143P8011o1460q9646Q2608l2553I9769d864A67150
17401A21239E2356J86774J19540C1924J308h980k3021E11417A39994m143a25855
17389D22579G8324J11023G4435K45601E1324e5258A66351K00095e3675J3108A67349
17377A52448L2780G0166Q3700D6861a55364B84567K139b03888A59596M6351r6613
$$ y = [3348, 87014, 356754, -249819, -38176, 411694, 105330, 97492, 345000, 278517, 312799, -119703, 54413, 318838, 191199, 347913, 120596, 524553, 175569, -106735, 254983, 504924, 307029, 355558, 346550, 292431, 84567, 87254, 243743, 439173, -22563, 41328, 431100, 18265, 102339, 548680, 156249, 356011, 514666, 68035, 447022, 537200, 232095, 93653, 412367, 302035, 116147, 237290, 315301, 253841, 164195, 246803, 214250, 99769, -4864, 167150, 121239, 52356, 239130, 358670, 31924, 33232, -8980, -32001, 511417, 139994, 135851, -125855, 422579, 78324, 189347, 74435, 320036, 51324, -55258, 166351, 366446, -53675, -40567, 167349, 152448, 185228, 70166, 153866, 46861, -155364, 284567, 286706, -203888, 159596, 205947, 109334]
17366A09334l0800J1376b11641P5943A34612d28166B92039I0876J41900n4706
17356A78070n7548K28705r9402G1N7631d8670C9509J31246M1861B7555d9697H9914
17343a53042E09079A65409a16167M1449B49066G6076a69272F8499J28809n8756
17333A38552l875M3309C1524Q1739R4719q0118K3130K0527L7016i2067E3213M8980
17321A02193R0142M9463n4719a12104A22466d4719A21525a39623A97932b41673
17310e4810C30107n1733F1776j5685J22647L60807C6159g4694q5207A94750c6142
17298A25944K34533j51408J24679G6550K49705n2371F1948J90628b12928D07333
17287C3378a6477B68810D5802A1414L2205K92553J66302K8144b02436C00967J36231
$$ y = [109334, 78534, 89910, -211641, -135698, 134612, -428166, 292039, 90876, 232776, 178070, 120522, 349227, 249825, 71, 57702, -48670, 39509, 170755, 212616, 27555, -49697, 89914, -153042, 509079, 165409, -116167, -74718, 249066, 76076, -169272, 68499, 197308, 138552, 134677, 177986, 31524, 113263, 207982, 127864, 150994, 171521, 208537, -92067, 53213, 102193, 192335, 241798, 187079, -112104, 122466, -44719, 121525, -139623, 197932, -241673, -54810, 330107, 278374, 61776, 46091, 168738, 529545, 36159, -74694, -159901, 194750, -36142, 125944, 360477, 209069, 333748, 76550, 326255, 273884, 61948, 252576, -212928, 407333, 33378, -16477, 268810, 45802, 11414, 43619, 336172, 502474, 530618, -202436, 300967, 437198]
17276D37198j10718l7420E5042L68107H223K42542m6702I6487K5697c54227C52690
17264E51849A39006K27500A79854F3047R7551K13451A27418b22796B32271G9307
17253h6886A27777K91831E2689M39409A00341j1500k2465J43216e3162A45516
17242E722M82057j87489L7428A4896K54038c0224c291C11944A28882L15252c11272
17230A93269r068J75524A55702J46455a52863A20015l5098J67679m9471b4081
17219g1893B53256b31564C5059L36152a0591D8769L83694E4358K74626o5563a16426
17207B81158L9936P793a58310G9993g1725l9070B63082c910A66958M5511I7643
17195B39228J54398p4272A55373p922K47658R6259A12300E2964J52253d5593A33126
$$ y = [437198, 326480, 289060, 55042, 423149, 8223, 250765, 204063, 96487, 122184, -354227, 352690, 551849, 139006, 366506, 179854, 63047, 160598, 374049, 127418, -222796, 232271, 79307, -86886, 127777, 419608, 52689, 492098, 100341, 88841, 66376, 209592, -53162, 145516, 5722, 487779, 300290, 337718, 14896, 268934, -30224, -3291, 311944, 128882, 444134, -311272, 193269, 184201, 359725, 155702, 302157, -152863, 120015, 84917, 252596, 203125, -24081, -71893, 253256, -231564, 35059, 371211, -10591, 48769, 432463, 54358, 328984, 263421, -116426, 281158, 321094, 328887, -158310, 79993, -71725, -110795, 263082, -3910, 166958, 212469, 97643, 239228, 393626, 319354, 155373, 147451, 395109, 491368, 112300, 52964, 205217, -45593, 133126]
17183C93677I6255M5374P428J38078a10044G3584L57688G7389K25189j13917n7323
17172A31338P6205L41510B55146L21520j69351H5856P8686J71209j31233N6960
17162B61478L8440A11392f6644B47243K61596j7271B42972K03384k06416J38296
17152C78236j75289J15664J99078A80391a55175A17507L93772A60399J23127K44682
17142E28208n709j34160A32195J90923o1253J05651A01605K46996j35918B5950
17131A95927M5397J98804A59035J54210J08394N8507m3621m8139N8890j02965
17121C44311A24719L43958o7482r056N8064K03789j37180k49153K8983J88743
17111D85385M9739m9243A0006J60264Q5839J08912m2749J10774j68596J31255
$$ y = [393677, 96255, 141629, 149057, 287135, -110044, 73584, 431272, 77389, 302578, 188661, 131338, 207543, 549053, 255146, 576666, 407315, 85856, 164542, 335751, 204518, 261478, 299918, 111392, -66644, 247243, 508839, 491568, 242972, 446356, 239940, 378236, 202947, 318611, 517689, 180391, -155175, 117507, 511279, 160399, 283526, 528208, 522499, 388339, 132195, 323118, 261865, 367516, 101605, 348601, 212683, 25950, 195927, 241324, 440128, 159035, 313245, 421639, 480146, 436525, 388386, 447276, 344311, 124719, 468677, 401195, 392139, 450203, 653992, 516812, 267659, 296642, 485385, 535124, 485881, 10006, 170270, 256109, 365021, 322272, 433046, 264450, 395705]
17101C95705j13320R48R6316J74329k17864r8161L82812b1469D29733o8540k2236
17090C38957j31813K74132k31832J67764k0118j10871J83864E862J51237J30143
17080B87242M3726K5115j1370K10905r1668A21327J8308P1471p8271K46991J82006
17069E61832j66462P3479n8644A93838M51489j25613k16675l7188K65864j91356
17059C40359n3187L06586J8772j04197j27213J02449K18506A52704J50042K80416
17049E83162J87280C81439L59227j77811k60250K16799O6930j52518J59669N232
17039E98717o2582j49106J68261j83803N99703l43666j17411J37289o0996k28089
17029C58317P8832K81506l01030j1860N82446J0094C60251O5457K4986r0203J09532
$$ y = [395705, 282385, 283333, 379649, 553978, 336114, 237953, 620765, -21469, 429733, 361193, 338957, 207144, 481276, 249444, 417208, 397090, 286219, 470083, 5862, 157099, 287242, 330968, 356083, 344713, 555618, 463950, 121327, 139635, 211106, 132835, 379826, 561832, 395370, 468849, 410205, 193838, 645327, 519714, 303039, 265851, 531715, 340359, 287172, 593758, 612530, 508333, 381120, 483569, 702075, 152704, 302746, 583162, 770442, 381439, 740666, 562855, 302605, 519404, 586334, 433816, 593485, 598717, 536135, 387029, 555290, 371487, 971190, 627524, 510113, 647402, 586406, 358317, 437149, 718655, 417625, 405765, 988211, 998305, 360251, 425708, 450694, 360491, 470023]
17018D70023K09928B84157L94271l33915K56015J43137j19485l11580K98546J80298
17008G91444P2581k30186K09542J29160k86325J41898m06180M30534l58080L78288
16998H72676k20885K11856m4941l2510j45995J17118l67059M79609q205j3520
16988H48144k95489J25121J59670N2349j5316j42895L57001k52520k65206M6645
16978F17504L26553k22824J80505j52003L4397j28358M18817l54871M45984k5704
16968A140000l4597j33177j74264N46970n49264J85333j39785l02775N57555j89628
16958I06368N811J48002j12412J07736J41620J66232n38100K00173j04720K98174
16948A218884D93571M92501r8292K60441j5569k34969J95455j53360j328m2910
$$ y = [470023, 679951, 284157, 678428, 344513, 600528, 743665, 624180, 312600, 611146, 791444, 864025, 633839, 843381, 972541, 686216, 828114, 421934, 852468, 494388, 872676, 651791, 863647, 818706, 786196, 640201, 757319, 390260, 869869, 861664, 848144, 552655, 677776, 837446, 889795, 874479, 731584, 1088585, 836065, 570859, 617504, 944057, 721233, 901738, 749735, 784132, 655774, 1074591, 719720, 1165704, 1140000, 1105403, 972226, 797962, 1344932, 795668, 981001, 841216, 538441, 1095996, 906368, 912179, 1060181, 947769, 1055505, 1197125, 1363357, 825257, 1025430, 920710, 1218884, 493571, 986072, 887780, 1148221, 1132652, 897683, 1093138, 939778, 938450, 895540]
16938H95540L9442K33680j11157J3030J03134J08295j91517P6516J91889j90096
16928A168756L02862k25467J05117K3721j74945J53406n3693K10182N1851l6241
16918A525549O784k40139K91456j14175j02097j84632O07821m33989K04630J29680
16908A690888k88608J93000J95407l58498J43416k51463L20880k35735k89491
16899A119796N77709J90922j26409m29289O2931L29903l1511K21756j99237K27774
16889A944345m42487N11746l26444J34355R7348j15288J47907K63986k84395n8487
16879A872586M32922n02727K55742J4440r2170O5011J11803K82481l63435K94302
16869B370955J7160N2793O9275k72176K23753r8734L92661k05042J7068r6385
$$ y = [895540, 934982, 1168662, 1057505, 1070535, 1173669, 1281964, 1090447, 1166963, 1358852, 1168756, 1471618, 1246151, 1351268, 1374989, 1200044, 1353450, 1299757, 1509939, 1561790, 1525549, 1532333, 1292194, 1583650, 1469475, 1367378, 1182746, 1790567, 1356578, 1561208, 1690888, 1402280, 1595280, 1790687, 1432189, 1575605, 1324142, 1645022, 1409287, 1119796, 1697505, 1888427, 1762018, 1332729, 1395660, 1725563, 1694052, 1915808, 1716571, 1944345, 1501858, 2013604, 1687160, 1821515, 1918863, 1803575, 1951482, 2215468, 1931073, 1872586, 2305508, 1802781, 2058523, 2072963, 1980793, 2045804, 2157607, 2440088, 2076653, 2370955, 2388115, 2440908, 2510183, 2238007, 2461760, 2363026, 2755687, 2550645, 2567713, 2471328]
16859B471328L89546l67470J20628j1429N19592k25369r7680K49619n9003j85192
16849B804570M49060j56169l94540M05500O4556K28345k81838N00583j48192K16376
16839C688251k29987j39386M50667j98297M35514j96196p0842J53707K9117L23815
16829D246363j32640K38703l65935O09370o056k5780N2285R926K45069p1567K62982
16818E062720K02587n5265l9329N05672K10338k43709K54023m8648J66220J28846
16808F143455J98748K06429L50788k65282j8388L61017M7304K01871J89417K26975
16798G642334M90429l34300M17806J85353K37787J23783L94597L65113J42722
16789I665624l39J95407N71460K80304L45918R3106K92282N11921K82228K94131
$$ y = [2471328, 2860874, 2493404, 2614032, 2602603, 3122195, 2896826, 2799146, 3048765, 2989762, 2804570, 3253630, 3097461, 2702921, 3108421, 3172977, 3401322, 3119484, 3620067, 3471875, 3688251, 3458264, 3318878, 3769545, 3571248, 4006762, 3810566, 3739724, 3893431, 3922548, 4246363, 4113723, 4352426, 3986491, 4595861, 4589805, 4564025, 4616310, 4626236, 4871305, 4799738, 5062720, 5265307, 5210042, 5170713, 5676385, 5886723, 5643014, 5897037, 5848389, 6014609, 6143455, 6342203, 6548632, 6899420, 6634138, 6615750, 6976767, 7024071, 7225942, 7415359, 7642334, 8132763, 7798463, 8216269, 8401622, 8639409, 8763192, 9157789, 9522902, 9665624, 9665285, 9860692, 10432152, 10712456, 11058374, 11151480, 11443762, 11955683, 12237911, 12532042]
16779A2532042M82882L31018N03238L61359L22904N93526L85745R17832L95684
16770A6826230L48426N64234Q09840P50386L96071J075006N25421Q12510R96119
16761B3104243R83532P70714J295926R92507J118708J372084R07086J512578J300589
16752C3357967J914441J497487K028701J758764K345903K042762K202395K572942
16744D9721362K674711K881094K470004L738272L739637L686122M113900L979144
16736G7004246M775045N081543N718780N494443N870505O298197O751989O753014
16728A23747762P204601P760909P421515P534815P242983P119368N929441O251577
16720A80212971N152825L840157K369360J055871L25031j635946k391412m145974
$$ y = [12532042, 13014924, 13345942, 13849180, 14210539, 14533443, 15126969, 15512714, 16430546, 16826230, 17174656, 17738890, 18548730, 19299116, 19695187, 20770193, 21295614, 22108124, 23104243, 24087775, 24858489, 26154415, 27146922, 28265630, 29637714, 30544800, 32057378, 33357967, 35272408, 36769895, 38798596, 40557360, 42903263, 44946025, 47148420, 49721362, 52396073, 55277167, 57747171, 61485443, 65225080, 68911202, 73025102, 77004246, 81779291, 86860834, 92579614, 98074057, 103944562, 110242759, 116994748, 123747762, 130952363, 138713272, 146134787, 153669602, 160912585, 168031953, 173961394, 180212971, 185365796, 189205953, 191575313, 192631184, 192956215, 191320269, 188928857, 184782883]
16712A84782883n041852o349545o343408p460969p410622p875791p705803p822864
16704A28772029p100014p682727o843938o615933o127402n367847n693276m957542
16696G8383350m893895m228206m202230l696269l560141l110358k969875k775857
16688D8946519k724478k585374k189272k315063j626531j843040j742631j906267
16680C2013863j150093j591934j169832j177091j230454j110102j153447j260038
16672B2170872n75318p36348q53241r22826l67959j014292n93122o33201l88769
16663A6085796p31503o88516k23487k42841o39662n66819l38925k08556m76679
16654A1968808m40549l03281l28225l00720k77347l02911n38078j77101l07583
$$ y = [184782883, 179741031, 173391486, 167048078, 159587109, 152176487, 144300696, 136594893, 128772029, 121672015, 113989288, 107145350, 100529417, 94402015, 89034168, 83340892, 78383350, 73489455, 69261249, 65059019, 61362750, 57802609, 54692251, 51722376, 48946519, 46222041, 43636667, 41447395, 39132332, 37505801, 35662761, 33920130, 32013863, 30863770, 29271836, 28102004, 26924913, 25694459, 24584357, 23430910, 22170872, 21595554, 20859206, 20005965, 19083139, 18715180, 17700888, 17107766, 16474565, 16085796, 15354293, 14665777, 14442290, 14199449, 13559787, 12992968, 12654043, 12445487, 11968808, 11528259, 11224978, 10896753, 10596033, 10318686, 10015775, 9477697, 9300596, 8993013]
16645H993013K47492o93303m12730k01886j45755k9153l6617m73691M3227Q6155
16635G376752n60998Q6299m39145K2604r7191j21484m56251J01670k25428k47807
16625E439021L4396j87638J37461j72565k70346N7950j77787j56659j18328l68211
16615D217294K62845K3473l08659j32651K6534j09585k36850l00850L47629k30399
16605C558781J03235K9224l62947L1924J03628l56531J09265j46609j56621P8879
16595B992228j07715L379Q7062m11292J68531l3889K6121j88505L03475m66877
16585B372518K53302Q0270m98408K44200J65967n07310K84209N8013K13858n90770
16575B075849j14460p705L365L12198K8131m53627Q5776N0258Q1712k21967J23268
$$ y = [8993013, 9240505, 8547202, 8134472, 7932586, 7786831, 7757678, 7721061, 7247370, 7290597, 7376752, 6815754, 6902053, 6462908, 6485512, 6388321, 6266837, 5810586, 5912256, 5686828, 5439021, 5473417, 5285779, 5423240, 5250675, 4980329, 5038279, 4860492, 4703833, 4585505, 4217294, 4480139, 4503612, 4194953, 4062302, 4088836, 3979251, 3742401, 3441551, 3789180, 3558781, 3662016, 3691240, 3328293, 3360217, 3463845, 3107314, 3216579, 3069970, 2913349, 2992228, 2884513, 2887892, 2974954, 2563662, 2732193, 2698304, 2724425, 2535920, 2839395, 2372518, 2625820, 2706090, 2207682, 2451882, 2617849, 2110539, 2394748, 2452761, 2666619, 2075849, 1961389, 1953684, 1957049, 2269247, 2297378, 1843751, 1929527, 1979785, 2061497, 1839530, 1962798]
16564A962798n9780k46837p6977J09448J32474l12094L03030l16342J4245l17764
16554A192201N38031o723l31920J5066N0163J32859m06978L0955J6496J32728
16544A362878j67355L73152n24123M72659l85041L34529k81951K97578k39253
16535A243073j1659P8194l06012J39789K4701j88645L133J65675J90860r3468
16525A245641l90840K27912P6410k4130j51848M4172N6793j05124R0210K04980
16515A274176j97618j31411L0816k0582j15215M6587j14335J59629l31334N42338
16505A143051j77711J11201D95409K50480P560J77783l98320K17545k17717M40696
16495I73436k06224M00273m00475o7746K00444R2751l48031L59478k73345j48703
$$ y = [1962798, 1903018, 1656181, 1579204, 1688652, 1821126, 1509032, 1812062, 1495720, 1509965, 1192201, 1730232, 1723509, 1391589, 1406655, 1456818, 1589677, 1182699, 1213654, 1230150, 1362878, 1195523, 1568675, 1044552, 1517211, 1132170, 1466699, 1184748, 1482326, 1243073, 1231414, 1309608, 1003596, 1143385, 1168086, 979441, 982574, 1148249, 1339109, 1245641, 854801, 1082713, 1159123, 1134993, 983145, 1027317, 1084110, 978986, 1069196, 1274176, 1076558, 945147, 975963, 955381, 840166, 886753, 772418, 932047, 600713, 1143051, 965340, 1076541, 495409, 745889, 753449, 931232, 532912, 750457, 532740, 973436, 767212, 1167485, 767010, 699264, 899708, 992459, 644428, 1003906, 730561, 581858]
16485E81858j9162P0902L06605j81879r6958m6504K87326l07101j88846n3602
16475C52639L53238k08151N23859m67112J14426K81602l49283j66644K47464J8047
16465G00085k97714J81008J30247j97895O8702B25796N7298k0300J55722Q6958
16455E05474J26725L06456D42901J01177l9138J86150k96080K13683j07690j89411
16445C11592J91595q9002O0471L95694l06204B55010O7858K0811J84720j64873
16435C63526L31423k72366l3613p8975J16288J99962k64220K66942k48366H0380
16424D21873o0454J83074r4594A90699L20109B43680R4205K83212j40684G2841
16413D26321j29978A38009K99893H3144K15740j27086M27130B76321J7594K10408
$$ y = [581858, 562696, 633598, 940203, 758324, 661366, 614862, 902188, 595087, 406241, 352639, 705877, 497726, 1021585, 554473, 668899, 950501, 601218, 434574, 682038, 700085, 402371, 583379, 713626, 515731, 584433, 225796, 283094, 262794, 418516, 505474, 632199, 938655, 442901, 544078, 504940, 691090, 395010, 608693, 501003, 311592, 503187, 414185, 474656, 870350, 564146, 255010, 322868, 343679, 528399, 363526, 694949, 422583, 388970, 309995, 426283, 626245, 362025, 628967, 380601, 80380, 421873, 361419, 544493, 449899, 190699, 510808, 243680, 337885, 621097, 480413, 72841, 426321, 296343, 138009, 437902, 83144, 298884, 171798, 598928, 276321, 293915, 504323]
16403E04323A99170J47689R1668B02205j6362k5118J52046M5696j08439o4328
16393A85700J28433j25719l4021K42016M8290o558j48377o0425K7906L41769j97442
16382D01572j02967K03552A43023a7721G2852K31693k3751P3073I8032L77408
16372D75440j20565C3570h7635A7575h4421B98982J10410J32128k52941J11197
16362C99776A93354J44632K86699j14906o8001j77907n8923a5379B38996o9308
16352A69688c7676B46293b0949E105h0056B42570o9723b75813c8988D63342j74059
16341B89283l9878c838B8118i7049A52220K68424e7660F2932L1081J61719I2989
16329I9907Q9198A4229P2686R5806o6169k0849a14100C37418Q8028A91753J23586
$$ y = [504323, 199170, 346859, 438527, 202205, 185843, 160725, 312771, 358467, 250028, 185700, 314133, 188414, 154393, 396409, 444699, 438141, 289764, 229339, 257245, 599014, 401572, 298605, 502157, 143023, -17721, 72852, 304545, 280794, 353867, 98032, 475440, 354875, 33570, -87635, 17575, -84421, 298982, 409392, 541520, 288579, 399776, 193354, 337986, 624685, 509779, 441778, 263871, 204948, -15379, 238996, 169688, -37676, 246293, -20949, 5105, -80056, 242570, 172847, -275813, -38988, 463342, 289283, 249405, -3838, 28118, -97049, 152220, 420644, -57660, 62932, 94013, 255732, 92989, 99907, 189105, 14229, 86915, 182721, 116552, 95703, -114100, 337418, 425446, 191753, 315339]
16318C15339f3598B51759j03376d3199E5229J21185J61296b07716a0805D25319
16307E0737a33038d9538D26514k02249R2923F4603K68820f0690d412B59964n5532
16296B04432b16598G8281L82045E8K30393n3621M75999a94017D5021L62533j64005
16285B43549a34553A14476j9440A0697a84542E33691B19044J6787C2597b04478
16274A57965f1187N713B44910a92219L4908A68851a61204E4852b3683m0538A21336
16262B40701G3153c6680p6876D25474j59343a38335f1400I6073K46374h206j52186
16251a60392A24687L19311j98968J8855J63804A4036a34181K8842B1853L26560
16241C48413F0507J59592c5971N834k74216D0858J19406a08280B2002f9622A0049
$$ y = [315339, -63598, 251759, 148383, -43199, 55229, 176414, 337710, -207716, -10805, 425319, 50737, -133038, -49538, 426514, 224265, 317188, 64603, 333423, -60690, -4412, 259964, 204432, -216598, 78281, 460326, 58, 230451, 176830, 652829, -194017, 45021, 407554, 243549, -134553, 114476, 95036, 10697, -184542, 533691, 219044, 235831, 32597, -204478, 157965, -61187, -55474, 244910, -192219, -157311, 168851, -161204, 54852, -23683, -64221, 121336, 240701, 73153, -36680, -113556, 425474, 266131, -138335, -61400, 96073, 342447, -8206, -160392, 124687, 443998, 245030, 263885, 427689, 14036, -134181, -105339, 21853, 348413, 60507, 220099, -35971, -30137, -304353, 40858, 160264, -108280, 22002, -69622, 10049]
16229A09796k1628P3249f4085I0547A4420J66038e3775A29990F3461c19730C52897
16217a62386A56599b10053f7881J5503A45614E9588b6178n3523A49182K70582
16207D19764A04188J13113I7335a22101C6667Q9975M3594a52574O3562B12440
16196h9370b0648B11627a11742A11419K44375C0429a0463B51516A18358f421C35978
16184A00521K9323Q4908J19480h7202K0808r4461P4420L5114m5104E8533e0699
16172a23938G5156g8547o9754b7890o9751A3561O5731k2350k7604J16287B6569
16160b5074j18645e7141D8265N6835a3348G7260h0348A35001a93129B1269J42030
16149A63299a3637q4828B32438E728M5322b42374b6135p0203C84222b29254B03592
$$ y = [109796, 88168, 161417, -64085, 90547, 14420, 180458, -53775, 129990, 63461, -319730, 352897, -162386, 156599, -210053, -67881, -52378, 145614, 59588, -26178, -79701, 149182, 419764, 104188, 217301, 97335, -122101, 36667, 126642, 170236, -152574, -89012, 212440, -89370, -20648, 211627, -111742, 111419, 355794, 30429, -10463, 251516, 118358, -6421, 335978, 100521, 129844, 214752, 334232, -87202, -66394, -160855, -86435, -51321, -96425, 58533, -50699, -123938, 75156, -78547, -148301, -27890, -97641, 13561, 79292, 56942, 29338, 145625, 26569, -25074, -143719, -57141, 48265, 105100, -13348, 77260, -80348, 135001, -193129, 21269, 163299, -13637, -98465, 232438, 5728, 51050, -242374, -26135, -96338, 384222, -229254, 203592]
16137E2635a40129j01023A29545Q0848b6295j29387g1067q7312F5133O982K50246
16126C22361A28505c01846B29985p6216b91669a8163j1393E1581c27683A12757
16115c87130d4021A00370g1976j7136j38608I6063b26537D2168c24581a50412
16104F4333L46152E8300a56275A51850q708Q5030f0904r2492e5308l4694q6707
16093a76709N2371A29378J21652j11070c5988A85141H2692h4482A01646d8238
16082I4933Q2504C0905b04793E7662J61010G6016a64597q7509M7781k15653a39167
16070b78456a13410A87999a52068H3378b72227B14316b59428H5475b59438O8121
16060a91317d644I6184a56902d2621A90778b50979J04010j24526M3631a1822n9119
$$ y = [52635, -140129, -241152, 129545, 210393, -26295, -155682, -71067, -158379, 65133, 72115, 322361, 128505, -301846, 229985, 153769, -291669, -18163, -29556, 51581, -327683, 112757, -387130, -44021, 100370, -71976, -89112, -227720, 96063, -226537, 42168, -324581, -150412, 64333, 410485, 58300, -156275, 151850, 143142, 228172, -60904, -153396, -55308, -90002, -176709, -124338, 129378, 251030, 139960, -35988, 185141, 82692, -84482, 101646, -48238, 94933, 177437, 30905, -204793, 57662, 218672, 76016, -164597, -252106, -204325, -419978, -139167, -278456, -113410, 187999, -152068, 83378, -272227, 214316, -259428, 85475, -259438, -191317, -4644, 96184, -156902, -42621, 190778, -250979, -146969, -271495, -227864, -11822, -70941]
16049g0941A76902h9686L2322l7570m6425A89417C5863i3124r8164B74754a07160
16037b9607C8317R540a48639j4348b7296C63230G021c4603I1663d25896B5948
16025a06254B3727f0075B272a7018j46064J3369l87652d0936b298l80187A12538
16013I027O0247R5640e36973E6928J09568d637A96764f01251A78084a14295A11676
16001h2945E7159d43379b3227F2499M4371d20625a85117O4831q9283P0161b883
15989B79757K8632a13296r5707F9611i0404A45618K21561J0548m7925j36423A8871
15977B08281a05396b5280k26362H3936j0546b9852j46214a2105j32134A74917
15966h1080l2484B65553D8087c4309C07881b18628B40290e2874k03357A52234
$$ y = [-70941, 176902, -89686, -57364, -94934, -141359, 189417, 35863, -93124, -191288, 274754, -107160, -29607, 38317, 47857, -148639, -162987, -27296, 363230, 7021, -34603, 91663, -425896, 25948, -106254, 23727, -60075, 2272, -17018, -163082, -149713, -537365, -40936, -2298, -382485, 112538, 9027, 69274, 164914, -536973, 56928, 166496, -4637, 196764, -601251, 178084, -114295, 111676, -82945, 57159, -443379, -23227, 62499, 106870, -420625, -185117, -120286, -209569, -139408, -2883, 279757, 308389, -113296, -209003, 69611, -90404, 145618, 367179, 377727, 329802, 193379, 18871, 208281, -105396, -25280, -251642, 83936, 73390, -29852, -176066, -12105, -144239, 174917, -81080, -113564, 265553, 48087, -34309, 307881, -218628, 240290, -52874, -256231, 152234]
15955e0727k55408B21647J2157h481A02284b01170A30856A0369J21319C8024L8351
15944G6375J19131l0763f9173B23861B9713d5849k6011F6206j6648N4851a86298
15932a54928J1592A47626k0143L1119g8181I2401d340k71868O8356k5558h3775
15920B36919a10281b6577a1960C52087A20313j3000a54770B1503K49445d8443
15909C5541N9311d8448l29972B09829A903L9798I752J04685a30100A96796K0406
15898B17202c09626B8952b99964a13248K2936l00358B4343b22599a2274B46234
15887B022a70525B72677h8871I6347l9404j0545A0680J04492a34466B10165a76803
15875a30146O4455D1179i1982Q444J1069n631A1366a18810j49129J07683M6787
$$ y = [-50727, -306135, 221647, 233804, -8481, 102284, -201170, 130856, 10369, 131688, 38024, 76375, 195506, 164743, -69173, 223861, 29713, -45849, -71860, 66206, 49558, 104409, -186298, -154928, -143336, 147626, 127483, 158602, -78181, 92401, -4340, -276208, -207852, -233410, -83775, 236919, -110281, -26577, -11960, 352087, 120313, 107313, -154770, 21503, 270948, -48443, 35541, 94852, -48448, -378420, 209829, 1903, 41701, 9752, 114437, -130100, 196796, 217202, -309626, 28952, -299964, -113248, -90312, -390670, 24343, -222599, -12274, 246234, 2022, -170525, 272677, -88871, 96347, 56943, 46398, 10680, 115172, -134466, 210165, -176803, -130146, -65691, 41179, -91982, -83538, -72469, -78100, 11366, -118810, -267939, -160256, -113469]
15864a13469A53659K1853a93640B25375I68b60545D7712a1662H803a8046E1243
15852c7267F5906a3483j45673A4477a70742N2227F3789b92335e7330q3334C02308
15840b51103n14284a9199A06530a91767J8746K8571k23288G7502b3013B02942
15829h8945l9537k1775L4893c01B67733c3131p3075A81521a93043q9853R7742
15818a85154H3779f0719k08132g5057j43217J9731D6256i9795J375L8907B13357
15806A24601a80298C05701d5923H4568K14836A41432D6853e4095I0236a72927
15795H6499c24044F6248a12532B49375D5621J5199J02703f5613E7980d5261n10064
15784e55325b18560O8076A05373J02158f3000A72430C2013a47222k03030C05924
$$ y = [-113469, 153659, 175512, -193640, 225375, 968, -260545, 47712, -11662, 8803, -18046, 51243, -37267, 65906, -13483, -159156, 14477, -170742, -118515, 63789, -292335, -57330, -140664, 302308, -251103, -765387, -19199, 106530, -191767, -173021, -144450, -367738, 77502, -23013, 202942, -88945, -128482, -150257, -115364, -301, 267733, -33131, -106206, 181521, -193043, -282896, -185154, 83779, -60719, -268851, -75057, -218274, -198543, 46256, -99795, -98420, -59513, 213357, 124601, -180298, 305701, -45923, 84568, 299404, 141432, 46853, -54095, 90236, -172927, 86499, -324044, 66248, -112532, 249375, 45621, 60820, 163523, -65613, 57980, -45261, -555325, -218560, -150484, 105373, 207531, -63000, 172430, 32013, -147222, -350252, 305924]
15773c11858A00684c0167k28022J11558a3449B52035D7773f7380A04191b07885
15762I500K04905C8517h7469l0285J6880B51678A01868M801K59886j69245J54776
15751C52086a5048m0085E01921b5653A07967J8407J16904N6315h9008F5389J21420
15740A86809f4777B10947E0070d219B16875c3838A47503b62565E9832a86514P4549
15729a11965m1885p3456n6549j5822J28587A08699a81690Q8602F9242h8426B00946
15717a28100A6850c16064h6702k2285L8375A22464C2001k617c3016j33083f0519
15705A5211i2402m5457O4504j44799d3112A32281C1371a94239j29546A46511l8206
15694A08305I68J54055c1090n8595C43105g0391k99323g0528l5621j19904j8957
$$ y = [-311858, 100684, -30167, -258189, -146631, -13449, 252035, 47773, -67380, 104191, -207885, 9500, 214405, 38517, -87469, -117754, -100874, 251678, 101868, 106669, 366555, 197310, 352086, -15048, -55133, 501921, -25653, 107967, 126374, 243278, 299593, -89008, 65389, 186809, -64777, 210947, 50070, -4219, 216875, -33838, 147503, -262565, 59832, -186514, -111965, -153850, -227306, -283855, -299677, -171090, 108699, -181690, -93088, 69242, -88426, 200946, -128100, 16850, -316064, -86702, -108987, -70612, 122464, 32001, 29384, -33016, -166099, -60519, 15211, -92402, -137859, -73355, -218154, -43112, 132281, 31371, -194239, -323785, 146511, 108305, 968, 155023, -31090, -89685, 343105, -70391, -369714, -70528, -106149, -226053, -245010]
15683b45010b9146B06775A02835P3843g240l0147J0578l24509a02110A18922a46906
15671A7600N3453P0318g3962c2169i749j33170q5139o1871J21775j540j26254
15660b95948B63280b18060Q5155n6464b3666A59447O7136A7625K48374p2743b39098
15648a1467j6703m7726j23304d3568I9477j4040k6089b35937K8231A93254m4315
15637A48939g6036E7079N8292c48179J58208k12538J66241i9610r5411g5658k37044
15626c12702m5081h9739C88723j27967Q2487d08268F1350Q3857p0016a80263f8083
15614f6326n8477e4577j7655o2250E5159M9568j8818a16957b0186E1157a77177
15602f6603J3942j11093b2202j0376B40281a15733l1749A1403L00766a10342M2337
$$ y = [-245010, -29146, 206775, 102835, 176678, -7240, -37387, -26809, -351318, -102110, 118922, -146906, 17600, 71053, 141371, -73962, -32169, -9749, -142919, -228058, -289929, -168154, -169694, -295948, 263280, -218060, -132905, -189369, -23666, 159447, 226583, 17625, 265999, 193256, -239098, -11467, -28170, -75896, -199200, -43568, 99477, 85437, 59348, -235937, -207706, 193254, 148939, -76036, 57079, 115371, -348179, -189971, -402509, -236268, -99610, -195021, -75658, -312702, -357783, -89739, 388723, 260756, 343243, -408268, 61350, 145207, 75191, -180263, -68083, -66326, -124803, -54577, -72232, -134482, 55159, 104727, 85909, -116957, -20186, 51157, -177177, -66603, -52661, -163754, -22202, -32578, 240281, -115733, -147482, 11403, 312169, -110342, -68005]
15591f8005A3029a56441E0541K21738e6079k6107A36879a19402A80446k8637a39623
15579b45041M5044B11125j2434E7892c7811j96602K9487A61755J41309E439N6011
15568F1450M7064P9064D7978a52999A75682E725J43156P042B5550a05376j75053
15557b80429B41640f3992r7730k18141F106J68840L0313b5707F9477l2397M4213
15546H1293a34773e5105m31517H6206b4063m1806C08316i3290C0338e5640C9338
15534b2358o510A72587c2689A54396a18540b0323D6279J45877a15010B65057g9448
15522e680j60519a5580r33l07901J42504A47200P9487F5209h3940C29307b18528
15510a64990q3791E6059a56808K3690e6760H5888a73274H8004j3180M8909Q8440
$$ y = [-68005, 13029, -156441, 50541, 272279, -56079, -82186, 136879, -119402, 180446, 151809, -139623, -245041, -199997, 211125, 198691, 57892, -37811, -234413, -204926, 161755, 303064, 5439, 61450, 108514, 187578, 47978, -152999, 175682, 5725, 148881, 155923, 25550, -105376, -280429, 241640, -63992, -161722, -379863, 6106, 174946, 205259, -25707, 69477, 37080, 81293, -134773, -55105, -486622, 86206, -24063, -65869, 308316, -93290, 30338, -55640, 39338, -22358, -28868, 172587, -32689, 154396, -118540, -20323, 46279, 192156, -115010, 265057, -79448, -5680, -166199, -15580, -16513, -324414, -181910, 147200, 226687, 65209, -83940, 329307, -218528, -164990, -248781, 56059, -156808, -133118, -56760, 85888, -173274, 88004, 74824, 123733, 212173]
15499B12173e3860k9437j0501B41588E4338C827c25184C6978a05773A00990D1320
15487A3636e6148A13381C9934P2308m2219Q0961R1344q7941C6139a93900j85663
15476c79563J87000A17176a33868B05608a77785j27967A96233m586d1071o149
15466d7220l0856l7808B02843G5432L356c82506a60510A35961a02113o6014q0114
15455b48241A26049J04344c04542D8367Q8469i6831B47715e6818n3508C64566
15444B42846I6338b69716A29780b0293l47662I9778L4096b13330J6960O0822A66013
15432a9092B53174E4441a9812j30701b9668l9584J1728l6348H9469A6450J00807
15421A17257D8001K67463h3324B29142a488k16037d355j09894p6072P9331F5980
$$ y = [212173, -53860, -83297, -93798, 241588, 54338, 3827, -325184, 36978, -105773, 100990, 41320, 13636, -56148, 113381, 39934, 112242, 70023, 150984, 242328, 154387, 36139, -193900, -379563, -192563, 117176, -133868, 205608, -177785, -305752, 196233, 191647, -41071, -47220, -78076, -115884, 202843, 75432, 78788, -382506, -160510, 135961, -102113, -168127, -248241, 126049, 230393, -304542, 48367, 136836, -96831, 247715, -56818, -110326, 364566, 242846, 96338, -269716, 129780, -20293, -367955, 99778, 133874, -213330, -196370, -135548, 166013, -19092, 253174, 54441, -19812, -150513, -29668, -69252, -57524, -93872, 89469, 16450, 117257, 48001, 315464, -83324, 229142, -1488, -217525, -4355, -114249, -190321, -110990, 65980]
15409b45966b0127A71186F7241a14871q0497k7431A07205f0162j13285B18978
15398a7753A8520B309a53548O0577d3721B6622b04829a8153r211I3159a21970
15386B62123a25580G7902R4129C8572d6689p3360B24322i319l3993A06631b36874
15374B4814j0099Q4712a73073I4513R1426E377a82514A0112Q5631F496K33504
15363B40000A17308a30175k81557A45863b45713A45190E0950Q0820a12688A10863
15352c07079e6899k601b1024G3586i8180C2901a19752d2259l3295A4157J1412
15341B5569r283q120K8731j3190M85710k31490A31398h9372A30035j3539b20846
15329B09075g4163l4977E8681K3760i2111K3336A65658E3887a81882A7007c2588
$$ y = [-245966, -20127, 171186, 67241, -114871, -195368, -222799, 107205, -60162, -173447, 218978, -17753, 18520, 2309, -153548, -92971, -43721, 26622, -204829, -18153, -27364, 93159, -121970, 262123, -125580, 77902, 172031, 38572, -46689, -120049, 224322, -9319, -43312, 106631, -236874, 24814, 14715, 99427, -173073, 94513, 185939, 5377, -182514, 10112, 95743, 6496, 240000, 117308, -130175, -411732, 145863, -245713, 145190, 50950, 131770, -112688, 110863, -307079, -56899, -59500, -21024, 73586, -98180, 32901, -119752, -42259, -75554, 14157, 25569, 16286, 8166, 36897, 23707, 509417, 277927, 131398, -89372, 130035, 116496, -220846, 209075, -74163, -109140, 58681, 82441, -92111, -68775, 165658, 53887, -181882, 17007, -32588]
15317A03524J4384B8738J92322b21101B02768e6597l2945A21625a01473H3260
15306g0630j16490A13685R7570F7684J03955j7968K7958a51335A93505a70867
15295a19691B01350a71518A23270l4475l6015k1076J54107b95921i8365p40j46388
15284b45493f446l18082c3323C7915a0082D1033a8464B51806k8425j05980C1571
15272c0327B58742j9573a51373L7105A80066J40236a01437E6764J69301p1064
15262A55001g8194j05053n5397B02678E1655c19672C78177p0389j30372E609K85404
15251B91013a06256B24491J30114N20915M86473m26785N24480k78632n14442B5783
15240H993b04705I315R1177K20921H9314i1143o2082d0180k37137e1357E757J66293
$$ y = [103524, 117908, 28738, 221060, -221101, 202768, -56597, -89542, 121625, -101473, 83260, -70630, -187120, 113685, 211255, 67684, 171639, 153671, 181629, -151335, 193505, -170867, -119691, 201350, -171518, 123270, 88795, 52780, 31704, 185811, -295921, -98365, -99105, -245493, -6446, -324528, -33323, 37915, -10082, 41033, -18464, 251806, 223381, 117401, 31571, -30327, 258742, 239169, -151373, -114268, 180066, 320302, -101437, 56764, 226065, 155001, -78194, -183247, -238644, 202678, 51655, -319672, 378177, 307788, 177416, 5609, 291013, -106256, 224491, 354605, 875520, 1361993, 935208, 1459688, 1181056, 666614, 25783, 8993, -204705, 9315, 100492, 321413, 89314, -91143, -153225, -40180, -277317, -51357, 5757, 172050]
15228A72050E617a90844i1564F1708a29820C6455N3713J43382a4200j23656e3212
15216D43273C3667a50421N0302R546C76680a51345D37594b21621J00041e9643
15205a19076q890B05392a14388B69132a83832p1438B45397K56254H1879a63559
15194a85774g8232A33461n169c3814G4399f8903D7091J71767Q1222a1749D8780
15182h9976H8580J0755C9985e0156o1821J3482c6466A9410M3171i4134B01388
15170C87847N1705j95174p3944b51765B80954J0156A0736K22421j11854e4143
15159C17266b34389A70110b0119j03705C4005b22515C7865b77422F094J93837
15149A99931n1510d0851C68534h7251q5215A24098M2799b37962A83689R2356j06673
$$ y = [172050, 5617, -190844, -91564, 61708, -129820, 36455, 90168, 233550, -14200, -137856, -53212, 443273, 33667, -150421, -100119, -90573, 376680, -151345, 437594, -221621, -121580, -59643, -119076, -127966, 205392, -114388, 269132, -183832, -255270, 245397, 501651, 81879, -163559, -185774, -78232, 133461, 128292, -33814, 74399, -68903, 47091, 218858, 300080, -11749, 48780, -89976, 88580, 99335, 39985, -50156, -111977, -98495, -36466, 19410, 62581, -94134, 201388, 387847, 439552, 244378, 170434, -251765, 280954, 291110, 10736, 233157, 121303, -54143, 317266, -234389, 170110, -20119, -123824, 34005, -222515, 37865, -277422, 6094, 199931, 148421, -40851, 368534, -87251, -172466, 124098, 166897, -237962, 183689, 276045, 169372]
15138A69372b7647C4030L12850G2845f2592D2972A7887J16567m1389k1777O8946
15127A40234j2346K31697F1554K07229r4676J53127j46653Q4276D0653J96514
15117B37167r7551c5973A50946d5768C11372A44643K3216B4848K38044I5699a5351
15105b07813E40668F0109J53754F2138O1425K21905C3254K03262E6093D304J48249
15094A52553o2305B5984L60615g6858f389A19954L249B8618K25006D7988b59454
15082f4846B59502n7776c267j9834A79289J39869o3002P0687A5459c4393A37400
15070H8859a82261B22362n9951A4202K36954b5074l2851A10803J89127l8435D645
15058C76635a92942B41928q3827K8730J87981j24763a61655A11461K71865M6979
$$ y = [169372, -27647, 34030, 346880, 72845, -62592, 42972, 17887, 134454, 93065, 71288, 140234, 127888, 359585, 61554, 268783, 174107, 327234, 180581, 264857, 40653, 237167, 139616, -35973, 150946, -45768, 311372, 144643, 167859, 24848, 262892, 95699, -15351, -207813, 540668, 60109, 213863, 62138, 123563, 345468, 33254, 236516, 56093, 4304, 152553, 90248, 25984, 386599, -76858, -6389, 119954, 123203, 28618, 253624, 47988, -259454, -64846, 259502, 201726, -3267, -23101, 179289, 319158, 256156, 326843, 15459, -34393, 137400, 88859, -182261, 222362, 162411, 14202, 251156, -25074, -57925, 110803, 299930, 261495, 4645, 376635, -192942, 241928, 158101, 186831, 374812, 250049, -161655, 111461, 383326, 430305]
15048D30305b6781A8221L82620j62279j5552g4106A25460E3954L79448k08736
15038B24666p0043o4303J89361I1383L10867A06383J25388R3897D0421J48867
15028A89288k4702J26280F3785A0208b67551e7817D80444D2630J58095h1968E59905
15016D94123F5581J41449J5175G0182B1729J4322J95047E7679J00150n3126g4046
15004e6816A54510J26259D8801J2782L73301c029C260K10357A6144N16752A98385
14992I1326J37572J66784j434I024K52589N1409E3849K08307j5795K422D9692
14980A38391D0783J12344P3191B2969O634J84994D1331K5480L36316I9862l7162
14969F2700R6115R8468j4214M4784a54008C16992b2831C98514b9974B86870G8598
$$ y = [430305, -26781, 18221, 400841, 238562, 223010, -74106, 125460, 53954, 433402, 224666, 154623, 90320, 279681, 91383, 402250, 106383, 231771, 325668, 40421, 189288, 164586, 290866, 63785, 10208, -267551, -57817, 480444, 42630, 200725, -81968, 559905, 494123, 65581, 207030, 222205, 70182, 21729, 36051, 231098, 57679, 157829, 104703, -74046, -56816, 154510, 280769, 48801, 61583, 434884, -3029, 3260, 213617, 16144, 532896, 198385, 91326, 228898, 395682, 394248, 9024, 261613, 313022, 53849, 262156, 246361, 248783, 49692, 138391, 40783, 153127, 226318, 22969, 29603, 214597, 41331, 66811, 403127, 99862, 62700, 158815, 257283, 243069, 287853, -154008, 316992, -22831, 398514, -29974, 286870, 78598]
14957h7663B86599j29179L37727n5508I5314l0589P2066L34544o0241C7344L08902
14946C46246j45755d6924D86378A75592q2774Q2298m4447K57125a5741A27613
14935C00662k8779J30310A15955Q0222k5024f7159B06898O1670C992M37442D4146
14923C67513D4561L63212J07507k45556J28723q3037K6580A67596K41607p315
14913D01888j80663J13074J75173k36757J44250j36106J75191N7306J00124A18121
14902C61988A02337L8823D6259K88515c4529H704K06330J53617R3774j01129j70739
14891A90557K53990q5336l2K1929F8545J53554P9848J6512k2494J49117k7405
14880D17677A22792d1517j7438D88862p4272j15439L48583B30484p85M17019j93272
$$ y = [-87663, 286599, 157420, 495147, 439639, 95314, 64725, 136791, 471335, 411094, 37344, 346246, 200491, -46924, 486378, 175592, 92818, 175116, 130669, 387794, -15741, 127613, 300662, 271883, 402193, 115955, 196177, 171153, -67159, 206898, 268568, 3992, 441434, 44146, 367513, 44561, 407773, 515280, 269724, 398447, 315410, 341990, 167596, 409203, 401888, 221225, 334299, 509472, 272715, 416965, 280859, 456050, 513356, 613480, 118121, 361988, 102337, 141160, 46259, 334774, -34529, 8704, 215034, 368651, 462425, 361296, 190557, 444547, 359211, 359179, 381108, 68545, 222099, 301947, 318459, 295965, 445082, 417677, 122792, -41517, -58955, 488862, 414590, 299151, 647734, 230484, 229699, 646718, 453446]
14869D53446A24781K57308J29644j11332A57632k8663L50965B21988m1015K05943
14859C86916M07152C93780J17097k18409q2787J16078j20578L73207j06387j25243
14849C46758O4726J02255p4704K62512k61696j26933l033K43245j07679J76709
14839F22160B60564K25563k36856j09188J76960O5026L9318j96027J01949L58370
14829F85679k47342J36234A94992L28393j91313P2708K25024n9117k10699j71758
14819A88230J72719K08828j34089k4611j2730J32910L00052A36868N65477k61064
14809D41281J73655k57956A02432K70961K9467j76346K80395k152Q2388n7487
14799E29658m2028d8947A68985K43517L2824Q1758B51591K21094M5840j0713J56749
$$ y = [453446, 124781, 382089, 511733, 400401, 157632, 128969, 479934, 221988, 180973, 386916, 794068, 393780, 510877, 292468, 209681, 325759, 205181, 578388, 472001, 346758, 411484, 513739, 439035, 701547, 439851, 312918, 309885, 553130, 445451, 622160, 260564, 486127, 249271, 140083, 317043, 382069, 421387, 225360, 327309, 685679, 438337, 574571, 194992, 523385, 332072, 404780, 629804, 570687, 359988, 188230, 360949, 569777, 435688, 411077, 398347, 531257, 831309, 136868, 702345, 441281, 614936, 356980, 102432, 373393, 402860, 226514, 506909, 504757, 587145, 529658, 487630, -48947, 168985, 412502, 445326, 527084, 251591, 472685, 518525, 507812, 664561]
14788F64561j61329k0873K20178k1467k03107K50071C43927J06242K16346P885
14778F74400p4832j32406J77150l15459J2302J38769K22321j37112j33852p766
14768D23515J88775n9580P3982K7311O7477R1450l65076M6720J20302L42735C60479
14756H45252k66615K96868k68593L54279k59698j09393r7835J05361m2542Q3225
14746F40309Q4920k01672n7850K8280M21375j60358o3921J31765q8095k43707
14736D91046R6388N609K00007Q2599k61221J76561j79848r8019l1329J70963M2764
14725F95520j48901K36539k7617q6627M110N25227l19861j68412L13904j4257
14715A009625k55642k15856L199M09367l13036L56847j21686j2969j18059J77991
$$ y = [664561, 503232, 482359, 702537, 681070, 477963, 728034, 343927, 450169, 666515, 674400, 599568, 467162, 644312, 328853, 341155, 479924, 702245, 565133, 431281, 423515, 612290, 552710, 626692, 654003, 721480, 812930, 447854, 494574, 614876, 957611, 360479, 845252, 578637, 875505, 606912, 961191, 701493, 592100, 494265, 599626, 557084, 640309, 725229, 523557, 465707, 493987, 915362, 755004, 691083, 822848, 734753, 491046, 587434, 593043, 793050, 875649, 614428, 790989, 611141, 513122, 481793, 652756, 695520, 546619, 783158, 755541, 668914, 673024, 1198251, 878390, 709978, 1023882, 1009625, 753983, 538127, 541326, 950693, 637657, 994504, 872818, 859849, 741790, 919781]
14705I19781l08739J70467k84710M49365N3624B59039M52207L33991l92964J2260
14695F64533P30446l40514J29808j71840k90544J7791j41528L52466k48147J10566
14685H13037k37212p701L89909L0903J2947J67732j63885q4573J6374N37K22847
14674A160915j25062k00208J93555J83159j93853O5018k83070L9482J18390J42690
14664A101016L817O9039r6757k0944j61517P873J2578n4899L92136l60441m1747
14653H50154K18585O2362P430N4677m0710j06311K61811j59664j98505o8216K6582
14642I08195M2760M2286K22208k29840J68251K51164J31225n38769J73314L07817
14632A478611J69821m18609K09755m8394k24284L46127k26204j67088J56490L84425
$$ y = [919781, 611042, 781509, 496799, 946164, 999788, 259039, 711246, 1045237, 652273, 664533, 1394979, 1054465, 1184273, 1012433, 721889, 739680, 598152, 950618, 702471, 813037, 575825, 568124, 958033, 988936, 1001883, 1169615, 1005730, 921157, 937531, 938068, 1160915, 1035853, 835645, 1029200, 1212359, 1018506, 1083524, 800454, 839936, 958326, 1101016, 1104833, 1173872, 1077115, 1056171, 894654, 902527, 915105, 860206, 1252342, 891901, 850154, 1068739, 1131101, 1138531, 1193208, 1152498, 1046187, 1307998, 1148334, 949829, 881613, 908195, 950955, 993241, 1215449, 985609, 1153860, 1405024, 1536249, 997480, 1170794, 1478611, 1648432, 1229823, 1439578, 1391184, 1166900, 1513027, 1286823, 1119735, 1276225, 1660650]
14622A660650j73198K19717n36838Q3535L12174k33761j91014L42960r5558k83413
14612A105254J12105J75243J41769j09766j63778K36225j0098Q8209j87996O1751
14602A448918L3735J96794j18037J48467l81175M55565k15985m10888L61318J61583
14592A680295j6087K5027k82404L87376q3177j2538J72516k3404j74922J23156
14582A795838J95845N777P2201R7345l11314J11639j47868J03455K01968M8164
14572B173050j6233M8566l6538l11299K17292N6221L34003k53749Q5568q8890
14562B207991K505L39268L30767l66283K96940k1450J89379J12690K78344K45311
14552C615462O53188Q1226R00716K326643M038824R375257K0231770K87331A9102317
$$ y = [1660650, 1487452, 1707169, 1170331, 1253866, 1566040, 1332279, 1141265, 1484225, 1388667, 1105254, 1217359, 1392602, 1534371, 1424605, 1260827, 1497052, 1486954, 1575163, 1387167, 1448918, 1482653, 1679447, 1561410, 1709877, 1328702, 1784267, 1568282, 1157394, 1518712, 1680295, 1664208, 1689235, 1406831, 1794207, 1711030, 1698492, 1871008, 1847604, 1672682, 1795838, 1991683, 1997460, 2069661, 2167006, 1855692, 1967331, 1819463, 1922918, 2124886, 2173050, 2156817, 2205383, 2168845, 1857546, 2074838, 2131059, 2465062, 2211313, 2296881, 2207991, 2210496, 2549764, 2880531, 2514248, 2811188, 2789738, 2979117, 3091807, 3370151, 3615462, 4268650, 4349876, 5250592, 7577235, 11616059, 20991316, 41223086, 41510417, 19102317]
14542A0020747D731812j601493q89226j73316k45430L18670L9734k1418l34107
14533A825226j29605M04164k303O3185M0346K7678j14729L009j02284L01874k82996
14522B033565R3296K36938J02800Q3421n9240j69531J48486J75304L66141n28956
14512B482224J34798K01277j96139L37371l15082J45702j48895K71686o4772o2394
14502B785776j04548K04924J09150K49420m35717K24161J03491K09361k05750
14493C140268r323K12553L858K63329l31024K57567j1295p0019R0852j08338l3966
14482C404462N01725k32345L64861l4858L38024m02886R8727N6959J04728k62657
14472C936740K31566N4383j35526J72478J75291O4719j63783J11968j11765J93551
$$ y = [10020747, 4731812, 3130319, 2241093, 2067777, 1822347, 2141017, 2180751, 2159333, 1825226, 1695621, 2099785, 2097482, 2160667, 2201013, 2228691, 2113962, 2116971, 2014687, 2316561, 2033565, 2126861, 2363799, 2466599, 2550020, 2490780, 2321249, 2469735, 2645039, 3011180, 2482224, 2617022, 2818299, 2622160, 2959531, 2644449, 2790151, 2641256, 2912942, 2848170, 2785776, 2681228, 2886152, 2995302, 3244722, 2809005, 3033166, 3136657, 3346018, 3140268, 3130945, 3343498, 3347356, 3610685, 3279661, 3537228, 3525933, 3455914, 3546766, 3438428, 3404462, 3906187, 3673842, 4038703, 4003845, 4341869, 3938983, 4037710, 4094669, 4199397, 3936740, 4168306, 4222689, 4087163, 4259641, 4434932, 4499651, 4335868, 4447836, 4336071, 4529622]
14462D529622L0125L75940P7186m70474K53778N9774j01294J99140R929j7094
14452D946632J65941j06209M19017l85332J44030k01484P33660j47273p1286K87497
14442E785193j88263K04629J99890J25918j77911K56305L01676l22579L09545
14433F494403j21984M42416P3065l16896K90283J14482j71607M83541j49262R9125
14423G237566J51502J39456P4872K30722N9723k46584M35331j03825J93320L60593
14413H532676R1235j20723M89068k24929K62377J65230k359j11088K12728M70224
14403I764439J75746Q5923K55440J46658J72926K12371k01841L38935N92226l80903
14393A1161920N51855K09265K48908J91541J39510j59007M83225K29705K77487
$$ y = [4529622, 4559747, 4935687, 5012873, 4542399, 4796177, 4855951, 4754657, 4953797, 4963726, 4946632, 5112573, 5006364, 5425381, 5040049, 5184079, 4982595, 5716255, 5568982, 5497696, 5785193, 5596930, 5801559, 6001449, 6127367, 5949456, 6205761, 6507437, 6184858, 6494403, 6372419, 6814835, 6887900, 6571004, 6861287, 6975769, 6804162, 7287703, 7138441, 7237566, 7389068, 7528524, 7603396, 7834118, 7893841, 7647257, 8082588, 7978763, 8172083, 8532676, 8623911, 8503188, 8992256, 8767327, 9029704, 9194934, 9192575, 9081487, 9294215, 9764439, 9940185, 10026108, 10281548, 10428206, 10601132, 10813503, 10611662, 10950597, 11542823, 11161920, 11713775, 11923040, 12171948, 12363489, 12502999, 12343992, 12827217, 13056922, 13334409]
14384A3334409L21152J35712K97431P4342K73093L37502N38484q2428N20194J20508
14374A5870399O18621J73137M92270Q7229Q6443N94948P71291K1340N71239K69730
14364A9556647K50110O40038J46416P19585K01040Q21072K30908P51174M94000
14355B3810990P34869M70872K71953Q13024P63051Q6454R20728P27590N75439
14346B9174970J069947R81623O20454P45319Q88860P44231J138228R43382R95447
14337C7302461J040498J006456J359475J092591J502945J006344J486291J567964
14329D7365025J438298J595047J349680K110110J570413J885557J970725K181703
14321F1466558K303752K106314K552462K607291K266190K998295K772413L198777
$$ y = [13334409, 13655561, 13791273, 14088704, 14163046, 14436139, 14773641, 15312125, 15229697, 15749891, 15870399, 16489020, 16662157, 17154427, 17241656, 17328099, 17923047, 18694338, 18715678, 19286917, 19556647, 19806757, 20446795, 20593211, 21312796, 21513836, 22334908, 22565816, 23316990, 23810990, 24545859, 25016731, 25288684, 26101708, 26864759, 26951213, 27871941, 28599531, 29174970, 30244917, 31226540, 31846994, 32592313, 33481173, 34225404, 35363632, 36307014, 37302461, 38342959, 39349415, 40708890, 41801481, 43304426, 44310770, 45797061, 47365025, 48803323, 50398370, 51748050, 53858160, 55428573, 57314130, 59284855, 61466558, 63770310, 65876624, 68429086, 71036377, 73302567, 76300862, 79073275, 82272052]
14313H2272052L308547L529252L108276M236041L963255M292547M544594M378203
14305A13632767N596875N191318N474923N828707O669706O870441O968289P577002
14297A63810028P909209Q464644R167755R199625J0145325J0490342J1115774
14290B30302702J1075258J2502308J2626647J2715963J3248950J3863156J3892537
14283C20227521J4177207J4692303J4354394J4137427J3711726J3284759J2070616
14276D16655953J1041078R143380P500583L833016O30251r38676j600770k457732
14268D43807083m681570n508920p053753r673147j1604356j3294298j3923897
14261C78067142j5165782j4738639j5167935j5336385j5133691j4694424j4366768
$$ y = [82272052, 85580599, 89109851, 92218127, 96454168, 100417423, 104709970, 109254564, 113632767, 119229642, 124420960, 129895883, 135724590, 142394296, 149264737, 156233026, 163810028, 171719237, 180183881, 189351636, 198551261, 208696586, 219186928, 230302702, 241377960, 253880268, 266506915, 279222878, 292471828, 306334984, 320227521, 334404728, 349097031, 363451425, 377588852, 391300578, 404585337, 416655953, 427697031, 436840411, 444340994, 448174010, 448804261, 447865585, 446264815, 443807083, 439125513, 433616593, 426562840, 416889693, 405285337, 391991039, 378067142, 362901360, 348162721, 332994786, 317658401, 302524710, 287830286, 273463518]
14254B73463518j2291281j2921312j2244519j1882059j1417175j0711076j0088535
14247A91907561q997811r123241q117329p628626p684626o892460o946237o287299
14239A30229932n572497n359245m937036n024975m830785m223457m513934l293528
14231I2474475l177548l760839l422373k889145l134552k930693k544403k433260
14223F8181662k465202k531876j818490j945633k205797j733345k178534j786058
14215E1516727q81538j645051j447856j234357j875335r51707j542530p67776
14207D1170577j143531q76304j207566j055996j300222j052095m93493n60718
14199C3480652j397626o72239j126939k25189j037628m90978p68656p38075p26256
$$ y = [273463518, 261172237, 248250925, 236006406, 224124347, 212707172, 201996096, 191907561, 182909750, 173786509, 165669180, 158040554, 150355928, 143463468, 136517231, 130229932, 124657435, 119298190, 114361154, 109336179, 104505394, 100281937, 95768003, 92474475, 89296927, 85536088, 82113715, 79224570, 76090018, 73159325, 70614922, 68181662, 65716460, 63184584, 61366094, 59420461, 57214664, 55481319, 53302785, 51516727, 50635189, 48990138, 47542282, 46307925, 44432590, 43480883, 41938353, 41170577, 40027046, 39150742, 37943176, 36887180, 35586958, 34534863, 34041370, 33480652, 32083026, 31410787, 30283848, 30058659, 29021031, 28530053, 27761397, 27023322, 26297066]
14190B6297066n93306o76803p16496k19972o50911o58824m39632k89687m20320
14181B1631115r04653j74518n01720l30364k50275o30624k35770l12537k55636
14172A8035018n27290k73663l27854k95577o08347j13742k81625p05305M94787
14163A5396402q21205j42548m5426k23437m54403j18228n60626o9299j23405j51916
14153A2685909k39215p2402l40334j01401l40005Q369o00859L90285p53666j2861
14143A0623820j93042j12074l24446N275m3526k0128m80389J15162r1513k3998
14133I455141j37000m06702J72430n01814K25963l37787j19336k8802m08877O7778
14123G980994N6955k47161L2973o6742k79250k24970L1376l80479o599L67804
$$ y = [26297066, 25703760, 25026957, 24310461, 24090489, 23439578, 22780754, 22341122, 22051435, 21631115, 20726462, 20551944, 20050224, 19719860, 19469585, 18838961, 18603191, 18290654, 18035018, 17507728, 17234065, 16906211, 16610634, 16002287, 15888545, 15606920, 14901615, 15396402, 14575197, 14432649, 14387223, 14163786, 13709383, 13591155, 13030529, 12961230, 12837825, 12685909, 12446694, 12374292, 12033958, 11932557, 11592552, 11600921, 11000062, 11390347, 10636681, 10623820, 10430778, 10318704, 9994258, 9999533, 9956007, 9935879, 9455490, 9570652, 9479139, 9455141, 9318141, 8911439, 9083869, 8582055, 8808018, 8470231, 8350895, 8322093, 7913216, 7980994, 8037949, 7790788, 7823761, 7757019, 7477769, 7252799, 7284175, 6903696, 6897097, 7264901]
14113G264901k88187K0203k13171M651J17321l31622m7616l37483K382K15945
14103F407324k05270k91791O7127j71838j05214l6420p9440j02543j08738m675
14093E368522L86182l57329m02947M18971J20428o08497K22081Q5430j10143k87984
14083D834714J47271m99459J29225J76105P320m77092J90062M1671M3225j53583
14073D439459j3884R1335l22059J8319K45757m19584J55307k13188K99285l35230
14063C945517j48053l8471K35101L03948q4224l38119j66671Q8974N789l1174
14053C772617j25011j59008K83287j07663k72466k48998J2418M44478l72562K65540
14043C492632m03590p8825M04485n02245N58687o02028N1278J99380j07275k23038
$$ y = [7264901, 6976714, 6996917, 6783746, 6788397, 6905718, 6574096, 6526480, 6188997, 6191379, 6407324, 6202054, 5910263, 5977390, 5805552, 5700338, 5663918, 5584478, 5481935, 5373197, 5368522, 5754704, 5397375, 4994428, 5413399, 5533827, 4925330, 5147411, 5232841, 5122698, 4834714, 4981985, 4482526, 4611751, 4787856, 4795176, 4318084, 4508146, 4549817, 4593042, 4439459, 4425575, 4516910, 4194851, 4213170, 4458927, 4039343, 4194650, 3981462, 4280747, 3945517, 3797464, 3758993, 3994094, 4298042, 4213818, 3875699, 3709028, 3798002, 3803791, 3772617, 3647606, 3488598, 3771885, 3664222, 3391756, 3142758, 3155176, 3599654, 3227092, 3492632, 3089042, 3010217, 3414702, 2912457, 3471144, 2869116, 2920394, 3119774, 3012499, 2789461]
14033B789461K48343M4467p7078K27287k51634j67285K83876m18193L04003k85567
14023B697680k0402q5630m5190J63737n7750J7237j86249j37119K32524p44391
14013A834447R03728M5546n20000J8968N0067l6966n371j52174K03447m25467
14003A916225K27716j83614K45631k48784K06430K93639m68699P0742k71103M05601
13993B193784k9419L03098J43116L54884P28395K849611P575337K0304539J0147516
13984D4570861k1592052j1010728m285754k388125j151494l07679j46422j35146
13976C553461n63874j24337J92953p26051K14021J118q0141J6935j36085k0479
13966B327521j54301k6947K0859j38138L02672j28262l64309M35686r9361j71878
$$ y = [2789461, 3037804, 3082271, 3005193, 3232480, 2980846, 2813561, 3097437, 2679244, 2983247, 2697680, 2677278, 2591648, 2546458, 2710195, 2652445, 2669682, 2483433, 2346314, 2578838, 1834447, 2738175, 2783721, 2263721, 2282689, 2332756, 2295790, 2290419, 2138245, 2341692, 1916225, 2143941, 1960327, 2205958, 1957174, 2163604, 2457243, 1988544, 2059286, 1788183, 2193784, 2164365, 2467463, 2610579, 2965463, 3693858, 6543469, 14118806, 34423345, 44570861, 22978809, 11968081, 7682327, 5294202, 4142708, 3835029, 3688607, 3553461, 2989587, 2865250, 3058203, 2332152, 2546173, 2547291, 2467150, 2484085, 2348000, 2327521, 2173220, 2146273, 2167132, 2028994, 2331666, 2203404, 1839095, 2274781, 2175420, 2003542]
13956B003542k13991L6286J00982q3559o9187j0836J49082k25942P4414o9264
13946A691527R0018O3221N1041j12573j30751N8711K66577k29169r4941l00450
13936A353211M09608J33823j72856J01231q4567o0357J70547m63155J08499L03854
13926A799838j85570n3654M6981l6167k51550J57219j02757J23298j18669K96153
13916A675122J2038l83531M98651k38966k60156j52154L50050O3327j52948L60424
13906A771857j79841l7437k58420L06088j95980j10934L90988l03788J16713m8729
13896A450517k60802Q4577j00194R8014j129k161K22236o9818n9550M1571l18799
13885A084462K16165j48016r914K869R5278P5902l56012J92438k7119K05003n00674
$$ y = [2003542, 1789551, 1825837, 1926819, 1843260, 1774073, 1763237, 1912319, 1686377, 1760791, 1691527, 1781545, 1844766, 1895807, 1783234, 1652483, 1711194, 1977771, 1748602, 1653661, 1353211, 1762819, 1896642, 1723786, 1825017, 1740450, 1680093, 1850640, 1387485, 1495984, 1799838, 1614268, 1560614, 1607595, 1571428, 1319878, 1477097, 1374340, 1497638, 1378969, 1675122, 1687160, 1303629, 1802280, 1563314, 1303158, 1151004, 1501054, 1564381, 1411433, 1771857, 1592016, 1554579, 1296159, 1602247, 1406267, 1295333, 1686321, 1382533, 1499246, 1450517, 1189715, 1274292, 1174098, 1272112, 1270983, 1268822, 1491058, 1421240, 1361690, 1403261, 1084462, 1300627, 1152611, 1142697, 1145566, 1240844, 1316746, 960734, 1153172, 1126053, 1331056, 830382]
13874H30382L93040J33074k29424n0331m796J13619m22991L74171j71126M09825
13864A375443l05668N3352q3793O1490Q3019l55531J39323M17331n70702L13524
13854A127788m1997J22169r2089j42670O2614D59892K98879L0305K6659K96850
13844A112585l5315p1150J00449J73316l08705q3996J38766P6200j96989k872
13834I02289J9838j34684J10313K27115k70794J66896q5528j49180J82250O0075
13824A028590n6853J06349l19374o9673K74637r5704J10563r8952K45263D93262
13813G39142k170L23566m08567K01479J63373k04266k47649J34174L25253j83650
13803H40685M19875E90829K4611K35883K93123l9142l39338j55928M1340L15878
$$ y = [830382, 1223422, 1356496, 1127072, 1076741, 1071945, 1185564, 762573, 1136744, 965618, 1375443, 1069775, 1123127, 1039334, 1100824, 1183843, 828312, 967635, 1384966, 814264, 1127788, 1085791, 1207960, 1115871, 973201, 1035815, 459892, 758771, 789076, 815735, 1112585, 1077270, 1006120, 1106569, 1279885, 971180, 887184, 1025950, 1102150, 905161, 902289, 922127, 787443, 897756, 1124871, 854077, 1020973, 935445, 786265, 968515, 1028590, 971737, 1078086, 758712, 689039, 963676, 867972, 978535, 879583, 1124846, 493262, 739142, 736972, 1060538, 651971, 853450, 1016823, 812557, 564908, 699082, 1024335, 840685, 1260560, 590829, 615440, 851323, 1144446, 1105304, 765966, 610038, 651378, 967256]
13793I67256k99938J55320n2997j81319O6216R2669j46760L70237D80169J08520
13783E88689J57018n1180J02511n1440k85080K02900R3092M5388o3519m0291K35344
13772I33432l87538L23379p9762m5901j56099n7202L03058M3853j92842K65835
13762I50213K09986k32285l81115r595j20174K23056p5120J82967B22992O28260
13752H51252l12937J18242Q4434k34442j13633j91639L10567J32852j05054n6899
13742D82743J52148Q1531m1246r7457J78701j1910p7792J77264k10400j9634K90798
13731I04746m04006A81239M85616K06010l14838M18089l50020m0412J17017j7550
13721F85151L1968k57565J40246j15661M3469A33773O11841A18641N82305r3924
$$ y = [967256, 667318, 822638, 769641, 588322, 654538, 747207, 600447, 970684, 480169, 588689, 745707, 694527, 797038, 745598, 460518, 663418, 756510, 801898, 738379, 698088, 933432, 545894, 869273, 789511, 743610, 587511, 530309, 833367, 877220, 684378, 950213, 1160199, 927914, 546799, 537204, 417030, 640086, 564966, 747933, 222992, 851252, 538315, 656557, 740991, 506549, 392916, 201277, 511844, 644696, 539642, 482743, 634891, 716422, 675176, 577719, 756420, 744510, 666718, 843982, 633582, 613948, 904746, 500740, 181239, 666855, 872865, 558027, 976116, 626096, 585684, 702701, 685151, 717119, 459554, 599800, 484139, 527608, 133773, 745614, 118641, 700946, 607022]
13711F07022J1382p5678J82038B67568M44614B78930J32880K440J09503j81481
13701C42272j8819J2949J75451J64083M9727C09096J41860J84582k74490K5297
13691C86345j15505K7074O9344M6694K76027C28477A37011E7428M17933k8337
13681D47024j22996M416L18332B84716N4816J16148k7085l5507j20573J23556
13671C96071M3178O6358j42566J52219N904K49276j87938K1082k17499A68062
13660E59375q4012N7478k63043J6263j5581L72213M7370B73958P9019L04826j56635
13649E01168J73138k12781K74987k95594J6544o1026J17083L8778B48426O676
13639B55102J87133j68713J50119L5893A44478K30640J6903L5489j57720j01083
$$ y = [607022, 618404, 542726, 724764, 267568, 712182, 278930, 411810, 414250, 523753, 342272, 323453, 336402, 511853, 675936, 725663, 309096, 450956, 635538, 361048, 386345, 270840, 297914, 367258, 413952, 689979, 328477, 137011, 57428, 475361, 447024, 324028, 328444, 646776, 284716, 339532, 455680, 428595, 393088, 272515, 396071, 439249, 505607, 363041, 515260, 521164, 770440, 582502, 603584, 386085, 168062, 559375, 475363, 532841, 269798, 286061, 270480, 642693, 690063, 273958, 352977, 657803, 501168, 674306, 461525, 736512, 440918, 457462, 396436, 513519, 552297, 248426, 255102, 442235, 273522, 423641, 459534, 144478, 375118, 392021, 427510, 269790, 168707]
13629A68707K93577k16763O7692k4036J79658c3005D17393m487M00054C25049
13618D44604J98783j63360j34429L15897B96099k6334K94817j09603B06413L46638
13608E53051k31379K35355O6718k50928K72846l00841l4166h262B21856M47371
13598F69227A75778N35812k46425j85855K60527j92127A55146J55857N9659O2088
13588D32750n9055j19941P0070A58221K57486Q1670A61568L94121j71167q905
13578C75617p7203I2211K36850K35654M6014A34711O1581J54254R3506n8532I1983
13566B81243N3094E3208K20018Q6782K3202p3967J37952j76065J63497g2240E22966
13554E54992H9991a07962A48939J35145E7540P3217K1150o0626L62537J43758
$$ y = [168707, 462284, 245521, 313213, 289177, 468835, -33005, 417393, 412906, 812960, 325049, 444604, 643387, 480027, 345598, 661495, 296099, 269765, 564582, 454979, 206413, 553051, 321672, 557027, 623745, 372817, 645663, 344822, 310656, -8262, 221856, 669227, 175778, 711590, 465165, 279310, 539837, 347710, 155146, 311003, 370662, 432750, 373695, 253754, 323824, 158221, 415707, 497377, 161568, 555689, 384522, 375617, 298414, 92211, 329061, 564715, 610729, 134711, 196292, 350546, 444052, 385520, 91983, 281243, 334337, 53208, 273226, 360008, 383210, 309243, 447195, 271130, 434627, -72240, 522966, 554992, 89991, -107962, 148939, 284084, 57540, 130757, 151907, 91281, 453818, 597576]
13544E97576p3202A24495J72502J49719A92014Q8403P2805j40069L78374B26375
13533C61112J00570j95805E7069L31878j27974j22459K91427A02045J70176E6574
13522A53547K62921c0737B02163J42011J30867A39435J42291J547j06287h8289
13511I66M99038p715I2904C808K82486j34878K90733D5556K10938A00210L54801
13500D55011r8172a0843A12361K35802o5235P228n634A22332J78526K5304I3211
13488B20533K06988L7791j11478K4340A64506K83m9518J57508r8717K41167A93409
13476B73721I0003l5797J88032F4540J15926Q0070K408M9987p5182j0929L2789
13465B59609Q7117A66696C7430L78569c7373B91984o6330F9070J76328c0802F38554
$$ y = [597576, 524374, 124495, 296997, 446716, 192014, 280417, 353222, 213153, 591527, 226375, 361112, 461682, 265877, 57069, 388947, 260973, 138514, 429941, 102045, 272221, 56574, 153547, 416468, -30737, 202163, 344174, 475041, 139435, 281726, 283273, 176986, -88289, 966, 500004, 492289, 92904, 3808, 286294, 151416, 442149, 45556, 256494, 100210, 455011, 356839, -10843, 112361, 348163, 282928, 290156, 284522, 122332, 300858, 326162, 93211, 220533, 427521, 465312, 353834, 378174, 164506, 164789, 115271, 272779, 174062, 415229, 193409, 273721, 90003, 54206, 242238, 64540, 180466, 260536, 262944, 312931, 237749, 226820, 259609, 346726, 166696, 37430, 415999, -37373, 291984, 225654, 69070, 245398, -30802, 638554]
13453C72931a5600D13191j98401b8717A62293J579Q9337M7249j09792N9621J66626
13442D16913j34482o359p4682J26421J51017K3066A86311E6287b2112l8722B67848
13430G6929M6993Q4771l9243l8427J46982j3874D7025d0292p7601C05634K74282
13419E79916k09775A11547k6063J57949n2874M262K2142p8934K04947A47183K4856
13408A72039J81N2675C0091K08280R1747A64378J94822i3851D03222H4079K49261
13397C33340j61552l1876k3436N7309b2442j61921B04419J21880j40947K2279
13387B07631H9228h2094B61766j18032k5079B6343R1282J41106H3054g2769c318
13375A92984o5901J70755J03761j74195i4458a8868A91513n5552J81308p5927
$$ y = [372931, -15600, 413191, 214790, -28717, 162293, 163872, 253209, 300458, 190666, 250287, 416913, 282431, 276072, 201390, 327811, 478828, 501894, 186311, 56287, -22112, -60834, 267848, 76929, 123922, 208693, 169450, 131023, 278005, 264131, 47025, -40292, -117893, 305634, 579916, 370141, 111547, 85484, 243433, 190559, 194821, 216963, 138029, 342976, 147183, 172039, 172220, 224895, 30091, 238371, 330118, 164378, 359200, -93851, 403222, 84079, 333340, 171788, 139912, 116476, 173785, -22442, -184363, 204419, 326299, 185352, 207631, 89228, -82094, 261766, 143734, 118655, 26343, 117625, 258731, 83054, -72769, -3318, 192984, 127083, 297838, 401599, 227404, -94458, -18868, 191513, 135961, 317269, 241342]
13365B41342r3369K28257j22726J77564A5044L0548M88537A71715n5110c8330
13354e1181C48581A53017b454q6173k3209B26786K6803K9898K85906k71498Q0402
13343C78297O873I1683K06287Q0035F3066a2021D41771k01965J32998A48856d9573
13331E0676N5297b192D38036j97013n92j02039J81960N8835b2444m6757B93186
13319A28449M858K62988A65790Q0474R9665m0355A3515N16836H6798K19505q6779
13308B19524a31234O2988G6018d8833C22294F1716J66360q5343R4705R5400A33019
13296A21625K52908A83538F3223K12628b12267C74586c86536g6804B45187A18957
13285d0758B71593A28926P4494H5714J29720J30807i6997A99716h7746A92075
$$ y = [241342, 147973, 376230, 253504, 431068, 15044, 45592, 534129, 171715, 116605, -38330, -51181, 348581, 153017, -2454, -88627, -111836, 226786, 253589, 283487, 569393, 297895, 378297, 385170, 91683, 297970, 378005, 63066, -12021, 441771, 239806, 372804, 148856, -49573, 50676, 105973, -2192, 438036, 241023, 240431, 138392, 320352, 379187, -22444, -69201, 293186, 128449, 133307, 396295, 165790, 246264, 345929, 305574, 13515, 530351, 86798, 306303, 219524, -131234, -68246, 76018, -48833, 322294, 61716, 228076, 142733, 237438, 332838, 133019, 121625, 374533, 183538, 63223, 275851, -212267, 374586, -386536, -76804, 245187, 118957, -40758, 271593, 128926, 203420, 85714, 215434, 346241, -96997, 199716, -87746, 192075]
13274E5251i9786A67443J67210q7043J238L6966A14491J31717G7254h3114B35917
13262b3175A24147a58181b4328A30240B8126b81355A37951J12058F1733J69738
13252B31471K6290a27226A62917k9365K37427J93737A06694P1062E2065n70b26045
13240C31720j04072A12277J65272d3773C5168d747G3698J67225c27E1549B3671
13228a45500C76244a18054B98136f8746B04153Q1990c7492B10647J76747j37873
13218B49521a30384A42662Q4972b34776H1807P9577j9095e8999K8165B15747e1676
13206B45478q990D8365b2664A82445c75403C27K37775o1500H6696L35419j14438
13195C07677G3939L21052A24665J56973a267o9261A69467B791d3037A32896r929
$$ y = [55251, -99786, 167443, 334653, 247610, 248848, 285814, 114491, 246208, 77254, -83114, 235917, -23175, 124147, -158181, -24328, 130240, 28126, -281355, 137951, 250009, 61733, 231471, 257761, -127226, 162917, 133552, 370979, 564716, 106694, 177756, 52065, 51495, -226045, 331720, 227648, 112277, 277549, -43773, 35168, -4747, 73698, 240923, -327, 51549, 23671, -145500, 376244, -118054, 298136, -68746, 204153, 286143, -37492, 210647, 387394, 249521, -130384, 142662, 227634, -234776, 81807, 161384, 142289, -58999, -30834, 215747, -51676, 245478, 236488, 48365, -22664, 182445, -375403, 327, 238102, 176602, 86696, 422115, 307677, 73939, 394991, 124665, 281638, -1267, -70528, 169467, 2791, -43037, 132896, 122967]
13184A22967a47969E3872f1536F51910B01636b5504H4068O6697B1174J49074D8234
13172A73008A560J31426c0991B72499A0371Q2187P7544A0058M84995A06458g2515
13160a57725M3157B8123g3135C8747J52778p176c6644f989o5126C63578F0526
13148G8138N2881j3991j6246A8218n534L06195j22254Q1575i3235B25833b4572
13136d6664C99845A34778Q817J48543E6234K34948C1743L08278m2233A46172F6191
13124A70486d29771D2163O7859a34522C23540g3188j13846G0415K9289b3598D8618
13112F2346K15767a32335e172B87219J3312I7781J86829j18165n7472b28507G3436
13100a19556H8690B3382J7248K487h4051a5838k8020B07014F8816N6595K36952
$$ y = [122967, -147969, 53872, -61536, 651910, 201636, -25504, 84068, 150765, 21174, 170248, 48234, 173008, 1560, 132986, -30991, 272499, 10371, 92558, 170102, 10058, 495053, 106458, -72515, -157725, -114568, 28123, -73135, 38747, 191525, 184349, -36644, -6989, -72115, 363578, 60526, 78138, 131019, 117028, 100782, 18218, 12684, 318879, 196625, 278200, -93235, 225833, -24572, -46664, 399845, 134778, 143595, 292138, 56234, 291182, 31743, 340021, 297788, 146172, 66191, 170486, -429771, 42163, 110022, -134522, 323540, -73188, -187034, 70415, 99704, -23598, 48618, 62346, 278113, -132335, -5172, 287219, 300531, 97781, 284610, 166445, 108973, -228507, 73436, -119556, 88690, 23382, 40630, 43117, -84051, -15838, -43858, 207014, 68816, 125411, 362363]
13089C62363B6912d398A87420m6510R6119L7214j0169B6196L18886a9895A16611
13077B05378h3109n3991A92711o9435N44764H1687j3270J32741r0035b14581b9102
13065a89357B81966j38409J32928J6850a70789A30687f6406A63850K02518a5355
13054d7569A68969O2533p3391p735b23736A60156d8610j4376J0305A69295F6057
13042C52241B4391L86627a1111j68036B44093K3230F5350a05554Q145k00151D61199
13030B6416J07886C4758c5635A4060M8460P3225g5261B57753o7968L3480d2052
13018A06168J4886B8990M8425K1079K37324F9080a31527B34206J35118e1735n780
13007e7515C75222D4510d7428B88468j25848l4490E2105g0269j4806B98223a33734
$$ y = [362363, 26912, -4398, 187420, 140910, 237029, 274243, 264074, 26196, 345082, -19895, 116611, 205378, -83109, -137100, 192711, 123276, 668040, 81687, 68417, 201158, 111123, -214581, -29102, -189357, 281966, 143557, 276485, 293335, -170789, 130687, -66406, 163850, 366368, -15355, -47569, 168969, 231502, 158111, 150376, -223736, 160156, -48610, -62986, -52681, 169295, 66057, 352241, 24391, 411018, -11111, -179147, 244093, 267323, 65350, -105554, -97409, -297560, 461199, 26416, 134302, 34758, -35635, 14060, 62520, 135745, -75261, 257753, 189785, 223265, -42052, 106168, 121054, 28990, 77415, 98494, 335818, 69080, -131527, 234206, 369324, -51735, -57515, 375222, 44510, -47428, 288468, 162620, 128130, 52105, -70269, -85075, 298223, -133734]
12995i8950B14062I9224K36362G703e196A53161a54064a3637j06885A07349M1195
12984A48544b71867C87846j86873F1051b80679a8825r7763C27553a15586C25622
12973F3536f1823r4833B23453A1537O2971J21273e3662A31569N7781L2899a52662
12961C13965j32353e1854C4639L70537B00602J69807A08070d7446D0658g9527
12950a73821A45116K2582h4768m4623k17124B44731n0197n7175A6940K7980J50842
12939A95762G120L3309O9358a57336A41119L0450Q1089k8376B7604K58061a06887
12927g3012l9586B53946I1522a1831E2276J65209J6552n5887g6330B96834E9973
12915d3367B98283A8514J85414q4860C3837O2809J95046a73475N8885j19601c2712
$$ y = [-98950, 214062, 99224, 335586, 7703, -5196, 153161, -154064, -13637, -120522, 107349, 148544, -271867, 387846, 200973, 61051, -280679, -18825, -116588, 327553, -115586, 325622, 63536, -61823, -156656, 223453, 11537, 74508, 195781, -53662, 131569, 189350, 222249, -152662, 313965, 181612, -51854, 34639, 405176, 200602, 370409, 108070, -47446, 40658, -79527, -173821, 145116, 167698, -84768, -129391, -346515, 244731, 194534, 137359, 16940, 44920, 195762, 7120, 40429, 109787, -157336, 141119, 171569, 252658, 224282, 27604, 285665, -106887, -73012, -112598, 253946, 91522, -11831, 52276, 217485, 234037, 178150, -76330, 296834, 59973, -43367, 298283, 18514, 203928, 119068, 33837, 96646, 291692, -173475, -114590, -234191, -32712]
12903A42853a23824F7296J75245A18246a73073B6330a39049O4073B01616g0379
12892A63867o9237b71519J08165m3123A5499K78921a05924R060j03682A05690
12881A30223a70364F4971A4915a94890K4632K6026j2634O8403E9126L5995D551
12869B33091d5120l38464a49411k14241a11515G6857J36604c7536J737n1744p1056
12858a58599f595A10739a67380A59564L03599k21281N7464B9311K11695l1773
12848B09233f4812H4768a64185D08484D0539J73480I9845K9281J19067H5996a7018
12836E6816a5439B19403b89955a28533r3841I2803a9958A10851d6355j39310Q3216
12825a02449q9512B66557c391r7707j19920E7962d2824C14609d12633A69074C9259
$$ y = [142853, -123824, 67296, 242541, 118246, -173073, 26330, -139049, -74976, 201616, -70379, 163867, 94630, -271519, -163354, -206477, 15499, 294420, -105924, -96864, -200546, 105690, 130223, -170364, 64971, 14915, -194890, -170258, -144232, -156866, -88463, 59126, 95121, 4551, 233091, -45120, -383584, -149411, -363652, -111515, 76857, 213461, -37536, -35799, -87543, -158599, -6595, 110739, -167380, 159564, 463163, 241882, 299346, 29311, 241006, 209233, -64812, 84768, -164185, 408484, 40539, 214019, 99845, 129126, 248193, 85996, -17018, 56816, -15439, 219403, -289955, -128533, -222374, 92803, -19958, 110851, -46355, -185665, -102449, -191961, 266557, -3391, -101098, -221018, 57962, -42824, 314609, -412633, 169074, 39259]
12813A96690p332r4051a89647M560A23469J18596a53696f5179b5064A3869b547
12801B26356F9093J83177D9878R6968C7860e8566B1758L1078h6572a0182m7012
12790e7194C06232B6920o879J81164m0669A8327M04627E5531a39919j04908A69712
12778C46958A34016d13121a22936M1998G9057P8853a4049C25209A02888c5618
12767e5235j11473B04393a13588M9435k7737j15206G155a67401B25370F4691a48681
12755B11587f2480A0653R5148a00658B66311A07079b87176A99090G6912B9095
12744d76431D8934j0967O87A2320R6927d7169H2760K74471A69035G342K62828
12733B70170K905b97365C2381h3191j01274C6906J50311o2941A9499K49534a50768
$$ y = [196690, 189358, 95307, -189647, -185087, 123469, 242065, -153696, -65179, -25064, 13869, -2547, 226356, 69093, 252270, 49878, 146846, 37860, -58566, 21758, 52836, -86572, -10182, -57194, 306232, 26920, 20041, 201205, 160536, 18327, 422954, 55531, -139919, -244827, 169712, 346958, 134016, -413121, -122936, -80938, 79057, 157910, -14049, 325209, 102888, -35618, -55235, -166708, 204393, -113588, -64153, -91890, -207096, 7155, -167401, 225370, 64691, -148681, 211587, -62480, 10653, 105801, -100658, 266311, 107079, -287176, 199090, 76912, 29095, -476431, 48934, 37967, 38654, 12320, 109247, -47169, 82760, 357231, 169035, 7342, 270170, 273075, -297365, 32381, -83191, -184465, 36906, 187217, 124276, 19499, 269033, -150768]
12721C06710D0461r383K57222a5229m4783B47367a5049r1867i065I3474N048a43071
12708B5198L76996j64730G9428J51143A03108e6113C69997A10903J73211P5780
12698C59894c85148E0283K75422C8999d6166E45056G945e6062D4386J80497g6601
12686A81990a41552I9681a44863F2912a25806d0887E9882R8628N881F3073A2678
12674I9815K27843H0230l7523b16330J4526B67554A5696i4287l063a5267D16204
12662b1323A3856L6766L7066e3676j01264B25495K9195j13336f6700j2199m6527
12651a25426B23017a21720B01936H9176b80942B22709e2283C0922R7535b79724
12640i7521n5196k04228a52423B63892b5889Q63B00698n970C2754c1119A0356
$$ y = [306710, 40461, 31078, 288300, -15229, -60012, 247367, -15049, -106916, -9065, 93474, 98522, -143071, 25198, 402194, 237464, 79428, 230571, 103108, -56113, 369997, 110903, 284114, 359894, -385148, 50283, 325705, 38999, -46166, 545056, 7945, -56062, 44386, 224883, -76601, 181990, -141552, 99681, -144863, 62912, -125806, -40887, 59882, 158510, 164391, 63073, 12678, 99815, 327658, 80230, 42707, -216330, -201804, 267554, 15696, -94287, -97350, -15267, 416204, -21323, 13856, 50622, 87688, -53676, -154940, 225495, 254690, 141354, -66700, -78899, -125426, 223017, -121720, 201936, 89176, -280942, 222709, -52283, 30922, 128457, -279724, -97521, -152717, -356945, -152423, 263892, -25889, -25026, 200698, 194728, 32754, -31119, 10356]
12628A13568R0394P484M5251H8477a05539c4842l6935A75341E9607A579O664K94136
12616C02379a19517A38090g0122A69442n9017J261A2671K66703q5545g0366A31247
12604G4098A6104J60798d6956B33409l4171r2428K03628e2786A68172a44224C69773
12592A42412J00151A16458j9892k2192J65793j13402J99168E4888K04266A11183
12581a27125d9256D8612a6575A28096e7216A51686c41581A16101a09551q1459
12571a91010d3498n3354D3362L4116a24124h615I2778M01A1206L36619j65454
12560A82371a778k75994C76062A77412c28633c533A57911b04633F4653Q8971M3366
12549A96990j7692F2127b93475j14421J42080A2791F054K10673i6029G3387B5464
$$ y = [113568, 203962, 211446, 256697, 88477, -105539, -34842, -71777, 175341, 59607, 1579, 8243, 302379, -119517, 138090, -70122, 169442, 110425, 111686, 12671, 279374, 193829, -70366, 131247, 74098, 16104, 176902, -46956, 233409, 199238, 106810, 310438, -52786, 168172, -144224, 369773, 142412, 242563, 116458, 96566, 74374, 240167, 126765, 325933, 54888, 259154, 111183, -127125, -49256, 48612, -16575, 128096, -57216, 151686, -341581, 116101, -109551, -191010, -43498, -96852, 43362, 77478, -124124, -8615, 92778, 93179, 11206, 347825, 182371, -1778, -277772, 376062, 177412, -328633, -3533, 157911, -204633, 64653, 153624, 196990, 179298, 62127, -293475, -407896, -265816, 12791, 6054, 216727, -96029, 73387, 25464]
12537D82963A09435B0565K9730a50408N6079D8468R9444J53226M0809a68915F0023
12525a02594A84632o890h2511C766c25735g4152C16062a13650A47095a36927j806
12514a38733f6626A7616a44847C63338A40631C5467K08987L0700A11097a28258
12503F3673I051J52839a9596A39673M4732H8228a60490f9572j11664b7604A83270
12491E9586J51994K9522g805I1851b08281B08820R231a53093B76806A2155a02265
12479B28590j08178b38349f2599k03665g7954D8109g5498A37617b85200A8252
12468A62334L2539A4523M76M3393J75524C7782O6780b12290B01037b45978J10170
12457a35808C0166a40200B9065e2723j26412G1131a97067n9287A29554a65792
$$ y = [482963, 109435, 20565, 50295, -150408, -94329, 48468, 147912, 301138, 341947, -168915, 60023, -102594, 184632, 177742, -82511, 3766, -325735, -74152, 316062, -113650, 147095, -136927, -138733, -66626, 17616, -144847, 363338, 140631, 35467, 244454, 275154, 111097, -128258, 63673, 9051, 161890, -19596, 139673, 184405, 88228, -160490, -69572, -181236, -27604, 183270, 59586, 211580, 241102, -7805, 91851, -208281, 208820, 218051, -153093, 276806, 12155, -102265, 228590, 120412, -238349, -62599, -266264, -77954, 48109, -75498, 137617, -285200, 18252, 162334, 194873, 14523, 14999, 58392, 233916, 37782, 104562, -212290, 201037, -245978, -135808, 30166, -140200, 29065, -52723, -179135, 71131, -197067, -256354, 129554, -165792]
12446F0611K29122d935k7992k64792d8679r9860l9402d7159j23285E3297b6990
12434b95159A73395a79203h6981o3987A85160b52435g3616B8757Q6429K7998J45481
12423B88665f6767j71786B14121a23120B42136j09033C4483a63933B2988P7686
12413A00674c93217C62643f9307k7072G8550A8705a35642a8156l6931G8001i9493
12401b0612j35817B2975J87576r0616b04892A9720L04362e2529A86415J79306
12391C65721E4520a04888A02062h7452M3419C0585a06398A17143c0131H7326C744
12379a89468j25291a1115j8649r186A89848a08884k36719O444c2744H8953i4259
12367f1242J380C912h2265I3451J51249c3044B86401m8161A06694p241b06793
$$ y = [60611, 289733, -4935, -32927, -297719, -48679, -148539, -187941, -47159, -170444, 53297, -26990, -295159, 173395, -179203, -86981, -150968, 185160, -252435, -73616, 28757, 115186, 143184, 288665, -66767, -238553, 214121, -123120, 242136, 133103, 34483, -163933, 22988, 100674, -393217, 362643, -69307, -96379, 78550, 18705, -135642, -18156, -55087, 78001, -99493, -20612, -156429, 22975, 210551, 119935, -204892, 19720, 324082, -52529, 186415, 365721, 54520, -104888, 102062, -87452, -44033, 30585, -106398, 117143, -30131, 87326, 3744, -189468, -314759, -11115, -29764, -38950, 189848, -108884, -345603, -339159, -32744, 88953, -94259, -61242, -59862, 3912, -82265, 93451, 244700, -33044, 286401, 238240, 106694, 99453, -206793]
12355h1038j27817A82716c00618B70385a44770a3104j00830A60414h9591C5020
12344B09570B5202q814a21069A03067d0766A64849e7797A65256L1249d3772J3410
12333c0362A88866a02430G1310b95734A2771L77771b43747A25504b68263e392
12322B18520D0839R4233a57882D3178a51648C8456f5026J0210A01813J79500g5009
12310c64892E51511A00935e657B92668d7237D15028b5924A94677d9001H6642B5730
12298C43648b58963N0432A11810a14488I7255h3237A37435E6084c8396k3846G6751
12286a38415A43083a94198C43071a62202d203n0699J2485A5251J08015J04973
12276B28239L6768G0627J03166N2199a53511A84521B1854i1D1908j6490J78979
$$ y = [-81038, -208855, 182716, -300618, 270385, -144770, -13104, -113934, 160414, -89591, 35020, 209570, 25202, 16388, -121069, 103067, -40766, 164849, -57797, 165256, 196505, -43772, -30362, 188866, -102430, 71310, -295734, 12771, 390542, -243747, 125504, -268263, -5392, 218520, 40839, 135072, -157882, 43178, -151648, 38456, -65026, -54816, 101813, 281313, -75009, -364892, 551511, 100935, -5657, 292668, -47237, 415028, -25924, 194677, -49001, 86642, 25730, 343648, -258963, -208531, 111810, -114488, 97255, -83237, 137435, 56084, -38396, -62242, 76751, -138415, 143083, -194198, 343071, -162202, -4203, -54902, -42417, 15251, 123266, 228239, 265007, 70627, 173793, 225992, -153511, 184521, 21854, -91, 41908, 25418, 204397]
12265B04397f9391j07197b8115c017I6489C1110K00852j1867K9552a54331F0326
12253D3783B500A06i3142A22637k444L574B9288g4206B2666J05224N2725J54245
12241C34860a9565C17536J39824C875J04486c5453q4757E6393a32280J3577B91317
12229E88405I2739g1096A48582P7996O8453A28779k927K19597A65643K02153k7257
12218C40539j15595K25580A79081M4557A00487L8383M7081L9035C7675K02665
12208B40340H4058p705J81937j01507a23086B90353b97781B72852J1475L9423
12198C23750d9732A22536Q3786K00982n2798A72503Q356a48947B12693j2582d796
12186B07147M16895a66886d7821A30960E9694K49637c3617A25721K81302h7253
$$ y = [204397, -69391, -176588, -28115, -3017, 96489, 31110, 231962, 220095, 249647, -154331, 60326, 43783, 2500, 106, -93142, 122637, 120193, 123767, 29288, -74206, 22666, 127890, 180615, 334860, -19565, 317536, 457360, 3875, 108361, -35453, -120210, 56393, -132280, -118703, 291317, 588405, 92739, -71096, 148582, 226578, 295031, 128779, 125852, 345449, 165643, 367796, 340539, 224944, 450524, 179081, 223638, 100487, 138870, 185951, 224986, 37675, 240340, 84058, 76353, 258290, 156783, -123086, 290353, -297781, 272852, 284327, 323750, -49732, 122536, 206322, 407304, 354506, 172503, 180859, -148947, 212693, 200111, -4796, 207147, 624042, -166886, -47821, 130960, 59694, 309331, -33617, 125721, 407023, -87253]
12175B08855I2715J74406E4373K03681o4467A0821J48946n1312C4566f0112C43859
12163A95579p7500c14972B1993J04084P5100G3397J88397a33138C19672I5672
12152A47075l3836f5228a0706B32461q642b9794F2776J25294D2218d5394H0122
12140a30596A49920A3763K72170J46420E3293Q1308b7184A3870n746b08908g6635
12128b55698H3447J78890a79361e731n7310l61634g8908B7351b03844N0385C96059
12116a01657A18314b12237g9891A47524d45940A12069L44959a64877B78030A02338
12105i3420k7746K4003j07816o5121A04370M359a25969O725j59707J3427F9147
12093C26699e1350A74320d4911C00079a27774C63502a13672e646r284l7604l48498
$$ y = [208855, 92715, 267121, 54373, 258054, 193587, 10821, 159767, 108455, 34566, -60112, 343859, 195579, 118079, -314972, 21993, 126077, 201177, 73397, 261794, -133138, 319672, 95672, 147075, 113239, -65228, -10706, 232461, 223819, -29794, 62776, 188070, 42218, -45394, 80122, -130596, 149920, 13763, 285933, 432353, 53293, 134601, -27184, 13870, 8124, -208908, -76635, -255698, 83447, 262337, -179361, -5731, -63041, -424675, -78908, 27351, -203844, -153459, 396059, -101657, 118314, -212237, -79891, 147524, -445940, 112069, 457028, -164877, 278030, 102338, -93420, -121166, -97163, -204979, -270100, 104370, 108729, -125969, -119244, -278951, -265524, 69147, 326699, -51350, 174320, -44911, 300079, -127774, 363502, -113672, -5646, -14930, -52534, -401032]
12082d01032a50359M7298A47380J0609J63834A16222K23362J162191n54307B53674
12071A28080R9076i7129O340C95056j84438D3434d3748l3278k98735E6368m770
12060E1598N4829Q1965I366b66179A87706a33960L1950A94709Q7363a83996B72028
12048A71668d72o7099I3296C9169b55037f6405B22971f0778j02687k5177j51803
12037c40445L0078O8183d7062B78342i0449m620D5546K03884G8568B9644a61938
12025D257b7391H6382a02875a8568p5880c9380r3342A6662J95149h0128B30365
12013D20719d8463I8078a82349a4022G6857M8694c42018h5301r5988j63494H947
12001b08519P0153j11414B73145e66415E6540b93329c0498A91113o7337J92731
$$ y = [-401032, -150359, -103061, 147380, 157989, 321823, 116222, 339584, 1501775, 947468, 253674, 128080, 227156, -97129, -90789, 395056, 210618, 43434, -43748, -77026, -375761, 56368, 51598, 106427, 188392, 9366, -266179, 187706, -133960, -102010, 194709, 282072, -183996, 272028, 171668, -472, -67571, 93296, 39169, -255037, -66405, 222971, -60778, -163465, -188642, -340445, -310367, -242184, -47062, 278342, -90449, -95069, 45546, 249430, 78568, 29644, -161938, 4257, -27391, 86382, -102875, -18568, -94448, -39380, -132722, 16662, 211811, -80128, 230365, 420719, -48463, 98078, -182349, -14022, 76857, 125551, -342018, -85301, -181289, -344783, 8947, -208519, -138366, -249780, 273145, -566415, 56540, -293329, -30498, 191113, 123776, 316507]
11991C16507b8806A42970a72318B20870d0082j46824I0590B463K27803e3864j89141
11980b43005i8089k28811f5636o160A16290e9038C25494b6153k28010A74090a61825
11968I4198J61820D0447a15500l08931b00392A9027d8276D1592b48641B49357
11957e5111j7463A19568K01668a6940j00815M8385j7666K2244a4886B04857L679
11946B08536d30694C7214d9709q0510k3426O261F5530j7332J5495b90875Q9239
11935b01636n343A37301J43831b64897a02755b1579B8187a31734C1874c1338A01245
11923a17828C21442B4644k102b62079A80068k5608F3472a34441N806L7052c6118
11911A43607A5935b6527I2191J10575a46823B18701i4245C0014J83401d1061J6890
$$ y = [316507, -28806, 142970, -172318, 220870, -40082, -186906, 90590, 2463, 230266, -53864, -243005, -98089, -326900, -65636, -71796, 116290, -59038, 325494, -26153, -254163, 174090, -161825, 94198, 256018, 40447, -115500, -424431, -200392, 19027, -48276, 41592, -248641, 249357, -55111, -72574, 119568, 321236, -16940, -117755, -69370, -87036, -64792, -14886, 204857, 208536, -430694, 37214, -49709, -130219, -153645, -147384, 65530, 48198, 63693, -290875, -201636, -206979, 137301, 281132, -264897, -102755, -21579, 28187, -131734, 31874, -31338, 101245, -117828, 321442, 24644, 22542, -262079, 180068, 154460, 63472, -134441, -128635, -91583, -36118, 143607, 15935, -26527, 92191, 202766, -146823, 218701, -94245, 30014, 213415, -41061, -24171]
11900b4171A82262H0575O1679b1513A78383F9512a48970j02090f1931j4264G8340
11888d2448k50444M7840Q5669A06676c35212J02985p5052G9668a12222k36223
11878c48445A39248e4707o3999A26322e0008J8970m3048a2809B96g4374D9330
11866c98645A19692c8433B18014b22609R8500B3937b6157r9127A78522p7954A9764
11854A31721l2453a93759G6413O6612F5694b77423C1196O9045a33228j63149C8397
11842A31055D5060K50715c60771h1248n297o9205G9739K02532c9122A15028f7464
11830b5279l13439A39674a03818C46855A59592A735c3425B17171a35689B98720
11819b27089F8055G103a56715d727k1026j71315G0187J06797a70266L4406A8264
$$ y = [-24171, 182262, 80575, 142254, -21513, 178383, 69512, -148970, -251060, -61931, -76195, 78340, -42448, -292892, -245052, -159383, 106676, -335212, -232227, -307279, 79668, -112222, -348445, 139248, -54707, -118706, 126322, -50008, -31038, -74086, -12809, 296, -74374, 49330, -398645, 119692, -38433, 218014, -222609, -124109, 23937, -26157, -125284, 178522, 100568, 19764, 131721, 99268, -193759, 76413, 143025, 65694, -277423, 31196, 100241, -133228, -296377, 38397, 131055, 45060, 295775, -360771, -81248, -86545, -155750, 79739, 282271, -39122, 115028, -67464, -25279, -338718, 139674, -103818, 346855, 159592, 1735, -33425, 217171, -135689, 298720, -227089, 68055, 7103, -156715, -4727, -25753, -197068, 70187, 176984, -170266, -135860, 18264]
11807d8894E0718a75248P5282j66673A39755a05096j61382B92257f2467n5857
11797a18324b3123E7496O7609a94394A89739b24476h1624K1474k6319n8552j80019
11786c25040c2696A83153C950g5950A63390a01130I9089C0119a33390G7765J00061
11775A77826b50244c977l1903D3755a29047B5515g2208A38442b98552a39917o5140
11764b05057P0555b5718k19403A9166J50222e6324B55709l0508m9358e5032D70575
11752e06420a04945L2889b8381B03319a42068f8815j8850a6782B7412M7776C905
11740G9077K29982a13746G680L59213I4736e4997A07363a01255m0373b7120C3351
11728a49576j62896B75240p3442i3075o4128B23054A01893J63663a78182j70114
$$ y = [-48894, 50718, -175248, -99966, -266639, 139755, -105096, -266478, 292257, -62467, -118324, -23123, 57496, 125105, -194394, 189739, -224476, -81624, -60150, -86469, -145021, -325040, -32696, 183153, 3950, -75950, 163390, -101130, 99089, 30119, -133390, 77765, 177826, -250244, -3977, -35880, 43755, -129047, 25515, -72208, 138442, -298552, -139917, -205057, -134502, -25718, -245121, 19166, 169388, -56324, 255709, 225201, 175843, -55032, 470575, -506420, -104945, -72056, -28381, 203319, -142068, -68815, -87665, -16782, 27412, 75188, 3905, 79077, 309059, -113746, 7680, 366893, 94736, -54997, 107363, -101255, -141628, -27120, 33351, -149576, -312472, 275240, 201798, -93075, -157203, 223054, 101893, 265556, -178182, -348296]
11718c48296a69763I548M60186a23703B28031d04967a14470M3404m5440d134k41861
11707b45995e7058A36162K02316l4146C8649J65017Q7421o9779r7158i5822E0053
11695A08216N0167E2667a13385B66432a0355B31032a7219k696j21035B62024c48507
11683d7382A64685B3695K558e228l4418k48223J33674B96541r5431a29339D1243
11671b45319H5885a67718f8042A93998j8694c47910A51837E9183e0448C39766
11660b66179a0701j42675P2123B7276f6466J8482A16360N5731p2227a06206J0204
11649i6002L6971A91212f3558B20081h9795n3068c5494l5342k06308A62925a6686
11637f3869B08671d662k02321B45617b19990A05105b4204B39257a82520A27026
$$ y = [-348296, -169763, 9548, 469734, -123703, 228031, -404967, -114470, -71066, -116506, -4134, -245995, -57058, 136162, 338478, 304332, 38649, 203666, 291087, 221308, 124150, -95822, 50053, 108216, 158383, 52667, -113385, 266432, -10355, 231032, -17219, -19915, -140950, 262024, -348507, -47382, 164685, 23695, 26253, -5228, -39646, -287869, -154195, 296541, 201110, -129339, 41243, -245319, 85885, -167718, -68042, 193998, 175304, -347910, 151837, 59183, -50448, 339766, -266179, -10701, -153376, -81253, 27276, -66466, -47984, 116360, 172091, 99864, -106206, -96002, -59031, 191212, -63558, 220081, -89795, -142863, -35494, -70836, -277144, 162925, -16686, -63869, 208671, -4662, -206983, 245617, -219990, 105105, -24204, 239257, -182520, 127026]
11626A84803n0411a11396A01300B9881J99701f7552A49252a73451C44431l8561
11616C05870j19526M4761A01459m1595R5391a566j16071B46159a08540C14648
11605B36997j0404q9605B5094M2005g2682l0992A27884a67276N2271d8850C3057
11593H152K11936b05042F7426K3997N8110J85011r2010i8833A18442k8833J09452
11582A99061l7729J47163b21391A26336m9782B0917a79636I2459h1653A3640Q3572
11571I7212L55570A90069a45750f0795D61773k16990I5946J58266G1495L0475
11561A01970g3531B81808A36278b76207B72066e2491C831a86795A11050b11126
11550A28071J72938a19439J1924k9804A32445Q1873j3895l8419e2685I4844R1643
$$ y = [184803, 134392, -111396, 101300, 29881, 229582, -67552, 149252, -173451, 344431, 305870, 186344, 231105, 101459, 59864, 155255, -1566, -117637, 246159, -108540, 314648, 236997, 226593, 136988, 25094, 67099, -72682, -103674, 127884, -167276, -115005, -48850, 33057, 8152, 220088, -205042, 67426, 91423, 149533, 334544, 242534, -98833, 118442, 89609, 199061, 161332, 308495, -221391, 126336, 76554, 20917, -179636, 92459, -81653, 13640, 97212, 452782, 190069, -145750, -60795, 461773, 244783, 95946, 254212, 71495, 101970, -73531, 281808, 136278, -276207, 272066, -52491, 3831, -186795, 111050, -211126, 128071, 301009, -119439, -107515, -137319, 132445, 214318, 200423, 162004, -52685, 94844, 186487]
11539A86487e57625A30724L068J0746O6853G058f6787B15379C1232a11228A33390
11527C30437g3067n604A50937R792b29622f4096A54658e9983p3589A8962J95359
11516B14321N5998b19391G2798J38476f5792B43517K93b768D22137H1837L4336
11505A16173a52040F6775d0304A30455n2402j1561b2090A5295Q0737n167J46765
11494B37630q9792m1152J36599b1642B43472p7214c8517I6456J36660j1441A06901
11482B60706k8504J99700E0653O9424J17118h6423B9422J99928A09524J1223L04359
11471D25106E1283J3499h2028B97124p0473a62606I7109e4172I1725J31098a59010
11459B59084o3971q146K3561k4933a2515n3861A68565f7700a0875k9212B16937
$$ y = [186487, -557625, 130724, 133792, 144538, 211391, 7058, -66787, 215379, 31232, -111228, 133390, 330437, -73067, -78671, 150937, 160729, -229622, -64096, 154658, -59983, -133572, 18962, 214321, 270319, -219391, 72798, 211274, -65792, 243517, 243810, -2768, 422137, 81837, 116173, -152040, 66775, -40304, 130455, 78053, 66492, -22090, 15295, 96032, 90865, 237630, 147838, 106686, 243285, -21642, 243472, 166258, -38517, 96456, 233116, 221675, 106901, 260706, 232202, 431902, 50653, 120077, 237195, -86423, 29422, 229350, 109524, 120747, 425106, 51283, 64782, -82028, 297124, 226651, -162606, 97109, -54172, 91725, 222823, -159010, 259084, 195113, 186967, 210528, 185595, -12515, -66376, 168565, -67700, -10875, -40087, 216937]
11447d3464B38715a28024c9126j39318A91884F6647L14987i5504D57707j85773
11437B71934c940C45514i2420k78921a73863C8692h539j00404A19748J59692A10127
11425a03303A73583g8000j6587j2287A09351g6260j00161m6752I3011N6534n6659
11414I2886k4028B6610b5127C6979Q8628a59021J5697B33711b21323A74258a32301
11402b92111A97130L4688a29444F5955L9679L20709a24944k5490P0151A87125
11391g3078B9562b5771p4234j27171Q5089C2339R4086J43757a01518I2726J75942
11380B68668m5799E4081a27754A55866b642A89979l9262f2089B35742A06791a46367
11368i7702B11459K49680b92448A25484i245j94890B04611B3565a50840e3825
$$ y = [-43464, 238715, -128024, -39126, -178444, 191884, 66647, 381634, -95504, 457707, 271934, -3940, 345514, -92420, -371341, -173863, 38692, -8539, -108943, 119748, 279440, 110127, -103303, 173583, -78000, -94587, -106874, 109351, -76260, -176421, -223173, 93011, 149545, 92886, 68858, 26610, -25127, 36979, 125607, -159021, -143324, 233711, -221323, 174258, -132301, -292111, 197130, 231818, -129444, 65955, 105634, 426343, -124944, -150434, -80283, 187125, -73078, 29562, -25771, -100005, -227176, -142087, 32339, 126425, 270182, -101518, 92726, 268668, 222869, 54081, -127754, 155866, -2642, 189979, 150717, -62089, 235742, 106791, -146367, -97702, 211459, 461139, -292448, 125484, -9245, -204135, 204611, 23565, -150840, -53825]
11357A84598o2668g8420l9795A91943a53099I531b38047b7503k3025A61930j2598
11346A49332n5973K3482a83368k66069B65327N3514C2878a61345p4755D7515i9736
11334A36213K23273a11450E9201B4041P2427M3673a62476O0463G215O2496L9625
11323A09336J35348b75709B27988A9211K74302b44530A25544J16200E5171f7760
11312A06975J63097g224k40518F4804b12803L6162d2533k90814A81095O61A9204
11300A53461g3263b4848m6669B81153b27473e7084F3139a74569A74356d73588
11289c07603L0179g6103A77491a05042j03350A78562b76246H5638n438a5369A0371
11277a02844B3641J755p46a53421c3030B8852a82226j08246B03808b25466A98912
$$ y = [184598, 121930, -78420, -118215, 191943, -153099, 9531, -238047, -27503, -50528, 161930, 149332, 93359, 116841, -183368, -449437, 265327, 318841, 32878, -161345, -236100, 47515, -99736, 136213, 359486, -111450, 59201, 24041, 96468, 140141, -162476, -102013, 7215, 69711, 109336, 244684, -275709, 227988, 19211, 293513, -244530, 125544, 241744, 55171, -67760, 106975, 270072, -7224, -247742, 64804, -212803, -176641, -42533, -333347, 181095, 181756, 19204, 153461, -73263, -24848, -71517, 281153, -227473, -57084, 63139, -174569, 174356, -473588, -307603, -277424, -76103, 177491, -105042, -208392, 178562, -276246, 85638, 80200, -15369, 10371, -102844, 23641, 25396, 24650, -153421, -33030, 28852, -182226, -290472, 203808, -225466, 198912]
11265a88715B5219J67430a2631r2175p3476C14100i0577E9023h8322j98283B51685
11253H5456c62416A12602e5604j6339E7012h8523l7406q228q5105B26439a52951
11241D143K4708a18756c5677C29897q7580C3351J22888h3849B10488i5695j04105
11230a99800d8399j38539d6873F5421b05548C62448a8278F3497L2370c40958A32463
11218I8261b08710m1512c4024j57576A48140b45383d357A24041f5569F8417Q3533
11207A51950m660a15112j70945A95528a39308N3677j04932n1741A79696M5103
11197B24799i6347k44634d49l08892a36981F1094d45483A19576R7429b78549H9359
11185b46363J11403F0588K7051e7407B7988f0968j97037a13197m0761M6190l5884
$$ y = [-188715, 25219, 192649, -12631, -104806, -178282, 314100, -90577, 59023, -88322, -286605, 251685, 85456, -362416, 112602, -55604, -71943, 57012, -88523, -125929, -134157, -219262, 226439, -152951, 4143, 28851, -118756, -35677, 329897, 242317, 33351, 156239, -83849, 210488, -95695, -199800, -48399, -186938, -46873, 65421, -205548, 362448, -18278, 63497, 95867, -340958, 132463, 98261, -208710, -250222, -34024, -191600, 148140, -245383, -4357, 124041, -65569, 68417, 151950, 147290, -115112, -286057, 195528, -139308, -85631, -190563, -242304, 179696, 224799, -96347, -340981, -449, -309341, -136981, 61094, -445483, 119576, 217005, -278549, 89359, -246363, -134960, 60588, 87639, -57407, 27988, -60968, -258005, -113197, -153958, -107768, -143652]
11174a43652F7189a35901B3065d09859a75089b823j65117m108H531a79578j16722
11163b96300i4691j0747c1086l1287C54724a65742C27004A24331a56978B90097
11152a09563N551C00181a97799I9367K30783f4366b8526j00323N864B27701a8816
11140b88614A69111d5892E50199b91781a23502n1246A91820b02813G1841b74306
11129D76891b78229B22214M1752j16558C8168J36572b82992H1040N199J74521
11119B60760a74169C1654g8860B10335D9841c6126A23865A6746J14989J13057
11109B44792I3897L3836J90057r9655f9946B07037F3005R2446j8129K48206a45761
11097C36799f6278k0791B19264J69280d1885B71625F434J17276A2836M5709J01070
$$ y = [-143652, 67189, -135901, 23065, -409859, -175089, -2823, -167940, -172048, 8531, -179578, -296300, -94691, -105438, -31086, -62373, 354724, -165742, 327004, 124331, -156978, 290097, -109563, -104012, 300181, -197799, 99367, 330150, -64366, -28526, -128849, -122985, 227701, -18816, -288614, 169111, -45892, 550199, -291781, -123502, -174748, 191820, -202813, 71841, -274306, 476891, -278229, 222214, 263966, 147408, 38168, 174740, -282992, 81040, 86239, 260760, -174169, 31654, -78860, 210335, 49841, -36126, 123865, 16746, 131735, 244792, 93897, 127733, 317790, 218135, -69946, 207037, 63005, 155451, 137322, 385528, -145761, 336799, -66278, -87069, 219264, 388544, -41885, 271625, 6434, 123710, 12836, 58545, 159615]
11086A59615J74705D9548A8980K72744A40596P0855J16873q5598J32216h0205
11075F60616k7466E5260K62258r2500a49701F33490k02010j18253A27850L55561
11065D83411k26394J15250J68941l2760j28717P0008n2283j8150K15757K17388
11055H12451l04889J42029K44786l95536J23620P5772j42262K19041j70885q3951
11045E20176K22213J4067k43782p1522J77393J42048m836K9584k46574K51167
11035G89934j49150j33997L33920L4120k42804J02348j12689j38006M00452C78721
11024H05198l73486k2677K95123l24160J04433J45430k12031J06503J52214j87676
11014D88871K61018J04313j8992m03257l4107K70930k02791J84018k0657J8168
$$ y = [159615, 334320, 49548, 18980, 291724, 140596, 211451, 328324, 242726, 374942, -80205, 660616, 633150, 55260, 317518, 225018, -149701, 633490, 431480, 313227, 127850, 483411, 257017, 372267, 541208, 508448, 379731, 449739, 397456, 379306, 595063, 812451, 507562, 649591, 894377, 498841, 622461, 698233, 555971, 775012, 604127, 520176, 742389, 756456, 512674, 441152, 618545, 760593, 755757, 785341, 538767, 789934, 640784, 506787, 840707, 874827, 632023, 734371, 621682, 483676, 884128, 378721, 805198, 431712, 409035, 704158, 379998, 484431, 629861, 417830, 524333, 676547, 488871, 749889, 854202, 835210, 431953, 397846, 668776, 465985, 650003, 629346, 647514]
11004F47514J12796n7592j12344O4718k8977M3236j19452J87971J79252l59560
10994E57562K1617Q2007r4301L86933J05215k25097j10024O5586K82454m54355
10984F17597J64964M0590J39095p3020M67442k32403M16252j5792J69073J67330
10974A861128L00063N80864L23639k43675j83058j14463J37961l76173m62712
10965A823574J08502J95902j22591Q3186k61746L13868k02895m3683K81618m20371
10955A755364J6999j82658j53670j75471k99193k16460B25394L9907K14904A93522
10944C52818L52391j75057A20764Q7174P7486a44537L8122c4619A74650p4325
10934A00325m669J41073H5759J6710A9778c8137C06763f9379Q343B12458J61940
$$ y = [647514, 760310, 702718, 590374, 655092, 626115, 669351, 549899, 737870, 917122, 557562, 579179, 661186, 566885, 953818, 1059033, 833936, 723912, 789498, 1071952, 617597, 782561, 823151, 962246, 889226, 1356668, 1124265, 1540517, 1524725, 1693798, 1861128, 2161191, 2742055, 3065694, 2822019, 2638961, 2524498, 2662459, 2286286, 1823574, 1932076, 2127978, 2005387, 2088573, 1826827, 2140695, 1937800, 1894117, 2175735, 1755364, 1772363, 1589705, 1436035, 1260564, 961371, 744911, 225394, 265301, 480205, 193522, 352818, 705209, 530152, 120764, 207938, 285424, -144537, -106415, -34619, 174650, 100325, 95656, 236729, 85759, 102469, 19778, -38137, 306763, -69379, -61036, 212458, 374398]
10923C74398r7204A17982N6656c35862B3592K57845j16098p5791a03878D7305
10912g031D7921M31485a52480j5287M4854M0578A55967l0018J06399A7167M47762
10901D64929f6631B5225o336J62507N0058o648q2164d08076B21189g2289F3270
10889i1936A59196E1281p239J75388A3190a03477q7539C7059a58783n0203B85506
10877i7194n3411j44752C4869a65382F0488b015A33798M244F2532J96333r5036
10866A63829G0365J10530A7957K36360l7531G2829b79966c3806A19362O5988d1890
10854A46761B9903J04806K5107k745a9492k37601B26773B227a44324D33049b11109
10842A55764M4365c86355J73214R9797e6460J2071p0199d8810j57019A09747a95100
$$ y = [374398, 277194, 117982, 174638, -335862, 23592, 281437, 165339, 89548, -103878, 47305, -7031, 47921, 479406, -152480, -167767, -122913, -82335, 155967, 125949, 232348, 17167, 464929, -66631, 25225, 18889, 181396, 231454, 224806, 142642, -408076, 221189, -72289, 63270, -91936, 159196, 51281, 44042, 219430, 13190, -103477, -191016, 37059, -158783, -208986, 285506, -97194, -150605, -295357, 34869, -165382, 60488, -2015, 133798, 138042, 62532, 258865, 163829, 70365, 180895, 17957, 254317, 216786, 72829, -279966, -33806, 119362, 185350, -41890, 146761, 29903, 134709, 159816, 157071, -19492, -257093, 226773, 2227, -144324, 433049, -211109, 155764, 200129, -386355, -213141, -113344, -56460, -44389, -114588, -48810, -205829, 109747, -195100]
10830F8810e5274F1891K32462I4791a98187g1603B7321b15591B8572a00915o2376
10819a63291O5157B44945a96666J1202D9291e8090j37986j9100A59874D880M8116
10808E2996a03798a5938B96222a22504F0797g2660A33271F1799c9668l57304f9585
10796a44415b5921k9773a5382k11140H8390a65134J0890A31390a20252J4459A85932
10784a36164I4821b47610i0796I8761G534M7483a32022j16897j34876e0229j25435
10773a75664A59994P3350h8816j07909D21540a793H923K27304I3234A8713i0334
10761c0782k88147a08109k17349D609c10268J15708h6487b9830A79616a59962
10750B29199l2270a45584m6147h4655B17913a20457k537m1074I2076P3862b0627
$$ y = [68810, -55274, 61891, 294353, 94791, -198187, -71603, 27321, -215591, 28572, -100915, -163291, -98134, 244945, -196666, -185464, 49291, -58090, -196076, -215176, 159874, 4880, 52996, -103798, -15938, 296222, -122504, 60797, -72660, 133271, 61799, -39668, -396972, -69585, -144415, -25921, -55694, -15382, -226522, 88390, -165134, -154244, 131390, -120252, -105793, 185932, -136164, 94821, -247610, -90796, 98761, 7534, 55017, -132022, -248919, -383795, -50229, -175664, 159994, 233344, -88816, -196725, 421540, -1793, 8923, 236227, 93234, 18713, -90334, -30782, -318929, -108109, -325458, 4609, -310268, -194560, -86487, -29830, 179616, -159962, 229199, 196929, -145584, -191731, -84655, 217913, -120457, -122994, -164068, 92076, 165938, -20627]
10738A17166f3750o4585l03015j6320a72217B07046o4161a73997A51804a19900
10727b46412I6032h1538J0629A07935A6870J52443a18740j8164r0681A62342e0252
10715b72665c3533l10535f9243m9913a9125k64283b9843B1259b11920m7420c7156
10703a50442q545B7238J46402E3799Q5550f5201k51774a05802a7639k38484c5229
10691h6025C6180b9479C0519J33891h8350J8267G9924c72864J65270o0228e7768
10679B59560l6031b36455e4600b6900j67183B79694E5990a38834c1809j63599
10669a95408D8806d5306K0688j12185k50359D6613M3247a44605E8247e6189C0502
10657A52398K09959b80375F0972J10436B9307K28858a30587A43942A7173a53171
$$ y = [117166, -63750, -128335, -431350, -447670, -172217, 207046, 142885, -173997, 151804, -119900, -246412, 96032, -81538, -70909, 107935, 16870, 169313, -118740, -136904, -227585, 162342, -50252, -272665, -33533, -344068, -69243, -119156, -19125, -283408, -29843, 21259, -211920, -259340, -37156, -150442, -158987, 27238, 173640, 53799, 139349, -65201, -316975, -105802, -17639, -256123, -35229, -86025, 36180, -29479, 30519, 164410, -88350, -70083, 79924, -372864, -207594, -267822, -57768, 259560, 223529, -236455, -54600, -26900, -194083, 279694, 55990, -138834, -31809, -195408, 48806, -45306, -24618, -136803, -387162, 46613, 89860, -144605, 58247, -56189, 30502, 152398, 362357, -280375, 60972, 171408, 29307, 258165, -130587, 143942, 17173, -153171]
10646A86663a20786c0811G8433J4721b2433A08657i6619j9761B33463g7987p3858
10635a51845A9215O6241a15760G9165K00520c58973a54608I4141L5623a22998
10624A37643l6960e9617B14280g1152k74894A67537L62844i7639A51740E22P9393
10613G9915J80557e0306r2912k31384g4428G6662b6443k42969J6537a08286j57026
10602b65312e7928B31747b20773b3309A87050G6565e4867q1481G1991b52374K1626
10591b30748G2326b21534j77901a57565e5741q9308o0093i6038A10646b44722
10580a15722r4567j56302J71859k9246M2511B8344a02447j07082j15489A08332
10569b41977E080a19385B0672a65911F2103c63534D8634h1775H4041c87114H3987
$$ y = [186663, -120786, -30811, 78433, 93154, -22433, 108657, -96619, -116380, 233463, -77987, -151845, 19215, 85456, -115760, 79165, 279685, -358973, -154608, 94141, 129764, -122998, 137643, 100683, -59617, 214280, -71152, -346046, 167537, 530381, -97639, 151740, 522, 79915, 260472, -50306, -143218, -374602, -74428, 76662, -26443, -269412, -252875, -108286, -265312, -57928, 231747, -220773, -23309, 187050, 76565, -54867, -136348, 71991, -252374, -230748, 72326, -221534, -399435, -157565, -55741, -145049, -205142, -96038, 110646, -244722, -115722, -210289, -366591, -194732, -223978, -181467, 28344, -102447, -209529, -325018, 108332, -241977, 5080, -119385, 20672, -165911, 62103, -363534, 48634, -81775, 84041, -387114, 83987]
10557f224A46945n1422b43545A95567a3209A05079K50803b7926j85148i4486B78501
10545b54562D1262a46274M7196J418a4889l0772j32041M6880d663A22811m904
10534A17907f2206B36937q1388d1707A75783a75563B49409j2034d962j27371o0497
10523a92830G117M9654L1764M3736d04903J80976c6219A19164a57809j60669F1432
10511a7244B06273a24314j30594J3548C4923J96789g5172A01241a84632M6388
10501a38244J0886m7729D0638J17674a66760D1664L9008O2929f5025C644R8689
10490A02333A2225b59580e3889k0075C08216i9367E04534B07129Q9388A34817
10479C76356A60447G9298a01288A39432a58632K4209M2372d1772a583j03875F7564
$$ y = [-6224, 146945, 95523, -243545, 195567, -13209, 105079, 355882, -27926, -213074, -94486, 278501, -254562, 41262, -146274, -99078, -97660, -14889, -45661, -177702, -130822, -4663, 122811, 117907, -62206, 236937, 155549, -41707, 175783, -175563, 249409, 237375, -4962, -132333, -192830, 7117, 56771, 88535, 132271, -404903, -223927, -36219, 119164, -157809, -318478, 61432, -17244, 206273, -124314, -254908, -241360, 34923, 231712, -75172, 101241, -184632, -138244, -127358, -175087, 40638, 158312, -166760, 41664, 80672, 143601, -65025, 3644, 102333, 12225, -259580, -53889, -73964, 308216, -99367, 504534, 207129, 296517, 134817, 376356, 160447, 79298, -101288, 139432, -158632, -134423, -92051, -41772, -1583, -105458, 67564]
10467B57375k8850C917e7511a4321C07338a02828c6124G9684B4135b48679B95615
10455F3281M3917a06602A94880D2142j4394i3287B25776b20972b6375j44531j82772
10444c53678O7072i3527A11838K39442h067A26402B4716J27148j1980K7886b09531
10432C745f514D7218K8542g2574m4632J0991A75254p2413m9503b57093g3127K0474
10420e2653D2025J62769D1894a75205f4859G9741a95569A2726L5614d04427D5310
10408a32385J3257j02795A2226c524j47559a2992q0841B04506F8159a6035A09621
10396B0165b94198M874a9651E2492K22406Q334r9293a69313B45767A8364L57243
10385C75607r2039A17241j9355P3631C7447d0313B78513o8332I2928K9408e8762
$$ y = [257375, 228525, 3917, -57511, -14321, 307338, -102828, -36124, 79684, 24135, -248679, 295615, 63281, 107198, -106602, 194880, 42142, 27748, -93287, 225776, -220972, -26375, -170906, -353678, -286606, -93527, 111838, 351280, -8067, 126402, 24716, 151864, 139884, 167770, -209531, 3745, -6514, 47218, 75760, -72574, -117206, -106215, 175254, 102841, 53338, -257093, -73127, -52653, 42025, 204794, 41894, -175205, -64859, 79741, -195569, 12726, 48340, -404427, 45310, -132385, -119128, -221923, 12226, -3524, -151083, -12992, -93833, 204506, 68159, -16035, 109621, 20165, -294198, -289324, -19651, 52492, 274898, 283232, 183939, -169313, 245767, 18364, 375607, 283568, 117241, 97886, 171517, 37447, -40313, 278513, 210181, 92928, 122336, -58762]
10373C77526J45328k55468q417J15682j59641K52252j23728R3941j45460J54730
10363D46745k2241l1144j36501p1724P7218I8451K5069K728J85707Q8585E7842
10351C59160P9485K02366j72570j19200n8866M9923q2857Q6058m113n876e5380
10339e3398B2448J90829l2951H9794L85004k24044g186r3760B85465C0795K69214
10328C00009c2179j27403C24553H7948J42156O5572J66163b18763d9798E6156
10317A9529K98472A12482L6633J02355D7898J46544i881A58736N7033b0780G8478
10305a82168j93359A23239f0028F0144P1730B547L412K09205B9722a36957B265
10293c8300r5785G608b6222n6066A47503c5407r8607I2955a99075c113H1055a2637
$$ y = [377526, 522854, 267386, 258969, 374651, 215010, 467262, 343534, 437475, 292015, 446745, 424504, 393360, 256859, 185135, 262353, 98451, 123520, 126248, 311955, 400540, 57842, 359160, 438645, 641011, 468441, 349241, 290375, 340298, 257441, 343499, 339386, 333510, -55380, -53398, 22448, 213277, 180326, 89794, 474798, 250754, -7186, -100946, 285465, 30795, 300009, -32179, -159582, 324553, 87948, 230104, 295676, 461839, -218763, -49798, 56156, 19529, 318001, 112482, 149115, 251470, 47898, 194442, -9881, 158736, 215769, -20780, 78478, -182168, -375527, 123239, -60028, 60144, 131874, 2547, 5959, 215164, 29722, -136957, 2265, -38300, -134085, 7608, -26222, -82288, 147503, -35407, -134014, 92955, -199075, -3113, 81055, -12637]
10280b91628A64731h9446q3386K5826F0707b28652B1517a68260f3138D9885b7994
10268a10190I4966a11640q152r7595C94832j36707J77645A57249K23217j59095
10258B21371K53564j94381J5279m9242m1041A02584K35627j30603A2684K827J93588
10247B09099f5495G536o81a80539O6166l5463j72264g1014k6427j44163A66012
10235c02427D2333h0904j79841a9073k18039j07584d8637A9675a19005A18784
10224a45187F9494a20993H4931b10342a7313A8982a94260h9178j43915D079d27539
10212b2972k47176J20280o0521d3857A72728d43864c4718C2621i6189r1126B57622
10200f8050b5782E11528D3514N2261L815h1005e682j58093K2221B6698d2873B00633
$$ y = [-291628, 164731, -89446, -172832, -147006, 60707, -228652, 21517, -168260, -63138, 49885, -27994, -110190, 94966, -111640, -119792, -217387, 394832, 258125, 435770, 157249, 380466, 221371, 474935, 280554, 295833, 246591, 205550, 102584, 338211, 207608, 12684, 15511, 209099, -65495, 7536, 6855, -180539, -114373, -149836, -322100, -71014, -97441, -241604, 166012, -302427, 42333, -80904, -260745, -19073, -237112, -344696, -48637, 19675, -119005, 118784, -145187, 69494, -120993, 84931, -210342, -17313, 18982, -194260, -89178, -233093, 4079, -427539, -22972, -270148, -149868, -210389, -43857, 172728, -443864, -34718, 32621, -96189, -187315, 257622, -68050, -25782, 511528, 43514, 95775, 99590, -81005, -5682, -163775, -141554, 26698, -42873, 200633]
10187c27601B7476a43826B13284I9195h8238j1789J0012c7668j96940j1765A8165
10175A95998b07264j7651B13222I420M7569c50375o1879H1816g9846r4760F4301
10163a07017C53000a0465M256m0275A71558q2272a061k6648H3586a33121H7504
10151B09422f6116k36749j04237a53160k6815B45804A8663n542a42106A02516
10140A07050b04788D7274B0374c06985D3494e08523b00803A17943A710e783p1803
10129g7586D0797e1306l5947k1910m11059B185J8862a12838r3281E8924J6842
10118G5766a02102A33317K01981I3704b80760A61621C1370K6214J63005C0219
10107a96791A003f35802c9037A76784M5077a30994c8534j55093B12117e6109C6256
$$ y = [-327601, 27476, -143826, 213284, 99195, -88238, -100027, -90015, -37668, -234608, -246373, 18165, 195998, -207264, -224915, 213222, 9420, 56989, -350375, -412254, 81816, -79846, -174606, 64301, -107017, 353000, -10465, -6209, -46484, 171558, 89286, -1061, -27709, 83586, -133121, 87504, 209422, -66116, -302865, -407102, -153160, -179975, 245804, 18663, 13121, -142106, 102516, 107050, -204788, 47274, 20374, -306985, 43494, -508523, -200803, 117943, 1710, -5783, -77586, 40797, -51306, -87253, -109163, -520222, 2185, 21047, -112838, -206119, 58924, 75766, -102102, 133317, 335298, 93704, -280760, 161621, 31370, 57584, 220589, 30219, -196791, 1003, -635802, -39037, 176784, 221861, -130994, -38534, -193627, 212117, -56109, 36256]
10095a49600k22558F1854l793J41102b65893A0907b72536O9682m1787M4611i9812
10083a02515k9166I58h4357k51011G0207d5176B09820i8157L5164j32816B2324
10071d6314J5182B32950g6826G1583d8060B00705B1779e0187B38936a08999H8083
10059d9527e095r7029j13298m9668f0643E7326f67l3520B9083b24677J1312P028
10047b06337M465N9357q0894c2627l57696A40190a33221D764Q3978a94107e6395
10035c6698m64697G2617a95453e8855j83943A16091b27178b2877A31370K8957
10025A60327j3295e869G5765c42159I4546a13447p6554A46560a41484B01527H908
10013B8410a71771d0180A78734l5433k1035C4716b45078G1676a89200c6118D8554
$$ y = [-149600, -372158, 61854, 58061, 199163, -265893, 10907, -272536, -202854, -244641, -200030, -99812, -102515, -131681, 958, -84357, -335368, 70207, -45176, 209820, -98157, -62993, -195809, 22324, -46314, -31132, 232950, -76826, 71583, -48060, 200705, 21779, -50187, 238936, -108999, 88083, -49527, -5095, -102124, -215422, -265090, -60643, 57326, -667, -34187, 29083, -224677, -213365, -206337, -201872, -142515, -223409, -32627, -390323, 140190, -133221, 4764, 88742, -194107, -56395, -36698, -501395, 72617, -195453, -58855, -242798, 116091, -227178, -22877, 131370, 160327, 147032, -5869, 75765, -342159, 94546, -113447, -190001, 146560, -141484, 201527, 8908, 28410, -171771, -40180, 178734, 143301, 122266, 34716, -245078, 71676, -189200, -36118, 48554]
10001c86718J35573A78859b68460B2098c41976a27684A02676c53222C6562d6377
9990a05320m1979H6774I937O8670a36741C41192a83723B4122b3739A22735A5939
9978a8064n2673F9066J60875Q0213A23971c64162D9650a41647O7907r5648L7104
9967a32284b1429j82801k70007a13418K6912k7202j3274j41153a5309m6984m8375
9956a10668j45418J22495B31960D4870a09273j41836c2685B77751H8042d11008
9945c3984m6048a3550o3970l79331J44769q931b2767A54786i2292j76920C0738
9933a47546A13870c9925j24101A6020a56162l2946n7770I4454C6136a90583A2439
9921a20960N6503A3477b90680b5169m24131a54679B53982b92519e0374k92918
$$ y = [-386718, -251145, 178859, -268460, 22098, -341976, -127684, 102676, -353222, 36562, -46377, -105320, -147299, 86774, 9937, 78607, -136741, 341192, -183723, 24122, -23739, 122735, 15939, -18064, -70737, 69066, 229941, 310154, 123971, -364162, 49650, -141647, -73740, -169388, -132284, -21429, -204230, -474237, -113418, -86506, -113708, -126982, -268135, -15309, -62293, -110668, -256086, -133591, 231960, 44870, -109273, -251109, -32685, 277751, 88042, -411008, -33984, -80032, -13550, -77520, -456851, -312082, -321013, -22767, 154786, -92292, -269212, 30738, -147546, 113870, -39925, -164026, 16020, -156162, -189108, -246878, 94454, 36136, -190583, 12439, -120960, -64457, 13477, -290680, -25169, -449300, -154679, 253982, -292519, -50374, -343292]
9911c43292g2570o1842C19970A07300j8529b92327j24139i3814F828b39316P1582
9900a67734f5610p453F7253L6508P8612b20594A35142J99422F3496a89542D5484
9888a86444E0485A9571q497d5766B40a63846b1569q2572J1119A34792d6206A14584
9875g0587G4427g7191l2615G0891d24898a88238D8017a09954j91713k8555C7967
9863E4964B5586M3150C622a20721K0140A7041a39061J1669D3710J33471b267q241
9851a0508k8193j6016k83581a53084A91712R9536b07119I2586b76051R7823b0300
9839B02933J35401b14453A99422c4916k23950O6367I2825C2119a73346L7600A2155
9827B1398q279N185b20073l6316B5900f4018j04966C273a05556j14850G5261a72910
$$ y = [-343292, -72570, -134412, 319970, 107300, 88771, -292327, -416466, -93814, 6828, -239316, -167734, -65610, -73063, 67253, 103761, 182373, -220594, 135142, 334564, 63496, -189542, 45484, -186444, 50485, 19571, 11074, -45766, 240, -163846, -21569, -104141, -93022, 134792, -46206, 114584, -70587, 74427, -77191, -109806, 70891, -424898, -188238, 48017, -109954, -301667, -330222, 37967, 54964, 25586, 68736, 3622, -120721, -100581, 17041, -139061, -127392, 43710, 177181, -2267, -10508, -38701, -54717, -338298, -153084, 191712, 291248, -207119, 92586, -276051, -178228, -20300, 202933, 338334, -214453, 199422, -34916, -258866, -192499, 92825, 32119, -173346, -135746, 12155, 21398, 13119, 18304, -220073, -256389, 25900, -64018, -168984, 3273, -105556, -220406, 75261, -172910]
9814C1471K5670b72465e5581i400j7857A24737J9427J13199H4983a6501D4362
9802A08111a59251l24439E105N2695f15j68940O1951B64271J2447a0075A33695
9790a46883K7174o803m9616E4678h1755l11181B8735c49195a5588B9139a44283
9778a84605B8333R7621b10330c4187k49209a38389N9879B575K78694a07700r9766
9767b07466g2908l3972K5133k6007C4073b34588A26005e672m8545C0720a23435
9755b07177A3665M1189O0262i2974k9947C5732b55302h4484J6687j09487L2243
9744a45041j88612A18959E5611K40246H5577F611k639P1549A7836a29867B6611
9732b2173p4937E7659A742b11404a02850p083H2625a39887k88395a81051b7135
$$ y = [31471, 57141, -272465, -55581, -9400, -27257, 124737, 144164, 257363, 84983, -16501, 44362, 108111, -159251, -483690, 5105, 57800, -615, -169555, -107604, 264271, 276718, -10075, 133695, -146883, -119709, -126512, -176128, 54678, -81755, -392936, 28735, -349195, -15588, 29139, -144283, -184605, 28333, 125954, -210330, -34187, -283396, -138389, -78510, 2575, 281269, -107700, -207466, -72908, -106880, -81747, -107754, 34073, -234588, 126005, -5672, -54217, 30720, -123435, -207177, 13665, 54854, 115116, -92974, -122921, 35732, -255302, -84484, -67797, -177284, -145041, -333653, 118959, 55611, 295857, 85577, 6611, 3972, 75521, 17836, -129867, 26611, -22173, -97110, 57659, 1742, -211404, -102850, -109933, 82625, -139887, -428282, -181051, -27135]
9720b53810A02820c01402I6587a10807j24382H068b79732J37793H1718N9974A7351
9708g0040E9245b16134J07802k17995F5405J66749c6663n7563M870l09956a34592
9696b07215e6827k53604J11842a1417M610m26903H5493a22681D456M9398d40j29262
9684a29702J0486m4158j43823M3700E1791a97327g0385m88747g842k62824A16010
9672d45026K01779F3590k2654b22113I0342a65414a7239A41994B3793c9693k57249
9661b96942J1656B2781K75817e9829B9295b01106L1149F4262K4702A2151c01778
9649C8711L5182b49575a11116b9936B03791r8564J55117a16403j21611M2844O9522
9638a25648C51442d67660B53240c29518N1478i6737j01114h6714f037j65819A46154
$$ y = [-253810, 102820, -301402, 96587, -110807, -235189, 8068, -279732, -141939, 81718, 141692, 17351, -70040, 59245, -216134, -108332, -326327, 65405, 232154, -36663, -94226, -89356, -399312, -134592, -207215, -56827, -310431, -198589, -11417, -6807, -433710, 85493, -122681, 4456, 53854, -440, -129702, -119216, -163374, -307197, -263497, 51791, -197327, -70385, -559132, -7842, -270666, 116010, -445026, -243247, 63590, 40936, -222113, 90342, -165414, -17239, 141994, 23793, -39693, -296942, -285286, 22781, 298598, -59829, 29295, -201106, -169957, 64262, 88964, 12151, -301778, 38711, 73893, -249575, -111116, -29936, 203791, 105227, 260344, -116403, -238014, -195170, -125648, 351442, -467660, 253240, -329518, -278040, -96737, -197851, -86714, -6037, -171856, 146154]
9626A9361c09385a45943D9019a82873Q6370O300c0154A623b77396a38378J9565
9615a18813J2421d5493j36766A16819C2616N5186f2740j14761b531k14278j82464
9604c99273i8633p5277I742h4732A09360J18059d1274H3331k6048J3908a12686
9592A15229m4304a01851k78351A47004L8822I1764M9885a10961B72479b10755
9581i3633B02235p7492i0710A1810c520j49599J6033f7774A12612i2012l945A68226
9568g2626A19153m4252b2406k69346C9760a61889H4192K01683G4970a8731A01392
9556C77783G0096J96289g991k35351C01117a90308A97626d49021a29022k36270
9546c65292C3248c29431B6740g7453L4363k43565Q8387j50886D4051b65376g4493
$$ y = [19361, -309385, -145943, 49019, -182873, -96503, -90203, -30154, 1623, -277396, -138378, -118813, -106392, -45493, -182259, 116819, 32616, 87802, -62740, -177501, -2531, -216809, -399273, -98633, -173910, 9742, -84732, 109360, 227419, -41274, 83331, 57283, 71191, -112686, 115229, 70925, -101851, -380202, 147004, 185826, 91764, 141649, -110961, 272479, -210755, -93633, 202235, 124743, -90710, 11810, -3520, -153119, -137086, -67774, 112612, -92012, -95957, 168226, -72626, 119153, 74901, -22406, -291752, 39760, -161889, 84192, 285875, 74970, -18731, 101392, 377783, 70096, 266385, -7991, -243342, 301117, -190308, 197626, -449021, -129022, -365292, 33248, -329431, 26740, -77453, -43090, -286655, -198268, -349154, 44051, -265376, -74493]
9534i520l59404f4721j6121C7596d3568j40760C45250I8747b66635B2302e0395
9522b66924a557o445k19024A3062J46522c04437A39998a48682m45449D8375b46393
9510c63799J06221m1849B1028c9044A69678a49718K6585l3767J5535f8929A15776
9498h2887A05503a99498Q7485k44921A15034a24742j33181g7483a3745l3640o1513
9487a08898C15100b33648K300M5943B54105a01829K2114k20778B0711J2519O7220
9476A00450c3646j11221o9514d522F0782e3534k27542D1120K92838i6633j28591
9465b25224O4021O7055j99862B8816K17811g3013I8783b24845H1516J93877j33532
9454A41861a0937j96380B58401e5951L293j45241A9685L5853c64799R8279A2574
$$ y = [-9520, -368924, -64721, -80842, 37596, -43568, -184328, 345250, 98747, -266635, 22302, -50395, -266924, -1557, -8002, -227026, 13062, 159584, -304437, 139998, -148682, -594131, 48375, -246393, -363799, -257578, -299427, 21028, -39044, 169678, -149718, -123133, -156900, -141365, -68929, 115776, -82887, 105503, -199498, -112013, -356934, 115034, -124742, -257923, -77483, -13745, -47385, -108898, 315100, -233648, -231348, -185405, 254105, -101829, -79715, -300493, 20711, 33230, 100450, -33646, -144867, -214381, -4522, 60782, -53534, -281076, 41120, 333958, -96633, -225224, -161203, -94148, -294010, 28816, 246627, -73013, 98783, -224845, 81516, 275393, 141861, -10937, -207317, 258401, -55951, -52658, -197899, 19685, 55538, -364799, -266520, 12574]
9442A39869b29234O8561k04723a13600a6045A28031a78012A0087a8006A15437
9431C8092b28061O833A4246b79983a01316D0422a73235N8962B51704c38347d2113
9419D2523b92704f2767G5049f2401r0647B0531a72932G4410a30981K7970l295
9408a06306e194q2363m1620q9056n4596B2182a19293c3874B2705J23403d913k12073
9396b16986h222F6222K30240b05450p2390G3599g5277k5306j38125C0630r548
9385B1082c34500B7240d51265g1685c0471j72948o8416d3886k30909B47700E742
9373b03755m3626J08835A14805b1156B94791k6012a11896p5299B78827c2446k80970
9362c13416J50562d7260H302c01460h3494j45950a3392m7972C71502c11910J42339
$$ y = [139869, -229234, -160673, -365396, -113600, -16045, 128031, -178012, 10087, -18006, 115437, 38092, -228061, -221228, 14246, -279983, -101316, 40422, -173235, -114273, 251704, -338347, -42113, 42523, -292704, -62767, 75049, -62401, -153048, 20531, -172932, 74410, -130981, -103011, -106306, -5194, -87557, -129177, -218233, -272829, 22182, -119293, -33874, 22705, 146108, -4913, -216986, -8222, 66222, 296462, -205450, -277840, 73599, -75277, -100583, -238708, 30630, 21082, -334500, 27240, -451265, -71685, -30471, -203419, -271835, -43886, -274795, 247700, 5742, -203755, -247381, -138546, 114805, -21156, 294791, 268779, -111896, -187195, 278827, -32446, -313416, -162854, -47260, 8302, -301460, -83494, -229444, -13392, -61364, 371502, -311910, -169571]
9351a69571j20050A37524m5756e5867E4492b21054l8468i2505l8698B43773a49481
9339i6688C2259b43290n9520A49639a67129I5640c07213A10352m919P9856a65263
9327A20580n1165C2796j4797M8642h9956m8234A45629A9100e5189k83484A678
9315a62438B14847b00688A73409H2063l2802A848c14047B29184e1448k93402J14959
9304b29891A56217G4206c3659G5091a99433p1672C8071a31863C29262c4840l8008
9293g2848A13871a01076j8913l2060p346L6285M3140A38125b67212A13691b79487
9281B2426b05020e3586b398q5782k28438P1361B14047a18025m2187A33055J88231
9270C21286d7573C2602a32305N5756q9685A4845a73906e348j30862G5071b33120
$$ y = [-169571, -289621, 137524, 91768, -55867, 54492, -221054, -259522, -92505, -131203, 243773, -149481, -96688, 32259, -243290, -302810, 149639, -167129, 95640, -307213, 110352, 105433, 185289, -165263, 120580, 69415, 32796, 17999, 66641, -89956, -138190, 145629, 19100, -55189, -338673, 1678, -162438, 214847, -200688, 173409, 82063, 49261, 1848, -314047, 229184, -51448, -344850, -229891, 156217, 74206, -33659, 75091, -199433, -271105, 38071, -131863, 329262, -34840, -72848, 113871, -101076, -119989, -152049, -159395, -123110, -79970, 138125, -267212, 113691, -279487, 22426, -205020, -53586, -2398, -88180, -316618, -245257, 214047, -118025, -160212, 133055, 321286, -47573, 32602, -132305, -76549, -166234, 14845, -173906, -5348, -136210, 75071, -233120]
9258A86733c55680f8677n3003A87126b51402g6552B13630A03295m7290g4683D1277
9246D6355K49813l7034b91500B55882A4225a438C0104N8620J85660D2509b23444
9234a06713Q877r9949d7946A62979d8577I0698a39036j55288b1222H5013b37726
9222A27891Q3186b45192Q517F2395a62983k95659A89076j6444b63493A4166a86290
9210A7044a72050d9216B56665c88227J88577A42040d0367G784K19735d0803B58558
9198b255m1054l69571m1090A6349e1831n1920j03932J0317R3958L5189E0465a69661
9185C1371D406h472B69987j16304O3027c67016J16713A14954J11316A8637g5697
9173I404e5525F3028J96652a49198F9485g5218A0120P7506b5237A34614C1424
$$ y = [186733, -355680, -68677, -121680, 187126, -251402, -76552, 213630, 103295, 56005, -74683, 41277, 46355, 296168, 259134, -291500, 255882, 14225, -1438, 30104, 88724, 274384, 42509, -223444, -106713, -97836, -197785, -47946, 162979, -48577, 90698, -139036, -294324, -21222, 85013, -237726, 127891, 211077, -245192, -236675, 62395, -162983, -458642, 189076, 172632, -263493, 14166, -186290, 17044, -172050, -49216, 256665, -388227, -199650, 142040, -40367, 7784, 227519, -40803, 258558, -2255, -43309, -412880, -453970, 16349, -51831, -103751, -207683, -197366, -103408, -68219, 50465, -169661, 31371, 4406, -8472, 269987, 153683, 216710, -367016, -250303, 114954, 226270, 18637, -75697, 9404, -55525, 63028, 259680, -149198, 69485, -75218, 10120, 87626, -25237, 134614, 31424]
9161D1263J08307b06900b0269j18678H9600J50771b57473e2420A12448e860j81881
9150a87741d6315l11964h0374D5634e9535j24727D1039c85512A61317c89191A84234
9138a72745A14035c57636a23709m7342B2850O5915L795K27526d5599Q831A58738
9126F4248c15234A7061a16844r7630A55753e6493D9129b28584P9074a0459j12611
9115a23070A09201d46716B04027h6339o8436f4644j78879d7421m3460j55543c5783
9103A0914J38728b51015a25455q1654b0590p4117a0910a737p3713a4938j23580
9092a38518j04825b1067m14366J21310a39455O9577H4876e5756k11023Q6281n6750
9081b37248A43638R4123b31462B53014a17119j56809i2847A10950a65517A12416
$$ y = [41263, 149570, -206900, -20269, -138947, 89600, 240371, -257473, -52420, 112448, -5860, -187741, -46315, -358279, -80374, 45634, -59535, -184262, 41039, -385512, 161317, -389191, 184234, -172745, 114035, -357636, -123709, -171051, 22850, 88765, 92560, 320086, -45599, -36768, 158738, 64248, -315234, 17061, -116844, -214474, 155753, -56493, 49129, -228584, -149510, -10459, -123070, 109201, -446716, 204027, -86339, -154775, -64644, -243523, -47421, -90881, -246424, -35783, 10914, 149642, -251015, -125455, -207109, -20590, -94707, -10910, -1737, -75450, -14938, -138518, -243343, -21067, -435433, -314123, -139455, -69878, 84876, -55756, -266779, -180498, -237248, 143638, 237761, -231462, 253014, -117119, -273928, -92847, 110950, -165517, 112416]
9070a83513A26048a40755C12574A0271b45280B7225O5314a24801N3017A46278
9059B1327a01681C14770A1546J88131b6221j73937i0569j08303L9506B38518p0458
9048A68060b0933E6050b49580J17658D4076a45395d2320J5729A7873c02373N3119
9037b49254J19049H09b44869A4186e3348k6930j40811n2000l8418R1708n5707
9026b75506c7110k64711a50597j15606c5016B51589b17293B02572a51738B34430
9015B08707c26997a2342B39099d73613A96285g1394A76384C5545b44610E6552
9004e3652A25375Q3084g0519m11098C7761K2922J33294f887o4648k31663a11937
8992a6530j71882e5687A44905j884o6388L5157N7990a93746n760K3885Q5697L4181
$$ y = [-183513, 126048, -140755, 312574, 10271, -245280, 27225, 92539, -124801, -71784, 146278, 21327, -101681, 314770, 11546, 199677, -26221, -200158, -90569, -198872, -159366, 238518, 168060, -20933, 56050, -249580, -131922, 44076, -145395, -42320, -26591, 17873, -302373, -249254, -130205, 809, -244869, 14186, -53348, -80278, -221089, -273089, -311507, -219799, -275506, -37110, -301821, -150597, -266203, -35016, 251589, -217293, 202572, -151738, 234430, 208707, -326997, -12342, 239099, -473613, 196285, -71394, 176384, 35545, -244610, 56552, -53652, 125375, 208459, -70519, -481617, 37761, 60683, 193977, -6887, -71535, -303198, -111937, -16530, -188412, -55687, 144905, 143021, 76633, 111790, 169780, -193746, -199506, -175621, -89924, -55743]
8980e5743A42970A9270b63967A9130d48150A33765a99202e0497G0650b2509B01603
8968A55444O2652e0325a171E7717O9211a30320A98185F6098c36045c1569a0150
8956d2051j51430A42211a61026f4803r5886e3634j97976c8649j48519A38902a49510
8944E9019f8949E7094b25617P4593A27198E1446O2902k4983a38541A55082a24956
8932C23259e8811A36926e0494C7994b23977C34031b5447F0201Q592a55606A28279
8920E65343a39312N6478L360C3996M0731d05j96889a8757k03994J08986O998I7637
8907g0106q555k1102l65406E5864a75463B36924g4236k9897M6376n3277a5592
8895a93408c9446D20743A6551J11293l6753c41034M7357f4279q54F0517c45976
$$ y = [-55743, 142970, 19270, -263967, 19130, -448150, 133765, -199202, -50497, 70650, -22509, 201603, 155444, 218096, -50325, -1171, 57717, 126928, -130320, 198185, 66098, -336045, -31569, -10150, -42051, -193481, 142211, -161026, -64803, -160689, -53634, -251610, -38649, -187168, 138902, -149510, 59019, -68949, 57094, -225617, -151024, 127198, 51446, 114348, 89365, -138541, 155082, -124956, 323259, -58811, 136926, -50494, 37994, -223977, 334031, -25447, 60201, 68793, -155606, 128279, 565343, -139312, -82834, -79474, 33996, 74727, -405, -197294, -18757, -222751, -113765, -106767, 97637, -70106, -78661, -99763, -465169, 55864, -175463, 236924, -74236, -104133, -57757, -111034, -15592, -193408, -39446, 420743, 16551, 127844, 91091, -341034, -293677, -64279, -65133, 60517, -345976]
8883B10262a65905A34348n4151N1307e21664i478B02650a26086b1473h460b980
8871a72191J373h1506n1138O0603I278a45139f2407j54800J8918M3955A21057
8859g4606l8212D021d13783G3781b57099b5613I6333m0497b2667A17616a95254
8847d8952l17694A19732a23323B02874C152J05159b43946J19768A01629c7266
8836c52163B29984a84276b681r736k72679B4162c5226C5040c9939o4291i917j71123
$$ y = [210262, -165905, 134348, 80197, 131504, -521664, -9478, 202650, -126086, -21473, -8460, -2980, -172191, -170818, -81506, -132644, -72041, 9278, -145139, -62407, -217207, -198289, -154334, 121057, -74606, -112818, 4021, -413783, 73781, -257099, -25613, 96333, 55836, -22667, 117616, -195254, -48952, -366646, 119732, -123323, 202874, 3152, 108311, -243946, -124178, 101629, -37266, -352163, 229984, -184276, -2681, -12417, -285096, 24162, -35226, 35040, -39939, -104230, -9917, -181040]
$$ [...]
##END NTUPLES=NMR SPECTRUM
##END=
