##TITLE=AC1728_SEN00001_9274204_Mng1pFnGc1
##JCAMPDX= 6.0         $$ Bruker NMR JCAMP-DX V2.0
##DATA TYPE= NMR SPECTRUM
##DATA CLASS= NTUPLES
##ORIGIN= BRUKER
##OWNER= Administrator
$$ 1.72 TOPSPIN		Version 2.1
$$ 2015-07-18 23:29:31.447 -0700  Administrator@X
$$ Compression mode = diff/dup
##.OBSERVE FREQUENCY= 400.02188249412
##.OBSERVE NUCLEUS= ^1H
##.ACQUISITION MODE= SIMULTANEOUS (DQD)
##.ACQUISITION SCHEME= undefined
##.AVERAGES= 64
##.DIGITISER RES= 22
##SPECTROMETER/DATA SYSTEM= spect
##.PULSE SEQUENCE= noesygpps1d.comp
##.SOLVENT NAME= COFFEE_meoh
##.SHIFT REFERENCE= INTERNAL, COFFEE_meoh, 1, 14.96082
##AUDIT TRAIL= $$ (NUMBER, WHEN, WHO, WHERE, PROCESS, VERSION, WHAT)
$$ ##TITLE= Audit trail, TOPSPIN		Version 2.1
$$ ##JCAMPDX= 5.01
$$ ##ORIGIN= Bruker BioSpin GmbH
$$ ##OWNER= Administrator
$$ $$ E:/data/COFFEE/nmr/AC1728_SEN00001_9274204_Mng1pFnGc1/22/pdata/1/auditp.txt
$$ ##AUDIT TRAIL=  $$ (NUMBER, WHEN, WHO, WHERE, PROCESS, VERSION, WHAT)
(   1,<2015-07-18 23:29:26.166 -0700>,<Administrator>,<X>,<go>,<TOPSPIN 2.1>,
      <created by zg
	started at 2015-07-18 23:17:56.244 -0700,
	POWCHK enabled, PULCHK disabled,
       configuration hash MD5:
       21 0F 79 D6 B3 7B B4 F6 88 20 88 DB 03 48 BD 9F
       data hash MD5: 64K
       76 05 01 80 F0 D8 86 5D 6E 10 37 E1 95 0C 03 84>)
(   2,<2015-07-18 23:29:29.322 -0700>,<Administrator>,<X>,<proc1d>,<TOPSPIN 2.1>,
      <Start of raw data processing
       efp LB = 0.3 FT_mod = 6 PKNL = 1 PHC0 = 0 PHC1 = 0 SI = 128K 
       data hash MD5: 128K
       76 69 70 DA A6 14 11 F2 E8 B8 4B A6 2E 40 26 85>)
(   3,<2015-07-18 23:29:30.229 -0700>,<Administrator>,<X>,<proc1d>,<TOPSPIN 2.1>,
      <pk PHC0 = -88.80798 PHC1 = 0 
       data hash MD5: 128K
       B6 8E 6B 3D 47 3B 32 57 44 04 9D F4 69 F3 DD 66>)
(   4,<2015-07-18 23:29:30.604 -0700>,<Administrator>,<X>,<proc1d>,<TOPSPIN 2.1>,
      <abs ABSG = 1 
       data hash MD5: 128K
       46 8F 73 F0 4F 60 1D 07 6E C9 07 FF 8B 43 39 49>)
(   5,<2015-07-18 23:29:30.697 -0700>,<Administrator>,<X>,<proc1d>,<TOPSPIN 2.1>,
      <abs ABSG = 2 
       data hash MD5: 128K
       DA EE DD 8C 71 F8 53 D1 68 01 DC 16 B0 C2 0F 5C>)
(   6,<2015-07-18 23:29:30.791 -0700>,<Administrator>,<X>,<proc1d>,<TOPSPIN 2.1>,
      <abs ABSG = 3 
       data hash MD5: 128K
       CD F9 11 C7 68 DE 73 71 3C DC B1 56 83 D8 69 BB>)
(   7,<2015-07-18 23:29:30.885 -0700>,<Administrator>,<X>,<proc1d>,<TOPSPIN 2.1>,
      <abs ABSG = 4 
       data hash MD5: 128K
       18 01 86 4A 02 E4 8D D2 63 04 6B 11 48 35 A1 33>)
(   8,<2015-07-18 23:29:30.979 -0700>,<Administrator>,<X>,<proc1d>,<TOPSPIN 2.1>,
      <abs ABSG = 5 
       data hash MD5: 128K
       9C 1B A3 B7 68 69 08 2C 3A 42 B3 3A 53 16 7C 5B>)
$$ ##END=
$$ 
$$ $$ hash MD5
$$ $$ 46 3C 9E 90 B3 A5 CE 3C B3 AA C9 AF 05 2E 77 C6
##$RELAX= 
##$RELAX= 
##$RELAX= 
##$RELAX= 
##$RELAX= 
##$RELAX= 
##$RELAX= 
##$RELAX= 
$$ Bruker specific parameters
$$ --------------------------
##$DU= <E:>
##$EXPNO= 22
$$ [...]
##$TP07= 0
##$TPNAME0= <>
##$TPNAME1= <>
##$TPNAME2= <>
##$TPNAME3= <>
##$TPNAME4= <>
##$TPNAME5= <>
##$TPNAME6= <>
##$TPNAME7= <>
##$TPOAL= (0..7)
0.5 0.5 0.5 0.5 0.5 0.5 0.5 0.5
##$TPOFFS= (0..7)
0 0 0 0 0 0 0 0
##$TUNHIN= 0
##$TUNHOUT= 0
##$TUNXOUT= 0
##$USERA1= <user>
##$USERA2= <user>
##$USERA3= <user>
##$USERA4= <user>
##$USERA5= <user>
##$V9= 5
##$VALIST= <valist>
##$VCLIST= <CCCCCCCCCCCCCCC>
##$VD= 0
##$VDLIST= <DDDDDDDDDDDDDDD>
##$VPLIST= <PPPPPPPPPPPPPPP>
##$VTLIST= <TTTTTTTTTTTTTTT>
##$WBST= 2048
##$WBSW= 25
##$XGAIN= (0..3)
0 0 0 0
##$XL= 0
##$YL= 0
##$YMAX_a= 6366258
##$YMIN_a= -11869842
##$ZGOPTNS= <>
##$ZL1= 120
##$ZL2= 120
##$ZL3= 120
##$ZL4= 120
##$ABSF1= 14.96082
##$ABSF2= -5.597362
##$ABSG= 5
##$ABSL= 3
##$ALPHA= 0
##$AQORDER= 0
##$ASSFAC= 0
##$ASSFACI= 0
##$ASSFACX= 0
##$ASSWID= 0
##$AUNMP= <proc_prof1d_extract.lims>
##$AXLEFT= 0
##$AXNAME= <>
##$AXNUC= <1H>
##$AXRIGHT= 0
##$AXTYPE= 0
##$AXUNIT= <>
##$AZFE= 0.1
##$AZFW= 0.1
##$BCFW= 0
##$BC_mod= 0
##$BYTORDP= 0
##$COROFFS= 0
##$CY= 15
##$DATMOD= 1
##$DC= 0
##$DFILT= <>
##$DTYPP= 0
##$F1P= 0
##$F2P= 0
##$FCOR= 0.5
##$FTSIZE= 131072
##$FT_mod= 6
##$GAMMA= 0
##$GB= 0
##$INTBC= 1
##$INTSCL= 1
##$ISEN= 128
##$LB= 0.3
##$LEV0= 0
##$LPBIN= 0
##$MAXI= 10000
##$MC2= 0
##$MEAN= 0
##$ME_mod= 0
##$MI= 0
##$NCOEF= 0
##$NC_proc= -2
##$NLEV= 6
##$NOISF1= 0
##$NOISF2= 0
##$NSP= 0
##$NTH_PI= 0
##$NZP= 0
##$OFFSET= 14.96082
##$PC= 1
##$PHC0= -88.80798
##$PHC1= 0
##$PH_mod= 1
##$PKNL= yes
##$PPARMOD= 0
##$PPDIAG= 0
##$PPIPTYP= 0
##$PPMPNUM= 2147483647
##$PPRESOL= 1
##$PSCAL= 4
##$PSIGN= 0
##$PYNMP= <proc.py>
##$REVERSE= no
##$SF= 400.020009710259
##$SI= 131072
##$SIGF1= 0
##$SIGF2= 0
##$SINO= 400
##$SIOLD= 131072
##$SPECTYP= <>
##$SREGLST= <1H.CDCl3>
##$SSB= 0
##$STSI= 131072
##$STSR= 0
##$SW_p= 8223.68421052631
##$SYMM= 0
##$S_DEV= 0
##$TDeff= 65536
##$TDoff= 0
##$TI= <>
##$TILT= no
##$TM1= 0
##$TM2= 0
##$TOPLEV= 0
##$USERP1= <user>
##$USERP2= <user>
##$USERP3= <user>
##$USERP4= <user>
##$USERP5= <user>
##$WDW= 1
##$XDIM= 131072
##$YMAX_p= 429445864
##$YMIN_p= -10887
##$CURPLOT= <Network HP LaserJet P1505>
##$CURPRIN= <$Network HP LaserJet P1505>
##$DFORMAT= <normdp>
##$LAYOUT= <+/1D_H.xwp>
##$LFORMAT= <normlp>
##$PFORMAT= <normpl>
##$SURQMSG= 1
$$ End of Bruker specific parameters
$$ ---------------------------------
##NTUPLES= NMR SPECTRUM
##VAR_NAME=  FREQUENCY,     SPECTRUM/REAL,   SPECTRUM/IMAG
##SYMBOL=    X,             R,               I
##VAR_TYPE=  INDEPENDENT,   DEPENDENT,       DEPENDENT
##VAR_FORM=  AFFN,          ASDF,            ASDF
##VAR_DIM=   131072,        131072,          131072
##UNITS=     HZ,            ARBITRARY UNITS, ARBITRARY UNITS
##FACTOR=    0.0627417313425164, 1,          1
##FIRST=     8223.62146879497, 3222,         -59593
##LAST=      0,             5817,            -59233
##MIN=       0,             -10887,          0
##MAX=       8223.62146879497, 429445864,    0
$$ Real data points
##PAGE= N=1
##DATA TABLE= (X++(R..R)), XYDATA
$$ [...]
63921E475339j52739j89013k20170k44827k61982k71348k73989k72050k67125
63912C322096k59107k47246k31898k14427j95752j76128j56305j37789j21574
63903A581870j07466r4855q3536p3426o4319n6253m9554m4172l9547l5345l1800
63892I01597k9033k6707k4727k3543k3267k3069k2117k0696j9677j9125j8217
63881F51419j6426j4137j1966r939p613m779j826N49K004K984M429O872R813J2112
63867F23496J3070J3134J3470J4722J6267J6837J5956J4478J3576J3451J3332
63856G81789J2425J0517P789M657J679p98k959n125p158q665r779j1110j2902
63843G60360j4741j6268j7649j9061k0280k0990k1256k1361k1469k1636k1849
$$ y = [5475339, 5322600, 5133587, 4913417, 4668590, 4406608, 4135260, 3861271, 3589221, 3322096, 3062989, 2815743, 2583845, 2369418, 2173666, 1997538, 1841233, 1703444, 1581870, 1474404, 1379549, 1296013, 1222587, 1158268, 1102015, 1052461, 1008289, 968742, 933397, 901597, 872564, 845857, 821130, 797587, 774320, 751251, 729134, 708438, 688761, 669636, 651419, 634993, 620856, 608890, 598951, 591338, 586559, 584733, 585282, 587286, 590270, 594699, 601571, 611384, 623496, 636566, 649700, 663170, 677892, 694159, 710996, 726952, 741430, 755006, 768457, 781789, 794214, 804731, 812520, 817177, 818856, 818058, 815099, 809974, 802816, 794151, 784372, 773262, 760360, 745619, 729351, 711702, 692641, 672361, 651371, 630115, 608754, 587285, 565649, 543800]
63832E43800k1897k1479k0560j9413j8248j7137j6234j5651j5023j3773j1939
63821C52446j0245r138q304p373o508n962n569n152m912m946m792m063l144k658
63807B69680k428j681k90Q64R39J18p15j002r66j147j714k302k453k097j525j072
63791B52209r92j456k363l228l635l692l677l437k684j735j276j308j130n37j48
63776B20911k08M9J139K214K058O76r07j995k524k386j468l71l3n48j009p95l20
63759B14483k55n81p60m64J68P65R86P16J63l57p18r20q96o10k54J6L65J036J851
63740B14734K407K689L007L388L440K992K363J906J656J569J708J986K133K134
63726B48112K361K974L515L429K871K595L059L954M610M704M470M254M004L285
$$ y = [543800, 521903, 500424, 479864, 460451, 442203, 425066, 408832, 393181, 378158, 364385, 352446, 342201, 333063, 324759, 317386, 310878, 304916, 299347, 294195, 289283, 284337, 279545, 275482, 272338, 269680, 267252, 265571, 265281, 266145, 267084, 267202, 266487, 265485, 264519, 263372, 261658, 259356, 256903, 254806, 253281, 252209, 251217, 249761, 247398, 244170, 240535, 236843, 233166, 229729, 227045, 225310, 224034, 222726, 221596, 221059, 220911, 220703, 220752, 221891, 224105, 226163, 226839, 225932, 223937, 221413, 219027, 217559, 217188, 217155, 216607, 215598, 214803, 214483, 214228, 213647, 212887, 212423, 212591, 213356, 214342, 215058, 215221, 214864, 214146, 213226, 212330, 211720, 211466, 211482, 211847, 212883, 214734, 217141, 219830, 222837, 226225, 229665, 232657, 235020, 236926, 238582, 240151, 241859, 243845, 245978, 248112, 250473, 253447, 256962, 260391, 263262, 265857, 268916, 272870, 277480, 282184, 286654, 290908, 294912, 298197]
63712B98197J883K49q73j264j437j905k509k630j988r72j89N4j83p11j294j588
63696B82840j307n29L57J129J942K938L837M201L973L487L059K846K986L403L533
63681C18695K757J175m00j356j710j654j252p79p21j024r47q8R97J680K130K642
63665C20145K663J509k63j262j042n72p95j585k402l173m031m751m976m717m243
63650B90505l736l315l096l025k768k089j154l80m6j15k51l3O04J191J278J110
63634B74680J369K242L234L950M521N077N342N129M817M923N521O362P318Q324
63620C42809R185R794J0345J1002J1552J1848J2342J3711J5940J8218J9882K1104
63608E07732K2579K4764K7493L0154L2123L3151L3408L2974L1373K7870K2340
$$ y = [298197, 300080, 300329, 299456, 298192, 296755, 294850, 292341, 289711, 287723, 286751, 286562, 286616, 286433, 285722, 284428, 282840, 281533, 281004, 281361, 282490, 284432, 287370, 291207, 295408, 299381, 302868, 305927, 308773, 311759, 315162, 318695, 321452, 322627, 322227, 320871, 319161, 317507, 316255, 315476, 314755, 313731, 312784, 312696, 313693, 315373, 317503, 320145, 322808, 324317, 324054, 322792, 321750, 321178, 320383, 318798, 316396, 313223, 309192, 304441, 299465, 294748, 290505, 286769, 283454, 280358, 277333, 274565, 272476, 271322, 270942, 270896, 270781, 270530, 270497, 271101, 272292, 273570, 274680, 276049, 278291, 281525, 285475, 289996, 295073, 300415, 305544, 310361, 315284, 320805, 327167, 334485, 342809, 351994, 361788, 372133, 383135, 394687, 406535, 418877, 432588, 448528, 466746, 486628, 507732, 530311, 555075, 582568, 612722, 644845, 677996, 711404, 744378, 775751, 803621, 825961]
63597H25961J5673R189L700p01m121o448p550p690p529p607q074q968j0620j3462
63583G71753j7403k1549k4784k6564k7082k6737k5690k3953k1726j9348j6970
63572E19947j4529j2109j0101q675p354n400k713K6K163L687M913N907O534O861
63558D89157P153P496P706P656P556P913R131J1104J3240J5227J7583K1050K5404
63545F47376K9543L2981L6444M0362M3403M3422L9527L2445K3232J2769K512n584
63533I78432j0458j2565j2794j1467q893o158m629m949p045j0691j5598k1072
63521H52113k6200l0338l3271l5027l5747l5500l4129l1579k8481k5906k4210
63510E11725k2654k0449j7776j5327j3379j1878j0904j0358r584q104o492n658
$$ y = [825961, 841634, 850823, 854523, 853822, 849701, 843253, 835703, 828013, 820484, 812877, 804803, 795835, 785215, 771753, 754350, 732801, 708017, 681453, 654371, 627634, 601944, 577991, 556265, 536917, 519947, 505418, 493309, 483208, 474533, 467179, 461779, 459066, 459092, 461255, 464942, 469855, 475762, 482296, 489157, 496310, 503806, 511512, 519168, 526724, 534637, 543768, 554872, 568112, 583339, 600922, 621972, 647376, 676919, 709900, 746344, 786706, 830109, 873531, 913058, 945503, 968735, 981504, 984016, 978432, 967974, 955409, 942615, 931148, 922255, 916097, 911468, 906519, 899474, 888783, 873185, 852113, 825913, 795575, 762304, 727277, 691530, 656030, 621901, 590322, 561841, 535935, 511725, 489071, 468622, 450846, 435519, 422140, 410262, 399358, 389000, 379416, 371312, 364820, 359162]
63498C59162n443m818l487k296j778j336l40O88Q17M0q04j203j366j547j621j379
63482C33289q12PR90J914K559L048L728M582N023M535L282J973J164Q72O94J39
63466C66987j036k574l810m259m123m021m231m430m236l710l128k492j603m55
63452C22879O68J494J869J693J108P49J351K971M814O047O543O744P059P627Q436
63437C82052R402J0477J1829J3787J6396J9261K2027K4716K7137K8263K6798K2645
63425F14790J7333J2782R842Q227P572Q091J0133J3516J7596K1933K6652L1874
63413H00341L7021M0948M2870M2779M0837L6714L0046K1376J2172L811l091q281
63401A097543j1393j2306j1683j0710j0282j0744j2339j5353j9624k4271k8335
$$ y = [359162, 353719, 348901, 345414, 343118, 341340, 340004, 339664, 340352, 341169, 341209, 340405, 339202, 337836, 336289, 334668, 333289, 332477, 332484, 333474, 335388, 337947, 340995, 344723, 349305, 354328, 358863, 362145, 364118, 365282, 366154, 366848, 366987, 365951, 363377, 359567, 355308, 351185, 347164, 342933, 338503, 334267, 330557, 327429, 324937, 323334, 322879, 323547, 325041, 326910, 328603, 329711, 330460, 331811, 334782, 339596, 345643, 352186, 358930, 365989, 373616, 382052, 391454, 401931, 413760, 427547, 443943, 463204, 485231, 509947, 537084, 565347, 592145, 614790, 632123, 644905, 654747, 662974, 670546, 678637, 688770, 702286, 719882, 741815, 768467, 800341, 837362, 878310, 921180, 963959, 1004796, 1041510, 1071556, 1092932, 1105104, 1108915, 1105824, 1097543, 1086150, 1073844, 1062161, 1051451, 1041169, 1030425, 1018086, 1002733, 983109, 958838, 930503]
63390I30503l1632l4546l7018l8175l7341l5073l2721l0944k9179k6675k3495
63379E73704k0171j6904j3646j0724q593o947m863k066O05K415L813N644P756
63366E10023R254J0012J0993J2871J5131J6980J8462K0092K1941K3827K6136K9472
63354G25194L3481L6835L8716L9576M0024L9539L6995L2099K5604J8269J0373
63343A076705K458m273q789j1168j2258j2686j2602j2259j2245j3118j5153j8501
63331I46111k3107k8243l2519l4892l5489l5147l4288l2723l0436k7866k5185
63320F06216k1852j7419j2461q214n482m350m810o974j0460j4097j6642j7611
63308D65844j7292j6212j4773j3179j1457r622p907o631n807n124m365l586k759
$$ y = [930503, 898871, 864325, 827307, 789132, 751791, 716718, 683997, 653053, 623874, 597199, 573704, 553533, 536629, 522983, 512259, 503666, 496719, 491856, 489790, 490395, 492810, 496623, 502267, 510023, 519277, 529289, 540282, 553153, 568284, 585264, 603726, 623818, 645759, 669586, 695722, 725194, 758675, 795510, 834226, 873802, 913826, 953365, 990360, 1022459, 1048063, 1066332, 1076705, 1079163, 1074890, 1066101, 1054933, 1042675, 1029989, 1017387, 1005128, 992883, 979765, 964612, 946111, 923004, 894761, 862242, 827350, 791861, 756714, 722426, 689703, 659267, 631401, 606216, 584364, 566945, 554484, 546270, 540788, 536438, 531628, 524654, 514194, 500097, 483455, 465844, 448552, 432340, 417567, 404388, 392931, 383309, 375402, 368771, 362964, 357840, 353475, 349889, 347130]
63295C47130j728o87k61p51j627k219k496k788l029k912k536k269k080j675j228
63280C18844j274j797k114j894j635j739j758j051J96J128J248Q45N44P38J363
63265C11644J961K044J619J208J261J722K287K806L128K973K375K002K467L442
63251C42939L968L680L210L317M121N302O533P420P536P034O862P831R608J1170
63237D30531J2126J2966J4073J5229J6308J7682J9430K0804K1162K0997K1208
63226F22516K1681K1491K0529J9788J9836J9996J9603J9264J9965K1537K2855
63215H49061K3281K3070K2507K1389J9481J6790J3290Q927L950j133o012j0585
63203I84016j4593j7731k0140k2190k3744k4127k3025k0897j8356j5623j2714
$$ y = [347130, 345402, 344715, 344454, 343703, 342076, 339857, 337361, 334573, 331544, 328632, 326096, 323827, 321747, 320072, 318844, 317570, 315773, 313659, 311765, 310130, 308391, 306633, 305582, 305778, 306906, 308154, 308999, 309543, 310281, 311644, 313605, 315649, 317268, 318476, 319737, 321459, 323746, 326552, 329680, 332653, 335028, 337030, 339497, 342939, 346907, 350587, 353797, 357114, 361235, 366537, 373070, 380490, 388026, 395060, 401922, 409753, 419361, 430531, 442657, 455623, 469696, 484925, 501233, 518915, 538345, 559149, 580311, 601308, 622516, 644197, 665688, 686217, 706005, 725841, 745837, 765440, 784704, 804669, 826206, 849061, 872342, 895412, 917919, 939308, 958789, 975579, 988869, 997796, 1001746, 1000613, 994601, 984016, 969423, 951692, 931552, 909362, 885618, 861491, 838466, 817569, 799213, 783590, 770876]
63192G70876r729o653l253N55M565Q577J2552J6336J9648K2501K5229K7895L0088
63179I19187L1475L2203L2555L2617L2456L2193L1693L0627K9152K8005K7584
63168A259747K7281K6126K3774K0422J6169J0866M480k827j0753j8780k6253l2878
63156A297374l8872m4311m8653n1255n2109n1681n0229m7769m4504m0911l7396
63145G89684l4157l1213k8315k5092k1586j8394j5984j4084j2169j0185q412o869
63133E63224n444m393m118m390m379l505j949k75J062J887K367K919L734M471
63119E51211M713M642M812N281N446M839L700K651K106K115K475K832K905K727
63105F02455K533K338J954J372Q67N65J83n42j373j736j422q49o18q61j222j353
$$ y = [770876, 761147, 754494, 751241, 751796, 756361, 764938, 777490, 793826, 813474, 835975, 861204, 889099, 919187, 950662, 982865, 1015420, 1048037, 1080493, 1112686, 1144379, 1175006, 1204158, 1232163, 1259747, 1287028, 1313154, 1336928, 1357350, 1373519, 1384385, 1388865, 1386038, 1375285, 1356505, 1330252, 1297374, 1258502, 1214191, 1165538, 1114283, 1062174, 1010493, 960264, 912495, 867991, 827080, 789684, 755527, 724314, 695999, 670907, 649321, 630927, 614943, 600859, 588690, 578505, 570093, 563224, 557780, 553387, 549269, 544879, 540500, 536995, 535046, 534771, 535833, 537720, 540087, 543006, 546740, 551211, 555924, 560566, 565378, 570659, 576105, 580944, 584644, 587295, 589401, 591516, 593991, 596823, 599728, 602455, 604988, 607326, 609280, 610652, 611519, 612084, 612267, 611725, 610352, 608616, 607194, 606345, 605727, 604866, 603644, 602291]
63089F02291j247r77m98P5K74k16r39j104n38K73J016J826K670L221L537M161
63073F13825N145N745N567N325N836O885P829Q731J0034J1530J2623J3359J4333
63060G26767J5679J7020J8334K0060K2296K4695K7194L0181L3755L7467M0846
63049A014294M3685M5840M7394M8931N0926N2923N3983N3908N3290N2358N0805
63038A568337M8892M7696M7806M8563M9054M9123M8888M8002M6000M2891L8814
63027B084066L3453K6361J7568P503l418j4769k5980l6488m5736n2906n7241n8903
63015A873510n8969n8133n5912n1619m5543l8593l1173k3161j4789o714Q35Q439
63003A498178J6695K5341L3404M0099M5536N0411N5006N8687O0629O0912O0450
$$ y = [602291, 601044, 600067, 599569, 599644, 599918, 599702, 598763, 597659, 597121, 597394, 598410, 600236, 602906, 606127, 609664, 613825, 618970, 624715, 630282, 635607, 641443, 648328, 656157, 664888, 674922, 686452, 699075, 712434, 726767, 742446, 759466, 777800, 797860, 820156, 844851, 872045, 902226, 935981, 973448, 1014294, 1057979, 1103819, 1151213, 1200144, 1251070, 1303993, 1357976, 1411884, 1465174, 1517532, 1568337, 1617229, 1664925, 1712731, 1761294, 1810348, 1859471, 1908359, 1956361, 2002361, 2045252, 2084066, 2117519, 2143880, 2161448, 2168951, 2165533, 2150764, 2124784, 2088296, 2042560, 1989654, 1932413, 1873510, 1814541, 1756408, 1700496, 1648877, 1603334, 1564741, 1533568, 1510407, 1495618, 1488904, 1489739, 1498178, 1514873, 1540214, 1573618, 1613717, 1659253, 1709664, 1764670, 1823357, 1883986, 1944898, 2005348]
62992B005348N9979N9585N9236N8976N8450N6914N4131N0653M6821M2051L5614
62981B587758K7550J8167P143n994k0735l5684m9774o2763p4595q4825r2868r8356
62969B115024j01194j01534r9760r6294r1374q5218p8335p1466o5243n9945n5366
62958A209295n0872m5941m0902l6778l4178l2655l1401l0145k8939k7570k5777
62947H24137k3822k2239k1186k0383j9594j8652j7376j5899j4815j4392j3964
62936F21815j2730j0934r538q816q139p108o099n467n018m527m115l766l084j958
62922E30516r23m88n21o72r80j529j970j939j757k052k799l269l035k516k376
62907E03690k720l156l445l739m232m770m984m713m177l683l268k688j789p23
$$ y = [2005348, 2065327, 2124912, 2184148, 2243124, 2301574, 2358488, 2412619, 2463272, 2510093, 2552144, 2587758, 2615308, 2633475, 2640618, 2634624, 2613889, 2578205, 2528431, 2465668, 2391073, 2306248, 2213380, 2115024, 2013830, 1912296, 1812536, 1716242, 1624868, 1539650, 1461315, 1389849, 1324606, 1264661, 1209295, 1158423, 1112482, 1071580, 1034802, 1000624, 967969, 936568, 906423, 877484, 849914, 824137, 800315, 778076, 756890, 736507, 716913, 698261, 680885, 664986, 650171, 635779, 621815, 609085, 598151, 588613, 579797, 571658, 564550, 558451, 552984, 547966, 543439, 539324, 535558, 532474, 530516, 529593, 529105, 528584, 527912, 526932, 525403, 523433, 521494, 519737, 517685, 514886, 511617, 508582, 506066, 503690, 500970, 497814, 494369, 490630, 486398, 481628, 476644, 471931, 467754, 464071, 460803, 458115, 456326, 455603]
62893D55603K05Q26J224J502J551J109K01o61q47k34O83J304J346Q05r4q12p46
62876D62965R9R89J267J132J199J523J529Q88M0l46j69km47j414k028j507j61
62859D65557P20L79l86k05J060K192K306J936K037K560K613J842R44P09R88J003
62843D86255M33k22m78n61r58j540j746j584j723k345k618j872o81n9J6L66J131
62826D71814J529J202Q48J140J791K123K007J734J481J315J362J546J511J215
62812D92618J144J617K295K807L351M037M267L532K575K667L831M713M491L978
62798E37923M385N742P105P919Q484R260J0253J1221J2086J3137J4840J7412K0550
62785F80317K3738K6838L0121L3708L7429M1422M6304N2329N8755O4610O9719
$$ y = [455603, 455808, 456634, 457858, 459360, 460911, 462020, 462221, 461560, 460713, 460479, 461162, 462466, 463812, 464617, 464523, 463711, 462965, 463064, 464053, 465320, 466452, 467651, 469174, 470703, 471591, 471631, 471285, 471116, 471114, 470667, 469253, 467225, 465718, 465557, 466277, 466656, 466270, 466065, 467125, 469317, 471623, 473559, 475596, 478156, 480769, 482611, 483555, 484264, 485252, 486255, 486688, 486466, 485988, 485427, 484469, 482929, 481183, 479599, 477876, 475531, 472913, 471041, 470360, 470301, 470317, 470683, 471814, 473343, 474545, 475393, 476533, 478324, 480447, 482454, 484188, 485669, 486984, 488346, 489892, 491403, 492618, 493762, 495379, 497674, 500481, 503832, 507869, 512136, 515668, 518243, 520910, 524741, 529454, 533945, 537923, 542308, 548050, 555155, 563074, 571558, 580818, 591071, 602292, 614378, 627515, 642355, 659767, 680317, 704055, 730893, 761014, 794722, 832151, 873573, 919877, 972206, 1030961, 1095571, 1165290]
62774A165290P4385P8274Q0526Q0960Q0230P8494P4725O7918N8409M7291L5069
62763A921571K1612P192p286k1092l3972m5559n5216o2713o8470p2837p5549p6310
62751A431371p5429p3484p0660o6878o2394n7793n3483m9489m5621m1608l7197
62740G97335l2574k8468k5492k3404k1489j9449j7425j5260j2518r413o972n820
62728E79051n351m623l615k906k389j264P29K806M188N039N956P072Q170R370
62714F02233J1083J3328J5659J7742J9647K1563K3668K6341L0003L4547L9365
62703H55179M4178M9405N5437O1896O8137P4245Q0880Q8265R5808J02808J08927
62692A685165J13873J17052J17982J16667J13230J07318R8212Q5453O9150M9768
$$ y = [1165290, 1239675, 1317949, 1398475, 1479435, 1559665, 1638159, 1712884, 1780802, 1839211, 1886502, 1921571, 1943183, 1950375, 1943089, 1921997, 1888025, 1842466, 1787250, 1724537, 1656067, 1583230, 1507681, 1431371, 1355942, 1282458, 1211798, 1144920, 1082526, 1024733, 971250, 921761, 876140, 834532, 797335, 764761, 736293, 710801, 687397, 665908, 646459, 629034, 613774, 601256, 591843, 584871, 579051, 573700, 569077, 565462, 562556, 560167, 558903, 559632, 562438, 566626, 571665, 577621, 584693, 592863, 602233, 613316, 626644, 642303, 660045, 679692, 701255, 724923, 751264, 781267, 815814, 855179, 899357, 948762, 1004199, 1066095, 1134232, 1208477, 1289357, 1377622, 1473430, 1576238, 1685165, 1799038, 1916090, 2034072, 2150739, 2263969, 2371287, 2469499, 2554952, 2624102, 2673870]
62682B673870K7974M715j8742m1058o1155p8425r2732j04184j12799j18377j20747
62671A958340j20111j17063j12252j06114r9038r1624q4526p7953p1575o5115
62661A012969n8848n3183m7938m2539l6963l1979k8179k5327k2924k0953j9529
62650F24607j8273j6722j5103j4018j3478j2913j2069j1192j0312r104p607o351
62638D77465n561m799l700k476j426n40J49L57P7k44m10q38j787k745l084k839
62622D47599k381j740q71j31J10J01L68J021J827K702L579M127M202M318N033
62607D69864O093O834P209P690Q373Q907R344J0264J1947J4014J6078J8196K0556
62594F15369K3180K6068K9238L2466L5343L7628L9300M0264M0310L9206L6534
$$ y = [2673870, 2701844, 2706559, 2687817, 2646759, 2585604, 2507179, 2414447, 2310263, 2197464, 2079087, 1958340, 1838229, 1721166, 1608914, 1502800, 1403762, 1312138, 1227612, 1149659, 1078084, 1012969, 954121, 900938, 853000, 810461, 773498, 741519, 713340, 688013, 665089, 644136, 624607, 606334, 589612, 574509, 560491, 547013, 534100, 522031, 510839, 500527, 491423, 483816, 477465, 471904, 467105, 463405, 460929, 459503, 458963, 459112, 459469, 459546, 459302, 458892, 458054, 456267, 453522, 450438, 447599, 445218, 443478, 442607, 442476, 442586, 442687, 443055, 444076, 445903, 448605, 452184, 456311, 460513, 464831, 469864, 475957, 482791, 490000, 497690, 506063, 514970, 524314, 534578, 546525, 560539, 576617, 594813, 615369, 638549, 664617, 693855, 726321, 761664, 799292, 838592, 878856, 919166, 958372, 994906]
62583I94906L1773K5093J7841J1380N580p89q134j5401k1492k6386l0435l3403
62571I50533l4887l5240l5315l5494l5375l4338l2114k9004k5816k3378k1875
62560F07697k0703j9106j6785j3986j1275r261q131p397o458n340m506l986l350
62547D77413k583k198k220j831n54Q30J224O40P7K30R24J670K248K662K965L175
62531D84672L274L359L812M970O525P692Q249Q934J0486J2760J5263J8006K1260
62518F09262K4836K8376L2081L6345M0778M4530M7658N1380N6507O2218O6809
62507A100780O9291O9897O9216O7273O3401N6960M8182L8181K7911J7208N350
62496A633650p405j9370k8805l5315l9487m1595m1304l8597l4286k9309k3875
$$ y = [994906, 1026679, 1051772, 1069613, 1080993, 1086573, 1085784, 1077650, 1062249, 1040757, 1014371, 983936, 950533, 915646, 880406, 845091, 809597, 774222, 739884, 707770, 678766, 652950, 629572, 607697, 586994, 567888, 551103, 537117, 525842, 516581, 508450, 501053, 494595, 489255, 484749, 480763, 477413, 474830, 472632, 470412, 468581, 468027, 468857, 470081, 470721, 470798, 471028, 471952, 473622, 475870, 478532, 481497, 484672, 487946, 491305, 495117, 500087, 506612, 514304, 522553, 531487, 541973, 554733, 569996, 588002, 609262, 634098, 662474, 694555, 730900, 771678, 816208, 863866, 915246, 971753, 1033971, 1100780, 1170071, 1239968, 1309184, 1376457, 1439858, 1496818, 1545000, 1583181, 1611092, 1628300, 1633650, 1626245, 1606875, 1578070, 1542755, 1503268, 1461673, 1420369, 1381772, 1347486, 1318177, 1294302]
62485A294302j7586j0253k259N840J3707K1171K7935L3554L7743M0498M1787M1110
62473A527549L7558L0620K1040J0703J338o813j4995k4562l5641m6981n6860o4018
62461A378938o8085o9526o9258o7998o5879o2699n8488n3686m8723m3665l8377
62450G32554l2932k7687k2988j8840j5039j1555q689o640n055l320j320M03J422
62437E80314K005K680L516M196M583M718M390L194J162j078k914m335n793p678
62423E88960r868j1648j2176j1293r830q841q547q368p798o858n764m700l962
62410D79307l828m091m219m043l873l768l323k444j756j801k251k353j891j207
62396D38459n34J64Q70J417J703J743J595J510J896K753L357K969J857J149J576
$$ y = [1294302, 1276716, 1266463, 1264204, 1270044, 1283751, 1304922, 1332857, 1366411, 1404154, 1444652, 1486439, 1527549, 1565107, 1595727, 1616767, 1627470, 1628808, 1621995, 1607000, 1582438, 1546797, 1499816, 1442956, 1378938, 1310853, 1241327, 1172069, 1104071, 1038192, 975493, 917005, 863319, 814596, 770931, 732554, 699622, 671935, 648947, 630107, 615068, 603513, 594824, 588184, 583129, 579809, 578489, 578892, 580314, 582319, 584999, 588515, 592711, 597294, 602012, 606402, 609596, 610758, 609680, 606766, 602431, 596638, 588960, 579092, 567444, 555268, 543975, 534145, 525304, 516757, 508389, 500591, 493733, 487969, 483269, 479307, 475479, 471388, 467169, 463126, 459253, 455485, 452162, 449718, 447962, 446161, 443910, 441557, 439666, 438459, 437925, 438089, 438959, 440376, 442079, 443822, 445417, 446927, 448823, 451576, 454933, 457902, 459759, 460908, 462484]
62381D62484K778L916M627N097N489N723N823O159P113Q483R501R554Q927Q561
62367E54235R123J0402J1778J3112J4912J7545K0566K3033K4693K6572L0087L5547
62355G91605M1773M7326N1738N5369N8438O0656O1544O0563N7049N0617M1786
62344A378464L1860K2070J3001M745k905j0384j7975k5309l1566l6327l9804m2307
62332A243563m3840m4344m3849m2345l9877l6838l3628l0112k6021k2013j9426
62321H61270j8667j8629j8264j7914j8408j9455j9988j9779j9721k0420k1215
62310F48810k0963j9353j7156j5360j4158j2865j0845q455o701n982n648n008
62298E06316m199l626l109k179r50MM99R05J444J909K179K540L259M151M789N067
$$ y = [462484, 465262, 469178, 473805, 478902, 484391, 490114, 495937, 502096, 509209, 517692, 527193, 536747, 545674, 554235, 563358, 573760, 585538, 598650, 613562, 631107, 651673, 674706, 699399, 725971, 756058, 791605, 833378, 880704, 932442, 987811, 1046249, 1106905, 1168449, 1229012, 1286061, 1336678, 1378464, 1410324, 1432394, 1445395, 1450140, 1447235, 1436851, 1418876, 1393567, 1362001, 1325674, 1285870, 1243563, 1199723, 1155379, 1111530, 1069185, 1029308, 992470, 958842, 928730, 902709, 880696, 861270, 842603, 823974, 805710, 787796, 769388, 749933, 729945, 710166, 690445, 670025, 648810, 627847, 608494, 591338, 575978, 561820, 548955, 538110, 529655, 522954, 516972, 511324, 506316, 502117, 498491, 495382, 493203, 492253, 492257, 492756, 493661, 495105, 497014, 499193, 501733, 504992, 509143, 513932, 518999]
62282E18999N373O057O890P271P156P348Q471R934J0643J0590J0867J1929J2904
62269F34432J2970J2529J2364J2542J2903J3813J5473J7113J7967J8616K0269
62258H00991K3017K6008K9155L3378L8961M4770M9582N3287N6301N8516N9233
62247A273199N7703N3420M6362L7237K7217J7189P519j528r735j7321k4872l2681
62235A433709m0446m7667n3828n8288o0624o1138o0440n8472n4675m9282m3694
62224H45155l9139l5579l2253k8743k5123k1561j8280j5559j3366j1317r282p590
62212E87363o399n403m591m601n606o410n592l423j668j329j517q79N17J482J459
62197E43403J227J769L011M064M419M446M760N513O441P350Q238R089R852J0592
$$ y = [518999, 524372, 530429, 537319, 544590, 551746, 559094, 567565, 577499, 588142, 598732, 609599, 621528, 634432, 647402, 659931, 672295, 684837, 697740, 711553, 727026, 744139, 762106, 780722, 800991, 824008, 850016, 879171, 912549, 951510, 996280, 1045862, 1099149, 1155450, 1213966, 1273199, 1330902, 1384322, 1430684, 1467921, 1495138, 1512327, 1519846, 1518318, 1508583, 1491262, 1466390, 1433709, 1393263, 1345596, 1291768, 1233480, 1172856, 1111718, 1051278, 992806, 938131, 888849, 845155, 806016, 770437, 738184, 709441, 684318, 662757, 644477, 628918, 615552, 604235, 594953, 587363, 580964, 575561, 570970, 566369, 560763, 554353, 548761, 545338, 543670, 542341, 540824, 539945, 540462, 541944, 543403, 544630, 546399, 549410, 553474, 557893, 562339, 567099, 572612, 579053, 586403, 594641, 603730, 613582, 624174]
62183F24174J1399J2164J2583J2436J1757J0728R547Q315P029N749M831M716N433
62170G40861O523P738R477J2246J5937K0077K4562K9586L4944L9928M3999M7031
62158A032909M8808M8771M6386M1614L4892K7055J9137J1874N211j288p543j2952
62146A294874j7317k1298k5610l0175l4270l7175l8436l7907l5868l2922k9534
62135I54362k5856k2167j9075j6882j5066j2864j0291q098o752n937n213m747
62123H01414m948n627n946n339m048k593j010R89L312N395O775P255O476L951
62109H06056p4m214o854p373o280m568l115k440k545l184m400o394q630r734q896
62094G27355o888n028l607k102n07O27J318K219L474M452M857N250O127P272Q408
$$ y = [624174, 635573, 647737, 660320, 672756, 684513, 695241, 704788, 713103, 720132, 725881, 730712, 735428, 740861, 747384, 755122, 764599, 776845, 792782, 812859, 837421, 867007, 901951, 941879, 985878, 1032909, 1081717, 1130488, 1176874, 1218488, 1253380, 1280435, 1299572, 1311446, 1316657, 1315369, 1307826, 1294874, 1277557, 1256259, 1230649, 1200474, 1166204, 1129029, 1090593, 1052686, 1016818, 983896, 954362, 928506, 906339, 887264, 870382, 855316, 842452, 832161, 824063, 817311, 811374, 806161, 801414, 796466, 790839, 784893, 779554, 775506, 772913, 771903, 772892, 776204, 781599, 788374, 795629, 802105, 806056, 805982, 801768, 794914, 787541, 781261, 776693, 773578, 771138, 768593, 765409, 761009, 754615, 745985, 736251, 727355, 720467, 715439, 711832, 709730, 709223, 709850, 711168, 713387, 716861, 721313, 726170, 731420, 737547, 744819, 753227]
62079G53227R793J1752J4098J6460J8635K0345K1139K1055K0920K1507K2616K3399
62067I74946K3354K2692K1924K1463K1561K2375K3994K6367K9072L1272L2157
62056A251177L1384K8900K4653J8908J2598O699J276m193r689j4612j8979k3707
62044A304415k9369l5309m0441m4289m6896m8308m8675m8352m7376m5251m1824
62033H28325l7956l4786l2479l0199k7203k3601k0104j7333j5391j3882j2406
62022E62985j0952r705q642p688p084p031p020o209m685l624l846m778n232m725
62008D71764l632k463j499q25k99L46J165J927K535L168L863M320M302L929L432
61993D92033K935K471J943J120P4n82n49o84k059m297n902o320o496p132p699
$$ y = [753227, 763020, 774772, 788870, 805330, 823965, 844310, 865449, 886504, 907424, 928931, 951547, 974946, 998300, 1020992, 1042916, 1064379, 1085940, 1108315, 1132309, 1158676, 1187748, 1219020, 1251177, 1282561, 1311461, 1336114, 1355022, 1367620, 1374319, 1375595, 1371402, 1361713, 1347101, 1328122, 1304415, 1275046, 1239737, 1199296, 1155007, 1108111, 1059803, 1011128, 962776, 915400, 870149, 828325, 790369, 755583, 723104, 692905, 665702, 642101, 621997, 604664, 589273, 575391, 562985, 552033, 542328, 533686, 525998, 518914, 511883, 504863, 498654, 493969, 490345, 486499, 481721, 476489, 471764, 468132, 465669, 464170, 463345, 463046, 463392, 464557, 466484, 469019, 472187, 476050, 480370, 484672, 488601, 492033, 494968, 497439, 499382, 500502, 500576, 499994, 499445, 498761, 496702, 492405, 486503, 480183, 473687, 466555, 458856]
61978D58856p714p696q030q049p140n815m743l697k515k103l096m310m060k575
61964C87313j597j787k067j536o71k57l24n12o53o09k26K57L79J90K77R70K007
61947C81154L067L990M544M567M436M817N878P185Q425R617J0731J1615J2376
61934D72402J3223J3956J4148J3834J3520J3389J3060J2193J0863R316P756O395
61922F14055N260L957K073k82k646m750o439p312p124o302n459m475k774m22J819
61907E79179L605N399P587R778J1239J1588J0930R646Q131O425M205J439j225
61894F67926l221m872o831q956j0460j0997j0852j0250r242q183p461o885o160
61881E63556n732o227p192p588p521q174r758j0913j0595r391q302p296n902m269
$$ y = [458856, 451142, 443446, 435416, 427367, 420227, 414412, 409669, 405972, 403457, 401354, 398258, 393948, 389888, 387313, 385716, 383929, 381862, 380326, 379655, 379398, 379074, 378562, 377909, 377300, 377074, 377331, 377710, 377900, 378177, 379147, 381154, 384221, 388211, 392755, 397322, 401758, 406575, 412453, 419638, 428063, 437680, 448411, 460026, 472402, 485625, 499581, 513729, 527563, 541083, 554472, 567532, 579725, 590588, 599904, 607660, 614055, 619315, 623272, 625345, 625063, 622417, 617667, 611228, 603916, 596792, 590490, 585031, 580556, 577782, 577360, 579179, 582784, 588183, 595770, 605548, 616787, 628375, 639305, 648951, 657082, 663507, 667712, 669151, 667926, 664705, 659833, 653002, 644046, 633586, 622589, 611737, 601487, 592245, 584062, 576601, 569716, 563556, 557824, 551597, 544405, 536817, 529296, 521122, 511364, 500451, 489856, 480465, 472163, 464867, 458965, 454696]
61867D54696k844j674p59m48p07o45M18J982L216M231N656P438Q954J0052J1155
61852E00721J2509J4076J5947J8164K0216K1475K2001K2338K2585K2330K1398
61841G13760K0020J8181J5477J1811P684L678m8l531o598q906j0193j0502j0184
61828G40649r612q654o621l061J464N744R024J1338J2762J2893J1322Q375M970
61815G90593J794j235m623q567j2575j5824j7848j8808j9122j8978j8298j7152
61803F39357j5918j4960j4207j3273j2010j0766r919r316q477p336o375n941n757
61790E05102n409m940m629m447m147l716l340l024k608k159k000k312k967l591
61776D55813l685k963j848j240j408j606j285j077j688k345j625L17J700J566
$$ y = [454696, 451852, 450178, 449419, 448971, 448264, 447619, 448037, 450019, 453235, 457466, 463122, 470560, 479514, 489566, 500721, 513230, 527306, 543253, 561417, 581633, 603108, 625109, 647447, 670032, 692362, 713760, 733780, 751961, 767438, 779249, 786933, 790611, 790563, 787032, 780434, 771528, 761335, 750833, 740649, 731037, 722383, 715762, 712701, 714165, 719909, 728933, 740271, 753033, 765926, 777248, 785623, 790593, 792387, 791152, 786529, 777962, 765387, 749563, 731715, 712907, 693785, 674807, 656509, 639357, 623439, 608479, 594272, 580999, 568989, 558223, 548304, 538988, 530511, 523175, 516800, 510859, 505102, 499693, 494753, 490124, 485677, 481530, 477814, 474474, 471450, 468842, 466683, 464683, 462371, 459404, 455813, 452128, 449165, 447317, 446077, 444669, 443063, 441778, 440701, 439013, 436668, 435043, 435360, 437060, 438626]
61762D38626R95J313K298K974L229L642M281M636M516M121L491K550J568R23M97
61747D79660j11r60j799k608l481m095l913l033k304k335k771k737j899q27l34
61732D46453n61q55n88N2M08L29L16O85J146J439J808K396K740K424J866J796
61716D61854K189K443K429K648L193L318K397P86o46j510k006k320k471k670l268
61701D66366m093m378l708k793k706l449l886l270k266k004k658l460l824l786
61687D20085l540l175k891k928l225l497l606l445k731j460m60o43j779k699k784
61672C81222k484k227j767r41k34j25m79r85j578k013j768q65j18K5K39J231K545
61655C69678L235L242L227L393L305K787K176J743J465J351J415J424J157Q40
$$ y = [438626, 439621, 440934, 443232, 446206, 449435, 453077, 457358, 461994, 466510, 470631, 474122, 476672, 478240, 479163, 479660, 479549, 478589, 476790, 474182, 470701, 466606, 462693, 459660, 457356, 455021, 452250, 449513, 447614, 446787, 446453, 445892, 445037, 444449, 444501, 444909, 445238, 445554, 446239, 447385, 448824, 450632, 453028, 455768, 458192, 460058, 461854, 464043, 466486, 468915, 471563, 474756, 478074, 480471, 481257, 480611, 479101, 477095, 474775, 472304, 469634, 466366, 462273, 457895, 454187, 451394, 448688, 445239, 441353, 438083, 435817, 433813, 431155, 427695, 423871, 420085, 416545, 413370, 410479, 407551, 404326, 400829, 397223, 393778, 391047, 389587, 389127, 388484, 386705, 384006, 381222, 378738, 376511, 374744, 373803, 373569, 373444, 372965, 371980, 370402, 368389, 366621, 365756, 365638, 365663, 365902, 367133, 369678, 372913, 376155, 379382, 382775, 386080, 388867, 391043, 392786, 394251, 395602, 397017, 398441, 399598, 400438]
61641D00438Q74J214J504J655J807J823J465R02M71K7q68k022k584k092j071l18
61625D03225r2k24o91j576k654l353l264k506j580r01o04o60r32j108q99o13j132
61608C80436k808m683n443n039m602m774n076n024m888m796m168k715j296q91
61594C24233j391k099k852l733m256l875k948k268j896j396r54j202j974k359
61580B91030k061j770j964k241k089j557q79j29N53R49J196J601J899J424K24
61565B86186o84n46K53R20J235J399J374J012N41M43Q78J540K004K072J855J598
61549C02080J387J056N20N0m4J62M32P91J314J686J570J309J568K217K340J550
61533C19988O39M71Q39R00L88j69k68o1q8o15j358j814j787j490j114n88L8L83
$$ y = [400438, 401312, 402526, 404030, 405685, 407492, 409315, 410780, 411682, 412153, 412180, 411312, 409290, 406706, 404614, 403543, 403225, 403133, 402909, 402218, 400642, 397988, 394635, 391371, 388865, 387285, 386384, 385780, 385120, 384188, 383080, 382181, 381568, 380436, 377628, 372945, 367502, 362463, 357861, 353087, 348011, 342987, 338099, 333303, 329135, 326420, 325124, 324233, 322842, 320743, 317891, 314158, 309902, 306027, 303079, 300811, 298915, 297519, 296565, 295363, 293389, 291030, 288969, 287199, 285235, 282994, 280905, 279348, 278469, 278340, 278893, 279842, 281038, 282639, 284538, 285962, 286186, 285502, 284956, 285209, 286129, 287364, 288763, 290137, 291149, 291690, 292133, 293011, 294551, 296555, 298627, 300482, 302080, 303467, 304523, 305043, 305093, 305049, 305211, 305643, 306434, 307748, 309434, 311004, 312313, 313881, 316098, 318438, 319988, 320627, 321098, 321937, 322837, 323225, 323056, 322788, 322727, 322639, 322024, 320666, 318852, 317065, 315575, 314461, 313873, 313911, 314294]
61515C14294K74J04J96J48n16j319j321m78K93M36K54K5m30j022j180p53l42k99
61497C08364j74L78R20J039J060J276J226N57p6J01O80P11K68K43P40Q58J92m49
61479C17914j67R30K178L172L766L826L454L102L045K985K447J419L32l64n28
61464C47511m09m43p65q96l89K73J3j347k622k694j867j136o84lQ20J031N22J70
61446C37085N38J084J177J071J173J090L28m99l39O47J204Q29L88O06J018J055
61430C48455J118J711K197J556J5j134j212p44l44N9O79J345J903K501L059K985
61414C64149K006Q08L01M40L84k29p95o99k47k53r05j526j471r07m30k48q9J96
61396C60485M02L67K19Q2r8k57j36K37M22K09N1M06R72J141R83J150J810K338
$$ y = [314294, 314568, 314672, 314868, 315016, 314500, 313181, 311860, 311382, 311675, 312111, 312365, 312390, 311960, 310938, 309758, 309005, 308663, 308364, 308190, 308568, 309488, 310527, 311587, 312863, 314089, 314646, 314570, 314671, 315351, 316062, 316330, 316573, 317313, 318171, 318363, 317914, 317747, 318677, 320855, 324027, 327793, 331619, 335073, 338175, 341220, 344205, 346652, 348071, 348403, 348039, 347511, 347102, 346659, 345894, 344998, 344609, 344882, 344895, 343548, 340926, 338232, 336365, 335229, 334545, 334542, 335362, 336393, 336915, 337085, 337623, 338707, 339884, 340955, 342128, 343218, 343546, 343047, 342708, 343355, 344559, 345388, 345776, 346382, 347400, 348455, 349573, 351284, 353481, 355037, 355052, 353918, 352706, 351962, 351618, 351677, 352356, 353701, 355604, 358105, 361164, 364149, 366155, 366963, 367264, 367704, 368088, 367859, 367064, 366365, 366118, 365865, 364960, 363434, 361963, 361056, 360626, 360378, 360289, 360485, 360887, 361254, 361473, 361555, 361457, 361200, 361064, 361301, 361723, 361932, 361983, 362389, 363361, 364502, 365485, 366635, 368445, 370783]
61378C70783K217J684J252J012P15L22J27M45J334K496L425L731L463K997K604
61363C98607K267J890J587J607K038K607K811K366J610J267J725K695L656M424
61349D31157N141N897O555O843O496N505M310L466L004K524J943J654J736J594
61335D87825Q65O9k14l09q59j689k039j670j081p57r44j807l118l992l772k947
61319D63561k327j666j78J761K811K696K733L900N604O928P927Q970R789J0117
61305E22626J0516J1614J3049J4014J4352J4241J3327J1106P962M906K376Q1k078
61292F38092l697m588n121n706o341o858p220p534p986q699r398r396q347o841
61278E40360n840n476m972l743k124q07lN50J045J420J632J805J987K017J779
$$ y = [370783, 373000, 374684, 375936, 376948, 377663, 377985, 378112, 378557, 379891, 382387, 385812, 389543, 393006, 396003, 398607, 400874, 402764, 404351, 405958, 407996, 410603, 413414, 415780, 417390, 418657, 420382, 423077, 426733, 431157, 436298, 442195, 448750, 455593, 462089, 467594, 471904, 475370, 478374, 480898, 482841, 484495, 486231, 487825, 488690, 488759, 488545, 488236, 487377, 485688, 483649, 481979, 480898, 480141, 479197, 477390, 474272, 470280, 466508, 463561, 461234, 459568, 459390, 461151, 463962, 466658, 469391, 473291, 478895, 485823, 493750, 502720, 512509, 522626, 533142, 544756, 557805, 571819, 586171, 600412, 613739, 624845, 632807, 637713, 640089, 640170, 638092, 634395, 629807, 624686, 618980, 612639, 605781, 598561, 591027, 583041, 574342, 564944, 555548, 547201, 540360, 534520, 529044, 524072, 520329, 518205, 517398, 517395, 517945, 518990, 520410, 522042, 523847, 525834, 527851, 529630]
61263E29630J550J855K894M284N487O290O744O872O659O188N422M069K132L99
61249E90475k28J38N03L18j8j91o21j603k488k462j796j544k139k956l283l128
61233E68977k906k784k544j866o50Q31K007K465K421K588L470M860O034O462O225
61218E95590N816N626N805O426P480Q604R128Q717P694O475N016L268J856J573
61204F79074K250K844K770K543K904L919N243O687Q139R395J0524J1976J3769
61191G62037J4886J4111J1455Q263N862M438L287J880L80p81j571k359l302m098
61177H14488m516m873n650o830p968q761r143r013q403p760p553p660p677p663
61163G11018q052q881r810j0764j1785j2342j1735j0250r000q365p561o072m483
$$ y = [529630, 531180, 533035, 535929, 540213, 545700, 551990, 558734, 565606, 572265, 578453, 583875, 587944, 590076, 590475, 590247, 590385, 590888, 591206, 591188, 590997, 590376, 588773, 586285, 583823, 582027, 580483, 578344, 575388, 572105, 568977, 566071, 563287, 560743, 558877, 558227, 559058, 561065, 563530, 565951, 568539, 572009, 576869, 582903, 589365, 595590, 601406, 607032, 612837, 619263, 626743, 635347, 644475, 653192, 660886, 667361, 672377, 675645, 677501, 679074, 681324, 684168, 686938, 689481, 692385, 696304, 701547, 708234, 716373, 725768, 736292, 748268, 762037, 776923, 791034, 802489, 810752, 816614, 821052, 824339, 826219, 826599, 825818, 824247, 821888, 818586, 814488, 809972, 805099, 799449, 792619, 784651, 775890, 766747, 757734, 749331, 741571, 734018, 726358, 718681, 711018, 702966, 694085, 684275, 673511, 661726, 649384, 637649, 627399, 618399, 610034, 602473, 596401, 591918]
61150E91918l370k346r07N41J275J226O13o73k560m238n039n422o152o897o644
61135E51325n310l892k976k055o01R63J867K149K688M128O132P794Q714R385J0468
61120E90779J2008J3687J5526J7656J9615K0666K0950K1414K2428K3267K3355
61109H01351K3115K3085K2987K2297K1132J9872J8505J6904J5212J3373J0844
61098A008677P413L695K37l181o636r339j0798j2007j4256j7162j9107j9431j8977
61085H89128j8542j8020j7232j6544j6156j5637j4570j3205j2054j1190j0204
61074G25774q696o703m700l101j786m01Q87J518J665K387M193O158P150P339P692
61059G39376Q569R669J0893J2291J3503J4235J4999J6473J8321J9606K0276K1229
$$ y = [591918, 588548, 586202, 585295, 585836, 587111, 588337, 588950, 588277, 585717, 581479, 576440, 571018, 564866, 557969, 551325, 546015, 542123, 539147, 537092, 536491, 537454, 539321, 541470, 544158, 548286, 554418, 562212, 570926, 580311, 590779, 602787, 616474, 632000, 649656, 669271, 689937, 710887, 732301, 754729, 777996, 801351, 824466, 847551, 870538, 892835, 913967, 933839, 952344, 969248, 984460, 997833, 1008677, 1016090, 1019785, 1020022, 1016841, 1010205, 1000866, 990068, 978061, 963805, 946643, 927536, 908105, 889128, 870586, 852566, 835334, 818790, 802634, 786997, 772427, 759222, 747168, 735978, 725774, 717078, 710375, 705675, 702574, 700788, 700387, 701274, 702792, 704457, 706844, 711037, 717195, 724345, 731684, 739376, 747945, 757614, 768507, 780798, 794301, 808536, 823535, 840008, 858329, 877935, 898211, 919440]
61047I19440K3045K5389K7697K9673L1185L2378L3785L5643L7317L8073L8245
61036A271870L8805M0020M1353M2550M3943M5702M7518M8998M9925N0305N0721
61025A771710N2052N4140N5326N4244N1560M9086M7824M8011N0287N5291O2444
61014B351975P0638P9680Q9759J00110J10118J21513J37689J61059J92805K34678
61004C650024K88533L54316M31509N23140O35785P75501R47596J161351J428439
60995A0196194J747178K081969K354981K459685K297368J830735J130984L77258
60987B4476352k13616m91568m38224j52238K12477M96367N57582L02899k60227
60978B4489804r96176j691376k164297k350339k298861k105319j850156j582712
$$ y = [919440, 942485, 967874, 995571, 1025244, 1056429, 1088807, 1122592, 1158235, 1195552, 1233625, 1271870, 1310675, 1350695, 1392048, 1434598, 1478541, 1524243, 1571761, 1620759, 1670684, 1720989, 1771710, 1823762, 1877902, 1933228, 1987472, 2039032, 2088118, 2135942, 2183953, 2234240, 2289531, 2351975, 2422613, 2502293, 2592052, 2692162, 2802280, 2923793, 3061482, 3222541, 3415346, 3650024, 3938557, 4292873, 4724382, 5247522, 5883307, 6658808, 7606404, 8767755, 10196194, 11943372, 14025341, 16380322, 18840007, 21137375, 22968110, 24099094, 24476352, 24262736, 23771168, 23332944, 23180706, 23393183, 23889550, 24447132, 24750031, 24489804, 23493628, 21802252, 19637955, 17287616, 14988755, 12883436, 11033280, 9450568]
60970I450568j331596j111768r25481p67685o34239n23689m33634l60133l00701
60961C061642k54594k19860j92691j70106j51157j35255j21241j08441r6978q6525
60951A524794p6210o6047n7099m9931m4131l9594l6998l6550l7285l8026l8160
60940A004763l7309l5189l2214k9343k7063k5147k3486k2289k1347k0036j8289
60929G13051j6709j5519j4259j2775j1576j0909j0272r267q154p246o436n701
60917E84228n346n320n049m383l962m147m207l340j921r99q77r49p60m87m02l82
60901E41697k37o4j65o23j117j191p91n42j205k758m228m635l958l009k509k569
60885E12096k997l772n033o627p963q441q047p367o949o782o517o008n468n087
$$ y = [9450568, 8118972, 7007204, 6081723, 5314038, 4679799, 4156110, 3722476, 3362343, 3061642, 2807048, 2587188, 2394497, 2224391, 2073234, 1937979, 1816738, 1708297, 1611319, 1524794, 1448584, 1382537, 1325438, 1275507, 1231376, 1191782, 1154784, 1118234, 1080949, 1042923, 1004763, 967454, 932265, 900051, 870708, 843645, 818498, 795012, 772723, 751376, 731340, 713051, 696342, 680823, 666564, 653789, 642213, 631304, 621032, 611765, 603611, 596365, 589929, 584228, 578882, 573562, 568513, 564130, 560168, 556021, 551814, 548474, 546553, 545554, 544677, 543728, 542968, 542481, 542079, 541697, 541460, 541396, 541231, 540608, 539491, 538300, 537509, 536967, 535762, 533004, 528776, 524141, 520183, 517174, 514665, 512096, 509099, 505327, 500294, 493667, 485704, 477263, 469216, 461849, 454900, 448118, 441601, 435593, 430125, 425038]
60871D25038m736m108l108k076j501j444j356o88M03J311J892K618L704M642M919
60856D25510M794M814M970M775M111L359K873K752L073L839M602M672L914K936
60842D80994K301J779P16r77k559l283l274l316l814m407m714m971n415n469m428
60827D39163k863k297l182m098l623k212j433j879k776l382l764m131m241l809
60813C95473l017k348k170k540l211l785m046m147m314m488m469m174l595k668
60799C46501j549p05m45n71p55r92j321j409r92m21k88o00q51p44l42L23J232
60782C36071K011K200J897J631J609J623J697K163K939L290K731J754J298J669
60768C64583K295K485K170J846J863J964J648Q73Q8m46q98j356j530j317j150
$$ y = [425038, 420302, 416194, 413086, 411010, 409509, 408065, 406709, 406021, 406424, 407735, 409627, 412245, 415949, 420591, 425510, 430304, 435118, 440088, 444863, 448974, 452333, 455206, 457958, 461031, 464870, 469472, 474144, 478058, 480994, 483295, 485074, 485790, 484813, 482254, 478971, 475697, 472381, 468567, 464160, 459446, 454475, 449060, 443591, 439163, 436300, 434003, 430821, 426723, 423100, 420888, 419455, 417576, 414800, 411418, 407654, 403523, 399282, 395473, 392456, 390108, 387938, 385398, 382187, 378402, 374356, 370209, 365895, 361407, 356938, 352764, 349169, 346501, 344952, 344247, 343802, 343231, 342476, 341484, 340163, 338754, 337762, 337341, 337053, 336453, 335602, 334858, 334516, 334839, 336071, 338082, 340282, 342179, 343810, 345419, 347042, 348739, 350902, 353841, 357131, 359862, 361616, 362914, 364583, 366878, 369363, 371533, 373379, 375242, 377206, 378854, 379727, 379815, 379369, 378471, 377115, 375585, 374268, 373118]
60753C73118j431j976k414k723k905k624j759r04o08n30m0O13P02K31k16p47k055
60736C53732l928n085m859m076l648l276k328j241j050j864k684k737k215j634
60722C13107j104m47K95Q12Q84O27L51K62L39N16Q27J264J603J641J532J634K026
60705C26169K408K497K337K153K149K388K686K646K110J479J344J711J942J524
60691C55543O60l6j99N4L15J92l95j043j118l95O00J031O43J04K77J159J822J585
60673C60799R13Q03J464K190K332J839P55r38k774l845l814l356l135k992k624
60658C47617k315k353k315j767j122r79r71l13Q01J448J469J722K666L643L818
60643C51049L102J927O98k66p90j025j279j638k060k615l189l230k422j354q51
$$ y = [373118, 371687, 369711, 367297, 364574, 361669, 359045, 357286, 356382, 355774, 355244, 355204, 355817, 356519, 356750, 356534, 355787, 353732, 349804, 344719, 339860, 335784, 332136, 328860, 326532, 325291, 324241, 322377, 319693, 316956, 314741, 313107, 312003, 311556, 311851, 312663, 313547, 314174, 314525, 314787, 315126, 315642, 316469, 317733, 319336, 320977, 322509, 324143, 326169, 328577, 331074, 333411, 335564, 337713, 340101, 342787, 345433, 347543, 349022, 350366, 352077, 354019, 355543, 356203, 356167, 355968, 356022, 356337, 356529, 356134, 355091, 353973, 353578, 354178, 355209, 355852, 355956, 356233, 357392, 359214, 360799, 361712, 362515, 363979, 366169, 368501, 370340, 371095, 370157, 367383, 363538, 359724, 356368, 353233, 350241, 347617, 345302, 342949, 340634, 338867, 337745, 336766, 335795, 335482, 336283, 337731, 339200, 340922, 343588, 347231, 351049, 354151, 356078, 356776, 356510, 355720, 354695, 353416, 351778, 349718, 347103, 343914, 340684, 338262, 336908, 336057]
60628C36057q56p78o19p47q14l8J362K204K027J617J539J331O15o7k11k15n89
60611C41818j010r61o58n92o65m29J52P66J257J563J558J276J013Q16M17n6J30
60594C46395J304K732L499L531L239K710J993J586J877K350K100J074M2n10q04
60579C73118j123j315j168p56k33M50J423K544L390L753M118N370P717J0160J1561
60564D19009J2038J2619J3575J3930J2844J0609P968N188K361j57k206m159o173
60551D97446p654q022p533o655n240l016m82J564L039M360N537O342P144Q661
60537D95491J0885J3016J4578J5938J7611J9574K1305K2009K0882J7726J3305
60526F82320Q611L863j212o195r902j1643j1906j1568j0988j0199r468r113q989
$$ y = [336057, 335201, 334423, 333804, 333057, 332243, 332205, 333567, 335771, 337798, 339415, 340954, 342285, 342900, 342833, 342622, 342407, 341818, 340808, 339847, 339189, 338597, 337932, 337503, 337655, 338421, 339678, 341241, 342799, 344075, 345088, 345904, 346321, 346265, 346395, 347699, 350431, 353930, 357461, 360700, 363410, 365403, 366989, 368866, 371216, 373316, 374390, 374432, 373922, 373118, 371995, 370680, 369512, 368756, 368523, 368973, 370396, 372940, 376330, 380083, 384201, 389571, 397288, 407448, 419009, 431047, 443666, 457241, 471171, 484015, 494624, 502592, 507780, 510141, 509984, 507778, 503619, 497446, 489792, 481770, 474237, 467582, 462342, 459326, 458844, 460408, 463447, 467807, 473344, 479686, 486830, 495491, 506376, 519392, 533970, 549908, 567519, 587093, 608398, 630407, 651289, 669015, 682320, 690931, 694794, 693582, 687387, 677485, 665842, 653936, 642368, 631380, 621181, 611713, 602600, 593611]
60513E93611q503p196n238l375k337k087j752n58J343L243M975P135J0151J3691
60499F03103J7196K0634K4402K8697L3294L7848M2126M5823M8424M9370M8512
60488I99429M6225M2997L8967L4044K8335K2100J5288P531j198j0405j9719k9244
60476A174350l8834m7398n3512n6593n7056n5565n2628m8738m4331l9564l4631
60465F45500l0218k7001k4658k2012j8493j4961j2703j1904j1537j0642r287q169
60453D43915p579p011n839m184k861k464k723k976k995l023l134k947k137r79
60439C93063j61r9n73j035j254j477j921k297k140j511r54p37o09l57j93k36k12
60422C77297l4j76r50j712j545n01M91R51J348K135K941L061K376J433P95O00
$$ y = [593611, 585108, 577912, 572674, 569299, 566962, 564875, 563123, 562565, 563908, 567151, 572126, 579261, 589412, 603103, 620299, 640933, 665335, 694032, 727326, 765174, 807300, 853123, 901547, 950917, 999429, 1045654, 1088651, 1127618, 1161662, 1189997, 1212097, 1227385, 1234916, 1233718, 1223313, 1203594, 1174350, 1135516, 1088118, 1034606, 978013, 920957, 865392, 812764, 764026, 719695, 680131, 645500, 615282, 588281, 563623, 541611, 523118, 508157, 495454, 483550, 472013, 461371, 452084, 443915, 436336, 429325, 423486, 419302, 416441, 413977, 411254, 408278, 405283, 402260, 399126, 396179, 394042, 393063, 392902, 392803, 392230, 391195, 389941, 388464, 386543, 384246, 382106, 380595, 379641, 378904, 378295, 377938, 377745, 377509, 377297, 377263, 377087, 376137, 374425, 372880, 372379, 372870, 373821, 375169, 377304, 380245, 383306, 385682, 387115, 387910, 388510]
60406C88510O75Q76J280J991K782L186L051K725K426J840Q43K77J148L074M392
60391D19076M089K923K212K213K324K313K506K972L327L410L455L483L123K364
60377D59790J891K294L220L784L617L115K769K675K654K529K193J675J134O16
60363D93956j16j131j889j650m00J145K490L748M922N497N297N141N959P602R162
60348E39733J0221J0994J1447J1063R596P380M732J659j675m722p034q618r603
60335E75173r994r840r308q533p665p051o900o828o257n234m314l730l320l224
60321D82975l715m292l959k720j769j707j535j41K058L848M931O040P764J0071
60307D97849J2707J5292J7208J8105J8286J8138J7526J6278J4755J3203J0959
$$ y = [388510, 389185, 390061, 391341, 393332, 396114, 399300, 402351, 405076, 407502, 409342, 410185, 410462, 411610, 414684, 419076, 423165, 426088, 428300, 430513, 432837, 435150, 437656, 440628, 443955, 447365, 450820, 454303, 457426, 459790, 461681, 463975, 467195, 470979, 474596, 477711, 480480, 483155, 485809, 488338, 490531, 492206, 493340, 493956, 493840, 492709, 490820, 489170, 488770, 489915, 492405, 496153, 501075, 506572, 511869, 517010, 522969, 530571, 539733, 549954, 560948, 572395, 583458, 593054, 600434, 605166, 606825, 605150, 600428, 593394, 584776, 575173, 565179, 555339, 546031, 537498, 529833, 522782, 515882, 509054, 502797, 497563, 493249, 489519, 486199, 482975, 479260, 474968, 471009, 468289, 466520, 464813, 463278, 463137, 465195, 469043, 473974, 480014, 487778, 497849, 510556, 525848, 543056, 561161, 579447, 597585, 615111, 631389, 646144, 659347, 670306]
60296F70306P158K039l298q209j2815j7042k0211k1665k1283j9431j6859j4478
60284E24212j2621j0736q353n987m378l303k093j086j208k238k802k411k199l062
60270D61735m213m399l627k758k136j650j627k533l877m411l628k341j585j510
60256D21440j577j383r15l45J31L38K68J33R7J22J80N39J492K768L552L309K411
60239D32560J626J157N59l58j072j025m02J30K38J99M03R38J653K345K821K924
60223D44696K652K224K013K250K738K999K857K788L366M531N686O413O746O788
60209D98747O643O701P392Q497R244R287R027Q768Q245P295O382N978N940N909
60195F04055N814N550M756L457K371J984J795J146K76j46j45l58j106k253l656
$$ y = [670306, 677464, 679503, 676205, 667996, 655181, 638139, 617928, 596263, 574980, 555549, 538690, 524212, 511591, 500855, 492502, 486515, 482137, 478834, 476741, 475655, 474447, 472209, 469407, 466996, 464797, 461735, 457522, 453123, 449496, 446738, 444602, 442952, 441325, 438792, 434915, 430504, 426876, 424535, 422950, 421440, 419863, 418480, 417565, 417220, 417351, 417689, 417957, 418090, 418187, 418309, 418489, 419028, 420520, 423288, 426840, 430149, 432560, 434186, 435343, 435902, 435544, 434472, 433447, 433045, 433175, 433413, 433612, 434015, 434953, 436606, 438951, 441772, 444696, 447348, 449572, 451585, 453835, 456573, 459572, 462429, 465217, 468583, 473114, 478800, 485213, 491959, 498747, 505390, 512091, 519483, 527980, 537224, 546511, 555538, 564306, 572551, 579846, 586228, 592206, 598146, 604055, 609869, 615419, 620175, 623632, 626003, 627987, 629782, 630928, 631204, 631058, 630913, 630555, 629449, 627196, 623540]
60180F23540n133o224o604o530o320n854n069m476m408m295l514k517k138k249
60166E58209k176k087k701l744l999k992j568o23k56k94o27p97k28Q42J497J396
60150E39852J049P80M01N4K69Q62Q80J40k80L60J344J766J936K672L837M616M794
60133E65332M931N450O233O986P452P362O607N372L901K378J123N18M77M46J68
60118F24736N9N36J396K105K354K115J595J358J964L137L743K957J112q50k372
60103F45945l451m239m831n200n193m806m492m678n037m820l964l152k678k113
60089E87291j240m71L4O96J486J534L95j062j773j729j396o97N10J591J813J395
60073E88377R29J70j514l835n757o910p788q628r069q938q476p678o331m846m161
$$ y = [623540, 618407, 612183, 605579, 599049, 592729, 586875, 581806, 577330, 572922, 568627, 565113, 562596, 560458, 558209, 556033, 553946, 551245, 547501, 543502, 540510, 538942, 538319, 538063, 537769, 537142, 536345, 536117, 536959, 538456, 539852, 540901, 541681, 542082, 542136, 542405, 543267, 544147, 544287, 544007, 544367, 545711, 547477, 549413, 552085, 555922, 560538, 565332, 570263, 575713, 581946, 588932, 596384, 603746, 610353, 615725, 619626, 622004, 623127, 623645, 624122, 624568, 624736, 624795, 625331, 626727, 628832, 631186, 633301, 634896, 636254, 638218, 641355, 645098, 648055, 649167, 648317, 645945, 642494, 638255, 633424, 628224, 623031, 618225, 613733, 609055, 604018, 599198, 595234, 592082, 589404, 587291, 586051, 585580, 585614, 586310, 587796, 589330, 589725, 588663, 586890, 585161, 583765, 583068, 583578, 585169, 586982, 588377, 589306, 589476, 587962, 584127, 578370, 571460, 563672, 555044, 545975, 537037, 528561, 520883, 514552, 509706, 505545]
60058E05545m495m948m731m086l583l223k762k379k270j991r15P20J868J996J801
60043D76547K362L845N475O619P358P890P862O879N415M524M480M316L112J229
60029E47913j93o71p45j062j716k528l457m495n458o139o566o977p555q223q613
60014D83515q328p378o355n898n946n761m836l541k663k420k348k112j950k085
60000D21894k145j685j028q65j084p68L85J497J780J645J874K326K363K139K397
59985D30725L159L621L438L175L269L402L182K738K189J251k22j767k841l366
59971D51953l439k943j890q19l48n50j019j364j338p54M10J806K895L296L086
59956D48982K723K618K653K314J464N80l0p65j873k594k018n13N77N91J3n88j090
$$ y = [505545, 501050, 496102, 491371, 487285, 483702, 480479, 477717, 475338, 473068, 471077, 470162, 470882, 472750, 474746, 476547, 478909, 482754, 488229, 494848, 502206, 510096, 517958, 524837, 530252, 534776, 539256, 543572, 546684, 547913, 547720, 547049, 546304, 545242, 543526, 540998, 537541, 533046, 527588, 521449, 514883, 507906, 500351, 492128, 483515, 475187, 467809, 461454, 455556, 449610, 443849, 439013, 435472, 432809, 430389, 428041, 425929, 423979, 421894, 419749, 418064, 417036, 416171, 415087, 414319, 414704, 416201, 417981, 419626, 421500, 423826, 426189, 428328, 430725, 433884, 437505, 440943, 444118, 447387, 450789, 453971, 456709, 458898, 460149, 459927, 458160, 455319, 451953, 448514, 445571, 443681, 442862, 442514, 441964, 440945, 439581, 438243, 437489, 437899, 439705, 442600, 445896, 448982, 451705, 454323, 456976, 459290, 460754, 461334, 461304, 460539, 458666, 456072, 454054, 453541, 454118, 454709, 454722, 454134, 453044]
59939D53044j304j003o21r27j813k302j990j439r24K0J396K242K073J834K602
59924D50888M104N274N655N502N061M386L537K482J198O2m34m84p02r04j83J454
59908D86896K767L089L244L943M509M211L599L404L073J794J43o44m47p4J84N42
59892E20233Q15P73J048K372M209N334N545N691O202O725P050P311P392P156P073
59877E94929P598Q162P858O877O106N509M218K207N29k68p60j444k012k216k493
59862F34800l199m029m528m645m546m404m399m452m082l107k231k153k295j424
59848E85306O04K749M375N861P486Q752R057Q192O010K662p45k635k561j430J9
59833F33702J875L918M911L839J127j948m512o258p007o746n843m776l900l548
$$ y = [453044, 451740, 450737, 450116, 449189, 447376, 445074, 443084, 441645, 440721, 440741, 442137, 444379, 446452, 448286, 450888, 454992, 460266, 465921, 471423, 476484, 480870, 484407, 486889, 488087, 488149, 487715, 487231, 486529, 485625, 485442, 486896, 489663, 492752, 495996, 499939, 504448, 508659, 512258, 515662, 518735, 520529, 520672, 520028, 519581, 519507, 519691, 520233, 521048, 521821, 522869, 525241, 529450, 534784, 540329, 546020, 552222, 558947, 565997, 573308, 580700, 587856, 594929, 602527, 610689, 618547, 625424, 631530, 637039, 641257, 643464, 643993, 643725, 642965, 641521, 639509, 637293, 634800, 631601, 627572, 623044, 618399, 613853, 609449, 605050, 600598, 596516, 593409, 591178, 589025, 586730, 585306, 585910, 588659, 593034, 598895, 606381, 615133, 624190, 632382, 638392, 641054, 640309, 637674, 635113, 633683, 633702, 635577, 639495, 644406, 648245, 649372, 647424, 642912, 636654, 629647, 622901, 617058, 612282, 608382, 604834]
59819F04834l958m876n735o339o913p412p328o385m892l331k116j747k506l831
59805E37465m665m654m308l977l416k613k203k548l092l099k572j960j427q10
59791D96121n9N78O62j06j321j825q65P83J623J353J104J645K342K287J555P82
59775E06659K03k51m57l38r6J82Q22J943L016L465L415L417L714M143M445M394
59759E38676L884L178K786K949L521M399N598O886P830Q408Q992R607R839R672
59745F26225R641R855R621Q538P269O558O100N099L619K546K336K463K131J114
59731G03115j76j147j497j400j215j011n97rL32J25m59j029j371j484j555j976
59715F88646l002m283n038m859m098l346k878k690k708k752k590k147j553r37
$$ y = [604834, 600876, 596000, 590265, 583926, 577013, 569601, 562273, 555888, 550996, 547665, 545549, 543802, 541296, 537465, 532800, 528146, 523838, 519861, 516445, 513832, 511629, 509081, 505989, 502890, 500318, 498358, 496931, 496121, 496062, 496640, 497302, 497196, 495875, 494050, 493185, 493968, 495591, 496944, 498048, 499693, 502035, 504322, 505877, 506659, 506862, 506611, 506154, 505816, 505720, 505902, 506724, 508667, 511683, 515148, 518563, 521980, 525694, 529837, 534282, 538676, 542560, 545738, 548524, 551473, 554994, 559393, 564991, 571877, 579707, 588115, 597107, 606714, 616553, 626225, 635866, 645721, 655342, 663880, 671149, 677707, 683807, 688906, 692525, 695071, 697407, 699870, 702001, 703115, 702939, 701792, 700295, 698895, 697680, 696669, 696072, 696063, 696395, 696520, 696061, 695032, 693661, 692177, 690622, 688646, 685644, 681361, 676323, 671464, 667366, 664020, 661142, 658452, 655744, 652992, 650402, 648255, 646702, 645765]
59701F45765l88j2K56P55J641K501K884K993L309L756L880L692L540L201K038
59686F79811R3j825l285m560n607n727m717l544l233l718m324m830n498o417p318
59671F15301p850p767p118o346n889n598n019m220l703l465k944k054j415j281
59657E50632r90N1J505K697L467M004M347M442M262L661K625J750J730K129J549
59642E87861n45l029m558n065n285n571n781n783n458m687l735l090k671j914
59628E30689r35o98j509k406k652k836l629m404m206l344k880l046l295l521m026
59613D87302m604m689m318l971l596k657j109M81J700K477K637K051J196Q06R64
59598D74670J154J056P89M42O4k9M16R93J061P22O81J158J579J460R92N61K13
$$ y = [645765, 645377, 645365, 645621, 646376, 648017, 650518, 653402, 656395, 659704, 663460, 667340, 671032, 674572, 677773, 679811, 679904, 678079, 674794, 670234, 664627, 658900, 654183, 650639, 647406, 643688, 639364, 634534, 629036, 622619, 615301, 607451, 599684, 592566, 586220, 580331, 574733, 569714, 565494, 561791, 558326, 555382, 553328, 551913, 550632, 549642, 549693, 551198, 553895, 557362, 561366, 565713, 570155, 574417, 578078, 580703, 582453, 584183, 586312, 587861, 587316, 584287, 579729, 574664, 569379, 563808, 558027, 552244, 546786, 542099, 538364, 535274, 532603, 530689, 529754, 529056, 527547, 525141, 522489, 519653, 516024, 511620, 507414, 504070, 501190, 498144, 494849, 491328, 487302, 482698, 478009, 473691, 469720, 466124, 463467, 462358, 462839, 464539, 467016, 469653, 471704, 472900, 473706, 474670, 475824, 476880, 477669, 478111, 478175, 478146, 478562, 479555, 480616, 481338, 482019, 483177, 484756, 486216, 487208, 487769, 487982]
59581D87982k24p95j421j965k341k640l103l678l857l285k356j815j831j921j712
59566D55038j390j307j450j483j186p00l24j08J71N05M70r7n27j35N96N30l66
59549D48237p55K11J683K379K253K224K789L722M731N802P117R025J1795J5066
59535E16279J8024K0273K1723K1357J7273R095n00p738j0988j1212r893p733n141
59522E70819k678p18O26J150P99J50k4K66K42o48k204l880n221o020o467p001
59506E39191p633p717o852n696n231n496n680n301m631m044l547k995k339j628
59492D70401j087r79j185j191q11m54l04J95J430K734L176K925L006L897N045
59477D86798N741N843N665N661O138O892P242O723N503L942K149L66q49j266j353
$$ y = [487982, 487758, 486963, 485542, 483577, 481236, 478596, 475493, 471815, 467958, 464673, 462317, 460502, 458671, 456750, 455038, 453648, 452341, 450891, 449408, 448222, 447522, 447198, 447090, 447261, 447766, 448236, 448139, 447612, 447477, 448073, 448603, 448237, 447482, 447693, 449376, 451755, 454008, 456232, 459021, 462743, 467474, 473276, 480393, 489418, 501213, 516279, 534303, 554576, 576299, 597656, 614929, 624024, 623524, 615786, 604798, 593586, 583693, 575960, 570819, 568141, 567423, 568049, 569199, 569998, 570148, 570124, 570390, 570632, 569984, 567780, 563900, 558679, 552659, 546192, 539191, 531558, 523841, 516989, 511293, 506062, 500566, 494886, 489585, 484954, 480910, 477363, 474368, 472029, 470401, 469314, 468335, 467150, 465959, 465148, 464694, 464390, 464585, 466015, 468749, 471925, 474850, 477856, 481753, 486798, 492539, 498382, 504047, 509708, 515846, 522738, 529980, 536703, 542206, 546148, 548297, 548663, 547814, 546548, 545195]
59462E45195j475j265l55Q16J557J856K169K785L900N749Q001R632J0100R979
59448E98644R871R473Q514P677P461O950M956J808j209l641n775p300p523o667
59434F23239n706n043m508m347m897n579n464m696m058l495k340p64N11J769L970
59419E78592O963R555J1440J3448J5778J7657J9076K1169K4431K7990L0897L2393
59407H09389L0534K2799R489m925j5305j9881j9993j7180j1976m794L523J1794
59395G93474J8122J9852J5075M477q621k0026k6631k7634k4664k0454j6831j3966
59383F92173j1344q752o167l607j503n00m30k02Q28K033K491K163J605J097O15
59368F70500J63l07q57j168p46J88O44J54n37n18J56R00J551K332L262M234N397
$$ y = [545195, 543720, 542455, 542100, 542916, 544473, 546329, 548498, 551283, 555183, 560932, 568933, 578565, 588665, 598644, 608515, 617988, 626502, 634179, 641640, 648590, 653546, 655354, 654145, 650504, 644729, 637429, 629906, 623239, 617533, 612490, 607982, 603635, 598738, 593159, 587695, 582999, 578941, 575446, 573106, 572342, 572853, 574622, 578592, 585555, 595110, 606550, 619998, 635776, 653433, 672509, 693678, 718109, 746099, 776996, 809389, 839923, 862722, 872211, 867286, 851981, 832100, 812107, 794927, 782951, 778157, 781680, 793474, 811596, 831448, 846523, 851000, 842379, 822353, 795722, 768088, 743424, 722970, 706139, 692173, 680829, 672077, 665910, 662303, 660800, 660300, 659870, 659668, 660496, 662529, 665020, 667183, 668788, 669885, 670500, 670663, 670356, 669499, 668331, 667585, 667773, 668417, 668571, 668034, 667516, 667672, 668572, 670123, 672455, 675717, 679951, 685348]
59351F85348O962Q788J0430J1510J1953J2154J2841J4324J5832J6202J5214J3694
59339H35252J2436J1627J1256J1050J0035P223L093o14k927m563o502q650j0451
59326H68265j1817j2773j3064j2799j2727j3201j3510j2938j1826j0902j0211
59315G32497r455q849q786r072r166q981q799q693q451p892o904n473l872k408
59301F25696q33J400M212O885R232J1904J5045J7413J7318J3884P182j810j0866
59288G16662j7205j9552j9007j7356j5291j2851j0497q603o628l960j124R27K272
59275E87787L749N557P198Q561J0038J1669J3086J4224J5306J6152J6239J5433
59263G24999J4000J1991R314O241L218K50k834n661p605q718r545j0013r433p741
$$ y = [685348, 692310, 701098, 711528, 723038, 734991, 747145, 759986, 774310, 790142, 806344, 821558, 835252, 847688, 859315, 870571, 881621, 891656, 898879, 901972, 901358, 898431, 893868, 887366, 878716, 868265, 856448, 843675, 830611, 817812, 805085, 791884, 778374, 765436, 753610, 742708, 732497, 723042, 714193, 705407, 696335, 687169, 678188, 669389, 660696, 652245, 644353, 637449, 631976, 628104, 625696, 624863, 626263, 630475, 637360, 646592, 658496, 673541, 690954, 708272, 722156, 729338, 727528, 716662, 699457, 679905, 660898, 643542, 628251, 615400, 604903, 596300, 589672, 585712, 584588, 585515, 587787, 591536, 597093, 604291, 612852, 622890, 634559, 647645, 661869, 677175, 693327, 709566, 724999, 738999, 750990, 760304, 766545, 769763, 770013, 767179, 761518, 753913, 745195, 735650, 725637, 716204, 708463]
59249G08463o006n193m998m374k944j390m96j71L81J614L111M208M836N281N387
59234G07709M755L784L621M640N671N348L645J523m29k150l444m085m492n419
59220G20677o877q129q777r203r663r640q618p096o230o512p178p108o065m803
59206F14778m060l822l680l500l352l071k421j553q35k49N01J300J642J444J247
59191E94369J424J724J861K047K644L630M684N522N973N993N822N772N851N816
59177F53132N613N440N363N305N282N218M712L525K192J492J469J618J810K220
59163G04391K531K188J354O09j62j485k956l597l684m673o917q870r295q883q861
59148F51690r190r201q974q973r013q571p699o873o396o429o968p376o822n576
$$ y = [708463, 702457, 697264, 692266, 687892, 684948, 683558, 683062, 682891, 683272, 684886, 687997, 692205, 697041, 702322, 707709, 712464, 716248, 719869, 724509, 730180, 735528, 739173, 740696, 740267, 738117, 734673, 730588, 726096, 720677, 713800, 705671, 696894, 687691, 678028, 668388, 659770, 652674, 646444, 639932, 632754, 625646, 619581, 614778, 610718, 606896, 603216, 599716, 596364, 593293, 590872, 589319, 588484, 588235, 588736, 590036, 591678, 593122, 594369, 595793, 597517, 599378, 601425, 604069, 607699, 612383, 617905, 623878, 629871, 635693, 641465, 647316, 653132, 658745, 664185, 669548, 674853, 680135, 685353, 690065, 693590, 695782, 697274, 698743, 700361, 702171, 704391, 706922, 709110, 710464, 711073, 710911, 709426, 706470, 702873, 699189, 694516, 687599, 678729, 669434, 660551, 651690, 642500, 633299, 624325, 615352, 606339, 597768, 590069, 583196, 576800, 570371, 563403, 556027, 549205, 543629]
59134E43629m878n013m706l136j260k31K36Q36J287J266J641L234N238O376O887
59119E51406P821R030R518R343R419R678R152P913P289P927Q961R446R337Q753
59105F74993P429N430L527K343J745J340R79N31k83j577l083m305m690l875k250
59090F78254r37p05j130j298r53m54m0J14m50j891l471m368m863n821p209q051
59074F36727p825p031o316n810n464n361n514n809o195o568o573n905m773l662
59060E53921k857k395k274k375k454k474k571k547j985j091p38j268k024k421
59046E24447k571k396j256O89J877J248j56o42j43L06N45J208K162K575K424K519
59030E32836L083L647M266N523P241Q377Q569Q706R669J1285J2831J3902J4533
$$ y = [543629, 538751, 533738, 529032, 525896, 524636, 524405, 524641, 525477, 526764, 528030, 529671, 532905, 538143, 544519, 551406, 559227, 568257, 577775, 587118, 596537, 606215, 615367, 623280, 630569, 638496, 647457, 656903, 666240, 674993, 682422, 687852, 691379, 693722, 695467, 696807, 697786, 698317, 698034, 696457, 693374, 689069, 684379, 680504, 678254, 677317, 676612, 675482, 674184, 673231, 672777, 672737, 672851, 672401, 670510, 667039, 662671, 657808, 651987, 644778, 636727, 628902, 621871, 615555, 609745, 604281, 598920, 593406, 587597, 581402, 574834, 568261, 562356, 557583, 553921, 551064, 548669, 546395, 544020, 541566, 539092, 536521, 533974, 531989, 530898, 530160, 528892, 526868, 524447, 521876, 519480, 518224, 518913, 520790, 522038, 521882, 521240, 521097, 521403, 521948, 523156, 525318, 527893, 530317, 532836, 535919, 539566, 543832, 549355, 556596, 564973, 573542, 582248, 591917, 603202, 616033, 629935, 644468]
59017F44468J4841J4732J3724J1363Q004M741K161j83k646m644n643o067o324
59004F88527n882m368k674j673o83J297L530M418L961L589L738L383K046O16j19
58989F99706m51r15j571k378l260l713l217k058j003l35J7q5l56M33K979N862
58973F89655P086O833P094Q749J0708J1977J2805J3515J3876J3942J4119J4047
58961H24406J2916J1080R813R152P581M403Q55j861m200p084j0267j2799j4300
58948H29695j4966j5026j4766j4503j4170j3427j2339j1315j0398r373q450p869
58936F83093p105n553l864l193l297k800j410k55J01L85R69J183P38L96N49N28
58920F60465j00q17j257j764k247j899o98J37q6n45l75J81P43J681L138M362M941
$$ y = [644468, 659309, 674041, 687765, 699128, 707132, 711873, 714034, 713851, 711205, 706561, 700918, 694851, 688527, 682645, 678277, 675603, 673930, 673247, 674544, 678074, 682492, 686453, 690042, 693780, 697163, 699209, 699825, 699706, 699255, 698340, 696769, 694391, 691131, 687418, 684201, 682143, 681140, 680805, 680822, 680737, 680381, 680814, 683793, 689655, 696741, 703574, 710668, 719417, 730125, 742102, 754907, 768422, 782298, 796240, 810359, 824406, 837322, 848402, 858215, 867367, 874948, 879351, 880206, 878345, 874145, 867061, 856794, 843995, 829695, 814729, 799703, 784937, 770434, 756264, 742837, 730498, 719183, 708785, 699412, 690962, 683093, 675988, 670435, 666571, 663378, 660081, 657281, 655871, 655616, 655717, 656102, 657071, 658254, 658992, 659388, 659937, 660465, 660365, 659548, 658291, 656527, 654280, 652381, 651683, 651820, 651734, 651189, 650814, 650995, 651738, 653419, 656557, 660919, 665860]
58903F65860N608O975Q507R634J0808J2439J3776J3949J3289J2629J2021J1090
58891G96585J0056R482R476R935J1088J2955J4796J5760J5782J5271J4340J2808
58879I48334J0671Q146N530L184J162j112m127p274r379j0277j0883j1660j2092
58866I10223j1852j1329j0689r613q353p856q258q494p956p452p834q698r207
58853G92632r254r085q608p834p276p214p177o637n694m721m002l956m881o268
58839G00025p278p996r171j0582j1035j0278r477r275q850p524n971m924l966
58826E93698k588j254n04N3Q78J597J841K093K865L802M443N022N722O004N480
58811F29152M701M275L948L245K329J567R22L31n2m28j359k751l722l966m250
$$ y = [665860, 671468, 678443, 686950, 696584, 707392, 719831, 733607, 747556, 760845, 773474, 785495, 796585, 806641, 816123, 825599, 835534, 846622, 859577, 874373, 890133, 905915, 921186, 935526, 948334, 959005, 967151, 972681, 975865, 977027, 975915, 971788, 964514, 955135, 944858, 933975, 922315, 910223, 898371, 887042, 876353, 866740, 858387, 850531, 842273, 833779, 825823, 818371, 810537, 801839, 792632, 783378, 774293, 765685, 757851, 750575, 743361, 736184, 729547, 723853, 719132, 715130, 711174, 706293, 700025, 692747, 684751, 675580, 664998, 653963, 643685, 634208, 624933, 616083, 608559, 602588, 597664, 593698, 591110, 589856, 589352, 589405, 590283, 591880, 593721, 595814, 598679, 602481, 606924, 611946, 617668, 623672, 629152, 633853, 638128, 642076, 645321, 647650, 649217, 650139, 650470, 650418, 649990, 648631, 645880, 642158, 638192, 633942]
58796F33942n090n942o330o642p194p450o915n886m777l580k489k029k058j634
58782E65926l67J092K309L593M929N605N437N119M866M052K604J357M55j056l398
58767F02523n374o174o352o380n921n206n316o148o006m260k496j866j279L42
58753E40087J993K424K300K685K941K095R18O70J009R83J039K038L343L760L669
58738E71954M279N501O267O468O768P054O586N410M284L576L234L306L483K951
58724F41121J649P62R58J272P38m1j41J34K52P14J930L104L645M344N614O034
58708F72089M384J848K88m95j852l755n248o442q058r775j0896j1869j3261j4180
58694E92778j3583j2319j1850j1790j0710q678o934n733m530l668l854m463m309
$$ y = [633942, 628852, 622910, 616580, 609938, 602744, 595294, 588379, 582493, 577716, 574136, 571647, 569618, 567560, 565926, 565559, 566651, 568960, 572553, 577482, 583087, 588524, 593643, 598509, 602561, 605165, 606522, 606977, 605921, 602523, 597149, 590975, 584623, 578243, 572322, 567116, 561800, 555652, 549646, 545386, 542890, 541024, 539745, 540087, 542080, 544504, 546804, 549489, 552430, 554525, 555443, 556113, 557122, 558105, 559144, 561182, 564525, 568285, 571954, 576233, 581734, 588001, 594469, 601237, 608291, 614877, 620287, 624571, 628147, 631381, 634687, 638170, 641121, 642770, 643532, 644490, 645762, 646500, 646459, 646318, 646452, 646704, 647418, 649348, 652452, 656097, 660441, 666055, 672089, 676473, 678321, 678609, 678114, 676262, 672507, 667259, 660817, 652759, 642984, 632088, 620219, 606958, 592778, 579195, 566876, 555026, 543236, 532526, 523848, 516914, 511181, 506651, 502983, 499129, 494666, 490357]
58681D90357l606l282l037k047r80j189k338k776j951o88N01J584K031J572J307
58666D75458K346L984M976N828P700R866J0499R398P643N225J501k455m551m663
58652E32755m580n053n194m754m664n084n104m524m092l803k911j662j168j436
58638D78726j359o60m8M19J340K380K554K068K068K646K776K193J579J083L11
58623D98076m21n99q10j796k618j779K62J756K443L470M927N708N674N708N741
58608E25742M876L416K613K485J991J186J059J463J374R96J334J889J217m52j526
58593E49663j815k497l466l367k201j232k71K174N782Q312Q975R296J0156J0660
58579E90169J0397J0279J0488R996Q695P690P070N832M369M441O164P626Q122
$$ y = [490357, 486751, 483469, 480432, 478385, 477405, 476216, 473878, 471102, 469151, 468463, 468964, 470548, 472579, 474151, 475458, 477804, 481788, 486764, 492592, 500292, 510158, 520657, 530055, 537698, 542923, 544424, 541969, 537418, 532755, 528175, 523122, 517928, 513174, 508510, 503426, 498322, 493798, 489706, 485903, 482992, 481330, 480162, 478726, 477367, 476707, 476659, 477078, 478418, 480798, 483352, 485420, 487488, 490134, 492910, 495103, 496682, 497765, 498076, 497655, 497056, 496246, 494450, 491832, 490053, 490315, 492071, 494514, 497984, 502911, 508619, 514293, 520001, 525742, 530618, 534034, 536647, 539132, 541123, 542309, 543368, 544831, 546205, 547201, 548535, 550424, 551641, 551189, 549663, 547848, 545351, 541885, 538518, 536317, 535085, 534814, 536988, 542770, 551082, 560057, 569353, 579509, 590169, 600566, 610845, 621333, 631329, 640024, 647714, 654784, 660616, 664985, 669426, 675590, 683216, 691338]
58566F91338R157J1534J4032J5766J7455J9547K1341K2747K4506K6016K5412K2483
58554I21334J9092J6003J1852O137P10k894n190o834p267o383n347m751l933l010
58540I29519l479n911r104j2260j5842j9627k2165k2954k2997k2547k0654j7527
58528G34452j4920j3384j1599r063o960n638l994k135j806l162l962l144k374
58515F52311k800l122k367j779k305k736k146j677k219k534j505j58K40J77N03
58500F27883Q46Q09R43J361J210M44J39K84l71j561j240R55K747K957L287N017
58484F45710O764P211P379Q435R691J0563J2060J4590J6606J7085J7083J7279
58472G90456J6401J3655J0250O975K799k464o623q102q001p650o585m583l051
$$ y = [691338, 700495, 712029, 726061, 741827, 759282, 778829, 800170, 822917, 847423, 873439, 898851, 921334, 940426, 956429, 968281, 974418, 975128, 972234, 967044, 960210, 952943, 946560, 941213, 936462, 932529, 929519, 926040, 920129, 911025, 898765, 882923, 863296, 841131, 818177, 795180, 772633, 751979, 734452, 719532, 706148, 694549, 685486, 678526, 672888, 668894, 666759, 664953, 661791, 657829, 654685, 652311, 649511, 646389, 644022, 642243, 639938, 637202, 635056, 633379, 631160, 628626, 627121, 626963, 627203, 627380, 627883, 628729, 629538, 630481, 631842, 633052, 633496, 633635, 633919, 633548, 631987, 630747, 631702, 634449, 637406, 640693, 645710, 652474, 659685, 667064, 675499, 685190, 695753, 707813, 722403, 739009, 756094, 773177, 790456, 806857, 820512, 830762, 837737, 840536, 838072, 831449, 823347, 815346, 807696, 801111, 796528, 793477]
58459G93477k527j399J172L620N004O835J0012J2778J3752J4143J4880J4386J1486
58446H97619P707M395L88m943r253j0637j0870j2329j4053j3784j1803r820p930
58433H04687n407k838j127J30J294J666J512K767N916Q637R509J0217J1988J2870
58419H61821J1090Q208O181M115P79k444m170n834q818j1291j1139r668r119q868
58405H20843p324n434m846m611k985p74K30L83Q86J287R88J292L176N014N167
58390H13292M626M532L641J004j449k050k442m311n768m424j545L78J751M063
58376H11298O303O845O739P672Q747Q571Q302R289J0045R047Q068R311J1524J2399
58362I34160J2389J2862J3106J2593J3228J5816J7323J5455J2738J2052J1540
$$ y = [793477, 790950, 789551, 790723, 794343, 799347, 806182, 816194, 828972, 842724, 856867, 871747, 886133, 897619, 905326, 909721, 910109, 905166, 895913, 885276, 874406, 862077, 848024, 834240, 822437, 812617, 804687, 799280, 796442, 795315, 795445, 796739, 798405, 799917, 802684, 808600, 817237, 826746, 836963, 848951, 861821, 872911, 881119, 887300, 891415, 892194, 889750, 885580, 879746, 870928, 859637, 848498, 838830, 829711, 820843, 813519, 808085, 803239, 798628, 795643, 794869, 795099, 795482, 796368, 797655, 798643, 799935, 803111, 808125, 813292, 817918, 822450, 826091, 827095, 825646, 823596, 821154, 816843, 811075, 806651, 805106, 805484, 807235, 811298, 817601, 824446, 831185, 838857, 847604, 856175, 864477, 873766, 883811, 892858, 900926, 910237, 921761, 934160, 946549, 959411, 972517, 985110, 998338, 1014154, 1031477, 1046932, 1059670, 1071722, 1083262]
58351A083262Q480M768L606L760K362O24J434L683M421M411O215Q885R815R911
58337A155637J1588J3589J3131J1522J2250J5017J6781J7210J8145J9177J8711
58326A322758J7757J7940J7547J4337J0299Q732Q717P376N401N190N830N193M729
58313A451806O728R273R411Q901J1047J4316J5070J4285J5378J7663J8113J7434
58301A609425J8188J9170J7924J6536J8441K1795K2507K1425K1964K3235K2356
58290A832966K0929K2171K4298K3970K3390K6357L0310L0415K8641L0249L3999
58279B127695L4748L3303L4519L7761L8630L8197M1039M5855M7590M7200M9671
58268B576208N4012N5116N4011N6159O1001O3338O3711O6991P2040P3481P2477
$$ y = [1083262, 1091742, 1096510, 1100116, 1103876, 1106238, 1106862, 1108296, 1111979, 1116400, 1120811, 1127026, 1135911, 1145726, 1155637, 1167225, 1180814, 1193945, 1205467, 1217717, 1232734, 1249515, 1266725, 1284870, 1304047, 1322758, 1340515, 1358455, 1376002, 1390339, 1400638, 1409370, 1418087, 1425463, 1430864, 1436054, 1441884, 1447077, 1451806, 1458534, 1467807, 1477218, 1486119, 1497166, 1511482, 1526552, 1540837, 1556215, 1573878, 1591991, 1609425, 1627613, 1646783, 1664707, 1681243, 1699684, 1721479, 1743986, 1765411, 1787375, 1810610, 1832966, 1853895, 1876066, 1900364, 1924334, 1947724, 1974081, 2004391, 2034806, 2063447, 2093696, 2127695, 2162443, 2195746, 2230265, 2268026, 2306656, 2344853, 2385892, 2431747, 2479337, 2526537, 2576208, 2630220, 2685336, 2739347, 2795506, 2856507, 2919845, 2983556, 3050547, 3122587, 3196068, 3268545]
58257C268545P4823P9591Q0794P9145Q0675Q4787Q5527Q3845Q6491R3331R7907
58246D195461R9939J05023J12644J17196J20076J27794J38952J46423J51327J60931
58236E475766J73968J82769J88757K00343K16440K28375K37295K52644K73895
58227G430252K91550L06025L27058L54477L78812M01173M32355M71824N08707
58218A0902233N44254N91181O49779P08051P66849Q40339R30117J024899J127847
58209A8085549J256563J413864J588188J785764K031027K332643K683895L100634
58201C4278127L621249M265067N032209N949399P069793Q424387J0032608J1973564
58193I0646403J4383392J7365856K0976836K5300899L0384971L5918502M0925453
$$ y = [3268545, 3343368, 3422959, 3503753, 3582898, 3663573, 3748360, 3833887, 3917732, 4004223, 4097554, 4195461, 4295400, 4400423, 4513067, 4630263, 4750339, 4878133, 5017085, 5163508, 5314835, 5475766, 5649734, 5832503, 6021260, 6221603, 6438043, 6666418, 6903713, 7156357, 7430252, 7721802, 8027827, 8354885, 8709362, 9088174, 9489347, 9921702, 10393526, 10902233, 11446487, 12037668, 12687447, 13395498, 14162347, 15002686, 15932803, 16957702, 18085549, 19342112, 20755976, 22344164, 24129928, 26160955, 28493598, 31177493, 34278127, 37899376, 42164443, 47196652, 53146051, 60215844, 68640231, 78672839, 90646403, 105029795, 122395651, 143372487, 168673386, 199058357, 234976859, 275902312]
58186B75902312M3789378M2644191L6026325K3709963P373695r614668k3592209
58179C96238987l2332168l5782290l5418514l3066826l0141274k7430492k5121658
58172A76945765k2977959k0700423j8238956j5774559j3485898j1435158r638571
58165F4694241q118593o862479n811953m923670m191050l597210l098384k666989
58157B5423913k306912k014606j764317j542225j358664j215526j093635r82006
58149A3146022q89679q19225p55826o91385o34254n87168n39248m87277m42305
58140G299655m07945l73353l34304l00898k77965k57478k36560k23656k20247
58131D667249k14775k01574j88747j80886j70842j55258j42107j35695j29068
$$ y = [275902312, 319691690, 362335881, 398362206, 422072169, 429445864, 419831196, 396238987, 363906819, 328124529, 292706015, 259639189, 229497915, 202067423, 176945765, 153967806, 133267383, 115028427, 99253868, 85767970, 74332812, 64694241, 56575648, 49713169, 43901216, 38977546, 34786496, 31189286, 28090902, 25423913, 23117001, 21102395, 19338078, 17795853, 16437189, 15221663, 14128028, 13146022, 12256343, 11437118, 10681292, 9989907, 9355653, 8768485, 8229237, 7741960, 7299655, 6891710, 6518357, 6184053, 5883155, 5605190, 5347712, 5111152, 4887496, 4667249, 4452474, 4250900, 4062153, 3881267, 3710425, 3555167, 3413060, 3277365, 3148297]
58122C148297j18061j08776j04631r9590r0678q4125q2862q0403p3283o7525o6716
58111B171647o5329n9819n5177n4571n3220m8342m4817m5379m5120m1233l8491
58100A620149l9688m0089l6736l4080l5096l5630l2818l0485l1079l0637k6820
58089A246991k3865k4464k4613k1511j8929j9795k0825j9371j8455k0259k1518
58078A013386j9989j8827k0090k0571j8324j6747j7891j8321j5829j3828j4803
58067H18166j5755j4307j3024j3552j2757r041o255p029q206p193o769r145j1230
58054F83903j0453r653j1379j2778j0960q341p936q162o856n764o520o722m462
58041E73917k416l146m554m102l358m329n396m839m395n576o489n875o028q161
$$ y = [3148297, 3030236, 2921460, 2816829, 2717239, 2626561, 2542436, 2459574, 2379171, 2305888, 2238363, 2171647, 2106318, 2046499, 1991322, 1936751, 1883531, 1835189, 1790372, 1744993, 1699873, 1658640, 1620149, 1580461, 1540372, 1503636, 1469556, 1434460, 1398830, 1366012, 1335527, 1304448, 1273811, 1246991, 1223126, 1198662, 1174049, 1152538, 1133609, 1113814, 1092989, 1073618, 1055163, 1034904, 1013386, 993397, 974570, 954480, 933909, 915585, 898838, 880947, 862626, 846797, 832969, 818166, 802411, 788104, 775080, 761528, 748771, 739730, 733475, 726446, 718240, 711047, 704278, 695133, 683903, 673450, 663797, 652418, 639640, 628680, 620339, 612403, 604241, 597385, 591621, 585101, 578379, 573917, 571501, 568355, 563801, 559699, 556341, 552012, 546616, 541777, 537382, 531806, 525317, 519442, 513414, 505253]
58027E05253r338p730o305p411q352o540m468m939n776m154k159k908m700m216
58013D26257k469k532l952m194l437l409l543k331o49l0L98J862L047K488J591
57998D09097K098K928K627K375L395L989K429K67m80q95k673m678n361o039q270
57983D00809j0365r987q113p027o506n272m169m574n487n275m495m222l595j820
57969C19902m51q29j413m27J028J203P89J021J046J0o42J84P77l96j707j377q00
57952C17918j692k594j654l59r30k243k020r87j119j659o52J224K037K217L356
57937C10843M814N044M817N815P283P387O596O572O955O233M562K860P24k036
57923C78469l544k633j621l067n615o438n993o634q111q368p597p537p722o206
$$ y = [505253, 495915, 488185, 481880, 474469, 466117, 459577, 455109, 450170, 444394, 440240, 438081, 435173, 430473, 426257, 423788, 421256, 417304, 413110, 409673, 406264, 402721, 400390, 399741, 399711, 400109, 401971, 405018, 407506, 409097, 411195, 414123, 416750, 419125, 422520, 426509, 428938, 429205, 428725, 427830, 425157, 420479, 415118, 409079, 400809, 390444, 380457, 372344, 365317, 358811, 353539, 349370, 344796, 339309, 334034, 329539, 325317, 321722, 319902, 319451, 318622, 317209, 316782, 317810, 319013, 319802, 320823, 321869, 321879, 321237, 321421, 322198, 321802, 320095, 318718, 317918, 316226, 313632, 311978, 311619, 310689, 308446, 306426, 305439, 304320, 302661, 302009, 303233, 305270, 307487, 310843, 315657, 320701, 325518, 331333, 338616, 346003, 352599, 359171, 366126, 372359, 376921, 379781, 380505, 378469, 374925, 372292, 370671, 367604, 361989, 355551, 349558, 342924, 334813, 326445, 318848, 311311, 303589, 297383]
57909B97383l352j336m71O22J886K154J971K748L698K904R09K9N82R15P09J157
57893C12508K205K627K582L228M157M000L161L161L740L412K490K626L668L819
57879C57384K741J770J221J37j439k419k760l275l659l028k028k105l042l487
57865C36011l353l495l590k675j203l10K91J462K611K859L108M375N336M373K993
57850C48793L819O085O607M837L358L414L431K268R02K29j15l37j75j31q73j507
57834C80605p64N01L76q90j367p19l26m08O3Q24N15o39j062p12r70j802j892j455
57816C69878j975l139l051j633q31j204j373j149k126m604o841p919q581q836
57802C16616p669n679m915n421m937k865j436j854k304j145N88J372J408J301
$$ y = [297383, 294031, 292695, 292224, 292846, 294732, 296886, 298857, 301605, 305303, 308207, 309116, 309145, 309727, 310642, 311351, 312508, 314713, 317340, 319922, 323150, 327307, 331307, 334468, 337629, 341369, 344781, 347271, 349897, 353565, 357384, 360125, 361895, 363116, 363253, 361814, 359395, 356635, 353360, 349701, 346673, 344645, 342540, 339498, 336011, 332658, 329163, 325573, 322898, 321695, 321385, 321676, 323138, 325749, 328608, 331716, 336091, 341427, 345800, 348793, 352612, 358697, 365304, 370141, 373499, 376913, 380344, 382612, 383514, 383743, 383628, 383291, 383116, 382985, 382112, 380605, 379841, 380342, 380718, 379828, 378461, 377742, 377416, 377008, 377071, 377895, 378410, 377771, 376709, 375997, 375027, 373225, 371333, 369878, 367903, 364764, 361713, 360080, 359249, 358045, 356672, 355523, 353397, 348793, 341952, 334033, 325452, 316616, 308947, 303268, 298353, 292932, 287995, 285130, 283694, 281840, 279536, 278391, 278979, 280351, 281759, 283060]
57788B83060P29j67j94Q42J488J170J301K763M371N050N489O368O829O182N315
57773C30596N150N174M703M117L775L146K071J405J531J505N86p33j846k767l200
57758C55213k518j178n86r29q68P9P19M52L74J252K245K543K614K827K568J695
57742C66502J177J357J175J36n83p6P75Q68N12M23M42L05M12Q75J037P56Q67J622
57724C78582K077J834J862K665L204K663J872J745J755J233Q72J588K799L195
57710D07946K580J827J570J737J861J328o8j467j613m42Q89J701K342K988L265
57695D26444L426M268N358M941K332r47l258m769o390q026q867q611p577o245
57681C92079n057m073k640k10K622M939P078J0054J3719J7266K1334K7598L6102
$$ y = [283060, 283789, 283622, 283428, 284270, 285758, 286928, 288229, 290992, 295363, 300413, 305902, 312270, 319099, 325281, 330596, 335746, 340920, 345623, 349740, 353515, 356661, 358732, 360137, 361668, 363173, 363759, 363026, 361180, 358413, 355213, 352695, 351517, 350931, 350002, 349134, 349213, 349932, 350384, 350758, 352010, 354255, 356798, 359412, 362239, 364807, 366502, 367679, 369036, 370211, 370347, 369764, 369688, 370463, 371331, 371843, 372266, 372708, 373013, 373425, 374300, 375337, 376093, 376960, 378582, 380659, 382493, 384355, 387020, 390224, 392887, 394759, 396504, 398259, 399492, 400364, 401952, 404751, 407946, 410526, 412353, 413923, 415660, 417521, 418849, 418781, 417314, 415701, 415259, 416148, 417849, 420191, 423179, 426444, 429870, 434138, 439496, 444437, 446769, 445822, 442564, 437795, 431405, 423379, 414512, 405901, 398324, 392079, 387022, 382949, 380309, 380099, 382721, 387660, 394738, 404792, 418511, 435777, 457111, 484709, 520811]
57668E20811M5170N4190O4075P3992P9640P6053O0972L5481L636k7777n1708o5008
57656H69527o9406o7958o2353n4099m5602l8394l1987k5856k0895j7651j4866
57645D20460j1374p956n820m635l512k610k292j871p02N33R31Q18R69J375J771
57630C86085K320K840K517J349N31N62L66p08j599j392q99j088j444j292j282
57615C86866j995k439j544l0P58P64O24K33n40q14J15J418J949J852J711J197
57599C90125J1r62r27o33j067j686j482q90j052j880k405k387k170j660p25K3
57583C70233P1n5K25N06M18N99J417J874J138J15k8J59m85j550j717r41k68q6
57565C71625QJ57L24Q57J752K106J457P74R11J210R79J078K324L599L545L082
$$ y = [520811, 565981, 620171, 684246, 758238, 837878, 913931, 974903, 1010384, 1014020, 986243, 934535, 869527, 800121, 732163, 669810, 615711, 570109, 531715, 499728, 473872, 452977, 435326, 420460, 409086, 401130, 395310, 390675, 387163, 384553, 382261, 380390, 379688, 380221, 381152, 381970, 382939, 384314, 386085, 388405, 391245, 393762, 395111, 395642, 396204, 396570, 395862, 394263, 392871, 391972, 390884, 389440, 388148, 386866, 384871, 382432, 380888, 380858, 381616, 382380, 383004, 383237, 382697, 381883, 381998, 383416, 385365, 387217, 388928, 390125, 390136, 389174, 388247, 387614, 386547, 384861, 383379, 382489, 381437, 379557, 377152, 374765, 372595, 370935, 370210, 370233, 370304, 370249, 370474, 370980, 371398, 371997, 373414, 375288, 376426, 376541, 376513, 376672, 376187, 374637, 372920, 371979, 371711, 371625, 371633, 371790, 372114, 372971, 374723, 376829, 378286, 379060, 379971, 381181, 382160, 383238, 385562, 389161, 392706, 395788]
57549C95788M050O044O901N872M165K692J395O19J097K411L240L246L211L389
57535D44120L337L226L671M254L893K725K042K243K420K112J967K327K586K388
57521D83311K239K556L088L572M059M430M345L836L319K945K682K744L266L782
57507E30174L802L526L322K932K078J317J366K018K558K760K603J749L13n89k13
57492E59716N83O59M25R78K166K952L208L572L993L913L593L785M299M377M143
57477F02362M288M574M183L316K936L056K757J932J571K200L226L956M220M064
57463F48641L749L912M780N564N565N327N671O256O312O145O461O820O366N496
57449G27065N259N481N241M763N043N905O238N963N974O252N919N173N302O585
$$ y = [395788, 399838, 405882, 412783, 418655, 422820, 425512, 426907, 427526, 428623, 431034, 434274, 437520, 440731, 444120, 447457, 450683, 454354, 458608, 462501, 465226, 467268, 469511, 471931, 474043, 476010, 478337, 480923, 483311, 485550, 488106, 491194, 494766, 498825, 503255, 507600, 511436, 514755, 517700, 520382, 523126, 526392, 530174, 533976, 537502, 540824, 543756, 545834, 547151, 548517, 550535, 553093, 555853, 558456, 560205, 560518, 559929, 559716, 560299, 560958, 561383, 562361, 564527, 567479, 570687, 574259, 578252, 582165, 585758, 589543, 593842, 598219, 602362, 606650, 611224, 615407, 618723, 621659, 624715, 627472, 629404, 630975, 633175, 636401, 640357, 644577, 648641, 652390, 656302, 661082, 666646, 672211, 677538, 683209, 689465, 695777, 701922, 708383, 715203, 721569, 727065, 732324, 737805, 743046, 747809, 752852, 758757, 764995, 770958, 776932, 783184, 789103, 794276, 799578, 806163]
57435H06163P846Q287Q211P857P102O399O436O796O526N953O301P442P944P447
57421I06710P124P522P832P707P913Q600Q687P717O699O469O599O613O850P527
57407A010569Q216Q796R600J0233R653P979O735O769P215P187P034P276P625P795
57393A122682Q183Q994R789J0364J1076J1826J1948J1506J1460J2108J2638J2682
57381A255256J2916J3554J3675J2780J1734J1410J1580J1785J2150J2559J2295
57370A391694J1264J0476J0538J0796J0673J0753J1690J3083J4268J5217J5898
57359A526350J5758J4742J3926J4159J4924J5341J5477J5810J6153J6057J5723
57348A694420J5662J5947J6381J6899J7284J7020J6048J5096J4803J4995J5159
$$ y = [806163, 814009, 822296, 830507, 838364, 845466, 851865, 858301, 865097, 871623, 877576, 883877, 891319, 899263, 906710, 913834, 921356, 929188, 936895, 944808, 953408, 962095, 969812, 976511, 982980, 989579, 996192, 1003042, 1010569, 1018785, 1027581, 1037181, 1047414, 1057067, 1065046, 1071781, 1078550, 1085765, 1092952, 1099986, 1107262, 1114887, 1122682, 1130865, 1139859, 1149648, 1160012, 1171088, 1182914, 1194862, 1206368, 1217828, 1229936, 1242574, 1255256, 1268172, 1281726, 1295401, 1308181, 1319915, 1331325, 1342905, 1354690, 1366840, 1379399, 1391694, 1402958, 1413434, 1423972, 1434768, 1445441, 1456194, 1467884, 1480967, 1495235, 1510452, 1526350, 1542108, 1556850, 1570776, 1584935, 1599859, 1615200, 1630677, 1646487, 1662640, 1678697, 1694420, 1710082, 1726029, 1742410, 1759309, 1776593, 1793613, 1809661, 1824757, 1839560, 1854555, 1869714]
57337A869714J5148J5095J5133J5451J6095J6595J6427J5824J5475J5525J5699
57326B042181J6154J7157J8006J7674J6556J6175J6961J7805J8077J8498J9461
57315B234705K0089J9766J9275J9516K0230K0843K1447K2142K2431K2123K1912
57304B464479K2265K2576K2193K1485K1176K1359K1750K2143K2201K1656K1097
57293B704380K1565K2888K3575K2862K1743K1319K1325K1042K0593K0475K0667
57282B942434K1055K1857K2885K3225K2444K1391K1140K1758K2637K3335K3653
57271C187814K3600K3688K4406K5207K5032K4043K3629K4328K5098K5094K4824
57260C456763K4894K4995K4874K4971K5367K5317K4621K4225K4672K5155K4946
$$ y = [1869714, 1884862, 1899957, 1915090, 1930541, 1946636, 1963231, 1979658, 1995482, 2010957, 2026482, 2042181, 2058335, 2075492, 2093498, 2111172, 2127728, 2143903, 2160864, 2178669, 2196746, 2215244, 2234705, 2254794, 2274560, 2293835, 2313351, 2333581, 2354424, 2375871, 2398013, 2420444, 2442567, 2464479, 2486744, 2509320, 2531513, 2552998, 2574174, 2595533, 2617283, 2639426, 2661627, 2683283, 2704380, 2725945, 2748833, 2772408, 2795270, 2817013, 2838332, 2859657, 2880699, 2901292, 2921767, 2942434, 2963489, 2985346, 3008231, 3031456, 3053900, 3075291, 3096431, 3118189, 3140826, 3164161, 3187814, 3211414, 3235102, 3259508, 3284715, 3309747, 3333790, 3357419, 3381747, 3406845, 3431939, 3456763, 3481657, 3506652, 3531526, 3556497, 3581864, 3607181, 3631802, 3656027, 3680699, 3705854, 3730800]
57249C730800K4526K4510K4580K4362K4196K4249K4100K3860K4372K5488K5671
57238D000714K4248K2566K1835K1432K0571K0094K0970K2429K3177K3397K3883
57227D245316K4236K3599K2409K1796K1837K1876K1877K2122K2128K1333K0236
57216D488765J9637J9184J7987J6142J4548J3592J3037J2726J2564J2279J1936
57205D652397J1983J2272J1985J1183J1127J2277J3359J3428J3383J4153J4882
57194D792429J4526J3897J4333J5481J6172J6550J7411J8315J8207J7313J6696
57183D971330J6463J6005J5385J4969J4280J2856J1492J1117J1084J0200Q741
57172E113922P741P104O134N231N112M966L364N82j947l997o490r475j2153j4630
$$ y = [3730800, 3755326, 3779836, 3804416, 3828778, 3852974, 3877223, 3901323, 3925183, 3949555, 3975043, 4000714, 4024962, 4047528, 4069363, 4090795, 4111366, 4131460, 4152430, 4174859, 4198036, 4221433, 4245316, 4269552, 4293151, 4315560, 4337356, 4359193, 4381069, 4402946, 4425068, 4447196, 4468529, 4488765, 4508402, 4527586, 4545573, 4561715, 4576263, 4589855, 4602892, 4615618, 4628182, 4640461, 4652397, 4664380, 4676652, 4688637, 4699820, 4710947, 4723224, 4736583, 4750011, 4763394, 4777547, 4792429, 4806955, 4820852, 4835185, 4850666, 4866838, 4883388, 4900799, 4919114, 4937321, 4954634, 4971330, 4987793, 5003798, 5019183, 5034152, 5048432, 5061288, 5072780, 5083897, 5094981, 5105181, 5113922, 5121663, 5128767, 5134901, 5140132, 5145244, 5150210, 5153574, 5154156, 5152209, 5148212, 5141722, 5132247, 5120094, 5105464]
57158E105464j7587k0434k1792k1904k2532k4325k6116k7016k7523k8257k9168
57147D838810l0204l1399l2139l1715l0543k9591k8786k7432k5950k5584k6449
57136D519018k7530k8564l0354l3171l6433l9975m4079m8228n1351n3415n5270
57125D070648n6935n7473n6671n5317n3784n1729m9181m6559m3694m0238l6910
57114C522157l4916l4308l4240l4433l4772l4011l0795k5662k0131j4030n710
57103C219149N426J8718L4456N4136P8661J08468J45374J92003K49563L18500
57093D424454M01094N00196O14782P38764Q63918R81246J080133J150173J184227
57084A1938987J176380J118967J010338Q69256P33073O31331N60130M86909L80126
$$ y = [5105464, 5087877, 5067443, 5045651, 5023747, 5001215, 4976890, 4950774, 4923758, 4896235, 4867978, 4838810, 4808606, 4777207, 4745068, 4713353, 4682810, 4653219, 4624433, 4597001, 4571051, 4545467, 4519018, 4491488, 4462924, 4432570, 4399399, 4362966, 4322991, 4278912, 4230684, 4179333, 4125918, 4070648, 4013713, 3956240, 3899569, 3844252, 3790468, 3738739, 3689558, 3642999, 3599305, 3559067, 3522157, 3487241, 3452933, 3418693, 3384260, 3349488, 3315477, 3284682, 3259020, 3238889, 3224859, 3219149, 3224575, 3243293, 3277749, 3331885, 3410546, 3519014, 3664388, 3856391, 4105954, 4424454, 4825548, 5325744, 5940526, 6679290, 7543208, 8524454, 9604587, 10754760, 11938987, 13115367, 14234334, 15244672, 16113928, 16847001, 17478332, 18038462, 18525371, 18905497]
57075A8905497K31538N3350j37291l27736n10081o78778q28822r54253j048182
57066A4705242j105373j125023j110885j069234j006865r30270q45617p58796
57058F753179o74769n96517n24873m59827m01805l51395l08347k71438k39335
57049B924873k11283j87125j66884j50175j36047j23673j13026j04361r7174r0422
57039A544703q3644p7054p0594o3885n7154n1076m5518l9556l3014k6694k0761
57028I75753j4058n581M464J5605K7937M1160N3255O0527N8522M3654J6112j8104
57016A259246m9588p1336q1912q3410p8390o9477n9712n1160m3838l7100l1190
57005F02133k6521k2542j8635j5267j3138j1932j0967j0278j0035r704q807p825
$$ y = [18905497, 19137035, 19190385, 19053094, 18725358, 18215277, 17536499, 16707677, 15753424, 14705242, 13599869, 12474846, 11363961, 10294727, 9287862, 8357592, 7511975, 6753179, 6078410, 5481893, 4957020, 4497193, 4095388, 3743993, 3435646, 3164208, 2924873, 2713590, 2526465, 2359581, 2209406, 2073359, 1949686, 1836660, 1732299, 1635125, 1544703, 1461059, 1384005, 1313411, 1249526, 1192372, 1141296, 1095778, 1056222, 1023208, 996514, 975753, 961695, 956114, 960578, 976183, 1004120, 1045280, 1098535, 1159062, 1217584, 1261238, 1277350, 1259246, 1209658, 1138322, 1056410, 973000, 894610, 825133, 765421, 714261, 670423, 633323, 602133, 575612, 553070, 534435, 519168, 506030, 494098, 483131, 472853, 462818, 453114, 444307, 436482]
56993D36482p316o883o028n136m617l802j825J064M122P181R954J1074R306N223
56979D48799M98m051q496j2338j4469j4549j3339j1658r820p982o246m520k854
56966C38975j623q29L15K468N348Q400J1693J5341J8707K0948K1803K0971J7412
56953D79929J0457J236p924j5293k0213k2405k1971j9867j7360j4949j2447r807
56941C29386p177m432j358J855M920P932J1137J4536J8176K2203K6019K8010K6704
56928D77911K1783J3601K723r271j9522k5686k7714k7164k5366k3102k1201k0126
56916C16866j9253j7651j5310j2936j0937r335q193p293n981m135k677k251k134
56903A98780j454o55o27j058r84m12m9J82R54K195L309M487O480R160J1588J3487
$$ y = [436482, 429166, 422283, 416255, 411119, 406502, 402700, 400875, 401939, 406061, 413242, 423196, 434270, 443576, 448799, 449297, 445246, 436750, 424412, 409943, 395394, 382055, 370397, 360577, 352595, 346349, 341829, 338975, 337352, 336523, 336838, 339306, 344654, 353054, 364747, 380088, 398795, 419743, 441546, 462517, 479929, 490386, 491622, 483698, 468405, 448192, 425787, 403816, 383949, 366589, 351640, 339193, 329386, 322209, 317777, 316419, 318274, 323194, 331126, 342263, 356799, 374975, 397178, 423197, 451207, 477911, 499694, 513295, 516018, 506747, 487225, 461539, 433825, 406661, 381295, 358193, 336992, 316866, 297613, 279962, 264652, 251716, 240779, 231444, 223251, 215958, 209977, 205842, 203165, 200914, 198780, 197326, 196671, 196044, 194986, 194002, 193590, 193541, 193723, 194677, 196872, 200181, 204668, 211148, 220308, 231896, 245383]
56887B45383J5423J7476J8829J8691J6727J2704O812L10n184r067j1578j2572
56875C13954j1652r400p132n314l269o29K076M494P047J0128J3577J7259K1460
56862C52599K6412L1971L7686M2417M3935L9931K9895J5664J74j3772k4013k9611
56850E53288l1304l0623k8363k4392j8838j2655o846j808K596P004J2475J9555
56838D40089K7453L4986M2334N0742O0186O8166P1146O6502N3143L1576M536k2972
56826I27887m5365n9025o3650o1650n6292m9877m3113l5907k8366k0918j3851
56815D49873p278j282M311J0134J6840K4542L2886M1300M8673N3023N1921M3466
56803G68409K7285N468j7364l6009m7695n2919n3333m9955m3811l6831l0599k4993
$$ y = [245383, 260806, 278282, 297111, 315802, 332529, 345233, 352045, 352355, 347171, 338104, 326526, 313954, 302302, 292902, 285770, 280456, 277187, 276558, 278634, 283128, 290175, 300303, 313880, 331139, 352599, 379011, 410982, 448668, 491085, 535020, 574951, 604846, 620510, 620684, 606912, 582899, 553288, 521984, 491361, 462998, 438606, 419768, 407113, 400267, 398459, 401055, 408059, 420534, 440089, 467542, 502528, 544862, 595604, 655790, 723956, 795102, 861604, 914747, 946323, 950859, 927887, 882522, 823497, 759847, 698197, 641905, 592028, 548915, 513008, 484642, 463724, 449873, 442595, 441313, 445624, 455758, 472598, 497140, 530026, 571326, 619999, 673022, 724943, 768409, 795694, 801162, 783798, 747789, 700094, 647175, 593842, 543887, 500076, 463245, 432646, 407653]
56791D07653j9282j3808r369n613j580K605O169R499J3972J9841K5489K8912K8766
56778D93254K4186J5024K759r852k0428k7796l1566l2031l0433k8219k5768k2672
56766C06458j9154j6197j4213j2683j1203r923q813p490n976m788m096l581l153
56753A85188l018k995k641k043j663j411p88L5K98j85q16j255j657j886j474n44
56737A63145J38J96r3n47j201j582j002K37R27M90l58p00m12J28N33M65r5n46
56719A59723k61N04J021J189J448J781J822J738J977K228J778Q66N08Q74J100
56704A78296Q48Q18J389J889J610P11k63r24r57l28L21L13n9l5K54Q0m14l45K90
56685A83494N56K94M26J271J942J904J780K015K042J420O93M04K27k46p70r92
$$ y = [407653, 388371, 374563, 365194, 359581, 358001, 360606, 366775, 376274, 390246, 410087, 435576, 464488, 493254, 517440, 532464, 535223, 525371, 504943, 477147, 445581, 413550, 383117, 354898, 329130, 306458, 287304, 271107, 256894, 244211, 233008, 223085, 214272, 206782, 200806, 196018, 191922, 188341, 185188, 182170, 179175, 176534, 174491, 172828, 171417, 170629, 170664, 170962, 170777, 169961, 168706, 167049, 165163, 163689, 163145, 163283, 163479, 163386, 162839, 161638, 160056, 159054, 159291, 160218, 160708, 160350, 159650, 159238, 159366, 159899, 160364, 160269, 159723, 159462, 159966, 160987, 162176, 163624, 165405, 167227, 168965, 170942, 173170, 174948, 175814, 176322, 177196, 178296, 179144, 179962, 181351, 183240, 184850, 185561, 185298, 184374, 183417, 183089, 183410, 183723, 183664, 183629, 183883, 183963, 183549, 183204, 183494, 184050, 184344, 184770, 186041, 187983, 189887, 191667, 193682, 195724, 197144, 197837, 198241, 198468, 198222, 197452, 196460]
56669A96460r38o08J18P80N56m85j265j187p57m44pO60J087J038P63K22q35j797
56651A93361j581m42N0o60j257p65l4o0k75K58J124J389J235J392J667J264K88
56634A96954l53k99j07l05p63j002p21j19J80j62o51n92j43Pj25M9L78qj172k091
56614A88955k177j938j797j458q72n29l79K62J213J270J41q47p85m38o39p95j68
56597A79019N95M96k24p09q16p83l78M70J072R82Q09J145J515J372J167J336J219
56580A88287J70j072j393r82o96m64L27J398J870J719J658J831J820J784K386
56565A98643L587M488M552M324M741O218Q299R964J0453R973R224Q107N704J876
56551B90153j983m372n146n052m567l919l486l405l301k986k917l336l664l338
$$ y = [196460, 195522, 194914, 195032, 195812, 196368, 195883, 194618, 193431, 192674, 192230, 192223, 192883, 193970, 195008, 195771, 195993, 195158, 193361, 191780, 191338, 191388, 190728, 189471, 188706, 188672, 188612, 188337, 188595, 189719, 191108, 192343, 193735, 195402, 196666, 196954, 196601, 196302, 196195, 195890, 195127, 194125, 193404, 193285, 193465, 193303, 192652, 192060, 191917, 191924, 191799, 191848, 192226, 192218, 191046, 188955, 186778, 184840, 183043, 181585, 180713, 180184, 179805, 180067, 181280, 182550, 182691, 181844, 181059, 180621, 179982, 179187, 179019, 179614, 180110, 179886, 179177, 178361, 177578, 177200, 177670, 178742, 179724, 180533, 181678, 183193, 184565, 185732, 187068, 188287, 188457, 187385, 185992, 185010, 184314, 183850, 184177, 185575, 187445, 189164, 190822, 192653, 194473, 196257, 198643, 202230, 206718, 211270, 215594, 220335, 226553, 234852, 244816, 255269, 265242, 274466, 282573, 288277, 290153, 288170, 283798, 278652, 273600, 269033, 265114, 261628, 258223, 254922, 251936, 249019, 245683, 242019, 238681]
56537B38681k659k225k071j933j759j561j228q66o78m24K07O61J47o75j83J619
56521B25053K688J787J21p78j178j895k456k043j122o70o29m72l91o95q93o29
56505B15798n56j151j579j051k54n8J18J119K189K007Q64J45J81J86j03k65k66
56488B17324l81l63k1pq20j545r96M16J337J501J591J599R25j55o44m06k22l84
56470B18749l80nL71N57O36M93J23O0O29J175R33K01l04o21j098j406j059l86
56452B18668R0N56J215J397O42j15K85J468K253K433K495K281J398L84O4J50j65
56435B35499q07j246j607k015j670j43J261J133K19J87Q55P30k24n77j0K42l14
56418B31513p03l40J24J78J86M17O30Q13J219J599J482J089Q49M05o94j691j457
$$ y = [238681, 236022, 233797, 231726, 229793, 228034, 226473, 225245, 224379, 223701, 223277, 223484, 224145, 224292, 223617, 223434, 225053, 227741, 229528, 229649, 228871, 227693, 225798, 223342, 221299, 220177, 219507, 218878, 218406, 218015, 217320, 216427, 215798, 215242, 214091, 212512, 211461, 211207, 211149, 211267, 212386, 214575, 216582, 217446, 217591, 217772, 217958, 217855, 217590, 217324, 216943, 216580, 216559, 216552, 215732, 214187, 213191, 213607, 214944, 216445, 218036, 219635, 220560, 220405, 219761, 219355, 219133, 218749, 218369, 218364, 218735, 219292, 219928, 220421, 220544, 220604, 221233, 222408, 223341, 223542, 223238, 222617, 221519, 220113, 219054, 218668, 218758, 219314, 220529, 221926, 222568, 222453, 222738, 224206, 226459, 228892, 231387, 233668, 235066, 235450, 235514, 235664, 235499, 234692, 233446, 231839, 229824, 228154, 228011, 229272, 230405, 230624, 230811, 231666, 232396, 232172, 231595, 231585, 231827, 231513, 230810, 230470, 230594, 230772, 230958, 231375, 232005, 232818, 234037, 235636, 237118, 238207, 239056, 239461, 238767, 237076, 235619]
56401B35619k36P90J304J691J636O11n62m55P52J492J211Q42R85J254J444J769
56385B50147J903J346O20O39J016O12l79o61JN71P16J192K093K453J911J190P61
56368B66131L92J22K78M90J18m11j45O69R83Q20J127J845J958J431J305J733J727
56351B80573J066P42J176J532J132K35p13j342j046L00J515J475Q67J089J902
56336B90503K119J936K526L612L809L194L217L996M108L151K302K087J884J810
56322C30254K758M170M173K470R63Q67J279J103M61l22j202j496l71J409K229
56307C48745K175K787M073M320L201K557L425M698N438O162P021P002N848M681
56293D12133L963K903J542J194K127K949L115L724N112O026O070O608Q155R171
$$ y = [235619, 235383, 236173, 237477, 239168, 240804, 241415, 240853, 240398, 241150, 242642, 243853, 244695, 245680, 246934, 248378, 250147, 252050, 253396, 254016, 254655, 255671, 256283, 255904, 255243, 255244, 255815, 256531, 257723, 259816, 262269, 264180, 265370, 266131, 266523, 266645, 266923, 267413, 267531, 267120, 266975, 267644, 268627, 269447, 270574, 272419, 274377, 275808, 277113, 278846, 280573, 281639, 282381, 283557, 285089, 286221, 286456, 285743, 284401, 283355, 283655, 285170, 286645, 287512, 288601, 290503, 292622, 294558, 297084, 300696, 304505, 307699, 310916, 314912, 319020, 322171, 324473, 326560, 328444, 330254, 333012, 337182, 341355, 343825, 344788, 345655, 346934, 348037, 348498, 348176, 346974, 345478, 345107, 346516, 348745, 350920, 353707, 357780, 362100, 365301, 367858, 371283, 375981, 381419, 387581, 394602, 401604, 407452, 412133, 416096, 418999, 420541, 421735, 423862, 426811, 429926, 433650, 438762, 444788, 450858, 457466, 465621, 474792]
56279D74792Q601P586P455P982Q646R724J1114J1925J2091J2638J3663J4132J4153
56266F14502J5222J7605J9756K1073K2748K5251K7567K9710L3198L8110M2496
56255I07238M5931N0680N7934O5875P3086Q1020R1196J02483J13248J23773J34540
56244A847004J44329J52032J58325J63543J65927J63887J58122J49611J37423
56235C240203J20308R8796P4087M6655J7583j0600l6106n9239q0286r7999j11613
56224C201789j22268j30939j36853j39377j39423j37699j33668j27633j21482
56215B012447j15996j09780j02200r4873q8722q2391p5198o8885o4473o0141n4340
56204A095448m8346m3645l9495l5238l2242l1083k9553k6058k2370k0447j9095
$$ y = [474792, 483393, 490979, 498434, 506416, 515062, 524786, 535900, 547825, 559916, 572554, 586217, 600349, 614502, 629724, 647329, 667085, 688158, 710906, 736157, 763724, 793434, 826632, 864742, 907238, 953169, 1003849, 1061783, 1127658, 1200744, 1281764, 1372960, 1475443, 1588691, 1712464, 1847004, 1991333, 2143365, 2301690, 2465233, 2631160, 2795047, 2953169, 3102780, 3240203, 3360511, 3459307, 3533394, 3580049, 3597632, 3587032, 3550926, 3491687, 3411401, 3313402, 3201789, 3079521, 2948582, 2811729, 2672352, 2532929, 2395230, 2261562, 2133929, 2012447, 1896451, 1786671, 1684471, 1589598, 1500876, 1418485, 1343287, 1274402, 1209929, 1149788, 1095448, 1047102, 1003457, 963962, 928724, 896482, 865399, 835846, 809788, 787418, 766971, 747876]
56193G47876j6559j3868j2662j2020j0454q851q471q078o115l828l238l783l725
56180F36224l220l246l243k373j443j190n74R10J489J47r92RJ625J808J685L168
56164F30784N193N729N462O175P342P535P347P812Q001P203P288R711J2422J3143
56150G41147J3368J5504J8435J9866K0901K4122K9006L3468L8322M5992N6210
56139A056341O6813P7388Q8081R6229R8430R4895Q8139P8749O6421N3820M5005
56128A910311M0706L8637L7326L6053L2463K4551J4204N192j541p347j2310j5977
56116B102268k0310k7986l8767n0780o3671p6939q7149r1038q9760q6229q0206
56105A389433p0311n8796m9478m2420l5246k8140k2898j8634j3382q519o655o466
$$ y = [747876, 731317, 717449, 704787, 692767, 682313, 673462, 664991, 656913, 650798, 646970, 643732, 639949, 636224, 633004, 629758, 626515, 624142, 622699, 621509, 620935, 621845, 623334, 623481, 622489, 622498, 624123, 625931, 627616, 630784, 635977, 641706, 647168, 653343, 660685, 668220, 675567, 683379, 691380, 698583, 705871, 715582, 728004, 741147, 754515, 770019, 788454, 808320, 829221, 853343, 882349, 915817, 954139, 1000131, 1056341, 1123154, 1200542, 1288623, 1384852, 1483282, 1578177, 1666316, 1745065, 1811486, 1865306, 1910311, 1951017, 1989654, 2026980, 2063033, 2095496, 2120047, 2134251, 2139443, 2137902, 2130555, 2118245, 2102268, 2081958, 2053972, 2015205, 1964425, 1900754, 1823815, 1736666, 1645628, 1555868, 1469639, 1389433, 1319122, 1260326, 1210848, 1168428, 1133182, 1105042, 1082144, 1063510, 1050128, 1041609, 1034954, 1028488]
56093A028488m595j338N06J055K497M184L892K880M286P384Q724Q070Q048Q859
56079A082940Q598P858Q746J0308J0121R288J0518J2646J2679J1828J3524J6733
56067A215787J7566J6398J6937J9157J9747J8855J9632K1650K1569J9932K0514
56056A427744K3097K3754K2131K1687K2718K2013J9525J8577J9388J9056J7929
56045A657619J9142K1998K2796K2085K3843K7643K9099K8032K8607L1286L2461
56034A944611L2147L4116L8104L9934L9747M1935M6561M9143M9289N1079N4474
56023B421140N5190N3550N4440N7882N8974N7786N9722O5173O8678O9394P2361
56012C094290P8180Q1830Q3039Q7293R4824R9431J00016J02499J08379J12610
$$ y = [1028488, 1023893, 1022555, 1023061, 1024116, 1026613, 1030797, 1034689, 1037569, 1041855, 1049239, 1057963, 1066033, 1074081, 1082940, 1091538, 1099396, 1108142, 1118450, 1128571, 1137859, 1148377, 1161023, 1173702, 1185530, 1199054, 1215787, 1233353, 1249751, 1266688, 1285845, 1305592, 1324447, 1344079, 1365729, 1387298, 1407230, 1427744, 1450841, 1474595, 1496726, 1518413, 1541131, 1563144, 1582669, 1601246, 1620634, 1639690, 1657619, 1676761, 1698759, 1721555, 1743640, 1767483, 1795126, 1824225, 1852257, 1880864, 1912150, 1944611, 1976758, 2010874, 2048978, 2088912, 2128659, 2170594, 2217155, 2266298, 2315587, 2366666, 2421140, 2476330, 2529880, 2584320, 2642202, 2701176, 2758962, 2818684, 2883857, 2952535, 3021929, 3094290, 3172470, 3254300, 3337339, 3424632, 3519456, 3618887, 3718903, 3821402, 3929781, 4042391]
56002D042391J14688J20374J30133J37602J41805J48966J60014J68767J74744
55993E339484J84777J99330K10842K18462K30379K48470K65215K79076K97735
55984G473770L22510L45445L65749L92635M27682M61701M93580N33960N85414
55975A1402446O38226O91260P56590Q37531R23806J015262J127473J266510J422683
55966B0081787J597679J812016K076940K387668K755078L213806L787761M481150
55958D2193885N315554O337750P578267R050850J0815907J2994225J5691624J8968762
55950A28946824K2909495K7596608L2845916L7882511M1269306M1183184L5985100
55943C68618944K5040810R506790p618730k2644133l2921397l7841805l8439056
$$ y = [4042391, 4157079, 4277453, 4407586, 4545188, 4686993, 4835959, 4995973, 5164740, 5339484, 5524261, 5723591, 5934433, 6152895, 6383274, 6631744, 6896959, 7176035, 7473770, 7796280, 8141725, 8507474, 8900109, 9327791, 9789492, 10283072, 10817032, 11402446, 12040672, 12731932, 13488522, 14326053, 15249859, 16265121, 17392594, 18659104, 20081787, 21679466, 23491482, 25568422, 27956090, 30711168, 33924974, 37712735, 42193885, 47509439, 53847189, 61425456, 70476306, 81292213, 94286438, 109978062, 128946824, 151856319, 179452927, 212298843, 250181354, 291450660, 332633844, 368618944, 393659754, 403166544, 395547814, 372903681, 339982284, 302140479, 263701423]
55936B63701423l6272092l2647522k8474506k4350188k0591547j7292940j4460056
55929H9612572j2088948j0141415q534886p197636o096356n197695m448521l810844
55921C2096271l277925k840430k469560k145879j873146j650536j458985j286382
55913A5093428j140021j022651r20127q23402p40332o75270o17678n60779n11989
55904H081179m75203m41076m04130l72207l49814l28300l01490k75892k56861
55895D876206k38988k18465k01269j90825j80343j65231j51109j42241j33639
55886C254096j21753j11674j06615j00965r0692q0560p4510o8821o1156n6761
55876B380589n9151o3511o5334o7047p0513p1657o8222o4718o4202o3025n8628
$$ y = [263701423, 227429331, 194781809, 166307303, 141957115, 121365568, 104072628, 89612572, 77523624, 67382209, 58847323, 51649687, 45553331, 40355636, 35907115, 32096271, 28818346, 25977916, 23508356, 21362477, 19489331, 17838795, 16379810, 15093428, 13953407, 12930756, 12010629, 11187227, 10446895, 9771625, 9153947, 8593168, 8081179, 7605976, 7164900, 6760770, 6388563, 6038749, 5710449, 5408959, 5133067, 4876206, 4637218, 4418753, 4217484, 4026659, 3846316, 3681085, 3529976, 3387735, 3254096, 3132343, 3020669, 2914054, 2813089, 2722397, 2641837, 2567327, 2498506, 2437350, 2380589, 2321438, 2257927, 2192593, 2125546, 2055033, 1983376, 1915154, 1850436, 1786234, 1723209, 1664581]
55865A664581n4508n2651m9255m2839l8395l8423l7962l3703l0021l0504l1281
55854A225039k8516k5190k4683k4534k2282k0888k2766k4655k3843k3303k5446
55843I58933k6870k4641k1809k1494k1296j8805j6870j8015j9093j6968j4285
55832G38787j4211j4537j2353r757r547r741p693n391n603o839o895p338r758
55819F19124j1656j0753r383j0102j0913r428p697q199q936p320n153n065n477
55806E09042l865j565q14k84J906M027M039L763N342O767N406K835J701Q82j669
55791E37513m314m642m168n453p155o612m868m527m929m028k906l937o404q171
55777D65399r761j2545j4831j4071j1312r392q320o355l962k759k093n42P92J93
$$ y = [1664581, 1610073, 1557422, 1508167, 1465328, 1426933, 1388510, 1350548, 1316845, 1286824, 1256320, 1225039, 1196523, 1171333, 1146650, 1122116, 1099834, 1078946, 1056180, 1031525, 1007682, 984379, 958933, 932063, 907422, 885613, 864119, 842823, 824018, 807148, 789133, 770040, 753072, 738787, 724576, 710039, 697686, 687929, 678382, 668641, 660948, 655557, 649954, 643115, 636220, 628882, 619124, 607468, 596715, 587332, 577230, 566317, 556889, 549192, 540993, 532057, 524737, 519584, 514519, 509042, 505177, 503612, 502798, 502514, 504420, 508447, 512486, 516249, 521591, 528358, 533764, 536599, 538300, 539182, 537513, 533199, 528557, 524389, 518936, 511781, 505169, 500301, 495774, 490845, 486817, 483911, 479974, 473570, 465399, 455638, 443093, 428262, 414191, 402879, 393487, 385167, 378812, 374850, 372091, 369998, 369456, 370248, 370441]
55763C70441r82l26J421J853J124J035J282K97j417k175k197k626k905k296k366
55748C60163m656p466q357q253r546j1623j2037j0825r946r558q347o646n773
55735B47130n228l775k318k392k938j898QM52n90j423k060l639n216m763k846
55720B08504j938k529k959k607k233j723m73N46O0q66l61Q75Q23j09J81J587K032
55703A98810J215P63Q88J45j409k062j588j599k485k854k313k090k545k543j717
55688A78616j057q87l50P83J726K249K846L435L531L554M179M834M576L939L967
55673B15941M060K919J096L45Q57J271J140J204J523J392R14P92R08Q31J121K304
55657B38618L304K862J741J405J375K08j664k520k247k273l039l752m195m659
$$ y = [370441, 369459, 369133, 370554, 372407, 373531, 374566, 375848, 376145, 374728, 372553, 370356, 367730, 364825, 362529, 360163, 355507, 348041, 339684, 331431, 321885, 310262, 298225, 287400, 277454, 267896, 259549, 252903, 247130, 241902, 238127, 235809, 233417, 230479, 228581, 228589, 229041, 228451, 227028, 224968, 221329, 216113, 211350, 208504, 206566, 204037, 201078, 198471, 196238, 194515, 194042, 194588, 194648, 193782, 193421, 194296, 195119, 195010, 195191, 196778, 198810, 200025, 200788, 201676, 201821, 200412, 198350, 196762, 195163, 192678, 189824, 187511, 185421, 182876, 180333, 178616, 177559, 176672, 176322, 177105, 178831, 181080, 183926, 187361, 190892, 194446, 198625, 203459, 208035, 211974, 215941, 220001, 222920, 224016, 224361, 225218, 226489, 227629, 228833, 230356, 231748, 232662, 233454, 234362, 235193, 236314, 238618, 241922, 244784, 246525, 247930, 249305, 249513, 247849, 245329, 243082, 240809, 237770, 234018, 229823, 225164]
55643B25164m644l698k844l093l516l012k754m203n894n382l419k798l658l545
55629A72704j946j044j651j923q68P5j98p94r60j249j817j833j266j161j569j412
55613A53088q08j142k453l034k274j520j519j335n58l44j327k412k574k119j552
55598A28117q58l62o38j162p57L68Q37M82N27J234J451Q60N38Q78R91O38O79J241
55580A35064J431J338K116L679M516M323M654O200P736Q522R591J1597J3476J4206
55566B28449J4138J3555J1720Q388M613J180k228n552p794q660r205j0037j0539
55553B28028j0454j0510j0752j0045q132o360n570m943l820k852k436j736l64
55540A50054O38O07M41R13J306Q75K15Qj37n29m56M17R80K39j135j962k220k503
$$ y = [225164, 220520, 216822, 213978, 210885, 207369, 204357, 201603, 197400, 191506, 186124, 182705, 179907, 176249, 172704, 170758, 169714, 168063, 166140, 165272, 165347, 165149, 164355, 163395, 162146, 160329, 158496, 157230, 156069, 154500, 153088, 152280, 151138, 148685, 145651, 143377, 141857, 140338, 139003, 138445, 138101, 136774, 134362, 131788, 129669, 128117, 127259, 126897, 126259, 125097, 124340, 124708, 125545, 126027, 126554, 127788, 129239, 130099, 130637, 131515, 132506, 133144, 133823, 135064, 136495, 137833, 139949, 143628, 148144, 152467, 157121, 163321, 171057, 179579, 189170, 200767, 214243, 228449, 242587, 256142, 267862, 276250, 280863, 282043, 279815, 274263, 266469, 257809, 248604, 238567, 228028, 217574, 207064, 196312, 186267, 178135, 171775, 166205, 161262, 157442, 154590, 152154, 150418, 150054, 150692, 151299, 151740, 152653, 153959, 154834, 155049, 155057, 154920, 154391, 153935, 154352, 155332, 155571, 154436, 152474, 150254, 147751]
55522A47751k761k696k579k787l100l162l019k691k022j352j365k034k549k538
55508A13096k361k116j625j317j728k107j168O34J397N83l48m88n29q50o54J44
55492A00563K52p58j542j264q52r73p67J42M27p01j904j880j387j448j355k42
55476H6311R16Q36K12M63J306J511J156J147J307P77j38l29K78P54P08M52K3o72
55458I7018j108p70j50k8k09o6J80j16p45r84q21p29o17n6O52P73L11oJ32L41
55438I3002L24J98R6L4N6J65K68M57R62J609J819J427R03N34N4o21j052r93q19
55419I8423p83n59J01R03J511J863J869J426Q65O30N17Q6l74l71l90j161j976
55402A02580j497j40L02m69r25o09q80k026k194n43R45N25n82m15N65P52K86L61
$$ y = [147751, 144990, 142294, 139715, 136928, 133828, 130666, 127647, 124956, 122934, 121582, 120217, 118183, 115634, 113096, 110735, 108619, 106994, 105677, 103949, 101842, 100674, 101308, 102705, 103288, 102940, 102452, 101923, 101073, 100419, 100563, 100815, 100057, 98515, 97251, 96399, 95426, 94659, 94801, 95228, 94527, 92623, 90743, 89356, 87908, 86553, 86311, 87227, 88063, 88275, 88738, 90044, 91555, 92711, 93858, 95165, 95942, 95804, 95475, 95753, 96507, 97215, 97667, 97690, 97018, 95910, 95140, 94990, 94962, 94753, 94687, 94867, 94751, 94006, 93022, 92201, 91472, 90855, 90799, 91451, 92224, 92535, 92529, 92661, 93002, 93326, 93524, 93620, 93654, 93710, 93875, 94143, 94600, 95562, 97171, 98990, 100417, 101320, 101854, 101908, 101287, 100235, 99242, 98423, 97640, 97081, 97182, 98085, 99596, 101459, 103328, 104754, 105619, 106249, 106766, 106852, 106478, 106107, 105717, 104556, 102580, 101083, 100943, 101245, 100776, 99851, 99242, 98362, 96336, 94142, 93599, 94544, 95069, 94487, 94072, 94637, 95389, 95675, 96036]
55384I6036P55L40o28q72k61J57j6k25j76jM09R99J046K16n63m21m6m92j355j500
55364I3402r42n05l12OJ17m61j159j067m10m2M9L50O00K78j19K27R44R97L56j98
55344I2111m53p04p21j68M41M71L79P97J107M00o68p33MJ20o11r70m53Q1J01J38
55324I0669N05P04M60J75N9j45m03l79k46m75q27o12P0M56M33O09J007Q72J4q15
55304I2131j082j088j131j003n50K7O26J305J823J783J276P62L64o4l00J1O09
55287I5499Q04M05j11k32K34J083J510N73j457k856k398q98P2K54L82N27K30j40
55269I3481K35J089J210K17r87j457r47L91J927K489J478j36r68j016j128j227
55253I4651n82N19R96P46N74M86k53j279j201J31J155R40M15N42P22k6j403k268
$$ y = [96036, 96791, 97131, 96503, 95631, 95370, 95527, 95511, 95286, 95110, 95109, 95518, 96517, 97563, 97779, 97216, 96795, 96749, 96257, 94902, 93402, 92460, 91955, 91643, 91649, 91766, 91305, 90146, 89079, 88669, 88627, 88676, 89026, 89626, 89904, 89785, 90012, 90956, 91953, 92309, 92111, 91658, 90954, 90233, 90065, 90506, 90977, 91356, 92153, 93260, 93660, 92992, 92259, 92263, 92383, 91772, 90802, 90349, 90430, 90531, 90669, 91174, 91878, 92338, 92513, 92572, 92427, 92024, 91645, 91399, 90924, 90097, 89485, 89555, 90011, 90444, 91053, 92060, 92932, 92946, 92131, 91049, 89961, 88830, 87827, 87277, 87304, 87930, 89235, 91058, 92841, 94117, 94879, 95243, 95179, 94879, 94890, 95499, 96303, 96708, 96597, 96365, 96599, 97682, 99192, 99765, 98308, 95452, 93054, 92156, 92228, 92482, 92864, 93391, 93621, 93481, 93716, 94805, 96015, 96232, 95245, 93788, 92841, 93232, 95159, 97648, 99126, 98990, 98022, 97006, 95878, 94651, 94069, 94588, 95584, 96330, 96904, 97390, 97137, 95858, 94657, 94788, 95943, 96883, 97298, 97840, 98562, 98536, 97133, 94865]
55235I4865k079j137l2O81P49N06M27M16J19k45k04k5l06p34m37L75M73m60j253
55216I1699r85r9O30J075J235Q23l0n42l04K34O16Q62Q64K86n54p50j91R4n33
55197I4430j381j572j188p00j35N13Q34O18L66M81O14L31j45l90m33m40k38K88
55179I1853P81Q49O06M12L68L28J87p0k83j25M81J020R52M87K04R6k91q37q92
55160I6126l53J55K75K94L94L67K37L42O47P09M55K36J25m8j9N48J135Q68K3k71
55140A02245J18J36n27q10j62L77j37r97r99j98M69N64K98j21m81m60j57j87o52
55121I8319p69j54L94J31l22K3R08J218O43ln6K45L03j10o43o11L25J506J738
55102A03085P45l15k59O72J356J323J015Q27N91O5n89r70q39l65ppj3M94J371
$$ y = [94865, 92786, 91649, 91617, 92298, 93047, 93553, 93980, 94396, 94515, 94270, 94066, 94041, 93735, 93001, 92564, 92939, 93412, 92952, 91699, 90714, 90615, 91245, 92320, 93555, 94378, 94348, 93806, 93502, 93736, 94352, 95214, 96078, 96364, 95810, 95060, 94869, 94963, 94430, 93049, 91477, 90289, 89589, 89454, 89967, 90801, 91419, 91785, 92266, 92880, 93211, 93066, 92676, 92243, 91803, 91565, 91853, 92634, 93483, 94089, 94501, 94869, 95197, 95384, 95314, 95031, 94906, 95387, 96407, 97359, 97846, 98050, 98146, 97855, 97018, 96126, 95773, 95928, 96203, 96497, 96891, 97258, 97495, 97837, 98484, 99193, 99648, 99884, 100009, 99961, 99942, 100490, 101625, 102493, 102516, 102245, 102363, 102499, 101972, 101162, 101000, 101377, 101240, 100243, 99244, 99046, 99515, 100079, 100377, 100256, 99775, 99315, 99158, 98971, 98319, 97550, 97396, 97790, 97921, 97599, 97622, 98530, 99748, 100391, 100388, 100332, 100577, 100880, 100770, 100127, 99516, 99841, 101347, 103085, 103830, 103515, 103256, 103928, 105284, 106607, 107622, 108449, 109040, 109105, 108516, 107546, 106707, 106342, 106335, 106328, 106315, 106809, 108180]
55083A08180J831J471Q18O27R63J244R04j48j414k039j509k77O14N98O7k75p8
55066A11577N37J169J381J134Q78Q66O33k85j403j804j444j085j028q57m79l98
55050A09392p62r88p10k82o1J2j03o73j438j536o10O15J229J074M89j96o88p40
55032A04024m56j28K37P48J058P44J55L5L04J65n08r04n49J12N49O70L48n03j290
55013A04811j184l35M23J011J908K545J678k97j211n6J633K219K099K286K451
54998A19981J810P34M0l40p01n09N22J278N69r75j785j518j035p30k95K15L94
54981A17655L77O42J106J303J211R60K66q98j552q47M39P85R0l12K92J107J150
54964A23774M42l89r09r91o75j37N34J326J937J768P55k84o51o24p94j064r98
$$ y = [108180, 110011, 111482, 112300, 112927, 113890, 115134, 116038, 115890, 114476, 112437, 110928, 110651, 111265, 111863, 111930, 111655, 111577, 112114, 113283, 114664, 115798, 116676, 117542, 118175, 117890, 116487, 114683, 113239, 112154, 111126, 110269, 109790, 109392, 108630, 107642, 106932, 106650, 106589, 106601, 106498, 105825, 104387, 102851, 102241, 102856, 104085, 105159, 105648, 105452, 104764, 104024, 103568, 103440, 103677, 104425, 105483, 106227, 106382, 106417, 106721, 106886, 106378, 105474, 104925, 105037, 105586, 106256, 106604, 106101, 104811, 103627, 103292, 103715, 104726, 106634, 109179, 110857, 110560, 109349, 109293, 110926, 113145, 115244, 117530, 119981, 121791, 122525, 122565, 122225, 121524, 121015, 121537, 122815, 123384, 122409, 120624, 119106, 118071, 117341, 117046, 117261, 117655, 118032, 118674, 119780, 121083, 122294, 123254, 123520, 122622, 121070, 120223, 120662, 121447, 121537, 121225, 121517, 122624, 123774, 124216, 123827, 122918, 121927, 121252, 121115, 121649, 122975, 124912, 126680, 127435, 127151, 126500, 125876, 125082, 124018, 123020]
54947A23020o15j23N76J343J420M19p71j107q88j099j687j720r70j67L01Q04J502
54930A20238J963J912J597J287J057J062J415J803J890J938K438L314M097M832
54916A50843N911P166P863P672O938N924M406K200m17k871m656n558n875o178
54902A73368o592o572n731m514l630l187k877k607k443k293k130k174k360k123
54888A24135j219k26K95N88J091J636J885J969K036J860J549J892L165M417M871
54873A49944N175O218P460P764P102O121M692K417N1j319k135l714n882p009o459
54858A70426n356m633l955l001k357k477k890l017k849k482j920j606k093k978
54844A28812l184k537j961j864j589q49l71n29n85m3L74k3o21m59K36N08J54j43
$$ y = [123020, 122405, 122282, 122858, 124201, 125621, 126040, 125269, 124162, 123274, 122175, 120488, 118768, 117798, 117631, 117932, 118736, 120238, 122201, 124113, 125710, 126997, 128054, 129116, 130531, 132334, 134224, 136162, 138600, 141914, 146011, 150843, 156754, 163920, 171783, 179455, 186393, 192317, 196723, 198923, 198506, 195635, 190979, 185421, 179546, 173368, 166776, 160204, 154473, 149959, 146329, 143142, 140265, 137658, 135215, 132922, 130792, 128618, 126258, 124135, 122916, 122690, 122985, 123573, 124664, 126300, 128185, 130154, 132190, 134050, 135599, 137491, 140656, 145073, 149944, 155119, 161337, 168797, 176561, 183663, 189784, 194476, 196893, 196944, 195625, 193490, 189776, 183894, 176885, 170426, 165070, 160437, 156482, 153481, 151124, 148647, 145757, 142740, 139891, 137409, 135489, 133883, 131790, 128812, 125628, 123091, 121130, 119266, 117677, 116828, 116457, 115928, 115343, 115300, 115674, 115651, 115030, 114571, 114807, 115315, 115469, 115326]
54826A15326O9N27P41M85j01n63n15j21O8j49m61o68r10j085o94L85J505J980
54808A15819J781J256O20M6j69J48Q69J786K672L059K490J192N2l07j44j10m89
54791A30571j019j225q40j45J68k07p17p00l52l43o66o30J5P00Q77O05J91j12
54773A26171R3J124K618L667L800L395L101L333M305N925P528Q287Q082P510P059
54758A95998O743O448N997M862K584m61l263n287o736p780q199p936p322o566
54744A69082n608m572l805l391l150l034l033k805k085j289r96r55n21J66L20
54729A34324p0j19O06J529K117K529K996L420L823M458N212N654N790N929N827
54714A84025M863L204J750Q12j67j444k648l770n206o552o732n750n001n130n041
$$ y = [115326, 115395, 115922, 116663, 117148, 117047, 116484, 115969, 115848, 115916, 115767, 115306, 114638, 113728, 112643, 111949, 112334, 113839, 115819, 117600, 118856, 119476, 119522, 119353, 119501, 120370, 122156, 124828, 127887, 130377, 131569, 131621, 131314, 131170, 131060, 130571, 129552, 128327, 127487, 127342, 127510, 127303, 126586, 125886, 125534, 125191, 124525, 123895, 123910, 124610, 125487, 126092, 126283, 126171, 126264, 127388, 130006, 133673, 137473, 140868, 143969, 147302, 151607, 157532, 165060, 173347, 181429, 188939, 195998, 202741, 209189, 215186, 220048, 222632, 222171, 218908, 213621, 206885, 199105, 190906, 182970, 175648, 169082, 163474, 158902, 155097, 151706, 148556, 145522, 142489, 139684, 137599, 136310, 135314, 134359, 133838, 134004, 134324, 134254, 134135, 134741, 136270, 138387, 140916, 143912, 147332, 151155, 155613, 160825, 166479, 172269, 178198, 184025, 188888, 192092, 193842, 194654, 194487, 193043, 190395, 186625, 181419, 174867, 168135, 162385, 157384, 152254, 147213]
54699A47213l847k468k155k464k087r19m9%k14j30N8j81j038k071k438j731o44
54682A24835k04l78j86O17J095P14J79R2r7r70j916k056j521r34l18M80R31N20
54664A20883k41m80k73l18o61p52m27JM40R59J289J176R40R88J030O15Q6J71P70
54645A26196R99M34m68j129j382j213o51OL54L17J62J05K04M24N48K48l96q06
54627A23952o08r0L36O83R76Q44N6q65j201r56o81o34n97k98L24J102J542J131
54609A25016M7q59j047q29n91j93M79R83R89Q22P96N90Kl65N0P32P89K80n1qk5
54588A27607k48m20m93n91n20r1K97J33k64r7O82J268J121N18o1m06m53k46p5
54569A27661k02m22l41N8M86Q24J059J004N71J90L05N95K93o86j467j209nJ251
$$ y = [147213, 143366, 140898, 138743, 136279, 134192, 133273, 133224, 133224, 133010, 132880, 132938, 132757, 131719, 129648, 127210, 125479, 124835, 124631, 124253, 124067, 124684, 125779, 126493, 126672, 126764, 126667, 125697, 123781, 121725, 120204, 119270, 118952, 119432, 120363, 120883, 120642, 120162, 119889, 119571, 118910, 118158, 117731, 117732, 118172, 119131, 120420, 121596, 122536, 123524, 124554, 125169, 125255, 125426, 126196, 127195, 127629, 127161, 126032, 124650, 123437, 122786, 122792, 123146, 123463, 123625, 123730, 123934, 124358, 124906, 125154, 124758, 123952, 123344, 123254, 123590, 124273, 125249, 126093, 126149, 125284, 124083, 123127, 122446, 121812, 121215, 120917, 121241, 122343, 123885, 125016, 125063, 124204, 123157, 122328, 121737, 121544, 122023, 123006, 123995, 124817, 125613, 126203, 126205, 125840, 125890, 126622, 127411, 127691, 127640, 127632, 127607, 127359, 126939, 126446, 125855, 125335, 125244, 125541, 125674, 125410, 125313, 125995, 127263, 128384, 128902, 128841, 128435, 127982, 127736, 127661, 127459, 127037, 126696, 126754, 127240, 128064, 129123, 130127, 130698, 130888, 131193, 131788, 132081, 131395, 129928, 128719, 128714, 129965]
54551A29965J695J204M24Lr8l24o68p12n18n95q26l87Q26J733J668J371J623J854
54533A38238J241L09L4J65j83p56o00O1K4p67r92j11P12M11m99j044j275j790
54515A33178k400k294j169L66J503J854J510Q17J23l62n51n21n39p82r49n29L25
54498A29580P85M62KO6L92M60M50P30R99Q03M45M09L45k57q26l74Q00J351Q37
54479A37459J99K06N68P63P04L37l95r65o00N09J296J310J187J385J478J167R34
54462A47542J146J336J064P04O84O28n6j101j657j383p70m40m95n50k77J09M9
54445A46533m95p45j22P77R16L78J69O01P97Q4j037j644j486r31l67j6J11K88
54427A43811O89R64P32L54M69Q12M86m31o96L25J671K118J723J288J025N16m09
$$ y = [129965, 131660, 132864, 133288, 133291, 133193, 132869, 132201, 131489, 130971, 130376, 129550, 129163, 129989, 131722, 133390, 134761, 136384, 138238, 139479, 139788, 139822, 139987, 139804, 139048, 138448, 138509, 138533, 137766, 136774, 136663, 137375, 137786, 137287, 136243, 134968, 133178, 130778, 128484, 127315, 127681, 129184, 131038, 132548, 133365, 133488, 133126, 132575, 132054, 131515, 130733, 129784, 129255, 129580, 130365, 130827, 130829, 130895, 131287, 131747, 132197, 132927, 133926, 134729, 135174, 135583, 135928, 135671, 134845, 134471, 135271, 136622, 137459, 137658, 137864, 138432, 139195, 139899, 140236, 139841, 138876, 138276, 138785, 140081, 141391, 142578, 143963, 145441, 146608, 147542, 148688, 150024, 151088, 151792, 152476, 153104, 153048, 151947, 150290, 148907, 148137, 147697, 147202, 146652, 146375, 146484, 146533, 146038, 145293, 145171, 145948, 146864, 147242, 147411, 148012, 148809, 148893, 147856, 146212, 144726, 143795, 143428, 143412, 143523, 143811, 144500, 145464, 146196, 146550, 147019, 147831, 148317, 147886, 147190, 147515, 149186, 151304, 153027, 154315, 155340, 155856, 155447]
54410A55447j395j967j826j049k51j50o57q95l74M02P50O82N33L51J03O0M24R45
54392A51133J263J384J473J515J472J392J165N78j69n21m13m81j113j841k020
54377A54817j583p14N67J989K770K482J734J427J627J828J895K092K407K534K509
54362A78381K671K998L031K529J795J176O47K1o72j274j825k544l397l812l218
54347A76507j926j118j528k437k527j583o96o82j083j014m29nj42n34o59l54O2
54330A59852J64r0l25l02k75n17p58n75j78j47m77n92l01o6j72l36l72n53r68
54311A53012j121o21J82O06M02j90q15j170j096p11l14r4r4l10m92j24Q99J803
54293A49752J792J153P75P51M16l55r18j003j050j181r03q7O93J135J507J762
$$ y = [155447, 154052, 152085, 150259, 149210, 148959, 148809, 148152, 147257, 146883, 147285, 148035, 148717, 149250, 149601, 149704, 149764, 150188, 151133, 152396, 153780, 155253, 156768, 158240, 159632, 160797, 161375, 161206, 160685, 160272, 159791, 158678, 156837, 154817, 153234, 152520, 153087, 155076, 157846, 160328, 162062, 163489, 165116, 166944, 168839, 170931, 173338, 175872, 178381, 181052, 184050, 187081, 189610, 191405, 192581, 193228, 193249, 192577, 191303, 189478, 186934, 183537, 179725, 176507, 174581, 173463, 171935, 169498, 166971, 165388, 164692, 164010, 162927, 161913, 161484, 161479, 161337, 160803, 160144, 159790, 159852, 160016, 159926, 159601, 159299, 159024, 158507, 157749, 157174, 156996, 156849, 156372, 155780, 155479, 155413, 155241, 154905, 154533, 153980, 153012, 151891, 151270, 151452, 152058, 152460, 152270, 151455, 150285, 149189, 148478, 148164, 148070, 147976, 147666, 147174, 147050, 147949, 149752, 151544, 152697, 153472, 154223, 154639, 154284, 153366, 152363, 151313, 150132, 149229, 149142, 149835, 150970, 152477, 154239]
54277A54239J478R26R84J473J034o41j871j297Q2N31J24J81R25J346R91M69J87
54260A61161n9j83L63J565K490K298J098k54q65l91O34J232R87L92n8n05j052
54243A68853j196o51j03k51o55m54K16N18L04J00qm30r89r54j91N29N53l3q35
54224A64323j473j510q09n8j46q94j159l83O44Q37O7r02j277q42k3N36O32O46
54206A58209Q00O75n9p92o81K7K42l38p89l39N55R68P54N25O57P93L89m87j066
54187A60043p25J91P71P40O95R08P14k77j140p52M63J001L18o55j004q10m43J47
54169A60185R87J635J629R73J1p59p50K09J295J335K50p73q01j98J34m1l70o32
54151A64319q40q67n06J45O79P47K89m79j201j585j564j199n30K99R70J269J303
$$ y = [154239, 155717, 156643, 157627, 159100, 160134, 159493, 157622, 156325, 156407, 156938, 157062, 157243, 158168, 159514, 160505, 160974, 161161, 161102, 160919, 161282, 162847, 165337, 167635, 168733, 168479, 167614, 167223, 167857, 169089, 170076, 170468, 170410, 169905, 168853, 167657, 167006, 166903, 166652, 165997, 165543, 165759, 166277, 166581, 166681, 166673, 166243, 165254, 164300, 164109, 164638, 165191, 165158, 164323, 162850, 161340, 160531, 160473, 160327, 159433, 158274, 157891, 158535, 159372, 159439, 158537, 157260, 156418, 156395, 156931, 157563, 158209, 159009, 159684, 159625, 158833, 158152, 158179, 158421, 158083, 157294, 156955, 157510, 158478, 159232, 159757, 160414, 161207, 161596, 161109, 160043, 159318, 159509, 160280, 161020, 161715, 162623, 163337, 163060, 161920, 161168, 161631, 162632, 162950, 162295, 161291, 160481, 160038, 160185, 161172, 162807, 164436, 165409, 165420, 164661, 163911, 164120, 165415, 166750, 167000, 166227, 165426, 165228, 165362, 165321, 164951, 164319, 163479, 162612, 162106, 162251, 162930, 163677, 163966, 163487, 162286, 160701, 159137, 157938, 157408, 157707, 158677, 159946, 161249]
54134A61249J189P92J45j96J66O81M54m05q60m35J45R7l46m81j48L03O57R13R72
54115A64892P11L10R1J32K56L49M31N18N89O55Q07J154J725K327K542K147J497
54098A81133J262J698K387K788K837K819K823K541J634J46j474k738l435l571
54084A90850l207k485j771j403j304j074n10K37J013J802K413K512K157J911K125
54069A93266K504K622K486K306K089J796J588J493J160L06q85k021k864l195k806
54054A99845j982j408j261r42j40N29N52M79J055J993K476K441K482K866L473
54039B12458M366N525O317O231N872O210P089P507P230P063P436P809P589O810
54025C05512N738M587L712L307K961K183J293R62J057Q58K87j29m16j217k611
$$ y = [161249, 162438, 163230, 163375, 163179, 163345, 164026, 164480, 164075, 163215, 162780, 162925, 163022, 162676, 162195, 162047, 162350, 163007, 163920, 164892, 165603, 165913, 166004, 166136, 166392, 166741, 167172, 167690, 168279, 168934, 169741, 170895, 172620, 174947, 177489, 179636, 181133, 182395, 184093, 186480, 189268, 192105, 194924, 197747, 200288, 201922, 202068, 200594, 197856, 194421, 190850, 187643, 185158, 183387, 181984, 180680, 179606, 179096, 179333, 180346, 182148, 184561, 187073, 189230, 191141, 193266, 195770, 198392, 200878, 203184, 205273, 207069, 208657, 210150, 211310, 211616, 210731, 208710, 205846, 202651, 199845, 197863, 196455, 195194, 194252, 194112, 194641, 195193, 195672, 196727, 198720, 201196, 203637, 206119, 208985, 212458, 216824, 222349, 228666, 234897, 240769, 246979, 254068, 261575, 268805, 275868, 283304, 291113, 298702, 305512, 311250, 315837, 319549, 322856, 325817, 328000, 329293, 330255, 331312, 332170, 332457, 332328, 331912, 330695, 328084]
54010C28084l970n055o098o839o686n996n849o259o030m767l658l646m099m090
53996B55042l775l610l297k517j821j764j864j487j086j505k496k999k624k004
53982B22193j739j705j467q42l6N87Q99J129J395J276M78l22j67O84J060P18O43
53965B24784J259J719J589J772K865L931M082M187N650Q169J0066J0230Q659N629
53951B94591J670j947l961m367m169m072m106m085l635k244p3J776K614L178M325
53936B75495N463N529M847M550M545L705J960O71O62J303J826K302K926L480L983
53921C23247M861O047O738O618O454P018Q101Q987R370R363R194R180R510R735
53907D34423R100P574O021N032M240K991J233o63k356l513l823l441l071l260
$$ y = [328084, 324114, 319059, 312961, 306122, 299436, 293440, 287591, 281332, 275302, 270535, 266877, 263231, 259132, 255042, 251267, 247657, 244360, 241843, 240022, 238258, 236394, 234907, 233821, 232316, 229820, 226821, 224197, 222193, 220454, 218749, 217282, 216440, 216404, 216991, 217890, 219019, 220414, 221690, 222168, 221846, 221679, 222363, 223423, 224141, 224784, 226043, 227762, 229351, 231123, 233988, 237919, 242001, 246188, 251838, 260007, 270073, 280303, 288962, 294591, 296261, 294314, 290353, 285986, 281817, 277745, 273639, 269554, 265919, 263675, 263602, 265378, 267992, 271170, 275495, 280958, 286487, 291334, 295884, 300429, 304134, 306094, 306765, 307427, 308730, 310556, 312858, 315784, 319264, 323247, 328108, 334155, 340893, 347511, 353965, 360983, 369084, 378071, 387441, 396804, 405998, 415178, 424688, 434423, 443523, 451097, 457118, 462150, 466390, 469381, 470614, 469951, 467595, 464082, 460259, 456818, 453747, 450487]
53893D50487l945m843n885p041q109q968r701j0300j0505j0153r385q448p551
53880C45653o885o450n886m979m216m236m770m836m113l411l446l896m101m030
53866B80398m008l970l610l001k544k390k386k504k912l593m116l928k877j529
53852B37030p76r87j593j795j512j245j216j263j443j957k408j960o01N48O41
53837B19463J54J6L06N09N34O28O48L16O3O85K022K781K092N85m86p15o24n91
53819B28386l92J20M95K24m08n01M07J758K608K652K368K349K743L322L808M085
53803B54024M313M825N714O555O802O432N940N667N449N041M546M227M117M042
53789C27694L891L678L422L101K722K282J755J111L70l44q41j064j349k237l803
$$ y = [450487, 446542, 441699, 435814, 428773, 420664, 411696, 401995, 391695, 381190, 371037, 361652, 353204, 345653, 338768, 332318, 326432, 321453, 317237, 313001, 308231, 303395, 299282, 295871, 292425, 288529, 284428, 280398, 276390, 272420, 268810, 265809, 263265, 260875, 258489, 255985, 253073, 249480, 245364, 241436, 238559, 237030, 236254, 235267, 233674, 231879, 230367, 229122, 227906, 226643, 225200, 223243, 220835, 218875, 218274, 218822, 219463, 219617, 219633, 219939, 220448, 220982, 221610, 222258, 222574, 222637, 223322, 225344, 228125, 230217, 230802, 230316, 229601, 228977, 228386, 227994, 228114, 228609, 228833, 228425, 227924, 228331, 230089, 232697, 235349, 237717, 240066, 242809, 246131, 249939, 254024, 258337, 263162, 268876, 275431, 282233, 288665, 294605, 300272, 305721, 310762, 315308, 319535, 323652, 327694, 331585, 335263, 338685, 341786, 344508, 346790, 348545, 349656, 350026, 349682, 348841, 347777, 346428, 344191, 340388]
53774C40388n382o241o406o428o509o328n754n133m731m394l994l760l781l642
53760B67905k997k259k210k968l720l643k848k232k455l169l375k638j597j131
53746B30663j213j115n77r6OQ9M14N65K29m9L49R17N53p69j775j503m26M13O43
53727B27318M97R0m90o36L57K225L641L593K454J403J054J016P39L41L62R61J669
53710B46594J916J669J430J684K418L215L659L610L150K446J786J539J877K566
53696B79559L204L663M091M475M540M143L527K959K342J454M58k09l43j65k2r9
53680C13577n26j333k222k620k237j471j039j148j307r63k06L75M56L33L99O02
53664C00670O28M44L03K14p3n11o36k64J26M8l02m06k22p7P0N37J147J190M85
$$ y = [340388, 335006, 328765, 322359, 315931, 309422, 303094, 297340, 292207, 287476, 283082, 279088, 275328, 271547, 267905, 264908, 262649, 260439, 257471, 253751, 250108, 247260, 245028, 242573, 239404, 236029, 233391, 231794, 230663, 229450, 228335, 227758, 227662, 227668, 227757, 228171, 228736, 228965, 228916, 229265, 230182, 230735, 229966, 228191, 226688, 226262, 226675, 227318, 227815, 227905, 227415, 226779, 227136, 229361, 233002, 236595, 239049, 240452, 241506, 242522, 243261, 243602, 243964, 244925, 246594, 248510, 250179, 251609, 253293, 255711, 258926, 262585, 266195, 269345, 271791, 273577, 275116, 276993, 279559, 282763, 286426, 290517, 294992, 299532, 303675, 307202, 310161, 312503, 313957, 314415, 314206, 313863, 313698, 313676, 313577, 313051, 311718, 309496, 306876, 304639, 303168, 302129, 300981, 299674, 298711, 298505, 298880, 299336, 299669, 300068, 300670, 301298, 301742, 302045, 302259, 302186, 301675, 301039, 300775, 300901, 300949, 300647, 300241, 300019, 299942, 300012, 300549, 301696, 302886, 303371]
53645C03371j44J09R15J329J159J145J712K287K201J775J851K436K599J810P50
53630C25305M19R56J819K650L379L778L752L830M539N304M918L343K017J978K600
53615C70587K801K621K705L007L088L211L939M857M886L955L189L253L528L359
53601D18986L099L308L635L346K426J499R28O11M72N05M38q6r49j611j812j860
53585D32935k063k242k085j744j734k190k594k463j974j626j447j055n14m56j158
53570D07590k052k509k630k753k675k022j073m06k7M39Q75P91L32J77L74J64p41
53553C93854j574j622j177q44n55P3R13J495J759K020K384K704K984L410M030
53538D09854M704N286N668N737N514N216N056N177N786O970Q294R006Q959Q892
$$ y = [303371, 303227, 303336, 304251, 305580, 306739, 307884, 309596, 311883, 314084, 315859, 317710, 320146, 322745, 324555, 325305, 325724, 326680, 328499, 331149, 334528, 338306, 342058, 345888, 350427, 355731, 360649, 363992, 366009, 367987, 370587, 373388, 376009, 378714, 381721, 384809, 388020, 391959, 396816, 401702, 405657, 408846, 412099, 415627, 418986, 422085, 425393, 429028, 432374, 434800, 436299, 437227, 437838, 438310, 438815, 439253, 439167, 438218, 436607, 434795, 432935, 430872, 428630, 426545, 424801, 423067, 420877, 418283, 415820, 413846, 412220, 410773, 409718, 409204, 408748, 407590, 405538, 403029, 400399, 397646, 394971, 392949, 391876, 391470, 391443, 391882, 392757, 393548, 393880, 394057, 394431, 394595, 393854, 392280, 390658, 389481, 388637, 388082, 388155, 389068, 390563, 392322, 394342, 396726, 399430, 402414, 405824, 409854, 414558, 419844, 425512, 431249, 436763, 441979, 447035, 452212, 457998, 464968, 473262, 482268, 491227, 500119]
53524E00119R528J0779J2116J3277J4141J4393J3988J3667J4312J5832J7251J7970
53512F67373J8463J9579K1546K3795K5517K6303K6383K6300K6334K6311K6052
53501I33956K5752K5638K5448K4652K3133K1393K0013J9166J8649J8187J7719
53490A173706J7410J7450J7780J8142J8412J8686J8936J8874J8342J7685J7487
53479A372910J8021J8982J9595J8963J6674J3331J0136P740N758L568J121j345
53467A505454l911o730r468j1560j2896j3688j3908j3420j2634j2342j2849j3735
53455A368313j4661j5874j7671j9780k1460k2099k1687k0885k0538k0783k0791
53444A152084j9799j8256j7258j6891j5929j3471j0171p361n587m599m194m211
$$ y = [500119, 509647, 520426, 532542, 545819, 559960, 574353, 588341, 602008, 616320, 632152, 649403, 667373, 685836, 705415, 726961, 750756, 776273, 802576, 828959, 855259, 881593, 907904, 933956, 959708, 985346, 1010794, 1035446, 1058579, 1079972, 1099985, 1119151, 1137800, 1155987, 1173706, 1191116, 1208566, 1226346, 1244488, 1262900, 1281586, 1300522, 1319396, 1337738, 1355423, 1372910, 1390931, 1409913, 1429508, 1448471, 1465145, 1478476, 1488612, 1496352, 1502110, 1505678, 1506799, 1505454, 1501543, 1494813, 1485345, 1473785, 1460889, 1447201, 1433293, 1419873, 1407239, 1394897, 1382048, 1368313, 1353652, 1337778, 1320107, 1300327, 1278867, 1256768, 1235081, 1214196, 1193658, 1172875, 1152084, 1132285, 1114029, 1096771, 1079880, 1063951, 1050480, 1040309, 1032948, 1027361, 1022762, 1018568, 1014357]
53432A014357m020k950j386m84n82m96J073L919O559P882Q097Q205R053J0830
53418A060057J3117J5215J6736J7954J9424K1220K2866K4117K5451K7470L0060
53407A293687L2494L4254L5443L6441L7528L8899M0719M2940M5239M7314M9159
53396A734117N0885N2392N3395N3853N4216N5095N6543N7766N7832N6708N5325
53385B338127N4472N3867N2648N0516M8000M5648M3409M0851L7642L3651K8946
53374B827777K3846J8745J3829R080M530K07m266r619j6324k4100l2037l8989
53362B772679m4025m6939m8451m9528n0459n0891n0733n0420n0210m9720m8487
53351B232816m6491m3964m1195l8851l7818l8301l9507m0691m1914m3288m4127
$$ y = [1014357, 1010337, 1007387, 1006001, 1005517, 1004935, 1004439, 1005512, 1009431, 1015990, 1023872, 1031969, 1040174, 1049227, 1060057, 1073174, 1088389, 1105125, 1123079, 1142503, 1163723, 1186589, 1210706, 1236157, 1263627, 1293687, 1326181, 1360435, 1395878, 1432319, 1469847, 1508746, 1549465, 1592405, 1637644, 1684958, 1734117, 1785002, 1837394, 1890789, 1944642, 1998858, 2053953, 2110496, 2168262, 2226094, 2282802, 2338127, 2392599, 2446466, 2499114, 2549630, 2597630, 2643278, 2686687, 2727538, 2765180, 2798831, 2827777, 2851623, 2870368, 2884197, 2893277, 2897807, 2898014, 2893748, 2884129, 2867805, 2843705, 2811668, 2772679, 2728654, 2681715, 2633264, 2583736, 2533277, 2482386, 2431653, 2381233, 2331023, 2281303, 2232816, 2186325, 2142361, 2101166, 2062315, 2024497, 1986196, 1946689, 1905998, 1864084, 1820796, 1776669]
53340A776669m3634m2046m0130l7920l4962l1660k9228k8047k7056k5229k2835
53329A413922k0673j8838j7034j5646j5595j7045j8954k0002j9689j8423j6969
53318A215054j5882j5156j4274j2777j0902r371q442p454n629l121p64J077K837
53305A115196M776O347P037P391Q520J0730J3261J5356J6979J8389J9726K1185
53293A264893K3038K5104K6687K7408K7609K7650K7330K6435K5331K4382K3216
53282A549083K1287J8827J6528J4440J1978Q999O015L240K03l343o737r194j0826
53269A620500j2427j4424j6519j8301j9802k1326k2948k4381k5354k5948k6456
53258A392614k6945k7186k7052k6763k6631k6711k6797k6606k5856k4484k2973
$$ y = [1776669, 1733035, 1690989, 1650859, 1612939, 1577977, 1546317, 1517089, 1489042, 1461986, 1436757, 1413922, 1393249, 1374411, 1357377, 1341731, 1326136, 1309091, 1290137, 1270135, 1250446, 1232023, 1215054, 1199172, 1184016, 1169742, 1156965, 1146063, 1136692, 1128250, 1120796, 1115167, 1112046, 1111282, 1112359, 1115196, 1119972, 1126319, 1133356, 1140747, 1149267, 1159997, 1173258, 1188614, 1205593, 1223982, 1243708, 1264893, 1287931, 1313035, 1339722, 1367130, 1394739, 1422389, 1449719, 1476154, 1501485, 1525867, 1549083, 1570370, 1589197, 1605725, 1620165, 1632143, 1641142, 1647157, 1650397, 1650600, 1647257, 1640520, 1631326, 1620500, 1608073, 1593649, 1577130, 1558829, 1539027, 1517701, 1494753, 1470372, 1445018, 1419070, 1392614, 1365669, 1338483, 1311431, 1284668, 1258037, 1231326, 1204529, 1177923, 1152067, 1127583, 1104610]
53247A104610k2174k2490k3450k4317k4864k5234k5349k5014k4386k3882k3598
53236H39852k3238k2569k1542k0028j7918j5544j3545j2225j1345j0582r902r382
53224F52032r104r222r865j0886j2000j3176j4518j5800j6522j6538j6236j5954
53212D92211j5535j4651j3256j1555r821q345p395o962o715o341n865n571n731
53199C74468o329o922o920o301n821o137o817o736n544m145l523l590l602l293
53185B98788l039l055k993k500j839j624k039k602k778k609k553k754k799k335
53171B63269j550r08o51p20r37j067r43o82n24l52J83Q42P63l67j685k287k348
53154B50036k433k285j391k31K41J49M35J035P74n95j692j465o19k65k52J52Q12
$$ y = [1104610, 1082436, 1059946, 1036496, 1012179, 987315, 962081, 936732, 911718, 887332, 863450, 839852, 816614, 794045, 772503, 752475, 734557, 719013, 705468, 693243, 681898, 671316, 661414, 652032, 642928, 633706, 623841, 612955, 600955, 587779, 573261, 557461, 540939, 524401, 508165, 492211, 476676, 462025, 448769, 437214, 427393, 419048, 411653, 404691, 397976, 391635, 385770, 380199, 374468, 368139, 361217, 354297, 347996, 342175, 336038, 329221, 322485, 316941, 312796, 309273, 305683, 302081, 298788, 295749, 292694, 289701, 287201, 285362, 283738, 281699, 279097, 276319, 273710, 271157, 268403, 265604, 263269, 261719, 260811, 260160, 259440, 258503, 257436, 256493, 255811, 255287, 254935, 255118, 255960, 256723, 256356, 254671, 252384, 250036, 247603, 245318, 243927, 243696, 243937, 244086, 244521, 245556, 246330, 245735, 244043, 242578, 241959, 241694, 241442, 241594, 242406]
53137B42406J138J269J704K121J752P42Q3J35K29j30n26m25KJ81j17o45j006r16
53119B47997l89K66P75J169J560J769J593J233J031Q61L04n58j092j046r50j246
53103B53277j506j058j11L33j99r78j010l27Q4l62j092j158m99M1j38p31j069
53086B43497r36n46n7N20J038J166P75J98k1K70N62J51r72j954k003j283n76k22
53068B39607M0K45%p03j126p57j11k2n41j022j071p99l51K63R07J324J486J498
53050B38867J312Q38L38K60O54J109J277J122O96K3o92j111j115q63m55J38P51
53033B43149R52N21j67m91k33K11K69j76o56o39j80R6k34q68j159p97Q2J172K069
53014B42921K284J641O65J16J16J37j42l64j36L03L78o4n98p64n38k76k89n34
$$ y = [242406, 243544, 244813, 246517, 248638, 250390, 251132, 251215, 251350, 251579, 251449, 250923, 250498, 250500, 250681, 250564, 249919, 248913, 247997, 247608, 247874, 248649, 249818, 251378, 253147, 254740, 255973, 257004, 257865, 258169, 257611, 256519, 255473, 254523, 253277, 251771, 250713, 250602, 250935, 250736, 249758, 248748, 248421, 248505, 248143, 247051, 245893, 245394, 245435, 245297, 244566, 243497, 242561, 242015, 241958, 242478, 243516, 244682, 245457, 245655, 245634, 245904, 246466, 246617, 245645, 243691, 241688, 240405, 239829, 239607, 239647, 239892, 239892, 239189, 238063, 237306, 237195, 237173, 236632, 235610, 234539, 233740, 233389, 233652, 234559, 235883, 237369, 238867, 240179, 241017, 241355, 241615, 242269, 243378, 244655, 245777, 246473, 246496, 245804, 244693, 243578, 242715, 242260, 242398, 243149, 244101, 244622, 244455, 243964, 243731, 243942, 244211, 244035, 243379, 242740, 242560, 242656, 242422, 241554, 240395, 239598, 239680, 240852, 242921, 245205, 246846, 247511, 247627, 247743, 247880, 247738, 247374, 247238, 247541, 247919, 247855, 247257, 246493, 245955, 245679, 245390, 244856]
52996B44856o33l09K31M29N6m20k74O33J641J938J388O05K81N56J049J392J527
52979B54946J554J505J372J280J409J839K429K886K866K115O58j095k393k542
52965B68829j425K24J319J412R94P17N46R4m49m26K69Q98R12O52N82M36l11j447
52947B73826k207k324k226k201j985j327n25r9j91n14p26o90m95l52m10n97p25
52930B56232p32p16p47p61o35l34L6K14j5n87j133j332j199r57p81p12o92n37
52912B44612k8P29J214R76J35p19j090q77l28J22J36j75k51K81J037J229N35n20
52894B47018j104q10M4P08O87J97j03J10N33Q04R54J099J003L61o29j407j655
52877B47810j410p68J49R87J343J216R87R80J210J483J468R13R2j78N53J632K044
$$ y = [244856, 244223, 243914, 244145, 244574, 244630, 244210, 243936, 244569, 246210, 248148, 249536, 250141, 250422, 250978, 252027, 253419, 254946, 256500, 258005, 259377, 260657, 262066, 263905, 266334, 269220, 272086, 274201, 274859, 273764, 271371, 268829, 267404, 267628, 268947, 270359, 271353, 272070, 272616, 272710, 272261, 271835, 272104, 273002, 273914, 274566, 275148, 275584, 275273, 273826, 271619, 269295, 267069, 264868, 262883, 261556, 261031, 260932, 260741, 260227, 259501, 258811, 258316, 257964, 257554, 256957, 256232, 255500, 254784, 254037, 253276, 252641, 252307, 252343, 252557, 252542, 251955, 250822, 249490, 248291, 247334, 246553, 245841, 245149, 244612, 244584, 245313, 246527, 247503, 247638, 246919, 245829, 244952, 244624, 244746, 244882, 244707, 244456, 244737, 245774, 247003, 247538, 247018, 245914, 245104, 245148, 245856, 246543, 246740, 246637, 246747, 247280, 248084, 249038, 250137, 251140, 251501, 250872, 249465, 247810, 246400, 245632, 245781, 246768, 248111, 249327, 250314, 251294, 252504, 253987, 255455, 256368, 256460, 256282, 256835, 258467, 260511]
52860B60511J734J582K047K550K365J458J57j379k926l965m220m072m049m060
52846B47733l717l123k789k788k555j705o61j26k45n37o29n99n64l41J71N38K40
52829B28303m30m74N16J707K064J659J310J178N87p03j823j796p64K48N34K55
52813B32371n9j49j28j48j14K43R21J464J414Q74L94J98j0m36p10m03K21L47m07
52794B35883j454j838j324o38o01j099j310q32k17j26m28n05j49L65R47J695K280
52777B30649K066J004o6m11j95k8j32l50n50o32l68K37O34K22q91j911k184j713
52759B25381q93n4O38J022R20L41l06l64M47J621K266K066J549J353J566J930
52743B39483K289K571K591K321K149K383K654K302J357O31O75J145J390J334J325
$$ y = [260511, 262245, 263827, 265874, 268424, 270789, 272247, 272404, 271025, 268099, 264134, 259914, 255842, 251793, 247733, 244016, 240893, 238104, 235316, 232761, 231056, 230395, 230269, 230024, 229487, 228858, 228259, 227695, 227354, 227525, 228063, 228303, 227873, 227399, 227915, 229622, 231686, 233345, 234655, 235833, 236420, 235717, 233894, 232098, 231334, 231582, 232116, 232371, 232312, 232163, 232035, 231887, 231773, 232016, 232937, 234401, 235815, 236689, 237083, 237281, 237271, 236835, 236125, 235722, 235943, 236290, 235883, 234429, 232591, 231267, 230629, 230028, 228929, 227619, 226787, 226570, 226444, 226016, 225511, 225362, 225727, 226674, 228369, 230649, 232715, 233719, 233653, 233242, 233047, 233019, 232887, 232537, 231987, 231355, 230987, 231224, 231858, 232080, 231189, 229278, 227094, 225381, 224488, 224434, 225072, 226094, 227014, 227355, 227049, 226685, 227132, 228753, 231019, 233085, 234634, 235987, 237553, 239483, 241772, 244343, 246934, 249255, 251404, 253787, 256441, 258743, 260100, 260731, 261406, 262551, 263941, 265275, 266600]
52728B66600J434J391J148J001J050R50L92m53j245j909k490k807k665k286k076
52713B58035k022j797j384j001m69O03J798J904M97j195j754j280q31o95k84M84
52697B50609R14O76K47o5n17j079j090l13M77N33J01j73k10k00M1O56J152Q73
52679B52632k5q22j199j398j581j689j736j733j413n90K52M12j9k33J99Q22J053
52662B42932Q72O02M62O30J255K142K731K692K326K153K311K593K804K851K625
52647B71981K115J462P18l32j804l209l745l161k093j364j128r50n74k38k53n63
52631B56862r18j165j166o40M85J698K262J992J355P86K11n68j402j904j886j497
52615B54505j036p46o14l86Q4N25N68L36L28P30J215J516J653J491P68j47k38
$$ y = [266600, 268034, 269425, 270573, 271574, 272624, 273574, 273966, 273513, 272268, 270359, 267869, 265062, 262397, 260111, 258035, 256013, 254216, 252832, 251831, 251362, 251965, 253763, 255667, 256164, 254969, 253215, 251935, 251104, 250409, 250125, 250609, 251523, 252199, 252446, 252381, 251864, 250785, 249695, 249382, 249859, 250392, 250493, 250320, 250110, 249910, 249951, 250607, 251759, 252632, 252607, 251785, 250586, 249188, 247607, 245918, 244182, 242449, 241036, 240446, 240698, 241110, 241091, 240858, 241057, 241879, 242932, 243804, 244406, 244868, 245498, 246753, 248895, 251626, 254318, 256644, 258797, 261108, 263701, 266505, 269356, 271981, 274096, 275558, 276276, 275944, 274140, 270931, 267186, 264025, 261932, 260568, 259440, 258490, 257916, 257678, 257425, 256862, 255944, 254779, 253613, 252973, 253458, 255156, 257418, 259410, 260765, 261551, 261762, 261194, 259792, 257888, 256002, 254505, 253469, 252723, 252109, 251723, 251807, 252332, 252900, 253236, 253564, 254294, 255509, 257025, 258678, 260169, 260937, 260790, 260552]
52598B60552P81J692J158m56j516j203k90K17K68L02L55J86p6j3N07J152J516
52581B65132J472J184Q92P35O67N64M21L50L95M51L59P4k71m14k30L1m0n04j027
52562B70241j381j649j706j083J98J089N42j013j956j373kQ44O83j10j031j668
52546B60625j598o81N31J174R49L79J68L85M73j2p92j100n47M07J010J046Q47
52529B63264O86N30L70L35L79K82J03J89N58P48N29L82O97R56L74p36j060J00
52511B68686J923L149L528L681L880L782L293K913K871K526J176q33k503l398
52497B94674l852m009l537k522j836k004k371k034j206q11j080j364j256r52n14
52482B65326L08J276J600J056M43M04O10O43Q97J750K500K210J282J006J621J978
$$ y = [260552, 261333, 263025, 264183, 263727, 262211, 261008, 260718, 260935, 261203, 261505, 261860, 262046, 261970, 261957, 262464, 263616, 265132, 266604, 267788, 268680, 269415, 270082, 270646, 271067, 271417, 271812, 272263, 272622, 272696, 272425, 272011, 271781, 271812, 271772, 271268, 270241, 268860, 267211, 265505, 264422, 264620, 265709, 266251, 265238, 263282, 261909, 261907, 262751, 263434, 263324, 262293, 260625, 259027, 258346, 258877, 260051, 261000, 261379, 261547, 261932, 262405, 262393, 261601, 260501, 259954, 260361, 261371, 262417, 263264, 263950, 264480, 264850, 265185, 265564, 265846, 265949, 266138, 266696, 267444, 267973, 268355, 269052, 270008, 270382, 269646, 268586, 268686, 270609, 273758, 277286, 280967, 284847, 288629, 291922, 294835, 297706, 300232, 301408, 300575, 298072, 294674, 290822, 286813, 283276, 280754, 278918, 276914, 274543, 272509, 271303, 270492, 269412, 268048, 266792, 265840, 265326, 265634, 266910, 268510, 269566, 270009, 270413, 271023, 271666, 272563, 274313, 276813, 279023, 280305, 281311, 282932, 284910]
52466B84910J344M37K38O83J133J434J761J996J976K003K333K461J684J81j139
52451C03435j833k215k501k480k184k065k202k060j452j048j343j740j389n00
52437B78423r0n71j383j936k205k291k093j596j025m80J75R16J386J324Q55L19
52421B69728M9L55J260K206K504K155J787J688J451P96J87K47R92K042L184M368
52405B94999N496O651Q129R827J0851J0289Q141N110J708j812m837o458o389n421
52391C36284m727m814n226n120m140k699j484p37l08j55l09l72K35J311J945J899
52375C11583K095L125M141M130L611L907N149O189O367O093N674M766L331K004
52361C72165J155L89n77j341j570j594j712j656j169n86l32l32l05j43L56J452
$$ y = [284910, 286254, 286691, 286929, 287612, 288745, 290179, 291940, 293936, 295912, 297915, 300248, 302709, 304393, 304574, 303435, 301602, 299387, 296886, 294406, 292222, 290157, 287955, 285895, 284443, 283395, 282052, 280312, 278923, 278423, 278333, 277762, 276379, 274443, 272238, 269947, 267854, 266258, 265233, 264753, 264928, 265844, 267230, 268554, 269409, 269728, 269777, 270132, 271392, 273598, 276102, 278257, 280044, 281732, 283183, 283979, 284166, 284413, 285405, 287447, 290631, 294999, 300495, 307146, 315275, 325102, 335953, 346242, 354383, 359493, 361201, 359389, 354552, 348094, 341705, 336284, 331557, 326743, 321517, 316397, 312257, 309558, 308074, 307337, 307029, 306874, 306565, 306193, 306428, 307739, 309684, 311583, 313678, 316803, 320944, 325074, 328685, 332592, 337741, 343930, 350297, 356390, 362064, 366830, 370161, 372165, 373320, 373709, 373132, 371791, 370221, 368627, 366915, 365259, 364090, 363504, 363172, 362840, 362535, 362392, 362748, 364200]
52345C64200K785L418L135K925L555M346M226L471L296M068M974N432N812O564
52331D22207P508Q395R489J1145J3128J4752J5573J5699J5635J5908J6688J7679
52319E83806J8499J9108J9693K0200K0232J9562J8526J7761J7634J7991J8375
52308G91387J8499J8413J8236J7861J7126J6212J5503J5071J4597J3920J3240
52297I70065J2660J1913J0783R368P646N263K205p89l016m710o462q044q599p982
52283I90301p092o664o446n888n029m204l224j555P95K998M244M607M907N830
52269I73580P347R007J0521J1865J2965J3621J3799J3679J3369J2904J2596J2933
52257A118186J3909J4807J5034J4775J4536J4411J4240J4084J3914J3229J1586
$$ y = [364200, 366985, 370403, 373538, 376463, 380018, 384364, 388590, 392061, 395357, 399425, 404399, 409831, 415643, 422207, 429715, 438110, 447599, 458744, 471872, 486624, 502197, 517896, 533531, 549439, 566127, 583806, 602305, 621413, 641106, 661306, 681538, 701100, 719626, 737387, 755021, 773012, 791387, 809886, 828299, 846535, 864396, 881522, 897734, 913237, 928308, 942905, 956825, 970065, 982725, 994638, 1005421, 1014789, 1022435, 1027698, 1029903, 1029114, 1026098, 1021388, 1014926, 1006882, 998283, 990301, 983209, 976545, 970099, 964211, 959182, 954978, 951754, 950199, 950994, 953992, 958236, 962843, 967750, 973580, 980927, 989934, 1000455, 1012320, 1025285, 1038906, 1052705, 1066384, 1079753, 1092657, 1105253, 1118186, 1132095, 1146902, 1161936, 1176711, 1191247, 1205658, 1219898, 1233982, 1247896, 1261125, 1272711]
52246A272711R355P233N176K641k48k654m265n650p067p816p354o340n864o107
52232A243751o380o204n678m980m158l380k882k620k298j802j291q35k59N72J541
52217A203097K376K889L143L423L982M743N420N944O494P052P288P159P197P802
52203A278009Q551Q673P976O891N763M793M434N107O355P036O745O332O610P080
52189A370355O665N351M286M219M535M150K798J071n09k032l820n865p803r304
52175A374097j0320j0967j1230j1003j0417r855r467q872p643o019m682l787k696
52162A267139j013O13J272J123J201J904K418J968R63K67j51j061k527l548l354
52147A267214k386j526r29k29M96P37M18K6l26j193k781m220m475l651k747k280
$$ y = [1272711, 1282066, 1289299, 1294475, 1297116, 1296868, 1294214, 1289949, 1284299, 1277232, 1269416, 1262062, 1255722, 1249858, 1243751, 1237371, 1231167, 1225489, 1220509, 1216351, 1212971, 1210089, 1207469, 1205171, 1203369, 1202078, 1201243, 1200984, 1201556, 1203097, 1205473, 1208362, 1211505, 1214928, 1218910, 1223653, 1229073, 1235017, 1241511, 1248563, 1255851, 1263010, 1270207, 1278009, 1286560, 1295233, 1303209, 1310100, 1315863, 1320656, 1325090, 1330197, 1336552, 1343588, 1350333, 1356665, 1363275, 1370355, 1377020, 1382371, 1386657, 1390876, 1395411, 1399561, 1402359, 1403430, 1402921, 1400889, 1397069, 1391204, 1383401, 1374097, 1363777, 1352810, 1341580, 1330577, 1320160, 1310305, 1300838, 1291966, 1284323, 1278304, 1273622, 1269835, 1267139, 1266126, 1266739, 1268011, 1269134, 1270335, 1272239, 1274657, 1276625, 1277588, 1277855, 1277704, 1276643, 1274116, 1270568, 1267214, 1264828, 1263302, 1262373, 1262144, 1262640, 1263377, 1263795, 1263821, 1263495, 1262302, 1259521, 1255301, 1250826, 1247175, 1244428, 1242148]
52131A242148j807p72Q56K956N581Q555J1242J3292J5248J7897K1172K4161K6138
52118A386667K7127K7560K7814K8077K8199K7709K6377K4729K3467K2424K0731
52107A670881J8176J5591J3598J1700R276O835N428N108M959M566M476M910M905
$$ y = [1242148, 1240341, 1239569, 1240425, 1243381, 1248962, 1257517, 1268759, 1282051, 1297299, 1315196, 1336368, 1360529, 1386667, 1413794, 1441354, 1469168, 1497245, 1525444, 1553153, 1579530, 1604259, 1627726, 1650150, 1670881, 1689057, 1704648, 1718246, 1729946, 1739222, 1746057, 1751485, 1756593, 1761552, 1766118, 1770594, 1775504, 1780409]
$$ [...]
##END NTUPLES=NMR SPECTRUM
##END=
