##TITLE=AC1729_SEN00002_9275740_F0xnw3EYGm
##JCAMPDX= 6.0         $$ Bruker NMR JCAMP-DX V2.0
##DATA TYPE= NMR SPECTRUM
##DATA CLASS= NTUPLES
##ORIGIN= BRUKER
##OWNER= Administrator
$$ 1.72 TOPSPIN		Version 2.1
$$ 2015-07-14 20:11:30.104 -0700  Administrator@X
$$ Compression mode = diff/dup
##.OBSERVE FREQUENCY= 400.02188249412
##.OBSERVE NUCLEUS= ^1H
##.ACQUISITION MODE= SIMULTANEOUS (DQD)
##.ACQUISITION SCHEME= undefined
##.AVERAGES= 8
##.DIGITISER RES= 22
##SPECTROMETER/DATA SYSTEM= spect
##.PULSE SEQUENCE= zg30
##.SOLVENT NAME= COFFEE_meoh
##.SHIFT REFERENCE= INTERNAL, COFFEE_meoh, 1, 14.98509
##AUDIT TRAIL= $$ (NUMBER, WHEN, WHO, WHERE, PROCESS, VERSION, WHAT)
$$ ##TITLE= Audit trail, TOPSPIN		Version 2.1
$$ ##JCAMPDX= 5.01
$$ ##ORIGIN= Bruker BioSpin GmbH
$$ ##OWNER= Administrator
$$ $$ E:\/data/COFFEE/nmr/AC1729_SEN00002_9275740_F0xnw3EYGm/10/pdata/1/auditp.txt
$$ ##AUDIT TRAIL=  $$ (NUMBER, WHEN, WHO, WHERE, PROCESS, VERSION, WHAT)
(   1,<2015-07-14 20:11:22.994 -0700>,<Administrator>,<X>,<go>,<TOPSPIN 2.1>,
      <created by zg
	started at 2015-07-14 20:10:17.104 -0700,
	POWCHK enabled, PULCHK disabled,
       configuration hash MD5:
       21 0F 79 D6 B3 7B B4 F6 88 20 88 DB 03 48 BD 9F
       data hash MD5: 64K
       CD 8B 36 F2 15 2F 19 69 3A C2 99 3E EF 50 1A E7>)
(   2,<2015-07-14 20:11:26.135 -0700>,<Administrator>,<X>,<proc1d>,<TOPSPIN 2.1>,
      <Start of raw data processing
       efp LB = 0 FT_mod = 6 PKNL = 1 PHC0 = 0 PHC1 = 0 SI = 32K 
       data hash MD5: 32K
       CA 12 21 90 B3 B6 A1 2E 21 7F 61 47 1B 8D C6 97>)
(   3,<2015-07-14 20:11:26.557 -0700>,<Administrator>,<X>,<proc1d>,<TOPSPIN 2.1>,
      <pk PHC0 = 91.74683 PHC1 = 0 
       data hash MD5: 32K
       79 B0 C9 FE 4D E9 D1 1E 34 EC DC 1E EB 84 2B B8>)
(   4,<2015-07-14 20:11:26.666 -0700>,<Administrator>,<X>,<proc1d>,<TOPSPIN 2.1>,
      <abs ABSG = 1 
       data hash MD5: 32K
       22 5D BD 3C B0 36 E1 69 D7 75 4A 95 13 7A 78 B8>)
(   5,<2015-07-14 20:11:26.729 -0700>,<Administrator>,<X>,<proc1d>,<TOPSPIN 2.1>,
      <abs ABSG = 2 
       data hash MD5: 32K
       66 12 68 B8 73 5E DA 19 47 B9 B9 8D 30 32 E7 11>)
(   6,<2015-07-14 20:11:26.791 -0700>,<Administrator>,<X>,<proc1d>,<TOPSPIN 2.1>,
      <abs ABSG = 3 
       data hash MD5: 32K
       CE 3A 70 D7 C8 CA D3 46 F7 A1 A7 C0 1B BE ED BD>)
(   7,<2015-07-14 20:11:26.838 -0700>,<Administrator>,<X>,<proc1d>,<TOPSPIN 2.1>,
      <abs ABSG = 4 
       data hash MD5: 32K
       71 19 77 89 39 96 0B 67 8D 03 9D 37 A7 02 08 9E>)
(   8,<2015-07-14 20:11:26.900 -0700>,<Administrator>,<X>,<proc1d>,<TOPSPIN 2.1>,
      <abs ABSG = 5 
       data hash MD5: 32K
       64 C5 52 28 9E 47 F2 5B 9C 0A 3D 9C B0 14 58 29>)
$$ ##END=
$$ 
$$ $$ hash MD5
$$ $$ EB 3E 51 4F 6A 46 82 3F 2F ED 5F 6D B1 9D 94 53
##$RELAX= 
##$RELAX= 
##$RELAX= 
##$RELAX= 
##$RELAX= 
##$RELAX= 
##$RELAX= 
$$ Bruker specific parameters
$$ --------------------------
##$DU= <E:\>
##$EXPNO= 10
##$NAME= <AC1729_SEN00002_9275740_F0xnw3EYGm>
$$ [...]
150 150 150 150 150 150 150 150
##$TP07= 0
##$TPNAME0= <>
##$TPNAME1= <>
##$TPNAME2= <>
##$TPNAME3= <>
##$TPNAME4= <>
##$TPNAME5= <>
##$TPNAME6= <>
##$TPNAME7= <>
##$TPOAL= (0..7)
0.5 0.5 0.5 0.5 0.5 0.5 0.5 0.5
##$TPOFFS= (0..7)
0 0 0 0 0 0 0 0
##$TUNHIN= 0
##$TUNHOUT= 0
##$TUNXOUT= 0
##$USERA1= <user>
##$USERA2= <user>
##$USERA3= <user>
##$USERA4= <user>
##$USERA5= <user>
##$V9= 5
##$VALIST= <valist>
##$VCLIST= <CCCCCCCCCCCCCCC>
##$VD= 0
##$VDLIST= <DDDDDDDDDDDDDDD>
##$VPLIST= <PPPPPPPPPPPPPPP>
##$VTLIST= <TTTTTTTTTTTTTTT>
##$WBST= 2048
##$WBSW= 25
##$XGAIN= (0..3)
0 0 0 0
##$XL= 0
##$YL= 0
##$YMAX_a= 612640
##$YMIN_a= -524043
##$ZGOPTNS= <>
##$ZL1= 120
##$ZL2= 120
##$ZL3= 120
##$ZL4= 120
##$ABSF1= 14.98509
##$ABSF2= -5.573092
##$ABSG= 5
##$ABSL= 3
##$ALPHA= 0
##$AQORDER= 0
##$ASSFAC= 0
##$ASSFACI= 0
##$ASSFACX= 0
##$ASSWID= 0
##$AUNMP= <proc_prof1d_extract_pilot.lims>
##$AXLEFT= 0
##$AXNAME= <>
##$AXNUC= <1H>
##$AXRIGHT= 0
##$AXTYPE= 0
##$AXUNIT= <>
##$AZFE= 0.1
##$AZFW= 0.1
##$BCFW= 0
##$BC_mod= 0
##$BYTORDP= 0
##$COROFFS= 0
##$CY= 15
##$DATMOD= 1
##$DC= 0
##$DFILT= <>
##$DTYPP= 0
##$F1P= 0
##$F2P= 0
##$FCOR= 0.5
##$FTSIZE= 32768
##$FT_mod= 6
##$GAMMA= 0
##$GB= 0
##$INTBC= 1
##$INTSCL= 1
##$ISEN= 128
##$LB= 0
##$LEV0= 0
##$LPBIN= 0
##$MAXI= 10000
##$MC2= 0
##$MEAN= 0
##$ME_mod= 0
##$MI= 0
##$NCOEF= 0
##$NC_proc= -8
##$NLEV= 6
##$NOISF1= 0
##$NOISF2= 0
##$NSP= 0
##$NTH_PI= 0
##$NZP= 0
##$OFFSET= 14.98509
##$PC= 1
##$PHC0= 91.74683
##$PHC1= 0
##$PH_mod= 1
##$PKNL= yes
##$PPARMOD= 0
##$PPDIAG= 0
##$PPIPTYP= 0
##$PPMPNUM= 2147483647
##$PPRESOL= 1
##$PSCAL= 4
##$PSIGN= 0
##$PYNMP= <proc.py>
##$REVERSE= no
##$SF= 400.02
##$SI= 32768
##$SIGF1= 0
##$SIGF2= 0
##$SINO= 400
##$SIOLD= 32768
##$SPECTYP= <>
##$SREGLST= <1H.CDCl3>
##$SSB= 0
##$STSI= 32768
##$STSR= 0
##$SW_p= 8223.68421052631
##$SYMM= 0
##$S_DEV= 0
##$TDeff= 65536
##$TDoff= 0
##$TI= <>
##$TILT= no
##$TM1= 0
##$TM2= 0
##$TOPLEV= 0
##$USERP1= <user>
##$USERP2= <user>
##$USERP3= <user>
##$USERP4= <user>
##$USERP5= <user>
##$WDW= 1
##$XDIM= 32768
##$YMAX_p= 445837698
##$YMIN_p= -684347
##$CURPLOT= <Network HP LaserJet P1505>
##$CURPRIN= <$Network HP LaserJet P1505>
##$DFORMAT= <normdp>
##$LAYOUT= <+/1D_H.xwp>
##$LFORMAT= <normlp>
##$PFORMAT= <normpl>
##$SURQMSG= 1
$$ End of Bruker specific parameters
$$ ---------------------------------
##NTUPLES= NMR SPECTRUM
##VAR_NAME=  FREQUENCY,     SPECTRUM/REAL,   SPECTRUM/IMAG
##SYMBOL=    X,             R,               I
##VAR_TYPE=  INDEPENDENT,   DEPENDENT,       DEPENDENT
##VAR_FORM=  AFFN,          ASDF,            ASDF
##VAR_DIM=   32768,         32768,           32768
##UNITS=     HZ,            ARBITRARY UNITS, ARBITRARY UNITS
##FACTOR=    0.250966925370066, 1,           1
##FIRST=     8223.43324360094, 78054,        -275144
##LAST=      0,             -4164,           -2734
##MIN=       0,             -684347,         0
##MAX=       8223.43324360094, 445837698,    0
$$ Real data points
##PAGE= N=1
##DATA TABLE= (X++(R..R)), XYDATA
$$ [...]
$$ plain form
19597 -37245 -153240 306241 -31858 -227186 292854 1701 -232701 -381656 -10803 -79097 295560
19585 -23383 -330581 -234905 -272516 -195774 -194798 -27765 -198517 378578 -97163 -60058 -61901 244269
19572 -26699 -149101 -141779 -110451 -8588 -165072 43021 -221021 -208286 11802 -99476 -34226
19560 -103448 -149212 58661 66114 -218272 -271039 -511300 -327472 190746 -98259 -70748 -239550
19549 -239550 -62978 99065 146767 -19946 97064 -196192 -31138 117569 212243 -179427 -91779
19538 -91779 -35149 -165804 -14210 -1006 90952 57091 -18324 -116183 -80689 12979 -113158
19526 172889 -216715 12928 -40540 -96366 58684 -62171 -326755 159619 79002 98588 -244499
19514 -86509 -59202 -56792 21424 -254104 -224296 -235009 -126820 244493 -177451 -253459 -13444
$$ packed form
19597c7245j15995C06241c1858j95328B92854A701b32701j48955a0803o8294B95560
19585b3383l07198R5676l7611P6742R76b7765j70752C78578i7163L7105j843B44269
19572b6699j22402P322L1328h588j56484D3021b21021J2735A1802i9476c4226
19560a03448m5764E8661P453b18272n2767k40261J83828A90746i8259K7511j68802
19549b39550f2978I9065M7702a9946I7064a96192c1138A17569R4674a79427Q7648
19538i1779c5149j30655a4210a006I0952l3861a8324r7859L5494A2979a13158
19526A72889b16715A2928d0540n5826E8684f2171k64584A59619G9002J9586b44499
19514h6509K7307K410B1424b54104K9808j0713J08189B44493a77451p6008a3444
$$ plain form
19502 -166620 -108352 15493 -210635 -88420 -64197 85863 146381 72053 -395455 -148709 -9076
19490 56864 -84141 -45838 -119255 162072 -112981 -455481 -23158 8336 10553 88627 -59018
19478 283956 137437 -306904 -51124 238804 -294192 84422 -105857 10738 35505 36607 -14592
19466 -303819 245701 -12976 -291762 289415 96320 -52317 -9810 -114984 398488 -309345
19455 -148392 -55854 -120460 87852 87088 -289867 180982 -105914 63069 -62378 -396047 152235
19443 49734 -13130 27798 67073 -259308 -241831 -50420 204488 -164979 -185871 -150317 18508
19431 -338119 14666 -51803 -209336 -230394 -248479 -33645 41752 -30928 -31808 40664 -348393
19419 -113352 -138411 54828 97303 121094 -187977 -280422 118559 -76866 -213913 -197787 156255
$$ packed form
19502a66620N8268A5493b10635h8420K4223H5863O0518G2053c95455a48709i076
19490E6864h4141L8303p3417A62072a12981l42500b3158H336K217P8074e9018
19478B83956A37437c06904e1124B38804b94192H4422a05857A0738K4767J102a4592
19466c03819B45701a2976k78786B89415I6320e2317i810j05174C98488c09345
19455a48392e5854o4606H7852p64b89867A80982a05914F3069f2378l33669A52235
19443D9734a3130B7798L9275b59308J7477e0420B04488a64979k0892L5554A8508
19431c38119A4666e1803j57533k1058j8085c3645D1752c0928q80D0664c48393
19419a13352k5059E4828M2475K3791a87977r2445A18559g6866j37047J6126A56255
$$ plain form
19407 121071 -307555 -44228 -179627 -391964 -53513 -75452 26341 -19534 -334850 -41429 -269020
19396 -269020 -78202 -75632 -115868 202006 -101164 5893 138596 -22580 -67955 -134301 118608
19384 104228 -165442 -24716 -88170 -109490 -283333 40210 -326702 23015 -205931 -84951 -299648
19373 -299648 328239 -214931 -302843 35331 209956 64166 31393 -173348 50607 -85293 108118
19361 -57270 -257598 -91291 -53475 45181 -33294 -183318 2315 161815 -105673 -134712 102622
19349 75600 79928 -49022 98 157786 137205 98012 128459 232940 65071 188702 249820 13041
19336 -149754 -19646 138713 3396 93472 14732 -372443 198497 99810 -166231 -210049 -196109
19325 -196109 -32912 -315131 -54319 -142791 102188 306018 -45989 -171442 -493765 -225677
$$ packed form
19407A21071c07555d4228j35399k12337e3513k1939B6341a9534l15316d1429k27591
19396b69020g8202K570m0236B02006a01164E893J32703b2580m5375o6346A18608
19384A04228a65442b4716o3454k1320j73843D0210c26702B3015b05931h4951k14697
19373b99648C28239b14931q7912C5331J74625F4166C1393a73348E0607h5293A08118
19361e7270k00328i1291L7816D5181c3294j50024B315J59500a05673k9039A02622
19349G5600M328d9022I8J57688k0581l9193L0447J04481F5071J23631O1118A3041
19336a49754a9646A38713C396R0076A4732c72443A98497r8687a66231m3818J3940
19325a96109c2912k82219e4319q8472A02188K03830d5989j25453l22323b25677
$$ plain form
19314 -414386 46715 -115420 123799 -109983 36185 69276 -191390 -12978 -353376 -48851
19303 254874 -352363 -87050 -102772 -464337 -161976 237038 -362118 -183202 248060 -102462
19292 -291558 218497 223120 -251044 88575 254479 -41445 -240959 -75387 157404 -14912 -128859
19281 -128859 44886 -43626 39744 -105192 148590 -204148 209059 -110788 207 -152501 -170627
19270 -170627 -16534 -385211 -326300 -230295 -401259 53661 -108494 -275701 -107331 -17913
19259 -250540 -175201 -154580 -388557 96723 37018 40925 204922 -252567 -126501 -302810 -123766
19247 14374 213952 -73984 -139892 -56550 95854 202599 184675 -16732 -189278 -131522 435842
19235 426827 108654 -206136 -79156 -136771 -305803 -271106 16390 -23938 -177483 -1517 -4381
$$ packed form
19314d14386D6715a15420A23799a09983C6185L3091a91390a2978l40398d8851
19303B54874c52363h7050j5722l61565a61976B37038c62118J78916B48060a02462
19292b91558B18497M623b51044H8575J65904d1445j99514g5387A57404a4912j13947
19281a28859D4886d3626C9744a05192A48590b04148B09059a10788B07a52501j8126
19270a70627a6534l68677N8911R6005j70964E3661a08494j67207a07331a7913
19259b50540P5339K0621k33977I6723C7018L907J63997b52567J26066j76309a23766
19247A4374J99578g3984o5908e6550I5854J06745j7924a6732j72546N7756D35842
19235D26827A08654b06136g9156n7615j69032L4697A6390b3938j53545a517k864
$$ plain form
19224 -4381 -104852 -132586 -67409 -19432 -220482 -203053 -154009 -44542 -11480 -198592 -31329
19212 159215 -199076 -141073 126168 -9547 288336 -99908 155344 -108392 -336354 -116134
19201 -302704 158079 62241 4328 -293137 -183458 -95920 -228271 -28722 240118 -148944
19190 171508 28093 270857 -499930 -97767 73714 -87827 79196 -49179 59876 -227863 230781
19178 -161046 3223 118369 -619 59376 -270821 -106463 53760 -286768 -103958 -169851 304336
19166 -222550 -78311 52061 -69085 460819 -253220 88493 -133517 -123773 -4513 -123336 -57864
19154 -49892 110764 -120954 184673 48330 -239047 -150856 -19374 -291675 -120234 -132418
19144 -132418 10983 -318310 42512 -236718 114141 29939 25657 33017 36368 12325 -211828
$$ packed form
19224d381j00471k7734O5177a9432k01050J7429M9044d4542a1480j87112c1329
19212A59215a99076N8003A26168i547B88336i9908A55344a08392k27962a16134
19201c02704A58079F2241D328b93137J09679Q7538j32351b8722B40118a48944
19190A71508B8093K42764d99930i7767G3714h7827G9196d9179E9876b27863B30781
19178a61046C223J15146f19E9376b70821a06463E3760b86768a03958o5893C04336
19166b22550g8311E2061f9085D60819b53220H8493a33517R744d513j18823e7864
19154d9892A10764a20954A84673D8330b39047Q8191a9374k72301a20234j2184
19144a32418A0983c18310D2512b36718A14141B9939m282P360L351A2325b11828
$$ plain form
19132 -109257 -243795 19586 -229663 34474 -220038 359123 61756 -216375 -33614 -364 -221739
19121 -221739 -352381 149849 48201 -345305 91919 -34223 -92413 213247 -164788 95284
19110 -64081 -134207 302748 -97478 -333735 74528 73377 -324675 118156 -22931 -82675 345111
19098 127484 92922 -226417 99177 -8470 -351674 52164 116364 282346 -155794 -246933 -349614
19087 -349614 20596 -95299 537 -30970 -492808 145442 -93554 -26400 -4979 -535757 -179167
19075 6666 149363 77669 -63547 -164940 -144574 157958 -156521 -80144 -241337 -215627 -25539
19063 -137498 -208242 -230917 -100818 149779 -66724 53101 77019 41010 98420 -281792 21487
19051 88589 104228 26853 -330039 75653 -257868 20075 18387 106799 -138469 -59838 158061
$$ packed form
19132a09257j34538A9586b29663C4474b20038C59123F1756b16375c3614c64k21375
19121b21739j30642A49849D8201c45305I1919c4223n8190B13247a64788I5284
19110f4081p0126C02748i7478k36257G4528j151c24675A18156b2931n9744C45111
19098A27484l4562b26417I9177h470l43204E2164O4200J65982a55794r1139j02681
19087c49614B0596i5299E37c0970m61838A45442i3554b6400d979n30778a79167
19075F666J42697p1694f3547j01393K0366A57958a56521P6377j61193K5710b5539
19063a37498p0744k2675a00818A49779f6724E3101K3918l6009N7410b81792B1487
19051H8589J5639B6853c30039G5653b57868B0075j688Q8412a38469e9838A58061
$$ plain form
19039 -26350 105801 -180941 52578 358593 191585 -226456 -291824 -458152 26677 -303391
19028 39505 323894 153247 30958 -213158 194626 -33748 -81780 -74150 207924 259947 73089
19016 -141135 -80676 146319 -213525 235483 139980 110831 -327937 -272543 -337202 -316910 68217
19004 -195759 32436 -35913 -116221 100772 76547 -262504 288508 33018 -188290 138958
18993 -50970 -64313 143376 -214305 287585 -14717 143283 -280392 -175975 -60432 -16294
18982 -214274 -245857 -161039 -378454 -113820 -167761 -150369 307671 -151826 -126803 -113962 94583
18970 89165 106549 -107997 -369996 -260630 169164 430828 60930 21815 82127 67374 -133102
18958 -176020 89803 -93468 79174 16458 -105699 201859 71155 118085 -22806 -113443 42615
$$ packed form
19039b6350A05801a80941E2578L06015j67008b26456o5368j66328B6677c03391
19028C9505K84389A53247C0958b13158A94626c3748m8032P630B07924N2023G3089
19016a41135O0459A46319b13525B35483r5503k9149c27937N5394o4659K0292F8217
19004a95759C2436c5913q0308A00772k4225b62504B88508C3018a88290A38958
18993e0970j3343A43376b14305B87585a4717A43283b80392J04417f0432a6294
18982b14274l1583Q4818k17415a13820n3941J7392C07671a51826K5023J2841I4583
18970H9165J7384a07997k61999J09366A69164K61664F0930B1815O0312j4753a33102
18958a76020H9803i3468G9174A6458a05699B01859G1155M6930b2806r0637D2615
$$ plain form
18946 89677 24317 -111667 192678 388558 -48515 226644 -39875 143344 -333355 71819
18935 -19291 152232 -460233 -239029 -59875 -104346 -444408 -103119 -48522 -122136 -176656 -36544
18923 -46477 310295 -53895 136362 -170045 -169351 84727 -166724 -192009 26460 -209270 -352842
18912 -352842 -122149 49791 -238212 178226 -136604 -22001 -42847 -120794 182740 -117708
18901 277864 36392 50389 235330 -29213 213467 98948 -144850 -104290 96402 149918 159506
18890 159506 177856 13021 -16871 -140266 121361 -160372 -119176 64381 317052 -158453
18879 -371677 -369546 -79487 -196369 -86226 -293485 -4370 -125112 -162150 161262 170064 -291178
18867 111345 78620 -168090 -305590 205230 -127911 -9515 133588 190678 35438 -230047
$$ packed form
18946H9677B4317a11667A92678J95880d8515B26644c9875A43344c33355G1819
18935a9291A52232d60233K21204e9875m4471l40062a03119d8522p3614n4520c6544
18923d6477C10295e3895A36362a70045O94H4727a66724k5285B6460b09270j43572
18912c52842a22149D9791b38212A78226a36604b2001k0846p7947A82740a17708
18901B77864C6392J3997J84941b9213B13467I8948a44850M0560I6402N3516R588
18890A59506J8350A3021a6871j23395A21361a60372M1196F4381K52671a58453
18879c71677K131g9487j16882h6226k07259d370j20742l7038A61262Q802b91178
18867A11345l2725a68090j37500B05230a27911i515A33588N7090C5438b30047
$$ plain form
18856 75035 -85418 -144143 -150216 65725 -83391 62442 53800 -186801 208040 -116559 212161
18844 -131883 385537 -82432 -249895 -96915 -188809 95018 -226312 60775 -168550 -38376 168540
18832 -230793 98294 -135348 -136111 -188777 152527 -225746 -301918 88879 34852 -435417 26075
18820 154438 60077 43479 -208164 -153022 217288 205691 -38906 155116 369330 65453 94195
18809 94195 28237 36127 89643 -152349 84741 179525 -180504 27869 -69552 -408536 -132872
18797 -67324 296517 -191162 125134 225850 29116 198704 -97311 -171449 -152431 -24242 -141141
18786 -141141 -112945 117688 229279 154178 -90116 -217050 28053 -25292 -25932 -161014 -77455
18774 -104418 177938 -211075 -261974 103797 -32412 -71098 79785 -144327 -67611 -55002 -84295
$$ packed form
18856G5035h5418n8725o073F5725h3391F2442q642a86801B08040a16559B12161
18844a31883C85537h2432j67463i6915r1894I5018b26312F0775a68550c8376A68540
18832b30793I8294a35348p63n2666A52527b25746p6172H8879C4852d35417B6075
18820A54438F0077j6598b08164N5142B17288j1597c8906A55116K14214F5453K8742
18809I4195B8237P890N3516a52349H4741R4784a80504B7869f9552l38984a32872
18797f7324B96517a91162A25134J00716B9116J69588i7311p4138J9018b4242j16899
18786a41141K8196A17688J11591p5101i0116j26934B8053b5292o40j35082g7455
18774a04418A77938b11075n0899A03797c2412l8686G9785a44327f7611J2609k9293
$$ plain form
18763 -84295 -170388 -126351 -30658 48886 -86962 21492 -174453 -141328 -186952 -28442 -29727 -164464
18751 -164464 110509 6507 -249248 -11308 -112590 14671 -22309 -159996 -228170 -168247 -137678
18740 -137678 -193950 -190605 211131 -381157 74662 5409 -116980 -76209 110540 -199794 111639
18728 93037 -148776 -55121 -171232 62800 -246239 33006 -109126 90136 248393 -226761
18717 -23391 39568 -176173 -297548 -55519 -104326 10233 -73736 -502249 121502 -207393 -237117
18706 -237117 77148 281786 -153376 137314 -125264 220152 104860 -199987 -98111 -36416
18695 -372320 -91973 -26162 22573 107911 137995 14036 20085 -15518 -91093 108020 -392408
18683 17445 39384 -229862 5402 301142 -132670 43428 -25612 111568 -257866 181276 -89893
$$ packed form
18763h4295q6093M4037c0658D8886h6962B1492a74453L3125m5624b8442j285j34737
18751a64464A10509F507b49248a1308j01282A4671b2309j37687o8174N9923L0569
18740a37678n6272L345B11131c81157G4662E409a16980M0771A10540a99794A11639
18728I3037a48776e5121j16111F2800b46239C3006a09126I0136J58257b26761
18717b3391C9568a76173j21375e5519m8807A0233g3736m28513A21502b07393k9724
18706b37117G7148K04638a53376A37314a25264B20152A04860a99987i8111c6416
18695c72320i1973b6162B2573Q5338L0084A4036O049a5518p5575A08020c92408
18683A7445K1939b29862E402K95740a32670D3428b5612A11568b57866A81276h9893
$$ plain form
18671 -383245 14544 137553 -273368 -97675 -297719 113252 35043 -111312 33900 -64143
18660 -29143 23270 -177687 -119445 -180791 93798 136923 -69444 6233 -256542 449153 -90229
18648 -292249 193561 63922 129599 -186474 310574 -102612 21546 67421 -450158 -196080
18637 106753 -74218 307130 -45954 20199 33994 30481 -87223 126339 -382633 -113205 -175750
18626 -175750 207881 328351 -65056 -303206 3663 120006 -129589 142525 -136836 32891
18615 -129021 104759 321396 -27633 -115445 -167903 83133 -140904 -12066 -35812 221417 -180543
18603 -58746 -228581 -394382 226005 106302 -551103 -422434 14307 140531 -120423 -178766
18593 -178766 -153460 -118585 125561 -152110 -236364 -37109 -257657 177722 -99838 -122128 135788
$$ packed form
18671c83245A4544J23009b73368i7675k00044A13252C5043a11312C3900f4143
18660b9143B3270a77687N8242o1346I3798M3125f9444F233b56542D49153i0229
18648b92249A93561F3922O5677a86474C10574a02612B1546M5875d50158a96080
18637A06753g4218C07130d5954B0199J3795l513h7223A26339c82633a13205o2545
18626a75750B07881J20470f5056k38150C663J16343a29589A42525a36836C2891
18615a29021A04759K16637b7633q7812n2458H3133a40904a2066k3746B21417a80543
18603e8746j69835j65801B26005A06302e51103J28669A4307J26224a20423n8343
18593a78766K5306L4875A25561a52110q4254c7109k20548A77722i9838k2290A35788
$$ plain form
18581 -269871 -186434 -129011 -69130 -282893 48179 -190486 112035 -243259 -227420 97736 -200330
18569 14572 38184 402507 18878 43357 -12355 215665 -84212 -70768 221538 -109160 -28650
18557 -101606 -88616 -113509 -83006 9012 -12993 -289992 -55160 181543 -58909 -335207 -244321
18546 -244321 -402331 -101205 -75128 -326128 54768 137709 -327988 -123692 -372836 -188160
18536 -188160 157570 -93781 -176043 31588 -106720 -42698 111047 -339544 -42737 -29207 -186075
18525 -186075 115851 -296318 -174266 -221755 -212649 -492133 -99682 -257367 25079 51648 71909
18514 71909 -51923 9727 -260646 115163 -192012 -142050 39230 38756 40658 7733 153813 -40045
18501 35697 -77333 -61884 7924 -38364 354304 -196731 -242997 70931 165322 -2132 44924 92700
$$ packed form
18581b69871Q3437N7423N9881k13763D8179a90486A12035b43259J5839I7736b00330
18569A4572K3612L64323A8878K4479a2355B15665h4212J3444B21538a09160b8650
18557a01606J2990k4893L0503I012a2993k76999e5160A81543e8909k76298R0886
18546b44321j58010a01205K6077k51000E4768Q2941c27988a23692k49144J84676
18536a88160A57570i3781q2262C1588a06720d2698A11047c39544d2737J3530j56868
18525a86075A15851b96318J22052m7489R106k79484i9682j57685B5079K6569K0261
18514G1909e1923I727b60646A15163a92012M9962C9230m74J902G733J46080d0045
18501C5697g7333J5449G924c8364C54304a96731m6266G0931R4391b132D4924M7776
$$ plain form
18489 92700 149155 237802 -172782 4928 108874 -122429 199668 56453 247642 -263307 -48664
18477 -191914 -1722 -357319 -43954 -213857 97265 17487 -131782 40806 -143781 -212402 -43505
18465 -130699 128542 19572 -10299 -26801 98720 -541283 -11365 201921 3015 -82825 -35692
18453 149503 -134255 -125382 -271364 85362 -376469 -149596 150956 -138317 37486 124641
18443 124641 62156 -58826 32875 -174859 -190488 -190181 -57315 217893 -4584 -121106 8725 -176035
18430 224681 -14442 -7795 -259370 -139431 314284 138944 225330 -31968 -42365 70381 -215967
18418 28831 165713 10516 -67136 -148666 9893 -134359 -74507 215769 -6444 7161 28734 264500
18406 264500 306665 206070 -163128 144613 -76165 85302 -67155 -251957 -44169 -100694 -208110
$$ packed form
18489I2700N6455Q8647a72782D928J03946a22429A99668E6453J91189b63307d8664
18477a91914a722l55597d3954j69903I7265A7487a31782D0806a43781o8621d3505
18465a30699A28542A9572a0299j6502I8720e41283a1365B01921C015h2825c5692
18453A49503a34255Q873j45982H5362c76469a49596A50956a38317C7486Q7155
18443A24641F2156e8826C2875a74859j5629L07e7315B17893d584j16522H725a76035
18430B24681a4442O647k51575J19939C14284A38944Q6386c1968j0397G0381b15967
18418B8831J36882A0516f7136q1530I893a34359N9852B15769f444G161K1573K35766
18406B64500M2165j00595a63128A44613g6165H5302f7155j84802d4169n6525j07416
$$ plain form
18395 -208110 -71155 -52920 325053 16046 -144408 -180717 40906 -97418 -115308 -354967 -194555
18384 -194555 -84008 69610 4262 -102500 -72811 -102180 -11380 263620 74506 -53321 -78183
18373 -78183 41241 128546 -266191 287309 329231 100538 -95689 63467 138213 -104381 178565
18361 91507 35610 89233 -332899 -275921 140093 -249682 -40725 -115100 30813 -466234 151177
18349 -61928 199139 -136095 96673 122212 130474 -256461 60637 -67284 221538 125801 115012
18338 115012 -151762 -139636 -288359 -69838 -295685 214669 -30272 -55961 153638 -110540
18327 41286 -210486 10682 -196033 -145176 187439 113342 -342446 -398382 38279 -200730 -293392
18316 -293392 9092 216577 -118420 -33092 -1816 9999 18563 -270873 -94389 -203436 104264
$$ packed form
18395b08110g1155J8235C25053A6046a44408l6309D0906i7418j7890k39659J60412
18384a94555h4008F9610D262a02500K9689k9369a1380B63620G4506e3321k4862
18373g8183D1241Q7305b66191B87309M1922A00538i5689F3467P4746a04381A78565
18361I1507C5610N3623c32899N6978A40093b49682d0725p4375C0813d66234A51177
18349f1928A99139a36095I6673K5539Q262b56461F0637f7284B21538r5737j0789
18338A15012a51762J2126j48723f9838k25847B14669c0272k5689A53638a10540
18327D1286b10486A0682a96033N0857A87439p4097c42446n5936C8279b00730r2662
18316b93392I092K07485a18420c3092a816I999Q564b70873i4389j09047A04264
$$ plain form
18304 -158638 -334947 347663 -187619 -84023 -180452 -240518 -225862 156256 111800 57019 -199256
18292 180678 91537 180961 -72387 -211034 151580 -252464 -103822 -121551 -99632 -110126 -28460
18280 14342 -213982 136313 143265 51080 24311 -205634 155150 -249282 -176991 116867 -66144
18268 -291174 -301438 -353251 -35214 202681 140156 85667 -193269 -46021 7956 -2801 -104586
18257 -104586 147869 136626 -15519 -168840 81773 -1273 -197558 -133393 -9397 9296 -130331
18245 -135823 5134 -488703 -212615 -173676 -369754 -71766 130685 -161556 416352 183710
18234 -116798 1878 -53525 -50850 14751 -64021 -75290 -123459 86013 -152759 115774 -74783
18222 25910 46917 -72035 210159 17733 -76395 -436483 -90727 -318786 120074 -151288 -138427
$$ packed form
18304a58638j76309C47663a87619h4023r6429o0066J4656A56256m4456n4781a99256
18292A80678q9141Q9424g2387j38647A51580b52464a03822j7729K1919j0494b8460
18280A4342b13982A36313O952E1080B4311b05634A55150b49282P2291A16867f6144
18268b91174j0264n1813c5214B02681o2525n4489a93269d6021G956b801j01785
18257a04586A47869j1243a5519j53321H1773a273j96285O4165i397I296a30331
18245a35823E134d88703b12615L8939j96078g1766A30685a61556D16352A83710
18234a16798A878e3525K675A4751f4021j1269m8169H6013a52759A15774g4783
18222B5910K1007g2035B10159A7733g6395l60088i0727k28059A20074a51288J2861
$$ plain form
18211 -138427 -66323 120888 -85933 141348 91996 223212 -133686 120882 -165529 60710
18200 118899 -317965 -22247 -152350 -118822 -35924 49069 -76746 209512 -26543 -92475 -6754
18188 247151 -159512 -343436 166232 -21435 -57604 -22364 -17340 -313751 276557 -224506
18177 -210792 -51044 448745 -37122 -13993 -16396 -9038 -91727 146349 -19702 28778 12125
18165 -108359 -35141 -37199 144291 10843 -333638 -76683 -261841 63431 74057 264759 -104585
18153 -7885 174048 130353 -385591 -50467 -134301 136909 57789 -34089 -313943 -210390 -24152
18141 14808 47013 -239699 207676 219063 53945 143169 115426 -121163 146751 -186608 -18556
18129 -71313 -105516 26389 16292 33911 -148024 -29188 109489 -28274 107112 20746 -213288
$$ packed form
18211a38427f6323A20888h5933A41348m9352J31216a33686A20882a65529F0710
18200A18899c17965b2247j30103L3528c5924D9069g6746B09512b6543o5932f754
18188B47151a59512j83924A66232b1435l6169b2364N024k96411B76557b24506
18177b10792e1044D48745c7122a3993k403P358q2689A46349a9702B8778A2125
18165a08359c5141k058A44291A0843c33638g6683j85158F3431J0626J90702a04585
18153g885A74048m3695c85591e0467q3834A36909E7789c4089k79854J03553b4152
18141A4808L2205b39699B07676J1387E3945Q9224k7743a21163A46751a86608a8556
18129g1313l4203B6389j0097J7619a48024b9188A09489b8274A07112B0746b13288
$$ plain form
18117 -440729 47248 -212448 -340587 -12790 -41663 -420784 -323113 -97483 -99194 -63633 -238342
18106 -238342 -10354 -17879 248474 -269642 -109610 272351 -266422 21983 199468 -65998
18095 126809 17311 39297 -80480 216308 106261 -116537 17495 12094 -131520 33683 -6088
18083 235014 265820 96908 -188196 396809 -180348 -17042 175965 116980 68602 -9821 45469
18071 -165859 -90660 -82975 -5985 -29915 43914 69463 85444 49151 -151569 -64445 -149992 113863
18058 -94056 -9799 152480 -24068 -280945 21454 82617 -422860 181785 31754 -173818 22466
18046 -214426 -47221 -234211 -65140 345990 -48777 -431356 242106 -19976 172420 18351
18035 -276451 1315 -42704 -196175 172711 -118995 338511 -47855 -56861 86659 67411 200210
$$ packed form
18117d40729D7248b12448j28139a2790k8873l79121R7671i7483j711L5561j74709
18106b38342a0354p525B48474b69642a09610B72351b66422B1983J77485f5998
18095A26809A7311K1986h0480B16308A06261a16537A7495n401a31520C3683f088
18083B35014L0806I6908a88196C96809a80348a7042A75965n8985m8378i821D5469
18071a65859P5199P685e985k3930D3914K5549J5981l6293a51569f4445q5547A13863
18058i4056i799A52480b4068k56877B1454O1163d22860A81785C1754a73818B2466
18046b14426d7221j86990f5140C45990d8777l82579B42106a9976A72420A8351
18035b76451A315d2704j53471A72711a18995C38511d7855r006H6659j9248J32799
$$ plain form
18024 200210 114961 10752 251565 -168643 -262131 -89519 91179 201818 -20781 -152935 78654
18012 28612 86916 49777 100641 129296 72979 77661 122182 121459 -108073 208844 -187164 231617
17999 236840 94760 260379 24044 -13452 71673 68602 -67900 122943 -95226 -69339 -26552
17987 -36986 177561 372608 137889 112587 -99600 -88450 -17273 308379 289098 90004 -35994
17975 11969 -311236 61514 86140 -581293 -149604 1758 -163931 -16996 54923 128899 56453
17963 -240709 -6881 -156258 -12760 -288023 2573 163113 -345588 -118798 -164206 91734 -85394
17951 -301907 511719 -242354 -16980 94152 -61145 139982 -111888 -291070 108305 -150953
17940 53211 -251380 -37721 149393 -40570 267113 126507 105755 -384386 61053 -218521
$$ packed form
18024B00210q5249A0752K40813a68643r3488h9519I1179J10639b0781j32154G8654
18012B8612N8304l7139N0864K8655n6317M682M4521p23a08073B08844a87164B31617
17999B36840I4760J65619B4044a3452G1673l071f7900A22943i5226K5887b6552
17987c6986A77561J95047A37889k5302i9600J1150a7273C08379j9281I0004c5994
17975A1969c11236F1514K4626e81293a49604A758a63931a6996E4923P3976E6453
17963b40709f881j49377a2760k75263B573J60540c45588a18798m5408I1734h5394
17951c01907E11719b42354a6980I4152f1145A39982a11888j79182A08305a50953
17940E3211b51380c7721A49393d0570B67113A26507k0752c84386F1053b18521
$$ plain form
17929 49536 -105709 -81303 -58334 -209217 -485726 72713 -178512 -16783 -68362 -220014 -168847
17918 -168847 96043 157371 -164867 23505 100805 -77014 -16768 -65894 20089 233396 -46538
17906 -110508 -258137 195752 169870 47657 200643 -95410 31322 -34423 -265371 -241778 120823
17894 -306459 -161637 46892 -156087 -40162 -286320 -87584 321973 96216 -33921 -179370
17884 -179370 -239904 -88938 -395345 -31294 -1780 57152 83701 89749 12357 232012 127233
17873 127233 254590 143154 49100 237092 11816 36348 -16688 -13960 173643 -239963 163435
17861 -11549 -51210 89973 -2016 79415 212616 318487 237401 -68373 -259796 24577 334978
17850 334978 103348 -18745 113242 18793 -177443 55074 7764 17225 -240367 -79296 10616
$$ packed form
17929D9536a05709K4406K2969j50883k76509G2713a78512a6783n1579j51652N1167
17918a68847I6043O1328a64867B3505P7300g7014a6768m9126B0089K13307d6538
17906a10508j47629A95752k5882D7657J52986i5410C1322c4423k30948K3593A20823
17894c06459J44822D6892a56087d0162k46158h7584C21973I6216c3921j45449
17884a79370o0534h8938l06407c1294a780E7152K6549O048A2357K19655j04779
17873A27233J27357j11436D9100J87992A1816K4532a6688K728A73643b39963A63435
17861a1549l9661H9973b016G9415J33201J05871q1086f8373j91423B4577L10401
17850C34978A03348a8745A13242A8793a77443E5074G764R461b40367g9296A0616
$$ plain form
17838 -64494 -204382 88413 149798 31393 -24572 -48017 -302747 -184398 -61527 -10576 -72248
17827 -72248 130932 -87700 -90347 -3300 95628 180596 -28202 -381877 23312 -233014 -142568
17816 -142568 -98639 97383 85413 -170371 -86479 -54540 183397 -57595 85651 -177536 -180102
17805 -180102 -73915 453814 -31996 -4251 -143093 -63864 73475 -26733 -33806 -135397 120437
17793 203540 -127989 -61977 6312 96698 25247 157943 648 -78456 -110755 -153888 271854
17781 -319059 69904 -91616 -124300 -44402 -100231 -409011 289667 60713 -109643 11423 -55503
17769 12631 -221328 -53059 95745 15735 -256780 -72441 -7513 19231 184015 -58836 26568
17757 36517 -50354 -29817 -3337 -202630 -140016 -155782 -162934 -289959 62808 -155304 -62864
$$ packed form
17838f4494j39888H8413O1385C1393b4572k3445k54730J18349f1527a0576o1672
17827g2248A30932h7700k647c300I5628Q4968b8202l53675B3312b33014R0446
17816a42568M3929I7383j1970a70371Q3892L1939A83397e7595H5651a77536k566
17805a80102g3915D53814c1996d251j38842f3864G3475b6733p073j01591A20437
17793B03540a27989f1977F312R0386B5247J32696F48g8456l2299m3133B71854
17781c19059F9904i1616l2684d4402n5829l08780B89667F0713a09643A1423e5503
17769A2631b21328e3059I5745A5735b56780g2441g513A9231J64784e8836B6568
17757C6517e0354K0537c337j99293O2614j5766p152j27025F2808a55304f2864
$$ plain form
17745 48625 -339499 300698 247530 68395 159932 217225 113754 54765 23949 250607 82419
17733 -17828 34544 103498 166690 -107665 150645 -335941 -328845 64310 166534 45211 -111170
17721 38656 98891 36770 438718 -169859 14397 265923 45279 45892 237039 34351 -19628
17709 889 -138757 -90415 -167929 -25422 26910 62625 25862 -269676 -10406 107248 38599
17697 -92783 111501 -145613 100356 248514 141544 173413 203600 47172 -172513 -36403
17686 58631 -161933 -81612 -277508 351859 -92433 333944 122518 46868 193705 4292 249938
17675 249938 201588 34546 172178 -105934 143896 -179294 -304118 318151 -64519 55791
17664 148982 -33544 -84816 -125889 31360 349514 -70716 139543 44518 10409 -48198 106405
$$ packed form
17745D8625c39499C00698n3168F8395R1537N7293j03471E4765B3949K26658H2419
17733a7828C4544O8954O3192a07665A50645c35941P096F4310J02224D5211a11170
17721C8656O0235C6770M01948a69859A4397K51526D5279O13J91147C4351a9628
17709H89a38757M8342p7514b5422B6910L5715B5862b69676a0406A07248C8599
17697i2783A11501a45613A00356J48158j06970L1869L0187D7172a72513c6403
17686E8631a61933Q0321j95896C51859i2433C33944A22518D6868J46837D292K45646
17675B49938m8350C4546J37632a05934A43896a79294j24824C18151f4519E5791
17664A48982c3544n1272m1073C1360L18154g0716A39543D4518A0409d8198A06405
$$ plain form
17652 161630 139492 210554 17435 57592 298543 -273439 -162697 118740 -59840 -67586 -191531
17641 -191531 233781 1668 14549 249719 -83164 218131 -169909 -27643 252005 64408 52775
17630 52775 244194 18304 -279281 70245 -46054 25787 9655 148881 138798 -209363 10052
17618 -25344 -22732 -16225 310889 23699 -153806 -120593 142303 180386 -111239 17327 121820
17607 121820 287070 -148557 142044 131138 258087 -137313 -337434 137069 142283 -25085
17596 118484 128938 260398 -19214 127120 -26575 -13206 54050 -12139 211437 -20533 -221243
17585 -221243 -275464 246769 127314 -14697 25363 205357 -100394 358549 -98113 336433
17574 193056 142679 -99677 249901 143323 57921 -34513 -108353 36898 210234 64569 61409
$$ packed form
17652A61630k2138P1062A7435M0157K40951b73439J10742A18740e9840p746j23945
17641a91531B33781A668J2881K35170h3164B18131a69909b7643B52005F4408j1633
17630E2775J91419A8304b79281G0245d6054B5787I655J39226j0083b09363A0052
17618b5344K612O507C10889B3699a53806L3213A42303L8083a11239A7327J04493
17607A21820J65250a48557A42044j0906J26949a37313k00121A37069N214b5085
17596A18484J0454J31460a9214A27120b6575a3206E4050a2139B11437b0533k00710
17585b21243n4221B46769j19455a4697B5363J79994a00394C58549i8113C36433
17574A93056n0377i9677B49901j06578E7921c4513p3840C6898J73336F4569l160
$$ plain form
17563 61409 -41789 -91492 -241782 87442 -51008 78021 -19144 432824 169181 -133663 201075
17551 -141268 33763 -32165 -59152 55315 -304033 146199 89321 -10189 168850 65913 2338
17539 23955 268471 248425 35105 19852 -268449 -345913 -88581 -32422 212916 8824 -34623
17527 -122447 102731 164860 198970 415559 -155790 202803 26665 82931 127828 284567
17517 284567 197449 88836 78545 144003 244218 -56153 35625 -42501 23684 55563 -134600
17505 216525 -27355 84008 68444 331328 8182 27340 254707 41255 227946 -233525 13202
17493 203503 -134927 426222 14590 -2784 143307 19886 185208 145331 261845 70113 -164863
17481 149463 74281 166759 261983 270054 -80607 38649 -49146 124194 155409 64292 67403 72194
$$ packed form
17563F1409d1789m9703j50290H7442e1008G8021a9144D32824A69181a33663B01075
17551a41268C3763c2165k6987E5315c04033A46199n6878a0189A68850F5913B338
17539B3955K44516k0046C5105j5253b68449p7464h8581c2422B12916H824c4623
17527a22447A02731O2129L4110K16589a55790B02803B6665N6266M4897J56739
17517B84567q7118H8836j0291O5458J00215e6153C5625d2501B3684L1879a34600
17505B16525b7355H4008j5564K62884H182J9158K27367D1255J86691b33525A3202
17493B03503a34927D26222A4590b784A43307A9886J65322l9877J16514G0113a64863
17481A49463G4281R2478R5224Q071h0607C8649d9146A24194L1215F4292L111M791
$$ plain form
17469 72194 156479 151742 46092 -69027 83161 -120342 36047 309023 245378 69945 -8227 -164689
17457 -164689 -34018 277880 102333 106190 248363 264525 262789 267466 383463 330254 208552
17446 208552 210365 164573 174859 238110 280071 256881 229424 -113992 137680 81885 158385
17435 158385 147679 288224 318194 -13340 36657 398685 -266829 -135094 542413 195200
17424 362355 143227 541626 209793 216667 -63921 -75688 450738 65874 140199 612184 88722
17412 10933 53348 -202060 -20078 140217 160049 29449 269224 65493 97343 87055 -34421
17400 32565 2593 17833 119744 6396 45077 189005 -165650 66610 162599 204645 68236
17388 232061 414555 322154 347207 195976 178236 96402 134675 73400 399505 158034 250577
$$ packed form
17469G2194Q4285m737D6092f9027H3161a20342C6047K72976o3645F9945h227j56462
17457a64689c4018B77880A02333L857J42173J6162j736M677J15997n3209j21702
17446B08552J813m5792J0286O3251M1961k3190k7457a13992A37680n5795P6500
17435A58385j0706J40545K9970a3340C6657L62028b66829J31735E42413A95200
17424C62355A43227L98399B09793O874f3921j1767D50738F5874P4325M71985H8722
17412A0933M2415b02060b0078A40217J9832B9449K39775F5493L1850j0288c4421
17400C2565B593J5240J01911F396L8681J43928a65650F6610R5989M2046F8236
17388B32061J82494r2401K5053j51231j7740q1834L8273o1275L26105A58034R2543
$$ plain form
17377 250577 236567 228721 187240 231027 154639 81835 215085 317080 231918 -90188 136695
17365 88916 -136586 223832 -37587 -27534 130841 244088 135406 24598 96242 110038 42244
17353 247753 131516 196718 -392805 -220301 -53950 61304 246300 376127 126156 205726
17343 205726 317814 184294 470150 390674 -34811 -301524 163151 -135181 -226452 234097
17332 46478 1105 143336 207292 207799 64331 518733 -213549 250192 -22605 187778 136132
17321 136132 63572 67687 264314 -29560 121297 61612 44472 343131 396814 24375 90866
17310 90866 189386 275403 113376 -8577 16239 131440 295344 32876 183559 -55020 384086
17298 -19794 280311 144996 139327 349884 152643 96411 166071 -73283 60490 265005 230296
$$ packed form
17377B50577j4010p846m1481M3787p6388p2804J33250J01995q5162i0188A36695
17365H8916a36586B23832c7587J0053A30841J13247j08682B4598P1644J3796D2244
17353B47753j16237O5202c92805J72504e3950F1304J84996J29827A26156P9570
17343B05726J12088j33520K85856p9476c4811k66713A63151a35181r1271B34097
17332D6478A105J42231O3956N07F4331M54402b13549B50192b2605A87778n1646
17321A36132F3572M115J96627b9560A21297n9685j7140K98659N3683B4375O6491
17310I0866R8520Q6017A13376h577A6239J15201J63904C2876J50683e5020C84086
17298a9794B80311j35315n669K10557A52643n6232O9660g3283F0490K04515l4709
$$ plain form
17287 230296 230378 -125186 286623 124461 446012 79835 333878 -54153 124342 140044 374385
17276 374385 307157 111680 177462 216705 264099 298806 -82094 154533 394461 249278 132815
17265 132815 -152106 129053 148876 -40203 -99665 80002 141322 122777 320504 335095 85927
17253 373694 230833 407236 -218043 214059 206720 242197 458386 -103839 -6258 215137
17242 313462 252547 -9269 161223 256486 55270 261515 277173 123283 118821 66682 102261
17231 102261 207644 130496 81071 195736 333818 362792 262663 263188 324896 262267 -8059
17219 298429 165709 96966 83656 362331 60628 196925 55270 5734 146649 459297 319115
17208 319115 201682 140794 430802 219829 220840 179705 191336 109578 305060 316287 171488
$$ packed form
17287B30296Q2a25186B86623A24461L21551G9835K54043e4153A24342J5702K34341
17276C74385o7228A11680O5782L9243M7394L4707h2094A54533K39928j45183j16463
17265A32815a52106A29053J9823d0203n9462H0002O1320j8545J97727J4591H5927
17253C73694j42861J76403b18043B14059p339L5477K16189a03839f258B15137
17242C13462o0915i269A61223R5263E5270K06245J5658A23283m462n2139L5579
17231A02261J05383p7148m9425J14665J38082K8974j00129N25O1708o2629h059
17219B98429j32720o8743j3310K78675F0628J36297E5270E734J40915L12648j40182
17208C19115j17433o0888K90008k10973J011m1135J1631q1758J95482J1227j44799
$$ plain form
17197 171488 150491 216205 35256 288173 376659 17944 25693 -256613 177689 114917 374059
17186 374059 62825 389090 223417 366085 476934 1279 134888 357502 149209 292373
17176 292373 -35338 -58823 311031 358147 476849 575005 503368 436759 336388 122460 592801
17165 592801 287536 465526 565223 193227 294910 -174088 157660 222880 158938 349202
17155 349202 247144 547439 197863 296344 395568 626701 358110 396934 317631 260618
17145 260618 720971 418196 -15446 371530 415849 120530 322879 382690 263512 231498
17135 231498 120739 535241 239074 7102 277386 407869 -27183 574712 604730 546746
17125 546746 218875 418143 561015 178934 345090 413070 157182 441198 399881 285310
$$ packed form
17197A71488k0997O5714C5256K52917Q8486A7944P749b56613A77689o2772K59142
17186C74059F2825L26265j65673J42668J10849A279J33609K22614A49209J43164
17176B92373c5338k3485C11031M7116J18702R8156p1637o6609j00371A22460M70341
17165E92801B87536J77990R9697A93227J01683a74088A57660O5220o3942J90264
17155C49202j02058L00295A97863R8481R9224K31133k68591L8824p9303n7013
17145B60618M60353l02775a5446C71530M4319A20530K02349N9811j19178l2014
17135B31498j10759M14502B39074G102K70284J30483b7183E74712L0018n7984
17125E46746B18875J99268J42872A78934J66156O7980A57182K84016m1317j14571
$$ plain form
17115 285310 364361 534016 903557 57773 190329 430365 550280 288647 512156 156561
17104 168577 294193 -39120 451351 288299 96338 185748 256300 323283 439790 305119
17094 305119 274332 404279 679447 228986 455215 24236 429518 795883 543904 229884
17083 502306 557301 124343 542491 339866 369885 536744 389434 313652 489905 225953
17072 457397 594965 706157 352492 487686 506995 528084 690811 358406 477063 510682
17062 510682 585973 89805 248970 473121 466519 710746 550555 669275 325840 529239
17052 529239 339166 697155 329190 364582 556669 475108 548342 421666 502162 328127
17042 328127 666850 272655 518530 525978 535811 569767 452331 411372 191988 312802 586417
$$ packed form
17115B85310P9051J69655L69541E7773J32556K40036J19915k61633K23509A56561
17104A68577J25616c9120D51351j63052I6338Q9410P0552O6983J16507j34671
17094C05119l0787J29947K75168B28986K26229B4236M05282L66365k51979B29884
17083E02306N4995A24343M18148k02625L0019J66859j47310p5782J76253B25953
17072D57397J37568J11192C52492J35194J9309K1089J62727l32405J18657L3619
17062E10682P5291H9805J59165K24151o602K44227j60191J18720C25840K03399
17052E29239j90073L57989C29190L5392J92087q1561P3234j26676Q0496j74035
17042C28127L38723B72655K45875P448R833L3956j17436m0959A91988J20814K73615
$$ plain form
17031 586417 512382 472078 298066 445462 402758 440268 520311 514924 497373 616697 401272
17020 401272 361887 480675 533163 655037 848091 766955 465665 395774 629721 726587
17010 726587 758059 959314 739747 853341 510671 729767 584749 711658 569520 960309
17000 960309 772945 593443 631902 609277 601381 846674 467332 728892 708028 765015 719177
16989 719177 863228 793872 697417 619041 991795 1070287 920720 724339 799169 904196
16979 904196 900378 789439 794559 915374 877537 751403 1005175 979735 1071773 1094523 890463
16968 890463 817222 886700 682546 1021520 1162167 867868 957877 875354 1283940 1025571
16958 1025571 638887 929521 934853 908943 1012964 975163 1180595 975802 909215 1337706
$$ packed form
17031E86417p4035m0304j74012J47396m2704L7510Q0043n387j7551J19324k15425
17020D01272l9385J18788N2488J21874J93054q1136l01290o9891K33947R6866
17010G26587L1472K01255k19567J13594l42670K19096j45018J26909j42138L90789
17000I60309j87364j79502L8459k2625p896K45293l79342K61560k0864N6987m5838
16989G19177J44051o9356r6455p8376L72754P8492j49567j96381P4830J05027
16979I04196l818j10939N120J20815l7837j26134K53772k5440R2038K2750k04060
16968H90463p3241O9478k04154L38974J40647k94299R0009q2523M08586k58369
16958A025571l86684K90634N332k5910J04021l7801K05432k04793o6587M28491
$$ plain form
16948 1337706 591133 1000582 1213268 1542113 1053403 1021108 981435 1138849 1281360 1222959
16938 1222959 1186831 1110713 1265689 1362927 1255550 970608 1187339 1320340 1205168 1407036
16928 1407036 1217355 1489214 1330956 1043918 1262811 1411816 1543332 1309210 1258965 1404911
16918 1404911 1307047 1489625 1426904 1431630 1359975 1337287 1725932 1312712 1562392 1368916
16908 1368916 1529750 1623159 1772128 1426317 1703845 1878040 1228872 1636521 1667731 1734392
16898 1734392 1766675 1399650 1643928 1842998 1991454 2017393 1984183 2073256 1780227 1953785
16888 1953785 2122989 1968153 2265518 1976892 2043898 2001582 2404128 2159714 2151085 2527225
16878 2527225 1939801 2137692 2126174 2305456 2395294 2599830 2267366 2419797 2310273 2662049
$$ packed form
16948A337706E91133M09449K12686L28845m88710l2295l9673J57414J42511n8401
16938A222959l6128p6118J54976R7238j07377k84942K16731J33001j15172K01868
16928A407036j89681K71859j58258k87038K18893J49005J31516k34122n0245J45946
16918A404911r7864J82578o2721M726p1655k2688L88645m13220K49680j93476
16908A368916J60834R3409J48969l45811K77528J74195o49168M07649L1210O6661
16898A734392L2283l67025K44278J99070J48456K5939l3210Q9073k93029J73558
16888A953785J69204j54836K97365k88626O7006m2316M02546k44414q629L76140
16878B527225n87424J97891j1518J79282Q9838K04536l32464J52431j09524L51776
$$ plain form
16868 2662049 2564789 2797443 2516170 2717666 2347655 2552327 2576218 2629847 2786526 2460276
16858 2460276 2968793 2651668 2715487 3195848 3155339 3185333 2901635 2916676 3258306 3153899
16848 3153899 3514876 3247725 3258198 3410913 3426363 3262737 3411729 3740510 3784092 3905123
16838 3905123 3866926 3938810 4041210 3754036 3993624 4372244 4160614 4366819 4526199 4559876
16828 4559876 4721028 4797739 4706419 4749571 4927530 5029909 4802149 5524170 5458904 5210733
16818 5210733 5274347 5558662 5504793 5996657 6150689 5804667 6285208 6325234 6164008 6445425
16808 6445425 6793456 6908633 7070875 6868569 7230356 7362223 7481749 7970598 7928142 8431838
16798 8431838 8639686 8457990 8486504 9039492 9390832 9349435 9477003 9970140 10310185 10589862
$$ packed form
16868B662049r7260K32654k81273K01496l70011K04672K3891N3629J56679l26250
16858B460276N08517l17125O3819M80361m0509K9994k83698J5041L41630j04407
16848C153899L60977k67151J0473J52715J5450j63626J48992L28781M3582J21031
16838C905123l8197P1884J02400k87174K39588L78620k11630K06205J59380L3677
16828D559876J61152P6711r1320M3152J77959J02379k27760P22021o5266k48171
16818E210733O3614K84315n3869M91864J54032l46022M80541M0026j61226K81417
16808F445425L48031J15177J62242k02306L61787J31867J19526M88849m2456N03696
16798H431838K07848j81696K8514N52988L51340m1397J27568M93137L40045K79677
$$ plain form
16788 10589862 11047947 10966194 11042554 11655355 11949345 12289312 12526537 12640034 13418801 13820227
16778 13820227 14437088 14888175 15094450 15568689 15978352 16453819 17290774 17559762 18086184
16769 18086184 18834042 19388747 20267143 20932595 21861787 22741822 23217209 24398402 25318322
16760 25318322 26209427 27244101 28371310 29675980 30956365 32245892 33730066 35390092
16752 35390092 36914407 38449222 40398684 42511580 44368903 46644366 49292402 51841641
16744 51841641 54495134 57253291 60472546 63820072 67398351 71171725 75109922 79498263
16736 79498263 83948633 88628659 94109351 99451797 105251158 111389008 117644734 123982125
16728 123982125 130302864 137337414 143750062 150154833 156770434 162387632 168026760 172632234
$$ packed form
16788A0589862M58085q1753P6360O12801K93990L39967K37225J13497P78767M01426
16778A3820227O16861M51087K06275M74239M09663M75467Q36955K68988N26422
16769A8086184P47858N54705Q78396O65452R29192Q80035M75387J181193R19920
16760B5318322Q91105J034674J127209J304670J280385J289527J484174J660026
16752C5390092J524315J534815J949462K112896J857323K275463K648036K549239
16744E1841641K653493K758157L219255L347526L578279L773374L938197M388341
16736G9498263M450370M680026N480692N342446N799361O137850O255726O337391
16728A23982125O320739P034550O412648O404771O615601N617198N639128M605474
$$ plain form
16720 172632234 176482235 179095569 181149100 182109425 181259439 179693019 177084098 173724769
16712 173724769 168756482 162994256 157537750 151331400 144410067 137628048 130775661 123705469
16704 123705469 117167383 110477787 104616906 98790134 92900746 87577248 82508643 77917597
16696 77917597 73573278 69330504 65467636 61877859 58520906 55453518 52490031 49727138
16688 49727138 47192494 44689810 42544282 40529139 38889232 36911985 35024346 33247341
16680 33247341 31871164 30230485 29385187 27914187 26560225 25513206 24552204 23893753
16672 23893753 22821069 21846019 21003688 19912845 19447880 18506086 17883431 17116991 16943950
16663 16943950 16223313 15886077 15098746 14780375 14181236 13716302 13399862 12898572 12413874
$$ packed form
16720A72632234L850001K613334K053531R60325q49986j566420k608921l359329
16712A73724769m968287n762226n456506o206350o921333o782019o852387p070192
16704A23705469o538086o689596n860881n826772n889388n323498n068605m591046
16696G7917597m344319m242774l862868l589777l356953l067388k963487k762893
16688D9727138k534644k502684k145528k015143j639907j977247j887639j777005
16680C3247341j376177j640679q45298j471000j353962j047019r61002o58451
16672B3893753j072684r75050q42331j090843m64965r41794o22655p66440j73041
16663A6943950p20637l37236p87331l18371n99139m64934l16440n01290m84698
$$ plain form
16654 12413874 12039584 11784550 11402924 11084896 10555167 10385451 9769563 9584834 9560262
16645 9560262 8928351 9200722 8750995 8497984 8208428 8364045 8114677 7616611 7482478
16636 7482478 7498183 7236291 6890915 6889182 6673662 6280548 6528872 6112776 6227154 6158490
16626 6158490 5617079 5552518 5594740 5387760 5423277 5305464 5464163 5070853 4874550 4778999
16616 4778999 4696438 4632733 4566724 4649050 4212926 4520037 4356188 4053508 4299539 3886999
16606 3886999 3943064 4027098 4064408 3940171 3535696 3446911 3628218 3381252 3378486 3330729 3122366
16595 3122366 3026754 3047697 3036734 3118438 2901713 2948014 3116348 2580703 2996930 2627176
16585 2627176 2560595 2614165 2692849 2443430 2451276 2268381 2380280 2686666 2476699 2594084
$$ packed form
16654A2413874l74290k55034l81626l18028n29729j69716o15888j84729k4572
16645I560262o31911K72371m49727k53011k89556J55617k49368m98066j34133
16636G482478J5705k61892l45376j733k15520l93114K48324m16096J14378o8664
16626F158490n41411o4561M2222k06980L5517j17813J58699l93310j96303r5551
16616D778999q2561o3705o6009Q2326m36124L07111j63849l02680K46031m12540
16606C886999N6065Q4034L7310j24237m04475q8785J81307k46966k766m7757k08363
16595C122366r5612K0943j0963Q1704k16725M6301J68334n35645M16227l69754
16585B627176o6581N3570P8684k49419P846j82895J11899L06386k09967J17385
$$ plain form
16575 2594084 2366260 1979509 2219734 2150312 2312427 2355473 2303500 2211794 2060604 2265155
16565 2265155 2262166 1873302 2111766 2039599 1876337 1749947 1834678 1496037 1608579 1754667
16555 1754667 1511196 1843827 1789076 1572317 1632273 1540321 1671966 1470796 1996677 1629874
16545 1629874 1629462 1652692 1291362 1365357 1102982 1416706 1376204 1456726 1376437 1053226 1285102
16534 1285102 1328511 1314789 1314267 1457215 941117 1393558 962047 1171549 1255426 1402097
16524 1402097 983182 1016935 1148946 1212163 795037 1333168 1098065 950313 1372722 976495
16514 976495 1260769 962468 1075050 1192192 932981 1010932 968819 1058021 771626 659347
16504 659347 1092360 1011148 834831 1028619 1006249 825372 1017098 1065590 932848 1076707
$$ packed form
16575B594084k27824l86751K40225o9422J62115M3046n1973r1706j51190K04551
16565B265155k989l88864K38464p2167j63262j26390Q4731l38641J12542J46088
16555A754667k43471L32631n4751k16759N9956r1952J31645k01170N25881l66803
16545A629874m12K3230l61330P3995k62375L13724m0502Q0522q0289l23211K31876
16534A285102M3409j3722n22J42948n16098M52441m31511K09502Q3877J46671
16524A402097m18915L3753J32011O3217m17126N38131k35103j47752M22409l96227
16514I76495K84274k98301J12582J17142k59211P7951m2113Q9202k86395j12279
16504F59347M33013q1212j76317J93788k2370j80877J91726M8492j32742J43859
$$ plain form
16494 1076707 834383 841618 548890 840000 672484 983204 997964 747985 833082 832748 636959
16483 636959 657357 638324 947787 850170 950014 614723 609061 684996 700838 781929 813061
16472 813061 1001732 236619 679107 449006 685983 562451 521595 499490 565523 592529
16462 592529 654882 318674 607521 352748 412514 59596 855485 872867 692882 536301
16452 536301 541880 689768 777580 289544 621692 575049 500518 468665 398283 332548 160828
16440 526415 419944 567770 562150 436367 375517 322927 433237 555651 534130 727606
16430 727606 428785 369949 636017 562278 246203 392660 251909 421028 445903 555705
16420 555705 359355 357749 246946 259947 222410 185971 779045 456409 466233 257938 333262
$$ packed form
16494A076707k42324P235k92728K91110j67516L10720J4760k49979Q5097l34j95789
16483F36959K0398j9033L09463r7617R9844l35291n662P5935J5842Q1091L1132
16472H13061J88671B36619M42488k30101K36977j23532m0856k2105O6033K7006
16462E92529O2353C18674K88847k54773N9766E9596P95889J7382j79985j56581
16452E36301N579J47888Q7812B89544L32148m6643p4531l1853p0382o5735A60828
16440E26415j06471J47826n620j25783o0850n2590J10310J22414k1521J93476
16430G27606k98821n8836K66068p3739B46203J46457j40751J69119K4875J09802
16420E55705j96350j606j10803J3001l7537l6439N93074l22636R824k08295P5324
$$ plain form
16409 333262 341486 -85999 207494 302298 171493 353457 415037 210927 593106 457049
16399 457049 421248 415884 484051 287267 272446 214433 387449 512285 186694 207895 471150
16388 471150 134979 749092 190724 243945 424109 99278 79779 342261 -44741 217406
16377 249560 68609 218976 202131 347030 42648 288092 167930 266033 78894 267590
16367 267590 248116 529311 571049 25350 123021 408025 50875 262355 255425 87235 303723
16356 303723 230463 201184 102185 110232 531391 507307 244010 461481 287631 313132 170089
16345 170089 -383 160213 58053 164647 173938 379662 159028 448546 367774 219026 343115
16334 343115 38728 165318 -34412 47579 10372 64347 279841 145337 151180 474484 214434
$$ packed form
16409C33262Q224h5999B07494R4804j30805J81964O1580k04110L82179j36057
16399D57049l5801n364O8167j96784j4821n8013J73016J24836A86694K1201K63255
16388D71150A34979O14113A90724N3221J80164I9278j9499K62482d4741B17406
16377B49560F8609J50367j6845J44899D2648K45444j20162R8103G8894J88696
16367B67590j9474K81195M1738B5350R7671K85004E0875K11480o930H7235K16488
16356C03723p3260k9279r8999Q047M21159k4084B44010K17471j73850K5501j43043
16345A70089c83A60213E8053J06594R291K05724A59028K89518q0772j48748J24089
16334C43115C8728J26590c4412D7579A0372N3975K15494j34504N843L23304B14434
$$ plain form
16322 190199 386629 96402 37024 247149 -53927 -84319 228609 267050 152760 81759 281341
16311 281341 272405 145140 -49441 230558 178578 232190 -132876 14688 413845 -163373 -23376
16299 335611 253843 288751 255109 243028 186456 77940 38390 -188426 145647 -284862 -61220
16287 -3770 9146 148457 120799 -247816 348717 292485 106539 239156 235844 -2913 187367
16275 201417 2654 -134825 340164 168020 371536 53009 101662 73478 -90975 216449 255272
16264 255272 -92561 6142 -27850 -67422 417015 108681 270357 217881 181930 8987 201518
16253 201518 207157 173413 78008 227048 -78630 -106702 86716 31991 77697 65988 365472
16242 365472 355715 7744 13513 370756 268283 157484 -211772 -164706 -92978 16300 172362
$$ packed form
16322A90199J96430I6402C7024K10125e3927l0392B28609L8441j14290p1001J99582
16311B81341q936j27265d9441B30558n1980N3612a32876A4688L99157a63373b3376
16299C35611q1768L4908l3642j2081n6572G7940C8390a88426A45647b84862f1220
16287c770I146J39311k7658b47816C48717n6232A06539J32617l312b913A87367
16275B01417B654a34825C40164A68020K03516E3009M8653k8184i0975B16449L8823
16264B55272i2561F142b7850l9572D17015A08681J61676n2476l5951H987J92531
16253B01518N639l3744G8008J49040g8630k8072H6716C1991M5706j1709K99484
16242C65472r757G744N769L57243j02473j10799b11772M7066P1728A6300J56062
$$ plain form
16231 172362 31723 58795 -108534 -18108 193685 84968 131402 -165034 -7222 -73865 132989
16219 114381 -5722 82464 58344 -137428 88901 -17138 324059 193383 29665 24058 -76100
16207 218524 319911 84459 -161586 -82481 -8042 484396 232732 119352 205636 448648
16197 448648 -149480 325881 -173925 45842 182632 -114021 467852 254370 -124539 -313238
16187 -313238 22533 -303650 602366 -31112 91936 62144 -74716 -60609 138603 -257749 -152847
16176 -152847 129737 -64458 22821 345815 125984 -3976 -9401 -54214 -38938 121545 -93906
16164 -202599 103199 206639 -98572 -249243 -31080 208560 -19856 -100881 -62930 273741
16153 -105689 433982 -19677 278343 153021 120042 -28368 505489 80158 -12385 257412
$$ packed form
16231A72362C1723K7072a08534a8108A93685H4968M6434a65034g222o6643A32989
16219A14381e722H2464k4120a37428H8901a7138C24059j30676B9665n607g6100
16207B18524J01387H4459a61586P9105h042D84396B32732j13380Q6284K43012
16197D48648a49480C25881a73925D5842J36790a14021D67852k13482a24539j88699
16187c13238B2533c03650F02366c1112I1936k9792g4716J4107A38603b57749J04902
16176a52847A29737f4458B2821L22994A25984c976n425m4813J5276A21545i3906
16164b02599A03199J03440i8572j50671c1080B08560a9856q1025L7951B73741
16153a05689D33982a9677B78343j25322l2979b8368E05489H0158a2385B57412
$$ plain form
16142 148055 222644 -23805 33482 -80700 155072 -109098 9344 -259938 200425 43174 -134197
16130 -112544 -26935 -68898 -89443 -257775 44245 456139 72527 -175332 159604 124742 -79277
16118 -151936 -299383 24759 128036 -79878 18668 -23979 -82932 93470 197673 13084 -60108
16106 -165609 -20297 -90059 88948 -258617 9332 44916 127692 313894 -25802 -29210 -16136
16095 -16136 92976 101899 -248851 169611 -145237 285206 -108486 143528 -164240 -43841
16084 -291001 -180124 131983 -79922 -353432 144100 73718 38385 -76091 86829 -142797
16073 84495 50698 -166100 -53005 -118671 -140702 -52515 50345 51886 -278555 -5898 9104 -78247
16060 344343 -101597 173587 -22331 -48642 199885 50164 45979 -223296 161234 -219041
$$ packed form
16142A48055P4589b3805C3482h0700A55072a09098I344b59938B00425D3174a34197
16130a12544b6935m1963k0545j68332D4245M11894G2527a75332A59604l4862g9277
16118a51936j47447B4759J03277g9878A8668b3979n8953I3470J04203A3084f0108
16106a65609b0297o9762H8948b58617I332L5584Q2776J86202b5802l408J3074
16095a6136I2976Q923b48851A69611a45237B85206a08486A43528a64240d3841
16084b91001J10877A31983g9922k73510A44100p0382l5333g6091H6829a42797
16073H4495l3797a66100e3005o5666k2031e2515E0345J541b78555e898I104g8247
16060C44343a01597A73587b2331k6311A99885E0164m185b23296A61234b19041
$$ plain form
16049 -209227 53446 -53865 -68878 -62720 -129528 253159 1004 66931 -132880 -14072 -156030
16038 -156030 -54565 107188 60526 -40685 -72941 228037 -35791 -121342 70244 172116 308120
16027 308120 -243368 -146680 -68266 -33560 -349858 -11556 -323097 35823 14956 -54341 -82130
16016 -82130 417214 -143458 -268677 289929 72660 193523 211065 -57880 -148920 118682
16005 -43880 -69881 -496107 -161599 -59659 -305541 408322 -138353 225869 -40480 165788
15994 -111559 -64823 5385 -360898 -126914 -78252 193768 -123681 175934 269032 253170 35922
15982 147831 626292 -152366 263571 186593 6558 -102407 -57524 -169123 -226587 140670
15971 -45985 -60273 25169 -119473 66553 -4487 -74834 27144 368659 -49623 67322 150069
$$ packed form
16049b09227E3446e3865j5013O158o6808B53159A004O5927a32880a4072j41958
16038a56030e4565A07188m6662d0685l2256B28037c5791q5551G0244J01872J36004
16027C08120b43368R6688f8266c3560l16298a1556l11541C5823A4956e4341k7789
16016h2130D17214a43458j25219B89929G2660J20863J7542e7880r1040A18682
16005d3880k6001m26226a61599e9659k45882D08322a38353B25869d0480A65788
15994a11559M6736E385c60898a26914M8662A93768a23681A75934R3098j5862C5922
15982A47831M78461a52366B63571p6978F558a02407M4883j11599n7464A40670
15971d5985j4288B5169a19473F6553d487p0347B7144L41515d9623F7322Q2747
$$ plain form
15960 150069 324195 69146 29372 -174110 12413 -218243 110282 53829 40773 70549 -74620
15948 27644 126643 -351214 -106749 188607 -45241 -95245 -4756 31747 122913 297844 2354
15936 115056 -70536 50972 -94060 -3373 -88569 301340 -194580 -36284 -191789 -90663 16912
15924 12153 -121826 -218144 -116476 -157618 135869 32788 -146 65127 -161142 -88402 -424984
15913 -424984 73893 272256 -52636 -16694 -13515 -4161 -1935 -297056 -94125 18251 110610 25079
15900 385567 11761 -8295 56575 1061 -380919 -250668 -195310 124005 267652 -124386 91977
15888 -44048 -175774 289588 132567 44938 -5558 -66571 93089 -79988 -128566 243675 -73986
15876 69688 -132167 -9662 26337 313510 -67679 -357383 19210 -156669 -288992 -109645 -614696
$$ packed form
15960A50069J74126F9146B9372a74110A2413b18243A10282E3829j3056K9776g4620
15948B7644R8999c51214a06749A88607d5241n0004d756C1747R1166J74931B354
15936A15056g0536E0972i4060c373q5196C01340a94580c6284j55505i0663A6912
15924A2153a21826r6318J01668m1142A35869C2788a46F5127a61142P2740l36582
15913d24984G3893J98363e2636a6694L179d161a935k95121i4125A8251R2359B5079
15900C85567A1761h295E6575A061c80919J30251N5358A24005J43647a24386I1977
15888d4048j31726B89588A32567D4938e558o1013I3089g9988m8578B43675g3986
15876F9688a32167i662B6337K87173f7679k89704A9210a56669j32323a09645n05051
$$ plain form
15865 -614696 43647 -64059 -232455 -130512 -355544 -173608 -39992 74862 -80489 -91972 -247434
15854 -247434 72313 -312140 331483 -31615 -111228 -106265 88746 -36372 139830 -286269 175379
15842 -150117 -57616 250871 -233394 -299634 52139 204406 -24420 -179530 -52925 -191913
15832 -191913 194114 56476 163541 80186 218934 28045 -187581 73101 -52635 238287
15821 -1322 -297482 -20535 43325 2858 115687 -152293 9423 116943 87630 43720 -226213
15809 64885 174553 -207389 -206203 -176808 -271828 -122214 -300029 -124687 22116 -14146 -77607
15798 -77607 -165819 112169 -81514 89763 101129 -104023 -119384 158111 199114 -324804 -97122
15786 -47341 -210641 90190 -186786 -45838 -91609 48876 -135156 -45350 32167 94658 -59525
$$ packed form
15865f14696D3647f4059j68396J01943k25032a73608c9992G4862h0489j1483j55462
15854b47434G2313c12140C31483c1615p9613M963H8746c6372A39830b86269A75379
15842a50117e7616B50871b33394o6240E2139J52267b4420j55110e2925j38988
15832a91913A94114E6476J07065H0186J38748B8045a87581G3101e2635B38287
15821a322k96160b0535D3325B858J12829a52293I423J07520k9313D3720b26213
15809F4885J09668b07389J186K9395r5020a22214j77815a24687B2116a4146o3461
15798g7607q8212A12169h1514H9763J1366a04023j5361A58111M1003c24804i7122
15786d7341j63300I0190a86786d5838m5771D8876a35156d5350C2167O2491e9525
$$ plain form
15774 201970 -89415 -55017 -159144 -18454 -117197 -276660 -46775 -123552 -295715 -305041 439501
15762 -157925 219708 -34434 170080 -57957 69059 -45211 -154677 10070 19324 178204 -356584
15750 4555 44770 24806 -7489 -106405 -152608 370411 -73983 225488 -231264 349306 182028
15739 182028 324674 -172139 40376 -120086 188737 26540 131075 -165259 -90130 -27430
15728 -118482 -239034 193712 -130527 -101602 -358124 304517 195297 87132 492323 -105548
15717 224967 -219877 150054 34370 -183696 124534 153718 -390417 -8990 193785 39205
15706 -57811 -189838 -9435 -86754 -158122 43775 111584 -138470 -133661 -379009 -14111 233530
15694 -27434 237408 -2135 -88741 9374 58170 252774 92755 324649 58217 -22199 -130999
$$ packed form
15774B01970h9415L4398j04127a8454r8743j59463d6775p6777j72163r326D39501
15762a57925B19708c4434A70080e7957F9059d5211j09466A0070R254J58880c56584
15750D555M0215j9964g489r8916m6203C70411g3983B25488b31264C49306j67278
15739A82028J42646a72139D0376a20086A88737B6540J04535a65259P5129b7430
15728a18482j20552A93712a30527K8925k56522C04517j09220H7132M05191a05548
15717B24967b19877A50054C4370a83696A24534K9184c90417h990A93785C9205
15706e7811j32027i435p7319p1368D3775O7809a38470M809k45348a4111B33530
15694b7434B37408b135q6606I374M8796J94604I2755K31894E8217b2199j08800
$$ plain form
15683 -130999 -289995 -19152 48154 -225957 -21069 84249 -4252 -94758 -196344 68232 256800
15672 256800 -61885 433809 -58186 -408572 13693 239557 -40733 -36834 -98202 320505 -241100
15660 82593 -307255 -232758 -87335 -10589 -329156 131439 43461 323982 307021 -414804 46285
15648 168020 -103462 -109476 -242080 3621 305545 267894 46227 128549 106236 -326184 98204
15636 21883 -173794 -120789 43217 123419 130487 11860 -18980 202341 -83656 -42772 -126280
15625 -126280 59435 -161448 -214196 104925 -1761 -101491 12732 -226051 -4386 301531 36268
15613 -117799 168985 131802 -359913 128759 -21256 -203278 87790 22197 -114197 -212647
15603 -212647 -266426 -248652 9254 -23759 -55967 -52602 -30293 135152 368659 -117677 100972
$$ packed form
15683a30999j58996a9152D8154b25957b1069H4249d252r0506j01586F8232J88568
15672B56800f1885D33809e8186l50386A3693K25864d0733L899o1368C20505b41100
15660H2593c07255P4497h7335a0589l18567A31439D3461K80521j6961d14804D6285
15648A68020a03462o014j32604C621L01924l7651D6227Q2322k2313c26184I8204
15636B1883a73794N3005D3217Q0202P068A1860a8980B02341h3656M0884q3508
15625a26280E9435a61448n2748A04925a761r9730A2732b26051d386C01531C6268
15613a17799A68985l7183c59913A28759b1256j82022H7790B2197a14197r8450
15603b12647n3779J7774I254b3759l2208L365K2309A35152K33507a17677A00972
$$ plain form
15591 -270329 -106206 -97592 -53110 33771 285437 229749 1732 -196108 -177835 507 -382149
15579 -64403 214525 211456 104523 -20727 -270647 -57776 174138 -289503 -19002 210217 79993
15567 27718 63193 -206925 193795 -104124 32195 115707 -40863 19104 174485 22158 354965
15556 354965 -177805 -139068 196161 -103242 -203379 -104035 -250999 56204 175652 85922
15545 -196455 218627 -114976 -102282 -188019 -124108 -244900 -34781 111432 117989 81242 -320865
15533 -29786 262576 118663 -33700 -399272 -29069 -352612 90408 57013 10432 -284311 61193
15521 87029 -8104 -212081 7761 52034 55245 -280110 -111791 215766 132745 188552 63716
15509 84743 -21830 7754 172892 206559 -212336 -7261 118776 -164712 204149 172910 -98765
$$ packed form
15591b70329a06206Q614M4482C3771K51666n5688A732a96108J8273E07c82149
15579f4403B14525l069A04523b0727k49920e7776A74138b89503a9002B10217G9993
15567B7718L5475b06925A93795a04124C2195Q3512d0863A9104J55381B2158L32807
15556C54965a77805L8737A96161a03242j00137R9344j46964E6204J19448H5922
15545a96455B18627a14976J2694q5737O3911j20792c4781A11432O557l6747c20865
15533b9786B62576A18663c3700l65572b9069l23543I0408l3395A0432b84311F1193
15521H7029h104k03977G761M4273L211b80110a11791B15766q3021N5807F3716
15509H4743b1830G754J65138L3667b12336g261A18776a64712B04149l1239i8765
$$ plain form
15497 -362791 -98642 410412 -75296 -180396 -135531 -10819 114962 -170070 -50952 78123 82420
15486 82420 -227410 91909 -112532 -212734 208633 -39207 -131892 -97794 -28514 -260764 -35563
15474 -247939 57034 -119473 -130704 428 50850 -254669 -87038 84045 -126112 208914 270036
15463 270036 -125830 -2876 6152 260695 73291 -241822 286077 -219350 68489 187898 105470
15452 105470 363114 47604 -86543 -20691 -13779 -28002 -25006 70289 -44723 54110 -207736
15440 -262245 -118123 153879 -86478 -171837 -126072 -47744 273875 28554 77741 -30290 -226472
15429 -226472 -221923 112631 -84689 -154325 43625 320364 136677 -208790 -10062 -60332 -101918
15418 -101918 142249 -48439 69300 -102169 281724 10840 -83315 -129996 -11795 167271 198944
$$ packed form
15497c62791i8642D10412g5296j05100M4865a0819A14962a70070e0952G8123M297
15486H2420b27410I1909a12532j00202B08633c9207r2685L4098b8514k32250c5563
15474b47939E7034a19473j1231D28N0422b54669h7038H4045a26112B08914O1122
15463B70036a25830b876F152K54543G3291b41822B86077b19350F8489J19409q2428
15452A05470K57644D7604h6543b0691O912j4223K996G0289d4723E4110b07736
15440b62245a18123A53879h6478q5359M5765d7744B73875B8554M9187c0290j96182
15429b26472M549A12631h4689o9636D3625K76739A36677b08790a0062n0270m1586
15418a01918A42249d8439F9300a02169B81724A0840h3315m6681a1795A67271L1673
$$ plain form
15407 198944 303377 83676 -153697 239917 187731 14270 93314 -176477 89633 -10492 135959
15395 191678 191690 -174832 -16984 -88227 -58013 19584 126347 -139800 -188707 -190302 -124769 6765
15382 171667 -191567 350115 -78908 -6021 350565 -121620 -373755 -9537 113878 6645 -7166
15370 -396014 110676 -296802 -55146 -3112 -324694 -40639 -185886 261528 -391325 -283010
15360 -283010 -13205 349727 -106826 -28586 281111 -229858 -238247 -15723 223018 -287766
15349 179258 -16657 124289 40348 -138014 -43537 -28694 -194790 -160617 -109919 135501 40559
15337 119178 39870 74435 -29254 -35165 73863 -264966 118176 13363 -344842 -159224 181261
15325 205447 -231023 149360 421001 -320433 226757 191814 -173862 153997 96602 53879
$$ packed form
15407A98944J04433H3676a53697B39917n2186A4270P9044a76477H9633a0492A35959
15395A91678J2a74832a6984p1243L0214A9584J06763a39800m8907j595O5533F765
15382A71667a91567C50115g8908f021C50565a21620k52135i537A13878F645g166
15370c96014A10676b96802e5146c112l21582d0639j45247B61528c91325J08315
15360b83010a3205C49727a06826b8586B81111b29858q389a5723B23018b87766
15349A79258a6657A24289D0348a38014d3537J4843j66096L4173N0698A35501D0559
15337A19178C9870L4565b9254n911G3863b64966A18176A3363c44842a59224A81261
15325B05447b31023A49360K71641c20433B26757l4943a73862A53997n7395m2723
$$ plain form
15315 53879 -254725 -54389 40463 176038 42245 34692 129069 -192194 -176769 37062 11264
15303 9031 36058 -111034 172374 -87022 -188760 138223 -146799 112038 171894 61871 -237884
15291 269002 -128691 -64400 -104885 -16429 -109318 46564 -162738 6640 255276 501388 126589
15279 66492 211043 -280449 112724 168514 146992 -122484 387473 -217749 202127 83145
15268 -66767 -71461 64312 141145 34003 -94590 -50747 270438 224713 -48774 57515 272578
15257 272578 266103 61890 -163611 143743 163530 -230278 237732 427926 726524 1432168
15247 1432168 1051310 1149358 1048711 656942 11164 71009 261415 156827 447340 47726
15236 10708 267417 65851 168444 193622 82858 107643 13275 127723 37504 37193 66563
$$ packed form
15315E3879b54725e4389D0463J35575D2245p553R4377a92194J5425C7062A1264
15303I031K7027a11034A72374h7022j01738A38223a46799A12038N9856F1871b37884
15291B69002a28691O4291m0485a6429r2889D6564a62738F640K48636K46112A26589
15279F6492J44551b80449A12724N5790k1522a22484C87473b17749B02127H3145
15268f6767m694F4312P6833C4003i4590M3843B70438m5725d8774E7515K15063
15257B72578o475F1890a63611A43743J9787b30278B37732J90194K98598P05644
15247A432168l80858R8048j00647l91769A1164N9845J90406j04588K90513D7726
15236A0708K56709F5851J02593K5178H2858K4785A3275J14448C7504l11K9370
$$ plain form
15225 66563 76385 -167029 -97967 14761 -191698 179647 68637 73498 -17836 164354 -233607
15213 -57606 236605 319898 286444 121142 47020 -63671 330878 -62748 -292903 -272746 -25114
15201 56679 188154 132884 185974 24249 -106576 -129962 277502 42342 -23486 -161833 -164669
15190 -164669 -158634 177055 69622 338676 158261 -89588 157194 -50981 34364 82804 87338
15179 87338 95509 82217 303221 138789 -138969 141650 251368 26162 -5683 -159419 -145771
15168 -145771 -284879 122737 -30020 191060 167527 120608 -88503 -115346 146396 11932 -76449
15156 39691 122754 99221 -4903 108533 66820 124155 436631 266774 -88851 170159 206469
15145 206469 222577 207889 258054 -179590 192461 -534 345027 -68737 50595 20611 66792
$$ packed form
15225F6563R822a67029O9062A4761a91698A79647F8637M861a7836A64354b33607
15213e7606B36605Q3293l3454A21142D7020f3671C30878f2748k30155K0157b5114
15201E6679J31475n5270N3090B4249a06576k3386B77502D2342b3486j38347k836
15190a64669O035A77055F9622K69054A58261h9588A57194e0981C4364M8440M534
15179H7338Q171j3292K21004A38789a38969A41650J09718B6162e683j53736J3648
15168a45771j39108A22737c0020A91060k3533m6919h8503k6843A46396A1932g6449
15156C9691Q3063k3533d903A08533m1713N7335L12476j69857h8851A70159L6310
15145B06469J6108j4688N0165a79590A92461e34C45027f8737E0595B0611M6181
$$ plain form
15134 66792 -21728 78487 243539 139820 11164 83300 -37762 94242 84324 95422 102322 314452
15122 314452 30339 126507 76808 194864 134557 199486 177506 94336 8978 281988 -29652
15110 363268 -20655 17940 306101 -84484 323322 161621 387849 -10623 160593 56035
15099 47190 63904 1698 189599 459585 178462 133833 290493 47337 133727 -259188 -219269
15088 -219269 352673 317707 -45344 -71866 203454 127873 160398 202070 424086 22618 220499
15077 220499 321767 290902 81635 187717 256174 -37212 41974 28162 -99467 234987 -35407
15065 -32477 51956 305510 3614 -30235 276416 209157 570816 -52389 163799 312484 52220
15053 263434 81362 167753 39624 304425 269880 50401 128714 106112 460478 235649 150472
$$ packed form
15134F6792b1728G8487J65052j03719A1164P2136c7762I4242r918J1098O900K12130
15122C14452C0339R6168m9699J18056o0307O4929k1980q3170H978K73010b9652
15110C63268b0655A7940K88161h4484C23322A61621K26228a0623A60593E6035
15099D7190J6714A698J87901K69986A78462m4629J56660D7337Q6390b59188L9919
15088b19269C52673l4966d5344k6522B03454p5581L2525M1672K22016B2618J97881
15077B20499J01268l0865H1635J06082O8457c7212D1974j3812i9467B34987c5407
15065c2477E1956K53554C614c0235B76416o7259L61659e2389A63799J48685E2220
15053B63434H1362Q6391C9624K64801l4545E0401P8313k2602L54366k24829q5177
$$ plain form
15042 150472 161354 84864 476837 -47303 75524 230062 51488 -59105 536334 202985 182525
15031 182525 104679 195122 212354 -24096 208694 248707 446479 220119 223293 310219 75028
15019 84321 241723 234372 255308 67778 250908 255875 62387 17023 -76863 125310 -95912
15007 174417 428779 163605 -162925 18336 31557 270307 355304 486096 -132865 91226
14996 532030 298187 230553 303856 319642 353652 116387 502634 136770 304853 125214
14985 -219429 362678 320686 45754 179735 -142660 -192303 74030 482964 312947 -39511
14974 -39762 328892 -83446 358634 197130 341583 245423 294739 116528 359948 27508
14963 386659 27369 478833 153745 -121516 258289 290242 237035 134764 147922 307687
$$ packed form
15042A50472J0882p6490L91973d7303G5524J54538E1488e9105E36334B02985k0460
15031A82525p7846R0443J7232b4096B08694M0013J97772B20119L174Q6926G5028
15019H4321J57402p351K0936F7778J83130M967F2387A7023g6863A25310i5912
15007A74417K54362A63605a62925A8336J3221K38750Q4997J30792a32865I1226
14996E32030k33843o7634P3303J5786L4010A16387L86247A36770J68083A25214
14985b19429C62678m1992D5754J33981a42660m9643G4030M08934j70017c9511
14974c9762C28892h3446C58634j61504J44453r6160M9316A16528K43420B7508
14963C86659B7369M51464A53745a21516B58289L1953n3207j02271J3158J59765
$$ plain form
14953 307687 143007 -21131 197817 462746 167925 -60941 30187 679001 179211 8231
14942 349501 481538 305779 242455 463585 320945 234849 518436 256792 85454 225187
14932 225187 44623 211214 295944 350622 174591 122857 185873 301407 -98636 541674 114883
14920 400182 257335 252636 164671 543557 595016 669374 302972 339141 550299 211571 280711
14909 280711 644536 277126 408445 135299 236351 177734 151064 258795 355444 151744
14898 343572 452992 395240 137262 362248 249044 141676 175457 533611 238907 261781
14888 261781 373938 142111 614300 595785 221674 513310 497252 228215 562910 237494
14877 400434 478943 381398 72260 224939 420521 406408 235932 97009 503551 473862 786219
$$ packed form
14953C07687A43007b1131A97817K64929A67925f0941C0187O48814A79211H231
14942C49501J32037j75759o3324K21130j42640q6096K83587B56792H5454J39733
14932B25187D4623J66591Q4730N4678A74591n1734O3016J15534i8636E41674A14883
14920D00182j42847m699q7965L78886N1459P4358C02972L6169K11158B11571O9140
14909B80711L63825B77126J31319A35299J01052n8617k6670J07731R6649A51744
14898C43572J09420n7752A37262K24986j13204j07368L3781L58154B38907K2874
14888B61781J12157A42111M72189j8515B21674K91636j6058B28215L34695B37494
14877D00434P8509r7545G2260J52679J95582j4113j70476I7009M06542k9689L12357
$$ plain form
14866 786219 563541 392188 237895 423356 196243 181374 309052 189283 417249 -8833
14855 410695 591798 390684 212102 362198 581403 523148 324223 410595 235659 313183
14845 313183 -145242 650452 201295 269738 96718 424795 525121 374693 752463 401721
14835 401721 276426 382587 628729 659280 215561 446624 596262 673896 337422 488081
14825 488081 235834 337509 160822 211099 483413 430770 910102 533685 581751 517996
14815 517996 459857 414661 619615 442004 754793 513532 409550 549798 510776 295336
14805 295336 511482 323554 612195 741448 413668 648060 398002 515454 717252 321546
14794 419395 706373 503703 482410 662164 646667 417342 502669 526113 699504 651070
$$ packed form
14866G86219k22678j71353j54293J85461A96243j4869J27678j19769K27966h833
14855D10695J81103k01114j78582J50096K19205n8255j98925Q6372j74936P7524
14845C13183a45242F50452B01295O8443I6718L28077J00326j50428L77770l50742
14835D01721j25295J06161K46142L0551B15561K31063J49638P7634l36474J50659
14825D88081B35834J01675A60822N0277K72314n2643M79332l76417M8066o3755
14815E17996n8139m5196K04954j77611L12789k41261j03982J40248l9022k15440
14805B95336K16146j87928K88641J29253l27780K34392k50058J17452K01798C21546
14794D19395K86978k02670k1293J79754j5497k29325Q5327K3444J73391m8434
$$ plain form
14784 651070 497600 780148 335449 302086 791006 429051 850486 666830 295338 475103
14774 475103 474498 429970 205124 677508 734786 817454 788751 522945 716483 582981 573496
14763 573496 742356 594553 673219 584636 507507 690269 651704 495412 912566 325038
14752 645906 779672 397067 783372 614587 660495 313132 515841 771194 676525 827794
14742 827794 1075552 470968 510477 640965 642608 1108985 866835 681150 772713 373382
14731 826040 717837 903023 306696 905121 858598 702293 778874 834422 619661 937150
14721 937150 518522 670498 813839 606871 821593 750119 1029061 940791 791326 968874
14711 968874 738268 819780 767923 696788 873002 858293 964429 912499 1200380 931233
$$ packed form
14784F51070j53470K82548C35449l3363M88920l61955M21435j83656B95338J79765
14774D75103o05m4528B05124M72384N7278Q2668k8703k65806J93538j33502r485
14763E73496J68860j47803P8666q8583p7129J82762l8565j56292M17154C25038
14752F45906J33766l82605L86305j68785M5908C13132K02709K55353r4669J51269
14742H27794K47758D70968L9509J30488J643M66377k42150j85685R1563C73382
14731H26040j08203J85186C06696N98425m6523j56305P6581N5548k14761L17489
14721I37150m18628J51976J43341k06968K14722p1474K78942q8270j49465J77548
14711I68874k30606Q1512n1857p1135J76214j4709J06136n1930K87881k69147
$$ plain form
14701 931233 938609 809053 1158562 683981 710579 668358 697151 913353 994717 1046048 1046351
14690 1046351 917926 1010551 1194061 1010405 647754 895786 816060 1049910 1042935 889341
14680 889341 800350 693323 1269238 991330 740440 969772 735008 983117 862942 693931
14670 693931 624219 886768 820750 717212 875946 911510 678819 1200335 1019507 1256396
14660 1256396 1048513 1165994 1193924 895958 1082957 911611 974193 814923 1389320 1294755
14650 1294755 956324 1173472 966710 998601 1293185 1182757 1105202 1144405 1023518 1142284
14640 1142284 1357877 1174922 1342744 1005403 1271414 1046243 1042558 1637308 1381464 1475003
14630 1475003 1168686 1081209 1594905 1377960 1226741 1080702 1534221 1346116 1285656 1512794
$$ packed form
14701I31233P376j29556L49509m74581K6598m2221K8793K16202Q1364N1331L03
14690A046351j28425R2625J83510j83656l62651K48032p9726K33850o975j53594
14680H89341q8991j07027N75915k77908k50890K29332k34764K48109j20175j69011
14670F93931o9712K62549o6018j03538J58734L5564k32691N21516j80828K36889
14660A256396k07883J17481K7930k97966J86999j71346O2582j59270N74397r4565
14650A294755l38431K17148k06762L1891K94584j10428p7555L9203j20887J18766
14640A142284K15593j82955J67822l37341K66011k25171l685N94750k55844R3539
14630A475003l06317q7477N13696k16945j51219j46039M53519j88105o0460K27138
$$ plain form
14620 1512794 1619475 1383627 1650993 1687059 1533220 1447300 1422113 1325226 1500268 1520259
14610 1520259 1516207 1327463 1777700 1544229 1592933 1665471 1545539 1298679 1431641 1450668
14600 1450668 1507668 1580197 1746940 1728942 1405712 1537855 1894263 1698822 1847929 1623001
14590 1623001 1390784 1855215 1697743 1547915 1556423 1978327 1790817 1681100 1687442 1894028
14580 1894028 1740977 1631713 2218473 2141259 1992166 2144005 2022923 2098055 2077529 2137591
14570 2137591 2146320 2264339 2285678 2135833 2194239 2310596 2293330 2712224 2429737 2389007
14560 2389007 2471436 2864709 2767889 3057614 3111330 3161401 3643472 3695333 4240253 4378380
14550 4378380 5638274 7239722 11333910 21251659 41301204 42664186 19182143 7894958
$$ packed form
14620A512794J06681k35848K67366L6066j53839q5920k5187r6887J75042J9991
14610A520259m052j88744M50237k33471M8704P2538j19932k46860J32962J9027
14600A450668N7000P2529J66743j7998l23230J32143L56408j95441J49107k24928
14590A623001k32217M64431j57472j49828Q508M21904j87510j09717O342K06586
14580A894028j53051j09264N86760p7214j49093J51839j21082P5132k0526O0062
14570B137591Q729J18019K1339j49845N8406J16357j7266M18894k82487m0730
14560B389007Q2429L93273r6820K89725N3716N0071M82071N1861N44920J38127
14550D378380J259894J601448M094188R917749K0049545J362982A9182143G894958
$$ plain form
14541 4173542 2909106 2048005 1870074 1766223 1857038 1951265 1922612 1844416 1861570 2237293
14531 2237293 1944505 2035839 2027386 2101054 2207506 2153943 2418465 2427667 2387042 2234093 2550087
14520 2550087 2489593 2599172 2371863 2591689 2672640 2646455 2608566 2564241 2369454 2802709
14510 2802709 2754906 2881278 2437283 2515280 3028503 2719179 2954037 2891329 2909138 3056313
14500 3056313 3176009 2785564 3082402 3066579 3320799 3179584 2935413 3172495 3463581 3325959
14490 3325959 3789443 3413474 3307184 3549530 3376993 3409286 3429783 3757780 3767533 3636694
14480 3636694 3697706 3790132 3856084 3750122 3873763 3800583 4256938 3814732 4246880 4232426
14470 4232426 4170867 4256452 4357801 4669193 4110138 4504108 4461039 4629074 4330825 4623386
$$ packed form
14541D173542j264436q61101j77931j03851R0815R4227k8653p8196J7154L75723
14531B237293k92788R1334q453P3668J06452n3563K64522R202m0625j52949L15994
14520B550087o0494J09579k27309K19826Q0951k6185l7889m4325j94787M33255
14510B802709m7803J26372m43995P7997N13223l09324K34858o2708J7809J47175
14500C056313J19696l90445K96838j5823K54220j41215k44171K37082K91086j37622
14490C325959M63484l75969j06290K42346j72537L2293K0497L27997R753j30839
14480C636694O1012R2426O5952j05962J23641p3180M56355m42206M32148j4454
14470D232426o1559Q5585J01349L11392n59055L93970m3069J68035k98249K92561
$$ plain form
14460 4623386 4693897 4795626 4677093 4888385 4565112 4978822 4977785 5401772 4940631 4970683
14450 4970683 5244829 5093654 4980676 5646229 5277803 5356967 5653040 5709941 6035662 5616123
14440 5616123 5914967 6015317 6018247 6235828 5782479 6233869 6426608 6223588 6173200 6511208
14430 6511208 6754262 6638982 7005075 6889307 6967088 7288892 7204484 7049057 7439556 7721408
14420 7721408 7425934 7701295 7738152 8122225 8218805 8116009 8200812 8231728 8315119 8673299
14410 8673299 8593520 8674402 8988879 9095713 9452773 9618228 9637165 9793647 9822305 9769681
14400 9769681 10293797 10501323 10595874 10603089 10704929 10793496 11004430 11374980 11411573 11722491
14390 11722491 11828878 12451174 12260921 12195538 12657233 13140521 13321177 13696906 13691127 14023176
$$ packed form
14460D623386P0511J01729j18533K11292l23273M13710j037M23987m61141L0052
14450D970683K74146j51175j12978O65553l68426P9164K96073N6901L25721m19539
14440E616123K98844J00350K930K17581m53349M51390J92739k03020n0388L38008
14430F511208K43054j15280L66093j15768P7781L21804q4408j55427L90499K81852
14420G721408k95474K75361L6857L84073R6580j02796Q4803L0916Q3391L58180
14410H673299p9779Q0882L14477J06834L57060J65455J8937J56482K8658n2624
14400I769681N24116K07526R4551P215J01840Q8567K10934L70550L6593L10918
14390A1722491J06387O22296j90253o5383M61695M83288J80656L75729n779L32049
$$ plain form
14380 14023176 14265687 14586924 14716774 15046988 15346160 15840452 16147369 16519297 16765070
14371 16765070 16868117 17332210 17691870 17785960 18439033 18876344 18942009 19776181 20072094 20539417
14361 20539417 20633635 21459748 21744521 22522987 22871682 23489494 23933804 24559022 25070546
14352 25070546 25735825 26553963 26706523 27461102 28253434 29127452 29970214 30430816 31239320
14343 31239320 32073010 33021559 33979068 34840136 36007159 36479172 37799704 38820964 39988644
14334 39988644 41214480 42216263 43534860 44912304 46377806 47644637 49070325 51094384
14326 51094384 52387424 53977239 55999990 57876441 60048277 61856424 63946057 66473659
14318 66473659 68981680 71727185 73896927 76552980 79836789 82857873 86230304 89735561
$$ packed form
14380A4023176K42511L21237J29850L30214K99172M94292L06917L71928K45773
14371A6765070J03047M64093L59660R4090O53073M37311O5665Q34172K95913M67323
14361B0539417R4218Q26113K84773P78466L48695O17812M44310O25218N11524
14352B5070546O65279Q18138J52560P54579P92332Q74018Q42762M60602Q08504
14343C1239320Q33690R48549R57509Q61068J167023M72013J320532J021260J167680
14334C9988644J225836J001783J318597J377444J465502J266831J425688K024059
14326E1094384J293040J589815K022751J876451K171836J808147K089633K527602
14318F6473659K508021K745505K169742K656053L283809L021084L372431L505257
$$ plain form
14310 89735561 93520358 97613219 101578169 105683237 110825238 115203443 120372428 126308355
14302 126308355 131685199 138254525 144702929 151516984 158967061 166674099 174812086 183663806
14294 183663806 192653825 202573277 212931283 223467172 234507398 246120306 258486908
14287 258486908 271519659 284109381 297949847 311676180 325669667 340008307 353884066
14280 353884066 367790383 381522357 394714151 407407646 418688823 429017199 437606569
14273 437606569 443741904 445837698 445238845 444655176 442167630 439740522 435133665 429245850
14265 429245850 420977108 410157736 397623908 384259408 369636197 354711551 339815009
14258 339815009 324277706 309605509 294583815 281192686 267866948 254783348 242157780
$$ packed form
14310H9735561L784797M092861L964950M105068N142001M378205N168985N935927
14302A26308355N376844O569326O448404O814055P450077P707038Q137987Q851720
14294A83663806Q990019R919452J0358006J0535889J1040226J1612908J2366602
14287B58486908J3032751J2589722J3840466J3726333J3993487J4338640J3875759
14280C53884066J3906317J3731974J3191794J2693495J1281177J0328376Q589370
14273D37606569O135335K095794n98853n83669k487546k427108m606857n887815
14265D29245850q268742j0819372j2533828j3364500j4623211j4924646j4896542
14258C39815009j5537303j4672197j5021694j3391129j3325738j3083600j2625568
$$ plain form
14251 242157780 229995772 218282465 207799736 197464547 187678448 178601888 170159267
14244 170159267 162207922 154561310 147076621 140386672 133529529 128180679 122604288 117219733
14236 117219733 112200273 107242041 102734360 98515759 94220533 90879440 87473634 83660034
14228 83660034 80936927 77398571 74645241 72125199 69038030 66337449 64314694 61977996
14220 61977996 60208581 57823806 55817720 53821314 52251067 50520460 49222760 47961693
14212 47961693 46156839 44632728 43687332 42074639 41222462 40404298 39313698 37943709
14204 37943709 36489051 35430409 34807423 34111369 33259545 32174837 31306462 30593021 29375321
14195 29375321 28637837 28323662 27816407 26699844 26181613 25759074 25254472 24298526 23628018
$$ packed form
14251B42157780j2162008j1713307j0482729j0335189r786099r076560q442621
14244A70159267p951345p646612p484689o689949o857143n348850n576391n384555
14236A17219733n019460m958232m507681m218601m295226l341093l405806l813600
14228H3660034k723107l538356k753330k520042l087169k700581k022755k336698
14220F1977996j769415k384775k006086j996406j570247j730607j297700j261067
14212D7961693j804854j524111r45396j612693q52177q18164j090600j369989
14204C7943709j454658j058642o22986o96054q51824j084708q68375p13441j217700
14195B9375321p37484l14175n07255j116563n18231m22539n04602r55946o70508
$$ plain form
14186 23628018 23517997 22773474 22534861 21792051 21211912 20959206 20273243 20057051 20060328 19352375
14176 19352375 18874928 18630539 18007580 17606958 17555756 17137917 16553611 16386132 16114469
14167 16114469 16110646 15670318 15351015 14863265 14675471 14343962 14195280 13877882 13693371 13578891
14157 13578891 13407228 13295307 12754064 12835792 12513414 12047680 12069195 11901879 11696961 11460617
14147 11460617 11190235 11384555 11370336 10930757 10270357 10594871 10163370 10022732 10025837 10115902
14137 10115902 9744177 9494621 9145677 9343096 9039684 8979729 8884630 8934938 8393486 8658122
14127 8658122 8470399 8253760 8023675 8219661 7966361 7660893 7654144 7689897 7450978 7404039
14117 7404039 7216446 7292337 6990928 7253338 6926979 6842644 6638662 6581592 6992569 6375445
$$ packed form
14186B3628018j10021p44523k38613p42810n80139k52706o85963k16192L277p07953
14176A9352375m77447k44389o22959m00622n1202m17839n84306j67479k71663
14167A6114469l823m40328l19303m87750j87794l31509j48682l17398j84511j14480
14157A3578891j71663j11921n41243Q1728l22378m65734K1515j67316k04918k36344
14147A1460617k70382J94320j4219m39579o60400L24514m31501j40638L105R0065
14137A0115902l71725k49556l48944J97419l03412n9955r5099N0308n41452K64636
14127H658122j87723k16639k30085J95986k53300l05468o749L5753k38919m6939
14117G404039j87593P5891l01409K62410l26359q4335k03982n7070M10977o17124
$$ plain form
14107 6375445 6630312 6401799 6310887 6319092 6069637 5935655 5841458 5835120 5917269 5572535 5878300
14096 5878300 5658094 5557937 5567862 5542658 5623242 5162725 5335264 5264106 5464416 5005559
14086 5005559 4936882 5031220 4999538 4947059 4746733 4711039 4674543 4566042 4757392 4427515
14076 4427515 4567886 4406474 4453373 4503876 4410150 4639168 4010309 4224723 4088290 3986564
14066 3986564 3979030 4005096 4120975 3878483 3777607 3949630 3687777 3892180 3939698 3847762
14056 3847762 3803283 3598016 3581002 3832652 3721551 3431243 3530824 3480600 3339860 3450162
14046 3450162 3471729 3351202 3224328 3001568 3125758 2985542 2941497 3126400 2834222 3330602
14036 3330602 3213618 3009118 2887359 2929681 2963499 3097634 3265178 2760988 2488865 2980483
$$ packed form
14107F375445K54867k28513r0912Q205k49455j33982r4197o338Q2149l44734L05765
14096E878300k20206j00157R925k5204Q0584m60517J72539p1158K00310m58857
14086E005559o8677R4338l1682n2479k00326l5694l6496j08501J91350l29877
14076D427515J40371j61412M6899N0503r3726K29018o28859K14414j36433j01726
14066C986564p534K6066J15879k42492j00876J72023k61853K04403M7518r1936
14056C847762m4479k05267j7014K51650j11101k90308R9581n0224j40740J10302
14046C450162K1567j20527j26874k22760J24190j40216m4045J84903k92178M96380
14036C330602j16984k04500j21759M2322L3818J34135J67544n04190k72123M91618
$$ plain form
14026 2980483 2477824 2800909 3022251 2556864 2455794 2643837 2664100 2331376 2523772 2399705
14016 2399705 2499644 2353486 2716989 2542681 2665342 2656011 2596880 2536692 1959742 2228632
14006 2228632 2167245 2085489 1970257 2173029 2123884 2331514 2245894 1908135 2121638 2265901
13996 2265901 1902470 2148275 1891248 2104802 2159539 2189293 2576579 3608931 6372424
13987 6372424 14077274 33929221 44721787 23915856 12338391 7605871 5369869 4686497
13979 4686497 3436704 3556966 2713673 2975725 3130556 2867741 2952367 2204049 2595641
13970 2595641 2201638 2479097 2255439 2150654 2176951 2131465 2018472 2007817 2346439 2021116
13960 2021116 2422724 2078849 1735201 1853635 1986909 2008801 2193812 2084401 1848656 1840516
$$ packed form
14026B980483n02659L23085K21342m65387j01070J88043K0263l32724J92396j24067
14016B399705R9939j46158L63503j74308J22661r331n9131o0188n76950K68890
14006B228632o1387q1756j15232K02772m9145K07630q5620l37759K13503J44263
13996B265901l63431K45805k57027K13554N4737K9754L87286J032352K763493
13987F372424P704850J9851947J0792566k0805931j1577465m732520k236002o83372
13979D686497j249793J20262q43293K62052J54831k62815Q4626p48318L91592
13970B595641l94003K77459k23658j04785K6297m5486j12993j0655L38622l25323
13960B021116M01608l43875l43648J18434J33274K1892J85011j09411k35745q140
$$ plain form
13950 1840516 1765344 1874618 1682693 1928951 1665154 1949709 1579838 1871708 1650352 1670046
13940 1670046 1342025 1806966 1777940 1366539 1474430 1556153 1336156 1953649 1671372 1827311
13930 1827311 1550118 1586891 1689032 1602342 1621326 1480470 1497706 1463861 1222017 1388274
13920 1388274 1271589 1211781 1571502 1063970 1301376 1258655 1305559 1698639 1549719 1477754
13910 1477754 1714965 1541127 1216333 1389638 1568951 1298693 1566618 1272121 1404279
13901 1404279 1030436 1444541 1222092 1379416 1293176 1321474 1380376 1371431 1309199 953666
13891 953666 1512162 1182831 983802 1032761 1175376 1184070 1378145 1225963 1346318 1180440
13881 1180440 1258464 1028304 1237837 1267325 937087 1254823 1222550 1323523 1199315 1183412
$$ packed form
13950A840516p5172J09274j91925K46258k63797K84555l69871K91870k21356J9694
13940A670046l28021M64941k9026m11401J07891Q1723k19997O17493k82277J55939
13930A827311k77193L6773J02141q6690J8984j40856J7236l3845k41844J66257
13920A388274j16685n9808L59721n07532K37406m2721M6904L93080j48920p1965
13910A477754K37211j73838l24794J73305J79313k70258K67925k94497J32158
13901A404279l73843M14105k22449J57324q6240K8298N8902q945o2232l55533
13891I53666N58496l29331j99029M8959J42615Q694J94075j52182J20355j65878
13881A180440P8024k30160K09533K9488l30238L17736l2273J00973j24208j5903
$$ plain form
13871 1183412 1114687 1518364 809513 1088114 1280136 1142761 1021651 1379353 1221601 1264187
13861 1264187 1105771 1274662 1219551 1167895 987700 780380 852256 1116204 725348 983402
13851 983402 869020 1035260 945225 1126125 1088990 869668 989157 566482 1414633 988165
13841 988165 864005 910464 923184 1038815 1151545 1249927 812092 926923 790891 920532
13831 920532 786646 681814 526553 745217 626796 455356 902006 869213 631693 958935
13821 958935 839743 993313 673593 751030 977739 760305 671058 710768 873218 745870
13811 745870 817201 937988 764965 688769 620986 1016650 720097 845363 538234 722098
13801 722098 709866 907804 1067639 669320 912496 768601 561323 881520 669898 407728
$$ packed form
13871A183412o8725M03677p08851K78601J92022j37375j21110L57702j57752M2586
13861A264187j58416J68891n5111n1656j80195k07320P1876K63948l90856K58054
13851I83402j14382J66240r0035J80900l7135k19322J19489m22675Q48151m26468
13841I88165j24160M6459J2720J15631J12730R8382m37835J14831j36032J29641
13831I20532j33886j04832j55261K18664j18421j71440M46650l2793k37520L27242
13821I58935j19192J53570l19720P7437K26709k17434q9247L9710J62450j27348
13811G45870P1331J20787j73023p6196o7783L95664k96553J25266l07129J83864
13801G22098j2232J97938J59835l98319K43176j43895k07278L20197k11622k62170
$$ plain form
13791 407728 652585 701927 887027 428999 963423 642016 1012906 705739 507989 664778
13781 664778 709213 362503 926015 560922 805689 569873 642317 741490 757951 845199
13771 845199 775389 700984 750962 1000235 921321 835390 528356 431727 735198 244528 563885
13760 563885 532990 795866 837572 449400 799431 534915 825891 423440 633094 823113
13750 823113 547854 470081 836990 269391 691090 289023 550808 511073 839566 712585
13740 712585 576477 398912 668124 643750 393975 606664 432871 771870 492440 604519
13730 604519 613794 720200 503815 377448 587170 572095 905733 653865 581155 401330
13720 401330 632498 437509 518877 777539 449851 419703 481516 606506 637455 551227
$$ packed form
13791D07728K44857M9342J85100D28999N34424l21407L70890l07167j97750J56789
13781F64778M4435l46710N63512l65093K44767k35816P2444R9173J6461Q7248
13771H45199o9810p4405M9978K49273p8914q5931l07034r6629L03471B44528L19357
13760E63885l0895K62876M1706l88172L50031k64516K90976m02451K09654J90019
13750H23113k75259p7773L66909B69391M21699B89023K61785l9735L28493j26981
13740G12585j36108j77565K69212k4374k49775K12689j73793L38999k79430J12079
13730F04519R275J06406k16385j26367K09722j5075L33638k51868p2710j79825
13720D01330K31168j94989Q1368K58662l27688l0148O1813J24990L0949q6228
$$ plain form
13710 551227 600450 314940 428186 397247 565172 309657 639129 497046 689917 559302
13700 559302 466892 726768 299193 638935 276152 506727 426604 531596 632161 566535
13690 566535 527996 238652 470909 653821 336933 349711 441404 158758 543131 310392
13680 310392 415013 482782 510339 220756 805341 715924 507713 398900 502378 316370
13670 316370 392801 444279 374125 349747 508071 295949 736380 572558 410234 804768
13660 804768 584601 513593 418241 178412 488845 516660 267264 411650 251808 511363
13650 511363 359203 65990 213551 282254 482687 354323 312871 448171 436475 472770
13640 472770 422020 599343 598605 367963 519339 417183 559991 263522 341081 715225
$$ packed form
13710E51227M9223k85510J13246l0939J67925k55515L29472j42083J92871j30615
13700E59302r2410K59876B99193L39742B76152K30575q0123J04992J00565o5626
13690E66535l8539B38652K32257J82912l16888J2778R1693A58758L84373k32739
13680C10392J04621O7769K7557B20756N84585q9417k08211j08813J03478j86008
13670C16370P6431N1478p0154k4378J58324k12122M40431j63822j62324L94534
13660H04768k20167p1008r5352A78412L10433K7815k49396J44386j59842K59555
13650E11363j52160F5990J47561O8703K00433j28364m1452J35300j1696L6295
13640D72770n0750J77323p38k30642J51376j02156J42808B63522P7559L74144
$$ plain form
13630 715225 222710 434443 384034 416916 389831 655948 412386 444762 713533 447817
13620 447817 313531 379912 374451 653776 553408 264018 557947 249596 265945 377667
13610 377667 151629 360583 390677 337083 122593 129406 424371 344044 526964 275588
13600 275588 413938 424633 457913 618460 176910 418923 521773 264980 462436 310890
13590 310890 263848 371675 54823 200329 226447 493030 264523 598691 37034 222973
13580 222973 519887 375526 296566 326461 314221 48028 65580 529447 182680 251314 177370
13569 177370 178581 141511 -24533 338785 28627 173416 30598 555620 458040 323524 71783
13557 65638 504555 335630 276075 237125 386580 271970 397885 139670 218188 275841
$$ packed form
13630G15225B22710K11733n0409L2882k7085K66117k43562L2376K68771k65716
13620D47817j34286O6381n461K79325j00368B64018K93929B49596J6349J11722
13610C77667A51629K08954L0094n3594A22593O813K94965q0327J82920k51376
13600B75588J38350J0695L3280J60547A76910K42013J02850k56793J97456j51546
13590C10890m7042J07827E4823J45506K6118K66583k28507L34168C7034J85939
13580B22973K96914j44361p8960K9895j2240D8028J7552M63867A82680O8634p3944
13569A77370J211l7070b4533C38785B8627J44789C0598N25022r7580j34516G1783
13557F5638M38917j68925n9555l8950J49455j14610J25915A39670P8518N7653
$$ plain form
13547 275841 286658 165342 148269 221026 302558 479676 364453 324577 417137 320751 191732
13536 191732 260431 -71102 261112 557665 347319 259937 106637 405602 465619 294178
13526 294178 160266 41770 223446 537900 40206 455780 183730 114356 89890 550244
13516 550244 -182225 262163 442230 267611 37486 420344 143710 178597 317402 169460
13506 169460 318455 243712 381383 4044 322612 310315 145489 214917 418322 363502 259940
13495 259940 34097 88589 106248 182641 161869 153576 344857 334914 97942 148134 308664
13484 308664 159850 70485 281355 341249 279829 8245 174024 220354 151616 -42142 305563
13472 -5004 235789 202045 47319 154940 178744 141384 -105967 126552 395471 214590 272278
$$ packed form
13547B75841J0817j21316j7073P2757Q1532J77118j15223l9876R2560r6386j29019
13536A91732O8699g1102B61112K96553k10346q7382A06637K98965O0017j71441
13526B94178j33912D1770J81676L14454D0206M15574A83730o9374k4466M60354
13516E50244a82225B62163J80067j74619C7486L82858A43710L4887J38805j47942
13506A69460J48995p4743J37671D044L18568j2297A45489O9428K03405n4820j03562
13495B59940C4097N4492J7659P6393k0772q293J91281r943I7942N0192J60530
13484C08664j48814G0485K10870N9894o1420H245J65779M6330o8738d2142C05563
13472e004B35789l3744D7319J07621K3804l7360a05967A26552K68919j80881N7688
$$ plain form
13461 272278 341185 129094 493418 11751 368347 166443 -111910 115775 386222 -75451
13450 99512 331499 -32264 99631 432983 224815 142249 364809 154828 163895 83840 -169057
13438 93968 -44257 259248 254360 188627 266943 217163 241157 173248 427919 522225 238864
13426 322473 331783 109071 -143740 118905 18401 -86840 428373 34615 397510 61239 165478
13415 165478 85137 -128137 201913 405704 -13056 -8770 309215 170593 2674 238450 122386
13404 122386 356420 -23482 277430 283345 255418 273036 -16882 266476 320634 230596 -111821
13392 351540 396754 243409 94206 2314 214938 -19720 59967 406392 246182 17360 309701
13381 309701 348179 159983 58537 330447 195560 208598 156843 247364 160333 -121855 528837
$$ packed form
13461B72278O8907A29094L64324A1751L56596A66443a11910A15775K70447g5451
13450I9512K31987c2264I9631L33352k08168q2566K22560A54828R067q0055a69057
13438I3968d4257B59248m888o5733P8316m9780K3994o7909K54671R4306B38864
13426C22473R310A09071a43740A18905A8401h6840D28373C4615L62895F1239J04239
13415A65478q0341a28137B01913K03791a3056M286C09215j38622B674K35776j16064
13404A22386K34034b3482B77430N915k7927J7618a6882B66476N4158r0038a11821
13392C51540M5214j53345I4206B314K12624a9720E9967L46425j60210A7360K92341
13381C09701L8478A59983E8537K71910j34887J3038n1755R0521q7031a21855E28837
$$ plain form
13369 122892 100712 203563 107841 207437 477021 797 -76469 125962 171464 397414 -180
13357 234249 143254 261447 -13809 326745 -262028 -9806 31626 230046 336792 453941
13347 453941 400917 120784 330950 822869 263100 408564 -18976 164397 428969 158684
13336 151905 178275 687348 77139 131030 163348 -110796 283161 99241 304936 -18343 252737
13324 316594 132128 101458 293170 -43839 165398 139289 132064 356681 212634 59961 198829
13313 198829 314957 68054 436624 283076 181014 119718 44371 245916 -56331 213289
13302 -53390 26310 -32506 467043 132393 179403 368427 221385 296256 229375 28860 -238792
13290 126935 37918 225612 156309 378711 266568 145951 51094 619943 -80877 117564
$$ packed form
13369A22892k2180J02851r5722R9596K69584G97g6469A25962M5502K25950a80
13357B34249r0995J18193a3809C26745b62028i806C1626J98420J06746J17149
13347D53941n3024A20784K10166M91919B63100J45464a8976A64397K64572A58684
13336A51905K6370N09073G7139N3891L2318a10796B83161I9241K05695a8343B52737
13324C16594A32128l0670J91712d3839A65398k6109p225K24617j44047E9961J38868
13313A98829J16128F8054L68570j53548j02062o1296D4371K01545e6331B13289
13302e3390B6310c2506D67043A32393M7010J89024j47042P4871o6881B8860b38792
13290A26935C7918J87694o9303K22402j12143j20617E1094N68849h0877A17564
$$ plain form
13279 -24617 -249741 -118299 209439 79195 -63760 25619 -169529 279401 186054 111202 69749
13268 69749 176875 -10718 175760 116155 312633 -139123 104284 222041 89795 -63274
13257 264969 -49428 150996 -103114 -97128 110683 389521 -46813 -86083 216013 174261 -161494
13245 -70177 189626 -185938 291855 344348 23630 169280 -32132 56716 392179 -285410
13234 161040 252572 -310026 -120072 105232 64867 337062 88689 114459 144810 -4988 56862
13222 180590 263882 5386 267633 256542 163936 82149 234983 147753 87191 -84487 -313969
13211 -313969 241188 163345 74483 105562 27922 113964 130995 145235 385629 215647 14847
13199 188460 112320 -186735 88241 74259 -153014 11190 108140 -53784 -347604 -89465 86161
$$ packed form
13279b4617k25124a18299B09439G9195f3760B5619a69529B79401r3347p4852m1453
13268F9749J07126a0718A75760n9605J96478a39123A04284J17757H9795f3274
13257B64969d9428A50996a03114N986A10683K78838d6813l9270B16013m1752a61494
13245g0177A89626a85938B91855N2493B3630J45650c2132E6716L35463b85410
13234A61040R1532c10026a20072A05232m0365K72195H8689K5770L0351d988E6862
13222A80590Q3292E386K62247j1091r2606q1787J52834q7230o0562h4487k29482
13211c13969B41188p7843G4483L1079B7922Q6042J7031J4240K40394j69982A4847
13199A88460p6140a86735H8241j3982a53014A1190R6950e3784k93820h9465H6161
$$ plain form
13187 120921 130100 311064 120747 112709 90151 130939 -166044 367928 543471 59294 80553
13176 80553 388413 191599 46157 148485 -155918 351125 -79611 324854 106806 163416
13166 163416 93596 94483 233147 116467 -82554 22778 275612 -120433 -4256 -12085 18052
13154 35150 482172 -251958 -142793 395556 -170728 -160694 -31684 -37924 319530 121443
13143 90401 14166 19203 202206 411782 -111841 -8965 -109968 263880 -63904 -384782 -32473
13131 -218440 275051 -51066 14674 91314 99207 29550 161529 -177464 458991 -231947 242305
13119 -56934 50599 -32668 -36384 278916 120801 245859 364300 52376 193308 -346622 -74399
13107 -309664 22638 114348 58525 -76617 -16758 245776 168091 250051 -234192 238602 -183294
$$ packed form
13187A20921R179J80964A20747q038k2558M0788a66044C67928J75543E9294K1259
13176H0553L07860A91599D6157J02328a55918C51125g9611C24854A06806N6610
13166A63416o9820Q87J38664A16467h2554B2778K52834a20433d256p829A8052
13154C5150M47022b51958J09165C95556a70728J0034c1684o240C19530A21443
13143I0401A4166N037J83003K09576a11841h965j01003B63880f3904l20878c2473
13131b18440B75051e1066A4674P6640P893B9550J31979a77464D58991b31947B42305
13119e6934E0599c2668l716B78916A20801J25058J18441E2376J40932c46622g4399
13107c09664B2638R1710n5823g6617a6758B45776p7685Q1960b34192B38602a83294
$$ plain form
13095 140835 -216222 61101 -41787 249342 99933 23455 284715 343642 -210181 -239642 67570
13083 14689 -54998 104081 122801 -75910 360548 276899 9979 -136937 -15329 124064 -203922
13071 -139365 107298 378268 -99210 -129193 109801 32951 204649 102355 117503 276562
13061 276562 79498 -49362 -50492 304732 120584 188718 331735 -96651 66442 -7521 15138
13049 114149 423231 87007 106580 274437 -50543 -126351 197650 264409 -471538 -188493
13038 345211 137873 -24815 -43349 -32588 45005 87913 -161079 203466 123873 -224285 130402
13026 429956 162435 121577 -159572 54385 -144212 274913 77700 135283 292579 -20137
13015 202384 43060 -44762 129460 -139105 229168 -174697 312892 -103825 -52968 109356
$$ packed form
13095A40835b16222F1101d1787B49342I9933B3455K61260N8927b10181k9461F7570
13083A4689e4998A04081J8720g5910C60548q3649I979a36937a5329A24064b03922
13071a39365A07298K70970i9210k9983A09801C2951J71698j02294J5148J59059
13061B76562G9498d9362j130C04732A20584O8134J43017i6651F6442g521A5138
13049A14149L09082H7007J9573J67857e0543p5808A97650O6759d71538a88493
13038C45211A37873b4815j8534J0761D5005M2908a61079B03466p9593b24285A30402
13026D29956A62435m0858a59572E4385a44212B74913G7700N7583J57296b0137
13015B02384D3060d4762A29460a39105B29168a74697C12892a03825N0857A09356
$$ plain form
13004 138338 330887 261931 5786 221777 73422 117891 161891 -45492 581279 245246 129045
12993 129045 5541 6769 -155946 156499 45372 108028 54213 318317 -145561 -278317 93361
12981 61739 -2494 198366 164075 208178 181281 90714 101368 -161202 99952 30947 155465
12970 155465 256248 175650 -10506 191324 -99891 -230802 157401 61938 36607 186616
12960 186616 -107275 298187 61746 -11592 -77822 160088 144712 183668 260627 251207 158397
12949 158397 -357668 126197 144086 183761 -29441 -210746 85389 118937 -48583 -89049 113700
12937 119527 127740 -28256 30598 32920 72729 359101 -58405 210841 122301 -12667 -193588
12926 -193588 -21381 -264099 10915 -106575 102401 174794 55335 -37459 -121772 -22581 -194975
$$ packed form
13004A38338J92549o8956E786K15991G3422M4469M4000d5492E81279B45246j16201
12993A29045E541J228a55946A56499D5372O2656n3815K64104a45561j32756I3361
12981F1739b494A98366l4291M4103k6897r0567J0654a61202I9952C0947J24518
12970A55465J00783q0598a0506A91324i9891j30911A57401F1938k5331J50009
12960A86616a07275B98187F1746a1592o6230A60088j5376L8956P6959r420r2810
12949A58397c57668A26197J7889L9675b9441j81305H5389L3548d8583m0466A13700
12937A19527Q213b8256C0598K322L9809K86372e8405B10841q8540a2667j80921
12926a93588b1381k42718A0915a06575A02401P2393E5335c7459q4313b2581j72394
$$ plain form
12915 -194975 166023 -186998 494461 66394 76479 -183844 175891 -48297 -72644 -212676
12905 -212676 2711 366999 -226122 -288352 174341 -370095 158751 9173 -194887 186080
12894 -199284 174501 -117105 -254516 97680 110051 39457 164751 117705 413775 19150
12883 -96837 -338945 -39892 -31433 119711 -281471 118158 493469 54829 -96647 -108582 72644
12871 157995 -62724 -156977 -145665 27801 215619 -88549 131608 -87444 -50063 -8485 40222
12859 229654 -20437 73413 -259080 266850 -56559 17187 188755 119875 -149322 126950
12848 -124004 112804 27125 62001 -88809 87197 -201812 134846 72524 -49324 84904 -65641
12836 -79802 106168 263527 -29450 305462 -305216 194574 187048 227702 84115 75382 -3816
$$ packed form
12915a94975A66023a86998D94461F6394J0085a83844A75891d8297k4347j40032
12905b12676B711L64288b26122o2230A74341c70095A58751I173a94887A86080
12894a99284A74501a17105j37411I7680J2371C9457J25294m7046K96070A9150
12883i6837k42108c9892Q459A19711b81471A18158L75311E4829i6647j1935G2644
12871A57995f2724r4253J1312B7801J87818h8549A31608h7444L7381h485D0222
12859B29654b0437G3413b59080B66850e6559A7187J71568o8880a49322A26950
12848a24004A12804B7125L4876h8809H7197b01812A34846o2322d9324H4904f5641
12836g9802A06168J57359b9450C05462c05216A94574p526M0654H4115q733c816
$$ plain form
12824 -249971 -170050 267945 170520 123557 196436 -344190 169780 -78703 37931 -59591 -57570
12813 -57570 311128 4305 244525 -135430 307574 152491 121346 -118150 -53815 -53691 -148705
12802 -148705 18530 158161 108107 -266546 94407 113083 65103 -272394 55695 55705 -272356
12790 -85995 -424526 -335867 183934 -107764 -119734 -75075 126401 -85646 217340 -70450 -207138
12779 -207138 180044 131137 -206443 -20984 -33676 14450 160433 116085 14164 52114 -17398
12767 -3226 46670 -144014 217837 -11028 -327940 205171 81472 291351 263263 -38811 68907
12755 43100 140830 -231271 93928 -23363 167729 152826 228277 -317204 168509 -419456 -272012
12744 -272012 -139330 12260 -244583 -141093 67615 178884 277249 -136870 -28022 -102784
$$ packed form
12824b49971P9921B67945r7425m6963P2879c44190A69780g8703C7931e9591K021
12813e7570C11128D305K40220a35430C07574A52491l1145a18150e3815J24r5014
12802a48705A8530J39631n0054b66546I4407J8676m7980b72394E5695J0b72356
12790h5995l38531Q8659A83934a07764j1970M4659A26401h5646B17340g0450j36688
12779b07138A80044m8907b06443b0984j2692A4450J45983m4348A4164L7950a7398
12767c226D6670a44014B17837a1028l16912B05171H1472K09879k8088c8811F8907
12755D3100R7730b31271I3928b3363A67729j4903P5451c17204A68509d19456J47444
12744b72012J32682A2260b44583J03490F7615J11269R8365a36870b8022p4762
$$ plain form
12734 -102784 339596 72296 421231 -7231 277885 -7724 -59392 -117931 -66034 -169508 -26856
12722 134412 226412 181278 -27117 50906 199195 -764 11100 95157 168210 -23293 99316 46459
12709 -134456 303046 128035 217690 76000 -80871 227933 277908 -243443 314274 335007
12699 335007 154582 252645 -102606 33053 133337 1884 -126387 -80806 34574 131769 39048
12687 -132483 402309 213959 513248 324296 5468 69961 -129891 -60414 152100 -122288
12676 136669 67505 -203934 115922 -67004 -12447 -36237 47681 404892 280573 251199 137087
12665 137087 54030 75553 146738 -124712 -2463 -18752 182651 165292 -48114 446166 316984
12654 316984 125741 -22754 -90745 173337 402802 62457 358411 -29009 -116245 293919
$$ packed form
12734a02784C39596G2296L48935g231B77885g724n1668n8539N1897j03474b6856
12722A34412R2000m5134b7117E0906J48289g64A1100Q4057P3053b3293I9316D6459
12709a34456C03046A28035Q9655G6000h0871B27933M9975b43443C14274K0733
12699C35007A54582R8063a02606C3053J00284A884a26387M5581C4574R7195C9048
12687a32483D02309j88350K99289j88952E468O4493a29891f0414A52100a22288
12676A36669F7505b03934A15922f7004a2447k3790D7681L57211j24319k9374j14112
12665A37087E4030K1523P1185a24712b463j6289A82651j7359d8114D46166j29182
12654C16984A25741b2754o7991A73337K29465F2457K95954b9009q7236B93919
$$ plain form
12643 227505 -169233 112774 358041 -133843 174057 -24421 137066 -86102 -125623 -84619
12633 -84619 -305468 345787 141642 -111452 140321 213828 393704 180918 -104896 -86931
12623 -86931 19392 47254 411033 446390 -265464 142313 -122562 161861 -258833 257717
12612 -86778 90519 142280 246878 80980 -228308 -144750 158638 343940 -32590 -310062 349483
12600 -25884 74700 356952 327668 166585 4889 59915 89465 -240888 145263 -43438 -38879
12589 -38879 249240 66059 178144 61694 5082 -251408 302180 -354524 19657 207972 13999
12577 340269 171090 -12849 129259 301373 -164269 163009 57217 10343 -129916 27642
12566 -149724 201151 91943 51510 -374873 101400 91887 -13519 -23065 -55574 -60045 95765
$$ packed form
12643B27505a69233A12774K45267a33843A74057b4421A37066h6102l9521M1004
12633h4619k20849C45787A41642a11452A40321P3507J79876A80918a04896J7965
12623h6931A9392K7862L63779L5357b65464A42313a22562A61861b58833B57717
12612h6778I0519N1761J04598H0980b28308Q3558A58638J85302c2590k77472C49483
12600b5884G4700K82252k9284j61083D889N5026K9550b40888A45263d3438M559
12589c8879B49240F6059J12085F1694E082b51408C02180c54524A9657J88315A3999
12577C40269j69179a2849A29259J72114a64269A63009E7217A0343a29916B7642
12566a49724B01151I1943m0433c74873A01400r513a3519r546l2509m471I5765
$$ plain form
12554 35309 157912 478398 182096 90194 -76205 -114614 -71232 -82982 40275 123842 10438
12542 -202771 202819 69564 129944 120181 -98627 2881 -58871 -144267 59470 -172135 91908
12530 65164 102293 -288050 247722 -206895 -144798 13649 -407127 10128 -268619 -29700 127743
12518 42764 -256184 -64864 280998 203478 -235221 -22026 -271966 94071 -11889 150425 -79048
12506 -170987 -93851 373213 244157 -175588 20429 96003 69112 156213 -61948 259681 188242
12495 188242 -116028 -123321 -104667 -281091 -289813 -183894 -49132 -206923 -93113 -160429 49423
12483 -95673 -355539 60099 -76542 44386 -99823 -96855 49911 -232881 151481 34130 -26153
12471 21088 -210961 87762 -132434 223519 -200723 -317458 -56616 -217039 -363882 -53658
$$ packed form
12554C5309J22603L20486A82096I0194g6205l8409M3382j1750D0275Q3567A0438
12542b02771B02819F9564O0380r763i8627B881e8871q5396E9470a72135I1908
12530F5164L7129b88050B47722b06895O2097A3649d07127A0128b68619b9700A27743
12518D2764b56184f4864B80998p7520b35221b2026k49940I4071a1889A50425g9048
12506a70987P7136C73213j29056a75588B0429P5574k6891Q7101f1948B59681p1439
12495A88242a16028p293J8654j76424q722J05919d9132j57791i3113o7316D9423
12483i5673k59866F0099g6542D4386i9823K968D9911b32881A51481C4130b6153
12471B1088b10961H7762a32434B23519b00723j16735e6616j60423j46843e3658
$$ plain form
12460 -201954 -84551 159326 266266 -12400 281250 -156360 -137000 -85394 14821 135603
12450 135603 -191364 131175 281866 -329418 49163 18302 -82863 -36463 -59892 -164306
12440 -164306 -103566 -345954 68281 -186590 -282782 -39114 -137349 -58396 -152712 73285 -80656
12428 -124015 265565 53719 -118363 8810 171086 -32561 83669 57500 56021 -37803 116787
12416 -58991 73141 48161 243337 -88978 -104715 107396 13843 -22903 27689 -149969 -153467
12405 -153467 70609 18202 -105465 433402 -133666 187277 339657 -212323 114307 63664
12395 63664 -175623 -227154 92886 13158 142462 169548 113479 -98171 -329269 42544 210569
12384 210569 107858 8245 -236637 246764 137875 121985 166370 -151645 -106473 211423
$$ packed form
12460b01954h4551A59326J06940a2400B81250a56360J9360N1606A4821J20782
12450A35603a91364A31175J50691c29418D9163A8302h2863c6463k3429j04414
12440a64306O0740k42388F8281a86590r6192c9114r8235e8396r4316G3285h0656
12428a24015B65565E3719a18363H810J62276c2561H3669k6169j479c7803A16787
12416e8991G3141k4980J95176h8978j5737A07396A3843b2903B7689a49969l498
12405a53467G0609A8202a05465D33402a33666A87277J52380b12323A14307n0643
12395F3664a75623n1531I2886A3158J29304K7086n6069i8171k31098D2544J68025
12384B10569j02711H245b36637B46764j08889j5890M4385a51645M5172B11423
$$ plain form
12373 -41779 101331 215238 89397 111453 -198752 22326 -239985 18911 -211165 7485 102788
12362 102788 120492 -181865 169406 187264 178175 11630 244563 -260168 95565 -154648 9748
12350 -222386 67949 -354306 -168662 197055 241713 460561 40635 78111 -163186 179556
12339 185749 -211506 281843 96550 -99515 65585 -334599 -122389 -627248 -35466 -183084
12329 -183084 172958 18669 111887 206689 -37265 -348190 -61431 196479 209282 146762 -13913
12317 -169753 301497 34863 -120434 -99937 -69479 35416 257518 248066 -181240 117531 41848
12305 -227457 -48707 18532 62561 89233 61967 153240 -173729 -116182 -228565 -194159 189181
12293 -238395 9742 250493 97406 -38213 218416 -3224 -82041 71139 262908 188818 144146
$$ packed form
12373d1779A01331J13907H9397K2056a98752B2326b39985A8911b11165G485R5303
12362A02788J7704a81865A69406J7858r089A1630K32933b60168I5565a54648I748
12350b22386F7949c54306a68662A97055M4658K18848D0635L7476a63186A79556
12339A85749b11506B81843I6550i9515F5585c34599a22389n04859c5466j47618
12329a83084A72958A8669R3218R4802c7265l10925f1431A96479J2803o2520a3913
12317a69753C01497C4863a20434K0497L0458C5416K22102r452a81240A17531D1848
12305b27457d8707A8532M4029K6672k7266R1273a73729N7547j12383L4406A89181
12293b38395I742K40751I7406c8213B18416c224p8817G1139J91769p4090m4672
$$ plain form
12282 144146 256846 230490 365791 -13624 141890 -6899 -11780 364283 324805 119136 114469
12271 114469 101983 -261109 -223135 -3160 294926 142917 -88853 149705 -112853 345188
12260 209170 115070 -31532 56273 197841 12457 221996 101099 -55838 -14852 249095 14544
12248 84008 87224 70313 85442 262880 -54904 259880 8799 -241287 -85758 212702 519712
12237 519712 86262 348517 288960 304792 -67597 206466 115446 -54518 85124 53391 226248
12226 226248 69751 212756 497760 164103 159304 326352 379040 377477 323321 207498 -69852
12214 -208844 561095 384571 151182 -57302 -16217 79288 -59481 51093 107740 125477 77733
12203 77733 82903 131136 21178 353731 391940 439660 391524 219881 61227 -59038 -20785
$$ packed form
12282A44146J12700k6356J35301a3624A41890f899m881C64283l9478A19136m667
12271A14469j2486b61109L7974c160B94926A42917h8853A49705a12853C45188
12260B09170r4100c1532E6273J41568A2457K09539A01099e5838a4852B49095A4544
12248H4008L216j6911J5129J77438e4904B59880H799b41287h5758B12702L07010
12237E19712H6262K62255n9557J5832f7597B06466r1020e4518H5124l1733J72857
12226B26248F9751J43005K85004A64103m799J67048N2688j563n4156j15823f9852
12214b08844E61095j76524A51182e7302a6217G9288e9481E1093N6647J7737m7744
12203G7733N170M8233B1178L32553L8209M7720m8136j71643F1227e9038b0785
$$ plain form
12191 441918 72197 172093 1944 206228 235269 335421 439293 157904 87148 -117847 211769
12179 23887 152511 -7260 631874 156286 -15230 -158312 177042 555203 119789 166615
12169 166615 209613 78064 -73859 170721 100296 115420 -352731 142796 110002 142059 -258064
12157 -8864 -83427 291993 -14604 -175214 154230 -10952 -55358 22138 159559 30246 228716
12146 228716 -210576 261591 139458 29195 149762 -5135 -118150 12037 2409 -91076 -95838
12135 -95838 -107288 -106934 138261 -160302 118499 -25995 -179320 204922 49023 -56316 -34262
12124 -34262 71538 -70267 -55703 -212026 22491 -80109 -178604 -123407 66141 -13933 -149787
12113 -149787 -107039 252746 348559 230002 -155640 96374 680 -28803 144840 146603 -54632
$$ packed form
12191D41918G2197R9896A944K04284K9041J00152J03872A57904p0756a17847B11769
12179B3887J28624g260F31874A56286a5230j43082A77042L78161A19789M6826
12169A66615M2998G8064g3859A70721p0425J5124c52731A42796l2794L2057b58064
12157h864p4563B91993a4604j60610A54230a0952m4406B2138J37421C0246J98470
12146B28716b10576B61591j22133B9195J20567e135j13015A2037B409i1076m762
12135i5838j1450L54A38261a60302A18499b5995j53325B04922D9023e6316K2054
12124c4262G1538g0267J4564j56323B2491h0109r8495N5197F6141a3933j35854
12113a49787M2748B52746R5813j18557a55640I6374F80b8803A44840J763e4632
$$ plain form
12101 97432 167451 -141491 87565 -2529 211681 61015 58671 8771 3886 -18842 -155672 -118067
12089 -118067 -204393 -288594 130228 296767 93387 -150684 32571 255247 -78717 57292 715678
12078 715678 1644834 1051826 122078 212457 214596 340246 312376 90831 -78707 29528 100356
12067 100356 80837 -151971 176362 50942 84720 -37730 49975 64391 -26816 -277446 -29050
12055 -133367 29355 -318750 -121221 -94208 151418 -51073 -70118 150686 -115023 103325
12044 -222844 -426538 111953 -240063 -139457 -78580 30925 -76362 214385 -46291 303490
12033 -63486 -13316 220530 -174006 199913 -283689 -61395 -27502 162915 -165856 -303168
12023 -303168 -237151 -79004 -235031 93768 247314 -232501 -171002 202950 7362 129067 141059
$$ packed form
12101I7432P0019a41491H7565b529B11681F1015k344H771C886a8842j36830L7605
12089a18067q6326q4201A30228J66539I3387a50684C2571K22676g8717E7292O58386
12078G15678R29156n93008A22078R0379K139J25650k7870I0831g8707B9528P0828
12067A00356j9519a51971A76362E0942L3778c7730D9975J4416b6816k50630b9050
12055a33367B9355c18750a21221K7013A51418e1073j9045A50686a15023A03325
12044b22844k03694A11953b40063J00606O0877C0925g6362B14385d6291C03490
12033f3486a3316B20530a74006A99913b83689f1395b7502A62915a65856j37312
12023c03168O6017g9004j56027I3768J53546b32501O1499B02950G362J21705J1992
$$ plain form
12012 141059 -73377 103351 -151632 87958 44383 216458 -107851 -27679 115941 -1141 -30161
12001 -30161 287573 -37402 80090 312550 -93332 -155474 -154128 49787 -190474 -280476 -50682
11989 40816 -241135 -74205 59078 57728 2064 33146 -2060 49876 318105 -341929 125284
11977 73694 -311413 131487 -222129 -175388 177721 -195491 31975 202874 53263 -113058
11966 -105841 114279 153438 99399 174762 409174 61396 -155445 -503956 151002 14570
11955 -98952 -234681 -12296 -114684 -526743 20979 284333 6275 -256446 160243 21812 -193713
11943 -185804 -262408 136087 -50244 -237702 -31820 12902 -12165 -72730 198960 -144025 -68819
11931 121870 113682 -75676 94807 -95959 1072 68937 -106159 92619 110559 342395 -105661
$$ packed form
12012A41059g3377A03351a51632H7958m3575J72075a07851b7679A15941a141k9020
12001c0161B87573c7402H0090K32460i3332o2142J346D9787a90474r0002e0682
11989D0816b41135g4205E9078j350B064L1082b060D9876K68229c41929A25284
11977G3694c11413A31487b22129M6741A77721a95491C1975J70899E3263a13058
11966a05841A14279L9159n4039P5363K34412F1396a55445l48511A51002A4570
11955i8952j35729a2296j02388m12059B0979K63354F275b56446A60243B1812a93713
11943a85804p6604A36087e0244j87458c1820A2902a2165o0565A98960a44025f8819
11931A21870q188g5676I4807i5959A072O7865a06159I2619J7940K31836a05661
$$ plain form
11919 172873 -126932 4379 -85072 235711 132565 535404 -210606 -21851 63114 -60080 -194652
11908 -194652 -111488 83028 119761 92639 45171 -338526 42603 82102 191256 -52230 -131512
11897 -131512 -332567 52409 444567 23055 -1226 -43526 54837 -7858 80151 39037 -92415
11885 114652 -143066 30385 -141795 -68504 -172862 164733 -97550 -4578 97490 -59230 -132561
11874 -132561 -52191 -316361 -208598 -286463 35361 -12524 -107888 -41357 55393 70493 266042
11863 266042 106933 297421 -118883 62266 116215 -6419 -14921 -110840 52184 -344437 -65336
11851 178051 197683 -61387 100172 112321 176041 30643 213410 -205454 -14401 35205 46210
11840 46210 -58028 -218692 59382 48790 23303 124509 -8350 70708 98248 111168 -102912
$$ packed form
11919A72873a26932D379h5072B35711j03146M02839b10606b1851F3114f0080j34572
11908a94652Q3164H3028L6733k7122D5171c38526D2603L9499J09154e2230p9282
11897a31512k01055E2409L92158B3055a226m2300E4837g858H0151C9037i2415
11885A14652a43066C0385a41795f8504j04358A64733i7550d578I7490e9230p3331
11874a32561e2191k64170J07763p7865C5361a2524r5364d1357E5393J5100J95549
11863B66042A06933J90488a18883F2266N3949f419q502r5919E2184c44437f5336
11851A78051J9632f1387A00172J2149O3720C0643J82767b05454a4401C5205J1005
11840D6210e8028j60664E9382j0592B3303J01206h350G0708K7540J2920a02912
$$ plain form
11828 349301 -59947 -91898 210147 -249865 -89130 -275885 20593 -262870 -141854 -118469
11818 -118469 221032 -12388 245759 142417 -72787 -420975 -190152 -109246 -214050 -245177
11808 -245177 -51766 -46202 -9410 31987 -33012 234977 -105859 -79578 332909 343024 -163650
11796 -128835 -211169 -1616 -41721 62375 31348 8849 -107548 99879 -71307 211090 186042
11785 186042 37180 -262957 -250201 126055 85306 22775 130516 278562 -108563 191089
11774 49558 -71852 -258315 329904 97957 -82270 -3455 100969 -208689 -102306 86565 -120600
11762 -196808 -50197 -358704 -225195 -124958 -221046 -308212 34249 58780 85935 -150267 -145062
11751 -145062 -25743 -88848 -11218 113422 276237 -228417 71195 -94892 -114078 -9062 -160490
$$ packed form
11828C49301e9947l1951B10147b49865h9130j86755B0593b62870J21016K3385
11818a18469B21032a2388B45759j03342g2787l48188a90152Q0906j04804l1127
11808b45177e1766N564i410C1987c3012B34977a05859K6281C32909J0115a63650
11796a28835q2334a616m0105F2375l1027H849a07548I9879g1307B11090k5048
11785A86042C7180b62957J2756A26055m0749B2775J07741J48046a08563A91089
11774D9558g1852j86463C29904I7957h2270c455A00969b08689a02306H6565a20600
11762a96808e0197l08507J33509J00237r6088q7166C4249K4531K7155a50267N205
11751a45062b5743o3105a1218A13422J62815b28417G1195i4892j9186i062j51428
$$ plain form
11740 -160490 64357 -60920 -59760 -203003 -98208 27358 163261 86451 -105646 124813 -95160
11728 -272298 101516 -1556 35433 129583 -51271 161226 -47265 2136 -4724 23816 53972 -66736
11715 114082 -206297 46903 -21469 241201 -8159 494334 15879 -8020 50016 -364439 -225921
11704 -225921 17014 242609 -105588 67973 10876 -163318 191198 112169 -117233 66530
11693 30027 -22834 253423 83998 128432 -102640 -93116 -326824 -116841 291595 38860 327410
11682 327410 92235 -42347 234327 37001 -245443 -16122 -130931 34267 -67292 104821 -26207
11670 -100602 -132721 -234334 202437 103305 134545 -101342 79604 242144 -14574 63027 67310
11659 67310 -66678 61580 -14886 184838 -113569 102643 39104 142693 -142388 4595 -49027
$$ packed form
11740a60490F4357f0920J160j43243i8208B7358J35903p6810a05646A24813i5160
11728b72298A01516a556C5433R4150e1271A61226d7265B136d724B3816L0156f6736
11715A14082b06297D6903b1469B41201h159D94334A5879h020E0016c64439J38518
11704b25921A7014K25595a05588F7973A0876a63318A91198p9029a17233F6530
11693C0027b2834B53423H3998M4434a02640R524k33708a16841B91595C8860K88550
11682C27410I2235d2347B34327C7001b45443a6122j14809C4267f7292A04821b6207
11670a00602l2119j01613B02437r9132L1240a01342G9604J62540a4574F3027M283
11659F7310f6678F1580a4886A84838a13569A02643C9104J03589a42388D595d9027
$$ plain form
11647 -72961 11590 104143 24773 -145653 181636 155641 49391 -293538 40593 -267516 -88599
11635 180532 153616 70300 27189 151860 -10973 410098 155164 -187978 32714 -281633
11624 -50040 32856 -159765 -302946 -110274 295639 66337 16264 -36533 93567 231152 39553
11612 217848 86042 351225 219379 -284652 -40235 -285955 88214 91871 -15195 387612 39852
11600 211682 192623 189404 176040 -440489 -33834 -265060 -93411 150983 111583 -371288 -61060
11588 -136954 64947 58955 268381 -66547 101885 22749 -16988 250160 -6107 92751 264984
11577 264984 60105 -4227 275926 -38093 189771 126684 72582 -89434 -35692 -137530 13405
11565 -322276 -36841 -3713 -12083 122408 27313 13395 -54666 44314 507109 269573 45281
$$ packed form
11647g2961A1590R2553B4773a45653A81636k5995D9391b93538D0593b67516h8599
11635A80532k6916G0300B7189J24671a0973D10098A55164a87978C2714b81633
11624e0040C2856a59765j43181a10274B95639F6337A6264c6533I3567J37585C9553
11612B17848H6042K65183j31846b84652d0235k45720H8214L657a5195C87612C9852
11600B11682j9059l219j3364d40489c3834k31226i3411A50983l9400c71288f1060
11588a36954F4947n992K09426f6547A01885B2749a6988B50160f107I2751J72233
11577B64984F0105d227B75926c8093A89771o3087n4102h9434c5692j01838A3405
11565c22276c6841c713q370A22408B7313A3395e4666D4314M62795k37536D5281
$$ plain form
11553 -129042 169035 46149 72488 -46092 -18835 186062 84799 107611 -12149 194352 55114
11541 -16829 147140 -289328 232956 147580 71555 -237074 21198 50723 -229005 -240949 -34328
11529 150142 -212442 -159867 -1941 46477 246934 177102 120297 -110774 482796 -151524 66118
11517 136307 -56245 -27639 338408 80633 148395 202390 320924 238475 -186171 108448 126192
11506 126192 285873 367244 -127559 149799 58510 318906 173409 -122168 88537 -17879
11495 242567 25128 100246 172256 181130 298210 394732 131246 -166642 -9485 364850 184749
11484 184749 140560 49957 156569 -258562 -13216 186367 140028 21355 -2128 -99614 167261
11472 -200122 35225 -46074 336920 376010 338396 -1238 229244 115071 148499 63145 114908
$$ packed form
11553a29042A69035D6149K6339d6092a8835A86062H4799K2812a2149A94352E5114
11541a6829A47140b89328B32956q5376G1555b37074B1198K9525b29005j1944c4328
11529A50142b12442N2575a941D6477K00457o9832n6805a10774D82796a51524F6118
11517A36307e6245b7639C38408H0633O7762N3995J18534q2449a86171A08448J7744
11506A26192J59681Q1371a27559A49799E8510K60396j45497a22168H8537a7879
11495B42567B5128P5118P2010Q874J17080R6522A31246a66642i485C64850j80101
11484A84749m4189D9957J06612b58562a3216A86367m6339B1355b128r7486A67261
11472b00122C5225d6074C36920L9090l7614a238B29244j14173L3428F3145N1763
$$ plain form
11461 114908 -262758 15686 92184 63214 -46670 337199 45267 202193 575001 84092 -1169
11449 66749 144696 -51113 423388 -198211 405048 237831 18256 -54420 314340 8421 208157
11438 208157 175232 92267 251077 -45434 327 -104139 -44312 -14892 -275676 198403 167219
11427 167219 -444129 -89031 -106618 64628 -92446 260388 306069 -27251 38640 8577 182973
11416 182973 -38851 -13380 -48323 8509 -80461 12213 260591 125525 91688 -189664 185499
11404 249271 -252301 -11250 3042 -244826 197405 -53410 29595 -54175 -72538 147080 305176
11393 305176 169182 -68558 74716 13085 -50536 161323 -281754 -137789 -251291 42232
11382 168283 -103870 -345258 184368 26022 -72887 -167993 22467 -184124 337488 66436
$$ packed form
11461A14908b62758A5686P6498k8970d6670C37199D5267J56926L72808H4092a169
11449F6749P7947e1113D23388a98211D05048j67217A8256e4420C14340H421J99736
11438B08157l2925q2965J58810d5434C27a04139d4312a4892k60784A98403l1184
11427A67219d44129h9031j7587F4628i2446B60388M5681b7251C8640H577J74396
11416A82973c8851a3380l4943H509h0461A2213K48378A25525l3837a89664A85499
11404B49271b52301a1250C042b44826A97405e3410B9595e4175j8363A47080J58096
11393C05176j35994f8558G4716A3085e0536A61323b81754a37789j13502D2232
11382A68283a03870k41388A84368B6022g2887r5106B2467a84124C37488F6436
$$ plain form
11371 70255 -195953 -59690 6762 -156063 136645 -28405 -367124 91229 262381 115808 -231396
11359 -11799 132801 57003 68008 -47753 125338 -312895 -301620 356406 94582 -117231 -67510
11348 -67510 289981 271814 102578 318792 -145835 151090 -237240 -13747 130756 238775
11338 238775 -25347 -131232 148995 214659 108768 -94728 44789 -45727 -20910 -36462 189530
11326 -42541 -122561 163870 -120560 61083 102582 67193 -191644 97624 -119347 -357706 -104076
11314 -255623 91231 -178774 102527 -177 -258360 -305833 -209853 -62375 -119310 118701 -16294
11302 -29629 -413103 -152224 103771 119230 -148517 264270 3771 -100878 -8030 -197866 -110681
11291 -110681 -276460 11075 -61862 180881 -233154 62936 -269552 179029 16506 300664
$$ packed form
11371G0255a95953e9690F762a56063A36645b8405l38719I1229J71152A15808b31396
11359a1799A32801E7003J1005d7753A25338c12895J1275C56406I4582a17231M9721
11348f7510B89981j8167A02578K16214a45835A51090b37240a3747A30756J08019
11338B38775b5347j05885A48995O5664j05891i4728D4789d5727b0910j5552A89530
11326d2541q0020A63870a20560F1083M1499l5389a91644I7624a19347k38359a04076
11314b55623I1231a78774A02527a77k58183m7473R5980f2375n6935A18701a6294
11302b9629l83474a52224A03771J5459a48517B64270C771a00878h030j89836Q7185
11291a10681j65779A1075f1862A80881b33154F2936b69552A79029A6506K84158
$$ plain form
11281 300664 19013 37253 104652 75906 69913 -54199 -34529 -171456 -193748 -274904 -177238
11270 -177238 -140278 270776 -56195 25862 -247956 -70368 71761 88000 -94913 -16083 -148304
11259 -148304 -408341 71045 102848 -590 -68812 -191985 -169190 -45998 159279 -81646 -350183
11248 -350183 27228 119768 235423 -193228 96014 84324 -50860 -138176 -255872 76583 4240
11236 341439 -114340 20680 38780 -128032 330227 116636 64423 231566 165768 -252527
11225 99780 -27107 -117064 -193037 -6796 -372601 -11531 92033 233787 -453835 -14268 -190546
11214 -190546 136069 -74184 -301736 -289736 37042 81963 298082 -79633 13996 90879 -8649
11202 -50413 -489300 -139732 65131 28610 -270056 120708 -81035 -159743 -661 -55713 -52725
$$ packed form
11281C00664A9013J8240O7399k8746n993e4199J9670j36927k2292q1156R7666
11270a77238L6960B70776e6195B5862b47956g0368G1761J6239i4913a6083j32221
11259a48304k60037G1045L1803e90o8222j23173K2795d5998A59279h1646k68537
11248c50183B7228R2540J15655a93228I6014j1690e0860q7316j17696G6583D240
11236C41439a14340B0680J8100a28032C30227A16636n2213J67143o5798b52527
11225I9780b7107q9957p5973f796l65805a1531I2033J41754d53835a4268j76278
11214a90546A36069g4184k27552J2000C7042M4921K16119g9633A3996P6883h649
11202e0413m38887a39732F5131B8610b70056A20708h1035p8708f61n5052K988
$$ plain form
11191 -52725 49383 -131093 149862 -168642 -142531 -225112 -163161 156138 195203 130399 -121404
11179 -67361 194677 223050 128322 78467 -121114 24617 -106917 -187410 48138 -3414 -164291
11168 -164291 21216 -166085 -82014 -50972 333182 -173659 147570 -199371 -85888 -76678 -223255
11157 -223255 -169910 -9939 -71681 -9332 -68790 -255383 144776 -244057 -132577 64339 162474
11146 162474 -120024 77254 83680 188612 -135357 8079 -211944 -43858 62180 183865 125772
11135 125772 169878 261879 190152 -30722 10412 -19999 -296652 282407 -234958 -25497 474832
11123 277633 -41565 -127878 245121 51331 -45675 33721 36086 208765 84649 -585289 137827
11111 -196092 -136151 26800 -64621 227193 173164 66338 141164 67396 -5420 114120 227459
$$ packed form
11191e2725D9383a31093A49862a68642K6111q2581O1951A56138L9065o4804a21404
11179f7361A94677K8373r4728m9855a21114B4617a06917q0493D8138c414j60877
11168a64291B1216a66085h2014L1042C33182a73659A47570a99371h5888R210j46577
11157b23255N3345i939o1742i332n9458j86593A44776b44057J11480F4339R8135
11146A62474a20024G7254O426J04932a35357H079b11944d3858F2180J21685n8093
11135A25772M4106R2001p1727c0722A0412a9999k76653B82407b34958b5497D74832
11123B77633d1565q6313B45121E1331d5675C3721K365J72679H4649e85289A37827
11111a96092N9941B6800f4621B27193n4029F6338P4826F7396e420A14120J13339
$$ plain form
11100 227459 110490 170847 310633 47503 324238 48129 -186130 580950 407721 155530
11089 101547 285141 -162261 231968 98194 367533 88197 491037 251487 267802 479578
11079 479578 319399 239195 -30329 92117 93880 197922 265356 257999 229689 144885 112084
11068 112084 210134 661426 441662 299890 113601 222672 233127 346933 282173 468291
11058 468291 585286 243815 592692 598691 836369 705819 345186 913739 829454 588988
11048 588988 637689 485703 580517 556761 391993 770743 418436 537495 668103 874380
11038 874380 524717 443988 634152 1094574 526773 430230 564964 594914 411986 407278
11028 407278 773290 443310 559355 722785 773974 835949 729230 469872 556646 681860
$$ packed form
11100B27459A10490O0357J39786D7503K76735D8129a86130E80950j73229A55530
11089A01547J83594a62261B31968I8194K69339H8197M02840k39550J6315K11776
11079D79578j60179q0204c0329I2117J763J04042O7434p357k8310q4804l2801
11068A12084R8050M51292k19764j41772A13601J09071J0455J13806o4760J86118
11058D68291J16995B43815L48877N999K37678j30550C45186N68553q4285k40466
11048E88988M8701j51986R4814k3756j64768L78750l52307J19059J30608K06277
11038H74380l49663q0729J90164M60422E26773r6543J34734K9950j82928m708
11028D07278L66012l29980J16045J63430N1189O1975j06719k59358Q6774J25214
$$ plain form
11018 681860 468025 543899 643071 402935 601712 548894 706700 181049 461576 372918
11008 372918 277196 336520 729226 406075 969305 661030 354640 752304 696721 273222
10997 350959 569049 668199 488388 581084 623201 951476 646908 772838 522242 746992
10987 746992 1003067 814035 1022191 896744 887909 894076 1224366 1180995 1286102 1131395
10977 1131395 1608865 1171957 1993451 2302489 2469207 2739104 2317642 2371489 2755212 2270007
10967 2270007 2193984 1670401 1711462 1359730 1816916 1368056 1298079 1566625 1829534 2180016
10957 2180016 1684720 1744880 1408918 1642803 1345866 1348717 982107 425425 598120 451422
10947 451422 446825 329073 750791 378760 331319 103488 57542 627399 521382 99040
$$ packed form
11018F81860k13835P5874R9172k40136J98777n2818J57806A81049K80527q8658
11008C72918r5722N9324L92706l23151N63230l08275l06390L97664n5583B73222
10997C50959K18090R9150j79811R2696M2117L28275l04568J25930k50596K24750
10987G46992K56075j89032K08156j25447q835O167L30290m3371J05107j54707
10977A131395M77470m36908Q21494L09038J66718K69897m21462N3847L83723m85205
10967B270007p6023n23583M1061l51732M57186m48860o9977K68546K62909L50482
10957B180016m95296O0160l35962K33885k96937K851l66610D25425J72695j46698
10947D51422m597j17752M21718l72031m7441A03488m5946N69857j06017I9040
$$ plain form
10936 -79330 253750 -6207 -487096 -122876 45846 92864 87231 99108 169254 11748 38694
10925 38694 -238348 -200157 83529 -72848 20458 10627 92587 -38985 82609 95721 -193635
10913 46143 105119 125706 74618 94962 -70277 -57312 -326108 -313060 -160463 -49215 -120317
10902 -120317 -45600 198013 78136 103355 210947 19931 1093 146708 -23738 213373 -20901
10890 109516 -11066 -55235 45385 -3380 194668 -62272 -71607 83731 -98239 13795 -68739 -15167
10877 225481 -185172 -124144 -69181 170635 -62072 56628 21946 21777 93711 169121 -57613
10865 47557 59578 -198107 94754 71499 -16896 -293669 -60351 94440 -142323 44768 91212
10854 91212 115174 276086 -48730 -251718 -266206 20091 -188896 188322 -16456 -119072 22362
$$ packed form
10936g9330B53750f207m80889a22876D5846M7018n633J1877P0146A1748K6946
10925C8694b38348L8191H3529g2848B0458r831Q1960c8985H2609J3112a93635
10913D6143N8976K0587n1088K0344g0277J2965k68796J3048J52597d9215p1102
10902a20317d5600A98013G8136K5219J07592A9931A093J45615b3738B13373b0901
10890A09516a1066m4169D5385c380A94668f2272r335H3731i8239A3795f8739a5167
10877B25481a85172O1028N4963A70635f2072E6628B1946j69P1934P5410e7613
10865D7557J2021a98107I4754k3255a6896k76773f0351I4440a42323D4768M6444
10854I1212K3962J60912d8730k02988j4488B0091a88896A88322a6456j02616B2362
$$ plain form
10842 -166386 187760 280024 191646 -458560 66812 54054 51016 -251877 191103 192903 139055
10831 139055 -125701 12351 201512 -36238 -163788 129777 201612 -42430 83290 345581
10821 345581 54482 21952 -233047 -201785 -392619 -143192 -323267 210917 42456 99156
10811 99156 -46455 -69706 -258568 -205869 -160042 141070 14522 137895 -145471 -115656 37609
10799 108176 -286885 -76506 -15375 -100304 -17328 188812 -212609 219860 262061 177222 72512
10787 -40643 -81875 -144031 -254411 1345 -158621 -223182 -168556 -50162 236160 -109534 259467
10775 -182002 144036 157561 -30723 -26752 -97735 76528 -85023 75859 62392 169543 -307743
10763 -331693 -48268 23192 -11826 -136833 -51661 70020 -383296 -48402 -70251 -212382 371443
$$ packed form
10842a66386A87760R2264q8378d58560F6812j2758l038b51877A91103J800n3848
10831A39055a25701A2351J89161c6238j27550A29777P1835d2430H3290K62291
10821C45581E4482B1952b33047L1262j90834a43192j80075B10917D2456N6700
10811I9156d6455k3251j88862N2699M5827A41070A4522J23373a45471K9815C7609
10799A08176b86885g6506a5375q4929a7328A88812b12609B19860M2201q4839G2512
10787d0643m1232o2156j10380A345a58621o4561N4626e0162B36160a09534B59467
10775a82002A44036J3525c0723L971p0983G6528h5023G5859j3467J07151c07743
10763c31693d8268B3192a1826j25007e1661G0020c83296d8402k1849j42131C71443
$$ plain form
10751 -25750 259011 169635 -387582 -50166 228555 36311 182128 13247 -238976 -71837 -437489
10740 -437489 -105464 212518 -200792 358214 115942 -117160 235904 -38271 -4915 -55092
10730 -55092 15956 18779 -620385 61634 168657 -140960 -11264 -98494 159239 -121862 -303309
10719 -303309 -294136 239599 108028 -139686 -96512 -199980 -65119 -67391 -411117 -286570 -27076
10707 85113 -267168 47865 63620 -272830 -162857 -163407 -210350 144532 5838 -88179 -5024 -162913
10695 -162913 16068 50367 3317 70650 -7360 292589 25914 -44518 -203199 61384 -42153
10683 -270231 -61952 -13596 -107934 -277966 85095 17172 -198641 -4193 69320 112232 -78337
10671 -202770 40321 -160220 123259 -469318 -99129 27075 57445 -286183 86713 -109781
$$ packed form
10751b5750B59011q9376c87582e0166B28555C6311J45817A3247b38976g1837l65652
10740d37489a05464B12518b00792C58214A15942a17160B35904c8271d915n0177
10730e5092A5956K823f20385F1634J07023a40960a1264q7230A59239a21862j81447
10719c03309R173B39599A08028a39686M3174j03468f5119k272l43726J24547b7076
10707H5113b67168D7865J5755b72830J09973n50m6943A44532E838h8179e024j57889
10695a62913A6068L4299C317O7333g360B92589B5914d4518j58681F1384d2153
10683b70231f1952a3596r4338j70032H5095A7172a98641d193F9320M2912g8337
10671b02770D0321a60220A23259d69318i9129B7075L0370b86183H6713a09781
$$ plain form
10660 -103981 -12773 -142189 262048 212206 -348586 -9382 62341 -52217 -180885 -396087 122356
10648 -62409 249957 -123719 35393 -170910 -235669 -135262 -160688 144526 211584 2635 -179476
10636 -185942 -419047 -247240 -7008 -114746 -122383 18440 -239687 35227 -218267 -66976 -174612
10625 -174612 -290968 -402422 -76864 13298 73402 141462 -162930 15209 365725 -214889
10614 125865 240074 -55403 -266479 120082 114728 93985 29418 112796 200731 -127775 -219005
10603 -219005 18560 111577 58845 -311763 91740 -139475 -3704 213662 65263 -227708 -175575
10592 -175575 -174602 -372409 -12547 152724 -78030 -6178 -132223 300146 -77718 -134020 -142259
10581 -142259 17862 -68325 -331600 120130 -383731 124348 -83404 -88946 43735 -142533 20874
$$ packed form
10660a03981a2773j29416B62048m9842c48586i382F2341e2217j28668k15202A22356
10648f2409B49957a23719C5393a70910o4759J00407k5426A44526O7058B635a79476
10636a85942k33105J71807g008j07738p637A8440b39687C5227b18267f6976j07636
10625a74612j16356j11454g6864A3298O0104O8060a62930A5209L50516b14889
10614A25865J14209e5403k11076A20082n354k0743B9418Q3378Q7935a27775r1230
10603b19005A8560R3017n2732c11763I1740a39475c704B13662F5263b27708N2133
10592a75575R73j97807a2547A52724g8030f178j26045C00146g7718n6302q239
10581a42259A7862f8325k63275A20130c83731A24348h3404n542D3735a42533B0874
$$ plain form
10569 53094 3173 -121207 -82381 12179 -298914 -8324 -276934 13087 43257 -305601 -61156
10557 -28195 -342811 -137987 -41928 11410 -205420 208883 -186842 -341624 -211244 125458
10546 16835 -120435 36090 74432 -104601 -2406 86450 -45992 313733 -19828 5107 -283722
10534 -45261 28544 211380 -49584 -146651 191143 -131959 -175119 -52929 -6371 39055 12839
10522 293247 -200877 43444 -23276 -145646 222234 -99590 110322 -51375 -90548 -46889 12602
10510 27021 154006 -141493 -4542 -105620 -193731 24834 16401 -120993 -4660 -369170 151982
10498 -292206 -27379 197637 -97528 -44255 113873 328754 -48595 -127367 34537 -148097 -247001
10487 -247001 10113 -234256 -239231 85802 296076 384161 211163 43746 272746 116350 -45045
$$ packed form
10569E3094C173a21207L8826A2179b98914h324k68610A3087L0170c05601f1156
10557b8195l14616a37987d1928A1410b05420B08883a86842j54782J30380A25458
10546A6835a20435C6090L8342a04601b406H6450d5992C13733a9828E107b83722
10534d5261B8544J82836d9584r7067A91143a31959m3160e2929f371C9055A2839
10522B93247b00877D3444b3276j22370B22234i9590A10322e1375l9173M3659A2602
10510B7021J26985a41493d542j01078q8111B4834q433a20993d660l64510A51982
10498b92206b7379A97637i7528d4255A13873K14881d8595p8772C4537a48097r8904
10487b47001A0113b34256m975H5802K10274Q8085j72998D3746K29000A16350d5045
$$ plain form
10475 86683 -115988 -67695 -26646 81945 -174123 83819 -76139 -164117 56089 150707 917 104315
10463 104315 291512 35466 84872 39699 -73587 -232297 49514 -74387 122189 -186954 31383
10451 52848 -263 -61632 61158 -215153 -147985 26609 1393 75000 -179357 -343257 -140232
10439 -127286 -75468 -619199 -112066 272061 218222 26471 -110712 269794 198560 -3160 353561
10427 294172 146488 44122 66123 -75356 262649 80225 -150212 48694 32895 -110790 154678
10415 -156305 172354 43995 98287 46837 13127 -113920 -437976 6572 11681 202434 -368691
10403 -78348 44897 -60922 -133819 104260 265601 238037 -27436 4302 50542 221196 109025
10391 55998 225136 71637 -91 -137384 168744 105428 28732 -148674 24298 90968 247686
$$ packed form
10475H6683a15988M8293b6646H1945a74123H3819g6139q7978E6089R4618I17J03398
10463A04315J87197C5466M9406C9699g3587j58710D9514g4387A22189a86954C1383
10451E2848b63o1369F1158b15153O7168B6609A393P3607a79357j63900a40232
10439a27286N1818n43731a12066B72061n3839B6471a10712B69794p1234c160C53561
10427B94172A46488D4122K2001g5356B62649H0225a50212D8694j5799a10790A54678
10415a56305A72354D3995N4292D6837A3127a13920l24056F572N109J90753c68691
10403g8348D4897f0922p2897A04260J61341k7564b7436D302M6240J70654A09025
10391E5998J69138G1637i1j37293A68744o3316B8732a48674B4298O6670J56718
$$ plain form
10380 247686 192912 -141346 238555 87242 278515 718890 380821 268024 267335 357685 273364
10369 273364 436499 14058 507052 437658 350277 245341 310358 284069 -103146 -84366 400357
10357 352962 190113 -1175 125884 371013 289581 225875 414222 628563 545047 405368
10347 405368 403364 224842 115340 298941 411263 450713 157823 421974 350682 60326
10336 18045 114795 25073 72909 117160 241790 62813 220424 -268290 -198519 -8746 -72940
10325 -72940 78970 331650 213436 214369 317964 -67398 98916 267821 275768 69440 83737
10314 83737 -47108 -7524 -9935 -69451 139560 159907 -343342 -9747 -98888 51581 -19169 -394626
10302 -394626 -147506 18317 -102611 118970 135445 -61798 341038 16218 -288674 88378
$$ packed form
10380B47686n4774a41346B38555H7242J91273M40375l38069j12797o89R0350q4321
10369B73364J63135A4058M92994o9394q7381j04936O5017k6289a03146J8780D00357
10357C52962j62849a175A25884K45129q1432o3706J88347K14341q3516j39679
10347D05368k004j78522j09502J83601J12322L9450A57823K64151p1292F0326
10336A8045R6750B5073M7836M4251J24630F2813J57611b68290O9771h746o4194
10325g2940G8970K52680j18214R33J03595f7398I8916J68905P947F9440J4297
10314H3737d7108g524k411n9516A39560K0347c43342i747q9141E1581a9169l75457
10302c94626a47506A8317a02611A18970J6475f1798C41038A6218b88674H8378
$$ plain form
10291 -299156 -40460 37604 114061 33883 -159766 92016 216710 -204789 -132777 6734 28683
10280 28683 215590 -31934 249567 -246634 -53086 -219168 168553 -44535 77070 -250803
10269 -263418 -28687 192949 12248 -36071 11679 52966 91422 276040 445358 257458 527075
10258 527075 60383 136801 229185 155898 -303203 112706 -246705 351230 34650 -9415 -52864
10247 -52864 -202132 -235892 -225420 84102 161329 -362258 136564 -69625 -117098 -98740 -193809
10236 -193809 -356759 226582 -154914 -196251 -173505 -38769 -157120 -178541 -232170 -100321
10225 58281 -27429 -29832 64449 -117850 18633 -66673 -59329 -23380 -623794 50515 208878
10214 208878 -107381 -50105 -97182 -371577 -139912 178211 123117 148167 -125478 -108839
$$ packed form
10291b99156d0460C7604P6457C3883a59766I2016J24694b04789P2012F734K1949
10280B8683J86907c1934B49567b46634e3086j66082A68553d4535G7070b50803
10269b63418b8687A92949A2248c6071A1679M1287L8456J84618J69318j87900K69617
10258E27075F0383P6418R2384p3287c03203A12706b46705C51230C4650i415m3449
10247e2864j49268l3760J0472H4102P7227c62258A36564f9625m7473J8358r5069
10236a93809j62950B26582a54914m1337K2746c8769j18351k1421n3629a00321
10225E8281b7429k403F4449a17850A8633f6673P344b3380o00414E0515J58363
10214B08878a07381e0105m7077k74395a39912A78211n5094K5050a25478J6639
$$ plain form
10204 -108839 -350929 -219386 -81572 -359413 -264786 247488 -104355 45321 -15130 40304
10193 -263746 -292078 -468925 -78468 -101788 143310 -203957 -168112 -44693 -3360 51724 92337
10182 92337 -285152 187040 125643 -38121 -23418 -113714 -257290 -262448 346515 -151981 188970
10170 -133927 -153004 101861 83128 50906 34420 116609 24141 -250721 -141875 -200683 128662
10158 -99222 -113669 44153 -355293 8862 -17883 -62912 -258133 -279884 104787 182943 108165
10147 108165 -95560 -147113 79923 -129074 103802 -173504 -11527 81811 42311 -151706 203630
10135 -136136 1785 9393 -428120 -201858 -1143 45621 -33442 -400853 -112003 -99324 -302600
10124 -302600 138621 123857 -157723 223523 380877 -303961 213206 23530 37211 -63807
$$ packed form
10204a08839k42090J31543h1572k77841R4627B47488a04355D5321a5130D0304
10193b63746k8332j76847g8468k3320A43310b03957L5845d4693c360E1724M0613
10182I2337b85152A87040o1397c8121J4703r0296j43576n158C46515a51981A88970
10170a33927j9077A01861j8733l2222j6486Q2189B4141b50721J08846n8808A28662
10158i9222j4447D4153c55293H862a7883m5029j95221k1751A04787P8156p4778
10147A08165i5560n1553G9923a29074A03802a73504a1527H1811l9500a51706B03630
10135a36136A785P608d28120b01858a143D5621c3442l67411a12003J2679k03276
10124c02600A38621j4764a57723B23523J57354c03961B13206B3530J3681f3807
$$ plain form
10113 -171034 6452 -208900 -532276 -158288 130166 -305791 -142081 -201207 -264314 182899
10102 -37241 -17817 132410 82272 -221686 -104065 -41704 52904 103500 -224518 -222 -229055
10091 -229055 -82025 10789 33454 -167286 -61719 -168808 63175 106831 -153777 -231848 297237
10079 -283998 -243493 -154552 -169604 -49262 -50832 194969 -277972 -311946 -106241 -285475 129534
10067 53359 -169483 268209 221346 -197971 5760 209074 -34139 109904 -244390 25314 -154864
10055 -201340 241100 24493 171845 188290 239827 -223447 -166872 -470090 -194114 16659
10044 -178516 51656 -103995 -298803 -28522 -171700 -79573 -137161 -129126 -355540 185845 -373780
10032 -260931 355245 -41492 -310958 -326585 165988 -11216 -133096 132772 50310 242949
$$ packed form
10113a71034F452b08900l23376a58288A30166c05791a42081n9126o3107A82899
10102c7241a7817A32410n0138b21686a04065d1704E2904N0596b24518b22k28833
10091b29055h2025A0789K2665a67286f1719j07089F3175M3656a53777p8071B97237
10079b83998M0505Q8941j5052d9262j570A94969b77972l3974a06241j79234A29534
10067E3359a69483B68209m6863a97971E760K03314c4139A09904b44390B5314a54864
10055b01340B41100B4493J47352J6445N1537b23447N6575l03218a94114A6659
10044a78516E1656a03995j94808b8522j43178g9573n7588Q035k26414A85845c73780
10032b60931C55245d1492k69466j5627A65988a1216j21880A32772E0310J92639
$$ plain form
10022 242949 -69477 -91213 -286134 128130 -56420 -550589 -3453 -58737 -179064 85135 114600
10011 114600 274904 102673 26148 -60529 -355378 -205442 42637 -288832 -346478 148406
10000 120843 -190548 -185079 -143123 95983 23376 -81077 -219040 39219 -720 -91951 21346 203123
9988 203123 177525 -67021 -139640 220636 -206582 -101923 -67668 -167408 -369097 -172162 -159756
9977 -159756 -326091 110775 145786 221759 -144990 -90316 -236530 171255 271493 -178120
9966 -234411 -148007 -206264 77623 -26326 -195968 -50815 -167902 205175 -94349 -292302 -45796
9954 133012 -17312 -68104 -61590 88415 264159 -139630 -38424 -81170 43425 76351 138896
9943 138896 -394445 -192027 -21847 -131757 5755 268591 -281894 -227283 -279413 -98751 77255
$$ packed form
10022B42949f9477k1736j94921A28130e6420m94169c453n5284j20327H5135K9465
10011A14600J60304A02673B6148f0529k94849J49936D2637b88832n7646A48406
10000A20843a90548N469M1956I5983B3376h1077j37963C9219g20r1231B1346J81777
9988B03123k5598f7021p2619B20636b06582a01923L4255r9740k01689a72162J2406
9977a59756j66335A10775L5011P5973a44990N4674j46214A71255J00238a78120
9966b34411Q6404n8257G7623b6326j69642e0815j17087B05175i4349j97953d5796
9954A33012a7312n0792O514H8415J75744a39630c8424m2746D3425L2926O2545
9943A38896c94445a92027b1847j09910E755K62836b81894N4611n2130i8751G7255
$$ plain form
9931 145131 127221 -196834 -122826 -116633 -268617 -315972 154285 -118105 -30378 -219594 55107
9919 79108 12199 -316591 61121 -235030 252803 -333 -133333 -441497 -366518 10935 -175176
9907 -213955 -106781 70356 -260054 129373 -175394 -273072 -114480 -582097 172418 -214868
9896 -214327 6134 29276 -207440 22553 55892 -433806 -18173 106927 107786 -42964 -66778 -383555
9884 -383555 -117161 -80497 -161747 67016 -258672 28705 -75746 265361 400144 -274350 -366551
9873 -366551 -61274 -114910 48618 53085 -159484 105533 -130167 -224990 229756 -85277 -273564
9862 -273564 -18233 -147560 -267660 -77255 25297 -278569 -238536 213714 -369973 -96584 -350824
9851 -350824 93509 -150246 -125102 -18846 167861 -334362 -222620 -67858 -52777 -168641 -69157
$$ packed form
9931A45131j7910a96834P4008O193j51984m7355A54285a18105c0378j89216E5107
9919G9108A2199c16591F1121b35030B52803c33j33000l08164P4979A0935a75176
9907b13955a06781G0356b60054A29373a75394r7678a14480m67617A72418b14868
9896b14327F134K3142b07440B2553L3339d33806a8173A06927Q59d2964k3814l16777
9884c83555a17161L6664q1250F7016b58672B8705g5746B65361J34783b74350r2201
9873c66551f1274n3636D8618M467a59484A05533a30167r4823B29756h5277j88287
9862b73564a8233j29327j20100g7255B5297b78569M0033B13714c69973i6584k54240
9851c50824I3509a50246K5144a8846A67861c34362J11742f7858J5081j15864f9157
$$ plain form
9839 62710 -105194 -296206 -152828 -49022 -28520 269515 -189126 -116302 -175823 -53322 44251
9827 104274 57000 210483 5655 44461 -9377 86024 -320105 101961 -73666 12635 44649
9816 44649 120589 -241973 -69060 336931 -76487 -68070 -11157 216994 -183392 99671 72953
9805 72953 -179782 170293 -481281 -115535 -163129 -57662 -113986 143408 31569 263651 -81952
9793 -264480 152883 -83753 -48636 -97112 -87066 -180959 -109571 -116831 -332715 4410 6881 -127350
9780 -74951 -10723 -63045 -252487 -262070 -102003 62532 -64274 -300190 29612 -204380 -201701
9769 -201701 -185017 -168558 -553061 -427038 13346 17910 -161684 -392317 25080 236629 -187188
9757 -163813 -242652 207341 165203 93720 -420329 -208150 -13748 5537 154336 181452 -157840
$$ packed form
9839F2710a05194j91012J43378d9022K0502B69515a89126P2824n9521e3322D4251
9827A04274m7274J53483E655L8806i377H6024c20105A01961g3666A2635L2014
9816D4649P5940b41973f9060C36931g6487Q417a1157B16994a83392I9671k6718
9805G2953a79782A70293d81281a15535m7594e7662n6324A43408C1569K32082h1952
9793b64480A52883h3753L5117m8476J0046r3893P1388p260k15884D410K471a27350
9780g4951a0723n2322j89442r583a02003F2532f4274k35916B9612b04380K679
9769b01701J6684J6459l84503J26023A3346M564a61684k30633B5080K11549a87188
9757a63813p8839B07341m2138p1483d20329b08150a3748E537J48799K7116a57840
$$ plain form
9745 29301 63253 -92336 225855 -96252 -112407 149883 -91269 -40735 -265943 -109933 -107829
9734 -107829 -25489 -24167 149551 -452447 26576 -132453 252215 -72877 27049 80282 -19808
9722 -130108 -112682 -6071 -218693 -110181 -230774 232911 -109578 43949 -111971 -33675 -151216
9711 -151216 -49170 -32826 -336354 -197105 70984 5737 213064 -616673 -234847 -141108 -159415
9700 -159415 174586 -114928 12419 -367761 49338 -183705 -148285 181749 58171 -40167 -152051
9689 -152051 -29646 -351609 -115967 154267 162589 -301567 -77530 -158036 -34399 -305022 -3403
9677 -334674 -90104 -27795 -14745 -100036 -62571 -148944 -218823 -209805 -252484 133125 -216332
9665 71689 -41949 -18273 -173450 -14885 -95140 -43606 -116013 304343 5092 78310 -30622 -398163
$$ packed form
9745B9301L3952i2336B25855i6252j6155A49883i1269d0735k25208a09933K104
9734a07829b5489J322A49551d52447B6576a32453B52215g2877B7049N3233a9808
9722a30108J7426f071k12622J08512j20593B32911a09578D3949a11971c3675j17541
9711a51216d9170J6344l03528J39249G0984E737K07327f16673b34847R3739j8307
9700a59415A74586a14928A2419c67761D9338a83705L5420A81749E8171d0167j11884
9689a52051b9646l21963a15967A54267Q322c01567g7530q0506c4399k70623c403
9677c34674i0104b7795J3050q5291L7465q6373o9879R018m2679A33125b16332
9665G1689d1949a8273j55177a4885q0255d3606p2407C04343E092P3218c0622l67541
$$ plain form
9653 -398163 -54515 -112501 166587 71026 32257 -113127 -276026 -68067 -212613 -35758 15506
9641 -216807 -73673 -325680 -8198 -455796 -133256 262492 -99091 194149 -142245 -204141 -253365
9630 -253365 -371868 -128132 -271202 -48179 -15034 -566324 -266799 -142241 68769 -208753
9619 -76238 170243 55868 -36883 164992 -20018 115598 45708 -303028 -323909 -224244 -146339
9608 -146339 -137019 -169408 -186602 -125842 -139699 6523 -117626 -1084 -33129 -247693 -249283 -186676
9596 -186676 13795 36412 -155028 197237 162467 -337906 -129733 -30872 28195 -142467 143
9584 -81629 -140464 -182062 -25009 118658 111204 -173887 -257746 -105660 90830 105424 141040
9573 141040 -163649 102858 15556 106145 -73625 70995 -149186 -228658 52047 -77467 112661
$$ packed form
9653c98163e4515n7986A66587G1026C2257a13127j62899f8067j44546c5758A5506
9641b16807g3673k52007h198m47598a33256B62492i9091A94149a42245o1896m9224
9630b53365j18503a28132j43070d8179a5034n51290b66799J24558F8769b08753
9619g6238A70243E5868c6883A64992b0018A15598D5708c03028k0881R9665P7905
9608a46339R320l2389j7194O0760j3857F523a17626a084l2045k14564j590O2607
9596a86676A3795K2617a55028A97237l4770c37906a29733c0872B8195a42467A43
9584h1629n8835m1598b5009A18658p454a73887q3859a05660I0830J4594L5616
9573A41040a63649A02858A5556R0589g3625G0995a49186p9472E2047g7467A12661
$$ plain form
9561 -40620 -329702 -7761 -143037 -107180 -84207 -72147 45360 -59195 90862 5241 -203090 99460
9548 -173527 -424543 -45755 -164259 -168706 -411984 126064 418470 -70731 58638 -56181 -105274
9537 -105274 -164035 -127317 15371 -22327 47304 -74681 68896 -113935 -11203 -115207 -76532
9526 -76532 -200814 232062 356269 -110260 35744 -63283 -146206 -233911 160477 -221096 -160667
9515 -160667 -101487 -12189 -254298 -374939 -162884 1066 269607 -207579 102855 -357471
9504 78953 -38043 -104634 -338379 -268186 119531 -294667 5244 -303701 -68582 91972 -271651
9492 10491 -362336 15037 -298565 243564 167995 96453 -321589 103489 -180938 -220638 275967
9480 -112786 360901 -76940 -260941 -441651 307245 126898 -225684 117878 32482 -259912
$$ packed form
9561d0620k89082g761j35276L5857K2973J2060D5360e9195I0862E241b03090I9460
9548a73527k51016d5755j18504m447k43278A26064K92406g0731E8638e6181m9093
9537a05274n8761L6718A5371b2327D7304g4681F8896a13935a1203j04004L8675
9526g6532j24282B32062J24207a10260C5744f3283q2923q7705A60477b21096O0429
9515a60667N9180a2189k42109j20641a62884A066K68541b07579A02855c57471
9504G8953c8043o6591k33745P0193A19531b94667E244c03701f8582I1972b71651
9492A0491c62336A5037b98565B43564p5569p1542c21589A03489a80938l9700B75967
9480a12786C60901g6940j84001j80710C07245A26898b25684A17878C2482b59912
$$ plain form
9469 326164 -64330 21560 88345 -182849 -136940 -198225 116664 -42203 -152018 41302 174911
9458 174911 -129022 -118615 -205755 -41778 -35432 35718 -250432 169332 -385964 30283 114068
9447 114068 39601 21836 68747 422146 17909 186940 139465 -153421 272224 -85441 115475
9435 36428 141405 100393 -25077 -2876 -486961 -90713 106777 -245402 -243279 -207339 170533
9423 1867 192793 -1628 151217 -78999 -294844 166749 -263436 226196 -34315 243585 166147
9412 166147 -355508 100679 -245038 82328 79283 -240544 -134593 68694 -174254 31500 55225
9401 55225 383368 -325307 -335880 -174330 -203196 145336 26357 182518 41389 -26615 37506
9389 -186089 -32153 -231489 -225387 -296374 134460 24777 -47986 283790 128054 203799 -159307
$$ packed form
9469C26164f4330B1560O6785a82849M5909o1285A16664d2203j09815D1302J33609
9458A74911a29022J0407q7140d1778O346C5718b50432A69332c85964C0283Q3785
9447A14068C9601j7765M6911L53399A7909J69031m7475a53421B72224h5441A15475
9435C6428J04977m1012b5077b876m84085i0713A06777b45402K123L5940A70533
9423A867J90926a628A51217g8999k15845A66749b63436B26196c4315B43585p7438
9412A66147c55508A00679b45038H2328l045b40544J05951F8694a74254C1500K3725
9401E5225L28143c25307j0573J61550k8866A45336B6357J56161D1389b6615C7506
9389a86089c2153j99336O102p0987A34460B4777d7986B83790A28054P5745a59307
$$ plain form
9377 125837 -252542 159448 -13872 11986 -79976 -202553 -382135 21015 -205463 101022
9366 -87435 -77983 -325874 -421154 -257444 59743 123652 374472 131850 88289 200251 -58896
9354 -63477 104030 -44213 -222207 -14893 -134291 -31635 15668 57343 -35406 -14972 77194
9342 -30459 -21054 70767 -4002 -344961 155177 -266480 -419719 -50214 74693 282780 59591
9330 296592 227744 203893 -2358 -315440 -241912 -211609 62546 -82272 -279611 158917 -92942
9318 -71501 -165184 149264 91634 -104555 -49199 -241588 295846 -15669 -116425 -84409 -36248
9306 -230167 -266961 195535 187780 48827 -2677 -134059 -101912 -193704 121593 -150328 -30194
9294 -86183 216471 -42774 -14754 -88859 -170660 -48955 -175593 236628 -27385 -274073 -149613
$$ packed form
9377A25837b52542A59448a3872A1986g9976j22577j79582B1015b05463A01022
9366h7435R452k47891r5280J63710E9743O3909K50820A31850m3561J11962e8896
9354f3477A04030d4213j77994a4893j19398c1635A5668M1675c5406a4972G7194
9342c0459R405G0767d002l40959A55177b66480j53239e0214G4693K08087E9591
9330B96592o8848k3851b358l13082P3528L0303F2546h2272j97339A58917i2942
9318g1501r3683A49264n7630a04555d9199j92389B95846a5669j00756L2016c6248
9306b30167l6794A95535p755D8827b677j31382L2147r1792A21593a50328c0194
9294h6183B16471d2774a4754p4105q1801d8955j26638B36628b7385k46688J24460
$$ plain form
9283 -149613 223209 -131145 -14969 244422 154063 -52500 -412782 123922 -287594 34006
9272 309813 -95444 -558200 -415616 -86454 -456228 -300498 140896 35620 -18857 -148679
9262 -148679 -548368 119536 47748 -375481 233796 71840 39052 -253880 -190728 -438763
9252 -438763 62469 -122305 7149 -222930 -203421 -15948 70769 -39618 101111 -409301 -82689
9240 -84212 -156772 -52999 65470 -73605 -327301 139166 -121457 72329 176939 -90424 -660771
9229 -660771 -227357 155505 27144 101722 8626 25132 -327460 -311742 -24976 -4451 24324
9217 -65049 -173501 88448 -332355 -9039 -249808 -17152 -66881 294653 -82713 60994 210372
9206 210372 -70537 -8775 171492 278767 165142 -365987 24504 106292 117819 240524 -78552
$$ packed form
9283a49613B23209a31145a4969B44422r0359e2500l60282A23922b87594C4006
9272C09813i5444m62756J42584h6454l69774J55730A40896C5620a8857j29822
9262a48679l99689A19536D7748c75481B33796G1840l2788b53880O3152k48035
9252d38763F2469a22305G149b22930J9509a5948G0769c9618A01111d09301h2689
9240h4212p2560e2999F5470g3605k53696A39166a21457G2329J04610i0424n70347
9229f60771b27357A55505B7144P4578H626J6506c27460J5718b4976d451B4324
9217f5049j08452H8448c32355i039k40769a7152m9729B94653h2713F0994J49378
9206B10372g0537h775A71492J07275j13625c65987B4504Q1788J1527J22705g8552
$$ plain form
9194 -241372 -104515 -69678 212820 -261401 25490 -20780 -4768 -185543 116611 185630 80083
9182 86 89175 44175 -81261 -253000 36766 -64896 38809 -100328 -214323 -133472 140627 91554
9170 91554 -116815 -61722 306008 -255016 18999 -45211 -119055 3559 -153988 -79573 -449572
9159 -449572 59250 99375 -113774 124623 -235222 -37598 168870 -309312 307911 -136181
9148 -215353 -206695 -35164 -84828 152007 265841 -207328 152760 71926 -12158 -130373 61872
9136 96605 40120 -223465 -193991 -58225 -53856 53576 -148650 -162291 -284318 -30250 -260846
9125 -260846 -58896 288274 -182187 79246 -106101 2970 -158955 150854 134058 -132234 -2505
9113 -387429 65657 65346 -297749 -95728 122120 253348 -464750 258754 -129637 -62288 -63311
$$ packed form
9194b41372a04515L4837B12820b61401B5490b0780d768j80775A16611O9019H0083
9182H6Q9089D4175h1261j71739C6766f4896C8809a00328j13995Q0851A40627m9073
9170I1554a16815N5093C06008b55016A8999d5211p3844C559a53988P4415l69999
9159d49572E9250M0125a13774A24623b35222c7598A68870c09312C07911a36181
9148b15353Q658c5164m9664A52007J13834b07328A52760G1926a2158j18215F1872
9136I6605D0120b23465K9474e8225M369E3576a48650j3641j22027c0250k30596
9125b60846e8896B88274a82187G9246a06101B970a58955A50854j6796a32234b505
9113c87429F5657l11b97749i5728A22120J31228d64750B58754a29637f2288j023
$$ plain form
9102 -63311 -166683 19792 -63241 -170870 -187592 33401 -108827 155546 -262589 -271483 -209870
9091 -209870 -121207 -150362 311515 317822 177537 205800 208175 26071 -52375 -97769 -76188 -20163
9078 -94539 -309765 165248 -21784 244018 -128823 -396867 197068 -173088 -224819 -72183
9067 -78033 -130076 83608 -59995 -360669 -132481 -80686 170640 -226359 -82019 -193179 -187432
9056 -187432 -289178 160496 -109849 47288 -11821 35001 -179612 28904 -112862 -102205 -117802
9045 -117802 -103663 5537 -56119 -279677 154388 -198766 -50238 -8379 115002 -11028 1741
9033 -59023 171100 -169127 -108026 -220114 179301 -259579 -18858 -64195 -10495 -410773 186309
9021 268028 242375 -35700 -215050 102142 163192 -167404 77581 43750 16203 276872 -129650
$$ packed form
9102f3311j03372A9792f3241j07629j6722C3401a08827A55546b62589q894O1613
9091b09870Q8663k9155C11515O307j40285K8263K375B6071e2375m5394K1581b0163
9078i4539k15226A65248b1784B44018a28823k68044A97068a73088n1731g2183
9067g8033n2043H3608e9995l00674a32481N1795A70640b26359h2019j11160N747
9056a87432j01746A60496a09849D7288a1821C5001a79612B8904a12862J0657j5597
9045a17802J4139E537e6119k23558A54388a98766e0238h379A15002a1028A741
9033e9023A71100a69127O1101j12088A79301b59579a8858m5337a0495m00278A86309
9021B68028k5653c5700j79350A02142O1050a67404G7581l3831A6203K60669a29650
$$ plain form
9009 -120211 113353 -216550 -427969 91758 -188135 -195752 34750 -25750 -82068 111799 -98092
8997 -115447 -174298 -150662 219822 -118999 130685 137410 -138253 -125137 -63804 35585 -321138
8985 74796 221403 -103983 -68734 -113017 180616 1026 -163623 -138875 -314494 -516924 -41886
8973 -67917 251002 8138 -76429 -204001 -271067 67096 -26602 -363573 127519 -62532 142345
8961 -192101 253215 165568 -24290 -165702 -13296 20850 -116499 123628 -306538 -66624 -73566
8950 -73566 -94243 -239630 -129575 -22694 -171951 140397 26651 47199 404859 -194534 243259
8938 109097 62819 -68294 -249900 -202700 -112023 -324784 -526616 161022 249602 120417 -279648
8926 76957 45430 -134357 -14849 220087 166872 381079 -254024 56749 -236827 -217662 -90919
$$ packed form
9009a20211A13353b16550k11419I1758a88135p617C4750b5750n6318A11799i8092
8997a15447n8851K3636B19822a18999A30685O725a38253J3116O1333C5585c21138
8985G4796J46607a03983L5249m4283A80616A026a63623K4748j75619k02430d1886
8973f7917B51002H138g6429j27572o7066F7096b6602l36971A27519f2532A42345
8961a92101B53215q7647b4290j41412a3296B0850a16499A23628c06538f6624o942
8950g3566k0677j45387J10055b2694j49257A40397B6651K0548L57660a94534B43259
8938A09097m6278f8294j81606M7200R0677k12761k01832A61022Q8580A20417b79648
8926G6957l1527a34357a4849B20087n3215K14207b54024E6749b36827J9165i0919
$$ plain form
8914 -233719 -114923 -270289 -26750 -66159 -80275 7134 -258074 -74950 -497755 82979 -71556
8902 -107556 201346 125117 -204301 -239474 50960 49569 -335526 -74606 262241 169330 71519
8890 95746 -94433 -96604 -51416 -496209 -63044 15316 251227 -14430 -64071 -42464 -106888 240700
8877 69939 -104514 115017 -184038 -63956 75361 -44009 -114929 115101 -214350 93936 -91584
$$ packed form
8914b33719a14923j55366b6750l9409j4116G134b58074g4950m22805H2979g1556
8902a07556B01346p6229b04301l5173E0960j391c35526g4606B62241r2911G1519
8890I5746i4433k171M5188m44793f3044A5316K35911a4430m9641K1607o4424B40700
8877F9939a04514A15017a84038f3956G5361d4009p0920A15101b14350I3936i1584
$$ [...]
##END NTUPLES=NMR SPECTRUM
##END=
