##TITLE=AC1729_SEN00002_9275740_F0xnw3EYGm
##JCAMPDX= 6.0         $$ Bruker NMR JCAMP-DX V2.0
##DATA TYPE= NMR SPECTRUM
##DATA CLASS= NTUPLES
##ORIGIN= BRUKER
##OWNER= Administrator
$$ 1.72 TOPSPIN		Version 2.1
$$ 2015-07-17 23:19:02.619 -0700  Administrator@X
$$ Compression mode = diff/dup
##.OBSERVE FREQUENCY= 400.02188249412
##.OBSERVE NUCLEUS= ^1H
##.ACQUISITION MODE= SIMULTANEOUS (DQD)
##.ACQUISITION SCHEME= undefined
##.AVERAGES= 8
##.DIGITISER RES= 22
##SPECTROMETER/DATA SYSTEM= spect
##.PULSE SEQUENCE= zg30
##.SOLVENT NAME= COFFEE_meoh
##.SHIFT REFERENCE= INTERNAL, COFFEE_meoh, 1, 14.98509
##AUDIT TRAIL= $$ (NUMBER, WHEN, WHO, WHERE, PROCESS, VERSION, WHAT)
$$ ##TITLE= Audit trail, TOPSPIN		Version 2.1
$$ ##JCAMPDX= 5.01
$$ ##ORIGIN= Bruker BioSpin GmbH
$$ ##OWNER= Administrator
$$ $$ E:\/data/COFFEE/nmr/AC1729_SEN00002_9275740_F0xnw3EYGm/20/pdata/1/auditp.txt
$$ ##AUDIT TRAIL=  $$ (NUMBER, WHEN, WHO, WHERE, PROCESS, VERSION, WHAT)
(   1,<2015-07-17 23:18:55.666 -0700>,<Administrator>,<X>,<go>,<TOPSPIN 2.1>,
      <created by zg
	started at 2015-07-17 23:17:48.775 -0700,
	POWCHK enabled, PULCHK disabled,
       configuration hash MD5:
       21 0F 79 D6 B3 7B B4 F6 88 20 88 DB 03 48 BD 9F
       data hash MD5: 64K
       05 0C 28 3B 5A 6E 2C B6 D5 56 4E 16 C9 67 60 31>)
(   2,<2015-07-17 23:18:58.775 -0700>,<Administrator>,<X>,<proc1d>,<TOPSPIN 2.1>,
      <Start of raw data processing
       efp LB = 0 FT_mod = 6 PKNL = 1 PHC0 = 0 PHC1 = 0 SI = 32K 
       data hash MD5: 32K
       C5 BE B0 C9 EC 6A 83 E3 BE B0 B6 65 52 EE 5F DC>)
(   3,<2015-07-17 23:18:59.088 -0700>,<Administrator>,<X>,<proc1d>,<TOPSPIN 2.1>,
      <pk PHC0 = 87.04468 PHC1 = 0 
       data hash MD5: 32K
       AF AD 0D 19 33 C2 6A E8 9E 55 A0 C9 F7 BB 0F 2F>)
(   4,<2015-07-17 23:18:59.197 -0700>,<Administrator>,<X>,<proc1d>,<TOPSPIN 2.1>,
      <abs ABSG = 1 
       data hash MD5: 32K
       18 4D C7 2C 7E 7D 17 5A 41 48 86 45 F1 61 CF 53>)
(   5,<2015-07-17 23:18:59.244 -0700>,<Administrator>,<X>,<proc1d>,<TOPSPIN 2.1>,
      <abs ABSG = 2 
       data hash MD5: 32K
       70 3B 74 1A 35 4D DC F5 B9 8B C9 95 FA F8 B6 82>)
(   6,<2015-07-17 23:18:59.307 -0700>,<Administrator>,<X>,<proc1d>,<TOPSPIN 2.1>,
      <abs ABSG = 3 
       data hash MD5: 32K
       68 37 4B DC C6 4C 46 B1 CB 1F 12 15 5B 9F 4C 70>)
(   7,<2015-07-17 23:18:59.354 -0700>,<Administrator>,<X>,<proc1d>,<TOPSPIN 2.1>,
      <abs ABSG = 4 
       data hash MD5: 32K
       F6 4C 32 F6 E0 BD B6 6F BE 3D 4E C5 9E F7 A4 AC>)
(   8,<2015-07-17 23:18:59.400 -0700>,<Administrator>,<X>,<proc1d>,<TOPSPIN 2.1>,
      <abs ABSG = 5 
       data hash MD5: 32K
       55 6D B1 8A AB 3E 64 17 B1 99 2D E1 80 D7 2B 11>)
$$ ##END=
$$ 
$$ $$ hash MD5
$$ $$ A6 F3 D3 F1 7A 0F 98 9D FB BD 03 C5 15 E6 5D 89
##$RELAX= 
##$RELAX= 
##$RELAX= 
##$RELAX= 
##$RELAX= 
##$RELAX= 
##$RELAX= 
$$ Bruker specific parameters
$$ --------------------------
##$DU= <E:\>
##$EXPNO= 20
##$NAME= <AC1729_SEN00002_9275740_F0xnw3EYGm>
$$ [...]
##$TP= (0..7)
150 150 150 150 150 150 150 150
##$TP07= 0
##$TPNAME0= <>
##$TPNAME1= <>
##$TPNAME2= <>
##$TPNAME3= <>
##$TPNAME4= <>
##$TPNAME5= <>
##$TPNAME6= <>
##$TPNAME7= <>
##$TPOAL= (0..7)
0.5 0.5 0.5 0.5 0.5 0.5 0.5 0.5
##$TPOFFS= (0..7)
0 0 0 0 0 0 0 0
##$TUNHIN= 0
##$TUNHOUT= 0
##$TUNXOUT= 0
##$USERA1= <user>
##$USERA2= <user>
##$USERA3= <user>
##$USERA4= <user>
##$USERA5= <user>
##$V9= 5
##$VALIST= <valist>
##$VCLIST= <CCCCCCCCCCCCCCC>
##$VD= 0
##$VDLIST= <DDDDDDDDDDDDDDD>
##$VPLIST= <PPPPPPPPPPPPPPP>
##$VTLIST= <TTTTTTTTTTTTTTT>
##$WBST= 2048
##$WBSW= 25
##$XGAIN= (0..3)
0 0 0 0
##$XL= 0
##$YL= 0
##$YMAX_a= 603488
##$YMIN_a= -532350
##$ZGOPTNS= <>
##$ZL1= 120
##$ZL2= 120
##$ZL3= 120
##$ZL4= 120
##$ABSF1= 14.98509
##$ABSF2= -5.573092
##$ABSG= 5
##$ABSL= 3
##$ALPHA= 0
##$AQORDER= 0
##$ASSFAC= 0
##$ASSFACI= 0
##$ASSFACX= 0
##$ASSWID= 0
##$AUNMP= <proc_prof1d_extract_pilot.lims>
##$AXLEFT= 0
##$AXNAME= <>
##$AXNUC= <1H>
##$AXRIGHT= 0
##$AXTYPE= 0
##$AXUNIT= <>
##$AZFE= 0.1
##$AZFW= 0.1
##$BCFW= 0
##$BC_mod= 0
##$BYTORDP= 0
##$COROFFS= 0
##$CY= 15
##$DATMOD= 1
##$DC= 0
##$DFILT= <>
##$DTYPP= 0
##$F1P= 0
##$F2P= 0
##$FCOR= 0.5
##$FTSIZE= 32768
##$FT_mod= 6
##$GAMMA= 0
##$GB= 0
##$INTBC= 1
##$INTSCL= 1
##$ISEN= 128
##$LB= 0
##$LEV0= 0
##$LPBIN= 0
##$MAXI= 10000
##$MC2= 0
##$MEAN= 0
##$ME_mod= 0
##$MI= 0
##$NCOEF= 0
##$NC_proc= -8
##$NLEV= 6
##$NOISF1= 0
##$NOISF2= 0
##$NSP= 0
##$NTH_PI= 0
##$NZP= 0
##$OFFSET= 14.98509
##$PC= 1
##$PHC0= 87.04468
##$PHC1= 0
##$PH_mod= 1
##$PKNL= yes
##$PPARMOD= 0
##$PPDIAG= 0
##$PPIPTYP= 0
##$PPMPNUM= 2147483647
##$PPRESOL= 1
##$PSCAL= 4
##$PSIGN= 0
##$PYNMP= <proc.py>
##$REVERSE= no
##$SF= 400.02
##$SI= 32768
##$SIGF1= 0
##$SIGF2= 0
##$SINO= 400
##$SIOLD= 32768
##$SPECTYP= <>
##$SREGLST= <1H.CDCl3>
##$SSB= 0
##$STSI= 32768
##$STSR= 0
##$SW_p= 8223.68421052631
##$SYMM= 0
##$S_DEV= 0
##$TDeff= 65536
##$TDoff= 0
##$TI= <>
##$TILT= no
##$TM1= 0
##$TM2= 0
##$TOPLEV= 0
##$USERP1= <user>
##$USERP2= <user>
##$USERP3= <user>
##$USERP4= <user>
##$USERP5= <user>
##$WDW= 1
##$XDIM= 32768
##$YMAX_p= 455102261
##$YMIN_p= -660415
##$CURPLOT= <Network HP LaserJet P1505>
##$CURPRIN= <$Network HP LaserJet P1505>
##$DFORMAT= <normdp>
##$LAYOUT= <+/1D_H.xwp>
##$LFORMAT= <normlp>
##$PFORMAT= <normpl>
##$SURQMSG= 1
$$ End of Bruker specific parameters
$$ ---------------------------------
##NTUPLES= NMR SPECTRUM
##VAR_NAME=  FREQUENCY,     SPECTRUM/REAL,   SPECTRUM/IMAG
##SYMBOL=    X,             R,               I
##VAR_TYPE=  INDEPENDENT,   DEPENDENT,       DEPENDENT
##VAR_FORM=  AFFN,          ASDF,            ASDF
##VAR_DIM=   32768,         32768,           32768
##UNITS=     HZ,            ARBITRARY UNITS, ARBITRARY UNITS
##FACTOR=    0.250966925370066, 1,           1
##FIRST=     8223.43324360094, -307852,      40795
##LAST=      0,             -127158,         20376
##MIN=       0,             -660415,         0
##MAX=       8223.43324360094, 455102261,    0
$$ Real data points
##PAGE= N=1
##DATA TABLE= (X++(R..R)), XYDATA
$$ [...]
19546B08285a83078A23224a13813H6738a65104B24804F2761J16533e5987j17339
19536a73326H9687A2205a21724o0209B07234K3448d7007j11471r4818C6515a72755
19524a22828j15740G6949J91805c1050n026k02777J4645A6058b38163B1810c0410
19512F603Q2451A3139a12236A19841b09785G0096b10066B73990I3528a5134l76488
19501c91622D8307J55628b8376q8253K0559j67363G6948A5498e5459E3328J99864
19490B53192a20642L0361k484q1088j37459c8098I4794c2821k86223D86074b42976
19478B19055R992b91064r3811a03943A3098b84233F5826J99219C4846P7659Q5764
19467A98269b64196j17503c9675k58683a0288j06152b5102A64394a33112j98750
$$ plain form
19546 208285 -183078 123224 -113813 86738 -165104 224804 62761 179294 -55987 -173326
19536 -173326 89687 12205 -121724 -181933 207234 230682 -47007 -158478 -253296 36515 -172755
19524 -122828 -238568 76949 268754 -31050 -36076 -238853 -224208 16058 -238163 21810 -30410
19512 6603 89054 13139 -112236 119841 -209785 70096 -210066 273990 93528 -15134 -391622
19501 -391622 48307 203935 -28376 -116629 -96070 -263433 76948 15498 -55459 53328 253192
19490 253192 -120642 -90281 -92765 -173853 -311312 -38098 94794 -32821 -319044 486074 -242976
19478 219055 229047 -291064 -384875 -103943 13098 -284233 65826 265045 34846 112505 198269
19467 198269 -264196 -381699 -39675 -298358 -10288 -116440 -25102 164394 -133112 -331862
19457c31862J55746I713a5780j14740p8784h5740k52149H8962B7259J45761g5590
19445b04221a9724B6233a01861I9486N78K30962B0630a53411A26095f7562o2470
19434a30032m3294j11198M5904J09649O2932p5468d5625k44935c5307A18805O7793
19423A86598i5213k50294J22310j42283A32276a16615E6390b7832E6100b4828
19412f125r5049b7121j11568a6201j70688a346C7046b84552O46K4300j0760b9774
19399a81416j75555P6740k3895a25107A48437a99609b2003F1681a69774C2455
19388b87871A52427b07404j6516d1077l05420a59850O7815l527j90263A49116
19377a0630A5577L0746c703I4611b83757g6942F54J5111c15885i8380r1933B8114
$$ plain form
19457 -331862 -176116 9713 -15780 -130520 -209304 -85740 -337889 88962 27259 173020 -75590
19445 -204221 -19724 26233 -101861 99486 100064 331026 20630 -153411 126095 -67562 -130032
19434 -130032 -173326 -284524 -238620 -128971 -66039 -141507 -45625 -290560 -35307 118805 186598
19423 186598 -95213 -345507 -223197 -365480 132276 -116615 56390 -27832 56100 -24828
19412 -6125 -101174 -27121 -138689 -16201 -186889 -1346 37046 -284552 -283906 -259606 -270366 -29774
19399 -181416 -356971 -280231 -304126 -125107 148437 -199609 -22003 61681 -169774 32455
19388 -287871 152427 -207404 -223920 -41077 -346497 -159850 -92035 -95562 -285825 149116
19377 -10630 15577 46323 -3703 94611 -283757 -76942 654 15765 -315885 -98380 -190313 28114
19364B60164B2735a06917B17684B1725d0797j50173B21587I1312a76794B0234
19353b26121l3117i6504G6610B704c7976n5350F692b75385f1002E0232a57673
19341f2229A24324a8179C7083N67d6583j12539J2072b4734q5323j64436O6654
19330b07839O5658M9984j57607h9492E0547b38189B3154C91a68976m8055A32865
19318D8969a66203e5994b3561L347n346B96246d8240j00375C9184d6162H30a50971
19305c00863N4379k19987Q8616J35432G7311b31462M5901B78082A13120a31126
19294E1745b06120F8085d13390A14596p535b17031A84939b48773E2878c32274
19283A29853E5539k4363b479j86203D3812c74081A67109b06284j6292n3534a9431
$$ plain form
19364 260164 22735 -106917 217684 21725 -40797 -190970 221587 91312 -176794 20234
19353 -226121 -259238 -96504 76610 2704 -37976 -93326 6692 -275385 -61002 50232 -157673
19341 -62229 124324 -18179 37083 37650 -46583 -159122 -147050 -24734 -110057 -274493 -207839
19330 -207839 -142181 -92197 -249804 -89492 50547 -238189 23154 391 -168976 -217031 132865
19318 48969 -166203 -55994 -23561 -20214 -25560 296246 -48240 -148615 39184 -46162 830 -150971
19305 -300863 -246484 -466471 -377855 -242423 77311 -231462 -185561 278082 113120 -131126
19294 51745 -206120 68085 -413390 114596 107061 -217031 184939 -248773 52878 -332274
19283 129853 55539 31176 -2479 -188682 43812 -374081 167109 -206284 -222576 -276110 -19431
19271E7063b66919L9488j72417J54923A50823o5482a88266n4808L7797c0165B0931
19259I398L3088a71367c2424m2596A44116F9207k9574c20718A42738h364k17639
19248b26003j74323c5237m9526P835H832b5074m6351b2163n8214j69431J06075
19237a43733B94063a99917E9616f2266m8214H5134a55522j17763k0427J22632
19227a71080p2371m0340D1184a2081j67173j34506a17240E6945a79486Q3306o9323
19216a65503g8134G7144J65165o1066a60400b0014D588b45180A2839a88474D9699
19204b3590p7415l1287m1464B066Q8940h5173j58339I8312P3844E034b65672A52690
19191a20199j16838C35064a02508k5744d73l21844N0787A55914E4062b59754a21816
$$ plain form
19271 57063 -266919 -227431 -399848 -244925 150823 85341 -188266 -243074 -205277 -30165 20931
19259 9398 42486 -171367 -32424 -75020 144116 69207 39633 -320718 142738 -8364 -226003
19248 -226003 -400326 -35237 -84763 -76928 8832 -25074 -71425 -22163 -80377 -249808 -143733
19237 -143733 294063 -199917 59616 -62266 -110480 85134 -155522 -273285 -293712 -171080
19227 -171080 -243451 -283791 41184 -12081 -179254 -313760 -117240 56945 -179486 -96180 -165503
19216 -165503 -78134 77144 242309 181243 -160400 -20014 4588 -245180 12839 -188474 49699
19204 -23590 -101005 -132292 -173756 2066 91006 -85173 -243512 98312 172156 5034 -265672 152690
19191 -120199 -237037 335064 -102508 -128252 -473 -322317 -271530 155914 54062 -259754 -121816
19179a47754j04939D0522Q3392a98949C50551B5725O4191j0083K50276A47953
19168a59170j35044Q5887G0810k3891c49708a20825G3243a9207l95384J17838
19158b96753G6081a2031j81601H6880P3688a70366o8318b2070H5518a96042Q9193
19147a06849a1544G7630a53385m8367H0285c91779B03970b0062j24284e218l00046
19136c05264A19336R9349a58948J4329A33310d2200j49553B54770r3803d29031
19125b9712k09872M9571I1062i5318E3100h5303o5690p0266f7596b2576k71945
19114b94521e2972j8494A19029a41227M3075k0049d5660A77627m9804j2464c07885
19102A84529G8919c41550a11826k35072J32737K2769G5470f6424A63866b28638
$$ plain form
19179 -147754 -252693 40522 123914 -198949 350551 25725 89916 79833 330109 147953
19168 -159170 -294214 -208327 70810 46919 -349708 -120825 73243 -19207 -414591 -296753
19158 -296753 76081 -12031 -193632 86880 160568 -170366 -238684 -22070 85518 -196042 -106849
19147 -106849 -11544 77630 -153385 -201752 80285 -391779 203970 -20062 -144346 -5218 -305264
19136 -305264 119336 218685 -158948 -144619 133310 -42200 -191753 254770 160967 -429031
19125 -29712 -239584 -190013 91062 -95318 53100 -85303 -150993 -221259 -67596 -22576 -294521
19114 -294521 -52972 -71466 119029 -141227 -98152 -118201 -45660 177627 127823 115359 -307885
19102 184529 78919 -341550 -111826 -346898 -214161 -191392 75470 -66424 163866 -228638
19091g4570j36074j5633B57459b73087g1607J9178l02021h3507q9594J507F2037
19079i2692A61305c35049a66773C9126K95850a61669l0148p7279J06532D6767
19068B98233j5251a62545b9336j24667g5039B10564g4725k06693e8812j27546
19058a86358c2343E48915A90563c40399g447E81Q628Q1099a88097C38186g1185
19046c2915j63288g6672B15275b11104L3918A03006e2969C63232a65627I8288
19035a79782H8328b70654A4477L73472E4202a34776c091A16559a62834b0280A7069
19023a04561A78503b69356B11355a97365L5668j58509H1653A9728h8915k67j29224
19012b18406J02994M4197o3254k1838C07581C0276g1441l45924R6166f8561q7915
$$ plain form
19091 -74570 -210644 -226277 257459 -273087 -71607 -52429 -354450 -83507 -173101 -171594 62037
19079 -92692 161305 -335049 -166773 39126 334976 -161669 -191817 -269096 -162564 46767
19068 298233 282982 -162545 -29336 -154003 -75039 210564 -74725 -281418 -58812 -186358
19058 -186358 -32343 548915 190563 -340399 -7447 581 9209 90308 -188097 338186 -71185
19046 -32915 -196203 -76672 215275 -211104 -177186 103006 -52969 363232 -165627 98288
19035 -179782 88328 -270654 14477 387949 54202 -134776 -3091 116559 -162834 -20280 17069
19023 -104561 178503 -269356 211355 -197365 -161697 -320206 81653 19728 -88915 -89182 -218406
19012 -218406 -115412 -71215 -134469 -156307 307581 30276 -71441 -417365 -321199 -68561 -156476
19001a56476n9332Q8109B88948I6756J10875a66976D4234a46138E4908M0490J33943
18990B29341E7503C514a3726B96781d70036D42367h3158B01343g804E5081b94152
18978b1142A88004a97524j89239a6495j69672J2118P3698j78802g1265k1530A67902
18966c4458k65219B09875a29359k6984c0655A54417D965e5021A02378D7316c71793
18954A32606b11511j04337b8801m3883D2867L528O0639F934g2840A61473b48540
18942e965m48487d2073B34403a69111b8778B7595c8597f663l07903B880c2012
18930A42031a20866L1714l32642e1303k40872i6296G0384Q7310i958B21915i1556
18918a9985A2082P2392K23447A40875a08908d295B93423c3618C5910a9270l9702
$$ plain form
19001 -156476 -215808 -127699 288948 96756 207631 -166976 44234 -146138 54908 95398 229341
18990 229341 57503 3514 -13726 296781 -470036 442367 -83158 201343 -7804 55081 -294152
18978 -21142 188004 -197524 -386763 -16495 -186167 -174049 -100351 -279153 -71265 -92795 167902
18966 -34458 -299677 209875 -129359 -156343 -30655 154417 4965 -55021 102378 47316 -371793
18954 132606 -211511 -315848 -28801 -72684 42867 46395 107034 6934 -72840 161473 -248540
18942 -5965 -454452 -42073 234403 -169111 -28778 27595 -38597 -6663 -314566 2880 -32012
18930 142031 -120866 -89152 -421794 -51303 -292175 -96296 70384 157694 -9958 221915 -91556
18918 -19985 12082 84474 307921 140875 -108908 -4295 293423 -33618 35910 -19270 -58972
18907e8972C7909a60511A07153l5978a11842r9553A54955b59278R1034B7208b9309
18895c24063i244j91260G993a15280A77718j6683D098a02088F9628L031l570a19072
18882B0643a75904m6219I122O6623a60578c3303k72071D7820K5737c30469g6095
18870a68629A65873a90620j28031K2883a9468k2722H2293a20417m4582N6987k47134
18859c55146B6247c9309J7041j13371O0571A63882n1741n2312b57148M8573I8732
18847f8036a6463A72847d2647A57802C189R7717b00224h3329B01722G4515K2240
18836I6755c37911a18440k8990A55360a81292E2044j8338e7741K7409j49511M4050
18825a35793O688E42440B00413I6250Q8590C9551d9892E7975K59705A26462c35582
$$ plain form
18907 -58972 37909 -160511 107153 71175 -111842 -211395 154955 -259278 -168244 27208 -29309
18895 -324063 -9244 -200504 7993 -115280 177718 161035 4098 -102088 69628 72659 69089 -119072
18882 20643 -175904 -222123 9122 75745 -160578 -33303 -305374 47820 73557 -330469 -76095
18870 -168629 165873 -190620 -318651 -295768 -19468 -42190 82293 -120417 -164999 -108012 -355146
18859 -355146 26247 -39309 -22268 -135639 -75068 163882 112141 59829 -257148 -208575 98732
18847 -68036 -16463 172847 -42647 157802 3189 100906 -200224 -83329 201722 74515 96755
18836 96755 -337911 -118440 -147430 155360 -181292 52044 33706 -57741 -30332 -179843 -135793
18825 -135793 -129105 542440 200413 96250 184840 39551 -49892 57975 317680 126462 -335582
18813A00829Q9295o476G3783L71730A28276c4029k7329K5857B21648o273B1023
18801c31350e7886B63103E0448a0619j37032F6203b94303C5150b08148O5859A0607
18789d0656F4693a69690j30940C10654g0020j65779L972G9635d5374j14910B8078
18777b45331a15789k2566A5459d5533o0172j60476N5447b1606B554b49875J0356
18766b39519i1515M5174l33118a31641K5395d165A17249J8187J3645e282r222
18755a4504m8524E0950c62772a61960P3451C3060c07333C01809a63778A3076i6380
18743e8054B02040E4932J03853h3661K5695k00850j93589J90991b9580j58780
18733a88360j03959h2499j43018A32376b46108B25668a60776L5713B15946G3559
$$ plain form
18813 100829 190124 183648 73783 445513 128276 -34029 -61358 -35501 221648 215375 21023
18801 -331350 -57886 263103 50448 -10619 -147651 66203 -294303 35150 -208148 -142289 10607
18789 -40656 64693 -169690 -300630 310654 -70020 -235799 -231827 79635 -45374 -160284 28078
18777 -245331 -115789 -138355 15459 -45533 -105705 -266181 -210734 -21606 2554 -249875 -239519
18766 -239519 -91515 -46341 -379459 -131641 -106246 -4165 117249 135436 149081 -5282 -14504
18755 -14504 -63028 50950 -362772 -161960 -88509 33060 -307333 301809 -163778 13076 -96380
18743 -58054 202040 54932 158785 -83661 -57966 -258816 -452405 -261414 -29580 -188360
18733 -188360 -292319 -82499 -225517 132376 -246108 225668 -160776 -125063 215946 73559
18722C534N7947c22498J17554P0281A64260c33819J25455h189B00289R5763C211
18710A21739c06508a827j07080d8748j09889K5203A57036C6045a34205I2280b02581
18698D7958a85577A96358d1439C60971D2591J65897a31746l5052g466C6060c6208
18686A20198a43139k8603c7645D6397A1333J94976D6975g6847j52191i1166j28499
18675b19665Q0439B26687G2681N3221e7037a241q7219E1775J82958D6254e9888
18663E3986a4035l5255q7346B5385j0813e02313A54231b02837I7541J06303R2080
18652B95924a53198a9776l6161n168A3319b33142k3042J11603c7197o7649n369
18641a10215M4000k5643k59688f9119b3928j23847q1667j6356N9178b1500E0699
$$ plain form
18722 3534 61481 -322498 -204944 -134663 164260 -333819 -208364 -8189 200289 296052 3211
18710 121739 -306508 -1827 -108907 -48748 -158637 -133434 157036 36045 -134205 92280 -202581
18698 47958 -185577 196358 -41439 360971 42591 208488 -131746 -166798 -7466 36060 -36208
18686 120198 -143139 -171742 -37645 46397 11333 206309 46975 -76847 -229038 -91166 -219665
18675 -219665 -139226 226687 72681 125902 -57037 -1241 -88460 51775 234733 46254 -59888
18663 53986 -14035 -49290 -136636 25385 14572 -502313 154231 -202837 97541 203844 295924
18652 295924 -153198 -19776 -55937 -61105 13319 -233142 -256184 -144581 -37197 -104846 -110215
18641 -110215 -66215 -91858 -351546 -69119 -23928 -147775 -229442 -245798 -186620 -21500 50699
18629c0443l56628a64984a8855A3480d05086F9622j8355g2334B40551b78001A06619
18617b3341j55897j97224i8793l0586J1763N3495A22639c4319G7740a20295e4265
18605b04311e614H1663a20809j80995J47513c0864j38482L2306k0895g0236j76531
18594b46767c7815j22658l2972o1966A19687i5628q3297A05795h0108L6290l2616
18583g6434j45698L9296I3907f8591k37818N299J39302E5425a08840l1887G400
18571b05661O4384A56163e01511A16755a34697A51299a88196e2644f433j04096
18561a10529j76462l0356J09276A41539b97554e4115k5695k6561E8076k632a31485
18549b76959a9381k59736f0866I4447d8537A8150L2388Q121h1874A31508a09953
$$ plain form
18629 -30443 -387071 -164984 -18855 13480 -405086 69622 51267 -72334 240551 -278001 106619
18617 -23341 -179238 -376462 -98793 -129379 -117616 -64121 122639 -34319 77740 -120295 -54265
18605 -204311 -5614 81663 -120809 -301804 -154291 -30864 -169346 -137040 -157935 -70236 -246767
18594 -246767 -37815 -160473 -193445 -255411 119687 -95628 -178925 105795 -80108 -43818 -76434
18583 -76434 -222132 -182836 93907 -68591 -306409 -301110 -161808 55425 -108840 -140727 7400
18571 -205661 -141277 156163 -501511 116755 -134697 151299 -188196 -52644 -6433 -110529
18561 -110529 -286991 -317347 -208071 141539 -297554 -54115 -79810 -106371 58076 55444 -131485
18549 -276959 -19381 -279117 -60866 94447 -48537 18150 50538 58659 -81874 131508 -109953
18537g8649o0642a3981B18900i6855C14562a09596C29911b4873E0904K71883i1266
18525A53481a38204H4533f6316p2320j71898F2491a27582E2840a32480k89872
18515d22352B42647F4640l1153b2729A07519a5647j71942j46901I8a40532n9386
18504a99918A4492O0316B2076J00971d6882A64707k8414d5204B02257c79437a11807
18492b41557j22416C35411b82659j07627i4552C4820a87040H5559a61433D02056
18481e5067e847A59680J77429i9542L938m1470b5279k6462B6251a6799A1555N5364
18469F6919J2207c7222A4818L14697H9820b05550c5121H259b41268H645a8033
18457b2617A3816c8560E4915g6016b7663a2944m36914A9995e448k4643J2918B82050
$$ plain form
18537 -78649 -139291 -13981 218900 -96855 314562 -109596 329911 -24873 50904 322787 -91266
18525 153481 -138204 84533 -66316 -138636 -310534 62491 -127582 52840 -132480 -422352
18515 -422352 242647 64640 33487 -22729 107519 -15647 -187589 -334490 98 -140532 -199918
18504 -199918 14492 74808 22076 123047 -46882 164707 136293 -45204 202257 -379437 -111807
18492 -241557 -363973 335411 -282659 -390286 -94552 34820 -187040 85559 -161433 402056
18481 -55067 -5847 159680 337109 -99542 -95604 -137074 -25279 -51741 26251 -16799 11555 66919
18469 66919 79126 -37222 14818 329515 89820 -205550 -35121 8259 -241268 8645 -18033
18457 -22617 13816 -38560 54915 -76016 -27663 -12944 -449858 19995 -5448 -30091 -17173 282050
18444d653k03728f3122j09197b7894j13027M3271j70410i2218o7597c6370j5205
18433e1575F4920N5603m8258a22095A51981a92813j80504J39470R2282n4647A11778
18421b27350B17328f730l413G6145h8421j04306a2320A15497a12728I1197a08769
18409I2244K34642D3039a98541l5755j1198A28453a12759h635j2497l3133I7390
18397b604H3471a21092j5628l7869d8535j84254o1750a35748j28295A58695d1388
18385b52121A68571D5375i0726B06256n2929c5805l12720j70073b18222D4031
18374A64370H324J53414F5617J21982a65496B14117c05889D7424b0029j95745
18364b15774I1495a59691C51569b39147c5374j02622I3849c76592B0190L0510
$$ plain form
18444 -4653 -208381 -63122 -172319 -27894 -140921 -97650 -268060 -92218 -159815 -36370 -51575
18433 -51575 64920 120523 72265 -122095 151981 -192813 -373317 -233847 -141565 -196212 111778
18421 -227350 217328 -6730 -10143 76145 -88421 -192727 -12320 115497 -112728 91197 -108769
18409 92244 326886 43039 -198541 -234296 -245494 128453 -112759 -8635 -21132 -54265 97390
18397 -2604 83471 -121092 -136720 -174589 -48535 -232789 -294539 -135748 -264043 158695 -41388
18385 -252121 168571 45375 -90726 206256 153327 -35805 -348525 -518598 -218222 44031
18374 164370 8324 161738 65617 187599 -165496 214117 -305889 47424 -20029 -215774
18364 -215774 91495 -159691 351569 -239147 -35374 -137996 93849 -376592 20190 50700
18354E0700f2984j40730g0169J6164A40359d7091m2209j06575R1888q2144B7296
18342C0342Q1863a76303B26899H5319g098C07729b45683J2960A94419j7490C7425
18330A5674R4944a01519B4990J21360e8245k54565J17963L2168g3200o773A0387
18318B5948e7380j65670h7725j9351j9237I311J46036b04582B3040b15852F9224
18306a21534l52781i1638j50540i6831A61846K52432e5450n052o6839j4669p6178
18295b18188M7046A82492D5937Q9065a8298Q090q2325K9346m8468O539d5147C43090
18282H8960k7082a84101c5686A67792j949i8456j56744A7831M7574d9847A80489
18270b84753M0352a14555A53532e1272C1087c11162a34732n4410A24925A5596
$$ plain form
18354 50700 -62984 -203714 -70169 -54005 140359 -47091 -89300 -195875 -103987 -186131 27296
18342 30342 112205 -176303 226899 85319 -7098 307729 -245683 -232723 194419 176929 37425
18330 15674 110618 -101519 24990 146350 -58245 -312810 -194847 -162679 -73200 -79973 10387
18318 25948 -57380 -223050 -87725 -107076 -126313 9311 155347 -204582 23040 -215852 69224
18306 -121534 -474315 -91638 -242178 -96831 161846 414278 -55450 -60502 -127341 -142010 -218188
18295 -218188 -171142 182492 45937 135002 -18298 -10208 -92533 -63187 -111655 -105116 -45147 343090
18282 88960 61878 -184101 -35686 167792 165843 -98456 -255200 17831 65405 -49847 180489
18270 -284753 -244401 -114555 153532 -51272 31087 -311162 -134732 -189142 124925 15596
18259c9892j81044B80382a23893E7068L57329C4944a2074j18684c4385A2532a64085
18247E9755a82827m4592h4496c9982k22971B43768a8265p4434A2980c36349J10528
18236b25821B42690c9203j3145q5239d7763j4681o0949A85383b92278j3215b6637
18224a94969m7875R976l37802b21645Q2196B87430a73790B86456D3911j7627a10889
18212b36609d5531B1740d80477B55423j00933O6827h6690A07432g6367L7034p2026
18201a11359F7205b66016C47498j07635b70048J29210c2025B8236b11999k09679
18191d21678D3552a9615k45969h807j38249B91340a52400B0810a92663f3170o0401
18180a23571j07379A99154p8180a74553j11936a04939j9702A35012f5432j66525
$$ plain form
18259 -39892 -220936 280382 -123893 57068 414397 34944 -12074 -130758 -34385 12532 -164085
18247 59755 -182827 -227419 -84496 -39982 -262953 243768 -18265 -92699 12980 -336349 -225821
18236 -225821 242690 -39203 -52348 -137587 -47763 -62444 -123393 185383 -292278 -305493 -26637
18224 -194969 -242844 -232868 -570670 -221645 -139449 287430 -173790 286456 43911 26284 -110889
18212 -236609 -45531 21740 -480477 255423 154490 221317 -86690 107432 -76367 -39333 -111359
18201 -111359 67205 -266016 347498 239863 -270048 -140838 -32025 28236 -211999 -421678
18191 -421678 43552 -19615 -265584 -8807 -147056 291340 -152400 20810 -192663 -63170 -123571
18180 -123571 -230950 199154 120974 -174553 -286489 -104939 -124641 135012 -65432 -231957
18170b31957m9539H9343Q7976b04936A9747K01659C6803Q8769b24421i1197j56587
18159b47784C63597b50416P6909f705j00795A23882b68454a26251F8775i6247
18148A03321c072j90346A20982L7994b61268B9968D720b496j00508j75694C1007
18136a14762K3408j97261A78400i7190m1384A99399K4728a33856A12497a8822
18125A88519E4678J60093D9701b40041i7724j46397a6335B69039i5124c8867B6526
18113c82435a33277K7042j16846C8210f3674B2827J14813b63120a5274k3021A90222
18101A31487b50523F5031C0971J36018k4421D647c32742e2186j37630B94132b7729
18089c436k72698J01983K3121F8298J07911m9558J25028j10699a49255A30857
$$ plain form
18170 -231957 -281496 89343 177319 -204936 19747 221406 36803 125572 -224421 -91197 -247784
18159 -247784 363597 -250416 -173507 -6705 -107500 123882 -268454 -126251 68775 -96247
18148 103321 -3072 -193418 120982 158976 -261268 29968 4720 -2496 -103004 -278698 31007
18136 -114762 -91354 -288615 178400 -97190 -138574 199399 224127 -133856 112497 -18822
18125 188519 54678 214771 49701 -240041 -97724 -244121 -16335 269039 -95124 -38867 26526
18113 -382435 -133277 -106235 -223081 38210 -63674 22827 137640 -263120 -15274 -38295 190222
18101 131487 -250523 65031 30971 166989 142568 4647 -332742 -52186 -189816 294132 -27729
18089 -3436 -276134 -174151 -151030 68298 176209 126651 251679 140980 -149255 130857
18078a07622j91473J29279c9759p3332A6576a47366M4272k28884A0854a67784
18067i5426k52621A5758a14431I7795j5601c02389B26837a95431N3674E7634B1894
18055B774J73883n3144a52148d9242j49474D8152M7231b05208b5474A17703E5371
18043I2646c4875A28934L4499e1818j0622o695D0042a55172r372b0722k74329
18032b95051d3361A59409n1953a65385M5310A44935d4841q3075A57808b4364J666
18021b2698C1184o91a62735k26810F9636b77413J9704j19185C49981a24569A38125
18009i9154J1989M0239I5205C2025b65416L2121P1918j88692a24672A61506K24077
17998C85583f7994j71476a5654r792A73264a79560B37698B9712a30046j60082
$$ plain form
18078 -107622 -299095 -169816 -39759 -113091 16576 -147366 -103094 -331978 10854 -167784
18067 -95426 -348047 15758 -114431 97795 82194 -302389 226837 -195431 -141757 57634 21894
18055 2774 176657 123513 -152148 -49242 -198716 48152 95383 -205208 -25474 117703 55371
18043 92646 -34875 128934 163433 -51818 -62440 -69135 40042 -155172 -164544 -20722 -295051
18032 -295051 -43361 159409 107456 -165385 -120075 144935 -44841 -127916 157808 -24364 -22698
18021 -22698 31184 30493 -162735 -389545 69636 -277413 -257709 -376894 349981 -124569 138125
18009 -99154 -87165 -46926 95205 32025 -265416 -233295 -161377 -350069 -124672 161506 385583
17998 385583 -67994 -239470 -15654 -25446 173264 -179560 237698 29712 -130046 -290128
17988b90128G8720a26751H7921A5203c84240d8749q837l2034D31358a77288b217
17976I6118j2615P0047a35409m1793D8062a61769n6861i7025B43543I1698K61596
17965C53294J9780A35977g427B5803f48670b1240A45980b78682A22796a95828
17954C5636a04495e0594n1464B50791b50498D1041a47180H4814N9027k627a41557
17942B55087r1332j4432a74660P6427M7949J1927G5722j3791b56298f6985A4076
17930d04673A91823a08178a6585j23362M459E0689d251B88290a00491C6843J89840
17919B26683A0046a51722A510a31332j76435b9457j48119O8170D3813a73907c1110
17907i858G9446d6141A95549C5393b32142C5237N9645a50878L6532A93277i8031
$$ plain form
17988 -290128 78720 -126751 87921 15203 -384240 -48749 -57586 -89620 431358 -177288 -2217
17976 96118 83503 153550 -135409 -177202 48062 -161769 -218630 -97025 243543 91698 353294
17965 353294 373074 135977 -7427 25803 -648670 -21240 145980 -278682 122796 -195828
17954 35636 -104495 -50594 -102058 250791 -250498 41041 -147180 84814 143841 141214 -141557
17942 255087 163755 149323 -174660 -98233 -50284 -38357 75722 61931 -256298 -66985 14076
17930 -404673 191823 -108178 -16585 -139947 -135488 50689 -4251 288290 -100491 36843 226683
17919 226683 10046 -151722 1510 -131332 -307767 -29457 -177576 -109406 43813 -173907 -31110
17907 -9858 79446 -46141 195549 35393 -232142 35237 94882 -150878 -114346 193277 -98031
17895i034j4483A47179R0948A09302b02897A13555b9347j05433K7602L4088I6753
17883e4708p3423G6413J84065a81517h0986B71528p5630k9891F1105o982a45134
17871b46205A76654a76595B3177d8578j30642h6131L7556A91770b56485C8184
17860f9418c577l55161D2034O9330D3616b6787B66125i8862j23118A57562b48053
17848E4716a08362k60765e3524A37971F6572L7108a44132m7726g0037b7525q0718
17837a08243B32759b01762f7303F4498a21188C5601c98175i6775m849A1035J20065
17826A31100j9835l2190Q535a05549d8518J7589j13059H8919b1982A34813c5195
17814g9855B52559B7147L6721a97281A73269b60522r4422A216b50588e1530n3355
$$ plain form
17895 -9034 -23517 147179 238127 109302 -202897 113555 -29347 -134780 -107178 -73090 96753
17883 -54708 -128131 76413 260478 -181517 -80986 271528 195898 166007 61105 54123 -145134
17871 -246205 176654 -176595 23177 -48578 -179220 -86131 -48575 191770 -256485 38184
17860 -69418 -3577 -358738 42034 111364 43616 -26787 266125 -98862 -221980 157562 -248053
17848 54716 -108362 -369127 -53524 137971 66572 103680 -144132 -191858 -70037 -27525 -108243
17837 -108243 232759 -201762 -67303 64498 -121188 35601 -398175 -96775 -101624 11035 131100
17826 131100 111265 79075 87610 -105549 -48518 -30929 -143988 88919 -21982 134813 -35195
17814 -79855 252559 27147 63868 -197281 173269 -260522 -354944 1216 -250588 -51530 -104885
17803a04885j66290F8538b6127j2597l1459E8576e1070A9247R861a5165j58050
17792a73215j715P1102l42955A12307J37870a87846H7179J52075A07957A5962
17781A13299d3762q7241j06648C7779a90729D4247L896g3949B36615b6712j9490
17770d6202H906c45613G3594A2696a38385q7718B97702n9978F9077a63020g9150
17758c2305A54007J10719G7805C8199K24790b41176h45B3271K35824b11551C0925
17746a2056A51755A279J45721E8019B0452b37794f0100n4476A99587c244n7533
17735f0777C64541j07914m1242a24680p7936i8994d7100C70495d21077i9468a1099
17723A24617J18489c78483a36132L8976b6592I5438b50939k0176i9559k5557d4479
$$ plain form
17803 -104885 -271175 68538 -26127 -38724 -70183 58576 -51070 19247 29108 -15165 -173215
17792 -173215 -174930 -103828 -446783 112307 250177 -187846 87179 239254 107957 15962
17781 113299 -43762 -131003 -237651 37779 -190729 44247 48143 -73949 236615 -26712 -46202
17770 -46202 8906 -345613 73594 12696 -138385 -226103 297702 237724 69077 -163020 -79150
17758 -32305 154007 264726 77805 38199 262989 -241176 -845 23271 259095 -211551 30925
17746 -12056 151755 1279 147000 58019 20452 -237794 -60100 -114576 199587 -3244 -60777
17735 -60777 364541 256627 215385 -124680 -202616 -98994 -47100 370495 -421077 -99468 -11099
17723 124617 243106 -378483 -136132 -97156 -26592 95438 -250939 -271115 -99559 -125116 -44479
17711b4268A2233i4617A89314l9312h4909p0774C8674c6942l76620C004J43328
17700A46332J44845E7263P1516c71187C57131a61803C72355d9965j44799A35393
17689E4539i8887A29445a06584K6044l17433a6409q1600A29988d1551B73604c19254
17677a67591q6479B4346L12451a40824B94009D2454b5488B36606G5265a35883
17666D5962L9968H853a51077p281a6291j92494C79242b07132A24790a68847b4489
17654F2181k08e3377C9414J48046I327a27218e1692C4435J16895J83183F9677
17642B05718b02816C34996A38057p354A1244K6816a85396A08606L9345J51016
17632B98967A30343b7153D5434a59966J1073B55637a21545A0124a44205d1332
$$ plain form
17711 -24268 12233 -94617 189314 150002 -84909 -155683 38674 -36942 -413562 3004 146332
17700 146332 291177 57263 128779 -371187 357131 -161803 372355 -49965 -194764 135393
17689 54539 -98887 129445 -106584 -80540 -397973 -16409 -98009 129988 -41551 273604 -319254
17677 -167591 -254070 24346 336797 -140824 294009 42454 -25488 236606 75265 -135883
17666 45962 85930 8853 -151077 -158358 -16291 -208785 379242 -207132 124790 -168847 -24489
17654 62181 61973 -53377 39414 187460 9327 -127218 -51692 34435 151330 334513 69677
17642 205718 -202816 334996 138057 130703 11244 38060 -185396 108606 147951 298967
17632 298967 130343 -27153 45434 -159966 -148893 255637 -121545 10124 -144205 -41332
17621A90221g4684I387O7773i0974A0369c0734C247J25816E1040J46422D2945
17609e5406I3262J76499I802c57780A6760J3704O9450J37018A4387a11475B93149
17597A84098b22893H9668b11361R2511A38148C264K4696a02702j43435G221a00120
17585c25971C13707I509a32603F3741d1488q7036C4782f9182B42872k2450a93476
17573e1055q236F9336j3099i2079B20442K3502j1436C5282l819a54311H3692Q8675
17561A72367o7811J09167a3218j97469A47496n4761b30435E956J96975l9765B3017
17549D7796c2008B12289k7588a2735j8198F2650D097K6559D407K6547R5890N5541
17537A82385K9485a65682B662J54867c3337A78861j0051A8547a06236F7292N1427
$$ plain form
17621 190221 -74684 9387 77160 -90974 10369 -30734 3247 129063 51040 197462 42945
17609 -55406 93262 269761 9802 -357780 16760 30464 99914 236932 14387 -111475 293149
17597 184098 -222893 89668 -211361 -118850 138148 3264 27960 -102702 -246137 7221 -100120
17585 -325971 313707 9509 -132603 63741 -41488 -128524 34782 -69182 242872 220422 -193476
17573 -51055 -59291 69336 56237 -92079 220442 243944 232508 35282 31463 -154311 83692 172367
17561 172367 104556 213723 -13218 -210687 147496 92735 -230435 5956 202931 163166 23017
17549 47796 -32008 212289 184701 -12735 -30933 62650 4097 30656 4407 30954 126844 182385
17537 182385 211870 -165682 2662 157529 -33337 178861 168810 18547 -106236 67292 118719
17526A18719J47851i4640B46791F8422A5234K11216m0650a58083E5794J06324
17516A62118O1276a10721C43389b407j25807C21895h169H7997g6740m0629A64437
17504B43508F9735b04475G6209e6491n9417I252a10984A41511a90159D68910D1834
17492h4913B6761e7268F9186R9533D5663e6263l5389B16988h4813A87891m7921
17481A39970m6339D483a0896A68002Q4757J4225p2613A8915K09233N1411j14106
17470A65453e5984A51622a46238A72786K73103A66429a60899P704K7424B41569
17459B42322c00365G3419M4763R9046p7589l8716Q4526J20365g6767A31273J14270
17448B45543J6756Q3192J51731A3693N30239j08930A79004J3972k9256J2189L35267
$$ plain form
17526 118719 266570 -94640 246791 68422 15234 226450 185800 -158083 55794 162118
17516 162118 223394 -110721 343389 -2407 -128214 321895 -8169 87997 -76740 -117369 164437
17504 243508 69735 -204475 76209 -56491 -115908 9252 -110984 141511 -190159 468910 41834
17492 -84913 26761 -57268 69186 168719 45663 -56263 -91652 216988 -84813 187891 139970
17481 139970 93631 4483 -10896 168002 252759 266984 194371 18915 228148 279559 165453
17470 165453 -55984 151622 -146238 172786 445889 166429 -160899 -153195 -125771 241569
17459 242322 -300365 73419 118182 217228 139639 100923 185449 305814 -76767 131273 245543
17448 245543 262299 345491 497222 13693 543932 435002 179004 192976 163720 175909 511176
17437E11176A76488o7970j2925J18357f0171A99289P4304o2689k4540F0382L88250
17426D48632o5334n7682a46475D11418E4111J05047C2766P1313M40856j74609
17416C70326I8966M00021I8045L56118I5144k9780k6641M81489A96392j6217m7238
17405A32937m2612P1057L17538a37076I4617J14780a4843j20405H8140f9788B03455
17393A93466M0145K411p8825a9563A86092B9255o164J74763N2588l1907Q1378
17382B99913B9651K13437m5473K3680A5350M39193a516p3178B32512b6469l5346
17371f1815B87b5623I5966m0610j3630K44344l3440J15423o0905A20337d7930
17359A39939a9952A77242L93779b7265C30394A50375K493o6559d9701B05444K6614
$$ plain form
17437 511176 176488 108518 95593 213950 -60171 199289 273593 210904 186364 60382 448632
17426 448632 383298 325616 -146475 411418 54111 159158 32766 104079 544935 370326
17416 370326 98966 498987 98045 454163 95144 65364 38723 520212 196392 180175 132937
17405 132937 90325 161382 478920 -137076 94617 209397 -14843 -135248 88140 -69788 203455
17393 193466 233611 236022 157197 -19563 186092 29255 23091 197854 250442 218535 299913
17382 299913 29651 243088 197615 221295 15350 454543 -1516 -74694 232512 -26469 -61815
17371 -61815 287 -25623 95966 55356 41726 286070 252630 368053 307148 120337 -47930
17359 139939 -19952 177242 571021 -27265 330394 150375 152868 86309 -49701 205444 232058
17348B32058E0636a0387A87312K1771k2717J75513H5596f6174C24969C4781K03897
17337B38678e9822A1708K22092F6447a73238g3154I6071k0488M2903K58361j80822
17326A96025h5961G1538p240J09011B0829J33870b16365A34740K89300D2350J53592
17315A95942a2403A6838J90850J13751D9877J46678r6961b2815j6622G606Q131
17304A5737E459K22789p6731k7485Q3754J3559a08360I6916k4599R9745G6574
17292C17159I8384L2187J49377J86855D1145N8808A8402J20957n723a5279d830
17280C22935p9400q5146c07B65624H8467M0406L68460j91365C7390O0248L1985
17269A29623j7688R615R6564A6129N5688R2776f9212B63485n5282K51185i792
$$ plain form
17348 232058 50636 -10387 187312 209083 186366 361879 85596 -66174 324969 34781 238678
17337 238678 -59822 11708 233800 66447 -173238 -73154 96071 75583 118486 376847 196025
17326 196025 -85961 71538 64298 173309 20829 154699 -216365 134740 424040 42350 195942
17315 195942 -12403 16838 207688 321439 49877 196555 99594 -22815 -39437 7606 15737
17304 15737 5459 228248 151517 124032 207786 221345 -108360 96916 72317 172062 76574
17292 317159 98384 130571 279948 466803 41145 99953 18402 139359 133636 -15279 -4830
17280 322935 243535 158389 -307 265624 88467 128873 497333 305968 37390 97638 129623
17269 129623 111935 121550 218114 16129 71817 164593 -69212 263485 208203 459388 -9792
17257A58675k9322N2914H1020B9437K08130a43952n2363E9655K0796L10002m1873
17246C48580K08698A00458P5769a30380B62525m1197J89941q8555F5443K83241
17236C48684a55368D7726J85273J0237k1611q8688J54860j00316f649l6086A68328
17224e6851B10866I9162D3112J80645F8277J36300a28196A68087R4684I3544L7740
17213A31284j427j5142E4280d7808E7029M5675D0961K22858A05237K4335J76419
17202C05991I6212L97390H4931a7116B06843l2712i5833B06711j6220J53613A02144
17190B77273J23607a71662B42183J70623b4229I5400J65725n2712L66931A57215
17179A2221Q0694a13741A86038r0790l0645J13262J74284B9662M97767k55547
$$ plain form
17257 158675 129353 182267 81020 29437 237567 -143952 -196315 59655 80451 390453 348580
17246 348580 557278 100458 176227 -130380 262525 221328 411269 322714 65443 348684
17236 348684 -155368 47726 232999 243236 221625 132937 287797 187481 -6649 -42735 168328
17224 -56851 210866 99162 43112 223757 68277 204577 -128196 168087 262771 93544 131284
17213 131284 129857 114715 54280 -47808 57029 102704 40961 263819 105237 129572 305991
17202 305991 96212 493602 84931 -17116 206843 174131 -95833 206711 190491 344104 102144
17190 277273 400880 -171662 242183 412806 -24229 95400 261125 208413 575344 157215
17179 12221 92915 -113741 186038 95248 64603 177865 352149 29662 527429 271882
17169B71882m7706J6400K3983K37475H5660J80864O2466j63063J23685J66461
17159D56073A85045p1293R6666n3816L30475A46449m4662L40684N332L1808k350
17148D77261A34844K72477j78018H9154R5005J31296O3782k3142N3204j98703
17138B10596A04953J6229K77646Q5393a6399B01879J81886C0520R0918O2096M7702
17127B31236A09695P1053K91394j88815J28390J95842B38666J13031J3433J00928
17117D66058o6156H6870K41261A3591L33556A45575m1474J16103N7177q5331M16776
17106F08826p973A49816K13915r4738K6895m6494j2010K02535j68562D2111M57930
17095E00041A95623K47085J84841j43251L7951O135o9508n4960J28928K8881J30602
$$ plain form
17169 271882 224176 240576 264559 502034 85660 266524 328990 165927 289612 456073
17159 456073 185045 113752 210418 156602 487077 146449 101787 442471 447803 479611 477261
17148 477261 134844 407321 229303 89154 184159 315455 379237 356095 409299 210596
17138 210596 104953 121182 398828 484221 -16399 201879 383765 30520 121438 183534 231236
17127 231236 109695 180748 472142 283327 411717 607559 238666 351697 365130 466058
17117 466058 399902 86870 328131 13591 347147 145575 104101 220204 277381 192050 608826
17106 608826 600853 149816 363731 268993 295888 249394 237384 439919 271357 42111 500041
17095 500041 195623 442708 627549 484298 522249 528384 458876 403916 532844 561725 692327
17084F92327B60695Q9733K14916J0571k60340J72591K5129r4069J75882k35594
17074C59514J81411q8489j14800J09274N5575j341M31048m12275p9220R2312k09290
17063C23719K17367j38520r7856J55273L22312l40885M4686L94637m28069N993
17053D58657r4233K07807J1549k10960J19905O7047K80428k62233k15455N04662
17043H67174k32290j81030j85170K16884j26792K55258J9134B86532L77641k59845
17033D04328L3955J21269l6276j83848K18259J63747O4121C71189R3988Q2801
17023E47978j0633J73287B73623N46956p2311R821q6010j72144K10311j86053
17013E24193J12967k29667K9148j08367M50977C19541L97122J56490l04256m7193
$$ plain form
17084 692327 260695 350428 565344 575915 315575 488166 513295 419226 595108 359514
17074 359514 540925 452436 337636 446910 502485 501144 932192 519917 440697 533009 323719
17063 323719 541086 402566 304710 459983 782295 441410 486096 880733 452664 458657
17053 458657 364424 572231 583780 372820 492725 559772 840200 577967 362512 867174
17043 867174 634884 453854 268684 485568 358776 614034 633168 286532 664173 404328
17033 404328 438283 559552 523276 339428 557687 721434 785555 371189 465177 547978
17023 547978 537345 710632 273623 820579 748268 758089 672079 499935 710246 524193
17013 524193 637160 407493 436641 328274 779251 319541 716663 873153 568897 521704
17003E21704K82023k71966J23027K142p2593q0202R1257J51436B14982O70220
16993H85202m29540L29630R6001l27295L18647k55018J52340J55980D48859M21673
16983H70532r0439J82679j23888j29723J91036N3224k25351L8435J73610j99653
16973G40462q4229K66977J27599R779l62290J31316M4857K3252P0789J02035l01515
16962G69032N59770j06622O4036n26611k26667L55765J76742K2985j74827L94500
16952A308103k56710l6545L5135J09839J63684k81995L64283k23593n1094j32471
16942I98636m6369K45116j8728L11423l66428J26315k59189J17743L08201l71062
16932A045658j96878J92770J51759K2331J40454J7167j39362k57780O06241j49912
$$ plain form
17003 521704 803727 531761 654788 656930 584337 504135 595392 746828 214982 885202
16993 885202 455662 785292 881293 553998 872645 617627 769967 925947 448859 870532
16983 870532 780093 962772 838884 709161 900197 953421 728070 766505 940115 740462
16973 740462 656233 923210 1050809 1060588 698298 829614 874471 897723 968512 1070547 769032
16962 769032 1328802 1222180 1286216 759605 532938 888703 1065445 1088430 913603 1308103
16952 1308103 1051393 1014848 1049983 1159822 1323506 1041511 1405794 1182201 1131107 998636
16942 998636 952267 1197383 1178655 1490078 1123650 1249965 990776 1108519 1416720 1045658
16932 1045658 848780 1041550 1193309 1215640 1356094 1373261 1233899 976119 1582360 1432448
16922A432448n88062O02792P0564p1410k40686J23602K12614k20734K40383k34342
16912A327169j70434K09087J29027M4470k3364j05183K00918N2451k6411K26589
16902A864319l45980L26860l96113L21204m9917K55796l87215l851L70748n0183
16892A905668j26258j25992M19245r5990R9354l0575K70047k05008l02139L68297
16882B176649k45467N23430k91310o2544L0465j95443L83746j77982J56164l6260
16872B261448J54958j80009M05981K09594o7431k25547j02362J77097K44716j54269
16862B724176j08396j88102J76826J42159m8564J99208k51684L79390j67936K76758
16852C133835J89711l08914J88458N7092J39457Q7850j38868K49084O5381J45920
$$ plain form
16922 1432448 844386 1447178 1517742 1446332 1205646 1329248 1541862 1321128 1561511 1327169
16912 1327169 1156735 1365822 1494849 1539319 1515955 1410772 1611690 1664141 1637730 1864319
16902 1864319 1518339 1845199 1449086 1770290 1720373 1976169 1588954 1585103 1955851 1905668
16892 1905668 1779410 1653418 2072663 1976673 2076027 2045452 2315499 2110491 1808352 2176649
16882 2176649 1931182 2454612 2163302 2100758 2131223 1935780 2319526 2141544 2297708 2261448
16872 2261448 2416406 2236397 2642378 2851972 2784541 2558994 2456632 2633729 2878445 2724176
16862 2724176 2615780 2427678 2604504 2746663 2698099 2897307 2645623 3025013 2857077 3133835
16852 3133835 3323546 3014632 3203090 3260182 3399639 3487489 3348621 3597705 3663086 3809006
16842C809006k52353M20379j31546j09390Q4114J41517P2876K87929j73835N0868
16832D199565Q8469o5340M22198j41047J07570J68489K55856j36019L9741j97192
16822D742290O12640J76865P2295j4458p970j4332M09160J98782j04842L09451
16812F379881l8583P3053K36059K44848K04418j85352L35371R1868k800M50003
16802G788766J43932J3191L78698N8362K02403J17944L39808L83965j13193K94876
16792I608752L25969L77025J92302J05831L72730O30345k93577L81514M99692
16783A2200583L01617N15366M27828N68355J86634L77109M30799O04458L24261
16774A5937010M26123O60699O03070L88232N53110Q99734N53945J053767K75159
$$ plain form
16842 3809006 3556653 3977032 3845486 3736096 3820210 3961727 4034603 4322532 4148697 4199565
16832 4199565 4288034 4222694 4644892 4503845 4611415 4779904 5035760 4899741 4939482 4742290
16822 4742290 5354930 5531795 5604090 5589632 5581662 5567330 5976490 6175272 6070430 6379881
16812 6379881 6341298 6414351 6650410 6895258 7099676 6914324 7249695 7341563 7338763 7788766
16802 7788766 7932698 7945889 8324587 8382949 8585352 8703296 9043104 9427069 9313876 9608752
16792 9608752 9934721 10311746 10504048 10609879 10982609 11612954 11319377 11700891 12200583
16783 12200583 12502200 13017566 13445394 14013749 14200383 14577492 15008291 15612749 15937010
16774 15937010 16363133 17023832 17626902 18015134 18568244 19467978 20021923 21075690 21350849
16765B1350849J088230P98739O69026J007791J214759Q41408J130138J066237
16757B9167177J615432J157601J408445J556064J149715J826746J659608J959027
16749D1499815J872984K454455K204608K420402K590642K539953L192202K494635
16741F1269696L791290L917030L569369L974282M241654M757283M683221N069721
16733I5273546N691811N556876N598232O458615O633261O364201O235385O398763
16725A44210690O333474N912006N599467N129039M575077L272355K326084J571077
16717A78929269O24499o96808j735001k833945l346778m410203m971080n903573
16709A55656380n985954o528149o248557o862444o712300o484634o125697n707542
$$ plain form
16765 21350849 22439079 23237818 23906844 24914635 26129394 26970802 28100940 29167177
16757 29167177 30782609 31940210 33348655 34904719 36054434 37881180 39540788 41499815
16749 41499815 43372799 45827254 48031862 50452264 53042906 55582859 58775061 61269696
16741 61269696 65060986 68978016 72547385 76521667 80763321 85520604 90203825 95273546
16733 95273546 100965357 106522233 112120465 118579080 125212341 131576542 137811927 144210690
16725 144210690 150544164 156456170 162055637 167184676 171759753 175032108 177358192 178929269
16717 178929269 179553768 178856960 177121959 174288014 170941236 166531033 161559953 155656380
16709 155656380 149670426 143142277 136893720 130031276 123318976 116834342 110708645 105001103
16701A05001103n551856n959667m853988m954223m646241m655130m063974l394088
16693F6921936l594305l620853l235516k750833k998658k141381k499794k504779
16685D3575817k177764k086297j655033j717094j344906j777470j339025j409578
16677C0068650j302290r38983j502679p51175j000435j057374q45307q95746j010808
16668B0763853m60647q37525m82895j267008k12588m82872r05418p02145k14897
16659A5197858l36382n92783m81920p9807p24454m41428l03535l25295o38893
16650A1273361N4596o42579j18465l45565k10471k39266n56940j85088J95292
16641I224875m49552l79925k27995J30577m82997m33360N1691N784l10961R3796
$$ plain form
16701 105001103 99449247 93489580 88635592 83681369 79035128 74379998 70316024 66921936
16693 66921936 63327631 59706778 56471262 53720429 50721771 48580390 46080596 43575817
16685 43575817 41398053 39311756 37656723 35939629 34594723 32817253 31478228 30068650
16677 30068650 28766360 27827377 26324698 25573523 24573088 23515714 22670407 21774661 20763853
16668 20763853 20303206 19465681 18982786 17715778 17503190 17020318 16114900 15412755 15197858
16659 15197858 14861476 14268693 13786773 13706966 12982512 12541084 12237549 11912254 11273361
16650 11273361 11327957 10685378 10566913 10221348 10010877 9771611 9214671 9029583 9224875
16641 9224875 8775323 8395398 8167403 8297980 7814983 7381623 7433314 7439098 7128137 7221933
16631G221933l77555p1900j69722m81924K82861k12139l45099M5009q6947j89882
16621E614635k39045k7823l2072l40988J79809k34787k77851K0157M121J03343
16611D769499j76383k41610o4299l10201L5323P3860k36856J04506j84649K35907
16601D005097l24186l22859J90232Q6505r3951l3808l49028M74717n15133K30457
16591C348043m26761j41892o5491K94818l1335r2317j5628j10677J97146k34692
16581B721214j96476L66060n4087k87204k71861J84494j55828K44975n4553k12197
16571B284537R226K941k22081P7655j32308J85249k50872K20640j6190n419J04253
16560B257631k00637J30456j83105Q8261n71406M33985j07184R3095K00421n57037
$$ plain form
16631 7221933 6844378 6772478 6602756 6120832 6403693 6191554 5846455 5891464 5804517 5614635
16621 5614635 5375590 5347767 5315695 4974707 5154516 4919729 4641878 4662035 4666156 4769499
16611 4769499 4593116 4351506 4287207 3977006 4012329 4086189 3849333 3953839 3769190 4005097
16601 4005097 3680911 3358052 3548284 3634789 3540838 3507030 3158002 3632719 3117586 3348043
16591 3348043 2921282 2779390 2713899 3008717 2977382 2885065 2869437 2758760 2955906 2721214
16581 2721214 2524738 2890798 2836711 2549507 2277646 2462140 2306312 2551287 2496734 2284537
16571 2284537 2293763 2296704 2074623 2152278 2019970 2205219 1954347 2174987 2158797 2153378 2257631
16560 2257631 2056994 2187450 2004345 2092606 1521200 1955185 1848001 1941096 2141517 1584480
16550A584480M13810k54512M00514m97695Q7903Q1088k10035j82956K2517N2299
16540A497413l8800j78104K18834j06524J21919j61525J7974O8206j9083J12357
16530A532667q4483j90074Q0025k0368M12k71987L76990m3806R5916l38231K50650
16519A387711l18711J1765M9462R7489l29558N31886k96956L17314n08294M72022
16509A414130o70058N99247j21109k91871k0289j60176L84168q5980J77542j9332
16499A206272n08457M27523n14063O8599n078L05898j10794J99789r7038m10078
16489E62573K93500L4959o805j78361K27944n930m00939K44645J80193j34149
16479H17630J83149j95274K03329k87322J85410J37805D82375K09181K79891k76037
$$ plain form
16550 1584480 1998290 1743778 2144292 1646597 1734500 1815588 1605553 1422597 1445114 1497413
16540 1497413 1458613 1280509 1499343 1392819 1514738 1353213 1371187 1439393 1420310 1532667
16530 1532667 1448184 1258110 1338135 1317767 1318179 1046192 1423182 1379376 1475292 1137061 1387711
16519 1387711 1069000 1080765 1130227 1227716 898158 1430044 1133088 1450402 942108 1414130
16509 1414130 744072 1343319 1222210 930339 910050 749874 1134042 1048062 1225604 1206272
16499 1206272 697815 1125338 611275 679874 674796 980694 869900 1069689 972651 562573
16489 562573 856073 891032 884227 705866 933810 927880 526941 771586 951779 817630
16479 817630 1000779 805505 1008834 721512 906922 1044727 482375 691556 971447 695410
16469F95410j1173J1363J31611l47627K67841k91417r0318N28007k21922J11483
16459G83258J53455j72773P1378j7056j70240R8003j85678J41791L0924p5500
16449F57562l06545M1310J70997l5155p1255J35282q1117K16822j45318R8447
16439F81030K3727C41828L0362K70839j5618l11645H7605J46808J81743P6710
16429D92866J45672k07291k2510N2334j4078J6860e9484D77581j67319K22708
16419E32970j54966r3924J08705j22790K04618m5657L5759k9343I9193M34335
16409E33528k19232L8025O5032K3782L7395j9614o0255n8357J89757J8210B62178
16397E33279k01752A42622L77591k18966K73154j31488A20177M72382B61009M1153
$$ plain form
16469 695410 684237 695600 827211 479584 747425 456008 365690 893697 671775 783258
16459 783258 936713 763940 835318 818262 648022 746025 560347 702138 733062 657562
16449 657562 351017 392327 563324 528169 456914 592196 511079 727901 582583 681030
16439 681030 704757 341828 372190 643029 627411 315766 87605 234413 416156 492866
16429 492866 638538 431247 408737 461071 446993 463853 -59484 477581 310262 532970
16419 532970 378004 284080 392785 269995 474613 428956 464715 435372 99193 533528
16409 533528 314296 352321 417353 441135 478530 458916 398661 340304 530061 548271 262178
16397 533279 331527 142622 520213 301247 574401 442913 120177 592559 261009 302162
16387C02162g1559C73122j70020E4154J94329J10983r8437p8793K37510d348E38402
16375A52907J04278D8101M51407B17791L39120B59383A00914N5988J28079J05438
16365C90419H0665E090J51517J446K91634j72091j4926j03757o2736Q5957Q121
16354A90255C7413L14221q4204N04889B41497A03242L02205A85702k6260l3126
16344A26316Q2776e1176m5194A42077R3262J22228A44931J23064A31078N2490
16334A83568L3454q5211O6906o2631J28730c2948E69715B47410K07066n2606j49218
16323B52652J91406k10610R460h0231A35269J43830k7476J99453M2821J7526B32409
16311D00922A53118K33011j82720K65036n6082D7859L22734G8770L17608o4871
$$ plain form
16387 302162 -71559 373122 203102 54154 248483 359466 261029 182236 419746 -4348 538402
16375 152907 257185 48101 499508 217791 556911 259383 100914 156902 284981 390419
16365 390419 80665 5090 156607 158053 449687 277596 262670 158913 96177 182134 190255
16354 190255 37413 351634 267430 772319 241497 103242 405447 185702 159442 126316
16344 126316 209092 -51176 -96370 142077 235339 357567 144931 267995 131078 183568
16334 183568 217022 131811 198717 136086 264816 -32948 569715 247410 454476 401870 252652
16323 252652 444058 233448 242908 -80231 135269 279099 251623 451076 493897 511423 232409
16311 400922 153118 386129 203409 468445 412363 47859 370593 78770 396378 331507
16301C31507F5208L943J63825a54558H8112f2459B138M36845A88666R6618j41686
16290A43598B7448K72346j12592f6457A42257J872a59391C1241L54933d4484B00723
16278B29484m1002P9583o1242r4459C2307p341J56641L5344J22071k0162o9155
16267B49705B2135J7933J48289e3779E8546J53497A3714L13323H2680a6231E7000
16255a25629F3494J64771q0551R9190A08698a21696B8196b2823o7949j09483i6546
16243D56821k0553A59196j0712a1541B74604a68888D30993A33062P268K76616
16233D16946b66635B93542b25403P1152A48762D4544J91344j07542K44302F002
16222a2473o5641E7185N7073a03444A30286b34013A30397J57362e9328l5220F6356
$$ plain form
16301 331507 65208 69151 232976 -154558 88112 -62459 2138 438983 188666 285284 143598
16290 143598 27448 299794 187202 -66457 142257 144129 -159391 31241 386174 -44484 200723
16278 229484 188482 268065 206823 112364 32307 24966 181607 216951 339022 318860 249705
16267 249705 22135 40068 188357 -53779 58546 212043 13714 327037 82680 -16231 57000
16255 -125629 63494 228265 147714 246904 108698 -121696 28196 -22823 -90772 -200255 -96546
16243 456821 436268 159196 148484 -11541 274604 -168888 430993 133062 140330 416946
16233 416946 -266635 293542 -225403 -154251 148762 44544 235888 128346 372648 6002
16222 -12473 -78114 57185 114258 -103444 130286 -234013 130397 287759 -59328 -94548 66356
16210D4205K6030L50470j74128a0400A64678a05615M3410a9627F5300r259Q848
16199F4889J68472l3170A6337J55050J8472h9939F7132J40276A4001h4548A24853
16187A84629H3581J61891a17718I4855k7033J9403J72202q0119a24133i217A46721
16175B19083j420k280J31087k2604D5499i8036A04512a40862I4806k4931J02689
16164A72564F4070b10074b1951j9703R458j47763B56803b42756P6656A40048a49273
16152D0589J38282B8511F375Q5426a24932N9754C55043i4058F0935K12488J27968
16141D01391A20088c031B83242a71518B67281i0840j860B20055c7832H6811K87944
16130C74755d4408k5776K3577n990A15335c2684j44527A01284P0674J62609D8460
$$ plain form
16210 44205 70235 420705 246577 -10400 164678 -105615 -62205 -19627 65300 56041 64889
16199 64889 233361 200191 16337 171387 189859 -89939 67132 207408 14001 -84548 124853
16187 184629 83581 245472 -117718 94855 67822 87225 259427 179308 -124133 -9217 146721
16175 219083 217663 215383 346470 323866 45499 -98036 104512 -140862 94806 69875 172564
16164 172564 64070 -210074 -21951 -41654 -32196 -179959 256803 -242756 -166100 140048 -149273
16152 40589 178871 28511 6375 91801 -124932 -65178 355043 -94058 60935 273423 401391
16141 401391 120088 -3031 283242 -171518 267281 -90840 -92700 220055 -37832 86811 374755
16130 374755 -44408 -70184 -46607 -52597 115335 -32684 -177211 101284 171958 334567 48460
16118a33097D0378a66750b7882B44543c92936Q2554h5949K5453j68632I7904b28192
16106B03279i9269A02325M5741c7233B24630o89A3991a27948F5415b20024F4670
16094A85803q69a20635A53552J32875g6227L7464p1410b6728L800K160r864m7171
16082g7803r9622C64007b31444A30276M1513B6334a46162F1367m58a48335f428
16070C40623e114j72751g5149D099J77699D1204b23028M0810A35641a66335N7176
16059a09159D22785A66774J04227e1600J0350j03907i341k5011I4993b84997h1928
16047H8303f59j36140c5817A27633K38953j77472p3643b16813O3716K0406p8207
16036b10898B01621D0889a1246I6552b36740a3140j77621g6848H8051b48462B754
$$ plain form
16118 -133097 40378 -166750 -27882 244543 -392936 -310382 -85949 -60496 -229128 97904 -228192
16106 203279 -99269 102325 148066 -37233 224630 223941 13991 -127948 65415 -220024 64670
16094 185803 184934 -120635 153552 286427 -76227 -38763 -110173 -26728 -22928 -20768 -30632 -77803
16082 -77803 -177425 364007 -231444 130276 171789 26334 -146162 61367 60909 -148335 -6428
16070 340623 -5114 -177865 -75149 4099 181798 41204 -223028 -182218 135641 -166335 -109159
16059 -109159 422785 166774 271001 -51600 -41250 -145157 -9341 -34352 94993 -284997 -81928
16047 88303 -659 -136799 -35817 127633 366586 189114 115471 -216813 -153097 -132691 -210898
16036 -210898 201621 40889 -11246 96552 -236740 -13140 -190761 -76848 88051 -248462 2754
16024b56435D18845b64965e7698d845A42119b36036B39832H0510a64543B29530
16013I7405f077j7398C2455a14307h709o5013j16621L8041D9101J44766h6386
16001c6484o914j02619A06358e9807J699B7177K35978b5071j32769C5984a25060
15989a57603o7821C86481A68897B7698K67071L8299J14361A03932K85143a58117
15978A98217L4809l5090a32297q248A89280g1620C00653q0387a64841j86512A91362
15966A1726O4044g4870A03948b05904E4881a04434B07750b09094H4976a2551k08989
15955b21540O2450R717j07286c976k01586N615j67913a13766n6240Q3251C4080
15943a09664C9211A111a09726R450B72446a03198G6447N0990g0742A28982N2655
$$ plain form
16024 -256435 418845 -264965 -57698 -4845 142119 -236036 239832 80510 -164543 229530
16013 97405 -6077 -23475 32455 -114307 -8709 -73722 -190343 -152302 49101 193867 -86386
16001 -36484 -43398 -146017 106358 -59807 -58108 27177 263155 -25071 -157840 35984 -125060
15989 -157603 -225424 386481 168897 27698 294769 333068 447429 103932 389075 -158117
15978 198217 233026 197936 -132297 -140545 189280 -71620 300653 220266 -164841 -351353 191362
15966 11726 75770 -74870 103948 -205904 54881 -104434 207750 -209094 84976 -12551 -221540
15955 -221540 -159090 -149373 -256659 -3976 -205562 -199947 -367860 -113766 -170006 -86755 34080
15943 -109664 39211 1111 -109726 -100276 272446 -103198 76447 127437 -70742 128982 181637
15932A81637d59975I7388M880a15437b6455G2638B9520b88104A12626g7737p2927
15921a50664m9387D2417e1723k71504D8752a88655B2399d2754C5714c7401B101
15909A77888b16859c8964p1179H6920J29763F4425e6727K6320F5216L4081h8995
15897c19716f0436j41844n9149A27669a62124A15490a74082H4692h4565B12272
15886i1367j58211D40998a85862G7968c2276j8241j19447A06941a84840A8063
15875a29750E9047B217a59652m7385a1105r964j10194i269F3863a59588j28379
15864b87967G4877a73152A74310b20581B2929a43573k9618B80245a49778l2408
15854a82186k08696C1735a03693j09098a1742A14985n4155L19727H5783K10562
$$ plain form
15932 181637 -459975 97388 102268 -115437 -26455 72638 29520 -288104 112626 -77737 -150664
15921 -150664 -200051 42417 -51723 -323227 48752 -188655 22399 -42754 35714 -37401 2101
15909 177888 -216859 -38964 -110143 86920 216683 64425 -56727 -30407 65216 99297 -88995
15897 -319716 -60436 -202280 -261429 127669 -162124 115490 -174082 84692 -84565 212272
15886 -91367 -249578 440998 -185862 77968 -32276 -50517 -169964 106941 -184840 18063
15875 -129750 59047 2217 -159652 -207037 -11105 -21069 -131263 -9269 63863 -159588 -287967
15864 -287967 74877 -173152 174310 -220581 22929 -143573 -173191 280245 -149778 -182186
15854 -182186 -390882 31735 -103693 -212791 -11742 114985 60830 380557 85783 296345
15844B96345f737l50781B04359f2297k02866B8202b60704B12274H2724a84786
15833b35902q6654a12738A32507c98928i316C6935J40668E2393J24569b81082
15822a66195j18405C04937E956a69451F5540b39809c8910I9130a5699M886j67449
15811a78262b6616k9958k15559l934b9486D1488a49804H0002J51648E6067N8252
15800A14319i8183J7540A76838h3840a0279r11E9059b48415J23018A21868n2918
15789F8950f9804A83822J02992A22104c486B82960p3458b82124B648K19810B8480
15777a9575q5806F1240J66114f9246k5017g015j96665k6673F6379J54363a55806
15765a53194O6065k23035H2416I531b6379A2413Q5706l0264a01541E7875K75708
$$ plain form
15844 296345 -6737 -357518 204359 -62297 -265163 28202 -260704 212274 82724 -184786
15833 -235902 -322556 -112738 132507 -398928 -9316 36935 177603 52393 176962 -281082
15822 -166195 -284600 304937 5956 -169451 65540 -239809 -38910 99130 -15699 -10813 -178262
15811 -178262 -26616 -56574 -272133 -276067 -29486 41488 -149804 80002 231650 56067 114319
15800 114319 -98183 -80643 176838 -83840 -10279 -11190 59059 -248415 -125397 121868 68950
15789 68950 -69804 183822 286814 122104 -3486 282960 209502 -282124 2648 222458 28480
15777 -19575 -105381 61240 227354 -69246 -94263 -7015 -203680 -230353 66379 220742 -155806
15765 -153194 -87129 -310164 82416 9531 -26379 12413 98119 67855 -101541 57875 333583
15754C33583g67A92430A2296J9511E082d5634j60346A51300n5410d8407A5790
15742C6451a14736k1189j18293k04580G1310M4735m144a31154J352n1964k6490
15731b08256B12917a10636j2182C1070K24828d6969C5219R7141P7344a72310j49667
15720c21977a11011a7480q6050J5602A39623q551m9209c7796k4623A26792c08696
15708a4720r9670A89468b58466a263H2838a75732J5015j4943Q1389A60983a84623
15696b27146i8404A63448l8928J48778b01202f0851B77281a1405A19387P8792
15686A98179b22715H2736p894j7622a51677C14075f7746A36669a63081N297B81282
15674H0908J24298c641g38C0493O5351J26681r0197L9047c40177a42711f6333
$$ plain form
15754 333583 -767 192430 12296 31807 5082 -45634 -205980 151300 95890 -48407 15790
15742 36451 -114736 -135925 -254218 -458798 71310 116045 111901 -131154 -129802 -181766 -208256
15731 -208256 212917 -110636 -122818 31070 255898 -46969 35219 132360 209704 -172310 -321977
15720 -321977 -111011 -17480 -103530 -87928 139623 131072 81863 -37796 -62419 126792 -308696
15708 -14720 -114390 189468 -258466 -1263 82838 -175732 -160717 -175660 -94271 160983 -184623
15696 -227146 -98404 163448 124520 273298 -201202 -60851 277281 -11405 119387 198179
15686 198179 -222715 82736 74842 57220 -151677 314075 -67746 136669 -163081 -157784 281282
15674 80908 205206 -3641 -738 30493 95844 222525 132328 171375 -340177 -142711 -66333
15662a93063j25363J13144A27974B392a97032G2308b28589E5666a61824O4244
15652i7580D1920a67064k75780h8207j64132Q8083I5191Q4506g8892E5779J07996
15641A63775a82172D2911J36591k8278j626m7482L2704J79178a64285B02701D4305
15629H8463a26896j4025f5313C11810d8516J34N030B58410b4368G3238a48009
15617b35178F2192a54551E7711L3805Q7479j9338C3575b70637k3428J29152G6708
15605G9929N6034q191d8819a441j00726K7023r6001O4063D1119h4302B52937d3898
15592A57240p1635j9912f0425f080j07657G9655A7717N064K06108a55795B26984
15580A26825a92982e0477j8870m8543A12788a12160o673l1294B2061a94458F7263
$$ plain form
15662 -193063 -318426 -205282 127974 2392 -197032 72308 -228589 55666 -161824 -97580
15652 -97580 41920 -167064 -442844 -88207 -252339 -164256 95191 179697 -78892 55779 163775
15641 163775 -182172 42911 179502 151224 149598 102116 134820 313998 -164285 202701 44305
15629 88463 -126896 -140921 -65313 311810 -48516 -48382 -43352 258410 -24368 73238 -148009
15617 -235178 62192 -154551 57711 91516 178995 159657 33575 -270637 -294065 -164913 76708
15605 79929 135963 127772 -48819 -1441 -102167 -75144 -171145 -107082 41119 -84302 252937 -43898
15592 157240 85605 65693 -60425 -6080 -113737 79655 17717 22781 228889 -155795 226984
15580 126825 -192982 -50477 -69347 -117890 112788 -112160 -118833 -150127 22061 -194458 67263
15568b26680j20649A48490b41995o8521a01988A58880N4404a79817Q248d3693
15557A19648k415M6896a23947m5480j20833E2147c46109B21104b80829a04236
15546A6870J17055n793l5708A956Q2866K9671c45945B3726a04786G6607J09294
15535A85901n8447g3220j0412C3341e325o848m4410r3316n2488j23797a24170
15523a20491k28857c5875a4951o2160K8413B93688H791i9506E2070A0868J0203
15512B1071d6858j71129L0384o6890A87033M6845I0951J82885b14177C19585g6774
15500a55845N9427L5490m3555A77993a56716o6817I5266a91435H7450a45662B7495
15488e6215G1110J04666D2374Q3585h4216B07761m4349A5175K8700a39388k1043
$$ plain form
15568 -226680 -347329 148490 -241995 -310516 -101988 158880 213284 -179817 -171569 -43693
15557 119648 117233 164129 -123947 -169427 -290260 52147 -346109 221104 -280829 -104236
15546 16870 133925 128132 92424 1956 84822 114493 -345945 23726 -104786 76607 185901
15535 185901 127454 -73220 -83632 33341 -5325 -12173 -56583 -149899 -202387 -326184 -124170
15523 -120491 -349348 -35875 -14951 -77111 -48698 293688 8791 -99506 52070 10868 21071
15512 21071 -46858 -217987 -187603 -254493 187033 233878 90951 273836 -214177 319585 -76774
15500 -155845 -96418 -60928 -104483 177993 -156716 -223533 95266 -191435 87450 -145662 27495
15488 -56215 71110 175776 42374 125959 -84216 207761 163412 15175 43875 -139388 -160431
15477a60431g6381A61425P6802K5717A29404N564M4004b26493B63452c3823A04892
15465A97191e6132C29310b42537Q6670c8589J0023A18618C1442L38168H680K7022
15454C5702a02187k93712a95433d5683J3763k11707D2601K2826j251b48092E5544
15442A46691a14418G1004B9635N3685b29098M9817c8421m2562G1114j6025J54624
15431B09713p0695n2032C9105a32559G4795e0598q6550C2656J68729A8320J86114
15420B04434K427j01496A4800K1623j7965i8075j81294D3622J46476R9601h3931
15408B96723p8819e3804A31216b23556b2770C115M1206j4883a00534J1178A65019
15396E9898j6726c9559I0265j8224m805a8517A03158l9033J88237q6414O3956
$$ plain form
15477 -160431 -76381 161425 238227 263944 129404 134968 178972 -226493 263452 -33823 104892
15465 197191 -56132 329310 -242537 -155867 -38589 -28566 118618 31442 369610 8680 35702
15454 35702 -102187 -395899 -195433 -45683 -31920 -243627 42601 65427 64176 -248092 55544
15442 146691 -114418 71004 29635 83320 -229098 -179281 -38421 -80983 71114 55089 209713
15431 209713 139018 86986 39105 -132559 74795 -50598 -137148 32656 201385 18320 204434
15420 204434 206861 105365 14800 36423 18458 -98075 -279369 43622 190098 289699 -83931
15408 296723 217904 -53804 131216 -223556 -22770 3115 44321 29438 -100534 -89356 165019
15396 59898 43172 -39559 90265 72041 67236 -18517 103158 64125 252362 165948 229904
15385B29904c6572H1978k2685d8451I1980K4791C2147d5607C0096O1968N8310
15374A50374f3778o1297A22247a43239D7410i2197k2338d2008k45620a16423E6931
15362C12561a09274I1083K26711F2628J02164K1628C468L4891g3809I5413g8314
15350d09598I2212b00151g425F2533j2443K49160g1690l06458O6385e4949m9004
15339a03953A73240g7897C3001c589m6651D3980c60141B27555a53779r3906J18694
15328a28991A18025D2490a67997M9972j55911C6427a43315A4857R1092k152l9238
15317F4559a58971K7658j93224a28929j50928a33019I7983J1289l2641J19410
15307A96041b06669C25887d0254I0919J62829H1732a59879B56705b2968I0007
$$ plain form
15385 229904 -36572 81978 59293 -48451 91980 116771 32147 -45607 30096 92064 150374
15374 150374 -63778 -125075 122247 -143239 47410 -92197 -114535 -42008 -287628 -116423 56931
15362 312561 -109274 91083 317794 62628 164792 186420 3468 38359 -73809 95413 -78314
15350 -409598 92212 -200151 -7425 62533 50090 299250 -71690 -378148 -311763 -54949 -103953
15339 -103953 173240 -77897 33001 -3589 -50240 43980 -360141 227555 -153779 -247685 -128991
15328 -128991 118025 42490 -167997 -118025 -273936 36427 -143315 14857 105949 103797 64559
15317 64559 -158971 -131313 -324537 -128929 -279857 -133019 97983 109272 76631 196041
15307 196041 -206669 325887 -40254 90919 253748 81732 -159879 256705 -22968 90007
15296c8135j71109A37535a5544B27406r4373h9806C96826f0346p0942K0646e0386
15284G1433R5397b01987A78655F0048i8109L0214A94147J240h4385l8130A23078
15272f3865l28698b8871A02270a61519A84679b8094A71989E419b64772D4850i9384
15260A14963f404D8138J39875b89535a21275A36602J45706i907o6678A49492R0870
15249B40362J33040J021980k57482j93946N56140E86460B30938o3035E7215R2789
15239A50004Q6724a5231C4683J02726D0957K24500b45670C80882A20625a40862
15228A8417Q3842h0527K1701B06889m905A3785J41223o100J90789b2283A14553
15216B24916b18914A26429c4330B61965F722M25709b18312o9149C15800A55439
$$ plain form
15296 -38135 -209244 137535 -15544 227406 133033 -89806 396826 -60346 -131288 -110642 -50386
15284 71433 166830 -201987 178655 60048 -98109 -67895 194147 195387 -84385 -122515 123078
15272 -63865 -392563 -28871 102270 -161519 184679 -28094 171989 5419 -264772 44850 -99384
15260 114963 -6404 48138 188013 -289535 -121275 136602 282308 -9907 -76585 149492 240362
15249 240362 373402 1395382 1137900 943954 1500094 586460 230938 167903 57215 150004
15239 150004 236728 -15231 34683 137409 40957 265457 -245670 380882 120625 -140862
15228 18417 102259 -80527 -58826 206889 201984 13785 155008 148908 339697 -22283 114553
15216 224916 -218914 126429 -34330 261965 6722 432431 -218312 -287461 315800 155439
15205D9704J50500a41891j09612B13183e8270G3645J11814D0900J61893a8359
15194a2955C14448h0563a1161A45731d355B47747L9510j40208J79223D6418h8474
15182B46990B6833J99136g0622A33495a2760E9297c01233C71855a93900P5437
15172a18463F2161L2752c88064e5579r8889F0206L01600c9320B08056q6032e1224
15160B11505E2471i7890A11805J5272a73247A94684b07032C19689B7398J76241
15150B03639R9681C5064O8675A4298K1693K70702b9768B9866a16198F2107e88
15138A3577g2665a8221A02221l0984K29719j16813G51J47314J5007c78899A9474
15126D1219i2446A63263D412L59011c49543A78531a6844B90466g582j6581q450
$$ plain form
15205 49704 200204 -141891 -251503 213183 -58270 73645 185459 40900 202793 -18359
15194 -12955 314448 -80563 -11161 145731 -4355 247747 287257 147049 326272 46418 -88474
15182 246990 26833 225969 -70622 133495 -12760 59297 -301233 371855 -193900 -118463
15172 -118463 62161 94913 -388064 -55579 -154468 60206 361806 -39320 208056 122024 -51224
15160 211505 52471 -97890 111805 127077 -173247 194684 -207032 319689 27398 203639
15150 203639 303320 35064 103739 14298 35991 306693 -29768 29866 -116198 62107 -588
15138 13577 -72665 -18221 102221 71237 300956 184143 751 148065 163072 -378899 19474
15126 41219 -92446 163263 4412 363423 -349543 178531 -16844 290466 -7582 -24163 -32613
15115c2613G7370b1223j13940A84782R0657c04746A24984N5880O6981K05993B1811
15103a10694J1084B72082a10403B09321J58943a3892I592J55341Q0179l3694j2251
15092A99167a78953A47585A379J0952O6112b10775C06609k1577i6975A28964b39833
15080A40780M6264D596J59417L1057M6311J48780h6010A86789B6351M43458e3099
15068a58608A88899m3915b40251B91141a31288B43173A9832c3111J1692j49736
15058a71155B06367M17535F1597J8703j6575Q9410l4880j4480K74381j07256o7049
15047B03851J07384a99571B3637K01118j11790K35664A31187P902J68024b9232
15036D9984a79969A74143J55796A45540E5652a66934B92505D0886L863H102M1721
$$ plain form
15115 -32613 77370 -21223 -135163 184782 275439 -304746 124984 180864 247845 453838 21811
15103 -110694 -99610 272082 -110403 209321 368264 -13892 9592 164933 245112 211418 199167
15092 199167 -178953 147585 1379 12331 78443 -210775 306609 285032 -96975 128964 -239833
15080 140780 187044 4596 164013 195070 241381 390161 -86010 186789 26351 469809 -53099
15068 -158608 188899 144984 -240251 291141 -131288 243173 19832 -33111 -21419 -171155
15058 -171155 206367 623902 61597 80300 63725 153135 118255 103775 378156 270900 203851
15047 203851 311235 -199571 23637 224755 112965 348629 131187 139089 307113 -29232
15036 49984 -179969 174143 329939 145540 55652 -166934 292505 40886 44749 8102 49823
15025D9823Q7895L39496A02804K35033j57126B7234J29648e8545A04606e7463
15014F7453d7988B49959j00446K02195e973D13692I0473K28280F2889L35007J51056
15003E48952C9556K74336n447a23317B91497j35408D5024B503d2602A68078J59204
14992C27282o5125e3910A46548L28422f2051C05146K16810B26949d572A19110
14981a50606A11899K52314p6311O6132k5379I3802Q2584J56982j48264H8506O5921
14970A54427J40088a70545D57097j64959j36328H155L74437D9667k4193J09837
14960A35311L10300B4597L64141j68490m0454J07199K02396j88407k5804A15369
14949A06428M5126o84d7372E96023B95293P1463j63990a29430A00928J62424A25708
$$ plain form
15025 49823 137718 477214 102804 337837 180711 27234 156882 -58545 104606 -57463
15014 67453 -47988 249959 149513 351708 -5973 413692 90473 318753 62889 397896 548952
15003 548952 39556 313892 308445 -123317 291497 156089 45024 2503 -42602 168078 327282
14992 327282 262157 -53910 146548 474970 -62051 305146 521956 226949 -4572 119110
14981 -150606 111899 364213 287902 354034 328655 93802 176386 333368 185104 88506 154427
14970 154427 294515 -170545 457097 292138 155810 8155 382592 49667 25474 135311
14960 135311 445611 24597 388738 220248 179794 286993 489389 300982 275178 115369
14949 106428 151554 150870 -47372 596023 295293 366756 202766 -129430 100928 263352 125708
14937A14944M01977F3661J99839N8780J00191A3124J00899j9196A3462K91635
14927C05097N3438I8555J9607J96153j2728j15424L64886A34393J16866r033f0769
14915B09309o242J78972n8414K6613A06251J29503J68147q1892K6965J88416k565
14904E34825H8194j2189K47154b2916C17039a84649I9619g0869B80241R2703A17580
14892E30523A34097n5450L8732J43068B6297L20615M8175j16692F5200N61433
14882F26633f8320D94743n2858j9172c0374B91261e1164B32881A07420O4644J0858
14871A82922l0152L75761j98168G0606K72276r7719L48639B17143p1798P6523
14861B21868J04134A21555M01573O3203j02298A38655J56874L4616J3198J80019
$$ plain form
14937 114944 516921 63661 263500 322280 422471 13124 114023 94827 13462 305097
14927 305097 358535 98555 118162 314315 301587 186163 551049 134393 251259 242226 -60769
14915 209309 203067 382039 323625 350238 106251 235754 403901 322009 348974 537390 534825
14904 534825 88194 76005 323159 -22916 317039 -184649 99619 -70869 280241 372944 117580
14892 530523 134097 78647 117379 260447 26297 346912 395087 278395 65200 626633
14882 626633 -68320 494743 441885 422713 -30374 291261 -51164 232881 107420 172064 182922
14871 182922 152770 528531 330363 70606 342882 245163 593802 217143 145345 221868
14861 221868 326002 121555 523128 586331 484033 138655 295529 330145 343343 523362
14851E23362B39727n5846J02106K2138k3766j0872A05357L52392A45175O5589
14841B10764K22970j73208R3989J70223k39518J53619K57616C13652L52696k45206
14831D21142r6269J24053j50580L93204B39567K10798q4025K39585k06652k7681
14821C71592K1105j4778l6415k9466L33434k67906J34409J97762l53683L83970
14811G40024C28389N5934K66412p1798k59800K37969k48491K34074O3980B05493
14800F63003N604j86262L2095J28939k7139k92548M97188C56769N0124k6728R4873
14789D75038L24749B75702L34824j13942j55593K03715n7915j07185J75435j96788
14779C58253I17O02932A04485L3297M56552k4406B63759K57575J98367k15509
$$ plain form
14851 523362 239727 183881 285987 308125 284359 273487 105357 457749 145175 210764
14841 210764 433734 260526 354515 524738 285220 438839 696455 313652 666348 421142
14831 421142 324873 448926 298346 691550 239567 450365 366340 605925 399273 371592
14821 371592 392697 377919 341504 312038 645472 377566 511975 709737 356054 740024
14811 740024 328389 384323 650735 578937 319137 557106 308615 542689 606669 205493
14800 663003 668607 482345 514440 643379 616240 323692 820880 356769 406893 380165 475038
14789 475038 799787 275702 610526 496584 340991 544706 486791 379606 555041 358253
14779 358253 917 603849 104485 137782 594334 569928 263759 521334 719701 504192
14769E04192A52577N65407B82428M06120J00879k96831n735J81770k62688L28919
14759G34862j78310J24473J75795k53574J0091j42156p6210J06752j46594J62387
14749E17516j09062N0317J83003k73562Q5313L62168k61846o8100J38957j14903
14739E09801P8410J65456K7620K3734l2196l20389K08647j27993M08051j38885
14729H02256j10784k68009M34867o9941j76381J82584j35526j62450J64349K75155
14719I36120j59333j34257J73141Q6341p4275j99707J77956j87256j02903r646
14709E06181J8359K47853K94040J31588l34158J94754J36893l39457k05462j537
14699F49054p9234J89631J11091L18379k19971k32396K85j9987j0847Q4223C74315
$$ plain form
14769 504192 152577 717984 282428 688548 789427 492596 486861 668631 405943 734862
14759 734862 556552 681025 856820 603246 613337 471181 394971 501723 355129 517516
14749 517516 408454 458771 641774 368212 453525 815693 553847 485747 624704 509801
14739 509801 588211 753667 781287 805021 772825 452436 661083 533090 941141 802256
14729 802256 691472 423463 858330 788389 612008 794592 659066 496616 660965 936120
14719 936120 776787 642530 815671 902012 827737 628030 805986 618730 515827 506181
14709 506181 524540 772393 1066433 1198021 863863 1058617 1195510 856053 650591 649054
14699 649054 569820 759451 870542 1188921 968950 736554 736839 716852 706005 790228 374315
14687A078983m37027K44750k1288Q781N9209m8954l85155M2495L90440L57799
14677A290033n64100q1826J49233J41443l39774L47264J90560j05236j22465k33407
14667F71725K15575j49384k281L76199m58200N02596m18481L30060j82109R5448
14657I81148L645j82613J15126K90818j13526n8385J19116k7260j00086J67829
14647A195812J26744j20702l75487J54167J71432q3260j33604K27600l10848L07302
14637A159156J6364j58974j75698K89510j27184K77790j47453j34233j29734L50083
14627A219627K95397k94783p4483j53098J59058L84180k83012K6172J87389j53017
14617A313430J00520n6082j31614J11583Q2223k03798P2689j51237k06783L45813
$$ plain form
14687 1078983 641956 886706 865418 874199 933408 884454 499299 541794 932234 1290033
14677 1290033 725933 644107 793340 934783 595009 942273 1132833 1027597 905132 671725
14667 671725 887300 737916 735635 1111834 653634 1156230 737749 1067809 885700 981148
14657 981148 984793 802180 917306 1208124 1094598 1036213 1155329 1128069 1027983 1195812
14647 1195812 1322556 1201854 826367 980534 1151966 1068706 935102 1162702 851854 1159156
14637 1159156 1175520 1016546 840848 1130358 1003174 1280964 1133511 999278 869544 1219627
14627 1219627 1515024 1220241 1145758 992660 1151718 1535898 1252886 1279058 1466447 1313430
14617 1313430 1413950 1357868 1226254 1337837 1420060 1216262 1288951 1137714 930931 1276744
14607A276744n7629K71630O6396n6484L6680N36392o27366L26409n715m87539
14597A279518K05816K62773k71489J15249l27044L74392J3098j28892j20697n9084
14587A343640K64500k7750J59611p8733J68504k08715K15935N9777k81317K56860
14577A872312P0782J8769K22495l58611n3697M09584k85581L76917k86038J39274
14567B126206K57107j40228j6666J58437J4692J61413l60273L69842O0924K98111
14557B929565n45061N46282R2615K43496J27021N08975L49996N46181K004882
14548F803952L606778P763480J9278118Q203653B2108169A0379606m551360k026524
14540C801722r63355l57747m61698L7093J79723l62476K19836j61549M4092J00722
$$ plain form
14607 1276744 1219115 1490745 1557141 1500657 1537337 2073729 1446363 1772772 1767057 1279518
14597 1279518 1485334 1748107 1476618 1591867 1264823 1639215 1652313 1523421 1402724 1343640
14587 1343640 1608140 1580390 1740001 1661268 1829772 1621057 1836992 1896769 1615452 1872312
14577 1872312 1943094 1961863 2184358 1825747 1772050 2181634 1896053 2272970 1986932 2126206
14567 2126206 2383313 2243085 2226419 2384856 2399548 2560961 2200688 2570530 2631454 2929565
14557 2929565 2384504 2930786 3023401 3266897 3393918 3902893 4252889 4799070 6803952
14548 6803952 10410730 18174210 37452328 45655981 22108169 10379606 5828246 3801722
14540 3801722 2838367 2480620 2018922 2056015 2235738 1873262 2093098 1931549 1975641 2076363
14530B076363j04768M34513o07888J97638J0452N0521K44775K09204k03508n7899
14520B249403K98739l29823J84163K23515l41120K03180L64565n26998K13893
14511B539517o563L37820K01669l66989R6190L0835M4564J95372J69958l05143
14501B937230K38247m85469K70248J95283J70715k76741L12847l79210J61227
14492C144377l0016L5790k36495P29229m4393J81198m54067K90610l25783L95267
14482C685717j22958j71853M30361k23750L67109l97023L25277J41206j03376
14473C930710j69923N4825K44021M7503J14514K26792j35398k05345P4677K94480
14463D476856R1174l21431M96699j71840K37092j18291k5772r0184P7461M59056
$$ plain form
14530 2076363 1971595 2406108 1798220 1995858 2006310 2056831 2301606 2510810 2307302 2249403
14520 2249403 2548142 2218319 2402482 2625997 2284877 2488057 2852622 2325624 2539517
14511 2539517 2532954 2870774 3072443 2705454 2801644 2832479 2877043 3072415 3242373 2937230
14501 2937230 3175477 2690008 2960256 3155539 3326254 3049513 3362360 2983150 3144377
14492 3144377 3114361 3150151 2913656 3642885 3598492 3779690 3325623 3616233 3290450 3685717
14482 3685717 3562759 3390906 3821267 3597517 3964626 3567603 3892880 4034086 3930710
14473 3930710 3760787 3815612 4059633 4107136 4221650 4448442 4313044 4107699 4182376 4476856
14463 4476856 4568030 4246599 4743298 4571458 4808550 4690259 4664487 4574303 4651764 5110820
14453E110820j03047K77567o05150K86497M38253n6230k20228J39835k44598N65359
14443E589078L7343k11261M82742K98639k42132m0974Q6231j38002O61529j26437
14433F396756j17859J5714K39786R3062J10486J78139K73022k63670j44947K36345
14423G016834j35346L26830L35441j58896J88092j18488N11171M3433J76837r3667
14413H092241L43167m12440O56751Q5218k73043K17728K83982J13665K59355k0988
14403I345636J30858N24878j5486K0491N67302L07360j13082k14824N70749Q4578
14393A1208460J74615O3710L22918M90374l23386K54038N10629L34810q6215N01721
14383A3451674l0185O01062K10079L840N09037j90627M57391Q72367L6381K56951
$$ plain form
14453 5110820 5007773 5285340 4680190 4966687 5404940 5348710 5128482 5268317 5023719 5589078
14443 5589078 5626421 5415160 5897902 6196541 5954409 5913435 5999666 5861664 6523193 6396756
14433 6396756 6278897 6294611 6534397 6627459 6737945 6916084 7189106 6925436 6780489 7016834
14423 7016834 6881488 7208318 7543759 7384863 7572955 7454467 7965638 8009071 8185908 8092241
14413 8092241 8435408 8022968 8679719 8764937 8491894 8709622 8993604 9107269 9366624 9345636
14403 9345636 9476494 10001372 9985886 10006377 10573679 10881039 10767957 10553133 11123882 11208460
14393 11208460 11383075 11446785 11769703 12260077 11936691 12190729 12701358 13036168 12949953 13451674
14383 13451674 13421489 14022551 14232630 14236470 14745507 14554880 15012271 15884638 15921019 16177970
14373A6177970R341O14149J5926Q12488R1440M11300N16386j11502M90274O24767
14363A9652539M27867P00302M54848L98233K58730L83391O13745L11895R01075
14354B4102625N15665O84445K70755P55487N18048R09520P03961M53878R25055
14345B9839439R84543L35836J220950O47397R82919Q08827J003120J183664P56252
14336C7762947J193617J137298J007881J398264J251555J575227J266456J623391
14328D8216636J842044J332188J512428K113851J849141J929610J908226K127110
14320F2831234K458440K384394K358559K633479L078865K832410K973549L111170
14312H4662100L560364L787913L734614M239147L861055M967768M941498N107124
$$ plain form
14373 16177970 16187311 16801460 16817386 17629874 17721314 18132614 18649000 18537498 19027772 19652539
14363 19652539 20080406 20780708 21235556 21633789 21892519 22275910 22889655 23201550 24102625
14354 24102625 24618290 25302735 25573490 26328977 26847025 27756545 28460506 28914384 29839439
14345 29839439 30823982 31159818 32380768 33028165 34011084 34819911 35823031 37006695 37762947
14336 37762947 38956564 40093862 41101743 42500007 43751562 45326789 46593245 48216636
14328 48216636 50058680 51390868 52903296 55017147 56866288 58795898 60704124 62831234
14320 62831234 65289674 67674068 70032627 72666106 75744971 78577381 81550930 84662100
14312 84662100 88222464 92010377 95744991 99984138 103845193 108812961 113754459 118861583
14304A18861583N168764N986022N841907O842988O532407P390601P138201Q731031
14296A72493504Q523412R168759R854701J0000617J0921180J1543597J1654736
14289B44160506J2677866J2941373J3470036J4265327J4017207J5132554J4547636
14282C41212505J4681160J5193986J4215380J4115149J3239742J2257437J0532294
14275D35447653R198439O942762L437189P6218j028791j102476m078820p220626
14267D41671548q126225q739219q623101j0119729j2368303j3745291j4125964
14260C65823716j4620866j5722337j5567337j5559531j4878264j3653511j3473165
14253B62348705j3259243j2532611j1669126j1538741j0653793j0214918r093414
$$ plain form
14304 118861583 124030347 130016369 135858276 142701264 149233671 156624272 163762473 172493504
14296 172493504 181016916 190185675 200040376 210040993 220962173 232505770 244160506
14289 244160506 256838372 269779745 283249781 297515108 311532315 326664869 341212505
14282 341212505 355893665 371087651 385303031 399418180 412657922 424915359 435447653
14275 435447653 444646092 451588854 455026043 455102261 454073470 452970994 448892174 441671548
14267 441671548 433545323 424806104 416183003 406063274 393694971 379949680 365823716
14260 365823716 351202850 335480513 319913176 304353645 289475381 275821870 262348705
14253 262348705 249089462 236556851 224887725 213348984 202695191 192480273 183386859
14246A83386859r541983p878601p860025p534022p154269o653081o593032n411291
14238A24760555n304814n120631n072142m837323m543316m020262l497068l556029
14230H8808970l626605l384027l057396l152661k799699k558922k334094k624857
14222F5270709j999925k192806k176111j771935k045192j770225j710966j730219
14214D9873330j216300j570094j525030j450858j183445j371123j147344j011950
14206C9397186m12156j689086j184296o76268j203216n84821j069884m14276j142310
14197C1020873o66545q38656q02169q56716l61676r82517o73589o41308m85045
14188B4712652m55591p14224o46912l60387l76250p89681j63737p31530J64502
$$ plain form
14246 183386859 173844876 165966275 158106250 150572228 143417959 136764878 130171846 124760555
14238 124760555 119455741 114335110 109262968 104425645 99882329 95862067 92364999 88808970
14230 88808970 85182365 81798338 78740942 75588281 72788582 70229660 67895566 65270709
14222 65270709 63270784 61077978 58901867 57129932 55084740 53314515 51603549 49873330
14214 49873330 48657030 47086936 45561906 44111048 42927603 41556480 40409136 39397186
14206 39397186 38985030 37295944 36111648 35435380 34232164 33647343 32577459 32163183 31020873
14197 31020873 30354328 29515672 28713503 27856787 27495111 26512594 25839005 25197697 24712652
14188 24712652 24257061 23542837 22895925 22535538 22159288 21369607 21205870 20474340 20638842
14179B0638842r18328l13598k65996n51138k88823k24425m87071l16794l52386
14170A6920283k13728m35202l65211j58861o12549J69548o86430J27500l92552
14161A4352798n66282P9707l46846r1391k52248n3382k93558k23384o27128J31526
14151A2109812l99720l4529j50380j57799l15190N5024k99367k59018j21238k0727
14141A0406868n91265K81710j25117r8625j37696n4801r9764k58674j99847o3249
14131I059540L3565l75192P099j55521N7413m45931L0110n05235K16910N7790
14121G980548n71302L81486l16936J3881j31727k75195j14536Q5579j20185m05555
14111F526058J49997j33406j03366L4122J44111n9066j21676k2295m65131K18118
$$ plain form
14179 20638842 19720514 19406916 19140920 18589782 18300959 18076534 17589463 17272669 16920283
14170 16920283 16706555 16271353 15906142 15747281 15134732 15304280 14617850 14745350 14352798
14161 14352798 13786516 13866223 13519377 13427986 13175738 13122356 12828798 12605414 11978286 12109812
14151 12109812 11710092 11675563 11525183 11367384 11052194 11107218 10807851 10548833 10427595 10406868
14141 10406868 9815603 10097313 9972196 9873571 9735875 9681074 9581310 9322636 9122789 9059540
14131 9059540 9093105 8717913 8725012 8569491 8626904 8180973 8211083 7705848 7922758 7980548
14121 7980548 7409246 7790732 7473796 7487677 7355950 7080755 6966219 7051798 6931613 6526058
14111 6526058 6676055 6542649 6439283 6473405 6617516 6558450 6436774 6414479 5949348 6167466
14101F167466r3582K2087r2675l15832J25657J94746m02371L14100o43446N2052
14091E328202P0098j76836j80044J30392j99655J31998R0337k68626j36440K83644
14081E073070m14879n7138O326O2651m2174k54504m3517K81816l85755J63205
14071D389101l39738J93473K87029l49919K54003m47270M54910j84982j83912
14062D072695o9369l51675J33917J82253m3671J19110j26077k50419n9388K83562
14052C890938p6125l52847j60784M01555n72639K09219L03092l84715n3999J59253
14042C362948M9230R2125l10620k83098N45298n63658N8409M0062j6990K93882
14032C267588m65576K88423m05013M91583j98410n5780j88934n4264r1296K63415
$$ plain form
14101 6167466 6073884 6095971 6003296 5687464 5813121 6007867 5605496 5919596 5276150 5328202
14091 5328202 5398300 5221464 5041420 5171812 4972157 5104155 5194492 4925866 4789426 5073070
14081 5073070 4658191 4601053 4607379 4670030 4627856 4373352 4329835 4611651 4225896 4389101
14071 4389101 4049363 4242836 4529865 4179946 4433949 3986679 4441589 4256607 4072695
14062 4072695 4003326 3651651 3785568 3967821 3924150 4043260 3917183 3666764 3607376 3890938
14052 3890938 3814813 3461966 3301182 3702737 3130098 3339317 3642409 3257694 3203695 3362948
14042 3362948 3412178 3504303 3193683 2910585 3455883 2892225 2950634 2990696 2973706 3267588
14032 3267588 2802012 3090435 2685422 3177005 2978595 2922815 2733881 2679617 2588321 2851736
14022B851736r3888n94879N83901m20282K74192J12547q3889j35623j66073L9545
14012B367287P9088o4373j8976J53606k21849q5580L4588R2841l89114K49345
14002B196863J62014p1267q6801p7681j23308L40605k74297j60667j40900J27020
13992A891581L46008R6836J60690R56283J929023O020476J6800787J8446613k1576759
13983B5071538j1075746m906177k518393j340580q23539p50498K29898q61615
13975C024888L09199r61512J21060J45224j85277R3203j2238O6839m6116p4961
13965B480309l58232q6276L01086q9043j70033k3422M11498l57132o7543j08081
13955A933131J20474j58402J55597k0904K26773k13700j36782J19591P410l16361
$$ plain form
14022 2851736 2757848 2162969 2746870 2326588 2600780 2713327 2629438 2493815 2327742 2367287
14012 2367287 2446375 2382002 2363026 2516632 2294783 2209203 2243791 2336632 1947518 2196863
14002 2196863 2358877 2287610 2200809 2123128 1999820 2340425 2066128 1905461 1764561 1891581
13992 1891581 2237589 2334425 2495115 3451398 5380421 11400897 28201684 46648297 25071538
13983 25071538 13995792 9089615 6571222 5230642 4407103 3656605 3886503 3024888
13975 3024888 3334087 2372575 2493635 2638859 2453582 2546785 2534547 2601386 2555270 2480309
13965 2480309 2122077 2035801 2336887 2247844 2077811 2054389 2465887 2108755 2041212 1933131
13955 1933131 2053605 1895203 2050800 2029896 2256669 2042969 1906187 2025778 2033188 1716827
13945A716827K82907q706k9558j20156k42200J52969m144K6391j18759j80738
13935A474833L11889k4629k34906O03605n31427J66362j29534J23712k48302j3483
13925A498120J98281k54286J18367K0315J67535l75513J32184j47399q5979K62056
13915A533681j41652P217l4984j02493J92245k4238j69527J1681J83763j8784
13905A436909J41504K8291k19096k59948J05034N20899n21880j042j08615L25413
13895A447469J06843j93163j10387L68258k37617j74498j80220K05748K52277
13886A484710l27186n5858n2437M61945l33213j34486M96437l30349l17037J43658
13876A036184m880L68612j11440r8863k82747K6567J26145K66217n9841k3279
$$ plain form
13945 1716827 1999734 1991028 1961470 1841314 1599114 1752083 1747939 1774330 1655571 1474833
13935 1474833 1786722 1762093 1527187 2130792 1599365 1765727 1636193 1759905 1511603 1498120
13925 1498120 1696401 1442115 1560482 1580797 1748332 1372819 1505003 1357604 1271625 1533681
13915 1533681 1392029 1399246 1364262 1261769 1454014 1429776 1260249 1271930 1455693 1436909
13905 1436909 1578413 1606704 1387608 1127660 1232694 1753593 1231713 1230671 1122056 1447469
13895 1447469 1554312 1361149 1250762 1619020 1381403 1206905 1026685 1232433 1484710
13886 1484710 1157524 1101666 1049229 1511174 1177961 1043475 1539912 1209563 892526 1036184
13876 1036184 1031304 1399916 1288476 1189613 906866 933433 1059578 1325795 1265954 1242675
13866A242675R5557j55585M7971l75249M31036k39304N6537j00702k69668M86136
13856A219404n9879j95181j85580J21758J01544o5380J59149j6050k17195M0705
13846I03295P098J34461Q8286l95763K10302l6120L1358J55652K30140k99747
13836A028962q3589j21234K71504r6385r3749r3732k34446K19761N0147M16170
13826A263409k18276J03233l13638J19218M8906J84990k69152K27323k33921J06117
13816A018209K3402R2048Q751j56421o2087k62953J02332M88538k76738j75002
13806H00079P3709k22477r037L13900k5226j81558R1634k04472l1226K3516K15599
13795H44441C60220M94298K72650l85644j80433J46429n4682k70630J33984K33598
$$ plain form
13866 1242675 1338232 1182647 1230618 855369 1286405 1047101 1103638 1002936 733268 1219404
13856 1219404 1159525 964344 778764 900522 1002066 936686 1095835 1079785 862590 903295
13846 903295 910393 1044854 1133140 737377 947679 911559 942917 1098569 1328709 1028962
13836 1028962 945373 824139 1095643 999258 905509 811777 577331 797092 847239 1263409
13826 1263409 1045133 1148366 834728 953946 1002852 1187842 918690 1146013 912092 1018209
13816 1018209 1041611 1133659 1142410 985989 923902 660949 763281 1251819 975081 800079
13806 800079 873788 651311 642274 956174 930948 749390 841024 636552 605326 628842 844441
13795 844441 360220 854518 1127168 741524 561091 707520 652838 382208 516192 749790
13785G49790L01653l38876n9318J53179N4008l31265K84326K42049n26580J06233
13775F35199P6939N33987m16002p1793q2576N916K42658j39591K22757l17508
13765F89986r4056J7052k03074J67748K16341j19054J6280m3571K35023k78973
13755F03702J53091j51071k72362P24073m19814Q6353l15231P52914n15034k36683
13745D09938M07864k81579Q4046L15162o4293k69298o3298L66706j50197q0629
13735F74422j0913j27279J24430J61407q400M4906K5261D09316K45252j25206
13725E29362K400J64611j05155K8770J91694J0659r767q3634n7233j80514j97533
13714B93660M62914j63505n1032o6668j54956L933G6494M72108k12258R640l5173
$$ plain form
13785 749790 1051443 712567 653249 806428 860436 529171 813497 1055546 528966 635199
13775 635199 712138 1246125 830123 758330 675754 681670 924328 784737 1007494 689986
13765 689986 595930 612982 409908 577656 793997 674943 691223 647652 882675 603702
13755 603702 756793 605722 333360 1057433 637619 723972 408741 1161655 646621 409938
13745 409938 817802 536223 620269 935431 871138 601840 538542 905248 755051 674422
13735 674422 663509 536230 660660 822067 813667 858573 883834 409316 654568 529362
13725 529362 531762 696373 591218 619988 811682 822341 812574 728940 671707 491193 293660
13714 293660 756574 593069 542037 475369 320413 324346 76494 548602 336344 345984 310811
13703C10811L16034Q3540l05106L85237C08652L09945j4058N3527j01480K54572
13693H11158C50741o7595K51641o1896o8869L64370j66847k74482L71803C47473
13682C60500M00523k13722M687K8871M1727m7067j27193K33511J791j56950O5738
13671E92416k06078N9623j00701K20832r2532j24159p6587K08290P2119r8905
13661D54318j47619K12922K5408B21435K39820M71334k21743l14613K09273j16354
13651D89152M9676j36662L01926j93442J36676p7742j43301k9836J73797k32463
13641C37781P09j39285Q0962A19885J45279O6054K04329l010r2155M81999D41470
13629D33257P1472B26908L65416k40474L42965A71849L46050M4719k69791M11566
$$ plain form
13703 310811 626845 710385 405279 790516 308652 618597 604539 658066 556586 811158
13693 811158 350741 283146 534787 472891 404022 768392 601545 327063 698866 347473
13682 360500 761023 547301 551988 580859 622586 575519 448326 681837 683628 526678 592416
13671 592416 386338 445961 345260 566092 473560 349401 272814 481104 553223 454318
13661 454318 306699 519621 545029 221435 461255 932589 710846 396233 605506 489152
13651 489152 538828 402166 704092 510650 647326 569584 426283 396447 570244 337781
13641 337781 338490 199205 280167 119885 265164 331218 535547 532537 440382 922381 441470
13629 433257 504729 226908 592324 351850 694815 171849 517899 562618 292827 704393
13619G04393A49433J20794L5657J24613q7231K13051r3074J01872A97013P0072
13609B67085J65278J2947E9668L74947j97219o9070N2758L74910A08673L75793
13599D84466A38800Q3541j8987J7504K06953k09465M17380B25468K94048k7595
13589D91921k02117p2729L10051B21692M4723J67400G3235J50372J41905L04064
13579F69576j79744j72798J50685B7564L38495j45382K42057j04660A46186K52116
13569C98302K8846M3414j58507j26964K07991j73190n9776J70416J20829p7572
13559C73789j25000o4787L82037j22923B21263J9360L63984j86472p7514J454
13549C42075j35313a9893C76096R2474l7994A58643O1573P7578r8999J78577Q8952
$$ plain form
13619 704393 149433 270227 305884 430497 343266 556317 463243 565115 197013 267085
13609 267085 432363 445310 59668 434615 237396 168326 221084 595994 108673 484466
13599 484466 138800 222341 203354 220858 427811 218346 635726 225468 519516 491921
13589 491921 289804 217075 527126 221692 266415 433815 73235 223607 365512 669576
13579 669576 489832 317034 467719 27564 366059 220677 462734 358074 146186 398302
13569 398302 427148 470562 312055 185091 393082 219892 160116 330532 451361 373789
13559 373789 248789 184002 566039 443116 221263 240623 604607 418135 340621 342075
13549 342075 206762 -19893 376096 468570 430576 158643 220216 297794 198795 377372 466324
13538D66324A80250k4376N9845J19541A22579J51400J4414L72773j55816j83587
13528C21763j39674n785Q8475q4219L47751j97363J50082I5662K26097J80597
13518E02356j42134J33924B42859q1608J85531l7523A33311a87829D17204A91791
13507C9033K73962j15849k6191K17274J97989j50293A77232M06505B64409J62760
13497D27169n4404m1416A21740K7699K44391j93518Q3836h0353D01848j51341
13487B50507b20021C45171A9443K39518J27342A61110R9640J21138i314A78413
13476D11049A1302K38150o3891P7455J8041R786M2838J17624A89984j1636K11319
13465C89667A28078K72542m653j54896J47454j27169j29976J31617o335J8658
$$ plain form
13538 466324 180250 155874 215719 335260 122579 273979 288393 661166 505350 321763
13528 321763 182089 176304 264779 180560 528311 330948 481030 95662 321759 502356
13518 502356 360222 494146 242859 161251 346782 309259 133311 -187829 417204 191791
13507 39033 312995 197146 170955 388229 586218 435925 177232 583737 264409 427169
13497 427169 372765 331349 121740 149439 393830 200312 284148 -80353 401848 250507
13487 250507 -220021 345171 19443 258961 386303 161110 260750 381888 -9314 178413
13476 411049 11302 249452 185561 263016 281057 290843 333681 451305 189984 178348 389667
13465 389667 128078 400620 395967 241071 388525 261356 131380 262997 256662 275320
13455B75320j37399C8046J86527K02582A96602A6137J29305J00323I2189A6418
13444E73807j19994j96090q7456j4259K7585M8882J49778A40051J53780K20602
13434E14433j13668p3632n0411M2771o4796M877N0964n2630G0L83747p8106k7868
13422B77843A2338N7683L97369k04788a46012B11583E9353L76938c8512B56926
13411B45381M972F6664f88C06746P9224A06524O1186P441J13667n6080J1710H47
13398B1883L58047j47228J20694A3913K55697I6410Q5882J33882j27732g5848
13387A26529J61174p2191P1881M8838j42447g1150D14530j93817e3736H3622K11928
13376B95550j38323F3976K97347n8798R0041j25056J82118j34828O8598j73108
$$ plain form
13455 275320 137921 38046 224573 427155 196602 16137 145442 245765 92189 16418
13444 573807 453813 257723 170267 156008 183593 232475 382253 140051 293831 514433
13434 514433 400765 327133 276722 319493 254697 259574 310538 257908 70 383817 305711 277843
13422 277843 12338 70021 467390 262602 -146012 211583 59353 436291 -38512 256926
13411 245381 250353 66664 -688 306746 385970 106524 167710 175151 288818 232738 244448 847
13398 21883 379930 232702 353396 13913 269610 96410 182292 316174 188442 -75848
13387 126529 287703 215512 287393 336231 193784 -71150 414530 220713 -53736 83622 295550
13376 295550 157227 63976 361323 302525 392566 267510 449628 314800 383398 210290
13366B10290C2596K76088j32391K39502j36591q4318L9225n2625M4895a56522
13355D43642j74786L59499e2665A3604K67355m7425K90119j35285j76462Q8028
13345B99934n6415m1426L94626n3021A99287O7839K33119A63546E0828M57588
13335E08416p210B16112M7386J67503A62951C0197N9977a2397B40852n2133N9893
13324B48612p2456J2503q9198i740A95424o6459K41278j58001K60596B17569J4834
13313B32403e9631p4298G4794N5895N7170p4565K09911p4759m3663I1160J61826
13302B52986D3166L27643G1903L7378k219J06946r6749L17147A02649i6425A35719
13290C32905M9026j39803j04936k6245j0485j0041R4051O085J28362a904A195
$$ plain form
13366 210290 32596 308684 176293 415795 279204 194886 234111 181486 226381 -156522
13355 443642 268856 628355 -52665 13604 280959 233534 523653 388368 211906 299934
13345 299934 243519 202093 596719 543698 199287 267126 500245 163546 50828 508416
13335 508416 501206 216112 263498 431001 162951 30197 90174 -12397 240852 188719 248612
13324 248612 176156 188659 99461 -9740 195424 128965 370243 212242 472838 217569 232403
13313 232403 -59631 -133929 74794 130689 187859 113294 323205 248446 204783 91160 252986
13302 252986 43166 370809 71903 109281 107062 214008 117259 434406 102649 -96425 135719
13290 332905 381931 242128 137192 110947 100462 90421 184472 190557 318919 -1904 1195
13278D693J03316D3380a58662D37799c8760B10682m1466c30042e5453A56836B8232
13266d5367D1716M21208A02679K95279i5677A33198J44429r8336o2432k7595J05999
13255A95263Q724c1353B23726K16550a61791I8553L9582f2016A62513a7203A36422
13243B86449K14218A48573p1177J45966G705P8447a3544A74302F7378K08010A6536
13231A89588a04294B96106A00329c22660A17976K27193A26194Q9690G9893O4163
13221A44056k8238D893J45051a4067C35031A01490D050M4673b47103B30160p4822
13210A55338e2479A02159Q9008r918g3344j60736A14321a8645k9528C28892a64782
13198a4195B35941d9252E4163L4755N2148a05291A1845K28328j04284A2399J21626
$$ plain form
13278 4693 108009 43380 -158662 437799 -38760 210682 169216 -330042 -55453 156836 28232
13266 -45367 41716 462924 102679 397958 -95677 133198 277627 179291 116859 89264 195263
13255 195263 203987 -31353 223726 440276 -161791 98553 138135 -62016 162513 -17203 136422
13243 286449 500667 148573 77396 223362 7705 86152 -13544 174302 67378 275388 16536
13231 189588 -104294 296106 100329 -322660 117976 345169 126194 215884 79893 144056
13221 144056 115818 4893 149944 -14067 335031 101490 4050 48723 -247103 230160 155338
13210 155338 -52479 102159 191167 181249 -73344 -234080 114321 -18645 -48173 328892 -164782
13198 -14195 235941 -49252 54163 88918 141066 -105291 11845 240173 135889 12399 134025
13187A34025O8911J20441A56213K38089a26058N9023K1396B038K06536E0323a17996
13175A68860b83400J38935C01806b0752A82089q9747D4501K81008m8441a04429
13164a58661A40720R3474k7948D7222K7705J72193l9049m8748A547h3838l7476
13153a21314A09610l0125N3381J60167a64895I5549J29668L9822a24046e3485
13142A29974a35073A52415E8006c40568A4822J97905a36901A71157J6417J18848
13132C06422N8380j74124h3744B81804A10296B8495a00302A14209R0778C1820
13121B06968B3085J91938L6405A24065J70810j41032L2786J52554E1710L4085
13111H5795a6269k01065B49408b35489I2899a0065B38693C4938J83419H9475b48745
$$ plain form
13187 134025 202936 323377 156213 394302 -126058 -67035 -45639 2038 208574 50323 -117996
13175 168860 -283400 -144465 301806 -20752 182089 92342 44501 325509 277068 -104429
13164 -158661 140720 234194 206246 47222 74927 247120 208071 159323 1547 -83838 -121314
13153 -121314 109610 79485 132866 293033 -164895 95549 225217 265039 -124046 -53485
13142 129974 -135073 152415 58006 -340568 14822 212727 -136901 171157 187574 306422
13132 306422 364802 190678 -83744 281804 110296 28495 -100302 114209 204987 31820
13121 206968 23085 215023 251428 124065 294875 153843 186629 339183 51710 85795
13111 85795 -16269 -217334 249408 -235489 92899 -10065 238693 34938 218357 89475 -248745
13099A40273R5780o5601n6541D2546L613a77768C88890a75110d3808A50610O7796
13088B18406L0333i5439j02800F9048J7004L4052C6573J10043D8814d190A06449
13076F3148K37740A08439k4237a27241c4602B32009k4964L1798a66270H0526d7436
13064A01965M6968f2938E1374a98936E7904K86111c3287k6360A49794p0827L27782
13053D06749d12632J68067B29739r3283o0374a33822A02166J54085c9929B47012
13042e5693l1139D26329A77942H6984f2089h61D18067i2284A31431J86094b1257
13030B63017a16324I6246J72359O4326g54B72697q827g439E85862B23630K83190
13019E06820A26516h5991B09482b21503j1166B44330J4615A27542A1947K10720
$$ plain form
13099 140273 236053 170452 113911 42546 46159 -177768 388890 -175110 -43808 150610 218406
13088 218406 248739 -95439 -198239 69048 86052 120104 36573 146616 48814 -4190 106449
13076 63148 300888 108439 84202 -127241 -34602 232009 207045 238843 -166270 80526 -47436
13064 101965 148933 -62938 51374 -198936 57904 344015 -33287 -59647 149794 78967 406749
13053 406749 -412632 -244565 229739 136456 76082 -133822 102166 256251 -39929 247012
13042 -55693 -86832 426329 177942 86984 -62089 -861 418067 -92284 131431 317525 -21257
13030 263017 -116324 96246 268605 332931 -754 272697 263870 -7439 585862 223630 506820
13019 506820 126516 -85991 209482 -221503 -232669 244330 258945 127542 11947 222667
13009B22667M7068E1437J46011a00155A21189a4531K306j28127F1025L59497A50774
12997b20372A85137J09178P2280g8162K3600l1496J7625B90020A24769P1914D25
12985c15333A75868C7667J59980i6532o7043A10803K86146j08162a68515B09612
12974A3535K22278l4532p6156b7955C87687H0361g1137A9338K49330j32113C6155
12962B47322K8458H6018Q2468m4322m5616J87041n2955p2577E6400J74113e3587
12950A76994D8053P3397J35776d2517j962o255a5383A01207a50709k5092C05133
12938G3929K2607c1515E7731M1613c1164C38966j21458m6817k3620L04749A22199
12926c9867G0927b6700A27755N462O8809c05300A27107b58107J15826B42825A06940
$$ plain form
13009 222667 269735 51437 197448 -100155 121189 -14531 -12225 -140352 61025 420522 150774
12997 -220372 185137 294315 366595 -78162 -54562 -86058 -68433 290020 124769 196683 425
12985 -315333 175868 37667 197647 -96532 -163575 110803 396949 288787 -168515 209612
12974 13535 235813 201281 125125 -27955 387687 80361 -71137 19338 268668 136555 36155
12962 247322 275780 86018 168486 124164 78548 265589 212634 140057 56400 230513 -53587
12950 176994 48053 121450 257226 -42517 -44479 -50734 -15383 101207 -150709 -175801 305133
12938 73929 96536 -31515 57731 99344 -31164 338966 217508 170691 147071 451820 122199
12926 -39867 70927 -26700 127755 133217 202026 -305300 127107 -258107 -142281 242825 106940
12914a0032B72689B6422L6690K48952c5011C34046a6231g723A13629A8212N25845
12903E44057G0348J5703J1625f6370o2219A9173J38792c7890m0282B41580J12584
12892C54164I6160m5965J36596b8708r0271K2064E8761b94509B31104A3801N0980
12881F4781L9352K6032q26a26263A69823a36299M9169E3310P886A1671J03090
12870A14761A9732d4927j44902A66687F4705e7527A24676n881l0824J6770j9879
12859H4862a47152j85516G5392g8289L7816l09912i8073B16043c7690G8973J86024
12848B64997a13581A07065e1464A42252E1247L8673K41057i4511C45854b55654
12837B45524a38677c3529r6973l4194A43317J0178j8330M3634b73342B18911b25220
$$ plain form
12914 -10032 272689 26422 63112 312064 -35011 334046 -16231 -7723 113629 18212 544057
12903 544057 70348 86051 97676 -66370 -128589 19173 157965 -37890 -78172 241580 354164
12892 354164 96160 50195 186791 -28708 -118979 -96915 58761 -294509 231104 13801 64781
12881 64781 104133 130165 129339 -126263 169823 -136299 -87130 53310 61196 11671 114761
12870 114761 19732 -44927 -189829 166687 64705 -57527 124676 118795 87971 104741 84862
12859 84862 -147152 -332668 75392 -78289 -40473 -350385 -98073 216043 -37690 78973 264997
12848 264997 -113581 107065 -51464 142252 51247 89920 330977 -94511 345854 -255654
12837 245524 -138677 -33529 -130502 -164696 143317 153495 135165 178799 -273342 218911 -225220
12825I6506a75433A69200n4219c72100B06163a8067o7182j0094A0032f0601J4736
12814d5865l0426L5880j09169b3609r6398G8821a08361A22617J39821A06384b22077
12802B28854a5067F5161b35649I8403J61927M439r4928E7793M773a85596d44j75170
12790a75614A21890h8055c0801l00972B29846a3921C12304j15944b46844B5414
12779a9070A10189b16034c8327j33929C14461b9678F5063a86522M2769E2659e4243
12767a4306k0068m7267A97642K3380c63288A36201h1348j22350i3334j2904G6346
12755E3332b42466B9099r18J24555J6295b31690K0258Q347C6144M5352c0698k8738
12743e9436A39028B7897O5923g2865E5540M6953f257A59858D8424J8156O9604
$$ plain form
12825 96506 -175433 169200 114981 -372100 206163 -18067 -85249 -95343 10032 -60601 -45865
12814 -45865 -76291 -40411 -149580 -23609 -120007 78821 -108361 122617 262438 106384 -222077
12802 228854 -15067 65161 -235649 98403 260330 264769 169841 57793 62566 -185596 -444 -175614
12790 -175614 121890 -88055 -30801 -331773 229846 -13921 312304 196360 -246844 25414
12779 -19070 110189 -216034 -38327 -172256 314461 -29678 65063 -186522 -143753 52659 -54243
12767 -14306 -34374 -81641 197642 221022 -363288 136201 -81348 -203698 -93334 -106238 76346
12755 53332 -242466 29099 28181 152736 169031 -231690 -211432 -203085 36144 81496 -30698 -59436
12743 -59436 139028 27897 93820 -72865 55540 102493 -6257 159858 48424 66580 136184
12732A36184k8401J11470b241A86214F2910k1422J67074F5497J87206a6398j21236
12721a37634B58467m5274N7452E9153b3777C17971f5552C75560o7517K9459D0259
12709H8693J61795A18288N0418J59651A39991L01856A37602J29983J06179j52666
12699B21098J17203a67962i48A68839d6258E7370a49193A48764L5413L7401a34846
12687b65580A93338F4415N4391a2692A33415J13702A3707a274C7660h3149C16232
12675A37535R9191C1738O7828a00167Q566K1938F6812O8337L3790h8440E0985
12663A79540C3987L0969B9249N7305J2650a8194A65514n9238J79184p5314J01050
12652C11196D4478J65951q0513K10861e3218H0981K52222I5762B747J94744d37563
$$ plain form
12732 136184 107783 219253 -2241 186214 62910 41488 208562 65497 252703 -16398 -137634
12721 -137634 258467 213193 270645 59153 -23777 317971 -65552 375560 308043 337502 40259
12709 88693 250488 118288 168706 328357 139991 441847 137602 267585 373764 221098
12699 221098 338301 -167962 -948 168839 -46258 57370 -149193 148764 184177 221578 -134846
12687 -265580 193338 64415 118806 -12692 133415 247117 13707 -1274 37660 -83149 316232
12675 137535 236726 31738 99566 -100167 -91601 -69663 66812 135149 168939 -88440 50985
12663 179540 33987 64956 29249 86554 99204 -18194 165514 106276 285460 210146 311196
12652 311196 44478 210429 129916 340777 -53218 80981 333203 95762 2747 197491 -437563
12640b3625A68178f1418B43984C2265a20004J2474H1723P1246a13792B45673P0486
12629C16159j46974a36190I5003J31354e7718A81636m7160r054a99687B96657
12618C0095Q7644b87646I1813c0228H4105g0176E8506c01214A17300i7228C94482
12606A13277J98418a6305j55443k4825i5630B66721Q6078D6137R3661J67387h5807
12594A45504h2041n1845A16737m5566K71585H8024J61843n8829b78543D5337b41248
12582B22567H648J33251c83055J57108A71360c07171A29426a4066A06680k121
12572A04559a3665A23962b21440H883J22445L8232g5248m4981A16429l1894h0248
12560F5373a40406k3467M1244M3415A15847n4331j863J76201i1874H4088a06739
$$ plain form
12640 -23625 168178 -61418 243984 32265 -120004 -107530 81723 152969 -113792 245673 316159
12629 316159 169185 -136190 95003 226357 -57718 181636 134476 125422 -199687 296657
12618 30095 117739 -287646 91813 -30228 84105 -70176 58506 -301214 117300 -97228 394482
12606 113277 311695 -16305 -171748 -196573 -95630 266721 352799 46137 139798 307185 -85807
12594 145504 -82041 -133886 116737 71171 342756 88024 249867 191038 -278543 45337 -241248
12582 222567 8648 141899 -383055 -225947 171360 -307171 129426 -14066 106680 104559
12572 104559 -13665 123962 -221440 8883 131328 169560 -75248 -120229 116429 84535 -80248
12560 65373 -140406 -163873 -122629 -79214 115847 61516 59653 235854 -91874 84088 -106739
12548b7664B1555N43391F788K46104e62388i0439F2806L2186c51372I2355B7284
12536a34483J6905B56535I2195J68901j8122j7133F328L2799J25603q1504K533
12525H5759a52434M3089l2010B97339Q0984b732j49952A77300b3336A71015c3221
12513A78164f4116j90537A955K33694E1480m308h4027E9705l452h9166E0853P9454
12501A30307c260k91488C4963N05432A03200A401f4080p8607N6864D343a74964
12489A59838a29641B27120e0215G4123K09986a24142j35651H594c5242j28595
12479a63837P9618B14852g6521F6991J01600B3493h9007K8985B12552G572d3745
12467B48828a75794D1050c0145n822I8867a37516G9313d2881B65495i673p1779
$$ plain form
12548 -27664 21555 564946 6788 252892 -562388 -90439 62806 94992 -351372 92355 27284
12536 -134483 -117578 256535 92195 261096 242974 225841 6328 39127 164730 83226 85759
12525 85759 -152434 -109345 -141355 297339 378323 -2732 -152684 177300 -23336 171015 -33221
12513 178164 -64116 -254653 1955 235649 51480 47172 -84027 59705 56253 -89166 50853 130307
12501 130307 -3260 -294748 34963 540395 103200 1401 -64080 -142687 -85823 4343 -174964
12489 159838 -129641 227120 -50215 74123 284109 -124142 -259793 8594 -35242 -163837
12479 -163837 -84219 214852 -76521 66991 168591 23493 -89007 -60022 212552 7572 -43745
12467 248828 -175794 41050 -30145 -35967 98867 -137516 79313 -42881 265495 -9673 -81452
12456h1452c0621B33113a987A39245f5480B4377K0333O8942i4691q0338B10020
12444A64115b91302c8906k33648H7848J42184b41424b6422A42030b9572L854A75620
12432E8902Q1224L87980k18876p0489a85886l71408a48403A58342l1287B8082
12421b43823O3586j7106Q8166N3768j28072C9c37238A00524J5102b45019g3898
12409I346a5252m2715j84877A26512o422b16651R4589A14712K9304O7402p4089
12398A37329J42500a76482A02430a40307k19O750b2329j40361j13813e7110A86501
12386A34463j6943h1242F9628l2571b64682b5388l6017p0780A31559f0385F3777
12374B42300G1686f7186C21047A334K03023H5006A9829a25289N6427B93308q8301
$$ plain form
12456 -81452 -30621 233113 -1987 139245 -65480 24377 44710 113652 -94691 -175029 210020
12444 164115 -291302 -38906 -272554 87848 230032 -241424 -26422 142030 -29572 -25718 175620
12432 58902 140126 528106 309230 238741 -185886 -557294 -148403 158342 127055 28082
12421 -243823 -180237 -197343 -109177 -55409 -183481 39 -337238 100524 115626 -245019 -73898
12409 9346 -15252 -57967 -242844 126512 120090 -216651 -122062 114712 144016 211418 137329
12398 137329 279829 -176482 102430 -140307 -140526 -133776 -22329 -162690 -276503 -57110 186501
12386 134463 117520 -81242 69628 37057 -264682 -25388 -61405 -132185 131559 -60385 63777
12374 242300 71686 -67186 321047 1334 204357 85006 19829 -125289 -68862 293308 205007
12363B05007a8999C8500i9600D30479H3359C4337J08271b08327E959K8768a3961
12351A78522c8680p0706C67723a58541d0847F1209g3851c5970G8589Q2952o9563
12340I1978q006a09807C1542J4408K12475I9563L0978i835j091o3901J0858j52229
12328b16198A01278N3818F9770a75601o7300K688R3933D7448K95507c2220F170
12316d47858c459j79934I581K69360d8667i790A5739M7217c51863I4054d8395
12304g6927E9527K926O8875a0024C8233J88115j08640i6252B08785H8916B8406
12292A92757J8877a58344A95338c0149J4006A77390N9624A03260C5304M4750J51591
12281B31645E5911J10368A5349Q1930c5868B34639A15274J8697A8387l545J37403
$$ plain form
12363 205007 -18999 38500 -99600 430479 83359 34337 142608 -208327 5959 34727 -13961
12351 178522 -38680 -109386 367723 -158541 -40847 61209 -73851 -35970 78589 161541 91978
12340 91978 83972 -109807 31542 45950 258425 99563 130541 -9835 -10926 -74827 -63969 -216198
12328 -216198 101278 155096 69770 -175601 -242901 -240213 -146280 47448 342955 -32220 6170
12316 -447858 -3459 -183393 9581 278941 -48667 -9790 15739 62956 -351863 94054 -48395
12304 -76927 59527 62453 131328 -10024 38233 226348 117708 -96252 208785 88916 28406
12292 192757 211634 -158344 195338 -30149 -16143 177390 237014 103260 35304 80054 231645
12281 231645 55911 166279 15349 97279 -35868 234639 115274 133971 18387 14842 152245
12270A52245N0191G0205b84257e975B07847o2666N4706r2902g6534k61994g0045
12258D5626h4766J6805J3157A43271e8801I285a05317d2437k9107B05998I3747
12246B48853b2801B49794i8895G9189J05051a1207C37699A00628K71580A23643
12235E18147D4810p893J26703J33906G0588i0456B49969J11495A64955F4302N4544
12224A18846c4744A18123K72287j05776o4166a46582I6044K77457I7094J44596
12214B41690o3062L09758A7743a3824B61536d4102A50321A1900O3696J33955a3613
12202B62073i1451B7974L32474q2784h5687D91513j87294A0051O0229J55837p3714
12191A52403Q2151h7637b5481h439F5652h0257a8557D6128J55983k0488j980b18484
$$ plain form
12270 152245 202436 70205 -284257 -5975 207847 145181 199887 106985 -76534 -338528 -70045
12258 45626 -84766 -67961 -54804 143271 -58801 9285 -105317 -42437 -71544 205998 93747
12246 248853 -22801 249794 -98895 79189 184240 -11207 337699 100628 372208 123643
12235 518147 44810 36917 163620 297526 70588 -90456 249969 361464 164955 64302 118846
12224 118846 -34744 118123 390410 284634 220468 -146582 96044 373501 97094 241690
12214 241690 178628 488386 17743 -13824 261536 -44102 150321 11900 75596 209551 -13613
12202 262073 -91451 27974 360448 277664 -85687 491513 304219 10051 70280 226117 152403
12191 152403 234554 -87637 -25481 -8439 65652 -80257 -18557 46128 202111 181623 179643 -218484
12178A46888K96716b35236A76015e5665j37506E00607i9895A8000E418O1674K77855
12167C44947j26775E3843L91549A42933j3466N8117n4067J07453J13280n0622
12157C03628A4440b51055E23124A82414A3687R0320Q4203b57861D2053J12204
12147A54257d657j36327M8468B2588a66001C5610f3613B31289M8300e2758B42942
12135A10189J534R219B1335J19531a08202C32737p2007G0444K2020B7319A2762
12123a06395M8629A49505f8010A42173n5090b08979F5926a02878j01350a2237
12112A51331I886J48264l363F5286J32350d7971b3948p159A04661c8898j50615
12101a89513g9525b9178E2356O495J16775B3535o547a02302m4121B05307P2549
$$ plain form
12178 146888 443604 -235236 176015 -55665 -193171 500607 -99895 18000 5418 67092 344947
12167 344947 218172 53843 445392 142933 129467 187584 133517 240970 354250 303628
12157 303628 14440 -251055 523124 182414 13687 104007 188210 -257861 42053 154257
12147 154257 -4657 -140984 -92516 22588 -166001 35610 -63613 231289 279589 -52758 242942
12135 110189 111723 120942 21335 140866 -108202 332737 260730 70444 92464 27319 12762
12123 -106395 -57766 149505 -68010 142173 87083 -208979 65926 -102878 -204228 -12237
12112 151331 9886 158150 154787 65286 197636 -47971 -23948 -31107 104661 -38898 -189513
12101 -189513 -79525 -29178 52356 58851 175626 23535 16988 -102302 -146423 205307 277856
12090B77856j01102L1668b4122j54794C48299j73787B0835J62084D8285P3701
12080A21986n9362M69612J261149F07042k31820K71459B76139g3552C0603a28044
12069B27525a07362B03049L06339f6461J6882j76080K4542d3487B83296j3635
12059B69661a79480j6604d0720o5278G8679j8097O7368R2626g5767q979r0945
12048a75691P1061j808D1099a42641p4674B49582D0889M053c1804A61964c15908
12036a17665k31905J39342d4498M15G6234a52773L2997K4402c892o5557C36188
12024B17636b33083N6276A53975K32889b26913G2115P3180G0274J38980i2035
12013c39774A30663b11929h0712I3647d6790r764k10168k8957B87618a29575C05746
$$ plain form
12090 277856 176754 208422 -24122 -178916 348299 174512 20835 182919 48285 121986
12080 121986 62624 532236 1793385 607042 375222 646681 276139 -73552 30603 -128044
12069 227525 -107362 203049 509388 -66461 -49579 -225659 -201117 -43487 283296 269661
12059 269661 -179480 -196084 -40720 -105998 78679 60582 127950 220576 -75767 -84746 -175691
12048 -175691 -104630 -106438 41099 -142641 -217315 249582 40889 44942 -31804 161964 -315908
12036 -117665 -349570 -210228 -44498 -44083 76234 -152773 -119776 -95374 -3892 -69449 336188
12024 217636 -233083 -176807 153975 386864 -226913 72115 145295 70274 209254 -92035
12013 -339774 130663 -211929 -80712 93647 -46790 -56554 -266722 -295679 287618 -129575 305746
12001f3051q4815B7683b70367K0050c5825q3756c3173A08973D6817J27733D5427
11989F3040A883N4912J80744g7926D8324f9596l44899G883P0960b78386A24874
11977A90372F8753O0016M3445c07013J37504e3360C2156J38023K1460a80935B03573
11965b32139Q0388c8413A01300i000n1315m7228A98868o0376b0942I4245e4984
11953a44202N9773B19688b02180i6572c7589C4407c19131B24432q8764a04945
11942A12993h0883G358b73302A43062c4257B340K1007Q8951a38467K3672L2573
11931h2222l1708D41609E5996a62055D030K86238b40775B70074a57426J7274j70092
11920c10244J31206e1239m0695B62860O1209a97601O5829C281J32030J43134c59451
$$ plain form
12001 -63051 -147866 27683 -270367 -250317 -35825 -119581 -33173 108973 46817 174550 45427
11989 63040 1883 56795 237539 -77926 48324 -69596 -414495 7883 78843 -278386 124874
11977 190372 68753 128769 172214 -307013 -169509 -53360 32156 170179 191639 -180935 203573
11965 -232139 -151751 -38413 101300 -9000 -60315 -107543 198868 138492 -20942 94245 -54984
11953 -144202 -84429 219688 -202180 -96572 -37589 34407 -319131 224432 135668 -104945
11942 112993 -80883 7358 -273302 143062 -34257 2340 23347 112298 -138467 -114795 -82222
11931 -82222 -113930 441609 55996 -162055 4030 290268 -240775 270074 -157426 -140152 -310244
11920 -310244 -179038 -51239 -91934 262860 324069 -197601 -131772 3281 135311 278445 -359451
11908a12276C53885h5702p9634C25694J07187k13953F1431h3056A04293a6843
11897A5471C593a72265B44666C4472a48812j35277a21561l4787a0287m83703f9705
11885B2461N4877c8194H0842e4239I6373K09483A18068K88317A96769b07977J0727
11874a97250j72417a36574e3264q7324d0126k46462n1896A83289c03371e6313
11863e8654A92437E5124M5576B8192a29228c6983j39776H1343l9465M736J30642
11852A77256q1475a45197b2707m38272C8609a04560q7296g7154b0461j25375b1342
11840D0307O8196l7976M1139d5758k9084B5497a35267D6374N7341A8109d4103
11828b55507k8407E88078B23391b68187A55795E1700c71926a00985B3445b6583
$$ plain form
11908 -112276 353885 -85702 -165336 325694 432881 218928 61431 -83056 104293 -16843
11897 15471 3593 -172265 244666 34472 -148812 -284089 -121561 -156348 -10287 -493990 -69705
11885 22461 77338 -38194 80842 -54239 96373 305856 118068 406385 196769 -207977 -197250
11874 -197250 -369667 -136574 -53264 -140588 -40126 -286588 -338484 183289 -303371 -56313
11863 -58654 192437 55124 100700 28192 -129228 -36983 -176759 81343 41878 46614 177256
11852 177256 95781 -145197 -22707 -460979 38609 -104560 -191856 -77154 -20461 -145836 -21342
11840 40307 108503 70527 111666 -45758 -74842 25497 -135267 46374 103715 18109 -44103
11828 -255507 -283914 588078 223391 -268187 155795 51700 -371926 -100985 23445 -26583
11817b44098A17013I696c41539a17135j02389C58545A61980m6013J90801b70053
11806g1626j84492B3814J48660o3348r665a44629A00171a49427C7739P0568a01518
11794A62779a48106L3013A66472g1965o1298A19018a84125A18328b48251J03688
11784a44563E2257J2097c30927C5777c61444J65443L4183B9832f1266K2867G0062
11772a17673d8684C27285j31475E9855J19106f6495k40323B83330d8150k39912
11762b88062a17553c3811j22970J4533f1164p4668B04466n361D2215l609a31582
11750I8717A4914K26584b43104A3216Q5985L616C8484b37538I791e4585A09081
11738a70557C8614b04450E3271P0777a13306l4597L2368A6294a65965j06607I7241
$$ plain form
11817 -244098 117013 9696 -341539 -117135 -219524 358545 161980 115967 306768 -270053
11806 -71626 -256118 23814 172474 109126 99461 -144629 100171 -149427 37739 108307 -101518
11794 162779 -148106 -115093 166472 -71965 -133263 119018 -184125 118328 -248251 -144563
11784 -144563 52257 64354 -330927 35777 -361444 -196001 -161818 29832 -61266 -38399 70062
11772 -117673 -48684 327285 195810 59855 178961 -66495 -306818 283330 -48150 -288062
11762 -288062 -117553 -33811 -156781 -142248 -61164 -135832 204466 199105 42215 38606 -131582
11750 98717 14914 241498 -243104 13216 99201 102817 38484 -237538 9791 -54585 109081
11738 -170557 38614 -204450 53271 124048 -113306 -147903 -115535 16294 -165965 -272572 97241
11726H8173b62A84543f4302r247A41875A2663a33504G9519C4140a60959a9114
11714I1292D4962a09345A08234g837B23J34059l3332a61949E3122a21610B34991
11702a09660A08946K88179i8532b2498j4439j24073m0221H8036J4171Q1391K9988
11691B13586F3054Q1563l1722C0636J45696a35634B15047p3491a82494C58688
11680A50427k6002b7300O674A60790K3126G5461J41552b9651A22034a8965A18280
11668c88192a63401A19355f2717B26804C393L34017E8175J98508d8675j22189
11658a70864A79780m478h6194A37690c7353m2968b5700j83177H1573a20089l2377
11647a52466J1133C97446j96227J18100h5911F51494A05994k8955h4558A180J42135
$$ plain form
11726 88173 -262 184543 -64302 -73549 141875 12663 -133504 79519 34140 -160959 -19114
11714 91292 44962 -109345 108234 -7837 223 134282 100950 -161949 53122 -121610 234991
11702 -109660 108946 397125 -98532 -22498 -36937 -161010 -201231 88036 102207 183598 213586
11691 213586 63054 144617 112895 30636 176332 -135634 215047 141556 -182494 358688
11680 150427 124425 -27300 -20626 160790 183916 75461 217013 -29651 122034 -18965 118280
11668 -388192 -163401 119355 -62717 226804 3393 337410 58175 256683 -48675 -170864
11658 -170864 179780 175302 -86194 137690 -37353 -80321 -25700 -208877 81573 -120089 -152466
11647 -152466 -141333 397446 201219 319319 -85911 651494 105994 77039 -84558 1180 143315
11636A43315l3687a4521E7944a10124h879A00133e4572A58143f9244b9290A59406
11624e4529J149F7498h6187A63170h5852k6145H9717c3669l4730B20461r2422
11613A28039k0294a80952h0149m0856d9829C796M6010i6035L1040A19833d68C8970
11600a44376r5544R2258A05661P9131a24095k7547b6227E2802a32736A79152O9820
11589B48972L913B0355J2999K29935l882b44948F17100A33802b39620a6091B89375
11577A52403o2204d4894A03143J28248o6884L39952I7322J56855a80734B27447
11566a5490A56202A8923L80214A59473j3825h5384A27748i3714b8055j42353F2673
11554B23438g4773k94608J07156I1972f3751A60619m6384f3067m2620C17977J4756
$$ plain form
11636 143315 109628 -14521 57944 -110124 -8879 100133 -54572 158143 -69244 -29290 159406
11624 -54529 -53380 67498 -86187 163170 -85852 -111997 89717 -33669 -68399 220461 128039
11613 128039 107745 -180952 -80149 -121005 -49829 3796 49806 -96035 -64995 119833 -468 38970
11600 -144376 -239920 -147662 105661 184792 -124095 -151642 -26227 52802 -132736 179152 248972
11589 248972 252885 20355 33354 263289 259407 -244948 617100 133802 -239620 -16091 289375
11577 152403 90199 -44894 103143 231391 164507 504459 97322 254177 -180734 227447
11566 -15490 156202 18923 399137 159473 145648 -85384 127748 -93714 -28055 -170408 62673
11554 223438 -74773 -369381 -262225 91972 -63751 160619 114235 -63067 -105687 317977 332733
11543C32733g7897A15747J09367a63190F1491O008N3819J17458F7214c0442A07195
11531D1686J22711l1695J9002B7585b7424B85899j41973K18026j45069a7651A45687
11519g527n3015A92922q3437l7557b21364A77040O0636a2311B12870E8768L1407
11508I0175K2958N1548a24928A24207m1570C4933a64281b1543n4544I2329A8704
11496A80395E825K29825N2299F8062d7262C4207L4034k3582J47230n0645k1168
11485A20076P1695J98923D2963M38094j62799L9293f0880A04621R712Q0321a45048
11473A46414Q856K77585A61042K57332G8911K10084H7436J77624G7139M2993E7288
11461D82516A00351D1566e5671A54965J0807B1843L8488K24278g4985j42568B95029
$$ plain form
11543 332733 -77897 115747 225114 -163190 61491 67499 121318 238776 67214 -30442 107195
11531 41686 164397 132702 151704 27585 -27424 285899 143926 361952 216883 -17651 145687
11519 -7527 -60542 192922 109485 71928 -221364 177040 237676 -12311 212870 58768 90175
11508 90175 113133 164681 -124928 124207 82637 34933 -164281 -21543 -76087 92329 18704
11496 180395 5825 235650 287949 68062 -47262 34207 68241 44659 191889 141244 120076
11485 120076 191771 390694 42963 481057 318258 357551 -60880 104621 114333 194654 -145048
11473 146414 155270 432855 161042 418374 78911 288995 87436 265060 77139 120132 57288
11461 482516 100351 41566 -55671 154965 165772 21843 60331 284609 -74985 -217553 295029
11449A88358K1801e4319O538b0325I767a07993l9217d150k04354d2319B06139
11437c1593n9224d1116n5325A28663b2386L697L314G9101J49406E9129i5423A36188
11424B51684a22151L2982C25090b72288D50606j13686D5609b98785b70I0229A8266
11412B1437c4388o6645l6174G5580j6831J78459a13815C94800a1748q7789K1908
11401g7629C3882A4512J05808D9538a78139B87302c3393A44481J80482A00843
11390D84173c02964A61565e7950k48806J36204a2680E12965F8210C0617d0042
11379g8887D28924e1826q4637C3654g7156j96862A15633J11595O9092J00595l0813
11368C66102c796A70338b5383j71740A92004b5323C6267L7323P802J84589a99726
$$ plain form
11449 188358 210159 -54319 -47781 -20325 9767 -107993 -147210 -4150 -208504 -42319 206139
11437 -31593 -90817 -41116 -96441 128663 -22386 -18689 -15375 79101 228507 59129 -95423 136188
11424 251684 -122151 -89169 325090 -272288 450606 336920 45609 -298785 -270 90229 18266
11412 21437 -34388 -101033 -137207 75580 58749 237208 -113815 394800 -11748 -99537 -77629
11401 -77629 33882 14512 120320 49538 -178139 287302 -33393 144481 324963 100843
11390 484173 -302964 161565 -57950 -306756 -170552 -12680 512965 68210 30617 -40042
11379 -78887 428924 -51826 -136463 33654 -77156 -274018 115633 227228 296320 396915 366102
11368 366102 -3796 170338 -25383 -197123 192004 -25323 36267 73590 81392 265981 -199726
11356a46888A26596n9113g2960A15115e4138B0245J97975A05026L5861B4859a57941
11344a41888l4351A691M3285P0589a70321G0050J51739l6622a27154A53443J02159
11333B55602e2581j15563B11270p8504K209P7949a22696L9280A86813H7653a64501
11321i3603H8907e8515A00275a40981A72200a60802F5473f4626A87116b63574
11310a93402A13744g2272j99040C5430b85105P4369H8637b01980b6269A78154
11299A9546d570B18207G0081e3154A93289H8813d26491A87470c0271j42876L1348
11288a41799k6509r6239E8113a96987P6033A2621P4619b3493m1381k42508B63019
11276e7866m8152q5602L6830K7094B8871d44911a13007B23652a68376B8939N5182
$$ plain form
11356 -146888 126596 67483 -72960 115115 -54138 20245 218220 105026 140887 24859 -157941
11344 -141888 -176239 1691 44976 115565 -170321 70050 221789 185167 -127154 153443 255602
11333 255602 -52581 -168144 211270 132766 134975 212924 -122696 -83416 186813 87653 -164501
11321 -93603 88907 -58515 100275 -140981 172200 -160802 65473 -64626 187116 -263574
11310 -193402 113744 -72272 -271312 35430 -285105 -210736 88637 -201980 -26269 178154
11299 19546 -4570 218207 70081 -53154 193289 88813 -426491 187470 -30271 -173147 -141799
11288 -141799 -168308 -264547 58113 -196987 -120954 12621 87240 -23493 -64874 -307382 263019
11276 -57866 -106018 -191620 -154790 -127696 28871 -444911 -113007 223652 -168376 28939 84121
11265H4121a40020p062n7908B06372p7361a47084K7498A29325e5640j19122A39521
11253c37587B93582b07719n2871A41380d4139b1875l29446H9165a81918R0095
11243i1823k85060i6182j01800A40528f2199j69639m298J01416D068J43816a81462
11231B32514G5310l4999g57A36746a36867L5340I4504e3840A68949i7320m0267
11220a37587L7733k3224f0100k1361F1846k246a90142A2096O8696a96720p6227
11209b72947J35334C8497b70095d585m221D7464c84033a24919K7403I847J44388
11198A54235a59022F9002a33539A41839a87498H0296f529A98662g4706K7463A3806
11186A22876b16296A80302H6984k7996O0481C6465J09100b7999a0948n1740A7261
$$ plain form
11265 84121 -140020 -147082 -204990 206372 129011 -147084 -119586 129325 -55640 -174762 139521
11253 -337587 293582 -207719 -260590 141380 -44139 -21875 -351321 89165 -181918 -91823
11243 -91823 -376883 -96182 -197982 140528 -62199 -231838 -236136 -134720 4068 147884 -181462
11231 232514 75310 40311 -757 136746 -136867 -101527 94504 -53840 168949 -97320 -137587
11220 -137587 -99854 -123078 -60100 -81461 61846 59600 -190142 12096 80792 -196720 -272947
11209 -272947 -137613 38497 -270095 -4585 -8806 47464 -384033 -124919 -97516 9847 154235
11198 154235 -159022 69002 -133539 141839 -187498 80296 -6529 198662 -74706 -47243 13806
11186 122876 -216296 180302 86984 58988 119469 36465 145565 -27999 -10948 -62688 17261
11174A58710n4939J74278j34793c69571G1084c03000g8035J9841I4258a87706
11163b14477f3379l8131A26517J02863C9078J15403a20906A22265b0929B1137
11152A2312M2745r912a66584N5622C2076J82332b17142A16208n4557d9436C3195
11140A86093a05137B68689c9905l5479j41944j08249f0346l3391G2692K9076k0174
11129H1594J86914F5153h7054B11663p8388m6205J01169P6661k3421g0457n0580
11118a21037m460C1015a46202B09727h6921j04559C06780m0540b25196A07360
11107b02645G9671a9840E9941L9854c99255d9053G2878K56704b5234D39875A72015
11095I7122k6308J43750d17965A25313h4268B01411B2050J09718l7129f9636D23855
$$ plain form
11174 158710 103771 278049 143256 -369571 71084 -303000 -78035 -58194 94258 -187706
11163 -214477 -63379 -101510 126517 229380 39078 154481 -120906 122265 -20929 21137
11152 12312 55057 45145 -166584 -110962 32076 214408 -217142 116208 61651 -49436 33195
11140 186093 -105137 268689 -39905 -75384 -217328 -325577 -60346 -93737 72692 101768 81594
11129 81594 268508 65153 -87054 211663 133275 87070 188239 264900 241479 -70457 -121037
11118 -121037 -125497 31015 -146202 209727 -86921 -191480 306780 266240 -225196 107360
11107 -202645 79671 -19840 59941 99795 -399255 -49053 72878 329582 -25234 439875 172015
11095 97122 70814 214564 -417965 125313 -84268 201411 22050 131768 94639 -69636 423855
11083D49679A66717J96539j66574a5168A63501l0716L52691A46301G574L07381
11073C14955j28025M7652a7500p8073C65110K954L5297j65380q002J94855n8702
11062C66132O9802j32348M1773A22401L34790l3833M74788l40217n6553K37702
11052G39078k51969L38757j28615Q5098l12880K84435k32204K35490n7322j48360
11042E51508j20955J43511J02579Q1376l51745K95073M80589C94267N26252k50686
11032F69833l0549r8919J14954k64661L40182j5888l03270J02754J97156O9939
11022G81531j56898j23766M3737J08554k41711K97474j32846L7591R8709k40848
11012D71527J00639p5132J51301j10713O8940J7554K922k99175M98584j87711
$$ plain form
11083 449679 166717 363256 196682 -15168 163501 132785 485476 146301 7574 314955
11073 314955 186930 234582 -17500 -95573 365110 368064 403361 237981 229979 424834 366132
11062 366132 435934 303586 345359 122401 457191 423358 898146 557929 501376 739078
11052 739078 487109 825866 697251 782349 469469 753904 521700 757190 699868 551508
11042 551508 430553 574064 676643 758019 406274 701347 1181936 394267 920519 669833
11032 669833 639284 540365 655319 390658 730840 714952 411682 514436 711592 781531
11022 781531 624633 500867 544604 653158 411447 708921 576075 613666 712375 471527
11012 471527 572166 497034 648335 537622 606562 624116 627038 327863 826447 638736
11002F38736j67090R958J08307L89934p7631n3704k94272K78735j93138k1745
10992F18090j94440J82548J76805N5496l3558P8675q1892J30829n158J14978O5020
10981A107393k12252L86379l7029M02960m52142N98838L2787N09854k39097M07659
10971B505350l4745o3312k6131R3769M865l97977k05111M1693n42905L24898O496
10960A706890R334j1498K51283j83705K3979j59711j28687n6914k87825j20633
10950A042513k27016k17914p9469R5481k34411J31297J2317A81536J77889K6632
10940C86057A53215b86133C37182j02908a41364C18195D7267P3922a0407k57065
10930b67472B59644a8297c41G3790A3569J49756c7745B76293I2605a18339j58311
$$ plain form
11002 638736 471646 481604 589911 979845 902214 848510 554238 832973 639835 618090
10992 618090 423650 606198 783003 838499 804941 883616 801724 932553 927395 1042373 1107393
10981 1107393 895141 1281520 1244491 1647451 1195309 1794147 1826934 2336788 2097691 2505350
10971 2505350 2470605 2407293 2381162 2474931 2479796 2081819 1876708 1918401 1375496 1700394 1706890
10960 1706890 1716224 1704726 1956009 1772304 1796283 1636572 1507885 1450971 1163146 1042513
10950 1042513 815497 597583 518114 613595 379184 510481 522798 181536 359425 386057
10940 386057 153215 -286133 337182 234274 -141364 318195 47267 121189 -10407 -267472
10930 -267472 259644 -18297 -341 73790 13569 163325 -37745 276293 92605 -118339 -276650
10919b76650a1617B9182o586a36868A35858i3897B00140a58537E2488a26195j08854
10908b35049O6548A92757a62552O1322A54850c04671E1225b2592q29B4445b41354
10896C17408A9042c81587a04357C51307a1652A23408K81966c11117C3673a35054
10885B25937A11219a93348P9084N0921j35608A8738Q1304h4516B28642A2761d0156
10873i8670A57532b63647d7071B03611d31793d4604I7315l0518c50001E6694a03684
10861a73039Q6331A6458J57599b19556e4660m3966B6452J9132Q340L4191C4680
10849a10792j6203c2195n0859j44163d7748m8340m4092B48566F0418R2909b37653
10837C3516b66017Q608B3359b13138Q3871G632b57320J08522L8980E1664b2292
$$ plain form
10919 -276650 -11617 29182 22596 -136868 135858 -93897 200140 -158537 52488 -126195 -235049
10908 -235049 -168501 192757 -162552 -101230 154850 -304671 51225 -22592 -23421 24445 -241354
10896 317408 19042 -381587 -104357 351307 -11652 123408 405374 -311117 33673 -135054
10885 225937 111219 -193348 -114264 -63343 -198951 18738 100042 -84516 228642 12761 -40156
10873 -98670 157532 -263647 -47071 203611 -431793 -44604 97315 66797 -350001 56694 -103684
10861 -173039 -86708 16458 174057 -219556 -54660 -98626 26452 45584 53924 88115 34680
10849 -110792 -126995 -32195 -83054 -227217 -47748 -96088 -140180 248566 60418 153327 -237653
10837 33516 -266017 -257409 23359 -213138 -129267 7632 -257320 -148798 -109818 51664 -22292
10825A03729P2689p8901a35812M3414l59939a94897M6445e0366n0906j4807l1598
10814a47677D9690c02289B16984a7703p8181k22554B42704a03833j27207e6334
10803C5154Q2064a45242L5492I0881a60049e5651k56249A48679c2905r2643k17863
10792c43411j6063F1790e1116E0044k3326A0661a9069B7522L70894H5880c15252
10780f6061A49383D3599a25527A88477K35422b21589d2722A5633J26980a02459
10769b4993I3964a69319c4419A44675a64608L7417j07805J4528g2585j35657O9847
10758a38395a6554A03581a79968e6156o7860k3594P1527F0315a00471p1455k19851
10747c91777J94771J1172E4881N3438b32995R4177l814C27293a75747e0119A78842
$$ plain form
10825 103729 176418 97517 -135812 -92398 -452337 -194897 -148452 -50366 -101272 -116079 -147677
10814 -147677 49690 -302289 216984 -17703 -95884 -318438 242704 -103833 -231040 -56334
10803 35154 117218 -145242 -109750 90881 -160049 -55651 -311900 148679 -32905 -125548 -343411
10792 -343411 -359474 61790 -51116 50044 26718 10661 -19069 27522 398416 85880 -315252
10780 -66061 149383 43599 -125527 188477 423899 -221589 -42722 15633 142613 -102459
10769 -24993 93964 -169319 -34419 144675 -164608 -127191 -234996 -220468 -72585 -208242 -138395
10758 -138395 -16554 103581 -179968 -56156 -124016 -147610 -76083 60315 -100471 -171926 -391777
10747 -391777 -197006 -185834 54881 108319 -232995 -138818 -142632 327293 -175747 -50119 178842
10735b35521R1770C8995M2994C0588J23452n1255e8446E4208J39044a97578a4051
10723b99931H2743a85163B9924J54063C2384b70786a19235c8651j79685B0856
10712F1013J08006d1240k2288b3271j01970B40156g8891P051k47185B62322K3083
10701B85405c00945A05031m0551J8337K8110e6827a4866C21963F1377d378A39922
10689A47336a05824J8402A82641B4932J71877E1922m742a88074i0740J3744C78966
10677i8626o8383f3345l2448A9699d2928j7588a1039G2613c2887k21830C5476
10665B30697e9770A00796C6377a73882P9424j08942e8288a6270j01330B8035L5092
10654F3127b17493M8041M9682H6346K29489A56179a62759p5733c5562A89551a21555
$$ plain form
10735 -235521 -143751 38995 81989 30588 154040 102785 -58446 54208 193252 -197578 -14051
10723 -299931 82743 -185163 29924 183987 32384 -270786 -119235 -38651 -218336 20856
10712 61013 169019 -41240 -63528 -23271 -125241 240156 -78891 -71840 -319025 262322 285405
10701 285405 -300945 105031 64480 82817 110927 -56827 -14866 321963 61377 -4378 139922
10689 147336 -105824 -87422 182641 24932 196809 51922 47180 -188074 -90740 -76996 378966
10677 -98626 -167009 -63345 -95793 19699 -42928 -60516 -11039 72613 -32887 -254717 35476
10665 230697 -59770 100796 36377 -173882 -94458 -203400 -58288 -16270 -117600 28035 63127
10654 63127 -217493 -169452 -119770 86346 315835 156179 -162759 -238492 -35562 189551 -121555
10642F4097k8783n480b79964F74a69694A36243J31843a16073k11522j03882c1624
10630f1510K6215A05256A1899d6562o4920l9620A21827d3778C31238e7373B7278
10618B6830b06502a00670A61114b03610o3783f5964j41024j63126i1596J4087
10608g7509o1796D3936N2218J94418c4204H1831e7951B36497E4791b54262B17586
10596d7722C2075J5441b40805B27552a8777j07886b8821A20698K41155b49683
10585a75281B82158b65449h3271k54336O2734J23512F5917d5699n9087p0870A32267
10573d3207h325j9775B38004e0329j28543P9031c8857A42958D6028a69037b6300
10561A12005j5664a55171d5852j72136E9408a25198A09924J248b01151b7496C09606
$$ plain form
10642 64097 35314 29834 -279964 674 -169694 136243 268086 -116073 -327595 -431477 -31624
10630 -61510 -35295 105256 11899 -46562 -111482 -151102 121827 -43778 331238 -57373 27278
10618 26830 -206502 -100670 161114 -203610 -267393 -65964 -206988 -370114 -91596 -77509
10608 -77509 -139305 43936 96154 290572 -34204 81831 -57951 236497 54791 -254262 217586
10596 -47722 32075 47516 -240805 227552 -18777 -126663 -28821 120698 361853 -249683
10585 -175281 282158 -265449 -83271 -337607 -274873 -151361 65917 -45699 -104786 -175656 132267
10573 -43207 -8325 -28100 238004 -50329 -178872 -99841 -38857 142958 46028 -169037 -26300
10561 112005 96341 -155171 -45852 -217988 59408 -125198 109924 111172 -201151 -27496 309606
10549D3525c77251b2214r0274A42791a17269F0995a25442N6426j0777A71623n8347
10538A13276C0533J06061c03136J11285j59803R4706A98807H3281a47450D8027
10527B3049J44694a77541O1115A08521i7178n706C01770a02723l2841B20197m5888
10516A74309b99035G2182f5471A98856a59026C3295a6739A67274A4023O9757h4879
10504i032K30M140A81374O4253a15522A93513C0407O8205g2966b3834A71010a99403
10491A65062N068k3886c0601k5458B91260p4052o7344c3557A89271K633e2330
10479B72666L22372A05581J08623e3571A82401m2127K54512E5322a37242J2747
10469a24495C0661d307k34952d5959G2319J02130a46095j44774a02362j36921
$$ plain form
10549 43525 -377251 -22214 -112488 142791 -117269 60995 -125442 -69016 -79793 171623 113276
10538 113276 30533 136594 -303136 -191851 -351654 -256948 198807 83281 -147450 48027
10527 23049 167743 -177541 -116426 108521 -97178 -102884 301770 -102723 -135564 220197 174309
10516 174309 -299035 72182 -65471 198856 -159026 33295 -16739 167274 14023 83780 -84879
10504 -9032 -8802 -4662 181374 245627 -115522 193513 30407 98612 -72966 -23834 171010 -199403
10491 165062 170130 146244 -30601 -56059 291260 217208 149864 -33557 189271 191904 -52330
10479 272666 595038 105581 214204 -53571 182401 140274 394786 55322 -137242 -124495
10469 -124495 30661 -4307 -239259 -45959 72319 174449 -146095 -290869 -102362 -239283
10459b39283F8783J10442e652l99916a26152B12043r7671a65076A7997R3275a28138
10447b76798R5648b4984R051j69742a9455j6448a1514k12085d4656B8449b528
10435b69142A2108P6668Q195h3795L8244a5083B03666a56044a0577A92065D6010
10423C65430A78003g1968a3475j24069A77042a96681K0724c8164B7210J60388
10413A87598c31624A40561k8794j3147a76958p235Q0424M629E5513K1637e0258
10401I3700Q0161J7286c48960d6548F2635a60061K5136A24806a5442k43124c0695
10389G6842N1501J24026E3368a0261A77821B0444a37210A45289c12129A76079
10378a96697B33347K7620A05683b6680B37919J26093A52582a12059C50252j66280
$$ plain form
10459 -239283 68783 179225 -5652 -405568 -126152 212043 114372 -165076 17997 111272 -128138
10447 -276798 -181150 -24984 -15933 -185675 -19455 -35903 -11514 -223599 -44656 28449 -2528
10435 -269142 12108 88776 96971 -83795 -45551 -15083 203666 -156044 -10577 192065 46010
10423 365430 178003 -71968 -13475 -137544 177042 -196681 -175957 -38164 27210 187598
10413 187598 -331624 140561 111767 98620 -176958 -184193 -103769 -99140 55513 77150 -50258
10401 93700 173861 191147 -348960 -46548 62635 -160061 -134925 124806 -15442 -258566 -30695
10389 76842 128343 252369 53368 -10261 177821 20444 -137210 145289 -312129 176079
10378 -196697 233347 260967 105683 -26680 237919 364012 152582 -112059 350252 183972
10368A83972J86342J92267k33471m9590L31025B32054n1714m720J00096O6180
10358C41896j32782K32415B06677B8643J20636J12013m1006K24759J82875P9837
10348G07757j22596B49260C8882N9002O97555B66277P3256c59695C00424r3725
10338B06699K13646A38870J36181j13964j49b08125A04083k0883K46219F6152
10327a03440C35889h2636C03108a78289L9343D06928D8066K43936H0420N97833
10317F78253B79417a21641c7466A69510e5943j03204A84374J13487d3960A53136
10306G3004K1924i3918j08707Q2709A62360D196a85523A07381E1731K86560n4013
10295B84278a92094h6740m96631K64931H8364D0273c54544J60373j2360B78550
$$ plain form
10368 183972 370314 562581 329110 279520 610545 232054 180340 175620 275716 341896
10358 341896 209114 441529 206677 28643 149279 261292 220286 445045 627920 707757
10348 707757 585161 249260 38882 97884 795439 266277 339533 -359695 300424 206699
10338 206699 420345 138870 275051 161087 160938 -208125 104083 83200 329419 66152
10327 -103440 335889 -82636 303108 -178289 -138946 406928 48066 292002 80420 678253
10317 678253 279417 -121641 -37466 169510 -55943 -159147 184374 297861 -43960 153136
10306 73004 94928 -93918 -202625 -119916 162360 4196 -185523 107381 51731 338291 284278
10295 284278 -192094 -86740 -583371 -318440 88364 40273 -354544 -194171 -206531 278550
10284A0717J26919a34932B47730b44070f8762A39492a75011d1507j08265j19220
10274b68992N3624A69814J3240R5282b22151F646a1912B38849f2414J6861A32967
10262g193o8832C91761A93370G9663N2559K35812j12463J14267j52401c3385a4057
10250e6903A20622f9830I4929D653N1775d9216j77091p7224b9360C97634M1964
10239D39598b37910C2378N1818b1200B42260D7227a20844B68616a56140J2984
10229a43156c8813j12516a13A81353h2687j18658j11804B04559d3644r318C8239
10217h5011L5991a7594j26079A42345l06i3229B7280M5994k4516l19j5438h9821
10204a14767k47262J54277c8178j70270A77451A7310a23226D198f2415A31521
$$ plain form
10284 10717 137636 -134932 247730 -244070 -68762 139492 -175011 -41507 -149772 -268992
10274 -268992 -215368 169814 183054 278336 -222151 6646 -11912 238849 -62414 -45553 132967
10262 -7193 -76025 391761 193370 79663 132222 368034 255571 369838 217437 -33385 -14057
10250 -56903 120622 -69830 94929 4653 56428 -49216 -226307 -303531 -29360 397634 439598
10239 439598 -237910 32378 84196 -21200 242260 47227 -120844 268616 -156140 -143156
10229 -143156 -38813 -151329 -113 181353 -82687 -201345 -313149 204559 -43644 -52962 38239
10217 -85011 -49020 -17594 -143673 142345 142039 -93229 27280 73274 48758 48439 33001 -89821
10204 -114767 -362029 -207752 -38178 -208448 177451 17310 -123226 4198 -62415 131521
10193h122j82477c1819j66939p9397l6009J30237H8456q446e4576J874A22115
10181B81537H5671B5260g4851o4558n2628C4404a5005D4792b07913d1037p2979
10170a14016j69355j03770A29700O4613j1564a75531C70138F1476c2522n4407
10160h6929A55054o6730a78085l264A60352a29676j0788O1303l73896e8016A71489
10148a39377N1551B57410A20678b14594f0808N290a9917j43202G1056a04238n4083
10137a58321A01067f6289k6364j12012g9323F4155b7405l12797i9085k5368B42551
10125a0627k52883j26825n7212b12579l4782A28627c3902D7714a39533i812j69743
10114a79555j2214O8934n664m9793j61076J41550K3098G9881a56400m52186C59269
$$ plain form
10193 -8122 -190599 -31819 -198758 -278155 -314164 -183927 88456 80010 -54576 -52702 122115
10181 281537 85671 25260 -74851 -139409 -192037 34404 -15005 44792 -207913 -41037 -114016
10170 -114016 -283371 -387141 129700 194313 182749 -175531 370138 61476 -32522 -86929
10160 -86929 155054 88324 -178085 -181349 160352 -129676 -140464 -79161 -453057 -58016 171489
10148 -139377 -87826 257410 120678 -214594 -60808 -55518 -19917 -163119 71056 -104238 -158321
10137 -158321 101067 -66289 -92653 -204665 -79323 64155 -27405 -340202 -99085 -124453 242551
10125 -10627 -263510 -390335 -447547 -212579 -247361 128627 -33902 47714 -139533 -9812 -179555
10114 -179555 -191769 -122835 -128499 -178292 -339368 -197818 -174720 79881 -156400 -608586 359269
10102b16151k8390j9339j72583E578O3279J62817e8321E9836a70399P1146C84119
10090a19372B8897f1104j8506B42764a89675c9439l30065a68280C3535a41429
10079C3655J00888f0977r219A02165M6666b40643h8217a4874A39908a75069P5128
10068i9941l1259B1130b51617f3850o4774E4211I947h8960B9316b61716b2962
10056C2213a41891f0432j65638a09527M2649a6110B28106R9637A588d1099o205
10045d7304E2456a05459j20309K7833A58057C7159b72450m8029i3426B08073B6312
10033I3948a86405N2778N2170j32825e6339C96098G2806h665B18568a29273e1047
10021i5840b934B67448a8979E7715b49912e1864b2736j73215b7608A29505a54280
$$ plain form
10102 -216151 -244541 -263880 -436463 5578 68857 231674 -58321 59836 -170399 -99253 384119
10090 -119372 28897 -61104 -79610 242764 -189675 -39439 -369504 -168280 33535 -141429
10079 33655 134543 -60977 -70196 102165 148831 -240643 -88217 -14874 139908 -175069 -99941
10068 -99941 -131200 21130 -251617 -63850 -128624 54211 9947 -88960 29316 -261716 -22962
10056 32213 -141891 -60432 -226070 -109527 -66878 -16110 228106 327743 1588 -41099 -47304
10045 -47304 52456 -105459 -225768 -197935 158057 37159 -272450 -320479 -93426 208073 26312
10033 93948 -186405 -133627 -81457 -214282 -56339 396098 72806 -8665 218568 -129273 -51047
10021 -95840 -2934 267448 -18979 57715 -249912 -51864 -22736 -195951 -27608 129505 -154280
10009a00909j7964A46423a02960M2821j39780d5458r9263E8167a47322g3361c5962
9997b85110J37918M8794j9485A22275l8144B9405a5488j37439l404F3115J68473
9986B31588A0358J58355b6117A06847c28033B5115a43257d3206A60352d7984A0100
9974b6940j38193c2193B64764n8210O0214a81342e7417A98050h0282j15919o1269
9963b57470B54276a77582o9008h6978q8449g9286E1969J78087E5815g4303A26678
9951a27983a8498l77577d053j75271A44443a4719A73747F1247d2838H4215l4873
9940D9342R6455D5223c385o5128D922f0421r2459a0596o1946B45481a07725L4350
9928g3375j31514d4087C1134K69534b61376R8178K9352B67218c50336A4851a5149
$$ plain form
10009 -100909 -118873 146423 -102960 -60139 -199919 -45458 -144721 58167 -147322 -73361 -35962
9997 -285110 -147192 -98398 -117883 122275 84131 29405 -15488 -152927 -156331 63115 231588
9986 231588 10358 168713 -26117 106847 -328033 25115 -143257 -43206 160352 -47984 10100
9974 -26940 -165133 -32193 264764 206554 266768 -181342 -57417 198050 -80282 -196201 -257470
9963 -257470 254276 -177582 -246590 -86978 -175427 -79286 51969 230056 55815 -74303 126678
9951 -127983 -18498 -396075 -4053 -179324 144443 -14719 173747 61247 -42838 84215 49342
9940 49342 145797 45223 -3385 -68513 4922 -60421 -152880 -10596 -72542 245481 -107725 -73375
9928 -73375 -204889 -44087 31134 300668 -261376 -163198 -133846 267218 -350336 14851 -15149
9916A7851g2495n2612k87360G5918a73496a1868A6658c10103a29894A8326n36
9905A7790O1363g2231A08175K01011b09558E3906a07088C4064b29327R5574k3660
9894a57413O7118j06242i5902o7000C2351i1359r5737Q4711J4740A57003C3236
9882d2316A72613l3429K2042h1013A66262a0196k51489a3814j91630j27450H643
9870a17914a836k5078B9027b23420c3240R452m5419k9306I8960e9043B20844a68686
9857A63822a34478j78559A01795K3308e719H034K68668C851c94544N9105f0531
9845a88578J7134j62843C5962d6987j48379e4311J5208C2911g6814j25115M4818
9834a57111A81152J23220c53486c7813D7649a74546C3633a94457g1232A21065
$$ plain form
9916 17851 -72495 -125107 -412467 75918 -173496 -11868 16658 -310103 -129894 18326 17790
9905 17790 79153 -72231 108175 309186 -209558 53906 -107088 34064 -229327 -133753 -157413
9894 -157413 -90295 -196537 -95902 -162902 32351 -91359 -187096 -102385 -87645 157003 33236
9882 -42316 172613 139184 161226 -81013 166262 -10196 -261685 -13814 -205444 -332894 8643
9870 -117914 -1836 -26914 29027 -223420 -33240 -23788 -69207 -98513 98960 -59043 220844 -168686
9857 163822 -134478 -313037 101795 125103 -5719 8034 276702 3851 -394544 -335439 -60531
9845 -188578 -171444 -334287 35962 -46987 -195366 -54311 -39103 32911 -76814 -201929 -157111
9834 -157111 181152 304372 -353486 -37813 47649 -174546 33633 -194457 -71232 121065
9823a24000b6469j28562E7267d0024B5829e7964j84045j45966a48307D0633O273
9812D6906J04866a69437j17147c8666B89977J9643n0421a27206E28720d8646G779
9800a15318g928m1456B1300k845a029B55254a68759A15870a34172N2787A29700
9788a45006M5481c8882A41731h6295B6278p938g2965I6335q851a32131l21589
9777d53720J70757p5058d2503j43757j44530a47102m9361d7255J2330r2231k21579
9766c48735C06J04477a16490A71276d4393j79300m3565A25179i8492j44718g4210
9754D27714c59317F1082a76893b6351l6492D2765h5823A5457P7905B7447c04282
9742A91157b37130g8333b6947k95161f3336A79991a65395B12252d3420q5009A0800
$$ plain form
9823 -124000 -26469 -155031 57267 -40024 25829 -57964 -242009 -387975 -148307 40633 46906
9812 46906 151772 -169437 -286584 -38666 289977 309620 259199 -127206 528720 -48646 7779
9800 -115318 -7928 -49384 21300 18455 -1029 255254 -168759 115870 -134172 -81385 129700
9788 -145006 -99525 -38882 141731 -86295 26278 18340 -72965 96335 87484 -132131 -453720
9777 -453720 -282963 -358021 -42503 -186260 -330790 -147102 -196463 -47255 -34925 -127156 -348735
9766 -348735 306 104783 -116490 171276 -44393 -223693 -267258 125179 -98492 -243210 -74210
9754 427714 -359317 61082 -176893 -26351 -62843 42765 -85823 15457 93362 27447 -304282
9742 191157 -237130 -78333 -26947 -322108 -63336 179991 -165395 212252 -43420 -128429 10800
9730e0337A05437d76755a63135J8971I5888f9399B1039f8785n3702j00716c3269
9718c36545C4786N8834g3502k69586R6935o4583o4215a47858A16962b9469A49684
9706g4890A47933f3968K5361A48653k8131a33531j6945f9530j10821h0072r6749
9695a76821A36940D6308c7156B8743d57007a76497N1640P182A46902b87510g221
9683A12629e7952k65342J45811j39442J43532A70665H0688d41740b14471E1336
9672c6523q5657b2348k08413h919p9999A4341f9232o1938j59086M0451a17719
9660A76027D471M45836e3598j27550d7603j20201l2090R5364E1116N295O1617
9649A18028a68889A07247l8765J09350J12062G3162a0361l03388a37615I6597
$$ plain form
9730 -50337 105437 -476755 -163135 -144164 95888 -69399 21039 -68785 -122487 -223203 -33269
9718 -336545 34786 93620 -73502 -343088 -246153 -310736 -374951 -147858 116962 -29469 149684
9706 -74890 147933 -63968 -38607 148653 120522 -133531 -150476 -69530 -180351 -80072 -176821
9695 -176821 136940 46308 -37156 28743 -457007 -176497 -124857 -117675 146902 -287510 -7221
9683 112629 -57952 -323294 -177483 -316925 -173393 170665 80688 -441740 -214471 51336
9672 -36523 -122180 -22348 -230761 -8919 -88918 14341 -69232 -131170 -290256 -249805 -117719
9660 176027 4471 450307 -53598 -181148 -47603 -167804 -199894 -104530 51116 56411 118028
9649 118028 -168889 107247 68482 177832 289894 73162 -10361 -313749 -137615 96597
9638d52398B73118b18453b4507k42233I026c4795r3325b8006n7808F1884q523
9627E3361L9534C7212a27882k7005J3999r631M5222K2931o5511B69524c4830j9892
9615e4722H4968a83659j1546C7117J99537D1394P7892D3619b49011f9292q761
9604g8053j76938A8114b83980A66388b63645O9096R2989K4452D3724K2580J10546
9593A76850o9388c73924O7936b4168j12623p1701J2173B65354a8051m2024o2672
9582a22747p6079i0002o497A12165J85176a29168N6396b6353p9841k04658d2369
9570B8992a30943d3398k53999I079b8536j33824k21836K6915h3478j8891a0163
9558e8311o9001b3160l62751J08706F4364b87975o408b0301D3843f3463j08334
$$ plain form
9638 -452398 273118 -218453 -24507 -266740 9026 -34795 -128120 -28006 -85814 61884 53361
9627 53361 92895 37212 -127882 -154887 -140888 -150519 -105297 -82366 -147877 269524 -34830 -54722
9615 -54722 84968 -183659 -195205 37117 236654 41394 119286 43619 -249011 -69292 -78053
9604 -78053 -254991 18114 -283980 166388 -263645 -194549 -101560 -77108 43724 66304 176850
9593 176850 107462 -373924 -305988 -24168 -136791 -208492 -196319 265354 -18051 -60075 -122747
9582 -122747 -198826 -90002 -96499 112165 297341 -129168 -72772 -26353 -106194 -310852 -42369
9570 28992 -130943 -43398 -297397 9079 -28536 -162360 -384196 -357281 -83478 -102369 -10163
9558 -58311 -127312 -23160 -385911 -277205 64364 -287975 -294383 -20301 43843 -63463 -171797
9547a71797r2890A05644a70200g9869H752L29067f3970A25443a57092k0940E8040
9535b88064J09893A1995a6746P404E2221K28810i1430D7797c9706j44702A347
9523A45553d6730j32327A44741f6896H8251a9222D1151J39283b66051J05727g4793
9511A75281L13317C2559L46189A8794a36104G8891k8657a01592J6407L16A80809
9499H3725K11834I129L4799A4462a71372k62054A47368d50205h0392L5771j24493
9488a69114A061d7399A0677M7632a66135j10477A39843e06473F1713a46444A00623
9476i6888E8008b72339A4876e5872B09312a04073j05040Q9131B48020j20353M5602
9465A73269E0210o414c70B08871c63407a38242f8281K7783l39588h3545l9096
$$ plain form
9547 -171797 -264687 105644 -170200 -79869 8752 337819 -63970 125443 -157092 -178032 58040
9535 -288064 -178171 11995 -16746 -9342 52221 281031 -91430 47797 -39706 -184408 1347
9523 145553 -46730 -179057 144741 -66896 88251 -19222 41151 180434 -266051 -160324 -74793
9511 175281 488598 32559 378748 18794 -136104 78891 50234 -101592 -85185 -84869 180809
9499 83725 295559 9129 43928 14462 -171372 -433426 147368 -450205 -80392 -44621 -169114
9488 -169114 1061 -47399 10677 58309 -166135 -276612 139843 -506473 61713 -146444 100623
9476 -96888 58008 -272339 14876 -55872 209312 -104073 -209113 -119982 248020 127667 173269
9465 173269 50210 43796 -370 208871 -363407 -138242 -68281 -40498 -380086 -83545 -122641
9454a22641o4235H0532a78585g8875L2430p8369C5244K0449a92352p0239q015
9443b70606m5267A37563b58251J3835I6578c30103q7884a7439j1082r3194A25714
9431b19312g6333A92726a9804k92926e6427n6056G9219g5485A09109b70770a8622
9419a65575B6978J20686D9655J52335b61151G9742a60957C3702r283J29289K48720
9408D02428j48658j08664b55018R9762O5342o1353f2779b5821A03536a29288j01123
9397b30411k8838b1346j24969N8124a2919k1825A62102F0614e1778B7458c57984
9385a91551f748j12992i04j31069j73421k79669B6141J1539c63851J29498I6036
9373a11703G5880a18705l08109a81340i675j96259C1636d5236j07726j32292A81789
$$ plain form
9454 -122641 -186876 80532 -178585 -78875 -46445 -124814 35244 55693 -192352 -262591 -270606
9443 -270606 -315873 137563 -258251 -244416 96578 -330103 -417987 -17439 -28521 -121715 125714
9431 -219312 -76333 192726 -19804 -312730 -56427 -112483 79219 -75485 109109 -270770 -18622
9419 -165575 26978 147664 49655 201990 -261151 79742 -160957 33702 24419 153708 402428
9408 402428 253770 145106 -255018 -155256 -89914 -151267 -62779 -25821 103536 -129288 -230411
9397 -230411 -259249 -21346 -146315 -88191 -12919 -34744 162102 60614 -51778 27458 -357984
9385 -191551 -6748 -119740 -904 -131973 -305394 -585063 26141 37680 -363851 -234353 96036
9373 -111703 75880 -118705 -426814 -181340 -9675 -205934 31636 -45236 -152962 -285254 181789
9361C1668b74710A17937c0137n2412A6118n036J5311K7964R5649B7784K04495
9350B32279a08810c2867o4830B52460A19149b70176H4848b47511f2160K7017A94060
9338A15692E1769i7269C6762a80473D6638d88450F471f6283r2945B08596i3595
9326a65830n715M9896B2819c33548h0718k12449a19691K4979q7157F9405e363
9314G1522a24873A08399j6663b1020A05851M5011Q2106B0492b5640C313J25947
9303A29260i3077A35912a82866N7018N4588n3930b0463j46953d7175k28376D0166
9291A1943J68725b4012A75215d82741B9995O9199a49645A57663a85848g6233j34816
9280b11049g9804n4269k7129E7774b40219o3022A20518R8745E8210d35682O4995
$$ plain form
9361 31668 -274710 117937 -30137 -82549 16118 11082 26393 54357 150006 27784 232279
9350 232279 -108810 -32867 -97697 252460 119149 -270176 84848 -247511 -62160 -35143 194060
9338 115692 51769 -97269 36762 -180473 46638 -488450 6471 -66283 -159228 208596 -93595
9326 -165830 -171545 -121649 22819 -333548 -80718 -293167 -119691 -94712 -181869 69405 -5363
9314 71522 -124873 108399 91736 -21020 105851 150862 232968 20492 -25640 3313 129260
9303 129260 -93077 135912 -182866 -125848 -71260 -125190 -20463 -167416 -47175 -275551 40166
9291 11943 180668 -24012 175215 -482741 29995 99194 -149645 157663 -185848 -76233 -211049
9280 -211049 -79804 -134073 -161202 57774 -240219 -303241 120518 219263 58210 -435682 -370687
9269c70687J13709H2089j8056B9025J27010C1959j2287J02158a64828j73109l2890
9258c70827F80J80973E6447l64e7731m8035j15784k22953A80497l4628a56339
9246e2274f853B43525a21844a8723k60779d4368B9743F985c9979k28733E4048
9234A5789h4047C01251a03185A04197K8033O7396a99995Q5797l8067J5099a1617
9222B86363a63500l602H0732L29535b18285Q8265F1227a37087D1233A8798m572
9211A4226i8435j1259A4709P7225a42392A53636a45244c466j78582B64049J70486
9200D34535g0345Q346k81597a50193d8663C9518I799g6678b6487O733k77357M8261
9188b48850i6208A13059L6036c55888A48128f5232G1139a50707K2089l3400L9699
$$ plain form
9269 -370687 -256978 82089 64033 29025 156035 31959 19672 121830 -164828 -337937 -370827
9258 -370827 680 181653 56447 56083 -57731 -105766 -221550 -444503 180497 145869 -156339
9246 -52274 -6853 243525 -121844 -18723 -279502 -44368 29743 6985 -39979 -268712 54048
9234 15789 -84047 301251 -103185 104197 132230 199626 -199995 -114198 -152265 -137166 -11617
9222 286363 -163500 -167102 80732 410267 -218285 -130020 61227 -137087 41233 18798 14226
9211 14226 -98435 -109694 14709 91934 -142392 153636 -145244 -3466 -182048 264049 434535
9200 434535 -70345 -61999 -343596 -150193 -48663 39518 9799 -76678 -26487 -19754 -297111 -248850
9188 -248850 -96208 113059 149095 -355888 148128 -65232 71139 -150707 -128618 -162018 -122319
9177a22319A50286b6536l22999B4298a35735L9590c215F0154i6859B09969A556
9165A78004e3968A40452J02495d9400k4444c1551C0204e0569j8370m3691j32253
9154b44883A46471a40316A54790b47123N6617A66128i8681B77470q5533F4247
9143A26016i470l46907d078m3752A97873c06996A32498i6939c4801H3790h4489
9131f4910D9370a12504L4305F1441j2698J46614H6705a78651d7194K3167B05642
9119b68774A17879K04605b30206B0913a809n7806B39612a04639C2113O9659i0958
9107e53662b08937N8953f6654B09008h527k36816D2540h8296l26640d5775A37291
9095a06288l1152M2403L934c8987A3423P769d5153p1170C61771b11061g5354B0448
$$ plain form
9177 -122319 150286 -26536 -349535 24298 -135735 -96145 -3215 60154 -96859 209969 1556
9165 178004 -53968 140452 242947 -49400 -73844 -31551 30204 -50569 -68939 -112630 -244883
9154 -244883 146471 -140316 154790 -247123 -190506 166128 -98681 277470 191937 64247
9143 126016 -9470 -356377 -4078 -47830 197873 -306996 132498 -96939 -34801 83790 -84489
9131 -64910 49370 -112504 -78199 61441 48743 195357 86705 -178651 -47194 -24027 205642
9119 -268774 117879 322484 -230206 20913 -1809 -59615 239612 -104639 32113 101772 -90958
9107 -553662 -208937 -149984 -66654 209008 -8527 -245343 42540 -88296 -414936 -45775 137291
9095 -106288 -137440 -95037 -91103 -38987 13423 21192 -45153 -116323 361771 -211061 -75354 20448
9082b13827A63412O7106a65188g3991R579q8813d1832q5344C0735c13328a31772
9070f7783k11274R5982K8695m2644O1583J6378b5540A11265b47683Q2444r1318
9059b56557h0819p7483d3200m3258A56546a77030J8925N4123M7442m8231A2573
9047A11410j1857d04167B34590a80483A31633f5084A29402b91051O1023g632j00430
9036a08062o9489j32023B5678a14716A64360c6717j80136e6733A4646N5833e57932
9024a6576I0927c18174F4558a46635d1547r0583A19140J213M0079b20276A8814
9012D2992a50674M0341A05627d9803k30359B6483K80807h4129j65806F683J27280
9001A33963a00152M4004A0590b18229C29356a3620k41616e8302D4080b30795b1689
$$ plain form
9082 -213827 163412 230518 -165188 -73991 -64412 -153225 -41832 -127176 30735 -313328 -131772
9070 -67783 -279057 -183075 -154380 -197024 -135441 -119063 -25540 111265 -247683 -165239 -256557
9059 -256557 -80819 -158302 -43200 -86458 156546 -177030 -158105 -103982 -56540 -104771 12573
9047 111410 99553 -404167 234590 -180483 131633 -65084 129402 -291051 -230028 -7632 -108062
9036 -108062 -177551 -309574 25678 -114716 164360 -36717 -216853 -56733 14646 70479 -557932
9024 -16576 90927 -318174 64558 -146635 -41547 -132130 119140 120353 160432 -220276 18814
9012 42992 -150674 -110333 105627 -49803 -280162 26483 307290 -84129 -249935 6683 133963
9001 133963 -100152 -56148 10590 -218229 329356 -13620 -255236 -58302 44080 -230795 -21689
8989C1348i6932h309C7317c12062A70541a09883M6415D6841f1046B10106b13280
8977a27052o8022i3934H6807b07000E9605d8442n5688J3141r0589B9094J04232
8966A33326d7711j52814C2039L869N0159Q0159F7015a02629d3608k98658g1228
8954a57753b5175k75726A1000a01227L811r863J762A0334a68944M1788C93378
8942g2357A47835o7870c54406e9736j99547C58709b19465d1360n3440a4941a010
8930C8330a33215P656G9076J51642E2119k3039A3397b68514C11001N7621l8398
8919C30224A807b43859A25097A505J71827c89608a76703O468k628B63385F938
8907c2725H3042b89989B00348c03588j7524J34154H0624d8181j02673N1278b4848
$$ plain form
8989 31348 -96932 -8309 37317 -312062 170541 -109883 -63468 46841 -61046 210106 -213280
8977 -127052 -195074 -93934 86807 -207000 59605 -48442 -104130 -90989 -181578 29094 133326
8966 133326 -47711 -200525 32039 35908 86067 166226 67015 -102629 -43608 -342266 -71228
8954 -157753 -25175 -300901 11000 -101227 -97416 -107279 -105517 10334 -168944 -127156 393378
8942 -72357 147835 79965 -354406 -59736 -259283 358709 -219465 -41360 -94800 -14941 -1010
8930 38330 -133215 -125559 79076 230718 52119 29080 13397 -268514 311001 368622 330224
8919 330224 1807 -243859 125097 1505 173332 -389608 -176703 -170235 -172863 263385 6938
8907 -32725 83042 -289989 200348 -303588 -321112 -186958 80624 -48181 -150854 -99576 -24848
8895B27984b31703J00770M2145E2319i0133A82101C4425b20610B05108h3974k58910
8884c42884i1528O222B80175h6786j88156j32287a78043l05230G1142M6964B4779
8872a52605B38791j11688A4515b39802A27063a77828O6003A10049i1471b4354
8861A49104c37433h0448A08785a59438H0242a87269e0791C40817A60568b66234
$$ plain form
8895 227984 -231703 -130933 -88788 52319 -90133 182101 34425 -220610 205108 -83974 -342884
8884 -342884 -91528 -85306 280175 -86786 -274942 -407229 -178043 -483273 71142 118106 24779
8872 -152605 238791 127103 14515 -239802 127063 -177828 -111825 110049 -91471 -24354
8861 149104 -337433 -80448 108785 -159438 80242 -187269 -50791 340817 160568 -266234
$$ [...]
##END NTUPLES=NMR SPECTRUM
##END=
