##TITLE=AC1729_SEN00002_9275740_F0xnw3EYGm
##JCAMPDX= 6.0         $$ Bruker NMR JCAMP-DX V2.0
##DATA TYPE= NMR SPECTRUM
##DATA CLASS= NTUPLES
##ORIGIN= BRUKER
##OWNER= Administrator
$$ 1.72 TOPSPIN		Version 2.1
$$ 2015-07-17 23:32:08.244 -0700  Administrator@X
$$ Compression mode = diff/dup
##.OBSERVE FREQUENCY= 400.02188249412
##.OBSERVE NUCLEUS= ^1H
##.ACQUISITION MODE= SIMULTANEOUS (DQD)
##.ACQUISITION SCHEME= undefined
##.AVERAGES= 64
##.DIGITISER RES= 22
##SPECTROMETER/DATA SYSTEM= spect
##.PULSE SEQUENCE= noesygpps1d.comp
##.SOLVENT NAME= COFFEE_meoh
##.SHIFT REFERENCE= INTERNAL, COFFEE_meoh, 1, 14.96098
##AUDIT TRAIL= $$ (NUMBER, WHEN, WHO, WHERE, PROCESS, VERSION, WHAT)
$$ ##TITLE= Audit trail, TOPSPIN		Version 2.1
$$ ##JCAMPDX= 5.01
$$ ##ORIGIN= Bruker BioSpin GmbH
$$ ##OWNER= Administrator
$$ $$ E:\/data/COFFEE/nmr/AC1729_SEN00002_9275740_F0xnw3EYGm/22/pdata/1/auditp.txt
$$ ##AUDIT TRAIL=  $$ (NUMBER, WHEN, WHO, WHERE, PROCESS, VERSION, WHAT)
(   1,<2015-07-17 23:32:02.932 -0700>,<Administrator>,<X>,<go>,<TOPSPIN 2.1>,
      <created by zg
	started at 2015-07-17 23:20:33.260 -0700,
	POWCHK enabled, PULCHK disabled,
       configuration hash MD5:
       21 0F 79 D6 B3 7B B4 F6 88 20 88 DB 03 48 BD 9F
       data hash MD5: 64K
       D1 29 7A DF 39 9C F0 7E 37 E8 CE DA 9D 3D E1 6D>)
(   2,<2015-07-17 23:32:06.385 -0700>,<Administrator>,<X>,<proc1d>,<TOPSPIN 2.1>,
      <Start of raw data processing
       efp LB = 0.3 FT_mod = 6 PKNL = 1 PHC0 = 0 PHC1 = 0 SI = 128K 
       data hash MD5: 128K
       BE 25 AA CC BB EC 4C EA 34 A4 1F 6C 8B C3 9E 58>)
(   3,<2015-07-17 23:32:07.338 -0700>,<Administrator>,<X>,<proc1d>,<TOPSPIN 2.1>,
      <pk PHC0 = 268.819 PHC1 = 0 
       data hash MD5: 128K
       32 49 D2 2A B1 38 99 B6 19 77 FC 1A 15 5E 81 09>)
(   4,<2015-07-17 23:32:07.729 -0700>,<Administrator>,<X>,<proc1d>,<TOPSPIN 2.1>,
      <abs ABSG = 1 
       data hash MD5: 128K
       F6 51 E8 B7 6D 6E 46 39 8C 05 51 0E CA 72 06 59>)
(   5,<2015-07-17 23:32:07.838 -0700>,<Administrator>,<X>,<proc1d>,<TOPSPIN 2.1>,
      <abs ABSG = 2 
       data hash MD5: 128K
       A9 E1 66 CD 6E 7F DA 61 BC 81 E3 22 86 43 47 BF>)
(   6,<2015-07-17 23:32:07.916 -0700>,<Administrator>,<X>,<proc1d>,<TOPSPIN 2.1>,
      <abs ABSG = 3 
       data hash MD5: 128K
       D9 B6 F9 A2 E6 F4 41 C1 EF 84 1E 6C 21 21 65 CA>)
(   7,<2015-07-17 23:32:07.994 -0700>,<Administrator>,<X>,<proc1d>,<TOPSPIN 2.1>,
      <abs ABSG = 4 
       data hash MD5: 128K
       2A 40 51 4C FC 92 41 EB A8 44 6D FE EA 36 F5 86>)
(   8,<2015-07-17 23:32:08.072 -0700>,<Administrator>,<X>,<proc1d>,<TOPSPIN 2.1>,
      <abs ABSG = 5 
       data hash MD5: 128K
       BE 2D 3E A5 32 9F ED CD 93 66 8A A7 9E 08 F4 1C>)
$$ ##END=
$$ 
$$ $$ hash MD5
$$ $$ 5D F7 9A 8D DB 60 D3 C0 4A 9F 59 EE 23 9C 27 E2
##$RELAX= 
##$RELAX= 
##$RELAX= 
##$RELAX= 
##$RELAX= 
##$RELAX= 
##$RELAX= 
##$RELAX= 
$$ Bruker specific parameters
$$ --------------------------
##$DU= <E:\>
##$EXPNO= 22
$$ [...]
150 150 150 150 150 150 150 150
##$TP07= 0
##$TPNAME0= <>
##$TPNAME1= <>
##$TPNAME2= <>
##$TPNAME3= <>
##$TPNAME4= <>
##$TPNAME5= <>
##$TPNAME6= <>
##$TPNAME7= <>
##$TPOAL= (0..7)
0.5 0.5 0.5 0.5 0.5 0.5 0.5 0.5
##$TPOFFS= (0..7)
0 0 0 0 0 0 0 0
##$TUNHIN= 0
##$TUNHOUT= 0
##$TUNXOUT= 0
##$USERA1= <user>
##$USERA2= <user>
##$USERA3= <user>
##$USERA4= <user>
##$USERA5= <user>
##$V9= 5
##$VALIST= <valist>
##$VCLIST= <CCCCCCCCCCCCCCC>
##$VD= 0
##$VDLIST= <DDDDDDDDDDDDDDD>
##$VPLIST= <PPPPPPPPPPPPPPP>
##$VTLIST= <TTTTTTTTTTTTTTT>
##$WBST= 2048
##$WBSW= 25
##$XGAIN= (0..3)
0 0 0 0
##$XL= 0
##$YL= 0
##$YMAX_a= 5932901
##$YMIN_a= -10823800
##$ZGOPTNS= <>
##$ZL1= 120
##$ZL2= 120
##$ZL3= 120
##$ZL4= 120
##$ABSF1= 14.96098
##$ABSF2= -5.597201
##$ABSG= 5
##$ABSL= 3
##$ALPHA= 0
##$AQORDER= 0
##$ASSFAC= 0
##$ASSFACI= 0
##$ASSFACX= 0
##$ASSWID= 0
##$AUNMP= <proc_prof1d_extract.lims>
##$AXLEFT= 0
##$AXNAME= <>
##$AXNUC= <1H>
##$AXRIGHT= 0
##$AXTYPE= 0
##$AXUNIT= <>
##$AZFE= 0.1
##$AZFW= 0.1
##$BCFW= 0
##$BC_mod= 0
##$BYTORDP= 0
##$COROFFS= 0
##$CY= 15
##$DATMOD= 1
##$DC= 0
##$DFILT= <>
##$DTYPP= 0
##$F1P= 0
##$F2P= 0
##$FCOR= 0.5
##$FTSIZE= 131072
##$FT_mod= 6
##$GAMMA= 0
##$GB= 0
##$INTBC= 1
##$INTSCL= 1
##$ISEN= 128
##$LB= 0.3
##$LEV0= 0
##$LPBIN= 0
##$MAXI= 10000
##$MC2= 0
##$MEAN= 0
##$ME_mod= 0
##$MI= 0
##$NCOEF= 0
##$NC_proc= -2
##$NLEV= 6
##$NOISF1= 0
##$NOISF2= 0
##$NSP= 0
##$NTH_PI= 0
##$NZP= 0
##$OFFSET= 14.96098
##$PC= 1
##$PHC0= 268.819
##$PHC1= 0
##$PH_mod= 1
##$PKNL= yes
##$PPARMOD= 0
##$PPDIAG= 0
##$PPIPTYP= 0
##$PPMPNUM= 2147483647
##$PPRESOL= 1
##$PSCAL= 4
##$PSIGN= 0
##$PYNMP= <proc.py>
##$REVERSE= no
##$SF= 400.020009644086
##$SI= 131072
##$SIGF1= 0
##$SIGF2= 0
##$SINO= 400
##$SIOLD= 131072
##$SPECTYP= <>
##$SREGLST= <1H.CDCl3>
##$SSB= 0
##$STSI= 131072
##$STSR= 0
##$SW_p= 8223.68421052631
##$SYMM= 0
##$S_DEV= 0
##$TDeff= 65536
##$TDoff= 0
##$TI= <>
##$TILT= no
##$TM1= 0
##$TM2= 0
##$TOPLEV= 0
##$USERP1= <user>
##$USERP2= <user>
##$USERP3= <user>
##$USERP4= <user>
##$USERP5= <user>
##$WDW= 1
##$XDIM= 131072
##$YMAX_p= 432076253
##$YMIN_p= -10895
##$CURPLOT= <Network HP LaserJet P1505>
##$CURPRIN= <$Network HP LaserJet P1505>
##$DFORMAT= <normdp>
##$LAYOUT= <+/1D_H.xwp>
##$LFORMAT= <normlp>
##$PFORMAT= <normpl>
##$SURQMSG= 1
$$ End of Bruker specific parameters
$$ ---------------------------------
##NTUPLES= NMR SPECTRUM
##VAR_NAME=  FREQUENCY,     SPECTRUM/REAL,   SPECTRUM/IMAG
##SYMBOL=    X,             R,               I
##VAR_TYPE=  INDEPENDENT,   DEPENDENT,       DEPENDENT
##VAR_FORM=  AFFN,          ASDF,            ASDF
##VAR_DIM=   131072,        131072,          131072
##UNITS=     HZ,            ARBITRARY UNITS, ARBITRARY UNITS
##FACTOR=    0.0627417313425164, 1,          1
##FIRST=     8223.62146879497, 470,          -50759
##LAST=      0,             1843,            -51022
##MIN=       0,             -10895,          0
##MAX=       8223.62146879497, 432076253,    0
$$ Real data points
##PAGE= N=1
##DATA TABLE= (X++(R..R)), XYDATA
$$ [...]
67939 76127 78119 79213 79350 79279 79457 79559 79174 78537 78256 78587 79327 80263 81397 82636 83536 83566 82702 81706
67921 81706 81625 82897 84977 86896 88090 88639 88889 89049 89032 88491 87125 85118 83117 81571 80312 79052
67905 79052 77980 77370 76879 75938 74800 74455 75315 76661 77625 78068 78170 77830 77048 76437 76673 77678 78851
67888 78851 79867 80763 81431 81602 81273 80742 80263 79984 80047 80387 80591 80338 79808 79235 78342 76790 74968 73663
67870 73663 73074 72861 73102 74310 76340 78078 78657 78375 78006 77826 77752 77926 78500 79144 79344 79058 78650 78353
67852 78353 78152 78012 77819 77289 76311 75239 74451 73822 73000 72040 71305 70890 70588 70357 70280 70146 69572 68612 67774
67833 67774 67384 67397 67863 69034 70817 72598 73873 74652 75093 75232 75392 76259 78113 80371 82411 84454 87018
67816 87018 89759 91605 92055 91625 90917 89883 88319 86489 84806 83277 81684 80090 78701 77402 75931
67801 75931 74386 73104 71990 70544 68699 67166 66589 66706 66742 66354 65740 65013 64108 63315 63223 63858 64399 64184
67783 64184 63603 63511 64053 64618 64817 64843 64854 64646 64150 63818 64126 65014 66078 67131 68319 69791 71395 72644
67765 72644 73040 72665 72396 73112 74638 75884 76176 75934 75817 75816 75680 75670 76174 76856 76932 76280 75645 75712 76487 77610
67745 77610 78746 79512 79512 78634 77091 75137 73057 71334 70366 69980 69648 69144 68590 67858 66574 64829 63303
67728 63303 62483 62288 62644 63744 65370 66565 66589 65797 65067 64683 64298 63730 63211 62999 63159 63586 63902 63539
67710 63539 62387 61167 60724 61069 61517 61651 61704 62068 62823 63734 64303 63928 62414 60330 58569 57556 57140
67693 57140 57045 57082 57117 57244 57805 58815 59592 59577 59320 59948 61642 63392 64341 64639 64810 65024 65359 66119 67333
67674 67333 68370 68576 68031 67346 66972 67022 67490 68256 69083 69844 70531 70912 70568 69548 68527 67988 67639 67097
67656 67097 66715 67109 68130 69035 69608 70437 71894 73424 74192 74103 73829 73915 74106 73717 72571 71342 70733 70453
67638 70453 69472 67422 65276 64345 64995 66696 68896 71248 73212 74199 74178 73670 73079 72477 72010 71981 72340 72574
67620 72574 72349 71913 71684 71782 72148 72752 73396 73609 73155 72568 72832 74423 76786 78786 79691 79690 79440 79159 78429
67601 78429 76986 75326 74138 73408 72655 71871 71494 71374 70621 68875 67023 66029 65594 64707 63210 61983 61640
67584 61640 61763 61628 61131 60745 60956 61929 63420 64809 65502 65464 65176 64968 64672 64051 63216 62417 61722 61196 61186
67565 61186 62007 63421 64741 65515 65856 66104 66365 66484 66282 65675 64633 63194 61549 60077 59201 59128 59717
67548 59717 60639 61635 62543 63125 63139 62657 62087 61740 61519 61260 61195 61695 62633 63390 63571 63359 63009 62396 61355
67529 61355 60195 59413 58969 58245 56770 54747 52772 51317 50597 50705 51597 52972 54337 55265 55635 55653 55637
67512 55637 55669 55463 54689 53437 52226 51486 51158 50905 50599 50477 50859 51787 52908 53660 53678 53143 52713 52999 54103
67493 54103 55649 57125 58154 58575 58554 58552 58950 59601 59931 59602 58924 58460 58294 57976 57209 56347 55994 56271 56739
67474 56739 57026 57239 57617 58104 58484 58780 59156 59509 59488 59028 58569 58617 59216 59974 60471 60615 60701 61189 62228 63388
67454 63388 64089 64311 64598 65212 65678 65394 64483 63639 63243 62930 62047 60382 58490 57377 57728 59291 61208
67437 61208 62984 64815 66785 68305 68852 68872 69228 69948 70294 70062 69932 70287 70420 69366 67052 64243 61785
67420 61785 60269 59960 60484 60900 60580 59813 59174 58660 57976 57303 57104 57328 57529 57741 58490 59808 60931 61247
67402 61247 60995 60723 60535 60282 60039 59948 59853 59550 59172 58938 58751 58479 58497 59388 61018 62457 62998 62896 62882 63210
67382 63210 63493 63313 62663 61838 61116 60596 60194 59722 59128 58659 58675 59228 59961 60508 60824 60974 60808 60164 59354
67363 59354 59054 59532 60331 60892 61240 61728 62396 62996 63539 64287 65112 65381 64698 63461 62406 61857 61660 61623 61685
67344 61685 61813 62009 62406 63122 64076 65048 65814 66134 65857 65281 65166 65985 67273 68144 68413 68789 69875 71413
67326 71413 72697 73369 73525 73341 72970 72712 72868 73320 73528 73092 72257 71684 71690 71859 71529 70621 69721 69346 69433 69736
67306 69736 70357 71438 72603 73281 73588 74255 75562 76847 77391 77246 76856 76322 75564 74871 74671 74884 75054 75119
67288 75119 75512 76434 77461 77995 77814 77073 76129 75447 75349 75677 75940 75855 75489 74865 73871 72758 72269 72888 74230
67269 74230 75576 76834 78494 80686 82787 84130 84730 85069 85392 85512 85254 84839 84701 85018 85501 85676 85316
67252 85316 84576 83725 82865 81975 81189 80811 80907 80949 80157 78355 76355 75280 75509 76463 77401 78116 78791 79470 79990
67233 79990 80251 80254 79944 79325 78735 78725 79554 80904 82121 82620 82173 81114 80274 80426 81643 83306 84732 85624
67215 85624 85967 85887 85718 85838 86208 86364 86117 85981 86540 87572 88220 88050 87557 87522 88077 88643 88738 88687 89371 91191
67195 91191 93358 94463 93840 92204 90831 90316 90340 90420 90521 90915 91787 93159 94982 97081 99043 100405 101074
67178 101074 101462 102065 102898 103499 103543 103262 103105 103157 103166 102976 102620 102113 101568 101504 102461 104176 105626 106157 106159 106352
67158 106352 106915 107710 108841 110379 111826 112555 112690 112917 113502 114066 114351 114599 115030 115522 115980 116543 117237 117840
67140 117840 118320 118970 119850 120545 120786 120901 121206 121306 120555 119111 117971 117916 118787 119919 120927 121827 122626 123206
67122 123206 123701 124681 126580 128973 130814 131589 131918 132648 133653 134067 133610 133044 133181 133986 134943 135777 136469
67105 136469 136923 137067 137112 137370 138014 139224 141250 143960 146569 148277 149043 149391 149623 149725 149882 150479 151548
67088 151548 152683 153689 154897 156673 158950 161421 163885 166128 167698 168130 167453 166345 165771 166392 168160
67073 168160 170421 172463 173914 174623 174458 173609 172946 173529 175571 178245 180658 182660 184502 186163 187458
67058 187458 188568 189949 191684 193285 194252 194655 195111 196317 198583 201642 204852 207630 209746 211250 212315
67043 212315 213235 214369 215894 217736 219899 222622 225899 229025 231129 232174 233044 234522 236581 238768 240829
67028 240829 242672 244143 245282 246591 248597 251215 253933 256518 259142 261829 264265 266314 268313 270610
67014 270610 273136 275670 278259 281081 284037 286843 289483 292235 295299 298654 302293 306272 310369 314023
67000 314023 316872 319247 321864 325095 328802 332886 337612 343075 348590 353105 356355 359259 362958 367671
66986 367671 372734 377428 381424 384666 387417 390371 394160 398589 402934 407170 412266 418818 425958 432289
66972 432289 437515 442443 447626 452888 458193 464038 470636 477398 483753 489997 496788 504121 511383 518279
66958 518279 525210 532751 541150 550309 559889 569367 578321 586852 595564 605007 615240 625977 636990
66945 636990 648215 659569 670884 682153 693723 705983 718791 731412 743274 754735 766852
66934 766852 780384 795235 810798 826515 842012 857123 872139 887840 904990 923734 943549
66923 943549 963646 983330 1002248 1020569 1038906 1057909 1077959 1099251 1121847 1145470 1169503
66912 1169503 1193526 1217753 1242682 1268433 1294691 1321127 1347568 1373825 1399798 1425820 1452575
66901 1452575 1480509 1509469 1539001 1568851 1599086 1629829 1660929 1691922 1722419 1752575 1782966
66890 1782966 1813835 1844709 1875052 1905054 1935340 1965988 1996328 2025745 2054218 2081895 2108576
66879 2108576 2133834 2157394 2179162 2199144 2217550 2234770 2251007 2266107 2279867 2292280 2303224
66868 2303224 2312218 2318879 2323514 2326869 2329207 2330018 2328710 2325289 2320091 2313038 2303542 2291275 2276832 2261336
66854 2261336 2245398 2228622 2210233 2189950 2168086 2144948 2120530 2094776 2067823 2039840 2010900
66843 2010900 1981213 1951309 1921682 1892289 1862550 1831937 1800490 1768737 1737159 1705808 1674482
66832 1674482 1643212 1612351 1582090 1552157 1522264 1492637 1463679 1435256 1406828 1378392 1350676
66821 1350676 1324148 1298302 1272337 1246185 1220418 1195445 1171311 1148071 1125751 1103899 1081738
66810 1081738 1058996 1036282 1014466 993918 974437 955633 937244 919242 901765 884824 868100
66799 868100 851261 834452 818159 802563 787354 772302 757601 743425 729514 715591 701954
66788 701954 689183 677278 665468 652959 639690 626325 613742 602531 592730 583804 574998 565851
66776 565851 556393 546837 537238 527559 518027 509193 501464 494593 487793 480484 472839 465450 458575 451991
66762 451991 445573 439657 434577 430070 425416 420085 414038 407539 401008 394941 389582 384549 379105 372970
66748 372970 366629 360724 355416 350509 345977 342051 338818 335915 332639 328383 323125 317639 312999 309649
66734 309649 306981 304025 300416 296497 292656 288955 285401 282146 279173 276069 272458 268577 265180 262753
66720 262753 260976 259080 256666 254019 251573 249244 246512 243138 239511 236149 233103 230119 227235 224844
66706 224844 223177 221959 220666 218955 216822 214533 212416 210590 208892 207161 205519 204128 202803 201136
66692 201136 198965 196409 193560 190606 188199 187022 186770 186130 184231 181659 179587 178276 177028 175339 173445
66677 173445 171733 170185 168548 166664 164553 162442 160741 159702 159118 158598 158035 157463 156659 155398 154117
66662 154117 153652 154164 154793 154626 153601 152212 150786 149381 148084 146979 145958 144854 143655 142452 141359
66647 141359 140545 140060 139490 138195 136140 134148 132958 132403 131876 131247 130753 130258 129356 128213 127663 128206 129305
66630 129305 129829 128993 126841 124179 122177 121635 122403 123635 124650 125329 125699 125592 124926 123992 123138 122344 121364
66613 121364 120169 119010 118114 117487 116943 116217 115099 113614 112049 110776 110080 110071 110592 111196 111407 111114 110500
66596 110500 109596 108165 106193 104143 102494 101264 100231 99424 99067 99202 99668 100317 100945 101128 100557 99535
66580 99535 98740 98458 98353 98108 97912 98095 98533 98711 98302 97511 96867 96711 96852 96760 96212 95631 95542 95762 95556 94676
66560 94676 93841 93883 94749 95719 96383 96911 97408 97470 96670 95230 93906 93211 92901 92366 91404 90408 89709 89034 87948
66541 87948 86696 86104 86572 87600 88484 89024 89299 89202 88626 87770 86770 85368 83497 81889 81387 81778 82068
66524 82068 81889 81849 82337 82812 82663 82096 81653 81377 80985 80489 80134 80022 80238 81028 82303 83266 83097 81868 80301
66505 80301 78817 77353 75961 74897 74046 72884 71267 69850 69442 70216 71662 73094 74094 74687 75183 75759
66489 75759 76257 76538 76831 77400 78018 78226 78059 78000 78159 78005 77117 75717 74241 72808 71444 70475 70313 71009
66471 71009 72257 73675 74892 75637 75962 76201 76481 76568 76357 76187 76342 76517 76237 75649 75449 76020 77021 77851
66453 77851 78246 78397 78694 79342 80049 80133 79211 77738 76653 76489 77010 77585 77649 76902 75473 73979 73083 72827
66435 72827 72654 72155 71544 71251 71330 71504 71614 71736 71932 72150 72384 72755 73352 74054 74536 74510 74037 73613 73804 74619
66415 74619 75369 75297 74380 73352 72907 72960 72782 71825 70359 69278 69244 70052 70865 71051 70712 70350 70196 70061 69772
66396 69772 69492 69520 69957 70702 71623 72519 73030 72866 72132 71187 70131 68714 66924 65414 65019 65850 67114 67918
66378 67918 68087 68140 68605 69502 70436 71026 71167 70970 70591 70215 70103 70405 70864 70863 69962 68388 66914 66254 66593
66359 66593 67599 68762 69724 70383 70737 70719 70290 69647 69111 68731 68197 67313 66348 65759 65672 65909 66345 66968 67635
66340 67635 68088 68256 68335 68502 68720 68814 68658 68291 67924 67733 67559 67022 66098 65306 65085 65264 65527 66082 67284
66321 67284 68798 69759 69824 69456 69107 68762 68419 68338 68530 68584 68392 68485 69184 69848 69554 68217 66576 65284 64477
66302 64477 64002 63660 63328 63226 63874 65418 67258 68696 69770 70952 72278 73336 73992 74486 74790 74504 73581
66285 73581 72618 72153 72056 71884 71520 71126 70695 70007 68986 67786 66533 65232 64025 63372 63690 64867 66335
66268 66335 67665 68804 69577 69454 68307 67130 67192 68431 69420 69176 68273 67762 67735 67669 67585 67892 68315 67931 66416
66249 66416 64579 63476 63487 64345 65631 67065 68602 70243 71621 72006 71190 70071 69768 70281 70725 70770 71002
66232 71002 71741 72360 72129 71117 69881 68882 68608 69658 72044 74717 76364 76557 75816 74810 73861 73046 72382
66215 72382 71961 72018 72652 73331 73096 71606 69695 68501 68297 68614 69204 70243 71589 72500 72395 71609 71033 71112
66197 71112 71426 71305 70670 70055 69839 69730 69271 68658 68631 69543 70893 71929 72380 72462 72453 72442 72288 71689 70530 69258
66177 69258 68566 68597 68823 68880 69020 69423 69582 68957 67928 67479 67991 68882 69402 69307 68723 67865 67065 66714 66931 67475
66157 67475 68071 68654 69211 69626 69791 69725 69486 69133 68854 68967 69633 70585 71278 71382 71104 70943 71032 70786 69447
66138 69447 67094 64911 64264 65566 68139 70963 73312 74815 75394 75360 75397 76170 77778 79584 80693 80727 80097
66121 80097 79401 78674 77587 76305 75596 75786 76119 75708 74897 74948 76359 78142 79016 78861 78583 78884 79654 80514
66103 80514 81416 82524 83786 84919 85698 86005 85652 84518 82958 81729 81262 81188 80916 80498 80505 81116 81878 82423
66085 82423 82884 83358 83526 83203 82847 82972 83369 83525 83629 84473 86275 88189 89206 89112 88361 87461 86763 86518
66067 86518 86720 87059 87314 87680 88389 89119 89196 88463 87568 87200 87288 87253 86916 86708 86909 87101 86714 85883 85331 85468
66047 85468 86009 86514 86910 87341 87866 88511 89312 90103 90535 90615 90932 91978 93407 94355 94370 93684 92746 91936 91700
66028 91700 92406 93831 95190 95912 96220 96750 97800 99158 100476 101603 102568 103399 103998 104194 103989 103728 103882
66011 103882 104553 105341 105850 106250 107148 108883 111150 113408 115535 117884 120743 124026 127542 131276 135122
65996 135122 138557 141029 142684 144340 146590 149204 151533 153245 154463 155386 156037 156264 155807 154467 152338
65981 152338 149823 147314 144984 142907 141173 139750 138366 136628 134202 130969 127261 123870 121432 119746
65967 119746 118174 116740 116142 116463 116561 115376 113283 111537 110754 110642 110880 111418 112001 112201 112098 112363 113533
65950 113533 115582 118152 120751 122828 124172 125223 126497 127831 128820 129792 131512 133892 135908 137059 138057
65935 138057 139652 141583 143247 144710 146351 147963 148959 149248 149290 149482 150008 151154 153222 156107 159335 162531
65919 162531 165573 168412 171063 173751 176762 180122 183540 186658 189270 191539 194039 197324 201212 204771
65905 204771 207212 208544 209173 209258 208849 208253 207756 207153 206077 204617 203118 201508 199360 196547 193208 189114
65889 189114 183817 177683 172031 167749 164218 160254 155778 151836 149042 146777 144230 141582 139572 138204
65875 138204 136599 134123 131066 127996 125015 122088 119655 118278 117834 117632 117345 117296 117745 118465 119199 120047
65859 120047 121045 121772 121755 121037 120070 119270 118914 119189 119986 120817 121288 121576 122142 123090 124060 124653 124727 124396 124005
65840 124005 123988 124502 125258 125890 126388 126989 127827 128859 130003 131140 132208 133516 135708 139113 143390 148057
65824 148057 153096 158567 164000 168764 172934 177134 181561 185722 189183 191949 193928 194618 193672 191378 188306
65809 188306 184813 181140 177610 174337 170955 167095 163031 159579 157288 155891 154549 152599 150162 148037
65795 148037 146886 146554 146299 145629 144647 143635 142721 142103 142208 143334 145330 147855 150730 153902 157334 161181
65779 161181 165852 171551 177875 184142 190003 195474 200499 204802 208070 209944 209932 207710 203606 198384 192471
65764 192471 185768 178423 171424 165944 162221 159515 157179 155372 154513 154446 154642 155133 156736 160171 165317
65749 165317 171596 178767 186959 196078 205688 215438 225148 234375 242380 248803 253966 258213 261247 262503
65735 262503 261853 259459 255140 248508 239826 230131 220318 210528 200670 191107 182362 174388 166624 158765
65721 158765 151146 144377 138835 134530 131134 128079 124946 121966 119872 119082 119125 119126 118678 117987 117236 116247 114869
65704 114869 113359 112088 111090 110190 109412 108893 108403 107425 105930 104746 104789 106105 107968 109841 111769 113827
65688 113827 115688 117044 118103 119239 120338 120992 121402 122568 125291 129246 133352 136903 140084 143479 147498
65673 147498 152393 158501 166091 174981 184544 194300 204488 215820 228494 241479 253075 262372 269999
65660 269999 277264 284662 291448 296531 299438 300441 300238 299775 299974 301174 302895 304538 306262 308821 312460
65645 312460 316337 319278 320842 321385 321195 319885 316665 311012 302972 292995 281578 269101 255930 242623
65631 242623 229820 217752 205987 194011 182101 171341 162583 155684 149964 145092 141052 137474 133653
65618 133653 129412 125443 122509 120644 119411 118571 118139 117985 117833 117515 116868 115596 113662 111727 110615 110332
65602 110332 110136 109736 109835 111147 113265 115000 115638 115502 115361 115645 116216 116626 116579 116292 116395 117355 119088 121240
65584 121240 123658 126360 129203 131948 134664 137745 141485 145923 151207 157797 166044 175709 186171 197023
65570 197023 208261 219878 231483 242390 251964 259829 265835 269877 271713 270983 267548 261852 254768
65557 254768 246907 238219 228458 217920 207421 197579 188459 179966 172253 165490 159576 154350 149876 146182
65543 146182 142913 139644 136474 133940 132369 131639 131535 131981 132885 134171 135995 138512 141314 143507 144605
65528 144605 145029 145478 146066 146284 145540 143490 140132 135952 131800 128311 125495 123129 121340 120485 120531 120882
65512 120882 120909 120497 120051 120080 120709 121510 121886 121680 121282 121036 120821 120378 119850 119649 119863 120039 119610 118476 117274
65493 117274 117104 118746 121939 125586 128885 132023 135585 139634 143812 148086 152763 157654 161742 163961
65479 163961 164109 162888 161234 159769 158630 157550 156135 154258 152254 150608 149310 147554 144364 139718
65465 139718 134857 131130 128653 126507 124242 122557 122240 122979 123647 123426 122211 120285 118139 116434 115590
65450 115590 115415 115454 115513 115552 115366 114926 114775 115468 116777 118061 119293 120978 123072 124861 126087 127426 129515
65433 129515 132174 135017 138148 141675 145048 147508 148919 149583 149482 148341 146318 144042 141843 139436 136565
65418 136565 133613 131355 130178 129719 129186 128020 126363 124941 124507 125292 126902 128576 129640 129898 129770 129963
65402 129963 130987 132951 135680 138784 141686 143904 145494 147075 149308 152435 156237 160164 163408 165170
65388 165170 165141 163724 161653 159480 157477 155865 154938 154872 155464 156177 156616 156981 157838 159328 160896 161979 162628
65371 162628 163119 163296 162893 162247 162034 162303 162557 162854 164054 166668 170165 173846 177840 182705 188567 195211
65355 195211 202617 210770 219206 227356 235209 243027 250536 256973 261908 265464 267712 268399 267428 265165 262030
65340 262030 258129 253514 248520 243552 238637 233342 227153 219858 211724 203366 195459 188448 182430 177215
65326 177215 172533 168304 164724 161946 159720 157589 155450 153645 152359 151278 150035 148718 147586 146529
65312 146529 145131 143207 141008 139007 137709 137437 137970 138509 138374 137671 136997 136595 136242 135918 136110 137241 139131
65295 139131 141308 143688 146704 150718 155381 159633 162419 163457 163255 162419 161240 159948 158938 158382 157862
65280 157862 156839 155363 153960 152943 152229 151770 151670 151827 151883 151636 151164 150479 149455 148208 147103 146164 144881
65263 144881 142917 140676 138845 137572 136480 135241 133765 131958 129856 128044 127483 128564 130516 131974
65249 131974 132092 131010 129418 127981 127165 127239 128085 129125 129753 129937 130190 130849 131616 132019 132106 132354 132984 133715
65231 133715 134263 134704 135162 135427 135176 134443 133553 132657 131644 130565 129830 129771 130206 130655 130866 130887 130708 130186 129419
65212 129419 128869 128862 129202 129520 129871 130639 131833 132767 132637 131346 129706 128841 129254 130360 131012 130581 129429 128236
65194 128236 127192 126199 125581 126019 127752 130276 132939 135381 137330 138499 138989 139377 140136 141282 142756 144708
65178 144708 147062 149245 150814 152088 153705 155768 157812 159406 160390 160772 160925 161666 163516 165884 167597
65163 167597 168387 169411 172080 176693 182387 188052 193070 197391 201273 205058 209118 213879 219731 226845
65149 226845 235181 244783 255974 269238 285089 304095 326648 352497 380717 410337 440650 470679
65137 470679 498838 523793 545537 565196 583881 602135 620140 637616 653376 665551 672617 674009
65125 674009 669901 660959 648415 633871 618603 603015 586677 568580 547506 522817 495166 466190
65113 466190 437425 409723 383601 359544 337776 318143 300486 284793 270845 258090 246129
65102 246129 235050 225102 216336 208741 202368 197007 192014 186882 181902 177938 175458 173899 172100 169428
65088 169428 166490 164565 164248 164799 165036 164559 163781 163023 162218 161408 160869 160585 160155 159423 158778 158584 158723 158881
65070 158881 158955 158950 158839 158723 158782 158877 158522 157479 156101 155009 154749 155804 158358 161758 164684 166249 166695 166823
65052 166823 167111 167552 167856 167486 165918 163319 160684 158962 158288 158253 158534 158946 159292 159549 159849 160044 159672 158687
65034 158687 157676 156876 155476 152499 148088 143411 139602 137228 136344 136400 136458 136150 136131 136966 137948 137869 136663
65017 136663 135405 134775 134486 134206 134037 133933 133574 133184 133628 135244 137266 138955 140663 143154 146309 149208
65001 149208 151294 152837 154244 155370 155782 155522 155411 156405 158528 160652 161630 161583 161711 162880 164863 167007
64985 167007 169073 171168 173314 175480 177806 180418 183136 185530 187120 187487 186490 184465 181949 179085 175683
64970 175683 171976 168811 166762 165401 163871 161908 159888 158106 156446 154685 152732 150656 148810 147787
64956 147787 147821 148269 148123 147167 146195 145905 145883 145049 143058 140915 140047 140823 142178 142750 142229 141355 140731 140113
64938 140113 138996 137519 136372 136021 136416 137362 138744 140357 141880 143173 144328 145336 145987 146271 146577 147209
64922 147209 147814 147646 146393 144567 143036 142349 142522 143284 144351 145511 146628 147629 148521 149403 150441 151810
64906 151810 153622 155891 158543 161419 164295 167002 169578 172266 175386 179200 183890 189476 195657 201819
64892 201819 207345 211968 215794 219017 221658 223525 224408 224415 224148 224336 225072 225593 225047 223361 221091 218587
64876 218587 215735 212446 208899 205211 201409 197901 195443 194251 193585 192625 191384 190289 189236 187721 185776
64861 185776 184088 183173 182911 182903 182767 181996 180096 177103 173612 170098 166548 162869 159281 156059 153255 150915
64845 150915 149262 148377 147920 147461 146970 146797 147282 148528 150333 152191 153529 154164 154405 154611 154846 155084 155436
64828 155436 155954 156478 156943 157623 158724 159925 160714 161168 162010 163836 166515 169472 172381 175501 179391 184387
64812 184387 190346 196868 203721 210921 218461 226200 234093 242204 250258 257377 262576 265407 265919 264201
64798 264201 260299 254559 247690 240423 233269 226549 220338 214396 208455 202668 197536 193325 189791 186575
64784 186575 183640 181253 179777 179573 180804 183064 185400 186963 187665 188039 188611 189621 191237 193706 197169
64769 197169 201545 206691 212522 218892 225509 232147 238856 245780 252825 259670 266077 271977 277192 281379
64755 281379 284466 286960 289517 292192 294361 295419 295320 294336 292601 290088 286876 283081 278529 272797 265734
64740 265734 257839 249992 242806 236239 229771 222955 215883 209220 203818 200196 198260 197438 197059 196717 196323
64725 196323 195895 195412 194956 194865 195482 196717 198088 199279 200454 201899 203598 205434 207599 210389 213551 216125
64709 216125 217146 216405 214502 212252 210063 207741 204878 201504 198279 195825 193925 191695 188607 185037
64695 185037 181621 178435 175182 172039 169860 169403 170544 172319 173647 174072 174053 174598 176424 179365 182688
64680 182688 186004 189622 193955 198916 204185 209879 216540 224357 232711 240673 247795 254263 260346 265917
64666 265917 270457 273408 274458 273600 270981 266764 261180 254665 247805 241044 234547 228443 223083 218875
64652 218875 215871 213732 212093 210843 210014 209591 209592 210205 211723 214365 218197 223125 228913 235338 242442 250523
64636 250523 259752 269927 280746 292157 304166 316343 327772 337586 345394 351224 355364 358293 360444
64623 360444 361755 361627 359541 355669 350684 345080 338909 332150 325095 318229 311804 305574 299026 291912
64609 291912 284567 277555 271051 264729 258291 251812 245416 238960 232356 225923 219963 214125 207767 200993
64595 200993 194845 190316 187519 185884 184717 183446 181911 180699 180711 182025 183683 185050 186841 190125 194653
64580 194653 199099 202824 206476 210665 214933 218495 221321 223870 226142 227626 228061 227720 226929 225665 223733
64565 223733 221136 218179 215213 212307 209182 205622 201872 198416 195397 192585 189949 187807 186246 184850
64551 184850 183331 181992 181148 180461 179419 178236 177623 177684 177708 177225 176683 176798 177596 178535 179340 180299 181706 183283
64533 183283 184287 184162 183065 181752 180923 180698 180753 180829 180927 181044 181006 180721 180472 180767 181856 183474 185106 186464
64515 186464 187609 188661 189594 190462 191658 193678 196610 200097 203798 207615 211455 215184 219027 223647 229543
64500 229543 236589 244373 252655 261139 269178 276172 282037 286776 289771 290184 288073 284511 280477 276109
64486 276109 271170 265696 259937 254141 248734 244340 241225 238887 236507 233640 230356 226935 223720 221044
64472 221044 219003 217295 215496 213432 211284 209395 208042 207192 206512 205822 205559 206434 208524 211020 213033
64457 213033 214265 214731 214380 213439 212744 213073 214227 215262 215640 215712 216047 216772 217776 219235 221584 225035 229265
64440 229265 233629 237646 241386 245360 250014 255430 261553 268572 276882 286794 298460 312011 327509
64427 327509 344718 363176 382662 403631 427229 454942 488122 527653 574032 627775 689560
64416 689560 759672 837172 919601 1003432 1084899 1160899 1229727 1291164 1345598 1392796 1431452
64405 1431452 1459744 1476095 1479605 1470412 1450062 1421201 1386228 1345930 1299426 1245324 1182848 1112254
64393 1112254 1035002 954000 873249 796476 725832 661971 605174 555853 513868 478035 446840
64382 446840 419472 395801 375608 358370 343704 331375 320787 310952 301285 292060 283843 276798
64370 276798 270726 265451 260791 256351 251679 246531 240839 234695 228683 223854 220853 219134 217549 215716
64356 215716 214358 214220 215200 216786 218895 221855 225789 230516 236002 242487 249962 257764 264946 270895 275434
64341 275434 278401 279544 278904 277013 274402 271141 267218 263220 260134 258317 257100 255656 253956 252616
64327 252616 252164 252800 254575 257258 260138 262463 264091 265286 265879 265147 262725 259163 255317 251566 247976
64312 247976 244864 242629 241064 239336 236799 233581 230300 227443 225111 223116 221094 218629 215509 211905
64298 211905 208251 204980 202395 200649 199671 199171 198879 198864 199452 200800 202624 204500 206393 208819 212397 217216
64282 217216 222662 227958 232934 238141 244118 250717 257337 263655 269740 275544 280854 285868 291226 297075
64268 297075 302450 306058 307402 306743 304367 300580 296234 292477 289843 288141 287291 287615 289081 290870 292007
64253 292007 291972 290463 287124 281958 275681 269216 263088 257493 252506 247785 242558 236555 230765 226624 224489
64238 224489 223389 222216 220688 219122 217837 216996 216628 216509 216194 215420 214451 213846 213843 214052 213896 213362 213163 213929
64220 213929 215392 216721 217514 217934 217846 216597 213992 210883 208220 205971 203616 201309 199767 199242 199344 199849
64204 199849 200907 202325 203344 203449 202962 202591 202779 203695 205421 207852 210665 213705 217293 221990 228076
64189 228076 235335 243284 251658 260813 271576 284431 298843 313455 326792 337609 344943 348333 347968
64176 347968 344271 337432 327813 316598 305406 295101 285471 276094 267012 258406 250245 242599 235838
64163 235838 230184 225422 221366 218267 216359 215294 214391 213329 212340 211844 212124 213221 214848 216441 217535
64148 217535 218166 218916 220581 223618 227623 231427 234073 235770 237539 239860 242056 243125 242722 241092 238501
64133 238501 235198 231670 228483 225932 224117 223203 223266 224019 225009 226080 227396 229054 230966 233182 236053
64118 236053 239925 244699 249815 254765 259650 265219 272275 281040 291100 301760 312345 322301 331263
64105 331263 338964 344915 348449 349510 349200 348989 349440 350364 352206 356362 363603 372740 381496 388395 393322
64090 393322 396547 397965 397335 394756 390655 385528 379737 373454 366763 359845 352951 346094 338991 331469
64076 331469 323774 316365 309514 303295 297749 292853 288421 284268 280450 277318 275347 274826 275455 276336 276669
64061 276669 276495 276406 276570 276552 276178 276015 276691 278249 280387 282841 285197 286934 288200 290075 293432 297913
64045 297913 302594 307382 313102 320482 329656 340431 352299 364294 375576 386203 396764 407260
64033 407260 416941 425172 431776 436448 438579 437944 435090 430891 426172 421839 418693 416794 415509 414442
64019 414442 413821 413696 413306 411669 408376 403354 396352 387340 377217 367465 359055 352053 346270 341775 338624
64004 338624 336475 334768 333225 331980 331331 331480 332583 334833 338321 342717 347279 351339 354713 357516 359718
63989 359718 361157 361940 362445 362926 363389 364008 365341 367944 372005 377450 384143 391763 399796 407978 416603
63974 416603 426085 436313 446764 457240 468180 480144 493255 507284 522130 538028 555334 574263
63962 574263 594875 617205 641278 667023 694413 723894 756663 794266 837850 887953 945086
63951 945086 1010328 1085184 1171136 1269679 1382750 1512647 1661192 1829009 2015649 2220222
63941 2220222 2441673 2678581 2929011 3190637 3460766 3736025 4011990 4283038 4542391
63932 4542391 4782465 4995859 5176788 5321848 5429359 5498035 5526414 5513285 5458184 5361465
63922 5361465 5224581 5050873 4846016 4617255 4371882 4116113 3854901 3592336 3332173
63913 3332173 3078146 2833919 2602725 2387103 2188807 2008725 1846778 1702111 1573583
63904 1573583 1460045 1360217 1272580 1195569 1127747 1067757 1014400 966901 924806 887433 853667
63893 853667 822554 793835 767556 743320 720236 697504 674770 652107 630089 609776 592136
63882 592136 577241 564211 552085 540661 530523 522429 516695 513072 511189 511043 512904 516694 521813
63869 521813 527744 534575 542699 552228 562977 574715 587079 599489 611586 623587 635758 647656
63857 647656 658358 667380 674933 681235 686039 688865 689339 687303 682980 677068 670232 662393 652888 641417
63843 641417 628504 614925 600965 586340 570573 553440 535276 516878 498839 481028 463050
63832 463050 445088 427892 411983 397313 383707 371089 359226 347806 336940 327115 318451 310468
63820 310468 302767 295502 288984 283289 278473 274694 271811 269277 266710 264175 261695 259040 256401 254716
63806 254716 254695 255792 256663 256490 255424 253940 252293 250537 248640 246532 244263 242095 240220 238497 236637
63791 236637 234528 232205 229756 227427 225529 223987 222248 220001 217715 216072 215062 214067 212685 211089
63777 211089 209675 208770 208571 208985 209548 209860 210016 210327 210669 210538 209750 208706 207908 207443 207011 206232 204971 203561
63759 203561 202641 202501 202681 202484 201826 201277 201313 201867 202605 203317 203972 204698 205799 207542 209854 212329 214572
63742 214572 216411 217901 219346 221179 223497 225788 227499 228827 230531 232897 235304 237012 238042 239024
63728 239024 240415 242108 243737 245182 246822 249357 253270 258354 263815 268863 273159 276763 279875 282653
63714 282653 285155 287287 288809 289376 288601 286329 283019 279689 277181 275442 273768 271655 269236 266987 265380
63699 265380 264762 265185 266201 267179 267972 269012 270622 272506 274098 275262 276484 278504 281798 286202 290928
63684 290928 295089 298276 300490 301634 301505 300398 299251 298799 298806 298473 297457 296194 295342 295255 295963 297334 299131
63667 299131 301104 303117 305100 306932 308444 309517 310072 310008 309194 307422 304391 299998 294830 290015 286225
63652 286225 283009 279542 275896 273041 271539 270809 269923 268608 267141 265725 264491 263801 263889 264307 264359 264155
63636 264155 264613 266262 268648 271258 274481 279088 285133 291954 299085 306508 314047 321187 327683 333891
63622 333891 340251 346874 353917 362006 371922 384021 398197 414199 431730 450393 469895 490324
63610 490324 512136 535907 562145 591053 622154 654267 685951 715847 742474 764122 779457
63599 779457 788265 791392 790104 785766 779854 773634 767671 761905 756215 750517 744297 736423 725649 711157
63585 711157 692743 670902 646900 622333 598310 575211 553289 533086 515060 499181 485319
63574 485319 473795 465096 459142 455210 452658 451455 451972 454417 458468 463335 468228 472991 478166 484265
63560 484265 491087 498036 505039 512685 521384 530836 540682 551409 564178 579868 598627 620393 645506
63547 645506 674616 708119 745693 785997 826438 863353 892987 912940 922990 924633 919859 910363
63535 910363 897773 884207 872017 862661 855992 850840 846134 841115 834677 825239 811559 793274 770432
63522 770432 743059 711794 678587 645968 615501 587294 560897 536102 512952 491692 472884
63511 472884 456927 443293 430845 419136 408707 399767 391455 383044 375206 369139 364905 361494 358247
63498 358247 355250 352506 349782 347398 346183 346251 346595 346241 345194 343934 342684 341595 340924 340438 339290 337224
63482 337224 335476 335669 338020 341398 344969 348955 353644 358460 362449 365246 367183 368664 369701 369858 368444
63467 368444 364933 359576 353550 348268 344340 341293 338341 335387 333125 332147 332160 332307 332136 331927 332047 332429
63451 332429 332934 333882 335776 338642 342080 345956 350626 356406 363135 370449 378220 386594 395785 406061
63437 406061 417789 431397 447410 466522 489240 514970 541516 565943 586283 602410 615394
63426 615394 626338 636012 645264 655195 666776 680544 696911 716541 740125 767806 799092 833346
63414 833346 870032 908202 945836 979996 1007788 1027366 1038284 1041254 1037733 1029589 1018854 1007423
63402 1007423 996681 987208 978740 970356 960690 948185 931575 910376 884901 855731 823418 788900
63390 788900 753913 720390 689243 660083 632370 606516 583490 563607 546282 530991 517951
63379 517951 507641 500078 494937 492062 491382 492498 494865 498446 503785 511304 520831 531897 544148 557331
63365 557331 571246 585977 601903 619223 637727 657317 678562 702349 729098 758632 790661
63354 790661 824930 860748 896618 930376 959648 982447 997836 1006122 1008213 1004852 996811 985646
63342 985646 973625 962524 952742 943656 934462 924390 912475 897644 879083 856450 829932 800335
63330 800335 768999 737302 706174 676172 647915 622297 600218 582146 567888 556907 548964 544284
63318 544284 542567 541746 538364 529829 516272 499940 482995 466350 450336 435588 422765 411809
63306 411809 402100 393346 385926 380232 375959 372335 369007 366376 364898 364286 363679 362552 361094 359557 357538
63291 357538 354276 349579 344161 338970 334322 329823 325059 320213 315939 312688 310286 308182 305981 303628
63277 303628 301284 299262 297959 297510 297508 297373 296985 296641 296437 296182 296022 296532 297908 299563 300941 302233 303777
63260 303777 305263 306285 307378 309584 312980 316457 319176 321526 324353 327950 332211 337211 342981 349042
63246 349042 354767 360111 365671 372105 379775 388699 398449 408306 418027 428450 440917 455955 472861
63233 472861 490658 509128 528717 549723 571868 594607 617530 640343 662610 683832 703893
63222 703893 723261 742542 761942 781490 801716 823582 847456 872475 897203 920648 942324
63211 942324 961686 978069 991040 1000206 1004673 1003306 995763 982887 965937 945846 923399 899629
63199 899629 875561 851730 828319 805669 784484 765638 749887 737547 728274 721365 716468 713801
63187 713801 713592 715713 720140 727335 737670 750737 765750 782437 800992 821237 842477 864192
63175 864192 886276 908482 930208 951105 971418 991482 1011230 1030412 1048794 1065810 1080414
63164 1080414 1091651 1099057 1102195 1100180 1092202 1078300 1059177 1035414 1007337 975532 940962 904588
63152 904588 867309 830281 794798 761666 730963 702547 676532 653120 632222 613429 596323
63141 596323 580766 566926 554939 544487 534944 526121 518628 513095 509222 506105 503454 501871 501773 502633
63127 502633 503683 504949 507234 511299 517378 525138 533602 541291 547067 551069 554500 558310 562246 565364
63113 565364 567237 568367 569444 570574 571430 571966 572556 573395 574156 574444 574321 574068 573676 572920 571791 570482 569073
63096 569073 567572 566122 564709 562815 560035 556984 554870 553988 553440 552657 552345 553281 554890 555942 556280 556901
63080 556901 558457 560621 562963 565590 568667 572037 575681 579962 585057 590652 596627 603521 611841 621245
63066 621245 630977 640917 651690 663850 677469 692510 709106 727335 747122 768541 791944 817695
63054 817695 846027 877237 911694 949420 989951 1032905 1078469 1126928 1177817 1229884 1281964
63043 1281964 1333617 1384854 1435598 1485655 1534992 1583773 1632143 1680189 1728093 1776178 1824711
63032 1824711 1873606 1922148 1968883 2011849 2049131 2079310 2101398 2114402 2117051 2108039 2086700 2053602
63020 2053602 2010427 1959101 1901057 1837615 1770939 1704055 1639569 1578787 1522409 1471559 1427437
63009 1427437 1390224 1359231 1334323 1316482 1306656 1304534 1308876 1318656 1333560 1353586 1378562 1407909
62997 1407909 1440649 1475720 1512384 1550178 1588494 1626612 1664291 1701923 1739788 1777577 1814874
62986 1814874 1851639 1887658 1921813 1952427 1978106 1997726 2009834 2012826 2005830 1988850 1961989 1925130
62974 1925130 1878657 1823934 1762695 1696352 1626330 1554729 1483936 1415449 1349496 1286040 1225808
62963 1225808 1169988 1119052 1072341 1029011 988961 952440 919012 887557 857418 828987 802837
62952 802837 778771 756165 734876 715100 696483 678092 659489 641388 624907 610406 597274
62941 597274 584715 572512 561017 550528 540831 531494 522571 514662 508075 502288 496581 490949 485921
62928 485921 481678 477950 474689 472190 470445 468970 467514 466370 465673 464875 463363 461209 458898 456608 454217
62913 454217 451720 449204 446598 443879 441345 439149 436729 433322 429132 425361 422867 421233 419450 417117
62899 417117 414580 412177 409856 407543 405501 404178 403819 404274 405096 405798 406133 406165 406044 405769 405274 404654 404157
62882 404157 403920 403895 404063 404523 405230 405776 405686 404913 403871 402996 402431 402202 402399 402985 403571 403693 403327 402918 402804
62863 402804 402840 402730 402532 402550 402850 403210 403612 404375 405597 406743 407184 407049 407148 408021 409477 411138 413041 415378
62845 415378 417961 420312 422115 423304 423811 423608 422917 422067 421146 420047 418813 417626 416543 415566 414872 414561
62829 414561 414286 413636 412945 413104 414407 416168 417710 419140 420810 422602 424335 426391 429240 432621 435831
62814 435831 438717 441737 445122 448620 452126 455914 460059 464105 467669 471125 475424 481259 488415 495865
62800 495865 502651 508878 515713 524156 533997 544316 554755 565789 577938 591401 606511 623900
62788 623900 643962 666711 692405 721760 755168 792289 832927 877950 928708 985647 1048068
62777 1048068 1115183 1186905 1263389 1344156 1427820 1512480 1596158 1676964 1753014 1822262 1882457
62766 1882457 1931332 1966931 1987877 1993540 1984126 1960617 1924563 1877723 1821769 1758159 1688350 1614075
62754 1614075 1537271 1459590 1382155 1305939 1232214 1162325 1097071 1036540 980487 928645 880800
62743 880800 836933 797267 761811 729910 700682 673968 650336 629963 612003 595397 579938
62732 579938 566153 554412 544615 536553 530098 525003 520909 517691 515577 514841 515494 517254 519717 522573
62718 522573 525844 529899 535142 541683 549428 558441 569043 581515 595867 612033 630255 651112 675093
62705 675093 702284 732668 766782 805733 850329 900317 954786 1013208 1075752 1142660 1213836
62694 1213836 1289156 1368600 1451567 1536247 1620058 1700673 1776298 1845059 1904509 1951968 1985220
62683 1985220 2002913 2004566 1990494 1961723 1919742 1866143 1802423 1730276 1652066 1570775 1489148
62672 1489148 1408827 1330385 1254157 1180778 1110982 1045231 983798 927071 875515 829298 787996
62661 787996 750728 716630 685302 656794 631141 608048 587073 567943 550528 534691 520423
62650 520423 507904 496987 486755 476185 465343 455457 447623 441810 437231 433162 429161 425029 421111
62637 421111 418323 417343 417822 418725 419319 419507 419332 418644 417322 415535 413646 411970 410584 409259 407703 406046
62621 406046 404996 405230 406696 408698 410625 412377 414159 416188 418681 421888 425947 430815 436415 442776
62607 442776 449897 457546 465332 473103 481247 490541 501611 514636 529591 546585 565824 587415 611558
62594 611558 638835 669886 704686 742414 782069 822896 864096 904594 943350 979549 1012159
62583 1012159 1039600 1060264 1073242 1078247 1075104 1063886 1045538 1021835 994438 964208 931516 896991
62571 896991 861668 826490 791949 758299 725936 695289 666362 638763 612478 588342 567316
62560 567316 549369 533533 519083 506165 495146 485871 477920 471117 465365 460325 455730 451865 449242
62547 449242 447850 447090 446396 445605 444753 443917 443306 443284 444088 445579 447233 448400 448790 448820 449280 450503 452072
62530 452072 453619 455667 459302 465042 472331 480260 488663 498491 511099 527011 545345 564660 584528
62517 584528 606049 630741 659329 691795 728101 768247 811803 857937 905920 955265 1005402
62506 1005402 1055551 1104772 1151760 1194632 1231427 1260990 1283141 1297971 1305268 1304746 1296627 1282019
62494 1282019 1262874 1241524 1219974 1199597 1181557 1167298 1158222 1154988 1157465 1165448 1179128 1198810
62482 1198810 1224408 1255363 1290982 1330816 1374438 1420370 1464977 1503112 1530810 1547607 1555897
62471 1555897 1557978 1553861 1541557 1518721 1484022 1437855 1382454 1321195 1257284 1192852 1129031 1066473
62459 1066473 1005699 947336 892295 841569 795712 754670 718238 686494 659584 637239 618756
62448 618756 603426 590766 580351 571671 564397 558737 555162 553607 553232 553354 554343 556966 560906 564692
62434 564692 567405 569665 572371 575098 576559 576242 574697 572346 568884 563952 557618 550083 541601 532892
62420 532892 524967 518159 511809 505211 498469 492145 486461 481186 476011 470736 465306 459945 455014 450532
62406 450532 446087 441401 436760 432645 429183 426215 423718 421913 421038 421203 422366 424264 426470 428687 430939
62391 430939 433391 436060 438760 441316 443754 446353 449500 453390 457837 462406 466697 470527 474011 477663
62377 477663 482216 488084 495000 502369 509971 518147 527345 537661 548751 560110 571571 583653 597231
62364 597231 612824 630496 650563 673883 701037 731664 765121 801521 841587 885852 934540
62353 934540 987811 1045094 1104188 1161811 1215174 1262466 1302018 1332077 1351821 1361950 1363991 1359496
62341 1359496 1349856 1335914 1317335 1293038 1262709 1227420 1188595 1147151 1104120 1061306 1020614
62330 1020614 983124 949374 919968 895168 874233 855950 839718 825555 813180 801701 790249
62319 790249 778516 766649 754883 743231 731248 718184 703650 688156 672795 658432 645210
62308 645210 632666 620228 607787 595840 584911 574912 565457 556695 549211 542944 536914 530411 523885
62295 523885 518154 513309 509009 505485 503447 503084 503743 504635 505455 506297 507335 508654 510179 511784 513585
62280 513585 515924 518924 522299 525843 529817 534602 540268 546773 554327 563182 573244 584256 596180
62267 596180 609073 622781 637136 652346 668915 687294 707844 731015 757367 787519 822221
62256 822221 862149 907388 957363 1011448 1069219 1129787 1191155 1250568 1305240 1352693 1391058
62245 1391058 1419701 1439257 1450585 1453903 1449276 1437335 1418801 1393634 1361402 1322338 1277404 1227582
62233 1227582 1173997 1118640 1064076 1012064 963018 916968 874520 836597 803670 775476 751121
62222 751121 729340 709068 690127 673189 658973 647567 638546 631396 625703 621105 617211 613510 609510
62209 609510 605143 600974 597752 595750 594740 594534 595263 597170 600320 604522 609398 614582 619987 625817 632196
62194 632196 638952 645814 652632 659304 665835 672534 679757 687249 694316 700971 708353 717455 727895 738460
62180 738460 748401 757549 765676 772683 779108 785490 791417 796218 800646 806786 816044 828120 842324 859004
62166 859004 879144 903296 931535 963990 1000705 1041109 1083970 1127596 1169794 1207967 1239751
62155 1239751 1263673 1279225 1286709 1287264 1282666 1274523 1263420 1248798 1229562 1204902 1174959 1140906
62143 1140906 1104375 1066834 1029604 994105 961501 932070 905516 881969 862110 846028 832575
62132 832575 820334 808970 799190 791583 785834 780934 775864 770181 764231 758793 754382 750987 748519 747268
62118 747268 747709 750012 753964 759134 764718 769223 770816 768426 762616 755182 747863 741527 736446 732713
62104 732713 729849 726308 720214 710853 699021 685884 672286 659384 648934 641972 637669 634385 631576
62091 631576 629858 629560 630264 631746 634302 637981 642357 647310 653272 660453 668615 677845 688746 701496
62077 701496 715464 730222 746209 763865 782782 802336 822572 843765 865596 887513 909548
62066 909548 932050 954902 977822 1001358 1026791 1054840 1084924 1115706 1145741 1173414 1196797
62055 1196797 1214103 1224325 1227479 1224488 1216900 1206343 1193685 1178502 1159459 1135431 1106444 1073591
62043 1073591 1038074 1000487 961117 920718 880626 842069 805622 771401 739483 710016 683085
62032 683085 658652 636526 616343 597651 580172 563992 549559 537407 527576 519179 510907 502241
62020 502241 493884 486612 480086 473362 466215 459158 452298 445123 437636 430874 425869 422647 420562 419050
62006 419050 417768 416594 415968 416769 419380 423210 427479 432095 437344 443105 448779 453734 457472 459787 461156
61991 461156 462676 465072 467900 469997 470472 468984 465450 460041 453385 446335 439510 433137 427076 420897
61977 420897 414271 407509 401352 396071 391279 386811 383070 380023 376584 371897 366762 362809 360458 358670
61963 358670 356730 355220 354885 355333 355504 354988 354337 354193 354568 355031 355342 355750 356687 358289 360349 362702 365466
61946 365466 368878 373129 378504 385414 394070 404238 415493 427579 440412 453946 468162 482989
61934 482989 498102 513026 527561 541791 555587 568485 580209 590864 600320 607940 613339 616955
61922 616955 619374 620418 619470 616436 611808 606028 599360 592352 585887 580775 577595 576757 578298 581818 587012
61907 587012 594146 603588 615091 627928 641417 654779 666789 676296 683007 687139 688478 686525 681536
61894 681536 674647 666851 658510 649901 641455 633192 624673 615855 607398 599721 592362 584763 577139 569966
61880 569966 562932 555089 545932 535865 525542 515243 504992 494995 485706 477519 470452 464217 458602
61867 458602 453758 450109 448105 448099 450243 454199 459088 464102 469214 475089 482321 491093 501519 513880
61853 513880 528330 544698 562792 582670 604394 627642 651764 676198 700767 725605 750720
61842 750720 775407 798109 817077 831345 840986 846480 848073 845778 839787 830727 819662 807964 797061
61829 797061 788092 781705 778093 777226 779137 784020 791944 802452 814581 827280 839528 849958 856821
61816 856821 858833 855959 849074 838994 826166 811110 794619 777474 760211 743169 726442 709786
61804 709786 692908 675891 659064 642480 625816 608873 591971 575872 561487 549469 539757 531519
61792 531519 523831 516390 509435 503222 497893 493570 490025 486448 482224 477931 474917 473704 473341 472509 470781
61777 470781 468612 466638 465254 464489 463984 463331 462615 462356 462826 463832 465210 467009 468969 470448 471279 472231
61761 472231 474170 477113 480590 484586 489525 495436 501678 507526 512630 516849 520003 521929 522562 521869 519825
61746 519825 516488 512041 506786 501155 495636 490529 485769 481075 476318 471750 467940 465377 463998 463095
61732 463095 461880 460202 458570 457537 457262 457624 458460 459537 460584 461522 462560 463941 465696 467637 469491
61717 469491 471041 472335 473693 475277 476781 477836 478594 479420 480039 479640 477962 475642 473185 470190 466102
61702 466102 461234 456395 451804 447035 441898 436731 431805 427063 422596 418839 415995 413591 410930 407841
61688 407841 404735 402025 399676 397283 394443 391116 387752 385045 383356 382298 380968 378747 375871 373116
61674 373116 370998 369441 368233 367476 367398 367923 368745 369689 370687 371554 372163 372813 373994 375708 377383 378570 379447
61657 379447 380508 382110 384450 387622 391442 395448 399286 402902 406145 408478 409413 409146 408543 408546 409600 411443
61641 411443 413338 414737 415899 417649 420399 423689 426805 429543 432071 434355 436112 437192 437604 437151 435396
61626 435396 432042 427261 421683 416122 411160 406784 402582 398438 394841 392324 390781 389628 388456 387177
61612 387177 385686 383812 381640 379489 377443 375161 372240 368607 364431 359879 355084 350286 345802 341801
61598 341801 338136 334456 330595 326861 323802 321615 319908 318145 316189 314222 312244 309961 307187 304164
61584 304164 301367 299113 297479 296547 296551 297642 299476 301134 301665 300797 299114 297558 296805 297020 297933 299009
61568 299009 299686 299651 298953 297880 296756 295834 295237 295009 295331 296555 298811 301627 304250 306399 308371 310341
61552 310341 311964 312952 313659 314678 315992 316937 317010 316447 315978 316181 317067 318080 318545 318313 318028 318612 320434
61535 320434 323060 325723 327879 329321 330040 330200 330249 330835 332372 334580 336559 337543 337600 337501 337845 338481 338821
61518 338821 338550 337904 337325 336939 336405 335314 333788 332573 332350 333037 334022 334956 335968 337090 337950 338264 338272 338395
61500 338395 338701 338978 339105 339074 338848 338542 338641 339745 342035 345109 348235 350685 352060 352543 352740 353085 353498
61483 353498 353798 354216 355197 356824 358750 360680 362618 364636 366614 368226 369045 368726 367271 365064 362583
61468 362583 360212 358422 357800 358461 359579 359941 359073 357496 355888 354382 352804 351170 349643 348275 347125
61453 347125 346494 346716 347721 349062 350396 351744 353153 354355 355047 355470 356403 358426 361332 364455 367445
61438 367445 370446 373535 376355 378533 380285 382301 385054 388337 391506 394044 395853 397095 397847 397973 397342
61423 397342 396186 395218 395356 397177 400466 404265 407588 410199 412564 414972 417011 418157 418594 419060 419980
61408 419980 421170 422301 423196 423630 423333 422369 421161 419952 418526 416583 414107 411267 408294 405570 403437
61393 403437 401807 400266 398680 397278 396005 394392 392327 390419 389167 388206 386922 385419 384308 383842 383852
61378 383852 384357 385586 387400 389265 390850 392189 393258 393903 394312 395095 396649 398708 400689 402200 403094
61363 403094 403332 403039 402521 402013 401525 401075 401006 401837 403780 406520 409597 412964 417100 422512 429238 436878
61347 436878 444913 452786 459838 465596 470289 474715 479404 484029 487790 490201 491454 492258 493418 495304
61333 495304 497538 499348 500332 500711 500802 500569 499800 498368 496129 492930 489018 485213 482413 481008 480851 481504
61317 481504 482410 483207 484090 485576 487790 490351 493057 496156 499803 503914 508942 516069 525949 537733 549956
61302 549956 561893 573377 583749 591969 597660 601236 603078 603280 602146 600142 597204 592781 586735 579705
61288 579705 572422 565156 557882 550494 542723 534366 525766 517745 510928 505400 500994 497504 494713 492626
61274 492626 491642 492023 493187 494095 494366 494466 494758 495016 495072 495371 496493 498544 501380 505083 509910 515935 522988
61257 522988 530704 538516 545802 552173 557431 561308 563666 565024 566390 568221 569880 570480 570037 569399 569137
61242 569137 568921 568106 566643 565156 564131 563292 561983 559981 557605 555095 552341 549447 547123 546215 547026
61227 547026 549324 552646 556361 559907 563414 567715 573223 579135 584327 588769 593404 598828 604749 610591
61213 610591 615932 620390 623820 626660 629520 632384 634755 636552 638258 640106 641777 643064 644347 646271
61199 646271 649331 653816 659758 667013 675729 686556 699868 714939 730382 745034 757802 767259 772616
61186 772616 774956 776297 777366 777375 776000 774180 772608 770739 767924 764386 760377 755452 749429 743177 737551
61171 737551 732217 726345 719821 712955 705694 697992 690414 683446 676648 669381 661923 654960 648303 641183
61157 641183 633616 626560 620714 615980 612168 609482 608180 608361 610205 613930 619309 625476 631203 635239
61143 635239 636741 635935 634156 632729 631879 631094 630321 630208 631321 633713 637315 642244 648605 656381 665596
61128 665596 676313 688524 702307 717983 735714 755010 775054 795573 817132 840550 866278
61117 866278 894374 924745 957210 991365 1026451 1061538 1096034 1130072 1164116 1198210 1231865
61106 1231865 1264651 1296435 1326852 1355006 1379962 1401227 1418515 1431404 1439539 1442902 1441691 1436162
61094 1436162 1426718 1413740 1397205 1376904 1353213 1327122 1299337 1269985 1239438 1208735 1178685
61083 1178685 1149134 1119639 1090415 1062165 1035444 1010564 987542 965677 943863 921945 901248
61072 901248 883143 867575 853577 840596 828600 817445 807004 797556 789314 781958 775280 769781
61060 769781 765853 762828 759710 756498 753990 752662 752498 753434 755145 756920 758689 761682 767101 774623 783254
61045 783254 793080 804866 818376 832551 847173 862997 880293 898576 917762 938296 960093 982584
61033 982584 1005831 1030410 1056322 1083327 1112232 1144354 1179620 1216645 1254593 1293371 1332151
61022 1332151 1369865 1407632 1448715 1495528 1548582 1608941 1679295 1761290 1853740 1954922 2065251
61011 2065251 2186939 2323449 2480974 2668533 2894818 3166773 3492687 3884202 4353474
61002 4353474 4912294 5578191 6379556 7353460 8546118 10020122 11838255 13991030 16304340
60993 16304340 18432718 19998865 20795919 20887685 20535316 20045354 19676201 19621125 19978619
60984 19978619 20671815 21407562 21778556 21470994 20418201 18788751 16852732 14852499 12950426
60975 12950426 11234733 9738908 8459144 7372725 6453261 5676241 5018727 4460710 3987263
60966 3987263 3587091 3249204 2962340 2716531 2503547 2316532 2150664 2003489 1873185
60957 1873185 1757025 1652606 1559589 1478668 1409350 1350102 1300010 1258512 1223555 1191614 1159890
60946 1159890 1127597 1095152 1063256 1032818 1004666 978849 954860 932517 911847 892169 872330
60935 872330 852083 832333 813698 795666 777534 759467 742149 725936 710795 696621 683254
60924 683254 670542 658659 648026 638738 630444 622879 616005 609524 602902 596160 589989 584703 579699
60911 579699 574432 569320 565063 561568 558261 555084 552391 550076 547615 544931 542505 540491 538369 535636
60897 535636 532350 528820 525207 521652 518375 515347 512134 508330 503970 499402 494946 490827 487205 484058
60883 484058 481119 478066 474736 471164 467537 464091 460868 457678 454517 451908 450449 450050 450044 450088 450500 451552
60867 451552 452997 454527 456250 458345 460688 463277 466619 471127 476363 481475 486137 490433 493920 495664
60853 495664 495426 494109 492730 491507 490346 489575 489458 489361 488217 485891 483389 481541 479959 477647 474211
60838 474211 470041 465523 460527 454691 447853 440154 431972 423873 416438 409977 404490 399887 396138 393166
60824 393166 390786 388826 387122 385333 383038 380179 377227 374591 372055 369062 365554 362218 359874 358768
60810 358768 358395 357827 356338 354067 352096 351541 352480 353983 355206 356188 357507 359510 362057 364745 367205
60795 367205 369289 371130 372911 374583 375953 376960 377603 377716 377283 376931 377468 378703 379351 378526 376884 375730
60779 375730 375382 374975 373666 371407 368647 365864 363420 361357 359236 356576 353594 351140 349791 349320 349143
60764 349143 348996 348986 349233 349667 350078 350275 350288 350420 350988 351979 353009 353610 353475 352576 351239 350002 349224 348939
60746 348939 349245 350618 353505 357630 362050 365834 368444 369548 368902 366603 363185 359338 355645 352535 350201
60731 350201 348494 347102 345978 345370 345363 345581 345544 345303 345576 347139 349948 352903 354775 355473 356145 357771 360008
60714 360008 361782 362727 363399 364085 364108 362590 359553 355953 352807 350535 348936 347580 346226 344958 343918
60699 343918 342954 341689 339891 337695 335489 333732 332717 332232 331534 330009 327882 326027 325070 324932 325236 325790
60683 325790 326529 327280 327865 328370 329183 330705 332926 335274 337086 338374 339940 342510 345989 349784 353475
60668 353475 356718 358816 359093 357697 355479 353035 350380 347540 344849 342567 340807 339966 340568 342353 344138
60653 344138 345005 345264 345864 347290 349421 352100 355356 359221 363688 368580 373205 376427 377489 376579 374330
60638 374330 370992 366519 361224 355881 351207 347588 345196 344005 343633 343448 342902 341754 340090 338329 337069
60623 337069 336741 337442 339102 341518 344051 345703 345917 345179 344445 344113 343909 343658 343627 344031 344600 344918 344969 345166
60605 345166 345864 346957 347939 348433 348715 349559 351384 353662 355472 356572 357596 359134 361022 362800 364517
60590 364517 366639 369263 371908 374173 376165 378026 379411 379890 379695 379513 379541 379283 378494 377877 378443 380480
60574 380480 383495 386904 390366 393668 396887 400714 406167 413726 422956 433059 443621 454691 466260
60561 466260 477712 487789 495220 499492 500932 500083 497287 492981 487872 482505 476989 471614 467349 465138
60547 465138 464933 466003 467981 470978 474912 479575 485314 492780 501846 511616 521829 533520 547856 564912
60533 564912 583992 604536 626053 647446 666954 682811 693893 700005 701720 699699 694103 684980
60521 684980 673219 660522 648222 636609 625571 615295 605973 597409 589447 582519 577347 574322 573399
60508 573399 574260 576294 578835 581839 586080 592452 601397 613269 628708 648189 671506 698224 728414
60495 728414 762491 800392 841220 883609 926207 967946 1008054 1045785 1080236 1110700 1137059
60484 1137059 1159270 1176340 1186401 1188034 1181021 1165589 1141526 1108505 1066887 1018039 964394 909364
60472 909364 856343 807143 761757 719944 682349 649630 621303 596254 573909 554187 536789
60461 536789 521346 507910 496590 486903 478125 469958 462306 454782 447130 439806 433423 427933 422962
60448 422962 418614 415150 412212 409144 405887 402795 399878 397036 394747 393577 393137 392455 391324 390339 389636
60433 389636 388546 386651 384334 382102 380169 378866 378665 379490 380599 381365 381640 381286 380110 378472 377283
60418 377283 377104 377754 378928 380577 382559 384562 386615 389011 391504 393240 393853 393996 394500 395556 397053
60403 397053 399083 401589 403990 405704 406803 407783 408986 410573 412729 415500 418588 421586 424297 426662
60389 426662 428685 430610 432893 435737 438831 441690 444045 445860 447308 448857 451016 453791 456642 459165
60375 459165 461518 464053 466831 469669 472389 474781 476616 477933 479103 480390 481573 482197 482146 481863 482141
60360 482141 483645 486480 490171 494129 498128 502257 506704 511850 518328 526479 535772 545114 553678 561111
60346 561111 567128 571409 573839 574384 572780 568908 563467 557683 552248 546999 541687 536461 531507 526821
60332 526821 522593 519252 516789 514466 511507 507791 503679 499507 495439 491559 487963 484965 483117 482581
60318 482581 482595 482250 481821 482688 485794 490954 497881 506891 517901 529477 539784 548240 555565 562405 568695
60303 568695 574325 579788 585821 592686 599901 606572 611927 615545 616999 615387 609659 599687 586843 573251
60289 573251 560517 549179 539078 529968 521863 515022 509644 505583 502378 499510 496527 493153 489540
60276 489540 486238 483525 480905 477665 473856 470179 466913 463561 459655 455342 450962 446579 442235 438268
60262 438268 435081 432868 431710 431570 432068 432592 432803 432753 432566 432454 432977 434550 436576 437804 437874 437817 438675 440297
60244 440297 441972 443603 445536 447675 449442 450397 450416 449574 448331 447543 447719 448440 448997 449381 450217 451885 454249
60227 454249 457068 460176 463356 466488 469798 473536 477451 480992 484090 487357 491422 496296 501525 506819
60213 506819 512416 518773 525891 533091 539744 546108 553032 560815 568838 576471 583748 590900 597776 604261
60199 604261 610784 617735 624578 630148 633787 635749 636615 636815 636681 636423 635860 634532 632282 629453 626398
60184 626398 622997 618849 613823 608184 602201 595873 589262 582945 577766 573969 570933 568012 565335 563352
60170 563352 561901 560307 558311 556260 554376 552432 550255 547917 545305 542159 538785 536092 534550 533715
60156 533715 533168 533313 534702 537026 539372 541236 542739 544073 545256 546358 547553 548896 550265 551468 552376
60141 552376 553152 554389 556642 559783 563230 566893 571320 576632 581977 586513 590474 594761 599799 605225
60127 605225 610383 614690 617853 620194 622543 625381 628305 630608 632136 633272 634464 636137 638647 641848
60113 641848 644970 647381 649202 650806 652075 652636 652544 652155 651518 650375 648643 646444 643807 640796 637801
60098 637801 635326 633503 632101 630869 629662 628469 627562 627367 627914 628663 629104 629124 628603 627158 624705 621798
60082 621798 618900 615722 611866 607791 604508 602463 601191 599867 597783 594488 590032 584976 579818 574513
60068 574513 568759 562466 555672 548470 541356 535185 530264 525911 521443 517155 513722 511065 508508 505781
60054 505781 503101 500497 497815 495392 494064 494435 496540 500084 504564 509274 513668 517705 521624 525630
60040 525630 530068 535436 541778 548373 554481 559950 564681 568089 569807 570442 570832 570910 570075 568288 565912
60025 565912 562714 557982 551550 543927 535530 526495 517153 507967 499095 490649 483150 476968 471562 466141
60011 466141 460926 456866 454254 452486 451139 450319 449899 449302 448139 446392 443967 440949 438227 436921 437056
59996 437056 437624 437968 438268 438638 438876 439343 441049 444397 448629 452868 456956 460957 464675 468100 471600 475152
59980 475152 477985 479449 479739 479387 478543 477079 474906 471968 468410 464958 462536 461238 460279 459153 458170
59965 458170 457613 457128 456470 456133 456655 457793 458994 460345 462458 465539 469041 472162 474442 475944 476983
59950 476983 477654 477713 477111 476422 476312 476789 477498 478532 480191 482059 483165 483208 482774 482197 481030 478992 476697
59933 476697 475027 474434 475207 477735 482003 487371 493222 499302 505112 509566 511778 511742 509848 506261 501284
59918 501284 495814 490927 487191 484776 483833 484427 486315 489125 492561 496307 500058 503776 507552 511160 514194
59903 514194 516700 519083 521290 522735 523205 523151 522889 522252 521305 520581 520227 519716 518906 518620 519576 521471 523790
59886 523790 526805 530874 535345 539126 542129 545240 549024 553217 557465 561810 566344 570897 575254 579326
59872 579326 583003 585992 587803 587920 586246 583480 580664 578170 575511 572322 569058 566479 564940 564451 564825
59857 564825 565393 565224 564301 563957 565431 568362 571446 574322 577953 583298 590410 598911 608487 618530 627730
59842 627730 634507 637877 637909 635686 632965 631648 633161 637881 644839 651995 657218 659388 658675 655914 652009
59827 652009 647796 643888 640328 636612 632248 627059 620956 613873 606156 598606 591850 585933 580703 576304
59813 576304 573025 570934 569863 569495 569329 568856 567947 566771 565320 563424 561354 559817 559062 558418 557099 555168
59797 555168 553408 552491 552447 552717 552588 551878 551274 551623 552886 554207 555049 555594 555948 555694 554582 553020 551530
59780 551530 550183 548954 548059 547534 546950 545945 544687 543526 542598 541969 541675 541411 540755 539925 539693 540334 541380
59763 541380 542676 544805 547991 551460 554505 557447 560966 565179 570066 575994 583021 590302 597041 603482
59749 603482 610180 616913 623246 629620 636819 644677 652287 659225 665661 671491 676339 680268 683650 686406
59735 686406 688239 689491 690848 692190 692662 692006 691080 690798 691142 691443 691180 690352 689381 688694 688122 686859 684392
59718 684392 681205 678135 675268 672107 668621 665388 662708 660242 657768 655752 654903 655393 656707 658173 659648
59703 659648 661681 664838 668961 673474 678434 684558 691946 699509 706193 712188 718290 724634 730730 736213
59689 736213 740796 743871 745038 744847 744329 744034 744066 744559 745258 745106 743294 740530 738214 736438 733799 729254
59673 729254 723189 716527 709736 702992 696522 690392 684464 678845 673913 669752 666035 662591 659641 657418
59659 657418 655983 655503 656253 658237 661158 664736 668691 672510 675727 678427 681020 683567 685688 687053 687492
59644 687492 686732 684494 680788 675733 669271 661486 652951 644225 635252 625881 616734 608867 602658 597641
59630 597641 593288 589240 584953 579969 574663 569940 566031 562182 557613 552215 546236 539922 533646 527848
59616 527848 522598 517578 512612 507856 503510 499745 496908 495310 494788 494819 495003 495141 495089 495002 495457 496814 498672
59599 498672 500486 502401 504809 507377 509422 511076 513215 516183 519316 521766 523093 523135 522120 520886 520201
59584 520201 519754 518593 516573 514537 512987 511480 509522 507199 504594 501429 497719 494142 491320 489193
59570 489193 487319 485328 482960 480255 477848 476472 476037 475799 475532 475724 476427 476766 476049 474686 473546 473053
59554 473053 473347 474658 476855 479092 480583 481512 482731 484800 487725 491395 495793 500863 506610 513274 521128
59539 521128 530197 540591 553241 569843 591293 615540 637254 650541 652830 646241 635265 623543
59527 623543 612937 604444 598703 595662 594707 595301 597082 599488 601915 604141 605992 606763 605652 602681 598519
59512 598519 593480 587470 580809 574241 567962 561413 554217 546688 539296 532299 526020 520805 516482 512446
59498 512446 508476 504958 502219 500251 499173 499310 500586 502350 504084 505860 507955 510402 513037 515645
59484 515645 518062 520416 523144 526386 529614 532315 534770 537659 541191 545272 550082 555662 561174 565506
59470 565506 568432 570380 571376 571252 570661 570659 571241 571437 570946 570639 571318 572984 575458 578660 582094 585128 588055
59453 588055 591939 597210 603281 609596 616011 622056 627058 631219 635353 639209 641295 640781 638360 634769
59439 634769 629778 623363 616667 610904 606184 602199 599129 597101 595570 594122 593217 593337 593987 594355 594544
59424 594544 595522 598197 603035 610150 619287 629988 642077 655681 670736 686944 704244 722971 743768
59411 743768 767777 795896 826235 852745 868507 871133 863916 851871 838469 826222 817717 814524
59399 814524 816724 824598 838840 857436 873941 881219 876673 862800 843825 823260 803615 786121
59387 786121 770450 755860 742545 731112 721421 713007 706072 700887 696777 692885 689455 687165 685649
59374 685649 683915 681851 680122 678917 677970 677495 677807 678273 677949 677200 677444 679257 681827 684363 687000 690118
59358 690118 693792 698155 703483 709629 716079 722851 730777 740642 752431 765557 779467 793901 808782
59345 808782 823902 838707 852628 865684 878335 890571 901641 910892 918248 923530 926004 925146 921299
59332 921299 915057 906544 895771 883191 869376 854690 839644 824847 810216 795035 779363 764503
59320 764503 751409 739548 728079 717202 707414 698320 689350 680933 673787 667603 661567 655706 650621
59307 650621 646293 642256 638671 636226 635275 635941 638825 644788 654337 667621 684162 701531 715116 720718
59293 720718 717418 707293 693046 676913 661033 647135 635706 626426 619219 614077 610342 607374 605607
59280 605607 605871 607938 610809 614107 618120 622886 628387 635306 644298 654734 665392 676191 687937
59267 687937 700548 712886 724320 735194 745634 755109 763335 770479 776321 780192 781939 782105 781129
59254 781129 779237 776994 775057 773425 771804 770510 769959 769514 768065 765705 763608 762196 760664 758493 756257
59239 756257 754602 753407 752331 751329 750329 749043 747265 744812 741329 736869 732400 728761 725292 720506
59225 720506 714001 706609 698767 690022 680348 670767 662278 654994 648590 642803 637354 632189 627888 625070
59211 625070 623365 621715 619662 617575 615801 614530 614265 615307 616850 617779 618434 620402 624386 629367 634072
59196 634072 638230 642052 645507 648479 650899 652457 652866 652496 652091 651936 651999 652652 654281 656309 657685 658265
59180 658265 658707 659069 658623 657054 654820 652332 649816 647827 646687 645464 642787 638762 634890 632116 630237
59165 630237 629221 629546 630952 632256 632835 633099 633233 632749 631573 630279 628825 626352 622612 618363 613936
59150 613936 608716 602539 596278 590512 584848 579124 574025 569814 565648 560903 556120 551861 547652 542869
59136 542869 537810 533176 529153 525650 522706 520210 517931 516148 515450 515671 516047 516713 518896 523131 528411
59121 528411 533608 538688 543960 549360 555195 562474 571607 581647 591550 601310 611173 620655 629207 637071
59107 637071 644693 651988 658830 665475 671781 676816 680034 682202 684331 686254 687043 686351 684647 682422 679814
59092 679814 676798 673434 670178 667980 667552 668416 669220 669071 667956 665963 663008 659342 655348 650753 645037
59077 645037 638676 632782 627426 621562 614935 608660 603493 598828 594011 589391 585380 581639 577879 574435
59063 574435 571358 567943 563910 560067 557134 554789 552454 550082 547651 544853 541841 539305 537280 535005
59049 535005 532461 530823 530713 531178 531226 531180 531619 532121 532080 531881 532237 533074 533926 534808 535909 537024 537910 538670
59031 538670 539477 540625 542990 547397 553274 559128 564707 571397 580107 590210 601109 613243 626726
59018 626726 640450 653436 665681 676770 685143 689889 692009 692807 692248 689938 686410 682308 677440 671866
59004 671866 666845 663600 662129 662107 663709 666640 669673 672256 675232 678916 681913 683051 682983 682564 681226
58989 681226 678483 675523 673507 671575 668340 664172 660211 656334 652019 648160 646021 645319 645293 646775 651061
58974 651061 657514 664411 671719 680935 692527 705447 718819 732227 744658 755042 763826 772376 781018
58961 781018 789110 796634 803951 810285 814215 815566 815233 813316 809038 802351 793981 783985 771895 758339
58947 758339 744955 732583 720813 709322 698365 688016 678187 669386 662289 656688 651935 648115 645542
58934 645542 643469 640693 637243 634164 631910 630171 629028 628859 629372 629982 630870 632414 633933 634343 633695 632731
58918 632731 631363 629091 626500 624748 623797 622715 621498 621008 621400 622127 623379 625918 629647 633860 638743
58903 638743 645117 652958 661680 671584 683307 696056 708127 719038 729450 739254 747708 755418 764160
58890 764160 774521 785610 797225 810326 824987 839846 854086 868145 881893 893853 903014 909959
58878 909959 915548 919828 922759 924629 925138 923382 919289 913952 908115 901632 894774 888759 884354 881038
58864 881038 878013 875012 871779 867853 863199 858048 851933 843962 834186 823651 813004 802187 791425
58851 791425 781196 771269 761189 751661 743920 737696 731456 724690 718144 711573 703337 692894 681886
58838 681886 671890 662701 653686 645293 638114 631676 625181 618616 612388 606728 601977 598590 596382 594659
58824 594659 593308 592789 593003 593409 594410 597093 601314 605561 609108 612765 616950 620701 623393 625870 628880
58809 628880 631741 633565 634717 635995 637300 638032 638059 637484 636150 633976 631187 627882 624089 620421 617644
58794 617644 615372 612278 607862 602919 598057 593068 588130 584295 582264 581820 582798 585325 588730 591722 594234
58779 594234 597737 603140 609715 616702 624467 633225 641933 649297 654672 657247 655736 649977 641731 632939
58765 632939 624062 614870 605750 597271 589414 582101 575702 570334 565617 561687 559389 558781 558600 557999 557710
58750 557710 558552 559865 560491 560444 560623 561475 562794 564252 565470 566217 567082 569241 573043 577579 582025 586466
58734 586466 590921 594703 597508 600250 604055 609124 615109 621729 628458 634416 639232 643375 647299 651087
58720 651087 655165 660307 666586 673343 680593 689239 699379 709610 718640 726566 733910 740436 745591 749100
58706 749100 750483 748889 744084 736815 727725 716733 703806 689418 673961 657641 641159 625384
58694 625384 610241 595164 580728 568389 558347 549269 540445 532544 525849 519591 513663 509088 505894
58681 505894 502342 497393 492312 488683 486280 484120 482202 480898 479857 478795 478429 479574 482194 486179
58667 486179 491888 499118 506716 514204 522695 533237 545204 556945 566861 573288 574844 571873 566359
58654 566359 559659 551650 542606 534105 527064 520560 513760 507418 502259 497512 492452 487927 484838 482420
58640 482420 479492 476320 473842 472134 470937 470623 471398 472642 474135 476745 480664 484216 485711 485395 484406
58625 484406 483005 481109 479346 478208 477192 475954 475232 475502 475982 476137 476914 479215 482464 485958 490231
58610 490231 495681 501139 505342 508655 511975 515162 518012 521452 526140 530986 534591 537110 539285 540822
58596 540822 541266 541306 541603 541365 539671 537243 535498 534831 535164 537055 540818 545687 551229 558379 567688 577840
58580 577840 587427 596830 606825 616785 625982 635194 645101 654443 661899 668665 677068 687603 699329 712205
58566 712205 726913 743130 760073 778306 799193 823064 849307 877477 906709 934912 960139
58555 960139 982028 1000545 1014412 1022360 1024859 1023164 1017895 1010150 1002470 996609 991483 985261 978223
58542 978223 971493 964292 954794 942702 928669 912115 892014 869146 845316 821063 796283 772378
58530 772378 751394 733508 717525 703331 691761 682498 674268 666880 661133 657013 653657 650688 647931
58517 647931 644431 639470 634009 629539 626090 622890 620144 618516 617653 616796 616056 615666 615009 613854 613224 613557
58501 613557 613484 612169 611175 612008 613531 614084 614451 616157 618385 619412 619826 621458 624266 627074 630431 635876
58485 635876 643200 651141 660008 670942 683465 696447 710645 727528 746373 765208 783762 802695
58473 802695 820763 835589 846532 854003 856794 853088 843563 830758 816055 800007 784681 772549
58461 772549 763607 756491 751679 750733 753181 757342 763519 773195 785765 799258 813602 829769 846198
58448 846198 859491 868314 873368 874043 868686 858054 845089 831352 816772 802498 790498 780565 771116
58435 771116 762784 757719 755523 753485 751019 750305 752353 755836 760135 766223 774150 782751 792115 803332
58421 803332 815596 826473 835016 841733 845835 845729 842073 837124 831265 823373 814176 805753 798030 789370
58407 789370 780338 773206 768031 762971 758229 755691 754888 753426 751429 751395 753582 755803 757971 762452 769374
58392 769374 775837 780507 784934 789659 793054 794754 796360 797976 797742 795307 792139 788142 781972 774971
58378 774971 770699 770115 771240 773736 779400 787796 796034 803545 812649 823760 834523 844376 855365 867702
58364 867702 879107 889390 901074 914666 927922 940587 954974 970907 984976 995919 1005948
58353 1005948 1015706 1022834 1026755 1029934 1033171 1034593 1034483 1036083 1040209 1044119 1046989 1051412 1058105 1064496
58339 1064496 1070106 1078062 1089595 1102267 1115192 1130636 1148742 1166175 1181846 1198553 1217097 1234315
58327 1234315 1248832 1263093 1277640 1289057 1295906 1301120 1306297 1309267 1309504 1310234 1312844 1314943 1316238
58314 1316238 1320382 1328521 1336980 1343902 1352261 1363756 1375865 1387599 1401898 1419485 1436545 1451470
58302 1451470 1467731 1487199 1506913 1525327 1545235 1567462 1588239 1606036 1624400 1644937 1664286
58291 1664286 1681249 1699883 1722157 1744655 1765884 1789447 1816454 1842512 1866116 1892154 1923015
58280 1923015 1954167 1982923 2013404 2048128 2082890 2115012 2148553 2186209 2224168 2260337 2299439
58269 2299439 2344470 2391337 2437509 2487472 2543819 2601521 2657182 2715423 2779927 2846755 2912840
58258 2912840 2982180 3057009 3131788 3202754 3274547 3350774 3427310 3501706 3579488 3664061 3750332
58247 3750332 3835651 3926659 4027758 4133517 4240452 4355113 4482135 4615718 4751786 4896756
58237 4896756 5055066 5220213 5387914 5565689 5759372 5963035 6172765 6396940 6641795
58228 6641795 6900822 7170102 7459603 7777096 8116031 8472212 8856526 9277722 9729435
58219 9729435 10208766 10730040 11304824 11927117 12594893 13326607 14138752 15028365 15997234
58210 15997234 17071467 18276704 19618234 21108801 22791506 24711514 26893080 29371860
58202 29371860 32221958 35525533 39352536 43804889 49045062 55248206 62573380 71226867
58194 71226867 81508150 93754964 108318569 125669575 146481258 171576889 201888911
58187 201888911 238361073 281196434 328264084 373961323 410363720 430618173 432076253
58180 432076253 416737948 389212109 354396219 316396469 278397591 242640601 210369199
58173 210369199 182006988 157498331 136538891 118676885 103429361 90392550 79242315
58166 79242315 69680187 61442157 54336675 48219650 42944424 38372157 34407744 30982450
58158 30982450 28014345 25418830 23141751 21148631 19393581 17827562 16424341 15170620
58150 15170620 14041593 13010888 12072863 11230773 10472730 9780736 9152374 8591705 8088504
58141 8088504 7627215 7207073 6832971 6494727 6174916 5870020 5585806 5319124 5062076
58132 5062076 4817635 4593885 4388110 4192084 4007303 3839900 3686124 3537558 3395483
58123 3395483 3265988 3146079 3028447 2915065 2812579 2718764 2626567 2537270 2456959 2383931
58113 2383931 2311754 2241053 2176571 2116348 2055200 1995307 1942242 1893984 1844609 1795301 1751078
58102 1751078 1710174 1667308 1624253 1586552 1552625 1516450 1478388 1443378 1410850 1376306 1340736
58091 1340736 1308943 1280360 1250581 1220202 1193573 1170643 1148273 1127460 1111084 1096617 1079160
58080 1079160 1059551 1041680 1024200 1003035 979721 959040 940389 919683 897822 879159 863313
58069 863313 846515 829458 815879 804780 791887 777610 766003 756986 747090 736713 729268 724136
58057 724136 717653 709992 703990 698255 688770 676442 665848 657252 647006 635219 625864 619538 613024
58044 613024 605862 600639 596831 590946 582908 576099 571017 564881 557465 551412 546825 541319 535247 531094
58030 531094 527912 522159 513882 506359 499834 491499 481557 473402 467606 461371 454171 448440 444467 440033
58016 440033 435233 432341 430782 427564 422799 419421 417382 413621 407970 403665 401605 399547 397330 397418 399625
58001 399625 400699 399997 400428 402974 405309 406672 409146 413099 416144 417554 419106 420722 419898 416320 412479
57986 412479 408929 403547 396291 390034 385604 380532 373785 367355 362178 356849 351465 348389 348002 347837 347005
57971 347005 347354 349271 350539 350464 350998 352684 353600 353391 354171 356239 357076 355830 354643 354179 352093 347547
57955 347547 343221 341013 339448 337081 334902 333645 332169 330213 329441 330194 330372 329059 328093 328657 329535 330138
57939 330138 331990 335669 339338 341846 344463 348282 352779 358008 365139 373579 380607 384995 388051 390179
57925 390179 389711 386197 381543 376667 370402 362840 356233 351210 345607 338577 332315 328005 323645 317848
57911 317848 312414 308963 306219 302895 300296 299692 299777 299020 298038 297435 295718 291708 286881 283139 280095 276478
57895 276478 272449 268812 265723 263648 263751 265926 268296 269804 271342 273365 274739 275062 275648 276953 277531
57880 277531 276898 276918 278792 281089 282307 283022 283966 284376 283893 283850 285057 286472 287546 289579 293234 297024
57864 297024 299860 302801 306739 310697 314120 318446 324608 331214 337033 342970 349716 355689 359423 361970
57850 361970 364899 367745 369414 370258 370841 370403 368446 366143 364428 362322 358877 354982 351606 348048 343684
57835 343684 339630 336872 334481 331497 328817 327411 326344 324439 322286 320899 319993 319317 319968 322560 325727
57820 325727 328201 330732 334141 337297 339061 340650 343897 348402 352283 354481 354565 351765 346153 339605 333739
57805 333739 328048 321608 315201 309981 305412 300403 295281 290931 287161 283602 280994 279856 279048 277288
57791 277288 274956 272929 270956 268728 267170 267013 267399 267449 267870 269422 271253 272477 273920 276558 279584
57776 279584 281853 283910 286731 289786 292178 294457 297455 300509 302615 304084 305279 305025 302259 298067
57762 298067 294183 290536 286150 281324 276998 273045 269066 265809 264004 262852 261460 260626 261427 263241 265091
57747 265091 267671 272003 277206 281709 285621 289850 293965 297033 299570 302527 305354 307221 309133 312504
57733 312504 316553 319525 321720 324834 328836 332046 334034 336088 338829 341483 343533 345254 346595 347135
57719 347135 347118 347116 346970 346275 345330 344297 342297 338890 335475 333479 332025 329329 325511 322028 319069 315726
57703 315726 312195 309600 307978 306504 305472 306036 308189 310812 313510 316582 319457 320976 321059 320495 319394
57688 319394 317469 315373 313995 312897 311223 309690 309809 311504 313431 315317 318058 321855 326181 331425
57674 331425 338606 347644 357836 369991 386192 407472 433624 465367 504790 552927 607586 662911
57662 662911 709748 737717 740092 717982 678969 631716 582554 535574 493102 455594 422812 395336
57650 395336 373693 356541 341605 328223 317280 308897 302016 296064 291155 286813 282328 278238 275653
57637 275653 274307 273075 272058 272144 272854 272837 272356 272895 274217 274265 272345 270115 268893 268151 267278 266706 266402
57620 266402 265156 262334 258898 255973 253825 252711 253127 254583 255549 255253 254322 253286 251859 250106 248831
57605 248831 248260 247579 246248 244591 242884 241071 239585 239047 238998 238224 236485 234503 232284 229119 225385 222551
57589 222551 220931 219145 216298 213191 210901 209545 208922 208902 208743 207400 205008 202823 201391 200071 198540
57574 198540 197274 196274 194832 192919 191371 190350 189114 187548 186417 185803 184762 182941 181009 179283
57560 179283 177472 175982 175754 176527 177032 177160 178032 179584 180274 179882 180463 183551 188288 193279 198344 203174
57544 203174 206153 206185 204456 202972 202294 201805 201182 200460 199558 198703 198558 199162 199569 199113 198145 197078 195776
57527 195776 194338 193353 192930 192665 192832 194182 196201 197251 197018 197142 198696 200791 202520 204485 207245 209891
57511 209891 211532 212756 214328 215735 216361 216885 218072 219246 219382 218854 218737 219064 218987 218079 216456 214183
57495 214183 211475 208905 206742 204707 202887 201924 201743 201234 199875 198476 197569 196339 194170 191998 190964
57480 190964 190735 190363 189947 190267 191481 193149 194901 196269 196664 196234 195882 195746 194752 192446 190120 189192 189483
57463 189483 190035 190483 190660 190076 188955 188683 189956 191463 191642 190752 189989 189540 188919 188325 188188 188070 187466 187117
57445 187117 188150 190361 192581 194287 195716 196890 197735 198733 200406 202503 204647 207190 210493 213919 216579
57430 216579 218534 220284 221679 222348 222584 222839 222954 222924 223625 225647 228139 230005 231561 233677 235952 237258
57414 237258 237659 238353 239896 241886 244234 247399 251347 255368 258969 262030 264154 264808 264078 262547 260550
57399 260550 258311 256485 255729 255947 256721 258162 260535 263398 265990 268259 270744 273681 276992 280788 285146
57384 285146 289618 293741 297759 302232 307200 312262 317038 321060 323832 325641 327623 330308 332760 333853
57370 333853 333643 332619 330537 327141 323345 320430 318524 316979 315819 315631 316397 317573 319087 321255 323930
57355 323930 326677 329506 332639 335923 339313 343478 348964 355173 361061 366467 371882 377422 382962 388739
57341 388739 394815 400442 404972 408957 413395 418449 423921 430196 437396 444183 448911 451740 454270 457330
57327 457330 460480 463494 466965 471319 476345 481742 487208 492136 496145 499832 504130 509187 514618 520348
57313 520348 526263 531641 536108 540629 546305 552722 558800 564694 571383 578816 586125 593334 601114 609102
57299 609102 616263 622926 630606 639683 649068 658424 668807 680542 692260 702816 712612 722271 731522
57286 731522 740332 749749 760453 771540 781891 791913 802804 814763 827030 839267 851883 865129
57274 865129 878711 892353 906240 920769 936054 951638 966759 981078 995095 1009539 1024543
57263 1024543 1039838 1055511 1071903 1088839 1105643 1122044 1138520 1155645 1173555 1192066 1210865
57252 1210865 1229593 1248200 1267156 1286900 1307264 1327837 1348623 1369824 1391304 1412830 1434557
57241 1434557 1456606 1478541 1499880 1520772 1541467 1561666 1581318 1601538 1623601 1647284 1671297
57230 1671297 1695138 1719378 1744258 1769249 1794138 1819428 1845463 1872017 1898924 1926332 1954302
57219 1954302 1982855 2012315 2042808 2073550 2103529 2132734 2161822 2190733 2218685 2245393 2271239
57208 2271239 2296379 2320811 2345273 2370880 2397819 2425479 2453848 2483530 2514309 2544986 2574924
57197 2574924 2604693 2634932 2665714 2697271 2730244 2764749 2800094 2835624 2871037 2905798 2939309
57186 2939309 2971811 3004011 3035656 3065639 3093635 3120389 3146079 3169819 3191422 3212396 3234351
57175 3234351 3257286 3280187 3302508 3324360 3345867 3367014 3387708 3407661 3426762 3445775 3465936
57164 3465936 3487573 3509801 3531783 3553490 3574936 3595568 3614917 3633164 3650585 3667000 3682160
57153 3682160 3696175 3709196 3721056 3731373 3739716 3745726 3749522 3751832 3753220 3753543 3752847 3752247 3752910 3754593
57139 3754593 3756441 3758880 3763286 3769905 3777650 3786043 3795684 3806444 3816701 3824903 3830593 3833405 3832440 3827347
57125 3827347 3818918 3808037 3795075 3780846 3767006 3754893 3744929 3737504 3733192 3731514 3730773 3729987 3730111
57112 3730111 3732746 3738718 3748597 3763549 3784811 3813165 3849687 3896283 3955046 4028114 4118930 4232862
57100 4232862 4375996 4554183 4773895 5043123 5370598 5764585 6232501 6780493 7412525
57091 7412525 8130342 8934156 9821525 10784339 11807134 12867602 13935609 14969713 15917665
57082 15917665 16727528 17366164 17832726 18155884 18373975 18510024 18559494 18499608 18310130 17985866
57072 17985866 17533061 16960492 16278123 15502215 14657419 13772698 12875983 11991258 11137126
57063 11137126 10325780 9563145 8850319 8185261 7564515 6985025 6445089 5943918 5481107
57054 5481107 5056946 4672444 4328255 4023677 3756351 3521479 3310524 3111995 2915262
57045 2915262 2714311 2508508 2301157 2097737 1903912 1723590 1558811 1411327 1282999
57036 1282999 1174062 1082331 1005019 940511 887920 846343 815502 796083 788941 795335 817921
57025 817921 858100 909581 956236 979743 970439 930699 869888 798359 724846 655543 593547 539620
57013 539620 493684 455127 422511 394441 370522 350492 333027 316734 301767 289056 278429
57002 278429 268977 260821 254792 250515 246456 242013 238119 235543 233855 232295 230600 228755 226866 225463
56988 225463 225172 226111 228265 232211 238608 247159 256831 266656 275358 280707 280577 274694 264441 251253
56974 251253 236209 220780 206583 194296 183810 175351 169380 165518 162714 160587 159727 160743 163902
56961 163902 169635 178455 190536 206179 226287 251013 277783 301618 317662 323081 317369 302367
56949 302367 282002 260527 240339 221913 205501 191851 181276 173179 166866 162195 159343 158584 160340
56936 160340 164944 172447 183060 197451 216159 239213 266579 297712 329452 355427 369409 369394
56924 369394 357680 337884 313278 287145 262278 239617 218668 199454 182847 169076 157297
56913 157297 146762 137273 128459 119956 112327 106537 102457 99065 96073 93990 92600 90882 88675 86958
56899 86958 86200 85777 85382 85720 87367 90164 94127 99770 107135 115646 125304 136906 150708 166056 182649
56884 182649 200778 219576 236199 247633 252720 252074 246997 239100 230113 221259 213092 206148 201046
56871 201046 197780 195718 194667 195347 198699 205443 216298 231701 251184 274034 300895 333799 374035
56858 374035 420120 467438 509080 537740 548890 543086 524756 498738 468692 438075 410375 387524
56846 387524 369351 355254 345447 340215 339310 342809 351569 366216 386604 412926 446570 489478 543385
56833 543385 609448 686505 768181 842527 896170 919882 911461 875458 821090 758880 697087 640153
56821 640153 589835 546791 510920 481417 457515 438943 425498 416844 413035 414689 422475 437069
56809 437069 459686 491818 534042 585138 641479 695965 738202 758291 752153 723124 678656 626481
56797 626481 573180 523590 479820 441608 408410 380435 357512 338452 322399 309808 301430 297378
56785 297378 297749 303061 313452 328548 348624 374385 404468 434036 456850 468285 466324 451373
56773 451373 426365 396002 364433 333766 304950 278899 255979 235520 216871 200198 185529
56762 185529 172046 159220 147763 138580 131518 125929 121509 117806 113880 109446 105537 103091 101663
56749 101663 100361 99167 98353 97463 95944 94132 92674 91601 90797 90589 90993 91115 90223 88716 87228 85617
56733 85617 83793 82652 83017 84336 85560 86694 88414 90696 92954 95021 96956 98348 98864 99109 99945
56718 99945 101265 102257 102550 102338 101843 101385 101567 102595 103852 104721 105270 105620 105478 105038 105458 107429 110018
56701 110018 111916 113120 114359 115557 116068 115948 115831 115888 115880 115929 116358 117045 117707 118467 119441 120304 120928 121890 123588
56682 123588 125467 126873 127953 128986 129652 129855 130432 131904 133258 133130 131619 129889 128541 127516 126965
56667 126965 127024 127136 126731 126187 126128 126196 125589 124375 123292 122626 122201 122036 122089 121925 121545 121934 123765 126193 127950
56648 127950 128977 129899 130633 130768 130686 130978 131284 130946 130320 130125 130074 129514 128911 129263 130381 131161 131272 131231 131102
56629 131102 130433 129308 128236 127301 126521 126578 127818 129025 128663 127032 125700 125144 124505 123462 122685 122421 122210
56612 122210 122076 122588 123625 124418 124817 125226 125343 124477 123131 122750 123601 124344 124054 123406 123464 124435 125952 127547
56594 127547 128562 128552 128030 127962 128480 128983 129382 130177 131386 132529 133676 135296 137046 137918 137756 137513 137844
56577 137844 138508 139207 139979 140697 141251 142208 144213 146739 148686 150195 152631 156636 161480 166493 171890 177882
56561 177882 184202 191013 199340 210213 223880 239644 255517 268347 275735 278083 277723 276133 273182
56548 273182 268996 264818 261565 258817 255845 252620 249437 246477 244077 242543 241421 239772 237326 234518
56534 234518 231452 227814 223834 220242 217241 214522 212196 210564 209037 206620 203543 201133 199914 199066
56520 199066 197861 196325 194340 191470 188008 184967 182702 180670 178718 177368 176600 175581 173941 172228
56506 172228 170861 169728 168892 168543 168144 166979 165643 165582 166926 168211 168534 168563 169044 169743 170313 170897 171379
56489 171379 171259 170710 170589 171081 171525 171834 172732 174230 175234 175151 174664 174569 175039 176312 178635 181136 182156
56472 182156 181311 180024 179606 180041 180880 181907 182506 181900 180511 179747 179954 179995 179251 178513 178370 178254 177732 177321
56454 177321 177355 177442 177570 178388 179843 180976 181577 182497 183895 184893 185548 187278 190456 193317 194321 193958 193241
56437 193241 192056 190201 188535 187769 187348 186664 186192 186371 186601 186352 186134 186407 186726 186804 187153 187810 187823 186931
56419 186931 186352 186891 187682 187860 188073 189162 190701 192048 193577 195658 197605 198782 199591 200316 200265 199164
56403 199164 198094 197939 198157 198177 198629 199976 201334 201998 202770 204342 205614 205163 203396 201857 201423 202261 204381
56386 204381 206909 208090 207436 206734 207580 209170 209956 210166 210953 212186 212912 213225 213948 215115 216216 217325
56370 217325 218700 219935 220720 221639 223039 224072 224073 223849 224325 225028 225269 225731 227289 229210 230150 230161 230227 230572
56352 230572 230900 231561 233019 234796 236215 237515 239096 240507 241341 242196 243565 244835 245605 246866 249468
56337 249468 252562 255029 257385 260758 265026 269496 274347 279804 284869 288492 291085 293374 294874 295124
56323 295124 295354 297018 299529 301217 301693 301658 301266 300447 300072 301016 302667 303858 304508 304985 304906 304137 303904 305219
56305 305219 307238 308792 310482 313509 317712 322611 329053 337549 346123 352225 356045 359727 364036 368040
56291 368040 371441 374903 378462 381669 384984 389213 394034 398777 403969 410356 417208 423485 429747 436973
56277 436973 444414 450752 456561 463480 471720 480533 490279 501728 514051 525804 537370 550272 564776
56264 564776 580334 597547 617355 639042 661449 685505 713163 744517 778480 815667 858107
56253 858107 906636 961021 1022107 1091295 1168393 1252438 1344087 1444799 1554175 1670553 1793387
56242 1793387 1922415 2055211 2188266 2319679 2447884 2568594 2676313 2768344 2844124 2901291
56232 2901291 2936160 2948036 2939495 2912221 2866009 2802151 2724345 2635618 2537401 2432133 2323697
56221 2323697 2214588 2105454 1997810 1894224 1795339 1699683 1607094 1519482 1437692 1360499
56211 1360499 1287416 1219674 1157667 1100122 1046529 997826 953976 913387 875369 840751 809595
56200 809595 780708 753774 729484 707398 686313 666913 651153 638755 627270 615897 606155 598450
56188 598450 591196 584004 578487 575048 571844 567852 564084 561036 557805 554498 552622 552294 551844 550843 550663
56173 550663 551563 552275 552969 555404 559501 563082 565722 569469 574961 580389 585269 591604 600062 608566 616083
56158 616083 624424 634846 646203 657934 671461 687041 702553 717212 733335 752590 773471 794302
56146 794302 815905 839590 865330 893741 927302 968003 1016183 1072795 1139893 1217397 1301780
56135 1301780 1388888 1475246 1556029 1625606 1682013 1728285 1768466 1805210 1841507 1880136 1919422
56124 1919422 1953118 1976394 1989088 1992366 1986569 1974060 1959670 1945395 1927597 1901310 1864126 1814612
56112 1814612 1751326 1675967 1594117 1510675 1427643 1347685 1275531 1213568 1159924 1113111 1074643
56101 1074643 1044863 1020422 998621 980482 967008 956280 946835 940008 936303 933333 929992 928709
56089 928709 930844 933880 935968 939127 944999 951550 956983 962914 970531 977698 983084 989145 997787 1007030
56075 1007030 1015153 1024067 1035367 1047214 1058408 1071260 1087042 1102945 1117027 1131726 1148908 1166072
56063 1166072 1181305 1197336 1216594 1236788 1255516 1274637 1295809 1316260 1333537 1349983 1368062
56052 1368062 1385752 1401037 1416354 1433948 1451537 1467334 1484538 1505861 1528419 1549242 1570995
56041 1570995 1596785 1624130 1649697 1675348 1703824 1732997 1760194 1787680 1818170 1849556 1879827
56030 1879827 1912443 1950920 1992898 2035310 2080261 2129658 2179473 2225926 2272089 2321765 2372325
56019 2372325 2420572 2470208 2526199 2587022 2649619 2716324 2789425 2864766 2938618 3015182 3099355
56008 3099355 3188038 3276698 3368164 3466427 3568385 3670822 3778840 3897845 4023899 4151820
55998 4151820 4285802 4431661 4585712 4742354 4905608 5081822 5268195 5460359 5663878
55989 5663878 5885863 6122665 6368720 6629877 6914695 7220658 7542911 7888211 8265540
55980 8265540 8671784 9102259 9566238 10075811 10629283 11223032 11869586 12585389 13371803
55971 13371803 14228357 15173528 16231372 17410380 18719219 20190636 21865474 23768563
55963 23768563 25929281 28412095 31299033 34662175 38588846 43214875 48696487 55175816
55955 55175816 62822870 71890202 82682899 95520038 110805399 129120801 151210025
55948 151210025 177944705 210289265 248786588 292168915 335928986 372656203 394842020
55941 394842020 398411066 384290221 357121132 322645700 285756613 249836628 216846883
55934 216846883 187630067 162291122 140569536 122061553 106301757 92832563 81279634
55927 81279634 71356015 62813030 55429919 49040236 43521246 38753013 34615483 31017426
55919 31017426 27894234 25178753 22801295 20713941 18887260 17284622 15862858 14594827
55911 14594827 13468139 12463648 11555998 10732793 9992721 9326234 8716468 8157142 7651345
55902 7651345 7194027 6772564 6383128 6030048 5709899 5411695 5132038 4875472 4640520
55893 4640520 4419346 4210744 4020064 3846484 3682782 3527401 3384966 3255416 3134016
55884 3134016 3021444 2922551 2835361 2751739 2668363 2587120 2506028 2420468 2332840 2250690 2175432
55873 2175432 2102243 2030223 1962815 1898858 1833205 1766317 1703993 1647591 1593379 1541307 1495316
55862 1495316 1454878 1415098 1375584 1340687 1310491 1279961 1247622 1217040 1189036 1160244 1130256
55851 1130256 1102633 1077883 1052518 1025883 1001021 978087 953665 927335 902391 879472 855941
55840 855941 832095 811460 794290 777005 758618 741547 725779 708640 690870 676440 665598
55829 665598 654384 641888 631706 625210 619495 613167 608135 604301 598293 589073 579523 571033 561613
55816 561613 550622 540354 531647 522711 513414 506013 500664 494897 488362 483459 480619 477862 475664 477118
55802 477118 482309 487572 491420 496282 503297 510266 515977 521662 526864 528679 526514 523039 519134 512589
55788 512589 503104 493837 486506 479586 472834 468642 466925 463322 454792 442955 429957 415319 399132
55775 399132 384277 372830 363526 354970 348121 343662 340066 336263 333217 331231 328735 325294 322735 321784
55761 321784 320626 318211 315867 314351 312506 310158 309041 309460 309363 308081 307453 307734 305952 300219 292342
55746 292342 284294 275406 265128 255353 247687 241086 234324 228282 223888 220191 216251 212602 209351 205339
55732 205339 200596 197100 195703 194962 194182 194632 196255 196331 193336 189265 186249 183616 180197 176810 174276
55717 174276 171546 167980 165183 164513 164900 165027 165492 166952 168327 168783 169415 171133 172917 173931 175220 177471
55701 177471 179187 178983 177733 176556 174605 170762 165859 161389 157614 154488 152733 152485 152543 152291 152642 153870
55685 153870 154567 154095 153961 155274 156965 158074 159696 163031 167476 172206 177570 183315 187575 189399 190293
55670 190293 191575 192277 191422 190273 190316 190899 190783 190231 189685 188270 185507 182806 181376 180441 179311 179212 181014
55653 181014 183017 183249 182347 181991 182053 181530 180843 180932 181248 180704 179536 178367 176598 173489 169597 165455 160256
55636 160256 153624 147196 142512 138732 134422 130218 127578 126145 124488 122447 120698 119023 116983 115404
55622 115404 115291 116069 116556 116788 117325 117800 117745 117708 117947 117215 114557 111150 108595 106592 104050 101305 99351
55605 99351 97972 96481 95299 95053 95170 95046 95373 96589 97325 96351 94758 94221 94358 93904 93194 93102 92700 90598
55587 90598 87744 86379 86767 87383 87750 88671 89997 90600 90543 91102 92678 94534 96495 99099 102222 105350
55571 105350 109069 114624 122059 130215 138246 145659 151334 154225 154745 153986 151979 148231 143442 138970 134914
55556 134914 130359 125234 120373 116099 112187 108896 106528 104361 101519 98499 96460 95475 94908 94882 95789
55541 95789 96901 97129 96737 96781 97377 98076 99323 101821 104913 107291 108855 110261 111227 111059 110302 109959 109535
55524 109535 107776 104973 102581 100842 98716 95971 93368 90899 87799 84339 81732 80162 78621 76794
55510 76794 75437 74833 74475 74287 74561 74768 74105 73174 73398 74663 75234 74183 72291 70491 69007 68155 68393
55493 68393 69269 69721 69591 69486 69244 68089 66371 65494 65903 66695 67355 68335 69590 70129 69494 68467 67880 67805
55475 67805 68062 68533 68888 69036 69682 71342 73101 73678 73342 73279 73431 72733 71311 70475 70471 70115 68976 68089 68049
55456 68049 68103 67645 67136 66992 66960 67039 67687 68631 68779 67751 66347 65194 64156 63295 63069 63210 62739 61515
55438 61515 60577 60610 61186 61765 62355 62967 63510 64324 65691 66935 67311 67613 69347 72365 74936 76234 76915
55421 76915 77138 76046 73766 71953 71550 71627 71242 70846 70962 70981 70312 69485 69158 69076 68840 68659 68594 68094 67030
55402 67030 66204 66161 66393 66359 66328 66699 67341 68058 68851 69361 69118 68615 69002 70346 71390 71396 70991 70777 70546 70422
55382 70422 71281 73159 74514 74086 72533 71376 71225 71798 72779 73840 74522 74749 74844 74728 73953 72779 72131
55365 72131 72142 71904 71090 70553 70756 70879 70173 69010 67889 66569 64976 63812 63376 62825 61460 59772 58499
55348 58499 57610 57086 57597 59407 61529 62955 63904 64961 65835 65980 65736 65788 65994 65682 64778 63914 63686 64235
55330 64235 65165 65623 65018 63906 63389 63510 63225 62256 61737 62482 63747 64455 64646 64951 65511 66172 66989 67893
55312 67893 68649 69578 71378 73677 74920 74346 73014 72139 71512 70459 69265 68600 68353 68068 67838 67884 67922 67723
55294 67723 67613 67742 67646 67155 66833 66892 66683 66037 65958 67043 68310 68676 68587 69015 69749 69930 69542 69122 68633 67805
55274 67805 67020 66739 66607 66177 65945 66550 67517 67968 68083 68767 70161 71530 72375 72775 72977 73341 74215 75197
55256 75197 75192 73983 72955 73311 74396 74899 74891 75321 76104 76211 75371 74348 73659 73192 72964 73149 73402 73148 72537
55237 72537 72247 72455 72774 72990 73107 72903 72228 71497 71126 70835 70249 69746 69850 70211 70144 69757 69560 69354 68599
55218 68599 67646 67492 68366 69540 70434 71046 71396 71437 71457 71760 72023 71712 71000 70517 70377 70160 69665 68959 67943
55199 67943 66650 65680 65503 65593 65129 64324 64154 64901 65901 66667 67426 68501 69813 71012 71653 71458 70891 71044
55181 71044 72370 73990 74870 75139 75430 75588 75114 74315 73889 73721 73354 73246 74226 75842 76656 76221 75454 74902
55163 74902 74012 72529 71413 71657 72988 74346 75118 75483 75937 76757 77635 77777 76740 75091 73847 73439 73624
55146 73624 74141 74841 75434 75793 76288 77192 78053 78349 78442 79050 80029 80567 80386 79925 79488 79083 78900 79088 79233
55127 79233 78927 78552 78564 78343 76925 74673 72984 72451 72517 72921 74024 75553 76414 76241 75942 76221 76612 76561
55109 76561 76421 76810 77764 79048 80563 82016 82935 83455 84279 85469 86125 85811 85442 86054 87343 88126 87805
55092 87805 86724 85501 84593 84291 84629 85408 86493 87805 88973 89528 89636 90042 90984 91712 91463 90427 89341
55075 89341 88581 88155 88173 88781 89766 90656 91171 91348 91322 91159 90821 90177 89160 87962 86947 86410 86488 87151 88027
55056 88027 88461 88132 87485 87174 87240 87259 87103 86943 86599 85578 83917 82434 81900 82320 83115 83702 83862 83843 84138
55037 84138 84921 85773 86231 86420 86815 87582 88489 89170 89157 88113 86574 85926 86835 88138 88218 87191 86653 87395
55019 87395 88618 89497 90279 91379 92432 92890 92814 92487 91789 90526 88975 87626 86672 86071 85858 86112 86789
55002 86789 87754 88794 89617 90085 90407 90809 91144 91225 91331 91883 92765 93526 94067 94491 94407 93207 91088 89097
54984 89097 87993 87626 87536 87526 87526 87448 87375 87491 87794 88243 89094 90575 92282 93458 93752 93297 92295 91127 90533
54965 90533 90935 91794 92368 92807 93616 94497 94822 94939 95710 96864 97216 96620 96230 96564 96765 96241 95648 95525 95251
54946 95251 94206 92947 92307 92158 91915 91578 91484 91606 91798 92182 92708 92893 92566 92246 92252 92124 91558 91267 92153
54927 92153 94110 96308 98225 99825 101207 102767 105278 109189 114091 119281 124492 129655 134406 138347
54913 138347 141380 143362 143890 142911 141056 138848 136022 132176 127710 123532 120101 117259 114776 112581 110659
54898 110659 109016 107613 106198 104537 102953 102145 102274 102663 102602 101960 100907 99712 99007 99493 100951 102270
54882 102270 102869 103504 105229 108198 111993 116480 121754 127704 134106 140715 146915 151838 155170 157245 158036
54867 158036 156852 153518 149095 144836 141074 137643 134651 132149 129693 126899 123854 120497 116402 111823
54853 111823 108033 105806 104329 102549 100803 100018 99957 99532 98462 97435 96842 96412 95897 95191 94002 92358
54837 92358 91235 91648 93288 94949 96136 97213 98098 98008 96609 94494 92352 90546 89592 90057 91647 93164
54821 93164 93672 93169 92008 90427 88888 88148 88596 89935 91695 93608 95340 96417 96673 96412 96022 95779
54805 95779 95981 96723 97530 97825 97872 98567 100085 101397 101558 100864 100256 100006 99613 98805 98040 97926 98489 99228 99704
54786 99704 99954 100317 100939 101536 101717 101476 101276 101593 102441 103382 104037 104548 105413 106859 108554 110084 111481 113047
54768 113047 114917 117248 120592 125410 131256 137059 142393 147755 153377 158440 161872 163384 163305 161883 159213
54753 159213 155468 150793 145268 139329 133800 129193 125350 122094 119784 118741 118580 118570 118386 118099 117753 117327
54737 117327 116817 116029 114684 112979 111605 110937 110753 111000 112082 113981 115869 117231 118637 120711 123064
54722 123064 125115 127329 130611 134895 139319 143395 147068 149913 151363 151576 151102 149789 146963 142674 137850
54707 137850 133221 128924 125142 122234 120050 117938 115647 113578 112049 110916 110039 109485 109143 108717 108198
54692 108198 107847 107693 107571 107632 108127 108667 108370 106924 104996 103430 102510 102120 102108 102301 102479 102449 101963 100752
54674 100752 99029 97728 97699 98729 99851 100429 100419 99797 98519 97044 96177 96264 97026 98197 99732 101359 102608
54657 102608 103440 104313 105431 106346 106428 105459 103806 102328 101939 102800 104057 104820 105171 105692 106384 106760 106731 106485
54639 106485 105701 103899 101666 100463 100851 101775 101988 101447 100873 100590 100456 100481 100900 101701 102495 102873 102794 102594
54621 102594 102595 102664 102449 102132 102458 103617 104656 104660 104090 104099 104814 105301 105107 104786 104791 104818 104511 103946 103162 102014 100878
54600 100878 100759 102228 104684 106979 108406 108958 109118 109502 110243 110670 110157 109144 108622 108658 108380 107492 106790
54583 106790 106863 107261 107421 107470 107553 107218 106148 104870 104012 103468 102959 102872 103689 104943 105602 105399 105111 105508 106554
54564 106554 107706 108563 109077 109338 109363 109101 108653 108312 108189 107996 107530 107222 107745 109147 110836 112331 113483
54547 113483 114074 113972 113787 114566 116519 118717 120317 121439 122470 123208 123236 122640 121829 120954 119992 119068 118296
54530 118296 117525 116623 115823 115511 115855 116761 117943 118881 119081 118544 117706 116861 116001 115253 114921 114943 114848 114526 114517 115285
54510 115285 116592 117892 118872 119392 119326 118805 118275 118035 117971 117877 117714 117454 117110 116974 117351 117994 118359 118522 119164
54491 119164 120438 121538 121756 121370 121118 121340 121980 122905 123773 124051 123591 122905 122627 123045 124207 125892 127341
54474 127341 127742 127303 127147 127829 128712 129225 129868 131337 133332 135031 136250 137432 138811 140232 141527 142548
54458 142548 143060 142947 142231 140740 138335 135709 134124 133898 133927 133337 132707 132811 133016 132112 130198 128520 127695
54441 127695 127260 126862 126755 127046 127444 127904 128612 129187 128809 127497 126477 126775 127982 128876 128848 128282 127809 127671
54423 127671 127786 128142 128972 130521 132614 134550 135562 135395 134428 133277 132311 131421 130274 128875 127800 127599
54407 127599 128053 128429 128434 128462 128886 129647 130666 132016 133456 134372 134541 134425 134422 134383 134235 134418 135165 135880 135849 135182
54387 135182 134540 134335 134629 135397 136307 136725 136498 136325 136762 137398 137631 137730 138273 139021 139385 139770 141343 144402
54369 144402 147948 151005 153518 155738 157574 159034 160655 162864 165193 166619 166671 165909 165235 164903 164443 163539
54353 163539 162622 162201 161815 160354 157547 154457 152168 150590 148995 147165 145478 144257 143544 143215 142925 142309
54337 142309 141558 141316 141651 141759 141117 140233 139623 138870 137571 136502 136751 138070 139221 139654 139830 140081 140223
54320 140223 140235 140333 140334 139785 138734 137639 136631 135687 135282 135854 136701 136493 134931 132923 131131 129480 128188
54303 128188 128021 129075 130379 131222 131963 132994 133864 134111 134166 134625 135127 134750 133189 130975 128860 127431 127057
54286 127057 127718 129010 130578 132287 133844 134720 134784 134567 134507 134344 133653 132688 132214 132677 133901 135381 136578
54269 136578 137088 136927 136601 136673 137333 138492 140088 142015 143860 145040 145344 145291 145843 147579 150074 152234 153369
54252 153369 153745 153942 153991 153509 152426 151064 149653 148285 147262 146936 147165 147468 147727 148226 148907 149200 148781
54235 148781 148027 147470 147224 147184 147375 147737 147884 147432 146454 145379 144499 143752 142908 141951 141278 141405 142377 143657
54217 143657 144750 145653 146394 146459 145241 142973 140681 139188 138555 138396 138294 137964 137433 137098 137210 137419 137228
54200 137228 136706 136239 135806 135218 134840 135279 136308 136982 136971 137008 137737 138836 139570 139568 138776 137301 135652 134568
54182 134568 134238 134224 134405 135359 137359 139600 140965 141201 140911 140794 141271 142464 144013 145157 145414 145004 144428
54165 144428 143924 143576 143541 143779 143911 143654 143180 142751 142314 141716 140993 140173 139133 137945 137016 136553 136216 135657
54147 135657 135144 135256 136193 137659 139162 140125 140015 138787 137087 135713 135013 134946 135405 136163 136812 137183 137641
54130 137641 138581 139758 140494 140490 140125 140020 140589 141965 144043 146513 149005 151289 153349 155312 157349 159590
54114 159590 162162 165289 169119 173274 176741 178585 178706 177617 175660 172895 169619 166394 163471 160713
54100 160713 158151 156084 154540 153180 151891 150946 150391 149935 149648 150102 151351 152425 152372 151459 150776 150992 151937
54083 151937 153099 154013 154329 153999 153415 153136 153548 154843 156996 159554 161853 163672 165316 166886 167921 168172
54067 168172 168200 168695 169582 170277 170528 170439 169904 168718 167178 166035 165782 166380 167622 169327 171144 172580 173425
54050 173425 173936 174576 175696 177472 179927 182925 186243 189693 193220 196934 201032 205554 210351 215465 221379
54035 221379 228431 236015 242941 248758 254220 260203 266592 272588 277704 282004 285658 288682 291060 292823
54021 292823 294134 295361 296880 298619 300070 300825 300782 299802 297654 294535 291115 287704 283838 279041 273560
54006 273560 267907 262167 256301 250762 246099 242129 238091 233584 228913 224581 220902 218068 216118 214771
53992 214771 213540 212087 210374 208679 207626 207885 209496 211643 213430 214804 216490 219261 223491 229000
53978 229000 234834 239354 241155 239991 236637 231988 226632 221119 216084 211947 208770 206471 204918 203763
53964 203763 202393 200332 197747 195526 194645 195262 196509 197401 197803 198209 198793 199263 199620 200350 201650 203100
53948 203100 204418 205998 208325 211317 214633 218123 221641 224917 228059 231707 236177 240866 245041 248786
53934 248786 252658 256795 260986 265258 269703 273964 277602 280829 284303 288235 292185 295686 298703 301654
53920 301654 305355 310641 317563 325195 332704 340358 348915 358351 367870 376990 385872 394623 402958 410609
53906 410609 417451 423073 426775 428231 427868 426481 424687 422723 420482 417734 414465 410897 407036 402471
53892 402471 396886 390471 383459 375597 366581 356784 347090 338115 329980 322638 315966 309683 303614 297916
53878 297916 292741 287867 282971 278048 273276 268817 264992 262141 259918 257296 253787 250077 246812 243438
53864 243438 239157 234460 230612 227958 225816 223817 222182 220753 218937 216790 215155 214445 214097 213374 212000
53849 212000 209929 207386 205187 204105 203703 202699 200717 198801 197901 197803 197882 198045 198349 198469 198157 197701 197413
53832 197413 197130 196676 196349 196530 197199 198147 199223 200126 200444 200250 200162 200519 200934 200993 200907 201128 201789 202839 204306
53813 204306 206156 208269 210813 214128 218017 221677 224663 227377 230332 233528 236979 241233 246795 253416
53799 253416 260450 267527 274486 281027 286922 292251 297041 301034 304187 307008 309950 312865 315464 317846
53785 317846 319997 321200 320699 318767 316474 314364 311916 308351 303537 298006 292365 286797 281073 275144
53771 275144 269674 265581 262915 260639 257814 254573 251548 248814 246052 243400 241358 239844 238008 235215
53757 235215 231805 228693 226437 224813 223110 220763 217784 214641 211768 209368 207718 207262 208017 209135 209472
53742 209472 208653 207263 206052 205220 204514 203699 202718 201545 200151 198748 197885 198017 198886 199662 199904 200138 201094
53725 201094 202638 204004 204958 206048 207671 209586 211603 214041 217027 219887 221808 222791 223507 224433 225588
53710 225588 226899 228355 229941 231733 233978 236788 239927 243091 246149 248908 251067 252841 255253 259157
53696 259157 264143 269006 273266 277565 282488 287587 291838 294607 295874 295854 294936 293862 293446 293879 294462 294243
53680 294243 292864 290650 288002 285075 282137 279816 278507 277729 276568 274750 272887 271627 271039 270915 271150
53665 271150 271551 271682 271274 270576 270012 269773 269950 270725 272046 273337 273912 273598 272749 271817 271210 271350 272484 274410
53647 274410 276575 278433 279626 280073 280142 280496 281467 282703 283768 284959 287097 290427 294047 296651 297741
53632 297741 297955 298260 298993 299803 300399 301075 302321 304153 306138 307992 309814 311758 313779 315765 317634 319300
53616 319300 320813 322545 324927 327980 331408 335068 338941 342742 346128 349369 353212 357837 362472 366292
53602 366292 369242 371661 373657 375182 376326 377192 377837 378577 379840 381384 382229 381825 380756 379764 378639 376767
53586 376767 374304 372041 370316 368902 367728 366921 366156 364821 362986 361456 360617 359797 358099 355462 352658
53571 352658 350563 349590 349473 349427 348841 347995 347759 348397 349013 348482 346689 344611 343340 343294 344183 345363 346165 346195
53553 346195 345547 344646 343896 343514 343693 344604 346058 347381 348039 348421 349582 352049 355190 358005 360226 362323
53537 362323 364730 367561 370886 374778 379160 384045 389808 396744 404504 412570 421205 431159 442402 453908
53523 453908 464927 475753 486971 498674 510823 523692 537379 551445 565650 580616 597233
53512 597233 615689 635605 656754 679114 702421 726177 749977 773524 796637 819522 842679
53501 842679 866166 889321 911555 932975 953827 973855 992802 1011091 1029360 1047596 1065397
53490 1065397 1082841 1100469 1118529 1136787 1154906 1172520 1189186 1204822 1220065 1235730 1252069
53479 1252069 1268935 1286318 1304163 1321950 1338945 1354571 1368073 1378372 1385024 1388938 1391357 1392418
53467 1392418 1391493 1388508 1383835 1377156 1367673 1355564 1342195 1328658 1315047 1301288 1287565 1273517
53455 1273517 1258049 1240598 1221905 1202973 1183912 1164393 1144655 1125333 1106638 1088339 1070394
53444 1070394 1053057 1036426 1020267 1004384 989025 974857 962484 951877 942506 934244 927772 923618
53432 923618 921049 918697 916214 914583 914731 916650 920084 925167 931851 939423 947213 955419 964755 975675
53418 975675 988392 1003223 1020320 1039265 1059401 1080448 1102470 1125501 1149547 1174765 1201269
53407 1201269 1228988 1258008 1288787 1321558 1355748 1390516 1425829 1462562 1501544 1542951 1586680
53396 1586680 1632779 1681161 1731230 1782273 1834228 1887675 1942845 1998874 2054344 2108528 2161741
53385 2161741 2214418 2266229 2316382 2364459 2410558 2454766 2496898 2536672 2573732 2607446 2637077
53374 2637077 2662260 2683158 2700152 2713571 2723549 2729741 2731126 2726396 2714663 2695677 2669593 2636973
53362 2636973 2598895 2556600 2510903 2462291 2411579 2359947 2308192 2256364 2204365 2152612 2101894
53351 2101894 2052803 2005476 1959768 1915549 1872901 1831933 1792242 1752716 1712295 1670891 1629323
53340 1629323 1588478 1548890 1510956 1474997 1441047 1409053 1379323 1352269 1327746 1305235 1284763
53329 1284763 1266971 1251971 1238678 1225647 1212161 1198205 1183782 1168742 1153156 1137592 1122987
53318 1122987 1110173 1099192 1089146 1079155 1069525 1061479 1055645 1051369 1047723 1044642 1042709 1042305 1043394
53305 1043394 1045788 1049233 1053508 1058772 1065578 1074188 1084156 1094894 1106486 1119605 1134866 1152501 1172461
53292 1172461 1194453 1217955 1242460 1267688 1293512 1319791 1346292 1372538 1397686 1420966 1442367
53281 1442367 1462541 1481841 1499763 1515482 1528537 1538674 1545483 1548638 1548311 1545025 1539216 1531145 1521001
53268 1521001 1508822 1494531 1478253 1460414 1441289 1420698 1398378 1374440 1349206 1322901 1295777
53257 1295777 1268310 1240901 1213479 1185694 1157436 1129008 1100958 1073904 1048291 1024046 1000556
53246 1000556 977126 953338 928937 903779 878228 853276 829830 807894 786738 765774 745076
53235 745076 725151 706447 689077 672844 657564 643402 630774 619866 610445 602218 595066 588673
53223 588673 582134 574346 564869 554226 543273 532288 520757 508089 494505 481042 468571 457049
53211 457049 445961 435233 425312 416469 408484 401033 393900 386827 379562 372208 365124 358349 351470 344122
53197 344122 336390 328633 321221 314427 308228 302253 296238 290465 285346 280755 276270 271905 267949 264203
53183 264203 260211 256243 253142 251032 249058 246731 244624 243325 242495 241497 240324 239328 238581 237959 237328 236309
53167 236309 234494 232303 230956 231089 231976 232573 232618 232247 231334 229938 228726 228154 227740 226898 225922 225398 225161
53150 225161 224656 223891 223245 222733 222202 221812 221598 221029 219830 218735 218521 218737 218397 217534 217018 217114 217386 217799
53132 217799 218766 220108 221059 221421 221769 222470 223412 224736 226830 229468 231840 233622 235182 236654 237765 238711
53116 238711 240173 242114 243574 244087 244473 245624 247218 248227 248189 247430 246456 245580 244817 243829 242269 240346
53100 240346 238686 237526 236506 235412 234566 234252 234246 234195 234054 233868 233518 232881 231904 230433 228355 225974 223808
53083 223808 222014 220451 219260 218642 218096 216771 214769 213255 212848 212768 212132 211317 211264 211953 212350 211660 210004
53066 210004 208086 206750 206690 207999 209929 211393 211781 211247 210478 210312 211219 212842 214288 215099 215671 216560 217743
53049 217743 218811 219503 219781 219720 219634 219918 220414 220328 219202 217604 216377 215550 214618 213597 213077 213205 213300 212748
53031 212748 211763 210982 210659 210633 210830 211360 212075 212470 212256 211809 211706 211957 212160 212380 213262 214973 216638 217364
53013 217364 217382 217497 217752 217499 216645 215929 215868 216194 216558 216992 217435 217510 217178 217020 217492 218403 219439 220595 221718
52994 221718 222288 222181 222072 222538 223251 223579 223560 223667 224048 224654 225779 227788 230477 233258 235794 237947 239404
52977 239404 240001 240211 240676 241331 241613 241429 241279 241418 241470 241054 240330 239843 240144 241571 244007 246770 249023 250317
52959 250317 250592 249911 248590 247313 246571 246054 245110 243769 242696 242125 241474 240188 238381 236366 234035 231176
52943 231176 228140 225841 225083 225969 227741 229144 229228 228038 226464 225379 225040 225219 225571 225748 225465 224675 223609
52926 223609 222608 222015 222080 222685 223167 222816 221707 220759 220857 222093 223884 225516 226499 226776 226783 227033 227526 227840
52908 227840 227911 228242 229037 229559 228865 227005 225044 223943 223822 224231 224739 225227 225915 227169 228965 230611 231305
52891 231305 231023 230494 230261 230144 229808 229458 229650 230627 232134 233673 234650 234479 232963 230644 228562 227583 228000
52874 228000 229592 231879 234424 237080 239890 242602 244558 245393 245681 246481 248279 250724 253283 255633 257360
52859 257360 257796 256450 253365 248972 243954 239266 235743 233373 231260 228580 225331 222084 219367 217460
52845 217460 216257 215100 213262 210914 209071 208216 207678 206856 206325 206888 208098 208772 208645 208403 208233 207526 206174
52828 206174 205087 205028 205779 206846 208166 209634 210652 210780 210351 209954 209744 209723 210170 211245 212461 213104 213004
52811 213004 212494 211927 211636 212068 213362 214911 215827 215784 215031 213720 211667 208859 205856 203493 202280 202087
52795 202087 202313 202392 202198 201948 201785 201677 201641 201777 202046 202405 203194 204849 206999 208397 208189 206904 205756 205257
52777 205257 205020 204659 204208 203673 202759 201349 199917 199167 199298 199732 199587 198478 196900 195794 195701 196361 197089
52760 197089 197360 197106 196695 196704 197440 198609 199647 200453 201538 203388 205922 208637 211031 212850 214243 215755
52744 215755 217827 220181 222039 223002 223339 223398 223276 223202 223570 224273 224579 224106 223398 223108 223149 223195 223534 224721 226641
52725 226641 228522 229661 229659 228294 225849 223304 221528 220362 219139 217908 217465 218150 219387 220521 221425 222064
52709 222064 222084 221259 220023 219193 219284 220242 221653 223070 224275 225293 226137 226605 226474 225786 224769 223648 222706
52692 222706 222250 222208 221932 220843 219195 217852 217361 217555 217950 218177 218114 217963 218178 219016 220231 221373 222214 222592
52674 222592 222225 221198 220340 220507 221532 222463 222749 222611 222353 222028 221893 222407 223477 224269 224163 223502 223127 223548
52656 223548 224823 226898 229704 233097 236904 240810 244098 245823 245536 243700 241287 239098 237459 236251
52642 236251 235123 233910 232868 232315 232089 231768 231392 231467 232136 232843 233067 232969 233037 233471 234294 235734 238037 240929
52624 240929 243645 245474 246186 245986 245161 243744 241480 238331 234993 232624 231878 232314 232885 232856 232221 231508 231332
52607 231332 231941 233026 234055 234830 235538 236278 236843 237089 237222 237513 237939 238316 238600 238872 239137 239344 239559 239940
52589 239940 240542 241230 241818 242288 242868 243788 244903 245779 246303 247045 248699 251258 253939 255818 256316 255299 253197
52572 253197 250967 249436 248550 247612 246302 245059 244483 244716 245518 246504 247261 247591 247635 247376 246202 243660 240629
52555 240629 238834 238833 239292 238746 237328 236117 235475 234936 234364 234226 234748 235589 236447 237306 238014 238224 238001 238029 238896
52536 238896 240393 241765 242469 242612 242770 243431 244504 245476 246129 246879 248130 249518 250269 250244 250137 250566 251378
52519 251378 251996 252101 251754 251175 250632 250358 250367 250532 250974 252206 254689 258406 262970 267897 272533 276017 277738
52502 277738 277810 276777 274927 272301 269318 266829 265178 263596 261011 257338 253567 250640 248715 247518 246886
52487 246886 246629 246254 245335 244054 243073 242831 243210 243883 244711 245724 246907 248148 249365 250615 252043 253652
52471 253652 255150 256185 256788 257422 258478 259900 261471 263229 265396 268041 271061 274376 277872 281227 283960
52456 283960 285576 285645 284065 281474 278958 276925 274627 271277 267278 263661 260595 257351 253647 250138 247394
52441 247394 245334 243933 243581 244210 244820 244574 243829 243407 243344 243107 242650 242450 242635 242898 243226 243997 245265 246586
52423 246586 247708 248865 250169 251263 251950 252742 254283 256406 258186 258960 259028 259281 260374 262429 265397 269407
52407 269407 274673 281281 289249 298566 308814 318757 326748 331716 333526 332385 328402 322050 314612 307637
52393 307637 301941 297468 293958 291309 289323 287583 285822 284239 283308 283411 284640 286708 288885 290293 290627
52378 290627 290575 291290 293255 295829 298071 299906 302166 305473 309511 313602 317669 322129 327050 331895 336076
52363 336076 339272 341189 341539 340468 338674 336891 335486 334552 333979 333332 332226 331005 330554 331176 332218 333144
52347 333144 334421 336710 339637 342049 343353 344020 344903 346580 349275 352918 357218 362009 367425 373486 379779
52332 379779 385950 392322 399568 407990 417610 428701 441497 455522 469988 484909 501077 518719
52320 518719 536867 554398 571164 587732 604486 621380 638242 654911 671288 687495 703861
52309 703861 720572 737581 754854 772356 789646 805985 821127 835620 850030 864217 877695
52298 877695 890273 901902 912226 920849 927827 933349 937051 938211 936640 932884 927508 920706 912784
52285 912784 904543 896838 889925 883488 877201 871128 865725 861588 859082 858116 858330 859483 861539 864467 868327
52270 868327 873611 881061 890806 901936 913289 924556 936237 948600 961150 973283 985145 997502
52258 997502 1010869 1024971 1039115 1052935 1066685 1080772 1095061 1108823 1121421 1132837 1143231
52247 1143231 1152130 1158428 1161338 1161017 1158140 1153225 1146622 1138828 1130288 1120964 1110508 1098973 1086991
52234 1086991 1075178 1063646 1052294 1041331 1031262 1022348 1014284 1006441 998435 990457 983085 976776 971631
52221 971631 967628 964882 963489 963211 963587 964343 965517 967183 969286 971838 975050 979065 983645 988223 992292
52206 992292 995821 999297 1003307 1007960 1012836 1017596 1022490 1028032 1034259 1040618 1046550 1051921 1056931 1061898
52192 1061898 1067181 1072990 1079096 1084934 1090099 1094600 1098617 1102120 1104706 1105685 1104426 1100869 1095575 1089044
52178 1089044 1081193 1071884 1061738 1051800 1042486 1033558 1025131 1017913 1012168 1007247 1002583 998528 995657 993815
52164 993815 992519 991889 992479 994434 997384 1000945 1004684 1007828 1009698 1010422 1010624 1010517 1009863 1008768 1007805 1007229
52148 1007229 1006737 1006222 1006171 1006990 1008371 1009675 1010627 1011288 1011630 1011442 1010533 1008817 1006459 1004211 1003335 1004716 1008020
52131 1008020 1012077 1016248 1021218 1028353 1038412 1051059 1065499 1081261 1098351 1116930 1137209 1159486
52119 1159486 1183896 1209948 1236599 1263028 1289143 1315151 1340750 1365075 1387431 1407892 1427054
52108 1427054 1445224 1461906 1476145 1487436 1496278 1503742 1510586 1516879 1522289 1526394 1528846 1529693 1529583
52095 1529583 1529152 1527977 1524605 1517820 1507484 1493939 1477273 1457754 1436589 1415537 1395812 1377765
52083 1377765 1361409 1346716 1333520 1321773 1311891 1304337 1298797 1294346 1290606 1288333 1288603 1291737 1297205
52070 1297205 1304288 1312581 1322038 1332846 1345234 1359196 1374275 1389659 1404604 1418871 1432738 1446459
52058 1446459 1459732 1471969 1483068 1493652 1504285 1514689 1523851 1530732 1534747 1535813 1534197 1530147
52046 1530147 1523550 1514065 1501667 1486759 1469718 1450789 1430592 1410163 1390125 1370259 1350338 1330910
52034 1330910 1312719 1295762 1279512 1263791 1248810 1234544 1220744 1207401 1194709 1182683 1171299
52023 1171299 1160756 1151043 1141479 1131314 1120575 1109760 1098992 1088204 1077852 1068525 1059911 1051022
52011 1051022 1041444 1031484 1021129 1009844 997519 984659 971339 956894 941010 924272 907192 889543
51999 889543 871162 852695 834956 818192 802515 788440 776309 765619 755523 745566 735419 724400
51987 724400 711993 698518 684619 670344 655399 640125 625456 611841 598666 584944 570289
51976 570289 555215 540700 527458 515521 504624 494993 487508 482892 481005 481131 482691 485520 489793
51963 489793 495897 503972 513230 522039 529063 534128 537698 539910 540560 539722 537852 535365 532584 530081 528677
51948 528677 529067 531659 536693 544263 554276 566557 580871 596535 612128 625861 636335 643075 646634
51935 646634 648364 649719 651391 653081 654088 653836 651783 647341 640331 631246 620664 608570 594640 578970
51921 578970 562208 545105 528309 512445 497930 484703 472467 461190 451113 442371 434858 428450
51909 428450 423069 418568 414841 412110 410862 411459 413862 417686 422387 427419 432309 436558 439585 440892
51895 440892 440324 437893 433397 426611 417982 408758 400116 392450 385641 379705 374875 371400 369600 369788 371776
51880 371776 374713 377802 380982 384611 388820 393586 399105 405477 412139 418153 422983 426544 428637 428972
51866 428972 427757 425687 423186 420163 416686 413407 410985 409450 408511 408320 409515 412456 416643 420986 424609
51851 424609 427321 429303 430406 429950 427258 422307 415779 408612 401589 395189 389541 384410 379400 374339
51837 374339 369557 365770 363475 362383 361674 360998 361021 362498 364976 366948 367441 366858 366066 365219 363975 362389
51821 362389 360904 359564 357821 355260 352232 349583 347877 346936 346212 345669 346048 347999 351041 353846 355564
51806 355564 356378 356765 356859 356740 356646 356514 355928 355017 354803 356005 357928 359186 359160 358204 356847 355587 355050 355394
51788 355394 355599 354264 351305 348258 346766 347260 349100 351281 352811 353041 352137 350971 350276 350033 349715 349002
51772 349002 348218 348246 349953 353555 358684 365131 373056 382122 391012 398533 404879 410908 416244 419058 417953
51757 417953 413351 406776 399452 391968 384608 377405 370171 363005 356570 351508 347720 344562 341641 339064
51743 339064 336982 335245 333735 332884 333520 336058 340036 344761 350278 357163 365255 373160 379429 383810 386863
51728 386863 388792 389399 389059 389040 390686 394574 400294 406487 411120 412366 409630 403788 396652 390291 386278
51713 386278 384827 384693 384351 383143 380978 377532 372649 367293 363115 361003 360790 362267 365395 369377 372580
51698 372580 373948 373798 372919 371616 370019 368583 367678 367199 366984 367072 367134 366236 363807 360494 357560 355694 354730
51681 354730 354167 353539 352633 351724 351419 352033 353390 355296 357702 360207 362008 362745 362898 363110 363855 366177 371840
51664 371840 381715 394364 406985 417499 425103 429303 429568 426053 419884 412511 405229 399255 395583 394600
51650 394600 396294 400819 408177 417161 425231 430013 430826 428577 424456 418947 411997 403769 394984 386452
51636 386452 378422 370673 363260 356732 351381 346663 341882 337208 333524 331343 330420 330392 331192 332626 334009
51621 334009 334611 334267 333333 332184 330951 329551 327764 325420 322727 320322 318725 317770 316760 315258 313538
51606 313538 312177 311422 311155 311356 312248 313956 316361 319456 323611 329249 336471 345202 355420 366809 378170
51591 378170 387561 393181 394226 391203 385676 379430 373427 367650 362226 358275 357049 358465 361236 364414
51577 364414 368066 372488 377645 383656 390932 399390 408258 417138 426616 437304 448887 460587 471909
51564 471909 482306 490924 497784 504865 514994 529632 548441 570761 596494 625324 655825 685665
51552 685665 712367 733980 749740 760326 766974 770178 769575 764944 756680 745138 730205 711789 690270
51539 690270 666232 640266 613383 587079 562452 539510 517799 497451 479181 463365 449627
51528 449627 437356 426251 416273 407367 399424 392364 386102 380497 375406 370806 366775 363339 360330 357400
51514 357400 354286 351148 348600 347258 347147 347603 347827 347482 346679 345576 344308 343341 343426 344831 346792 348126
51498 348126 348406 348211 348290 348850 349712 350708 351709 352549 353191 353829 354612 355400 355895 355853 355138 353742 351852 349662
51480 349662 347034 343649 339589 335510 332028 329171 326572 323915 321043 317959 315020 312823 311595 310839
51466 310839 309831 308304 306483 304735 303447 302893 302907 302908 302583 302322 302636 303402 304107 304696 305746 307876 311286
51449 311286 315803 321056 326681 332662 339430 347487 357093 368396 381371 395131 407624 416712 421577
51436 421577 422724 420860 416436 410255 403739 398140 393685 389665 385180 379777 373694 367621 362065 356945
51422 356945 351955 347227 343240 340121 337421 334679 331970 329745 328347 327776 327858 328569 330207 333013 336553
51407 336553 339769 341939 343375 344871 346733 348750 350818 353057 355437 357826 360304 362912 365207 366757
51393 366757 368061 370313 374087 378914 384295 390428 397583 405502 413998 423708 435653 450332 467706
51380 467706 487895 511278 538008 567983 601471 639245 681568 726767 770899 809140 838019
51369 838019 856684 866291 868431 864213 854329 839187 818832 793276 763200 730057 695272 659766
51357 659766 624406 590389 558658 529314 502147 477618 456720 439857 426345 415157 405731 397852
51345 397852 391113 384885 378741 372643 366696 360925 355332 350015 345102 340652 336695 333305 330533 328309
51331 328309 326505 325063 323874 322612 320937 318913 316962 315304 313750 312204 311025 310568 310607 310635 310556 310716
51315 310716 311317 312257 313512 315299 317750 320754 324149 327683 330703 332243 331684 329248 325909 322997 321664
51300 321664 322173 323593 324612 324800 324698 324607 323930 322051 319352 316879 315305 314757 315348 317164 319699 321881
51284 321881 323008 323426 324145 325947 328930 332696 336759 340815 344708 348204 350886 352426 352940 352942 352900 352919 352884
51267 352884 352757 352693 353028 354234 356719 360345 364175 366941 367981 367581 366334 364373 361489 357816 353987
51252 353987 350595 347846 345778 344384 343307 341822 339539 336980 335114 334367 334260 333866 332415 329706 326326
51237 326326 323417 321829 321413 321288 320741 319680 318414 317318 316727 316758 317080 317086 316443 315432 314701 314717 315371 316112
51219 316112 316587 317138 318401 320407 322504 324357 326450 329192 332072 334342 336166 338330 340994 343584 345877
51204 345877 348313 350997 353163 354050 353900 353732 354400 355988 357769 358650 358134 356949 356340 356630 356987 356658 355828
51187 355828 355017 354321 353631 353073 352672 351973 350517 348477 346464 344934 344041 343740 343605 342905 341372 339774 339243
51170 339243 340065 341434 342308 342231 341394 340321 339533 339387 340126 341963 344882 348326 351472 354026 356455 359175
51154 359175 361800 363497 363837 363014 361420 359402 357327 355567 354374 353831 353795 353776 353133 351589 349424 347082
51138 347082 344819 342907 341802 341821 342788 344209 345582 346486 346723 346649 346961 347888 348919 349677 350637 352523 355299
51121 355299 358289 361090 363765 366224 367962 368532 367991 366932 366285 366893 368861 371391 373584 375262 376674
51106 376674 377686 377920 377624 377766 379035 381171 383429 385341 386925 388464 390219 392107 393630 394404 394749
51091 394749 395328 396232 396894 397014 396996 397195 397258 396690 395715 395044 394974 395234 395675 396532 397876 399270 400219 400717 401094
51072 401094 401624 402646 404852 408881 414473 420462 425957 431376 438075 447128 458734 472649 488833 507573
51058 507573 529157 553218 578031 600569 617832 628491 633340 634482 634584 636378 641466 648778 654924
51045 654924 657116 655702 653266 651424 649133 644071 634914 622152 607548 593451 582264 575580 573197
51032 573197 572921 571609 566763 557556 544738 529917 514985 501758 491477 484394 480104 478356 479248
51019 479248 482538 487307 492711 498773 505978 514294 523039 531648 540099 548526 556764 564331 570690 575481
51005 575481 578720 580720 581681 581414 579702 576819 573420 570010 566806 564075 562244 561567 561922 563065 564950
50990 564950 567703 571438 576147 581730 588111 595408 603998 614386 627009 642075 659399 678274 697587
50977 697587 716158 733003 747558 760106 772110 785630 802070 821662 844359 870860 902344
50966 902344 939357 981356 1027273 1076295 1128191 1183154 1241272 1302005 1364261 1427074 1489860
50955 1489860 1551792 1611289 1666595 1716781 1761794 1801685 1836186 1865047 1888409 1906805 1921061
50944 1921061 1932187 1941275 1949513 1958221 1968324 1979384 1989451 1996473 1999901 2000694 1999935 1997723 1993192
50931 1993192 1985171 1972882 1956313 1935853 1911480 1882581 1848686 1809878 1766239 1717541 1664121
50920 1664121 1607476 1549228 1490006 1430234 1371540 1316144 1264868 1216978 1172040 1130759 1093630
50909 1093630 1059955 1028812 1000146 974196 950577 928683 908509 890384 874241 859644 846213
50898 846213 833575 821275 809301 798440 789583 782857 777728 773653 770272 767347 765062 764070 764700 766284
50884 766284 767785 768971 770490 772942 776371 780639 785788 791902 798899 806560 814608 822909 831753 841790
50870 841790 853386 866188 879669 893873 909262 925978 943811 962845 983583 1006320 1030927
50859 1030927 1057602 1087420 1121726 1161150 1205634 1255371 1311298 1374492 1445367 1523725 1609473
50848 1609473 1702964 1804486 1913734 2030035 2152958 2282321 2417584 2557534 2700612 2844989
50838 2844989 2987941 3125382 3252572 3365521 3461766 3540162 3600543 3643754 3671520 3685788
50828 3685788 3688157 3680193 3664288 3644004 3623411 3606077 3594555 3590475 3594724 3607416 3627596 3652796
50816 3652796 3678720 3699709 3710182 3706184 3685754 3648085 3592770 3519934 3430539 3326057 3207966
50805 3207966 3077908 2938294 2792442 2644097 2496921 2354243 2218827 2092667 1976936
50796 1976936 1872053 1777795 1693718 1619799 1556485 1503820 1460749 1425663 1397469 1375664 1359486
50785 1359486 1347558 1338497 1331443 1325816 1320945 1316131 1310895 1304998 1298374 1291139 1283524 1275750 1267975 1260181
50771 1260181 1251903 1242287 1230701 1217239 1202377 1186314 1168965 1150422 1131002 1111031 1090965 1071507
50759 1071507 1053105 1035553 1018698 1003303 990497 980477 972607 966802 963811 963896 966224 970094 975962
50746 975962 984610 995910 1009100 1023908 1040744 1060145 1082638 1108885 1139363 1173970 1212417 1254858
50734 1254858 1301745 1353207 1408976 1468860 1532901 1600956 1672274 1745471 1818917 1891421 1962612
50723 1962612 2032520 2100784 2166576 2229037 2287023 2338273 2379677 2408943 2425539 2429671 2421239 2400772
50711 2400772 2371022 2336633 2302033 2270110 2242665 2221260 2207173 2200850 2201732 2208666 2220518 2236336
50699 2236336 2254741 2273175 2288137 2296304 2295118 2282373 2256085 2215306 2160703 2094001 2017507 1934584
50687 1934584 1849682 1766746 1687680 1613021 1543720 1481432 1427251 1381108 1342460 1310862 1285885
50676 1285885 1267230 1255052 1249539 1250200 1256174 1267235 1283713 1305263 1330399 1357381 1384907 1411775
50664 1411775 1436697 1458895 1478419 1495568 1510510 1523771 1536508 1549786 1563883 1578584 1593728
50653 1593728 1609091 1624153 1638553 1652666 1667364 1683273 1700526 1719125 1739300 1761572 1786566
50642 1786566 1814667 1845801 1879751 1916693 1957022 2000409 2045402 2090281 2134117 2176694 2217608
50631 2217608 2255870 2290425 2320900 2347979 2373407 2399467 2427525 2456044 2479602 2490489 2482574
50620 2482574 2454790 2411561 2360054 2306966 2257198 2214151 2179929 2155112 2138964 2130238 2127743 2130342
50608 2130342 2136956 2146650 2158236 2169662 2178201 2181379 2177377 2164551 2141289 2106859 2062059 2008614
50596 2008614 1948190 1882306 1812761 1741426 1669648 1598325 1528565 1461779 1399014 1340674 1287068
50585 1287068 1238807 1196265 1158934 1125826 1096450 1070891 1048830 1029110 1010794 994417 981508
50574 981508 972830 967638 964831 964234 966296 971034 977886 986419 996566 1008240 1021310 1036050 1053026
50561 1053026 1072339 1093376 1115511 1138618 1162701 1187469 1212721 1238887 1266709 1296404 1327383
50550 1327383 1358810 1390187 1421376 1452245 1482507 1511928 1540640 1569093 1597660 1626488 1655968
50539 1655968 1687216 1721755 1760750 1804787 1854418 1910436 1973335 2042681 2117232 2195714 2277588
50528 2277588 2363455 2454852 2553356 2659514 2772525 2890812 3012638 3136125 3259093 3379182
50518 3379182 3493966 3600728 3696328 3777650 3842282 3888744 3916291 3924688 3914034 3884510 3836275
50507 3836275 3769876 3686866 3590043 3483180 3370650 3257173 3147485 3045807 2955441 2878765
50497 2878765 2817512 2772836 2745122 2733930 2738416 2757708 2790549 2834370 2884947 2937058 2985259
50486 2985259 3023906 3047071 3049405 3027627 2981295 2912450 2824913 2723571 2613287 2497680 2378916
50475 2378916 2258754 2139564 2024142 1914801 1812853 1718743 1632401 1553551 1481940 1417367
50465 1417367 1359487 1307732 1261485 1220238 1183646 1151641 1124507 1102474 1085111 1071468 1061036
50454 1061036 1054244 1051704 1053181 1057716 1064611 1073893 1085723 1099761 1115328 1132074 1150369 1171051
50442 1171051 1194756 1221268 1249185 1276051 1298889 1315030 1323067 1323533 1318744 1311761 1305095 1299939 1296286
50429 1296286 1293718 1292218 1292290 1294343 1298195 1303454 1310256 1319209 1330560 1343896 1358938 1376260 1396934
50416 1396934 1421719 1451074 1485635 1526016 1571958 1622229 1675697 1732232 1792224 1855403 1920484
50405 1920484 1985861 2050210 2112356 2171018 2225111 2274122 2317739 2355024 2384210 2403411 2411289
50394 2411289 2406910 2389374 2358148 2313830 2258312 2194109 2123706 2049529 1974144 1900110 1829626
50383 1829626 1764465 1706228 1656476 1616428 1586520 1566380 1555379 1553146 1559397 1573271 1593009 1616300
50371 1616300 1640694 1663606 1682241 1693918 1696539 1688809 1670457 1642630 1607840 1569019 1528376 1487238
50359 1487238 1446693 1407878 1371398 1336577 1301366 1263093 1219809 1171590 1120742 1070553 1023667
50348 1023667 981450 944345 912229 884592 860904 840951 824592 811380 800845 793051 788317 786389
50336 786389 786454 787990 790940 794887 798746 801652 803702 805463 807201 808971 811054 813851 817595 822505 828924
50321 828924 836870 845710 854742 863948 873770 884229 894649 904221 912526 919487 925130 929538 933014 936262
50307 936262 940274 945801 952907 961211 970559 981145 993069 1006332 1021355 1038930 1059401 1082485
50295 1082485 1108273 1137788 1172094 1211709 1257692 1312121 1375033 1439824 1493057 1520959 1517530
50284 1517530 1487211 1440651 1388265 1336747 1289537 1248683 1215617 1190784 1173504 1162592 1156928
50273 1156928 1155439 1157027 1161006 1167486 1177062 1190207 1207088 1227598 1251060 1276095 1301278 1325963
50261 1325963 1350074 1373163 1394272 1412878 1429598 1445675 1462040 1478943 1496040 1512312 1526027
50250 1526027 1535187 1538199 1534125 1522496 1503264 1477202 1446228 1413107 1380575 1350572 1324186 1302160
50238 1302160 1285170 1273320 1265255 1257896 1247474 1231370 1209442 1183670 1156447 1129182 1102384 1076572
50226 1076572 1052416 1030006 1008627 987646 967263 948064 930162 913166 896828 881257 866622
50215 866622 853016 840546 829179 818528 808125 797977 788525 780102 772758 766659 762214 759553 758087
50202 758087 756853 755178 752910 750214 747374 744735 742576 740903 739354 737425 734831 731660 728168 724455
50188 724455 720433 716107 711753 707758 704402 701830 700021 698663 697227 695407 693455 691867 690758 689670
50174 689670 688043 685798 683438 681658 680813 680801 681437 682853 685388 689172 694001 699630 705979 713176 721709
50159 721709 732472 746180 762633 781057 801425 825043 853535 887703 927689 973725 1026023
50148 1026023 1084044 1146342 1211031 1275988 1338832 1397394 1450496 1498269 1541915 1583366 1624664
50137 1624664 1666916 1709625 1751108 1789113 1820562 1841292 1847332 1836948 1811147 1772242 1722502
50126 1722502 1664172 1599900 1532559 1464858 1399189 1337339 1280181 1228003 1181215 1140185 1104339
50115 1104339 1072205 1042745 1016055 992357 970988 951028 932499 916214 902673 891719 882990
50104 882990 876001 869856 863665 857405 851831 847332 843231 838409 832294 825105 817489 810142 803570 798032
50090 798032 793789 791397 791381 793522 796789 800350 804443 809945 817140 825291 833513 841676 850211 859217 868130
50075 868130 876286 883521 890031 895887 900934 905085 908465 911218 913330 914691 915133 914369 912092 908330 903696
50060 903696 899146 895431 892764 890857 889233 887513 885476 882948 879843 876492 873833 872948 874285 877469
50046 877469 881849 887047 893047 900147 909036 920538 934908 951515 969501 988633 1009209 1031350
50034 1031350 1054943 1080269 1108169 1139313 1173648 1210721 1250168 1291537 1333831 1375575 1415178
50023 1415178 1450971 1481269 1505136 1523289 1537862 1551097 1564322 1577859 1590959 1601267 1604899
50012 1604899 1597968 1578436 1546540 1503842 1452396 1394685 1333573 1271776 1211427 1154221 1101669
50001 1101669 1054913 1014405 980015 951456 928534 910882 897511 886779 877083 867722 858925 850951
49989 850951 843435 835866 828239 820645 812396 802320 790097 776665 762997 749061 734420 719476
49977 719476 705434 693124 682316 672289 662766 654215 647268 641897 637212 632236 626786 621324 616022
49964 616022 610476 604483 598547 593305 588903 585388 583259 583003 584281 586176 588270 591082 595439 601717
49950 601717 609558 617977 625786 632301 637642 642196 645992 648957 651501 654223 657035 659118 659880 659547 658656
49935 658656 657240 654694 650217 643324 634133 623291 611592 599731 588379 578177 569416 561983 555943
49922 555943 551818 549781 548858 547669 545978 544896 545436 547432 550003 552457 554484 556010 557330 559084 561678
49907 561678 564988 568934 574038 580931 589400 598396 607145 615884 625252 635137 644541 652631 659574 665986
49893 665986 671821 676301 678894 679685 678621 675040 668493 659556 649306 638401 627272 616770 607728
49880 607728 599949 592432 584660 577031 570044 563868 558825 555489 553884 553144 552400 551635 551429 552237 554104
49865 554104 556675 559261 561318 563130 565660 569601 574902 581278 588588 596556 604773 613341 622873 633361
49851 633361 643552 652012 658413 663259 666785 668934 670229 671729 673734 675017 673735 669030 661599 652861
49837 652861 643870 635068 626765 619360 612920 606989 601254 596209 592644 590582 589234 588002 586998 586567
49823 586567 586929 588425 591478 596036 601514 607523 614162 621439 629025 636822 645071 653422 660577 665491
49809 665491 668514 670807 673091 675455 677814 679747 680204 678290 674354 669742 665559 662205 659802 658205
49795 658205 656481 653149 647305 639159 629388 618503 607095 596221 586990 579813 574364 570232 567389
49782 567389 565852 565035 563802 561377 558054 554718 551879 549702 548886 550649 555370 561801 568169 573773 579072
49767 579072 584603 590426 596352 602103 607279 611675 615576 619359 622897 625752 627805 629260 630108 629976 628374
49752 628374 624731 618516 609936 600427 591761 584698 579018 574685 572145 571319 571251 571264 571818 573645 576409 578836
49736 578836 580010 580151 580302 581693 585178 590758 597463 603957 609367 613443 616172 617722 618861 620976 625284
49721 625284 632113 641116 651959 664462 678239 692652 707200 721417 734096 743123 746729 744939
49709 744939 739428 732047 723880 715500 707424 699971 693149 687163 682891 681610 684120 689924 696941 702168
49695 702168 703252 699795 693086 684698 675778 667518 661368 658159 657406 658010 659481 662163 666512 672586 680143
49680 680143 688957 699024 710467 723315 737676 754495 775530 801334 828915 852371 866671 870613
49668 870613 866253 856616 844655 833201 824329 818641 815928 816481 821183 830493 843631 858144 869669
49655 869669 873022 865124 847233 823757 799002 775548 754918 738108 725021 714492 705517 697966
49643 697966 691920 687107 683403 681284 681287 683241 686284 689302 691334 691921 691264 689767 687430 683981 679455
49628 679455 674189 668346 662020 655745 650282 645836 642022 638550 635385 632318 629106 626133 624121 623016
49614 623016 621904 620274 618642 617585 616902 616251 616012 616945 619346 622934 627239 631633 635325 637807 639200
49599 639200 639952 640344 640426 640147 639345 637923 636195 634817 634220 634422 635400 637158 639246 640730 641087 640801 640770
49582 640770 641356 642229 642884 642983 642424 641390 640290 639502 639234 639628 640809 642827 645754 649781 654947 660898
49566 660898 667245 674104 681860 690504 699623 708903 718020 726144 732286 736265 738646 739645 738861 736277 732692
49551 732692 728779 724498 719876 715616 712358 709931 707952 706569 705919 705426 704425 703226 702784 703483 704888
49536 704888 706585 708602 711042 713867 717171 721347 726948 734523 744352 756047 768743 782198 797593
49523 797593 816710 840176 866583 893125 916738 934972 946529 951550 951449 948424 944884 942879 943732
49510 943732 948137 956441 968387 982470 996094 1006703 1012633 1012828 1006450 993392 975023 953930 932813
49497 932813 913500 896462 880968 866126 852133 840207 831043 823852 817332 811039 805242 800058 795597
49484 795597 792571 791730 792708 794305 795941 797927 800122 801381 800950 799732 799385 800486 802251 803870 805320
49469 805320 806793 808042 808807 809536 811074 813722 817058 820746 824935 829610 834076 837629 840414 843013 845298
49454 845298 846373 845697 843618 840733 837340 833719 830380 827589 825072 822481 819897 817641 815873 814513
49440 814513 813334 812099 810992 810791 812092 814523 817538 821944 829518 840799 854232 867939 881311
49427 881311 894445 907320 920465 935314 952832 972931 996380 1025555 1060570 1094915 1117693
49416 1117693 1121586 1107927 1084070 1057537 1033091 1013156 998715 989773 985971 986896 991728 999248 1008725
49403 1008725 1020271 1033903 1048791 1063928 1078977 1093939 1108533 1122551 1136374 1150376 1164097
49392 1164097 1176737 1188216 1199032 1209108 1217475 1223198 1226111 1226549 1224803 1221044 1215409 1207916 1198519
49379 1198519 1187465 1175530 1163804 1153211 1144135 1136371 1129433 1123069 1117466 1112945 1109597 1107334 1106120
49366 1106120 1105858 1106098 1106213 1105926 1105406 1104730 1103508 1101246 1097876 1093527 1087904 1080354 1070775 1060111 1049646
49351 1049646 1040026 1031303 1023692 1017622 1012931 1008586 1003653 998348 993731 990484 988306 986384 984049 980970
49337 980970 977169 973219 970279 969600 971879 977175 985423 996690 1010507 1024974 1036955 1043662 1044154 1039403
49323 1039403 1031299 1021783 1012422 1003995 996326 988817 981142 973094 964065 953417 941439 929282 917831
49310 917831 907306 898080 890997 886405 883511 881309 879608 878661 878352 878433 879149 880870 883383 886165 889119
49295 889119 892462 896080 899571 902647 904933 905696 904552 902311 900356 899125 897801 895380 891516 886443
49281 886443 880860 875955 872809 871570 871692 873005 875979 880844 887097 894092 901555 909294 916763 923197
49267 923197 927935 930697 931917 932699 933853 934948 934851 933220 930857 928652 927114 927230 930723 938540 949559
49252 949559 961725 974352 988474 1004619 1020713 1032714 1037356 1034233 1025349 1013052 998699 983062
49240 983062 967208 952382 939271 927874 918068 909950 903698 899486 897567 898152 901225 906611 913960
49227 913960 922393 930546 937628 944309 952027 961429 971970 982821 993456 1003336 1011893 1019236 1026381
49214 1026381 1034343 1043155 1051852 1059127 1064079 1066845 1068744 1071540 1076388 1083558 1092877 1103913 1115884
49201 1115884 1128118 1140731 1154384 1169275 1184840 1200453 1215873 1230975 1245633 1259963 1274084
49190 1274084 1287605 1299980 1311414 1322707 1334015 1344611 1354134 1363308 1373012 1383412 1394553 1407074
49178 1407074 1421615 1438014 1455886 1475735 1498877 1526452 1559039 1597022 1640553 1688735 1738811
49167 1738811 1786116 1825054 1851066 1862655 1861947 1853309 1841319 1829511 1820053 1813881 1811059 1811116 1812966
49154 1812966 1814909 1815483 1814630 1813539 1813161 1813433 1814164 1815989 1819899 1826237 1834625 1844530 1855532 1867335 1879969
49139 1879969 1893725 1908612 1924155 1940045 1956649 1974527 1993682 2013557 2033505 2053103 2072429
49128 2072429 2092330 2113961 2137597 2162135 2186080 2208787 2230636 2252491 2275367 2300139 2327088
49117 2327088 2355919 2386485 2419241 2454926 2494372 2538934 2590536 2651034 2722547 2809331 2918350
49106 2918350 3055273 3217346 3389512 3549790 3683384 3795800 3911331 4052531 4215080
49097 4215080 4361945 4446083 4443683 4369203 4260982 4152496 4053387 3951789 3831143 3685830
49087 3685830 3524570 3362518 3211843 3078645 2965144 2871490 2795464 2732984 2680488 2636490
49077 2636490 2600539 2571561 2547749 2527306 2508687 2490638 2472651 2455129 2438746 2423863 2410655
49066 2410655 2399325 2389769 2381381 2373544 2366087 2359065 2352470 2346432 2341371 2337532 2334590 2332072 2330072 2329177
49052 2329177 2329741 2331486 2333895 2336802 2340510 2345325 2350949 2356288 2359889 2360651 2358304 2353466 2347376 2341400
49038 2341400 2336487 2332992 2330956 2330401 2331290 2333424 2336599 2340782 2345966 2351911 2358165 2364182 2369387 2373337
49024 2373337 2375950 2377372 2377535 2376212 2373679 2370878 2368615 2366960 2365798 2365543 2366738 2369276 2372605 2376568
49010 2376568 2381477 2387415 2394020 2400927 2407917 2414679 2420974 2427113 2433769 2441186 2448922 2456410 2463343 2469416
48996 2469416 2474165 2477347 2479259 2480418 2480972 2480524 2478529 2474962 2470630 2466537 2462800 2458565 2453373 2448150
48982 2448150 2444280 2441891 2439795 2437030 2433766 2430592 2427608 2424530 2421206 2417661 2413939 2410165 2406531 2403041
48968 2403041 2399461 2395678 2391960 2388729 2386260 2384656 2383961 2384275 2385858 2389089 2394194 2401068 2409460 2419123
48954 2419123 2429659 2440597 2451971 2464500 2478778 2494533 2511249 2529233 2549287 2571293 2593841
48943 2593841 2615512 2636039 2656122 2676637 2698316 2721719 2747190 2775038 2805896 2840561 2879312
48932 2879312 2921594 2966468 3013181 3061412 3111336 3163513 3218312 3275361 3333856 3393349 3453848
48921 3453848 3515238 3577168 3639612 3702901 3766947 3830896 3893771 3955000 4014159 4070818 4125053
48910 4125053 4177600 4228960 4278647 4325827 4370482 4413373 4454873 4494346 4530822 4563990 4594270
48899 4594270 4622075 4647299 4669683 4689506 4707520 4724050 4738523 4750256 4759477 4767030 4773131 4777012
48887 4777012 4777889 4775776 4771031 4763544 4752821 4738638 4721221 4700824 4677398 4650734 4620817 4587991
48875 4587991 4552773 4515431 4475764 4433350 4387931 4339443 4287878 4233404 4176665 4118695 4060487
48864 4060487 4002763 3946060 3890771 3837014 3784682 3733708 3684236 3636642 3591466 3549115 3509440
48853 3509440 3471792 3435780 3401781 3370429 3341874 3315898 3292486 3271822 3253898 3238652 3226337
48842 3226337 3217259 3211217 3207722 3206602 3207853 3211082 3215870 3222654 3232394 3245165 3259863 3275523 3292177
48829 3292177 3310029 3328561 3347091 3365693 3384879 3404633 3424357 3443705 3462973 3482702 3503192
48818 3503192 3524394 3546027 3567729 3589211 3610320 3631006 3651257 3671020 3690055 3708133 3725594
48807 3725594 3743484 3762719 3783224 3804258 3825470 3847196 3869899 3893791 3918910 3945025 3971465
48796 3971465 3997517 4022910 4047440 4070369 4090934 4109239 4125842 4140577 4152851 4163116 4172850
48785 4172850 4182667 4191486 4198085 4202477 4205040 4205248 4202082 4195087 4184224 4169280 4150289 4128010 4103058
48772 4103058 4074885 4042470 4005819 3966014 3923960 3879845 3833769 3786191 3737594 3688199 3638024
48761 3638024 3586985 3535150 3483322 3433061 3385595 3340810 3297815 3256316 3216932 3180362 3146798
48750 3146798 3116082 3087771 3061049 3035134 3009982 2986304 2964831 2945899 2929706 2916546 2906629
48739 2906629 2899866 2895860 2894010 2893738 2894827 2897328 2900891 2904467 2907089 2908811 2910461 2912580 2915044 2917678
48725 2917678 2920708 2924507 2929246 2934940 2941508 2948583 2955430 2961246 2965612 2968718 2971233 2973798 2976501 2978938
48711 2978938 2980915 2982913 2985629 2989149 2992876 2996215 2999059 3001546 3003599 3004938 3005627 3006432 3008320 3011392
$$ [...]
##END NTUPLES=NMR SPECTRUM
##END=
