##TITLE=AC1729_SEN00002_9275740_F0xnw3EYGm
##JCAMPDX= 6.0         $$ Bruker NMR JCAMP-DX V2.0
##DATA TYPE= NMR SPECTRUM
##DATA CLASS= NTUPLES
##ORIGIN= BRUKER
##OWNER= Administrator
$$ 1.72 TOPSPIN		Version 2.1
$$ 2015-08-08 00:17:45.531 -0700  Administrator@X
$$ Compression mode = diff/dup
##.OBSERVE FREQUENCY= 400.02188249412
##.OBSERVE NUCLEUS= ^1H
##.ACQUISITION MODE= SIMULTANEOUS (DQD)
##.ACQUISITION SCHEME= undefined
##.AVERAGES= 64
##.DIGITISER RES= 22
##SPECTROMETER/DATA SYSTEM= spect
##.PULSE SEQUENCE= noesygpps1d.comp
##.SOLVENT NAME= COFFEE_meoh
##.SHIFT REFERENCE= INTERNAL, COFFEE_meoh, 1, 14.96103
##AUDIT TRAIL= $$ (NUMBER, WHEN, WHO, WHERE, PROCESS, VERSION, WHAT)
$$ ##TITLE= Audit trail, TOPSPIN		Version 2.1
$$ ##JCAMPDX= 5.01
$$ ##ORIGIN= Bruker BioSpin GmbH
$$ ##OWNER= Administrator
$$ $$ E:\/data/COFFEE/nmr/AC1729_SEN00002_9275740_F0xnw3EYGm/32/pdata/1/auditp.txt
$$ ##AUDIT TRAIL=  $$ (NUMBER, WHEN, WHO, WHERE, PROCESS, VERSION, WHAT)
(   1,<2015-08-08 00:17:40.219 -0700>,<Administrator>,<X>,<go>,<TOPSPIN 2.1>,
      <created by zg
	started at 2015-08-08 00:06:10.609 -0700,
	POWCHK enabled, PULCHK disabled,
       configuration hash MD5:
       21 0F 79 D6 B3 7B B4 F6 88 20 88 DB 03 48 BD 9F
       data hash MD5: 64K
       70 C1 8D 0F 2A 72 3F 9E 79 39 98 B9 3F 33 E0 D3>)
(   2,<2015-08-08 00:17:43.469 -0700>,<Administrator>,<X>,<proc1d>,<TOPSPIN 2.1>,
      <Start of raw data processing
       efp LB = 0.3 FT_mod = 6 PKNL = 1 PHC0 = 0 PHC1 = 0 SI = 128K 
       data hash MD5: 128K
       AA CC 32 3C F8 B8 B8 F1 47 43 D8 8C 55 B1 9D 33>)
(   3,<2015-08-08 00:17:44.344 -0700>,<Administrator>,<X>,<proc1d>,<TOPSPIN 2.1>,
      <pk PHC0 = -86.52832 PHC1 = 0 
       data hash MD5: 128K
       A8 05 EF 63 1C 48 DC 2F 8F 35 47 AA 75 35 41 5E>)
(   4,<2015-08-08 00:17:44.766 -0700>,<Administrator>,<X>,<proc1d>,<TOPSPIN 2.1>,
      <abs ABSG = 1 
       data hash MD5: 128K
       A1 FE 85 D6 89 A1 B7 40 51 B1 DA 91 B6 61 BF CC>)
(   5,<2015-08-08 00:17:44.859 -0700>,<Administrator>,<X>,<proc1d>,<TOPSPIN 2.1>,
      <abs ABSG = 2 
       data hash MD5: 128K
       3B 1F 86 DF 39 7E CA E2 20 79 7A 5B 92 D4 11 89>)
(   6,<2015-08-08 00:17:44.938 -0700>,<Administrator>,<X>,<proc1d>,<TOPSPIN 2.1>,
      <abs ABSG = 3 
       data hash MD5: 128K
       CC B1 FA E8 C5 46 C9 2B A9 2A F7 23 E6 69 C6 EA>)
(   7,<2015-08-08 00:17:45.016 -0700>,<Administrator>,<X>,<proc1d>,<TOPSPIN 2.1>,
      <abs ABSG = 4 
       data hash MD5: 128K
       5F B2 50 09 09 2D 65 BB 26 78 65 60 D5 D7 06 45>)
(   8,<2015-08-08 00:17:45.141 -0700>,<Administrator>,<X>,<proc1d>,<TOPSPIN 2.1>,
      <abs ABSG = 5 
       data hash MD5: 128K
       4D 93 85 C7 E7 A1 08 B9 C5 CB FD 31 7F 5D D2 49>)
$$ ##END=
$$ 
$$ $$ hash MD5
$$ $$ A8 A5 68 BD 14 97 3E 77 24 56 D5 1A 9B 49 A0 30
##$RELAX= 
##$RELAX= 
##$RELAX= 
##$RELAX= 
##$RELAX= 
##$RELAX= 
##$RELAX= 
##$RELAX= 
$$ Bruker specific parameters
$$ --------------------------
##$DU= <E:\>
##$EXPNO= 32
$$ [...]
##$TP07= 0
##$TPNAME0= <>
##$TPNAME1= <>
##$TPNAME2= <>
##$TPNAME3= <>
##$TPNAME4= <>
##$TPNAME5= <>
##$TPNAME6= <>
##$TPNAME7= <>
##$TPOAL= (0..7)
0.5 0.5 0.5 0.5 0.5 0.5 0.5 0.5
##$TPOFFS= (0..7)
0 0 0 0 0 0 0 0
##$TUNHIN= 0
##$TUNHOUT= 0
##$TUNXOUT= 0
##$USERA1= <user>
##$USERA2= <user>
##$USERA3= <user>
##$USERA4= <user>
##$USERA5= <user>
##$V9= 5
##$VALIST= <valist>
##$VCLIST= <CCCCCCCCCCCCCCC>
##$VD= 0
##$VDLIST= <DDDDDDDDDDDDDDD>
##$VPLIST= <PPPPPPPPPPPPPPP>
##$VTLIST= <TTTTTTTTTTTTTTT>
##$WBST= 2048
##$WBSW= 25
##$XGAIN= (0..3)
0 0 0 0
##$XL= 0
##$YL= 0
##$YMAX_a= 6158207
##$YMIN_a= -11761203
##$ZGOPTNS= <>
##$ZL1= 120
##$ZL2= 120
##$ZL3= 120
##$ZL4= 120
##$ABSF1= 14.96103
##$ABSF2= -5.597152
##$ABSG= 5
##$ABSL= 3
##$ALPHA= 0
##$AQORDER= 0
##$ASSFAC= 0
##$ASSFACI= 0
##$ASSFACX= 0
##$ASSWID= 0
##$AUNMP= <proc_prof1d_extract.lims>
##$AXLEFT= 0
##$AXNAME= <>
##$AXNUC= <1H>
##$AXRIGHT= 0
##$AXTYPE= 0
##$AXUNIT= <>
##$AZFE= 0.1
##$AZFW= 0.1
##$BCFW= 0
##$BC_mod= 0
##$BYTORDP= 0
##$COROFFS= 0
##$CY= 15
##$DATMOD= 1
##$DC= 0
##$DFILT= <>
##$DTYPP= 0
##$F1P= 0
##$F2P= 0
##$FCOR= 0.5
##$FTSIZE= 131072
##$FT_mod= 6
##$GAMMA= 0
##$GB= 0
##$INTBC= 1
##$INTSCL= 1
##$ISEN= 128
##$LB= 0.3
##$LEV0= 0
##$LPBIN= 0
##$MAXI= 10000
##$MC2= 0
##$MEAN= 0
##$ME_mod= 0
##$MI= 0
##$NCOEF= 0
##$NC_proc= -2
##$NLEV= 6
##$NOISF1= 0
##$NOISF2= 0
##$NSP= 0
##$NTH_PI= 0
##$NZP= 0
##$OFFSET= 14.96103
##$PC= 1
##$PHC0= -86.52832
##$PHC1= 0
##$PH_mod= 1
##$PKNL= yes
##$PPARMOD= 0
##$PPDIAG= 0
##$PPIPTYP= 0
##$PPMPNUM= 2147483647
##$PPRESOL= 1
##$PSCAL= 4
##$PSIGN= 0
##$PYNMP= <proc.py>
##$REVERSE= no
##$SF= 400.020009623009
##$SI= 131072
##$SIGF1= 0
##$SIGF2= 0
##$SINO= 400
##$SIOLD= 131072
##$SPECTYP= <>
##$SREGLST= <1H.CDCl3>
##$SSB= 0
##$STSI= 131072
##$STSR= 0
##$SW_p= 8223.68421052631
##$SYMM= 0
##$S_DEV= 0
##$TDeff= 65536
##$TDoff= 0
##$TI= <>
##$TILT= no
##$TM1= 0
##$TM2= 0
##$TOPLEV= 0
##$USERP1= <user>
##$USERP2= <user>
##$USERP3= <user>
##$USERP4= <user>
##$USERP5= <user>
##$WDW= 1
##$XDIM= 131072
##$YMAX_p= 353002281
##$YMIN_p= -12889
##$CURPLOT= <Network HP LaserJet P1505>
##$CURPRIN= <$Network HP LaserJet P1505>
##$DFORMAT= <normdp>
##$LAYOUT= <+/1D_H.xwp>
##$LFORMAT= <normlp>
##$PFORMAT= <normpl>
##$SURQMSG= 1
$$ End of Bruker specific parameters
$$ ---------------------------------
##NTUPLES= NMR SPECTRUM
##VAR_NAME=  FREQUENCY,     SPECTRUM/REAL,   SPECTRUM/IMAG
##SYMBOL=    X,             R,               I
##VAR_TYPE=  INDEPENDENT,   DEPENDENT,       DEPENDENT
##VAR_FORM=  AFFN,          ASDF,            ASDF
##VAR_DIM=   131072,        131072,          131072
##UNITS=     HZ,            ARBITRARY UNITS, ARBITRARY UNITS
##FACTOR=    0.0627417313425164, 1,          1
##FIRST=     8223.62146879497, 4734,         -50506
##LAST=      0,             6708,            -50617
##MIN=       0,             -12889,          0
##MAX=       8223.62146879497, 353002281,    0
$$ Real data points
##PAGE= N=1
##DATA TABLE= (X++(R..R)), XYDATA
$$ [...]
63931E303527J57944J21129Q1782M0376k331m5345q7488j27359j63562j95231
63921E083442k22025k43574k59289k68933k73007k72288k67225k58161k45857
63912B773083k31329k15271j98033j80077j62047j44388j27378j11615r7907q6398
63902A218640p6226o6430n6935m8395m1373l6074l2507l0385k8915k7220k5122
63891G49058k3158k1797k0938k0183j9307j8369j7524j6833j6016j4575j2418
63880E47940j0244q877q156o987m679j763P54K529L925N270O542P702Q861J0064
63866E52881J1135J1932J2577J3383J4455J5342J5269J3911J1878J0070Q671P138
63854F98642N244L514K291J028r88l524n654p011q190r829j1835j3600j4761j5571
$$ y = [5303527, 5461471, 5582600, 5664382, 5704758, 5702427, 5657082, 5569594, 5442235, 5278673, 5083442, 4861417, 4617843, 4358554, 4089621, 3816614, 3544326, 3277101, 3018940, 2773083, 2541754, 2326483, 2128450, 1948373, 1786326, 1641938, 1514560, 1402945, 1305038, 1218640, 1142414, 1075984, 1019049, 970654, 929281, 893207, 860700, 830315, 801400, 774180, 749058, 725900, 704103, 683165, 662982, 643675, 625306, 607782, 590949, 574933, 560358, 547940, 537696, 528819, 520663, 513676, 508997, 507234, 507988, 510517, 514442, 519712, 526254, 533956, 542817, 552881, 564016, 575948, 588525, 601908, 616363, 631705, 646974, 660885, 672763, 682833, 691504, 698642, 703886, 707400, 709691, 710719, 709731, 706207, 700553, 693542, 685352, 675523, 663688, 650088, 635327, 619756]
63840F19756j6654j8292j9890k0394j9538j8348j7984j8304j8141j6915j5263
63829D20033j4030j3275j2540j1610j0610r683q866q138p380o462n527m867m537
63816C02508m276l891l390k762j984j321j108j166r74o58j037k330l479l377k340
63801B68415j596j647j908j801j456j250j334j698k225k577k529k396k685l237
63787B40076l348k805k196j971j801j247n45k07k35k05J03N77J088J491J517J071
63771B31363N36L61M41L23q6m32n46o31p67p72p10j010j677j900j009L92R16P2
63753B24864j118j371n12O53J388J528J293J067J278J983K554K302J491J182J889
63738B40471K835K914J962P38m0j25M62J467K342K737K979L612M445M674M050
$$ y = [619756, 603102, 584810, 564920, 544526, 524988, 506640, 488656, 470352, 452211, 435296, 420033, 406003, 392728, 380188, 368578, 357968, 348285, 339419, 331281, 323901, 317439, 311912, 307045, 302508, 298232, 294341, 290951, 288189, 286205, 284884, 283776, 282610, 281636, 280978, 279941, 277611, 274132, 270755, 268415, 266819, 265172, 263264, 261463, 260007, 258757, 257423, 255725, 253500, 250923, 248394, 245998, 243313, 240076, 236728, 233923, 231727, 229756, 227955, 226708, 226163, 225956, 225721, 225516, 225619, 226196, 227284, 228775, 230292, 231363, 231899, 232260, 232701, 233024, 232938, 232506, 231960, 231329, 230562, 229790, 229080, 228070, 226393, 224493, 223484, 223876, 224792, 224864, 223746, 222375, 221863, 222516, 223904, 225432, 226725, 227792, 229070, 231053, 233607, 235909, 237400, 238582, 240471, 243306, 246220, 248182, 248920, 248880, 248755, 249217, 250684, 253026, 255763, 258742, 262354, 266799, 271473, 275523]
63723B75523L332L303L854M307M300L892L209K310J297K54p85j640k055k100k162
63708B96839k303k045j191l99l77q03p68n5O67R90J288J917K551K752K709K956
63692C04728L526L874L551K592J362K41m93p60p80q82j176j417j328r41n59l34
63676C11204q2M32J097J518J440R02Q3o83q18J20J653K445J570m26k115k681k473
63659C13186k225k267k493k732k973l363l978m475m253l198k015j400j151o93
63645B75970j18J3k22l7Q50J809K305K533K722K658K399K665L785M898N010M446
63629C11686M366N187O277P079P667Q203Q634R067R828J0955J2149J3330J4761
63616D29189J6437J7887J8788J9494K0628K2395K4336K5622K5579K4204K2066
$$ y = [275523, 278855, 282158, 286012, 290319, 294619, 298511, 301720, 304030, 305327, 305581, 304796, 303156, 301101, 299001, 296839, 294536, 292491, 291300, 290901, 290524, 289721, 288953, 288898, 289565, 290555, 291843, 293760, 296311, 299063, 301772, 304728, 308254, 312128, 315679, 318271, 319633, 319874, 319381, 318621, 317841, 316959, 315783, 314366, 313038, 312097, 311538, 311204, 311122, 311554, 312651, 314169, 315609, 316511, 316594, 315911, 315093, 315213, 316866, 319311, 320881, 320455, 318340, 315659, 313186, 310961, 308694, 306201, 303469, 300496, 297133, 293155, 288680, 284427, 281229, 279214, 277814, 276663, 275970, 275852, 275865, 275643, 275606, 276456, 278265, 280570, 283103, 285825, 288483, 290882, 293547, 297332, 302230, 307240, 311686, 316052, 321239, 327516, 334595, 342262, 350465, 359099, 368166, 377994, 388949, 401098, 414428, 429189, 445626, 463513, 482301, 501795, 522423, 544818, 569154, 594776, 620355, 644559, 666625]
63605F66625J9495J6085J1432O228J878r96l011m828o219o678o433o236o494p100
63591F73748p944r160j0891j3081j5389j7234j8106j8043j7510j6706j5376j3506
63579E00802j1730j0550r524p820n366k869q33Q31K208L064L332L414L692M124
63565D72775M564N128N888O512O674O693P357Q956J0897J2364J3298J4443J6472
63552E92021J9229K1942K4076K5795K7438K8686K8477K5951K1315J5624R765L930
63540H44249j781o585r321r689q812q223q407q652q288p702p974r751j2721j5973
63526G20370j8731k0752k2249k3408k4033k3775k2740k1495k0411j9268j7835
63515D85673j6430j5448j4534j2927j0657q741p880p525o656n158l831l231l076
$$ y = [666625, 686120, 702205, 713637, 719865, 721743, 720747, 717736, 712908, 706689, 700011, 693578, 687342, 680848, 673748, 665804, 656644, 645753, 632672, 617283, 600049, 581943, 563900, 546390, 529684, 514308, 500802, 489072, 478522, 468998, 461178, 455812, 452943, 452110, 452941, 455149, 458213, 461545, 464959, 468651, 472775, 477339, 482467, 488355, 494867, 501541, 508234, 515591, 524547, 535444, 547808, 561106, 575549, 592021, 611250, 633192, 657268, 683063, 710501, 739187, 767664, 793615, 814930, 830554, 840319, 844249, 842468, 835883, 826562, 816873, 808061, 799838, 791431, 782779, 774491, 766789, 758815, 749064, 736343, 720370, 701639, 680887, 658638, 635230, 611197, 587422, 564682, 543187, 522776, 503508, 485673, 469243, 453795, 439261, 426334, 415677, 406936, 399056, 391531, 384875, 379717, 375886, 372655, 369579]
63502C69579k868k562k357k187j770j067m32k69o99j497k255k551k148j126J20
63487C45911J087J452J231P45M26O19J401K438L138L185K920K928L187K976J893
63472C75537N52k09n55j354k711l610l349k598k363k516k135j078k15j42m40m89
63456C52325k90o5L51J200K213K908L284L806M784O047P210P988Q351Q593R105
63441D17810R968J0951J2063J3757J6201J8655K0077K0207J9617J8783J7648J6095
63429F11832J4287J2433J0653R304R006J0117J2328J4988J7668K0292K2944K5579
63417G91431K7727K8446K6869K2994J7708J2085O791K165j625m625p007q725r613
63404I04621r931j0384j1334j2364j3054j3855j5696j8774k2210k4928k6531k7248
$$ y = [369579, 366711, 364149, 361792, 359605, 357835, 356768, 356336, 356067, 355368, 353871, 351616, 349065, 346917, 345791, 345911, 346998, 348450, 349681, 350426, 350852, 351471, 352872, 355310, 358448, 361633, 364553, 367481, 370668, 373644, 375537, 376089, 375880, 375325, 373971, 371260, 367650, 364301, 361703, 359340, 356824, 354689, 353611, 353396, 353254, 352814, 352325, 352035, 351970, 352321, 353521, 355734, 358642, 361926, 365732, 370516, 376563, 383773, 391761, 400112, 408705, 417810, 427778, 438729, 450792, 464549, 480750, 499405, 519482, 539689, 559306, 578089, 595737, 611832, 626119, 638552, 649205, 658509, 667515, 677632, 689960, 704948, 722616, 742908, 765852, 791431, 819158, 847604, 874473, 897467, 915175, 927260, 934051, 936216, 934591, 929966, 922959, 914234, 904621, 894690, 884306, 872972, 860608, 847554, 833699, 818003, 799229, 777019, 752091, 725560, 698312]
63392F98312k7355k6869k5696k3882k1623j9133j6540j3994j1715r757p792n438
63380D88518k831n74R76K133L416M999O704Q315R629J0484J0976J1448J2074J2679
63366E78946J3170J3907J5296J7261J9399K1508K3606K5501K6719K6847K5840
63355H08000K4018K1875J9656J6966J3096P938K368k544o321q916j0258j0527
63343H75351j0448j0656j1057j1383j2053j3741j6252j8713k0756k2629k4152
63332G03511k4601k3829k2531k1042j8848j5793j2771j0505q485o049l837l104
63320E32116l930n193o157p137q552j0211j1717j2818j3208j2566j1060r322p742
63307D12503o238m802l644k723j678n39J00p7n38o52n31p28j395k259l180m212
$$ y = [698312, 670957, 644088, 618392, 594510, 572887, 553754, 537214, 523220, 511505, 501748, 493956, 488518, 485687, 485113, 486089, 488222, 491638, 496637, 503341, 511656, 521285, 531769, 542745, 554193, 566267, 578946, 592116, 606023, 621319, 638580, 657979, 679487, 703093, 728594, 755313, 782160, 808000, 832018, 853893, 873549, 890515, 903611, 911549, 913917, 911373, 905052, 896136, 885878, 875351, 864903, 854247, 843190, 831807, 819754, 806013, 789761, 771048, 750292, 727663, 703511, 678910, 655081, 632550, 611508, 592660, 576867, 564096, 553591, 545106, 539057, 535220, 532116, 528186, 522993, 516836, 509699, 501147, 490936, 479219, 466401, 453193, 440627, 429567, 420245, 412503, 406265, 401463, 397819, 395096, 393418, 392879, 392979, 392902, 392364, 391712, 391181, 390453, 389058, 386799, 383619, 379407]
63291C79407n213n785n665m967m063l466l559m138m384l707k506j724j702j873
63277C26655j591q49p5L60K92k22p50o35L77J756K603K434J500M82nK40R39J718
63259C35229K466L239L844L918L530L298L575L923L839L675M202N417O411O624
63245C93190O500O672P052P229P362Q041R444J1150J2786J4334J5770J6826J7369
63232E33725J7699J8228J9077K0052K0871K1220K0916K0153J9459J9169J9132
63221G49701J9089J9152J9547K0078K0269K0064J9861J9778J9291J7912J5877
63210I60619J3678J1220P873L372j818p043j1874j5895j8668k0237k1333k2562
63198H77332k3591k3545k2097j9809j7393j5100j2788j0278p492m555j770P30
$$ y = [379407, 374194, 368409, 362744, 357777, 353714, 350248, 346689, 342551, 338167, 334460, 331954, 330230, 328528, 326655, 325064, 324215, 324140, 324500, 324792, 324570, 323820, 323185, 323562, 325318, 327921, 330355, 331855, 332337, 332332, 332572, 333511, 335229, 337695, 340934, 344778, 348696, 352226, 355524, 359099, 363022, 366861, 370536, 374738, 380155, 386566, 393190, 399690, 406362, 413414, 420643, 428005, 436046, 445490, 456640, 469426, 483760, 499530, 516356, 533725, 551424, 569652, 588729, 608781, 629652, 650872, 671788, 691941, 711400, 730569, 749701, 768790, 787942, 807489, 827567, 847836, 867900, 887761, 907539, 926830, 944742, 960619, 974297, 985517, 993390, 996762, 994944, 987901, 976027, 960132, 941464, 921227, 899894, 877332, 853741, 830196, 808099, 788290, 770897, 755797, 743009, 732731, 725239, 720684, 718914, 719644]
63186G19644L250O135R103J1442J2961J4243J5798J7445J8809J9874K0657K0815
63174H90176K0187J9342J8935J8735J7974J6565J5211J4184J2781J0320P020L546
63162A064976O2l726p962j2479j7084k1545k5438k8375l0384l1782l2663l2804
63150H20796l1962l0146k7542k4498k1552j9244j7750j6761j5736j4252j2192
63139E89161r824p675o171n290m600l627k195m71J195K503L424M180M972N758
63125E71340O354O731O928O803O020M547L035K436L072M113M224K889R22m66r29
63110F28019j081j411j653j402r28q89j443k102k410k354k147j992k155k809l601
63095E99642l777l037k004j508j616j685j258m51L93J086J532J728J944K533L342
$$ y = [719644, 722894, 729029, 738132, 749574, 762535, 776778, 792576, 810021, 828830, 848704, 869361, 890176, 910363, 929705, 948640, 967375, 985349, 1001914, 1017125, 1031309, 1044090, 1054410, 1061430, 1064976, 1065038, 1061312, 1053350, 1040871, 1023787, 1002242, 976804, 948429, 918045, 886263, 853600, 820796, 788834, 758688, 731146, 706648, 685096, 665852, 648102, 631341, 615605, 601353, 589161, 579337, 571662, 565491, 560201, 555601, 551974, 549779, 549308, 550503, 553006, 556430, 560610, 565582, 571340, 577694, 584425, 591353, 598156, 604176, 608723, 611758, 614194, 617266, 621379, 625603, 628492, 629414, 628948, 628019, 626938, 625527, 623874, 622472, 621544, 620655, 619212, 617110, 614700, 612346, 610199, 608207, 606052, 603243, 599642, 595865, 592828, 590824, 589316, 587700, 586015, 584757, 584306, 584699, 585785, 587317, 589045, 590989, 593522, 596864]
63080E96864L662L079K172J982K860M216N332O051O522O736O648O562P005Q145
63066F67836R570J0778J1716J2741J4127J5807J7561J9310K1092K2941K4983K7533
63054H75995L0799L4360L7317L9215M0586M2238M4216M5861M6838M7494M8062
63043A332981M8086M7066M5330M3778M2906M2512M2240M2023M1874M1584M0832
63032A811212L9387L7162L4144L0235K5132J8504J0478J785o884j5490k4288l2992
63020A928385m0784m7200n2471n6726n9369n9582n7313n3418m8938m4405l9702
63009A368477l4303k7741k0149j2356n354L81N117R557J4320J9448K4264K7917
62997A369578L0273L2040L3947L5878L7087L7099L6215L5190L4576L4281L3652
$$ y = [596864, 600526, 603605, 605777, 607759, 610619, 614835, 620167, 626218, 632740, 639476, 646124, 652686, 659691, 667836, 677406, 688184, 699900, 712641, 726768, 742575, 760136, 779446, 800538, 823479, 848462, 875995, 906794, 941154, 978471, 1017686, 1058272, 1100510, 1144726, 1190587, 1237425, 1284919, 1332981, 1381067, 1428133, 1473463, 1517241, 1560147, 1602659, 1644899, 1686922, 1728796, 1770380, 1811212, 1850599, 1887761, 1921905, 1952140, 1977272, 1995776, 2006254, 2008039, 2001155, 1985665, 1961377, 1928385, 1887601, 1840401, 1787930, 1731204, 1671835, 1612253, 1554940, 1501522, 1452584, 1408179, 1368477, 1334174, 1306433, 1286284, 1273928, 1268574, 1268955, 1274072, 1283629, 1297949, 1317397, 1341661, 1369578, 1399851, 1431891, 1465838, 1501716, 1538803, 1575902, 1612117, 1647307, 1681883, 1716164, 1749816]
62986A749816L2076K9557K6539K3073J8564J2598N621j609r026j7099k5820l4414
62974A809876m2116m8770n4432n8943o2067o3767o4034o2821o0390n7443n4489
62963A180604n1383m7809m4117m1058l8744l6358l3215k9705k6910k5384k4636
62952G81285k3727k2161k0161j8310j7060j6398j5839j4888j3608j2630j2394
62941E94109j2469j1972j0634r118q105p461o527n075l573k627k463k890l387
62928E07808l300k358j103m32n60q31p47p25j383k440k997k820k662l094l665
62913D78691l619l051k732k990l376l466l413l420l205k437j412p03l21K18R17
62898D45681J083L54o09r51p65p79j151j253p58j75j9m7K18N97N70K05J42N69
$$ y = [1749816, 1781892, 1811449, 1837988, 1861061, 1879625, 1892223, 1897844, 1896235, 1887209, 1870110, 1844290, 1809876, 1767760, 1718990, 1664558, 1605615, 1543548, 1479781, 1415747, 1352926, 1292536, 1235093, 1180604, 1129221, 1081412, 1037295, 996237, 957493, 921135, 887920, 858215, 831305, 805921, 781285, 757558, 735397, 715236, 696926, 679866, 663468, 647629, 632741, 619133, 606503, 594109, 581640, 569668, 559034, 549916, 541811, 534350, 527823, 522748, 519175, 516548, 514085, 511195, 507808, 504508, 502150, 501047, 500615, 500055, 499224, 498477, 497752, 496369, 493929, 490932, 488112, 485450, 482356, 478691, 475072, 472021, 469289, 466299, 462923, 459457, 456044, 452624, 449419, 446982, 445570, 444867, 444546, 444764, 445681, 446764, 447118, 446509, 445558, 444793, 444014, 442863, 441610, 440852, 440677, 440658, 440611, 440829, 441426, 441996, 442201, 442343, 442912]
62880D42912Q93O70L32N49J131J146J64j130j726j481j163j393j928k077j562
62865D35337p14P3P26J233J408J179Q81R24J226J387J333J362J467J188M67J08
62849D49585Q56K283L155K857J880R45K81j40k77k62m79j020j405j245q34o66
62833D55514o19j78O89J440J692J590J415J262J256J582K155K558K531K282K182
62818D77351K393K874L448L787L618L129K828K857K776K296J838K014K754L413
62804E17376L634L719M123M944N978O963P744Q360R073J0070J1167J2017J2706
62791F17874J3865J6003J8929K2041K5038K8078L1348L4790L8397M2417M7034
62780I35814N1928N6525O0571O4234O7606P0428P2353P3166P2563P0098O5617
$$ y = [442912, 443805, 444475, 444807, 445356, 446487, 447633, 447797, 446667, 444941, 443460, 442297, 440904, 438976, 436899, 435337, 434623, 434696, 435422, 436655, 438063, 439242, 440123, 441047, 442273, 443660, 444993, 446355, 447822, 449010, 449477, 449585, 450441, 452724, 455879, 458736, 460616, 461561, 461842, 461702, 461425, 461163, 460684, 459664, 458259, 457014, 456180, 455514, 454895, 454717, 455406, 456846, 458538, 460128, 461543, 462805, 464061, 465643, 467798, 470356, 472887, 475169, 477351, 479744, 482618, 486066, 489853, 493471, 496600, 499428, 502285, 505061, 507357, 509195, 511209, 513963, 517376, 521010, 524729, 528852, 533796, 539774, 546737, 554481, 562841, 571914, 581984, 593151, 605168, 617874, 631739, 647742, 666671, 688712, 713750, 741828, 773176, 807966, 846363, 888780, 935814, 987742, 1044267, 1104838, 1169072, 1236678, 1307106, 1379459, 1452625, 1525188, 1595286, 1660903]
62769A660903N9469N1975M2961L2197K0131P658m682j6814k8516l9279m8710n6580
62757A680713o2464o6072o7991o9453p0929p1529p0194o6976o2796n8431n4165
62746I59713n0072m6025m1752l7313l3289l0055k7168k3989k0641j7750j5509
62735F16150j3558j1719j0239r239q457p572o460n126l735k641k002j438m34R45
62721E34475K123K788L237L984N345P314R511J1367J2694J3956J5620J7541J9390
62708F59345K1384K3967K6961K9789L2507L5796L9874M4119M7972N1531N5079
62697A068324N8638O2267O6099O9765P2298P3023P2103O9820O5819N9479N0755
62686A788390M0241K8625J6343L559r660k2927l5295m5823n4447o1796o8022p2445
$$ y = [1660903, 1720372, 1772347, 1815308, 1847505, 1867636, 1875294, 1870612, 1853798, 1825282, 1786003, 1737293, 1680713, 1618249, 1552177, 1484186, 1414733, 1343804, 1272275, 1202081, 1135105, 1072309, 1013878, 959713, 909641, 863616, 821864, 784551, 751262, 721207, 694039, 670050, 649409, 631659, 616150, 602592, 590873, 580634, 571395, 562938, 555366, 548906, 543780, 540045, 537404, 535402, 533964, 533530, 534475, 536598, 539386, 542623, 546607, 551952, 559266, 568777, 580144, 592838, 606794, 622414, 639955, 659345, 680729, 704696, 731657, 761446, 793953, 829749, 869623, 913742, 961714, 1013245, 1068324, 1126962, 1189229, 1255328, 1325093, 1397391, 1470414, 1542517, 1612337, 1678156, 1737635, 1788390, 1828631, 1857256, 1873599, 1877158, 1867498, 1844571, 1809276, 1763453, 1709006, 1647210, 1579188, 1506743]
62674A506743p4602p4989p4325p2697o9891o6127o1901n7427n2715m7959m3421
62663H10689l9139l5077l1299k7742k4241k1038j8802j7659j6759j5262j3362
62652E50309j1778j0718r915r255q641p627n971m366l765m073m203l447k082p19
62638D63749K90P09M28k38p57j048j542k479l581m406m623l992k595j030R6Q42
62622D39823J602K211K151J604J540K451L682M283M090L592L293L443M026M708
62608D82499N143N476O143P166Q162R212J0986J3675J6404J8201J9120J9987K1464
62595F43638K3748K6733K9905L2454L3995L4900L5508L5410L4059L1683K8873
62584I90906K5445K0581J4077O784l18o881j2891j8184k2591k6151k8908l0743
$$ y = [1506743, 1432141, 1357152, 1282827, 1210130, 1140239, 1074112, 1012211, 954784, 902069, 854110, 810689, 771550, 736473, 705174, 677432, 653191, 632153, 613351, 595692, 578933, 563671, 550309, 538531, 527813, 517898, 508643, 500002, 492375, 486404, 482038, 478273, 474200, 469997, 466550, 464468, 463749, 464039, 464748, 465176, 464938, 464181, 463133, 461591, 459112, 455531, 451125, 446502, 442510, 439915, 438885, 438981, 439823, 441425, 443636, 445787, 447391, 448931, 451382, 455064, 459347, 463437, 467029, 470322, 473765, 477791, 482499, 487642, 493118, 499261, 506427, 514589, 523801, 534787, 548462, 564866, 583067, 602187, 622174, 643638, 667386, 694119, 724024, 756478, 790473, 825373, 860881, 896291, 930350, 962033, 990906, 1016351, 1036932, 1051009, 1057793, 1057475, 1050594, 1037703, 1019519, 996928, 970777, 941869, 911126]
62572I11126l1665l1992l2059l1926l1531l0840k9662k7596k4523k1037j8073
62561F00222j6089j4746j3383j1633r613p755o438n678n062m172l098k411k486
62548D97658k976l091k402j197j00N39Q13J012J317J598J493P96k07q89q43j40
62532D93381J034K643M470N874O353O302O709Q023R682J1053J2395J4547J7687
62519F00153K0926K3264K4766K6458K9128L2509L5806L8689M1333M3656M5103
62508I61791M5334M4668M3506M1732L8998L5221L0393K4306J7110R917M093k4
62496A297045l192n969p957q369o841l587P87N478R990J4576J9764K5351L0416
62483A367492L4287L6896L7977L6676L2512K6213J9078J1741L895m999j5017k5516
$$ y = [911126, 879461, 847469, 815410, 783484, 751953, 721113, 691451, 663855, 639332, 618295, 600222, 584133, 569387, 556004, 544371, 534758, 527003, 520565, 514887, 509825, 505653, 502555, 500144, 497658, 494682, 491591, 489189, 487992, 487892, 488431, 489244, 490256, 491573, 493171, 494664, 495460, 495253, 494364, 493521, 493381, 494415, 497058, 501528, 507402, 513755, 520057, 526766, 534789, 544471, 555524, 567919, 582466, 600153, 621079, 644343, 669109, 695567, 724695, 757204, 793010, 831699, 873032, 916688, 961791, 1007125, 1051793, 1095299, 1137031, 1176029, 1211250, 1241643, 1265949, 1283059, 1292976, 1297069, 1297045, 1293853, 1287884, 1279927, 1271558, 1264717, 1261130, 1261917, 1267395, 1277385, 1291961, 1311725, 1337076, 1367492, 1401779, 1438675, 1476652, 1513328, 1545840, 1572053, 1591131, 1602872, 1606767, 1601768, 1586751, 1561235]
62471A561235l5417m4023n1604n8616o4421o7556o7593o5876o3799o1242n7410
62460I23678n2557m7743m3283l8525l3124k7662k2959j9399j6827j4577j1764
62449E95258q258n119l343k414j012J052K703L399L828M510M910M533L898L638
62435F07583L375K370P52p20j759k634l441m018m469n107n910o558o974p263p286
62420E57941o808o110n808n948n866n174m374m120m260m135l538k873k363j719
62406D94845p51P9J77m12j093j493j550j012M90K488L579K900J364O70J299K201
62390E03781K436K268K368K780L129L400L872M555N119N313N145M780M498M643
62376E58087N379O581P985R310J0226J0621J0980J2067J3950J5845J7224J8671
$$ y = [1561235, 1525818, 1481795, 1430191, 1371575, 1307154, 1239598, 1172005, 1106129, 1042330, 981088, 923678, 871121, 823378, 780095, 741570, 708446, 680784, 657825, 638426, 621599, 607022, 595258, 587000, 581881, 578538, 576124, 575112, 576164, 578867, 582266, 586094, 590604, 595514, 600047, 603945, 607583, 610958, 613328, 614080, 613360, 611601, 608967, 605526, 601508, 597039, 591932, 586022, 579464, 572490, 565227, 557941, 551133, 545023, 539215, 533267, 527401, 522227, 517853, 513733, 509473, 505338, 501800, 498927, 496564, 494845, 494094, 494173, 494350, 493938, 492845, 491352, 489802, 488790, 489280, 491768, 495347, 498247, 499611, 500281, 501580, 503781, 506217, 508485, 510853, 513633, 516762, 520162, 524034, 528589, 533708, 539021, 544166, 548946, 553444, 558087, 563466, 570047, 578032, 587342, 597568, 608189, 619169, 631236, 645186, 661031, 678255, 696926]
62364F96926K1103K4494K8014L1227L4568L8532M2851M6646M9111N0074M9938
62353A113484M9044M6965M2757L6240K8587K1215J4343P318R3o483j1920j6809
62341A324834k1928k7178l1857l5535l8180l9719l9961l8902l6817l4096l1185
62330I49476k8548k6444k4702k2963k1071j9204j7702j6804j6506j6544j6593
62319G22395j6481j6201j5768j5214j4669j4215j3668j2763j1516j0171q784p253
62307E65692n787m825m351l808l015k591k925l226k361n04R54J201R29J179J937
62292E38499K446K416K278K415K785L251L803M318M577M659M942N531N999O014
62278E93933N884O105O633P029P300Q034R510J1104J1930J1928J1972J2918J4782
$$ y = [696926, 718029, 742523, 770537, 801764, 836332, 874864, 917715, 964361, 1013472, 1063546, 1113484, 1162528, 1209493, 1252250, 1288490, 1317077, 1338292, 1352635, 1359953, 1360046, 1353563, 1341643, 1324834, 1302906, 1275728, 1243871, 1208336, 1170156, 1130437, 1090476, 1051574, 1014757, 980661, 949476, 920928, 894484, 869782, 846819, 825748, 806544, 788842, 772038, 755532, 738988, 722395, 705914, 689713, 673945, 658731, 644062, 629847, 616179, 603416, 591900, 581729, 572945, 565692, 559905, 555080, 550729, 546921, 543906, 541315, 538390, 535164, 532803, 532299, 533253, 534454, 535383, 536562, 538499, 540945, 543361, 545639, 548054, 550839, 554090, 557893, 562211, 566788, 571447, 576389, 581920, 587919, 593933, 599817, 605922, 612555, 619584, 626884, 634918, 644428, 655532, 667462, 679390, 691362, 704280, 719062]
62265G19062J6875J8669K0334K2523K5587K9215L2842L6263L9598M2710M5121
62254A048799M6544M7100M6733M4847M0896L5145K8385K1138J3614O242m29o442
62242A372572j2414j8611k4558k9779l4401l8557m1733m3293m3419m2913m2082
62231A000812m0454l7666l4099l0370k6619k2730j9009j6161j4498j3476j2200
62220G33530j0348q409p026o319n890n384m822m355l920l294k367j214K5J208
62206F71415K158K831L458M344N375O018N997N788O073O813P276P142O977P301
62192G48966P655P228O241N816O383P037O950O638P068Q013Q217P074N296L859
62178H42441L081K948L532M657N734O458P283Q823J1108J3825J6939K0538K4325
$$ y = [719062, 735937, 754606, 774940, 797463, 823050, 852265, 885107, 921370, 960968, 1003678, 1048799, 1095343, 1142443, 1189176, 1234023, 1274919, 1310064, 1338449, 1359587, 1373201, 1379443, 1379014, 1372572, 1360158, 1341547, 1316989, 1287210, 1252809, 1214252, 1172519, 1129226, 1085807, 1042894, 1000812, 960358, 922692, 888593, 858223, 831604, 808874, 789865, 773704, 759206, 745730, 733530, 723182, 714773, 707747, 701428, 695538, 690154, 685332, 680977, 677057, 673763, 671396, 670182, 670207, 671415, 673573, 676404, 679862, 684206, 689581, 695599, 701596, 707384, 713457, 720270, 727546, 734688, 741665, 748966, 756621, 763849, 770090, 775906, 782289, 789326, 796276, 802914, 809982, 817995, 826212, 833286, 838582, 842441, 845522, 848470, 852002, 856659, 862393, 868851, 876134, 884957, 896065, 909890, 926829, 947367, 971692]
62165I71692K7703L0241L1696L1738L0128K7121K3359J9265J4871J0119N118Q2
62153A223133m752r167j3203j7153k1119k4675k7243k8773k9721l0371l0467k9575
62141I56914k7718k5550k3825k2596k1015j8330j5028j2500j1373j0803r786q533
62129G49857p943q168q530q581q413q014p127n773m299k884j519l73N20J792M078
62114F84623O779Q351Q021O450M591K751J018l61j425k511l391l278k196j378
62100G08044j626k251k382k435l206m275m611m225l899l546k283j15J809K843
62086F77842L595M667N754O489P247Q444R749J0693J1472J2572J3910J5001J5658
62073H03093J6091J6494J6996J7819J9095K0602K1905K2713K2950K2644K1871
$$ y = [971692, 999395, 1029636, 1061332, 1093070, 1123198, 1150319, 1173678, 1192943, 1207814, 1217933, 1223051, 1223133, 1218381, 1209214, 1196011, 1178858, 1157739, 1133064, 1105821, 1077048, 1047327, 1016956, 986489, 956914, 929196, 903646, 879821, 857225, 836210, 817880, 802852, 790352, 778979, 768176, 758390, 749857, 741914, 733746, 725216, 716635, 708222, 700208, 693081, 687308, 683009, 680125, 678606, 678233, 678753, 680545, 684623, 691402, 699753, 707774, 714224, 718815, 721566, 722584, 722223, 720798, 718287, 714896, 711618, 709422, 708044, 706418, 704167, 701785, 699350, 696144, 691869, 687258, 683033, 679134, 675588, 673305, 673190, 674999, 677842, 681437, 686104, 691858, 698347, 705594, 714038, 723787, 734480, 745952, 758524, 772434, 787435, 803093, 819184, 835678, 852674, 870493, 889588, 910190, 932095, 954808, 977758, 1000402, 1022273]
62062A022273K0663J8877J6342J3164R624N819J761k162n364p861j0406j3532
62050A069198j6946k0116k2974k5625k7896k9619l1028l2260l2817l2122l0406
62039G67389k8506k6866k5325k3763k2328k0945j9219j6990j4649j2696j1288
62028E44814j0341r681r056q255p385o701o167n522m829m441m246l556k199j162
62014D61273j435k447k563j176M54Q36J20l01L75J669K848L798M587M893M486
61999D77417L847L592L401K385N49q75j009o05j097k743m455n370n773o302o955
61984D56007p327p391p432p374o794n625m453l862l788l715l364k938k732k752
61970C86460k735k418j722q38k11k84j023j709j505l55Q52J230Q48N30P54J183
$$ y = [1022273, 1042936, 1061813, 1078155, 1091319, 1100943, 1106762, 1108523, 1106361, 1100997, 1093136, 1082730, 1069198, 1052252, 1032136, 1009162, 983537, 955641, 926022, 894994, 862734, 829917, 797795, 767389, 738883, 712017, 686692, 662929, 640601, 619656, 600437, 583447, 568798, 556102, 544814, 534473, 524792, 515736, 507481, 500096, 493395, 487228, 481706, 476877, 472436, 468190, 464634, 462435, 461273, 459838, 457391, 454828, 453652, 454106, 454942, 455062, 454761, 455136, 456805, 459653, 463451, 468038, 472931, 477417, 481264, 484856, 488257, 490642, 491191, 490316, 489307, 488702, 487605, 484862, 480407, 475037, 469264, 462962, 456007, 448680, 441289, 433857, 426483, 419689, 414064, 409611, 405749, 401961, 398246, 394882, 391944, 389212, 386460, 383725, 381307, 379585, 378747, 378536, 378252, 377229, 375520, 374015, 373660, 374512, 375742, 376590, 377120, 377874, 379057]
61954C79057J357J492K158L442M834N912O642P012O896O564O856Q304J0325J1780
61940D62631J2294J2444J2782J3211J3472J3665J3929J3963J3350J2113J0675
61929F04529R398Q377P417O045L795Q64j759l204l674m039m660n051m660l509
61915F09869k003m50J057K617M378O288P971R105R837J0428J0651J0036Q689P288
61901F95761O085M483J912j246l971n633o474p232q411r693j0124r179p611o748
61887F31919o806o667n622m606m974o616q167q831r079r482r719r132p789o408
61873E28021n541n112m697l984k932j648k47J184K538L722M804N963P211Q325
61859E37607R150R877J0879J2359J4263J6424J8604K0605K2344K3807K4772K4912
$$ y = [379057, 380414, 381906, 384064, 387506, 392340, 398252, 404894, 411906, 418802, 425366, 432222, 440526, 450851, 462631, 474925, 487369, 500151, 513362, 526834, 540499, 554428, 568391, 581741, 593854, 604529, 613927, 622304, 629721, 635766, 639561, 640425, 638666, 635462, 631788, 627749, 623089, 618038, 613378, 609869, 607866, 607416, 608473, 611090, 615468, 621756, 629727, 638832, 648669, 659097, 669748, 679784, 688473, 695761, 701846, 706329, 708241, 706995, 703024, 697391, 690917, 683685, 675274, 665581, 655457, 646278, 638667, 631919, 625113, 618446, 612824, 608218, 603244, 596628, 588461, 579630, 570551, 561069, 551350, 542218, 534429, 528021, 522480, 517368, 512671, 508687, 505755, 504107, 503860, 505044, 507582, 511304, 516108, 522071, 529282, 537607, 546757, 556634, 567513, 579872, 594135, 610559, 629163, 649768, 672112, 695919, 720691, 745603]
61847G45603K4235K3167K1965K0313J7781J4463J0868P378M099J040j886m850
61835H84176p631r405r417p924n939m103k191J99K997N844Q502J0681J1723J0882
61821H88394Q112M396J075j310l431o231r638j2602j4443j5646j6941j8131j8452
61808G85152j7853j7208j7250j7859j8439j8533j7947j6687j5075j3559j2342
61797F02400j1280j0202r045p792o602n842n634n453m639l322k283j934j872j619
61783E24881j260j184j560k223k734k534j432qQ92J102J093J075Q43N23P00J490
61767E19664K246K606L064M066N172N738N884O061O189N945N523N307N032M079
61753E86576K440P21q12k408m131n564o394o760o913o957p014p178p221o743n699
$$ y = [745603, 769838, 793005, 814970, 835283, 853064, 867527, 878395, 885773, 889872, 890912, 889026, 884176, 876545, 867140, 857723, 849799, 843860, 839757, 837566, 837765, 840762, 846606, 855108, 865789, 877512, 888394, 896506, 900902, 901977, 900667, 897236, 891005, 881367, 868765, 854322, 838676, 821735, 803604, 785152, 767299, 750091, 732841, 714982, 696543, 678010, 660063, 643376, 628301, 614742, 602400, 591120, 580918, 571873, 564081, 557479, 551637, 546003, 540550, 535911, 532589, 530306, 528372, 526500, 524881, 523621, 522437, 520877, 518654, 515920, 513386, 511954, 511946, 512838, 513940, 515033, 516108, 516951, 517474, 518174, 519664, 521910, 524516, 527580, 531646, 536818, 542556, 548440, 554501, 560690, 566635, 572158, 577465, 582497, 586576, 589016, 589737, 588925, 586517, 582386, 576822, 570428, 563668, 556755, 549798, 542784, 535606, 528385, 521642, 515943]
61738E15943m463l360k471j875j640j561j282p38j27M94J139J501J188M94K60
61723E03502P32J163Q96L38L44R97J534J373O64j13p22j200j636k116k685l316
61707D99755l921m412m770n027n225n309n087m476l799l655m281n121n242m233
61693D35197k637j438j186j640k202k543k736k861k782k362j762j359j369j646
61679D06674j798j499q13k46k76p53j032p62k99p7M3M81J233J875K132K043J722
61662D08648J361J304J707K176K268K192K373K545K007R05L37Q11J424J179M13
61647D31650J65O58J299J881K838M182N115N032M334L781L449K755J399j47j232
61632D67159j795k356l276m255m788m858m840m800m418l699l148k939k459j298
$$ y = [515943, 511480, 508120, 505649, 503774, 502134, 500573, 499291, 498553, 498426, 498920, 500059, 501560, 502748, 503242, 503502, 504234, 505397, 506293, 506631, 506975, 507972, 509506, 510879, 511543, 511430, 510708, 509508, 507872, 505756, 503071, 499755, 495834, 491422, 486652, 481625, 476400, 471091, 466004, 461528, 457729, 454074, 449793, 444672, 439430, 435197, 432560, 431122, 429936, 428296, 426094, 423551, 420815, 417954, 415172, 412810, 411048, 409689, 408320, 406674, 404876, 403377, 402564, 402318, 402042, 401289, 400257, 399495, 399196, 399119, 399162, 399643, 400876, 402751, 404883, 406926, 408648, 410009, 411313, 413020, 415196, 417464, 419656, 422029, 424574, 426581, 427486, 427823, 428634, 430058, 431237, 431650, 431815, 432473, 433772, 435653, 438491, 442673, 447788, 452820, 457154, 460935, 464384, 467139, 468538, 468391, 467159, 465364, 463008, 459732, 455477, 450689, 445831, 440991, 436191, 431773, 428074, 424926, 421987, 419528, 418230]
61618D18230j84j91j259k241k436k221k168k298k494k891l433l671l482l441l927
61603C81893m363l976l001k442k768l457l757l384k477j433p80p44r04p28m43
61588C47236p60j724k440k248j598j315j413j219m75J94k3j221k613l176k501
61573C24704j099K03J091J770K205J916P63m79q60k99N20J032J225J314J467J768
61557C37241K070J997J450Q89P44P21L65L2N12J637K228J696Q93Q31J342J645
61541C56293J641J811K194K367K355K659L322L692L356K709K245J817J045J23
61527C87629k98K0N55O23J09n39r22j142j528k040k180j637q06m27q34j667k311
61510C72605k379j874j144o62n76n59k34K56M35K25Q2L54Q52J243J519J852K190
$$ y = [418230, 418046, 417855, 416596, 414355, 411919, 409698, 407530, 405232, 402738, 399847, 396414, 392743, 389261, 385820, 381893, 377530, 373554, 370553, 368111, 365343, 361886, 358129, 354745, 352268, 350835, 350055, 349311, 348407, 347679, 347236, 346476, 344752, 342312, 340064, 338466, 337151, 335738, 334519, 334044, 334238, 334215, 332994, 330381, 327205, 324704, 323605, 323808, 324899, 326669, 328874, 330790, 331553, 331074, 330214, 329915, 330435, 331467, 332692, 334006, 335473, 337241, 339311, 341308, 342758, 343647, 344391, 345112, 345477, 345509, 346021, 347658, 349886, 351582, 352475, 353306, 354648, 356293, 357934, 359745, 361939, 364306, 366661, 369320, 372642, 376334, 379690, 382399, 384644, 386461, 387506, 387629, 387331, 387351, 387906, 388529, 388638, 388099, 387177, 386035, 384507, 382467, 380287, 378650, 377844, 377417, 376583, 374916, 372605, 370226, 368352, 367208, 366546, 365970, 365411, 365177, 365433, 365868, 366093, 366175, 366529, 367381, 368624, 370143, 371995, 374185]
61493C74185K385K508K793L223L465L225K584J953J702J821J923J658J180R73
61479D05578J191J403J137N30J33K37O01P86N06k21r71j040j14J130J490N68p26
61462D12218j248r43o41p88r23n20K34P39P35M29J50J05L54O72P19N77R26K192
61444D14987L755M529M328L994M124M327M097L729L772M018L745K761J625Q48
61430D64639M34J73p3m08p46o39K63J481K013J534Q65Q99J484J738J149Oj131
61413D73681j925k321k435k477k635k960l334l512l241k573k045k251l098l757
61399D35117l577k773k043j738j717j787j851j675r92J06J067J379J021M45J67
61384D21149L90Q61J153J125J048J193J488J737K032K598L324L762L611K976K150
$$ y = [374185, 376570, 379078, 381871, 385094, 388559, 391784, 394368, 396321, 398023, 399844, 401767, 403425, 404605, 405578, 406769, 408172, 409309, 409839, 409972, 410209, 410810, 411596, 412102, 411881, 410910, 409870, 409756, 410886, 412376, 412944, 412218, 410970, 410027, 409386, 408598, 407675, 407155, 407389, 408128, 408863, 409292, 409442, 409547, 409901, 410573, 411292, 411869, 412795, 414987, 418742, 423271, 427599, 431593, 435717, 440044, 444141, 447870, 451642, 455660, 459405, 462166, 463791, 464639, 465073, 465246, 465173, 464765, 464019, 463380, 463643, 465124, 467137, 468671, 469536, 470435, 471919, 473657, 474806, 474812, 473681, 471756, 469435, 467000, 464523, 461888, 458928, 455594, 452082, 448841, 446268, 444223, 441972, 438874, 435117, 431540, 428767, 426724, 424986, 423269, 421482, 419631, 417956, 416964, 417070, 418137, 419516, 420537, 420982, 421149, 421539, 422400, 423553, 424678, 425726, 426919, 428407, 430144, 432176, 434774, 438098, 441860, 445471, 448447, 450597]
61369D50597J404J010J103J465J714J818K117K688L033K741K169K080K671L410
61355D80020L864M262N005N907O332O031N496N342N619N884N765N197M206K847
61341E51777J481P24Q18J204J070K32q17j682k426l119l518l460l275l326l351
61326E32332k752j554n72m17o85m91L93J263J425J048R53J661K903M058M885N628
61310E50078O498P386Q111Q737R422J0071J0356J0019Q941P109M782K604J084
61297F45198p3j682l954o099p272p538p528p573p621p744q065q290p913o939n938
61282E50969n259m682l905k919j764l99R63J872K250K565L138L607L484K839K140
61267E54899J691J680K401L902N655P077Q248R607J0979J1557J0864R306P573
$$ y = [450597, 452001, 453011, 454114, 455579, 457293, 459111, 461228, 463916, 466949, 469690, 471859, 473939, 476610, 480020, 483884, 488146, 493151, 499058, 505390, 511421, 516917, 522259, 527878, 533762, 539527, 544724, 548930, 551777, 553258, 553982, 554800, 556004, 557074, 557306, 556489, 554807, 552381, 549262, 545744, 542284, 539009, 535683, 532332, 529580, 528026, 527454, 527037, 526352, 525861, 526254, 527517, 528942, 529990, 530943, 532604, 535507, 539565, 544450, 550078, 556576, 563962, 572073, 580810, 590232, 600303, 610659, 620678, 629619, 636728, 641510, 644114, 645198, 645125, 643443, 639489, 633390, 626118, 618580, 611052, 603479, 595858, 588114, 580049, 571759, 563846, 556907, 550969, 545710, 541028, 537123, 534204, 532440, 532041, 533004, 534876, 537126, 539691, 542829, 546436, 549920, 552759, 554899, 556590, 558270, 560671, 564573, 570228, 577305, 585553, 595160, 606139, 617696, 628560, 637866, 645439]
61254F45439N930M286K605J052j65r77j530k106k863l631m105m153l849l327k786
61239F29820k448k285k013j525j140j051r00k72O55J399J929K521L129L524L915
61224F35258M686N527N720N281N067N477N907N809N485N365N233M725M010L350
61210G06900K582J685J306J998L253M089M326M601N386O620Q161R830J1193J1976
61196G83906J2662J3951J5627J6626J6294J4948J3164J1163R076P144N409L736
61184I23706K269J321P17r2j117j709j714j962l076m460n171n284n536n980n919
61169H85993n130m295m042m222m389m369m075l242j820k56J008K113L503N243
61155H62020P022Q670J0290J1919J3414J4754J6072J7329J8205J8438J8015J7016
$$ y = [645439, 651369, 655655, 658260, 659312, 659147, 658170, 656640, 654534, 651671, 648040, 643935, 639782, 635933, 632606, 629820, 627372, 625087, 623074, 621549, 620409, 619358, 618458, 618186, 618841, 620240, 622169, 624690, 627819, 631343, 635258, 639944, 645471, 651191, 656472, 661539, 667016, 672923, 678732, 684217, 689582, 694815, 699540, 703550, 706900, 709482, 711167, 712473, 714471, 717724, 721813, 726139, 730740, 736126, 742746, 750907, 760737, 771930, 783906, 796568, 810519, 826146, 842772, 859066, 874014, 887178, 898341, 907417, 914561, 919970, 923706, 925975, 927296, 928013, 927921, 926804, 925095, 923381, 921419, 918343, 913883, 908712, 903428, 897892, 891912, 885993, 880863, 876568, 872526, 868304, 863915, 859546, 855471, 852229, 850409, 850153, 851161, 853274, 856777, 862020, 869042, 877712, 888002, 899921, 913335, 928089, 944161, 961490, 979695, 998133, 1016148, 1033164]
61143A033164J5559J4005J2816J2010J1141J0083R430R610J0070R949R335R031
61131A166203R123Q697P275N707N048N152N131M790M733N150N329M677L620L071
61117A243706L324L829L943L591L172K977K799K165R05n82j749k529l426m920
61103A257205o909q839j0419j2028j4232j6966j9506k1392k3038k4967k6757k7374
61091A044778k6634k5564k5018k4561k3280k1204j9217j7809j6617j5233j3786
61080H15855j2573j1594j0720r929r113p934o197m280k951k676l195l823m089
61067G26781l969l486k438p95P98J503J362J355K160L382M380N328O786Q592R985
61052G61724J0713J1361J2444J3776J4876J5589J6131J6833J7933J9351K0609
$$ y = [1033164, 1048723, 1062728, 1075544, 1087554, 1098695, 1108778, 1118208, 1127818, 1137888, 1147837, 1157172, 1166203, 1175326, 1184023, 1191298, 1197005, 1202053, 1207205, 1212336, 1217126, 1221859, 1227009, 1232338, 1237015, 1240635, 1243706, 1247030, 1250859, 1254802, 1258393, 1261565, 1264542, 1267341, 1269506, 1270411, 1269829, 1268080, 1265551, 1262125, 1257205, 1250296, 1241457, 1231038, 1219010, 1204778, 1187812, 1168306, 1146914, 1123876, 1098909, 1072152, 1044778, 1018144, 992580, 967562, 943001, 919721, 898517, 879300, 861491, 844874, 829641, 815855, 803282, 791688, 780968, 771039, 761926, 753992, 747795, 743515, 740564, 737888, 734693, 730870, 726781, 722812, 719326, 716888, 716093, 716891, 718394, 719756, 721111, 723271, 726653, 731033, 736361, 743147, 751739, 761724, 772437, 783798, 796242, 810018, 824894, 840483, 856614, 873447, 891380, 910731, 931340]
61041I31340K1255K1325K1167K0924K0593K0441K0842K1677K2385K2717K2998
61030A167664K3603K4569K5801K7266K8899L0692L2865L5529L8177M0117M1469
61019A516651M3203M6086N0137N5307O1955P0266P9763Q9838J00473J12228J25898
61008B351805J42574J63605J90277K23799K65652L17325L79530M52573N38206
60999E025346O40954P67568R25542J119886J345000J573311J752589J823081J748083
60990A6721360J534467J226418Q81246N50949K79401J01562L0108L8113O2009
60981B1425633L2391r0209l03607n79502q83831j183666j444682j633137j725375
60972A3614015j716176j619039j459957j269086j073105q90355p30284n95939
$$ y = [931340, 952595, 973920, 995087, 1016011, 1036604, 1057045, 1077887, 1099564, 1121949, 1144666, 1167664, 1191267, 1215836, 1241637, 1268903, 1297802, 1328494, 1361359, 1396888, 1435065, 1475182, 1516651, 1559854, 1605940, 1656077, 1711384, 1773339, 1843605, 1923368, 2013206, 2113679, 2225907, 2351805, 2494379, 2657984, 2848261, 3072060, 3337712, 3655037, 4034567, 4487140, 5025346, 5666300, 6433868, 7359410, 8479296, 9824296, 11397607, 13150196, 14973277, 16721360, 18255827, 19482245, 20363491, 20914440, 21193841, 21295403, 21325511, 21363624, 21425633, 21458024, 21367815, 21064208, 20484706, 19600875, 18417209, 16972527, 15339390, 13614015, 11897839, 10278800, 8818843, 7549757, 6476652, 5586297, 4856013, 4260074]
60964D260074m86403l98222l27122k69861k24490j89075j61253j39101j21477
60955A943070j07199r4801q3563p3799o5619n8248n1161m5018m0635l7659l5208
60944A250160l3336l2815l3650l4761l5184l4817l3903l2539l0913k9371k7896
60933H90975k6053k3703k1426j9872j8965j8125j7035j5807j4510j3016j1422
60922F91041j0256r938j0137r996r086p910p287p379p566p214o267n048l837k804
60908E86316k089j661j271q06n58q75j578k101k163k065k195k565k965l342l806
60893E56276m431n200o009o480n995m287k042m96k72p91j025o84l88p21j461j846
60877E14148j456o60k44o26j427j833j407n73j62m76r04o02M69J406J309L64k78
$$ y = [4260074, 3773671, 3375449, 3048327, 2778466, 2553976, 2364901, 2203648, 2064547, 1943070, 1835871, 1741070, 1657507, 1583708, 1518089, 1459841, 1408680, 1363662, 1323027, 1285368, 1250160, 1216824, 1184009, 1150359, 1115598, 1080414, 1045597, 1011694, 979155, 948242, 918871, 890975, 864922, 841219, 819793, 799921, 780956, 762831, 745796, 729989, 715479, 702463, 691041, 680785, 670847, 660710, 650714, 641628, 633718, 626431, 619052, 611486, 604272, 598005, 592957, 589120, 586316, 584227, 582566, 581295, 580489, 579931, 579056, 577478, 575377, 573214, 571149, 568954, 566389, 563424, 560082, 556276, 551845, 546645, 540636, 534156, 528161, 523874, 521832, 521336, 521064, 520273, 519248, 518564, 518176, 517455, 515994, 514148, 512692, 512032, 511788, 511162, 509735, 507902, 506495, 505922, 505760, 505284, 504380, 503778, 504247, 505653, 506962, 507326, 507048]
60860E07048K56J579K504K373J635J032O85K20n51j482k428l241l519k953j985
60845E01173j538j965k671l113l598m662o059o978p110o949o984p095o893o299
60831D29259n598n023m514l802k770j688j010q70r05p12k93O8K33K94L97N96Q41
60814D04503Q81M40l81j084j346j328j202p33J76R52R73N52N60J125J478J163
60798D06729O21L11K3n10r18p84m18m36q27j037q98q34j178j734k175k464k771
60781C90700l170l551l702l524l229l198l454l502k916j913j013k90N35J334J499
60766C60606Q08m9j63O03J581K112K047J648J254J111J276J596J839J897J819
60751C79985J699J568J414J243J144J304J887K792L622L915L440K299Q68l31r17
$$ y = [507048, 507304, 508883, 511387, 513760, 515395, 516427, 517112, 517332, 516781, 515299, 512871, 509630, 506111, 503158, 501173, 499635, 497670, 494999, 491886, 488288, 483626, 477567, 470589, 463479, 456530, 449546, 442451, 435558, 429259, 423661, 418638, 414124, 410322, 407552, 405864, 404854, 403984, 403079, 402367, 402074, 402142, 402375, 402669, 403066, 403662, 404503, 405384, 405824, 405443, 404359, 403013, 401685, 400483, 399750, 399926, 400878, 401851, 402403, 402963, 404088, 405566, 406729, 407350, 407661, 407684, 407174, 406256, 405472, 405054, 404618, 403791, 402754, 401856, 401022, 399844, 398110, 395935, 393471, 390700, 387530, 383979, 380277, 376753, 373524, 370326, 366872, 363370, 360454, 358541, 357528, 357238, 357773, 359107, 360606, 361414, 361365, 361202, 361805, 363386, 365498, 367545, 369193, 370447, 371558, 372834, 374430, 376269, 378166, 379985, 381684, 383252, 384666, 385909, 387053, 388357, 390244, 393036, 396658, 400573, 404013, 406312, 407180, 406849, 405932]
60736D05932r74r62j168j325j078o38n86j035j365j006j34O17Q70O24j7q26j361
60719C95568j385j316j763k600l024k667k135k118k480k620k389k140k094k146
60705C64691k246k420k467k049j276p43q22j248j540j592j528j257n70L78R68
60690C46279P42K7k59M81J888L020L324L068K812K722K603K368K187K213K433
60675C75908K769L082L177K985K714K553K262J429J43r98j616j922k190k280j998
60660C86018j604j538j707j549p34M29J383J759J499Q21K33L24J229K366K872
60645C91801K328J037l38j302j760j918k011k131k258k400k580k640k228j234
60631C72366j78J96k16o42l82L33P27N39K42K75N63Q70J135J277J096O76M57O01
$$ y = [405932, 404958, 403996, 402828, 401503, 400425, 399787, 399201, 398166, 396801, 395795, 395661, 396278, 397148, 397772, 397755, 396929, 395568, 394183, 392867, 391104, 388504, 385480, 382813, 380678, 378560, 376080, 373460, 371071, 368931, 366837, 364691, 362445, 360025, 357558, 355509, 354233, 353490, 352668, 351420, 349880, 348288, 346760, 345503, 344933, 345311, 346279, 347021, 347048, 346789, 347270, 349158, 352178, 355502, 358570, 361382, 364104, 366707, 369075, 371262, 373475, 375908, 378677, 381759, 384936, 387921, 390635, 393188, 395450, 396879, 397022, 396024, 394408, 392486, 390296, 388016, 386018, 384414, 382876, 381169, 379620, 378886, 379315, 380698, 382457, 383956, 384777, 385010, 385334, 386563, 388929, 391801, 394129, 395166, 394828, 393526, 391766, 389848, 387837, 385706, 383448, 381048, 378468, 375828, 373600, 372366, 372188, 372384, 372168, 371526, 371144, 371477, 372204, 372743, 372985, 373260, 373823, 374693, 375828, 377105, 378201, 378877, 379334, 379935]
60613C79935O91M04J13L23Q43J086R56P90O11J18n65q64o34l91m31l24L55J286
60595C84302J901K184K482K792K723K206J770K022K967L883L866K729J308P03
60581D17838J075J549J365Q30P72J432K237K593K486K413K929M225N917P239P723
60566D62623P674P830Q584R662J0418J0333R292P601N727L893K014J9j861l307
60552E40502m236m715m721m122k903j224N77K025K718K762K882L769N377P041
60538E45732Q309R429J0952J3041J5347J7490J9411K1008K1653K0481J7474J3804
60526G34131J0591P631L985k92l982o377q183j0185j1887j2353j1790j1235j0903
60513F69151r974q064n918m365l296k137o96R05K713M877P401J0242J3431J6808
$$ y = [379935, 380626, 381030, 381143, 381466, 382309, 383395, 384351, 385141, 385752, 385870, 385305, 384441, 383807, 383416, 382985, 382661, 383016, 384302, 386203, 388387, 390869, 393661, 396384, 398590, 400360, 402382, 405349, 409232, 413098, 415827, 417135, 417838, 418913, 420462, 421827, 422657, 423429, 424861, 427098, 429691, 432177, 434590, 437519, 441744, 447661, 454900, 462623, 470297, 478127, 486711, 496373, 506791, 517124, 526416, 534017, 539744, 543637, 545651, 545670, 543809, 540502, 536266, 531551, 526830, 522708, 519805, 518581, 519158, 521183, 523901, 526663, 529545, 533314, 538691, 545732, 554041, 563470, 574422, 587463, 602810, 620300, 639711, 660719, 682372, 702853, 720327, 734131, 744722, 752353, 756338, 756046, 752064, 745687, 737504, 727319, 715432, 703079, 691289, 680054, 669151, 659177, 651113, 645195, 640830, 637534, 635397, 634701, 635606, 638319, 643196, 650597, 660839, 674270, 691078]
60499F91078J9988K2899K6069K9868L3773L6834L8806M0223M1305M1355L9618
60488A061816L6442L3021L0001K6747K2305J6736J1086N982P66n728j3849k2854
60476A202471l1710l9668m6141n0578n2685n2619n0862m8067m4897m1611l7798
60465G05835l3004k7733k3347k0639j8998j7370j5592j4198j3192j1883r994q189
60453D91696p177o756o224n342m403l595k834k174j892k007k103j892j622j696
60439D41979k007j981j295l35J55j51q02j070p69m73p06j183j169n33Q6K52K86
60422D30284N31O23J30n15m47M26J350J827K049K199K120J901J993K401K396J576
60406D50844N85K92O96J172J421J548J561J412J326J549J938K281K762L558M258
$$ y = [691078, 711066, 733965, 760034, 789902, 823675, 860509, 899315, 939538, 980843, 1022198, 1061816, 1098258, 1131279, 1161280, 1188027, 1210332, 1227068, 1238154, 1244136, 1244902, 1239174, 1225325, 1202471, 1170761, 1131093, 1084952, 1034374, 981689, 929070, 878208, 830141, 785244, 743633, 705835, 672831, 645098, 621751, 601112, 582114, 564744, 549152, 534954, 521762, 509879, 499885, 491696, 484519, 477763, 471539, 466197, 461794, 458199, 455365, 453191, 451299, 449292, 447189, 445297, 443675, 441979, 439972, 437991, 436696, 436361, 436516, 436365, 435563, 434493, 433724, 433251, 432545, 431362, 430193, 429660, 429746, 429998, 430284, 430815, 431438, 431568, 431053, 430606, 431032, 432382, 434209, 436258, 438457, 440577, 442478, 444471, 446872, 449268, 450844, 451429, 451721, 452417, 453589, 455010, 456558, 458119, 459531, 460857, 462406, 464344, 466625, 469387, 472945, 477203]
60391D77203M341M015L885L938L596K735J878J362J026Q26J013J485J699J477
60377E10479J279J428J685J885K317L082L647L532K990K536K228J887J574J426
60363E41975J378J471K016K990L741L866L959M742N798O092N564N266N799O508
60349F01165O537N946N258M471L104J059j085k653l426l679l829m083m332m439
60335F00014m526m775m935m426l150j898j579k176k883l199l464m095m728m516
60321E49664l203j522l94Q2O16J839L586N146O111O810P807R004R541Q760P076
60306F10923N586M963N081N670O601P382P112N516L526K162J231j22j946l568
60292F60117m976o947r535j1516j1858j0964r828q752p524o247n207m441m064
$$ y = [477203, 481544, 485559, 489444, 493382, 496978, 499713, 501591, 502953, 503979, 504805, 505818, 507303, 509002, 510479, 511758, 513186, 514871, 516756, 519073, 522155, 525802, 529334, 532324, 534860, 537088, 538975, 540549, 541975, 543353, 544824, 546840, 549830, 553571, 557437, 561396, 566138, 571936, 578028, 583592, 588858, 594657, 601165, 607702, 613648, 618906, 623377, 626481, 627540, 626455, 623802, 620376, 616697, 612868, 608785, 604453, 600014, 595488, 590713, 585778, 581352, 578202, 576304, 574725, 572549, 569666, 566467, 563003, 558908, 554180, 549664, 546461, 544939, 544545, 544627, 545243, 547082, 550668, 555814, 561925, 568735, 576542, 585546, 595087, 603847, 610923, 616509, 621472, 626553, 632223, 638824, 646206, 653318, 658834, 662360, 664522, 665753, 665631, 663685, 660117, 655141, 648194, 638659, 627143, 615285, 604321, 594493, 585741, 578217, 571970, 566763, 562322, 558258]
60279E58258m503n665o364n643m312m052n199o414o579n855m734l227j508l51
60265D93852k22n52n86l79m07o67p96o84m25L1N95Q11M89L33J207K852L956L584
60247E02992K041L80n95p95o99q29j125j001j93O99R43N85J94l5k10oJ101K782
60229E06229L940M104L994M335M845M918M673M665N012N491O141P096P997Q323
60215E81763Q202Q291Q839R431R714R766R666R211Q325P324O566O089N725N340
60201F94252M828M157L427K732J888O97o48j738k568l488m523n292n697o087o549
60186F75391o668o327o103o367o529n864m645l781l603l650l496l108k538j839
60172F10873j227q34l77L85R82P51j23p58q19q32j197j623j778j756j631j181
$$ y = [558258, 553755, 548090, 541726, 536083, 531771, 527719, 522520, 516106, 509527, 503672, 498938, 495711, 494203, 493852, 493630, 493078, 492492, 492113, 491706, 491039, 490243, 489559, 489134, 489165, 489760, 490571, 491060, 491393, 492600, 495452, 499408, 502992, 505033, 505413, 504818, 504023, 503324, 502495, 501370, 500369, 500176, 500875, 501818, 502403, 502597, 502562, 502352, 502346, 503447, 506229, 510169, 514273, 518267, 522602, 527447, 532365, 537038, 541703, 546715, 552206, 558347, 565443, 573440, 581763, 589965, 598256, 607095, 616526, 626240, 636006, 645672, 654883, 663208, 670532, 677098, 683187, 688912, 694252, 699080, 703237, 706664, 709396, 711284, 711981, 711333, 709595, 707027, 703539, 699016, 693724, 688027, 681940, 675391, 668723, 662396, 656293, 649926, 643397, 637533, 632888, 629107, 625504, 621854, 618358, 615250, 612712, 610873, 609646, 608812, 608435, 608820, 609802, 610553, 610430, 609672, 608853, 608021, 606824, 605201, 603423, 601667, 600036, 598855]
60156E98855m41P7J42K44Q62J747K402K723K828K651K267K110K395K729K768K809
60140F27168L202L653L834M184N256O575P159P018P048P409P099N538L663K767
60126G01573K902L101K773K193J808J662J577J464J354J250J108R06P34P44Q64
60111G26013O66j79j330j996j897j714k346l867n432o164n901n106m173k966j220
60096F82388P20J914J825J045O52R68J380J249N90k02q01j062j112j439k419l664
60080F82032m313m093l602l420l519l768m393n456o448o930p204p728q221p952
60066F04985o754n229m051l513l560l831l830l501l338l487l157j602N99K118
60052E61849K613K890L421L705L462L376M076N159N902O311O766P121O915O191
$$ y = [598855, 598414, 598491, 598633, 598877, 599739, 601486, 603888, 606611, 609439, 612090, 614357, 616467, 618862, 621591, 624359, 627168, 630370, 634023, 637857, 642041, 647297, 653872, 661031, 668049, 675097, 682506, 689605, 695143, 698806, 701573, 704475, 707576, 710349, 712542, 714350, 716012, 717589, 719053, 720407, 721657, 722765, 723671, 724405, 725149, 726013, 726679, 726500, 725170, 723174, 721277, 719563, 717217, 713350, 707918, 701754, 695853, 690747, 686574, 683608, 682388, 683108, 685022, 686847, 687892, 688544, 689512, 690892, 692141, 692731, 692529, 691728, 690666, 689554, 688115, 685696, 682032, 677719, 673626, 670024, 666604, 663085, 659317, 654924, 649468, 643020, 636090, 628886, 621158, 612937, 604985, 598231, 593002, 588951, 585438, 581878, 578047, 574217, 570716, 567378, 563891, 560734, 559132, 559731, 561849, 564462, 567352, 570773, 574478, 577940, 581316, 585392, 590551, 596453, 602764, 609530, 616651, 623566, 629757]
60038F29757N391M581L443J898K16j434l050m451n445o220p094p900q165p897
60024E93630p661p791q102q450q983r528r350q025o194m876m333m021l561l155
60010D99600k975k657j808o93n2j64m46k01M66Q26N68K71O19J454J999J807J192
59993D99806P72R96K011L531M769M989M335L759L872M146L566J798m74k258l020
59978E32598k946k667k669k848k750k272j824j714j756j665j498j336r33q3R61
59963E06598J866K722L688M377M303L754L516L656L351K184Q83K96J96k13r75
59948E40202j312q95m59q24j769k349k153j751j737j775j046N31K094K943L316
59933E33016L773M219M115L428K735K357J946J098m5j002j528j765k034k544l123
$$ y = [629757, 635148, 639729, 643172, 645070, 645286, 643852, 640802, 636351, 630906, 624686, 617592, 609692, 601527, 593630, 585969, 578178, 570076, 561626, 552643, 543115, 533765, 525740, 519546, 514670, 510337, 506316, 502755, 499600, 496625, 493968, 492160, 491467, 491415, 491251, 490805, 490604, 491070, 491896, 492464, 492735, 493354, 494808, 496807, 498614, 499806, 500578, 501574, 503585, 507116, 511885, 516874, 521209, 524968, 528840, 532986, 536552, 538350, 537876, 535618, 532598, 529652, 526985, 524316, 521468, 518718, 516446, 514622, 512908, 511152, 509487, 507989, 506653, 505720, 505637, 506598, 508464, 511186, 514874, 519251, 523554, 527308, 530824, 534480, 537831, 540015, 540898, 541194, 541390, 541177, 540202, 538890, 537995, 537536, 536712, 534943, 532594, 530441, 528690, 526953, 525178, 524132, 524663, 526757, 529700, 533016, 536789, 541008, 545123, 548551, 551286, 553643, 555589, 556687, 556642, 555640, 554112, 552347, 550313, 547769, 544646]
59918E44646l185k285o80Q59J887K559L132L576L830M008M144M077L809L597L518
59903E77492L206K343J110j15j168j960k235j847j078l53K17P79J401J983K374
59888E82149K342J786J117J101K018L264M139M632N104N594N898O020N978N432
59874F36574M150K598J478P81l0j025j686j829j852k040k247k421k819l451l864
59859F22317l776l412k983k420j809j551j645j389k40J394K694L428L951M578
59845F19137N383O424P662Q707R085Q625P417N623L673K379K315L258M589O052
59831G00329P568Q485P767N151J605j561l732n040n848o436o898p064o712n944
59817F81670n159m531l853l026k404k336k649k915l031l145l186k893k429k432
$$ y = [544646, 541461, 539176, 538496, 539355, 541242, 543801, 546933, 550509, 554339, 558347, 562491, 566568, 570377, 573974, 577492, 580698, 583041, 584151, 584036, 582868, 580908, 578673, 576826, 575748, 575395, 575612, 576391, 577792, 579775, 582149, 584491, 586277, 587394, 588495, 590513, 593777, 597916, 602548, 607652, 613246, 619144, 625164, 631142, 636574, 640724, 643322, 644800, 645581, 645551, 644526, 642840, 641011, 639159, 637119, 634872, 632451, 629632, 626181, 622317, 618541, 615129, 612146, 609726, 607917, 606366, 604721, 603332, 603092, 604486, 607180, 610608, 614559, 619137, 624520, 630944, 638606, 647313, 656398, 665023, 672440, 678063, 681736, 684115, 686430, 689688, 694277, 700329, 707897, 716382, 724149, 729300, 730905, 729344, 725612, 720572, 714724, 708288, 701390, 694326, 687614, 681670, 676511, 671980, 668127, 665101, 662697, 660361, 657712, 654797, 651766, 648621, 645435, 642542, 640113, 637681]
59803F37681l246m293m558l654k234j359j586k582l459l450k466j174m85p83j593
59788F00759k043j713j007o77r78j417j338o92n3J10k3Q2O54J475K321L193M085
59771F02738M775N081N031M674L946L033K557K985L909M413M227M048M526N373
59757F61316N801N571N124M866M715M489M274M251M330M167L582K842K522K986
59743G20836L937M561M279L342K454J876J204J25r33j305j059r51j383j793j398
59728G33792k40R09J527J817K134K371K182J538P97K48j21m34o72p11m75n8K77
59711G44881L08J14J95J069K754M660O026O439N997N119M285L903M255N348O756
59696H02109P742P776O925N589L959K065L19n54m51l04j037k365l215l194k995
$$ y = [637681, 634435, 630142, 625584, 621930, 619696, 618337, 616751, 614169, 610710, 607260, 604794, 603620, 603135, 602352, 600759, 598716, 597003, 595996, 595319, 594341, 592924, 591586, 590894, 590841, 590951, 590928, 591010, 591664, 593139, 595460, 598653, 602738, 607513, 612594, 617625, 622299, 626245, 629278, 631835, 634820, 638729, 643142, 647369, 651417, 655943, 661316, 667117, 672688, 677812, 682678, 687393, 691882, 696156, 700407, 704737, 708904, 712486, 715328, 717850, 720836, 724773, 729334, 733613, 736955, 739409, 741285, 742489, 742614, 741681, 740376, 739317, 738366, 736983, 735190, 733792, 733552, 734461, 735988, 737805, 739939, 742310, 744492, 746030, 746827, 747075, 746954, 746520, 745848, 745137, 744662, 744604, 744881, 745189, 745303, 745498, 746567, 749321, 753981, 760007, 766446, 772443, 777562, 781847, 785750, 790005, 795353, 802109, 809851, 817627, 824552, 830141, 834100, 836165, 836484, 835930, 835479, 835175, 834138, 831773, 828558, 825364, 822369]
59681H22369l289l838m070l933l829l977m289m650m921m835m282l576l066k598
59667G67216j751n90K89O10P53J099J393J261J008J305K141K717K563K233K454
59652G84701L016L089K414J455M07j207l636o241q218r549j0659j1492j1629j1148
59638G21303j0612j0172r372q046o742n968n504m967m563m793n605o431o909p161
59624F24458p310p249o971o785o949p251p179o467n397m500l993l527k556j033
59610E47291M26J156J157J053J381K041K495K392J854J306J055J152J458J780
59596E67997J899J714J384J249J430J662J657J485J305Q73k98k178l950m773m573
59581E66883l928l336k861k404k042j968k174k369k296k080k087k337k375j834
$$ y = [822369, 819080, 815242, 811172, 807239, 803410, 799433, 795144, 790494, 785573, 780738, 776456, 772880, 769814, 767216, 765465, 764875, 765164, 765774, 766527, 767626, 769019, 770280, 771288, 772593, 774734, 777451, 780014, 782247, 784701, 787717, 790806, 793220, 794675, 795082, 793875, 790239, 783998, 775780, 766231, 755572, 744080, 732451, 721303, 710691, 700519, 691147, 683101, 676359, 670391, 664887, 659920, 655357, 650564, 644959, 638528, 631619, 624458, 617148, 609899, 602928, 596143, 589194, 581943, 574764, 568297, 562900, 558400, 554407, 550880, 548324, 547291, 547717, 548873, 550030, 551083, 552464, 554505, 557000, 559392, 561246, 562552, 563607, 564759, 566217, 567997, 569896, 571610, 572994, 574243, 575673, 577335, 578992, 580477, 581782, 582655, 582357, 580179, 576229, 571456, 566883, 562955, 559619, 556758, 554354, 552312, 550344, 548170, 545801, 543505, 541425, 539338, 537001, 534626, 532792]
59567E32792r74l55j78k47l56l60j8O78J175R39L15J13L48K62k48k32P93J864
59549E36311J976J676K209L597M758N300N951P156Q450R593J1200J3571J5598
59536F27346J5710J3558J0223O936M181J838k66k075l274l550k963j936p91M44
59522F65381J625K222J783M69j122k550l698m607n430o379p410q066p998p543
59508F16677p362p559p602p091o182n129l895k459j196n15l27j78J67N98R95J428
59492E70370J977K587L089L239K829K038J488J683K340K697K440J989J782J794
59478F02342J970K583L667M558M559L894L407L380L284K713J934J317P81J41m06
59463F40124m92pR82K447M214N782O697O994P050P067O978O715O383O162O162
$$ y = [532792, 531818, 531463, 531285, 531038, 530682, 530322, 530304, 530982, 532157, 533096, 533411, 533524, 533872, 534134, 533886, 533654, 534447, 536311, 538287, 539963, 542172, 545769, 550527, 555827, 561778, 568934, 577384, 586977, 598177, 611748, 627346, 643056, 656614, 666837, 673773, 677954, 679792, 679526, 677451, 674177, 670627, 667664, 665728, 664937, 665381, 667006, 669228, 671011, 671480, 670358, 667808, 664110, 659503, 654073, 647694, 640284, 632218, 624220, 616677, 609315, 601756, 594154, 587063, 580881, 575752, 571857, 569398, 568202, 567687, 567360, 567182, 567349, 567947, 568942, 570370, 572347, 574934, 578023, 581262, 584091, 586129, 587617, 589300, 591640, 594337, 596777, 598766, 600548, 602342, 604312, 606895, 610562, 615120, 619679, 623573, 626980, 630360, 633644, 636357, 638291, 639608, 640389, 640530, 640124, 639632, 639625, 640607, 643054, 647268, 653050, 659747, 666741, 673791, 680858, 687836, 694551, 700934, 707096, 713258]
59448G13258O248N895M501K085n25k448l573m335m930n140m844m257l544k575
59434F95816j254J33J159J725K139K699L380M030M797O088P981R970J1554J2932
59420G63149J4631J6580J8116J9046K0121K2026K4299K5593K4775K1521J6232
59409I86089R922L863j168n226q502j0508j0426q125m447o74J914K275J22l797
59395I51312q363j2999j7516k1279k3249k3004k1159j8705j6264j4045j1995r864
59383G52870p519n185l122j165Q80K558L136K678K034J736J650J771K458L517
59369G58297M005L509K857K967L582L907L902M082M505M801N008N488O152O576
59355H19638O898P751R170J0302J0580J0497J0878J1744J2377J2244J1479J0538
$$ y = [713258, 719506, 725401, 729902, 731987, 731462, 729014, 725441, 721106, 716176, 711036, 706192, 701935, 698391, 695816, 694562, 694695, 695854, 697579, 699718, 702417, 705797, 709827, 714624, 720712, 728693, 738663, 750217, 763149, 777780, 794360, 812476, 831522, 851643, 873669, 897968, 923561, 948336, 969857, 986089, 996011, 999874, 998706, 993480, 984978, 974470, 964044, 955919, 951472, 950798, 952712, 954987, 955109, 951312, 942949, 929950, 912434, 891155, 867906, 844902, 823743, 805038, 788774, 774729, 762734, 752870, 745351, 740166, 737044, 735879, 736759, 739317, 742453, 745131, 747165, 748901, 750551, 752322, 754780, 758297, 762302, 765811, 768668, 771635, 775217, 779124, 783026, 787108, 791613, 796414, 801422, 806910, 813062, 819638, 826536, 834287, 843457, 853759, 864339, 874836, 885714, 897458, 909835, 922079, 933558, 944096]
59343I44096R672Q746P443N563L163M50k353n008p369r585j1993j4536j6515j7266
59329H94508j7003j6585j6489j6433j6021j5298j4471j3406j1855j0000q473p726
59317G30748p530p176o219m940m038l894m272m756n141n224m570k974j018L43
59303F69339Q54J257K340M073N877P486R146J1059J2831J3614J2787J0485P430
59290G68578M175P32k856n849p239o880n691m534l375j812M2J746L293N052P034
59275G52416Q814J0234J1687J3354J4708J5076J4517J3677J2929J2046J0815R502
59263H99775Q416P239N252K380m22k138k870l629m974o396p277p839q679r697
59249H69141j0206r982r478q951q090o828n789n401n107m081k455j160p21q88
$$ y = [944096, 953768, 962514, 969957, 975520, 978683, 979133, 976780, 971772, 964403, 954818, 942825, 928289, 911774, 894508, 877505, 860920, 844431, 827998, 811977, 796679, 782208, 768802, 756947, 746947, 738474, 730748, 723218, 716042, 709823, 704883, 700845, 696951, 692679, 687923, 682782, 677558, 672988, 670014, 668996, 669339, 670193, 671450, 673790, 677863, 683740, 691226, 700372, 711431, 724262, 737876, 750663, 761148, 768578, 772753, 773485, 770629, 764780, 757541, 750661, 744970, 740436, 737061, 735249, 735291, 737037, 740330, 745382, 752416, 761230, 771464, 783151, 796505, 811213, 826289, 840806, 854483, 867412, 879458, 890273, 899775, 908191, 915430, 920682, 923062, 922640, 920502, 917632, 914003, 909029, 902633, 895356, 887517, 878838, 869141, 858935, 848953, 839475, 830524, 822434, 815606, 809817, 804416, 799309, 795228, 792773, 791613, 790892, 790004]
59235G90004j338k050k835l239l229l426m215n090n326n029m986n579o342o545
59221G30775n965m986m205l980m152m137l460k189q80o3Q5k49p22j026j052r59
59205F92835r90j248j638k004k262k439k571k641k614k589k720k944k914k441
59191F60820j788j241o17L44J297J577J225R93J185J168M59l78n10o1J79o6l94
59174F64192n63p40r14p24k0Q65J609K211K703K844K379J396K88n96j183j720
59158F72027k433l133l328k950k636l016l968m914n591o085o378o399o374o545
59144F08277o664o322n623m999m449l675k896k744l193l350k612j387l64L05P82
59129E61086J066J150J317J886K920M331N927P217P718P644P802Q531R259R462
$$ y = [790004, 788666, 786616, 783781, 780542, 777313, 773887, 769672, 764582, 759256, 754227, 749241, 743662, 737320, 730775, 724810, 719824, 715619, 711639, 707487, 703350, 699890, 697701, 696821, 696758, 696843, 696594, 695872, 694846, 693794, 692835, 691845, 690597, 688959, 686955, 684693, 682254, 679683, 677042, 674428, 671839, 669119, 666175, 663261, 660820, 659032, 657791, 657174, 657518, 658815, 660392, 661617, 662610, 663795, 664963, 665422, 665044, 664534, 664473, 664652, 664586, 664192, 663629, 662889, 661975, 661251, 661231, 662096, 663705, 665916, 668619, 671463, 673842, 675238, 675526, 674930, 673747, 672027, 669594, 666461, 663133, 660183, 657547, 654531, 650563, 645649, 640058, 633973, 627595, 621196, 614822, 608277, 601613, 595291, 589668, 584669, 580220, 576545, 573649, 570905, 567712, 564362, 561750, 560363, 559999, 560304, 561086, 562152, 563302, 564619, 566505, 569425, 573756, 579683, 586900, 594618, 602262, 610064, 618595, 627854, 637316]
59115F37316R454R835J0562J1086J1014J0270Q922P323O100N521N140M392L325
59102G40260K342J556P90l0q54j681k377k619k363k095k260k691k944k909k712
59087G19413k361j890j564j533j589j674k200l385m665n356n539n673n714n407
59073F70863n104n332n675n133l670k469k333k731k807k590k592k814k811k443
59059F22359k011j782j778j887j914j648j147p61p16q50r34j003j045p07K60J404
59043F05840J895J517R18P42Q90Q37M59J51K36O30J149J862K878M039N132O282
59027F35457P847R847J1799J3140J3671J3535J2953J2106J1014R557P685N629
59015G64240L610J495q94l154m490m637m159l660l163k528j897j290k90J329K951
$$ y = [637316, 646770, 656605, 667167, 678253, 689267, 699537, 708459, 715782, 721882, 727403, 732543, 736935, 740260, 742602, 744158, 744948, 744918, 744064, 742383, 740006, 737387, 735024, 732929, 730669, 727978, 725034, 722125, 719413, 717052, 715162, 713598, 712065, 710476, 708802, 706602, 703217, 698552, 693196, 687657, 681984, 676270, 670863, 665759, 660427, 654752, 649619, 645949, 643480, 641147, 638416, 635609, 633019, 630427, 627613, 624802, 622359, 620348, 618566, 616788, 614901, 612987, 611339, 610192, 609431, 608715, 607865, 606931, 605928, 604883, 604176, 604436, 605840, 607735, 609252, 610170, 610912, 611802, 612639, 613098, 613249, 613485, 614115, 615264, 617126, 620004, 624043, 629175, 635457, 643304, 653151, 664950, 678090, 691761, 705296, 718249, 730355, 741369, 750926, 758611, 764240, 767850, 769345, 768451, 765297, 760807, 756170, 752011, 748351, 745188, 742660, 740763, 739473, 739183, 740512, 743463]
59000G43463L704L513L093L034L311L561L349K327N96j127k118k347k253j993
58986G60113j440p74n25r07j563j968j757p51R05K666M144N680P853J0379J2131
58971G94186J2448J1823J1104J0530R925R300Q729P971O743N318M307L796L032
58958H99212J253j395l971n766p011q427j0247j1974j3107j3697j4018j3963j3190
58945G83699j1747j0137q772p641o547n395m201l075k262j988k142k235j787p42
58931G15028M86J369J715J761J772J592Q22n13j801k445k387j891j156l85R9J63
58915G14229J06K89P26J335K292L794N616P275Q529R431J0053J0441J0634J0563
58901G95313J0160R727R804J0342J0540R910Q989Q529Q434Q233Q093Q585R718
$$ y = [743463, 747167, 750680, 753773, 756807, 760118, 763679, 767028, 769355, 769951, 768824, 766706, 764359, 762106, 760113, 758673, 757899, 757374, 756467, 754904, 752936, 751179, 750428, 751333, 753999, 758143, 763823, 771676, 782055, 794186, 806634, 818457, 829561, 840091, 850016, 859316, 868045, 876016, 882759, 888077, 892384, 896180, 899212, 900465, 899070, 895099, 889333, 882322, 873895, 863648, 851674, 838567, 824870, 810852, 796889, 783699, 771952, 761815, 753043, 745402, 738855, 733460, 729259, 726184, 723922, 721934, 719792, 717557, 715770, 715028, 715514, 716883, 718598, 720359, 722131, 723723, 724545, 724032, 722231, 719786, 717399, 715508, 714352, 713967, 714066, 714229, 714335, 714624, 715350, 716685, 718977, 722771, 728387, 735662, 744191, 753622, 763675, 774116, 784750, 795313, 805473, 815200, 825004, 835346, 845886, 855796, 864785, 873314, 881748, 889981, 898074, 906659, 916377]
58888I16377J1023J2360J3748J4664J4426J3192J1684J0006P724N162L356K522
58876A036244J574l19k616m342n318n825n839n311m751m798n483o361p097p573
58862I72185p783q045q924j0559j2347j3655j4481j5059j5206j4624j3524j2412
58850H25566j1460j0485r511q872q748q962r220r435r686j0031j0279j0058r245
58837F99574q261p701p650p702p515o923n619l417j014K39j91j207j250M1J727
58822F43131K868L366L670M095M564M773M568M137L710L139K095P72q9j05J27
58807F84821k67j351k383k818k880l124l726m352m609m425m036l727l642l748
58793F39733l757l216k048r48p74j343j464m34J099K302L447N143O841P318O549
$$ y = [916377, 927400, 939760, 953508, 968172, 982598, 995790, 1007474, 1017480, 1025204, 1030366, 1033722, 1036244, 1037818, 1037499, 1034883, 1030541, 1025223, 1019398, 1013559, 1008248, 1003497, 998699, 993216, 986855, 979758, 972185, 964402, 956357, 947433, 936874, 924527, 910872, 896391, 881332, 866126, 851502, 837978, 825566, 814106, 803621, 794110, 785238, 776490, 767528, 758308, 748873, 739187, 729156, 718877, 708819, 699574, 691313, 683612, 675962, 668260, 660745, 653822, 648203, 644786, 643772, 644011, 643820, 642613, 641363, 641404, 643131, 645999, 649365, 653035, 657130, 661694, 666467, 671035, 675172, 678882, 682021, 684116, 684888, 684799, 684694, 684821, 684554, 683203, 680820, 678002, 675122, 671998, 668272, 663920, 659311, 654886, 650850, 647123, 643481, 639733, 635976, 632760, 630712, 629764, 628990, 627647, 626183, 625749, 626848, 629150, 632597, 637740, 644581, 651899, 658448]
58778F58448N851N963O076N249L788K600J812P54j008l173n069o223o698p014
58764F61356p521p863p449o341n183m292l433k532j949j822j801j540r96j59Q90
58749F09365J607J412O02J61N29J276K067L006L902M152L775L581L946M342M507
58734F48230N054O262P246P093O113N239M892N041N632O236O080N259N135O601
58720G30113Q603R434Q906Q187P961P843P406O708N810M561K920R48j444m195
58706H03761o844q998j0850j2732j4516j5923j7007j7859j8293j8295j8217j8029
58694F26198j6994j4810j2375j0646r411q054o846o388o293n661m545l771l495
58681E16909l094k373j858j806j903j860j585q18N15J734K097J993K537M023N693
$$ y = [658448, 664299, 670262, 676338, 681587, 685375, 687975, 689787, 690541, 689533, 686360, 681291, 675068, 668370, 661356, 653835, 645972, 638523, 632182, 626999, 622707, 619274, 616742, 614793, 612971, 611170, 609630, 608634, 608475, 609365, 610972, 612384, 612986, 613147, 613676, 614952, 617019, 620025, 623927, 628079, 631854, 635435, 639381, 643723, 648230, 653284, 659546, 666792, 673885, 679998, 685237, 690129, 695170, 700802, 707038, 713118, 718377, 723512, 730113, 738716, 748150, 757056, 765243, 773204, 781047, 788453, 795161, 800971, 805532, 808452, 809400, 807956, 803761, 796917, 787919, 777069, 764337, 749821, 733898, 716891, 699032, 680739, 662444, 644227, 626198, 609204, 594394, 582019, 571373, 561962, 553908, 547062, 540674, 534381, 528720, 524175, 520404, 516909, 513815, 511442, 509584, 507778, 505875, 504015, 502430, 501612, 502127, 503861, 505958, 507951, 510488, 514511, 520204]
58666E20204P042Q321R594J0268R873Q625O922M918K687L11k271m995p262q421
58652E65816q535q153p474o428n385m882m658l883k474j371j243j627j615q46
58638E07242L84J550K255K483K532K498J965O93p67j647j941k197k568k693k317
58623E07472j455j79J175J929J874J801K519L741M677N244N666N544M519L436
58609E47963L429M042L806K591J877K457L393L553K895J778L67p51o62M69J181
58594E78388O27k86l05O18J904L453N265O746P392P693Q432R539J0348J0651J0769
58579F61234J0759J0283R274Q180P510P380P580P974Q819J0528J3012J5580J7839
58566G95952K0328K3649K7262K9880L0930L0863L0095K8511K5940K2314J7362
$$ y = [520204, 527246, 535567, 545161, 555429, 565302, 573927, 580849, 585767, 588454, 588765, 586494, 581499, 574237, 565816, 557281, 549128, 541654, 535226, 529841, 524959, 520301, 516418, 513944, 512573, 511330, 509703, 508088, 507242, 507626, 509176, 511431, 513914, 516446, 518944, 520909, 521602, 520835, 519188, 517247, 515050, 512482, 509789, 507472, 506017, 505838, 507013, 508942, 510816, 512617, 515136, 518877, 523554, 528798, 534464, 540008, 544527, 547963, 551392, 555434, 559240, 561831, 563708, 566165, 569558, 573111, 576006, 577784, 578151, 577400, 576738, 577207, 578388, 579015, 578729, 578424, 579042, 580946, 584399, 589664, 596410, 603802, 611495, 619927, 629466, 639814, 650465, 661234, 671993, 682276, 691550, 699730, 707240, 714620, 722200, 730174, 738993, 749521, 762533, 778113, 795952, 816280, 839929, 867191, 897071, 928001, 958864, 988959, 1017470, 1043410, 1065724, 1083086]
58555A083086J1013M223j502n483q101r649r976r286q333p581p022p003q107j0163
58541A006116j2316j4390j7077k0475k3533k5331k5881k5335k3557k0990j8760
58530G78471j7292j5788j3757j1949j1047j0398r065p253n786m805l895k965k150
58517F62321j323m76j50p14j590j849j347o83l08j79m8K57P13J018Q99N51L52
58500F57444K78P4r4O9K65Q4R5J264L291M781N334O093P799R734J1128J2294J3613
58483G33546J4700J5435J6588J8471K0023K0176J9193J7765J5839J3226J0298
58472I15260P105K913k264o773r214j0222j1078j1554j0660q663o674m710j854
58459H41612J883N348P830R633J1137J2386J3432J4049J3310J0470O141J613k738
$$ y = [1083086, 1094099, 1098322, 1096820, 1091337, 1083236, 1073587, 1063611, 1054325, 1045992, 1038411, 1031389, 1024386, 1016279, 1006116, 993800, 979410, 962333, 941858, 918325, 892994, 867113, 841778, 818221, 797231, 778471, 761179, 745391, 731634, 719685, 708638, 698240, 689175, 681922, 676136, 671331, 667436, 664471, 662321, 660998, 660522, 660372, 659658, 658068, 656219, 654872, 654189, 653881, 653702, 653654, 653911, 654624, 655642, 656541, 657092, 657444, 657722, 657796, 657702, 657771, 658036, 658120, 658215, 659479, 662770, 667551, 672885, 678978, 686777, 696511, 707639, 719933, 733546, 748246, 763681, 780269, 798740, 818763, 838939, 858132, 875897, 891736, 904962, 915260, 922365, 925278, 923014, 916241, 907027, 896805, 885727, 874173, 863513, 854850, 848176, 843466, 841612, 843495, 848843, 856673, 866306, 877443, 889829, 903261, 917310, 930620, 941090, 947231, 948844, 946106]
58446I46106p290j1664j4662j5797j5806j5491j4886j3751j2075r929p438m986
58434H02331k957j265M22K189L902N521O889P703Q100Q836J0143J0984J0181P915
58420H80894N261K630l85l873p199r687j1037j1222j0551r721r169q613p649o513
58406G93166n633m870l845k679j702p64M77J863K979L843M692N399N651N457M968
58391H09002M136L075K342K276K475K469K423K609K770K667K783L675N052O153
58377H53907O730P009P101P080P275P841Q432Q747R047R604J0222J0772J1608
58364I65375J2882J4046J4618J4864J5120J5073J4294J2874J1020Q637N830L201
58352A107834J235kl85J26P22L78l71K77K820N710P760R567J1698J3302J3874
$$ y = [946106, 938816, 927152, 912490, 896693, 880887, 865396, 850510, 836759, 824684, 814755, 807317, 802331, 799374, 798109, 798531, 800720, 804622, 810143, 817032, 824735, 832835, 841671, 851814, 862798, 872979, 880894, 886155, 888785, 888400, 884527, 877328, 867641, 856604, 845382, 834831, 825110, 815941, 807328, 799679, 793166, 787533, 782663, 778818, 776139, 774437, 773673, 774150, 776013, 778992, 782835, 787527, 792926, 798577, 804034, 809002, 813138, 816213, 818555, 820831, 823306, 825775, 828198, 830807, 833577, 836244, 839027, 842702, 847754, 853907, 860637, 867646, 874747, 881827, 889102, 896943, 905375, 914122, 923169, 932773, 942995, 953767, 965375, 978257, 992303, 1006921, 1021785, 1036905, 1051978, 1066272, 1079146, 1090166, 1098803, 1104633, 1107834, 1109069, 1109067, 1108682, 1108808, 1109530, 1109908, 1109537, 1109814, 1112634, 1118344, 1126104, 1135671, 1147369, 1160671, 1174545]
58337A174545J4611J6472J8327J8707J8020J7410J6691J5190J3484J2435J1472
58326A347364R634P447O007N052L711K320J827K157K818M125O230P949Q412Q827
58312A423880J0658J3045J4152J4188J4834J6320J7332J7467J7613J8101J8345
58301A595935J8164J7900J7585J7340J7913J9427K0576K0552K0592K1892K3363
58290A811239K3545K3283K4199K5766K6508K6943K8598L1033L2689L3881L6138
58279B123822L9112M1014M1601M2088M2603M2449M2373M3852M6478M8580M9966
58268B603938N1568N3166N4124N5562N8945O3182O5953O7149O8164O8820O8155
58257C278726O7238O7834O9125O9144O8626O9940P3037P6144P9469Q4421R0137
$$ y = [1174545, 1189156, 1205628, 1223955, 1242662, 1260682, 1278092, 1294783, 1309973, 1323457, 1335892, 1347364, 1356998, 1364445, 1370452, 1375504, 1379215, 1381535, 1383362, 1385519, 1388337, 1392462, 1398692, 1406641, 1415053, 1423880, 1434538, 1447583, 1461735, 1475923, 1490757, 1507077, 1524409, 1541876, 1559489, 1577590, 1595935, 1614099, 1631999, 1649584, 1666924, 1684837, 1704264, 1724840, 1745392, 1765984, 1787876, 1811239, 1834784, 1858067, 1882266, 1908032, 1934540, 1961483, 1990081, 2021114, 2053803, 2087684, 2123822, 2162934, 2203948, 2245549, 2287637, 2330240, 2372689, 2415062, 2458914, 2505392, 2553972, 2603938, 2655506, 2708672, 2762796, 2818358, 2877303, 2940485, 3006438, 3073587, 3141751, 3210571, 3278726, 3345964, 3413798, 3482923, 3552067, 3620693, 3690633, 3763670, 3839814, 3919283, 4003704, 4093841]
58246D093841R4780R9357J06054J13765J19722J24599J31301J39596J46850J53332
58236E323197J61595J71243J79725J87814J98639K11727K23762K34954K48717
58227G141373K65300K81994K99395L20915L46133L71373L96892M26518M60385
58218A0310278M95442N33075N78163O30436O85364P43942Q12660Q93432R83248
58209A6666040J084363J204577J346840J510006J701094J935004K221045K562986
58201C0231955K973943L477412M093054M837936N742056O841892Q156936R699384
58193G6054568J1518202J3716117J6420598J9745338K3709367K8028597L1880465
58186B21073252L3974217L3093143K8759925K1458378J2273441K369925p258869
$$ y = [4093841, 4188621, 4287978, 4394032, 4507797, 4627519, 4752118, 4883419, 5023015, 5169865, 5323197, 5484792, 5656035, 5835760, 6023574, 6222213, 6433940, 6657702, 6892656, 7141373, 7406673, 7688667, 7988062, 8308977, 8655110, 9026483, 9423375, 9849893, 10310278, 10805720, 11338795, 11916958, 12547394, 13232758, 13976700, 14789360, 15682792, 16666040, 17750403, 18954980, 20301820, 21811826, 23512920, 25447924, 27668969, 30231955, 33205898, 36683310, 40776364, 45614300, 51356356, 58198248, 66355184, 76054568, 87572770, 101288887, 117709485, 137454823, 161164190, 189192787, 221073252, 255047469, 288140612, 316900537, 338358915, 350632356, 353002281, 345743412]
58179C45743412j5782808k2530670k7086602k9369368k9609713k8264720k5909847
58172A67189684k3103882k0259352j7593815j5178168j3013917j1081368r362342
58165E7596840p852604o556969n470619m571974l834165l233441k745178k343344
58157B0988546k009036j732585j504983j314473j153143j018906r08387q14495
58149A0532538p32756o63286o04567n51535n01652m56824m17573l81002l46012
58140E877331l14836k87737k61786k36598k15831k01064j89216j77897j68445
58131C823921j61704j55514j48485j42013j36507j29716j20769j12014j04968
58122B612231r8063r0315q3505p8811p4640o9748o5345o2229n8876n4350n0270
$$ y = [345743412, 329960604, 307429934, 280343332, 250973964, 221364251, 193099531, 167189684, 144085802, 123826450, 106232635, 91054467, 78040550, 66959182, 57596840, 49744236, 43187267, 37716648, 33144674, 29310509, 26077068, 23331890, 20988546, 18979510, 17246925, 15741942, 14427469, 13274326, 12255420, 11347033, 10532538, 9799782, 9136496, 8531929, 7980394, 7478742, 7021918, 6604345, 6223343, 5877331, 5562495, 5274758, 5012972, 4776374, 4560543, 4359479, 4170263, 3992366, 3823921, 3662217, 3506703, 3358218, 3216205, 3079698, 2949982, 2829213, 2717199, 2612231, 2514168, 2423853, 2340348, 2261537, 2186897, 2117149, 2051804, 1989575, 1930699, 1876349, 1826079]
58111A826079m8040m6645m4881m3343m2608m1792m0377l9287l8810l7632l5191
58100A367473l2823l1429l0090k8119k6341k5265k4082k2457k1247k0526j8975
58089A086119j6221j3739j2475j1680j0874j0834j1622j1876j1193j1125j2588
58078I51892j4310j5022j5327j6131j6908j6845j6169j5314j4124j2844j2356
58067G86542j2624j2337j0924r400q551p856o960o528o797o895o444o293o857
58054F78076p231o822o444o898p752q201q009p107n549m200m067m727m903m678
58040E91488n252o460o704n700m960m981m451l069k572l722m687m018l064l616
58026E28232n060n749n644n666n755n376m929m963m924m130l175k948l175l105
$$ y = [1826079, 1778039, 1731394, 1686513, 1643170, 1600562, 1558770, 1518393, 1479106, 1440296, 1402664, 1367473, 1334650, 1303221, 1273131, 1245012, 1218671, 1193406, 1169324, 1146867, 1125620, 1105094, 1086119, 1069898, 1056159, 1043684, 1032004, 1021130, 1010296, 998674, 986798, 975605, 964480, 951892, 937582, 922560, 907233, 891102, 874194, 857349, 841180, 825866, 811742, 798898, 786542, 773918, 761581, 750657, 741257, 732706, 724850, 717890, 711362, 704565, 697670, 691226, 684933, 678076, 670845, 664023, 657579, 650681, 642929, 634728, 626719, 619612, 614063, 609863, 605796, 601069, 596166, 591488, 586236, 579776, 573072, 567372, 562412, 557431, 552980, 549911, 547339, 543617, 538930, 534912, 531848, 528232, 523172, 517423, 511779, 506113, 500358, 494982, 490053, 485090, 480166, 476036, 472861, 469913, 466738, 463633]
58012D63633k869k859k689j887r16m36k82r2n8j87J96J299K199K260K171K586
57996D62069K876K333J599J685K388K781K507J693L71j048j668j363j224j886
57982D73113k429k000j327j494k171k339j938j490r25JP79Q33N73O40P59L91j94
57965D60782n00q70j755k642k800k564k701l053k909k374k192k533k895k946k711
57950D25337k178j469r38o34j53N14Q23Q38J518L119M449M657M634N445O554O944
57934D59460O990P586Q256P838O485N271M163K175o32l000m435n787p603r223
57920D77544r924r835r340q512p478o564n718m503k807j086K22J026J262R31M07
57905D15625K16L65L44j30p66j059q00l15k68q75j295m19J537K969K944K379K538
$$ y = [463633, 460764, 457905, 455216, 453329, 452413, 451977, 451695, 451603, 451545, 451358, 451554, 452853, 455052, 457312, 459483, 462069, 464945, 467278, 468877, 470562, 472950, 475731, 478238, 479931, 480302, 479254, 477586, 476223, 474999, 473113, 470684, 468684, 467357, 465863, 463692, 461353, 459415, 457925, 457000, 457001, 457780, 458613, 459186, 459826, 460585, 460976, 460782, 460282, 459412, 457657, 455015, 452215, 449651, 446950, 443897, 440988, 438614, 436422, 433889, 430994, 428048, 425337, 423159, 421690, 420752, 420118, 419965, 420479, 421302, 422140, 423658, 426777, 431226, 435883, 440517, 445962, 452516, 459460, 466450, 474036, 482292, 490130, 496615, 501886, 506049, 508224, 507592, 504592, 500157, 494370, 486767, 477544, 467620, 457785, 448445, 439933, 432455, 425891, 420173, 415670, 412863, 411777, 411999, 413025, 414287, 415218, 415625, 415841, 416206, 416550, 416420, 415654, 414595, 413795, 413480, 413212, 412337, 411042, 410623, 412160, 415129, 418073, 420452, 422990]
57888D22990L184L174K266J253O74M32M32O98Q91N46k53r59j236j081n50J51O13
57871D33225P31R87J739K633L181L452L711L921M105M692N860P084P859Q273Q419
57856D99872Q037P313P134P752Q059P218O086N904O294N869M277K352P28n17j210
57841E75168j314j513k398l332l321k683k654l507m363m623m420l679k147l24
57827E34890P53Q68P20O71M72K40N83J480K103K006J618J391J243J056R52R41
57811E51987R39J135J591J619M42j488k767k700j865j004k48M03P45P57O98O20
57795E50864L83J20O2l7n79j346j720j647j589j629j378p17J20J063K078K715
57779E46763K621K337K636L322L563L230K762K002M55j351k149j795j548k164
$$ y = [422990, 426174, 429348, 431614, 432867, 433541, 433973, 434405, 435103, 435994, 436540, 436287, 435328, 434092, 433011, 432461, 432612, 433225, 433956, 434943, 436682, 439315, 442496, 445948, 449659, 453580, 457685, 462377, 468237, 475321, 483180, 491453, 499872, 507909, 515222, 522356, 530108, 538167, 545385, 551471, 557375, 563669, 569538, 573815, 576167, 576895, 576378, 575168, 573854, 572341, 569943, 566611, 563290, 560607, 557953, 554446, 550083, 545460, 541040, 537361, 535214, 534890, 535643, 536511, 537231, 537902, 538374, 538614, 539197, 540677, 542780, 544786, 546404, 547795, 549038, 550094, 551046, 551987, 552926, 554061, 555652, 557271, 557713, 556225, 553458, 550758, 548893, 547889, 547641, 548044, 548789, 549546, 550244, 550864, 551247, 551367, 551429, 551392, 550813, 549467, 547747, 546100, 544511, 542882, 541504, 540787, 540907, 541970, 544048, 546763, 549384, 551721, 554357, 557679, 561242, 564472, 567234, 569236, 569691, 568340, 566191, 564396, 562848, 560684]
57765E60684k976l268l364l747m112l962l411k808k186j514r09l09M64J158J276
57750E31016J042J342K493L765M420M514M438M385M552N178O090O771P005O895
57736E93906O314N054L520K471K063K008K542M124O164P209O720N597M721M074
57722F56487L591L728M564N320N295M617L699K783K225K304K492J855M30p99j438
57707F97153j986k471k136r75q0R9M82J588K509K553K504L131L699L239K200J502
57691G13011Q96l08j682k250k108k060k101j535k63J216K815M764O759Q299R628
57676G35081J1431J3763J6214J8886K2306K6576L1446L6883M2595M7256M9080
57665A051517M7074M1039L0881J7082J549j3183k5663l5609m2533m5496m4355
$$ y = [560684, 557708, 554440, 551076, 547329, 543217, 539255, 535844, 533036, 530850, 529336, 528427, 528118, 528582, 529740, 531016, 532058, 533400, 535893, 539658, 544078, 548592, 553030, 557415, 561967, 567145, 573235, 580006, 587011, 593906, 600220, 605274, 608794, 611265, 613328, 615336, 617878, 622002, 628166, 635375, 642095, 647692, 652413, 656487, 660078, 663806, 668370, 673690, 678985, 683602, 687301, 690084, 692309, 694613, 697105, 698960, 699390, 698591, 697153, 695167, 692696, 690560, 689585, 689505, 689604, 690086, 691674, 694183, 696736, 699240, 702371, 706070, 709309, 711509, 713011, 713907, 713599, 711917, 709667, 707559, 705499, 703398, 701863, 701600, 702816, 705631, 710395, 717154, 725453, 735081, 746512, 760275, 776489, 795375, 817681, 844257, 875703, 912586, 955181, 1002437, 1051517, 1098591, 1139630, 1170511, 1187593, 1189142, 1175959, 1150296, 1114687, 1072154, 1026658, 982303]
57654I82303m0328l4974k9351k4134j9703j5906j2430r459p395n978m509k924
57642G75212j871j565j431j037n95k52L81J513K561K759K070J163P26R58J529
57627G82121J874J720J340J156J164J061Q17P23R32J326J766K151K280K070J856
57612H04357K138K970L825M096L531K437J598J734K721L612L736L430L311L318
57598H46814L055K612K399K403K337K273K359K238J584J039J608L091M141M092
57584H82045L712L818M083L829L229K963L097L050K540J954J836K311K993L328
57570I24788L085K687K827L635M424M479L875L348L411L942M539N022N443N741
57556I81246N701N343N111N382N913O194O278O725P633Q333Q377Q152Q074P775
$$ y = [982303, 941975, 907001, 877650, 853516, 833813, 817907, 805477, 796018, 788623, 782645, 778136, 775212, 773341, 771776, 770345, 769308, 768713, 768461, 768842, 770355, 772916, 775675, 777745, 778908, 779634, 780592, 782121, 783995, 785715, 787055, 788211, 789375, 790436, 791253, 791976, 792908, 794234, 796000, 798151, 800431, 802501, 804357, 806495, 809465, 813290, 817386, 820917, 823354, 824952, 826686, 829407, 833019, 836755, 840185, 843496, 846814, 849869, 852481, 854880, 857283, 859620, 861893, 864252, 866490, 868074, 869113, 870721, 873812, 877953, 882045, 885757, 889575, 893658, 897487, 900716, 903679, 906776, 909826, 912366, 914320, 916156, 918467, 921460, 924788, 927873, 930560, 933387, 937022, 941446, 945925, 949800, 953148, 956559, 960501, 965040, 970062, 975505, 981246, 986947, 992290, 997401, 1002783, 1008696, 1014890, 1021168, 1027893, 1035526, 1043859, 1052236, 1060388, 1068462, 1076237]
57542A076237O807N723N526O245O832O500N464M459M115M791O227P340P115N909
57528A159290N187N765O934P586P517P197O891O558O321O481P171Q165Q978R137
57514A259178Q684Q359Q890R984J0541J0019R072Q539Q433Q274P913P514P093
57501A372493O636O397O559O783O631O277O269O620O734O270N612N307N423N688
57487A459699N967O348O903P559Q139Q522Q800R260J0024J0689J0644R814Q792
57474A571160Q120P801P758Q300R511J0515J0178Q761P979Q972J0847J1838J1419
57461A693159J0479R766R232Q896R239J0316J1279J1394J0980J0794J0999J1346
57449A817879J1884J2716J3371J3219J2521J2223J2682J3249J3372J3377J3816
$$ y = [1076237, 1083044, 1088767, 1094293, 1100538, 1107370, 1113870, 1119334, 1123793, 1127908, 1132699, 1138926, 1146266, 1153381, 1159290, 1164477, 1170242, 1177176, 1184762, 1192279, 1199476, 1206367, 1212925, 1219246, 1225727, 1232898, 1241063, 1250041, 1259178, 1267862, 1276221, 1285111, 1295095, 1305636, 1315655, 1324727, 1333266, 1341699, 1349973, 1357886, 1365400, 1372493, 1379129, 1385526, 1392085, 1398868, 1405499, 1411776, 1418045, 1424665, 1431399, 1437669, 1443281, 1448588, 1454011, 1459699, 1465666, 1472014, 1478917, 1486476, 1494615, 1503137, 1511937, 1521197, 1531221, 1541910, 1552554, 1562368, 1571160, 1579280, 1587081, 1594839, 1603139, 1612650, 1623165, 1633343, 1642104, 1650083, 1659055, 1669902, 1681740, 1693159, 1703638, 1713404, 1722636, 1731532, 1740771, 1751087, 1762366, 1773760, 1784740, 1795534, 1806533, 1817879, 1829763, 1842479, 1855850, 1869069, 1881590, 1893813, 1906495, 1919744, 1933116, 1946493, 1960309]
57438A960309J4474J4661J4188J3612J3536J3995J4601J5009J5146J5168J5267
57427B119966J5533J5867J6014J5720J4974J4128J3754J4192J5206J6123J6455
57416B287932J6412J6670J7568J8616J9041J8738J8367J8468J8823J8909J8626
57405B488170J8259J7957J7639J7276J6929J6632J6549J6958J7735J8208J8028
57394B680340J7894J8676K0071K1023K1294K1649K2353K2659K2176K1685K1953
57383B911773K2582K2806K2732K2959K3409K3445K2940K2441K2330K2398K2242
57372C162057K1665K0726J9772J9353J9855K1174K2750K3844K3955K3383K3279
57361C401813K4471K6268K7114K6570K5794K5852K6462K6817K6747K6617K6762
$$ y = [1960309, 1974783, 1989444, 2003632, 2017244, 2030780, 2044775, 2059376, 2074385, 2089531, 2104699, 2119966, 2135499, 2151366, 2167380, 2183100, 2198074, 2212202, 2225956, 2240148, 2255354, 2271477, 2287932, 2304344, 2321014, 2338582, 2357198, 2376239, 2394977, 2413344, 2431812, 2450635, 2469544, 2488170, 2506429, 2524386, 2542025, 2559301, 2576230, 2592862, 2609411, 2626369, 2644104, 2662312, 2680340, 2698234, 2716910, 2736981, 2758004, 2779298, 2800947, 2823300, 2845959, 2868135, 2889820, 2911773, 2934355, 2957161, 2979893, 3002852, 3026261, 3049706, 3072646, 3095087, 3117417, 3139815, 3162057, 3183722, 3204448, 3224220, 3243573, 3263428, 3284602, 3307352, 3331196, 3355151, 3378534, 3401813, 3426284, 3452552, 3479666, 3506236, 3532030, 3557882, 3584344, 3611161, 3637908, 3664525, 3691287]
57350C691287K7526K9013L0413L0500K9338K8348K8187K7834K6666K5928K6786
57339D001826K8184K8366K7572K7389K8069K8448K8150K7959K8007K7546K6633
57328D308149K6351K6960K7416K7134K6816K7071K7540K7896K8510K9573L0633
57317D614049L1480L2470L3551L4115L4241L4934L6551L8131L8854L9153L9612
57306E007141L9822L9251L8386L8131L8573L9178L9720M0320M0923M1322M1495
57295E444262M1531M1555M1890M2808M3980M4753M5108M5691M6687M7509M7861
57284E933635M8260M9116N0121N1031N2191N3760N5159N5888N6302N6925N7658
57273F520046N8228N9003O0764O4088O9086P5189Q0871Q4384Q5335Q4960Q4564
$$ y = [3691287, 3718813, 3747826, 3778239, 3808739, 3838077, 3866425, 3894612, 3922446, 3949112, 3975040, 4001826, 4030010, 4058376, 4085948, 4113337, 4141406, 4169854, 4198004, 4225963, 4253970, 4281516, 4308149, 4334500, 4361460, 4388876, 4416010, 4442826, 4469897, 4497437, 4525333, 4553843, 4583416, 4614049, 4645529, 4677999, 4711550, 4745665, 4779906, 4814840, 4851391, 4889522, 4928376, 4967529, 5007141, 5046963, 5086214, 5124600, 5162731, 5201304, 5240482, 5280202, 5320522, 5361445, 5402767, 5444262, 5485793, 5527348, 5569238, 5612046, 5656026, 5700779, 5745887, 5791578, 5838265, 5885774, 5933635, 5981895, 6031011, 6081132, 6132163, 6184354, 6238114, 6293273, 6349161, 6405463, 6462388, 6520046, 6578274, 6637277, 6698041, 6762129, 6831215, 6906404, 6987275, 7071659, 7156994, 7241954, 7326518]
57262G326518Q4296Q3803Q3157Q2478Q1442P9804P7859P5832P3433P0594O7924
57251H187140O5814O3841O1702O0096N9748O0149O0145N9392N8444N7693N6946
57240H851110N5870N4203N1820M9073M6843M5774M5705M6096M6626M7029M6965
57229I387114M6537M6374M6716M6966M6687M6376M6646M7234M7483M7380M7354
57218I902867M7528M7818M8412M9437N0433N0815N0578M9979M8869M6897M4147
57207A0437780M1110L8254L5846L3888L1900K9354K6538K4381K3086K1790J9968
57196A0763895J8267J7250J6244J4391J2172J0763J0337J0032R326Q571Q244Q345
57184A0907837Q467P991O449M120J950N49l62j316k448l840n733p921r401r072
$$ y = [7326518, 7410814, 7494617, 7577774, 7660252, 7741694, 7821498, 7899357, 7975189, 8048622, 8119216, 8187140, 8252954, 8316795, 8378497, 8438593, 8498341, 8558490, 8618635, 8678027, 8736471, 8794164, 8851110, 8906980, 8961183, 9013003, 9062076, 9108919, 9154693, 9200398, 9246494, 9293120, 9340149, 9387114, 9433651, 9480025, 9526741, 9573707, 9620394, 9666770, 9713416, 9760650, 9808133, 9855513, 9902867, 9950395, 9998213, 10046625, 10096062, 10146495, 10197310, 10247888, 10297867, 10346736, 10393633, 10437780, 10478890, 10517144, 10552990, 10586878, 10618778, 10648132, 10674670, 10699051, 10722137, 10743927, 10763895, 10782162, 10799412, 10815656, 10830047, 10842219, 10852982, 10863319, 10873351, 10882677, 10891248, 10899492, 10907837, 10916304, 10924295, 10930744, 10934864, 10936814, 10937363, 10937001, 10935685, 10933237, 10929397, 10923664, 10915743, 10906342, 10897270]
57170A0897270o572k720K78K1k679k287O188J9018K4076J2265j2590l7513n2753
57157A0842002n8163n9004n9425o0580o2058o3133o3506o3705o4400o5462o6508
57146A0156058o8013p0771p4616p8821q3484q9276r5977j02506j08214j13080
57136I271300j16772j18590j18053j14700j07874r7825q6375p5483o5886n8330
57126H311412n4824n6750o2467o8773p4243p9141q2802q3490q0868p6389p1110
57115G520555o4957n8150n1396m4524l6689k7897j8768q826L351J8632L7577O1554
57103G330462R1627J27103J67415K14882K73342L44947M30772N33533O56842Q03039
57093A0973964R75198J179919J423740J707056K024349K367158K720516L058736
$$ y = [10897270, 10890698, 10887978, 10888256, 10888277, 10885598, 10883311, 10889499, 10908517, 10932593, 10944858, 10932268, 10894755, 10842002, 10783839, 10724835, 10665410, 10604830, 10542772, 10479639, 10416133, 10352428, 10288028, 10222566, 10156058, 10088045, 10017274, 9942658, 9863837, 9780353, 9691077, 9595100, 9492594, 9384380, 9271300, 9154528, 9035938, 8917885, 8803185, 8695311, 8597486, 8511111, 8435628, 8369742, 8311412, 8256588, 8199838, 8137371, 8068598, 7994355, 7915214, 7832412, 7748922, 7668054, 7591665, 7520555, 7455598, 7397448, 7346052, 7301528, 7264839, 7236942, 7218174, 7209348, 7212699, 7231331, 7268908, 7330462, 7422089, 7549192, 7716607, 7931489, 8204831, 8549778, 8980550, 9514083, 10170925, 10973964, 11949162, 13129081, 14552821, 16259877, 18284226, 20651384, 23371900, 26430636]
57085B6430636L353262L584549L739183L800878L763884L660367L549865L454096
57077E5336720L303796K972102K372573J523429N22945n20818j533549k471458
57069F1505740l299620l978811m467484m735650m781373m635278m347690l970538
57061B7289296l548190l116480k701800k319880j978198j680044j425428j210514
57053I308762j029681q78482p53422o50131n63918m91620m31221l80275l36280
57044C793732k98054k65237k36866k11725j89438j70022j52817j37058j22866
57035B009649j10478r9013q7290p5426o4497n4839m5774l6601k6845j5744k611
57024A390531J1935K5435L4335L5519K8243J4970n70j6755l4609n4508p3652q7892
$$ y = [26430636, 29783898, 33368447, 37107630, 40908508, 44672392, 48332759, 51882624, 55336720, 58640516, 61612618, 63985191, 65508620, 66031565, 65510747, 63977198, 61505740, 58206120, 54227309, 49759825, 45024175, 40242802, 35607524, 31259834, 27289296, 23741106, 20624626, 17922826, 15602946, 13624748, 11944704, 10519276, 9308762, 8279081, 7400599, 6647177, 5997046, 5433128, 4941508, 4510287, 4130012, 3793732, 3495678, 3230441, 2993575, 2781850, 2592412, 2422390, 2269573, 2132515, 2009649, 1899171, 1800158, 1712868, 1637442, 1572945, 1518106, 1472332, 1435731, 1408886, 1393142, 1390531, 1402466, 1427901, 1462236, 1497755, 1525998, 1540968, 1540398, 1523643, 1489034, 1434526, 1360874, 1272982]
57012A272982r5072r5480r0265q1063p0392o0482n1689m3297l5672l0209k7222
57001E92139k5362k3348k1139j9144j7417j5982j5050j4435j3476j1824r806p729
56989C97427n413k641M13L470O443R227J1537J2982J3117J1489Q011L263j933
56976D67392p121j1997j5934j8252j8920j8409j6939j4480j1380q332n556k666
56964C17406N06L565O228Q810J1735J4905J7855K0118K1128K0075J6370J0300
56952D69001L028m149j0524j6021k0561k3563k4345k3056k0750j8247j5290j1284
56940B84239o531k055J574M608P372R959J2833J6853K2127K7289L0428L0492K7467
56927D66655K1611J3127K635q514j8581k6112l0523l2250l2240l1049k8530k4593
$$ y = [1272982, 1177910, 1082430, 992165, 911102, 840710, 780228, 728539, 685242, 649570, 619361, 592139, 566777, 543429, 522290, 503146, 485729, 469747, 454697, 440262, 426786, 414962, 405156, 397427, 392014, 389373, 389786, 393256, 399699, 408926, 420463, 433445, 446562, 458051, 466062, 469325, 467392, 460271, 448274, 432340, 414088, 395168, 376759, 359820, 345340, 333960, 325628, 320072, 317406, 317912, 321477, 327705, 336515, 348250, 363155, 381010, 401128, 422256, 442331, 458701, 469001, 472029, 467880, 457356, 441335, 420774, 397211, 372866, 349810, 329060, 310813, 295523, 284239, 277708, 275653, 277227, 281835, 289207, 299166, 311999, 328852, 350979, 378268, 408696, 439188, 466655, 488266, 501393, 504028, 495514, 476933, 450821, 420298, 388048, 355808, 324759, 296229, 271636]
56915B71636k0023j6112j3527j1885j0446q877p187n411l704k503k163k383k382
56902A65033j718p00J64Q30J677K879M150N099N713O355P381Q775J0265J1790
56888B27693J3777J6623J9799K1798K1344J8584J4765J0788O417J071n002j0563
56876C57094j4303j5724j5189j3376j0738p429l596M52M423Q262J2088J6054K0437
56863C38455K5672L1919L8609M4580M8630M9708M6841L9457K8031J4069o77j4734
56851F90560k6659l4962l8849l8836l6207l1878k6057j8791j0482j790O730J4845
56839D47624K2703L0756L9551M9524O0639P1793Q0384Q3021P7385O3629M3999
56828A071008K1213k580k5671m6319o2711p3275p7142p4644o7443n7791m7398
$$ y = [271636, 251613, 235501, 221974, 210089, 199643, 190766, 183579, 178168, 174464, 171961, 169798, 167415, 165033, 163315, 162615, 162779, 163609, 165286, 168165, 172315, 177414, 183127, 189482, 196863, 205638, 215903, 227693, 241470, 258093, 277892, 299690, 321034, 339618, 354383, 365171, 371588, 372659, 367657, 357094, 342791, 327067, 311878, 298502, 287764, 280335, 276739, 277191, 281614, 289876, 301964, 318018, 338455, 364127, 396046, 434655, 479235, 527865, 577573, 624414, 663871, 691902, 705971, 705294, 690560, 663901, 628939, 590090, 551254, 515047, 483169, 457112, 438321, 427839, 426049, 432779, 447624, 470327, 501083, 540634, 590158, 650797, 722590, 802974, 885995, 963380, 1027009, 1071008, 1092221, 1089641, 1063970, 1017651, 954940, 881665, 804523, 729879, 662436, 604645, 557247]
56817E57247l6994k6892j7387q455N09J0083K0085K9934L9560M9134N7556O1921
56805G36301N9387M9614L4874J7848Nj7831l4260m7472n6343o0678o0576n6282
56793E64587m8808m0042l1725k4508j8140j2285o852j779L174Q379J4161K0457
56781D26619K6359L0143L0120K5777J8073Q614j428j1549k1238k9453l5088l7808
56769D29141l8091l6438l3050k8490k4021k0634j8047j5361j2524j0418r460q979
56757A73628q209p228o356n338l790k090j129j207j753k090k050j791j469j173
56743A27955q84m54J10L48k70j533k419k152j078k13p3l23m88n50o21m38L24J354
56725A18595J884J689J434J718K241K348K081K033K355K546K256J691J073L24
$$ y = [557247, 520253, 493361, 475974, 467519, 468028, 478111, 498196, 528130, 567690, 616824, 674380, 736301, 795688, 845302, 880176, 898024, 898029, 880198, 845938, 798466, 742123, 681445, 620869, 564587, 515779, 475737, 444012, 419504, 401364, 389079, 382227, 380448, 383622, 392001, 406162, 426619, 452978, 483121, 513241, 539018, 557091, 565705, 564277, 552728, 531490, 502037, 466949, 429141, 391050, 354612, 321562, 293072, 269051, 248417, 230370, 215009, 202485, 192067, 182607, 173628, 165419, 158191, 151835, 146497, 142707, 140617, 139488, 138281, 136528, 134438, 132388, 130597, 129128, 127955, 127071, 126617, 126727, 127075, 126805, 125272, 122853, 120701, 119623, 119410, 119337, 119014, 118526, 117976, 117355, 116917, 117241, 118595, 120479, 122168, 123602, 125320, 127561, 129909, 131990, 134023, 136378, 138924, 141180, 142871, 143944, 144268]
56711A44268m43p34k89M59R32J035R38O51K71K32P82J429J484R81N80O41Q99R80
56693A55096P74L07l23p98q34o32o76r79j017n22Q5L54M38P53J275J596J571J456
56675A57924J439J317P97q4r48j456j566j489j413j311j067o93l42j45j26k72
56659A50565m69m03K11J141J687J480J031J068J480J457P03j05l32k65m56p08
56643A58085l87L95P73L59k12k38J44M03L44O6l70p15m90L06Q29L80n96j175j315
56624A56586j682k310k398j649q35o69q38o32K3O19P93N10q6o65p96m21N0K90
56606A45890L36J48n22j391j435o2J793K595J987J014O28P44Q93J009J264J541
56590A56432J560J293R66P31N55L70J82P9J48L43M46L20J53L09R00J643K247K683
$$ y = [144268, 143825, 143091, 142802, 143261, 144193, 145228, 146166, 146817, 147088, 147320, 148102, 149531, 151015, 151996, 152576, 153217, 154116, 155096, 155870, 156177, 155854, 155056, 154222, 153590, 152914, 151935, 150918, 150396, 150481, 150835, 151273, 152026, 153301, 154897, 156468, 157924, 159363, 160680, 161477, 161393, 160445, 158989, 157423, 155934, 154521, 153210, 152143, 151450, 151108, 150963, 150837, 150565, 150096, 149693, 149904, 151045, 152732, 154212, 155243, 156311, 157791, 159248, 159951, 159846, 159514, 159249, 158793, 158085, 157698, 158093, 158866, 159225, 159013, 158775, 158919, 159322, 159666, 159732, 159362, 158647, 158157, 158463, 159292, 159672, 159076, 157901, 156586, 154904, 152594, 150196, 148547, 147712, 147043, 146205, 145573, 145596, 146215, 147008, 147518, 147432, 146767, 145971, 145550, 145600, 145890, 146226, 146374, 145852, 144461, 143026, 142964, 144757, 147352, 149339, 150353, 150981, 151725, 152618, 153627, 154891, 156432, 157992, 159285, 160251, 160982, 161537, 161907, 162089, 162168, 162316, 162659, 163105, 163425, 163578, 163887, 164787, 166430, 168677, 171360]
56572A71360K968K866K167J262J058K020L455M223M201M591O449R316J1712J2749
56558B40397J2669J1918J0438Q161N596L436J810L59j108k328k970l051l001l260
56544B79066l747l826l083k046j708k312l067l290l223l408l786l949l921m058
56530B33642m309m212l566k722k105j849j910k118k113j591p31j20j05m59q09
56515B04923j110j523j997k256k176j955j806j709j576j548j811k165k147j732
56501A79412j511j797j952j124N14J844K111J631J141R46R06P78M42J6j40J20
56485A83337L68J20m19o78o88r20j195p27N05J395J213N61L10L89L47L33O39Q58
56467A85748M34l21n77r2P22J456J778J265L5q48m65P23J543J675J650J561R85
$$ y = [171360, 174328, 177194, 179361, 180623, 181681, 183701, 187156, 191379, 195580, 200171, 206620, 215936, 227648, 240397, 253066, 264984, 275422, 283583, 289179, 292615, 294425, 294784, 293676, 291348, 288378, 285327, 282326, 279066, 275319, 271493, 268410, 266364, 264656, 262344, 259277, 255987, 252764, 249356, 245570, 241621, 237700, 233642, 229333, 225121, 221555, 218833, 216728, 214879, 212969, 210851, 208738, 207147, 206416, 206296, 206191, 205732, 204923, 203813, 202290, 200293, 198037, 195861, 193906, 192100, 190391, 188815, 187267, 185456, 183291, 181144, 179412, 177901, 176104, 174152, 173028, 173542, 175386, 177497, 179128, 180269, 181215, 182121, 182899, 183341, 183357, 183217, 183337, 183705, 183825, 183406, 182728, 182040, 181120, 179925, 179198, 179703, 181098, 182311, 182872, 183182, 183571, 183918, 184251, 184890, 185748, 186182, 185861, 185284, 185192, 185914, 187370, 189148, 190413, 190448, 189600, 189135, 189858, 191401, 193076, 194726, 196287, 197272]
56450A97272J57k0O52J239J044N13L81O10O98M88J39k67o88r25q20m70j21J3k26
56431A99669p26j011o57J05O08N61L20L07O03J068J440J359P06n1k88o1L0j75
56413B03807j70L39Q72R04O25N71P77P62K66l06l30L19J141J597J714J863K078
56396B16829J989J469R24O93O48O49Q45J146J014L30j42J18L63l25j391j390r0
56379B23679J223J651J710K088K435K046J110N27P56J361J540R85K16P7P40J386
56363B43530J254O40M08P05R16P35N44P02J117J605K051K235K050J875K084K298
56347B64749J830Q33J38L6K2j35j9N64J217J732K356L037L220K767K335K427K770
56330B89879K996L244L642L809L369K529J801J521J775K346K604K032R31M3m55
$$ y = [197272, 197429, 197409, 198061, 199300, 200344, 200857, 201238, 201848, 202546, 203034, 203173, 202906, 202218, 201293, 200473, 200003, 199882, 199895, 199669, 198943, 197932, 197275, 197380, 197988, 198549, 198869, 199176, 199779, 200847, 202287, 203646, 204352, 204301, 204013, 203952, 203982, 203807, 203637, 203976, 204848, 205752, 206377, 206948, 207725, 208487, 208753, 208447, 208117, 208436, 209577, 211174, 212888, 214751, 216829, 218818, 220287, 221211, 221904, 222552, 223201, 224046, 225192, 226206, 226536, 226394, 226512, 226875, 226550, 225159, 223769, 223679, 224902, 226553, 228263, 230351, 232786, 234832, 235942, 236469, 237225, 238586, 240126, 241111, 241327, 241404, 242144, 243530, 244784, 245424, 245832, 246537, 247453, 248188, 248732, 249434, 250551, 252156, 254207, 256442, 258492, 260367, 262451, 264749, 266579, 267412, 267550, 267586, 267608, 267473, 267454, 268018, 269235, 270967, 273323, 276360, 279580, 282347, 284682, 287109, 289879, 292875, 296119, 299761, 303570, 306939, 309468, 311269, 312790, 314565, 316911, 319515, 321547, 322478, 322521, 322066]
56315C22066q55r18n5J412K308K242K100K471K744K400K164K907M236N103N246
56300C55571N187N197N084M757M403M215M319M653M825M531M204M647N851O859
56286D24303P092O993P064P167P144P316P843Q349Q606Q916R417R866J0376J1433
56272E41885J2792J3496J3520J4147J5988J7897J8838J9548K1226K3586K5639
56261G38562K7558L0393L4446L9216M4479N0273N6204O1948O8091P5377Q3495
56250A310042R1551R9292J06873J13867J19664J24362J28175J30328J29670J25949
56240B479773J19439J09789R6623Q0784O3607M5196K4971L714j6567l4922n1999
56229B920408o7951q1456r1491r8781j04565j08931j11251j11538j10427j08176
$$ y = [322066, 321211, 320293, 320238, 321650, 323958, 326200, 328300, 330771, 333515, 335915, 338079, 340986, 345222, 350325, 355571, 360758, 365955, 371039, 375796, 380199, 384414, 388733, 393386, 398211, 402742, 406946, 411593, 417444, 424303, 431395, 438388, 445452, 452619, 459763, 467079, 474922, 483271, 491877, 500793, 510210, 520076, 530452, 541885, 554677, 568173, 581693, 595840, 611828, 629725, 648563, 668111, 689337, 712923, 738562, 766120, 796513, 830959, 870175, 914654, 964927, 1021131, 1083079, 1151170, 1226547, 1310042, 1401593, 1500885, 1607758, 1721625, 1841289, 1965651, 2093826, 2224154, 2353824, 2479773, 2599212, 2709001, 2805624, 2886408, 2950015, 2995211, 3020182, 3023896, 3007329, 2972407, 2920408, 2852457, 2771001, 2679510, 2580729, 2476164, 2367233, 2255982, 2144444, 2034017, 1925841]
56219A925841j04514r9377r3345q7265q1695p6653p1854o7130o2551n8055n3400
56208A070002m8637m4314m0816l7866l5049l2410l0031k7489k4365k1055j8391
56197G09579j6619j5263j3803j2069j0234q759q043p717o880n312l862l126k585
56184E95307j729j110j321j708j296l99r4m45n13J08R36J676K499L345L871M128
56168F03255M503N139O055P412Q944R690R241Q627Q917R526R261Q487Q675J0100
56154G17832J1594J2572J3718J5514J7557J9663K2360K5976L0260L5138M0883
56143I63067M7402N4360O1970P0598P9512Q7123R2412R5064R4407Q9711Q1763
56132A817389P2774O4397N6867N0129M4398L9356L4047K8011K1552J4681P008
$$ y = [1925841, 1821327, 1721950, 1628605, 1541340, 1459645, 1382992, 1311138, 1244008, 1181457, 1123402, 1070002, 1021365, 977051, 936235, 898369, 863320, 830910, 800879, 773390, 749025, 727970, 709579, 692960, 677697, 663894, 651825, 641591, 632832, 624789, 617072, 610192, 604880, 601018, 597892, 595307, 593578, 592468, 591147, 589439, 588143, 587744, 587650, 587205, 586692, 586800, 587736, 589412, 591911, 595256, 599127, 603255, 607758, 612897, 618952, 626364, 635308, 644998, 654239, 662866, 671783, 681309, 690570, 699057, 707732, 717832, 729426, 741998, 755716, 771230, 788787, 808450, 830810, 856786, 887046, 922184, 963067, 1010469, 1064829, 1126799, 1197397, 1276909, 1364032, 1456444, 1551508, 1645915, 1735626, 1817389, 1890163, 1954560, 2011427, 2061556, 2105954, 2145310, 2179357, 2207368, 2228920, 2243601, 2250609]
56121B250609j216r100j6496k4151l2369m0721m9294n8754o8696p7362q3467q7125
56109A701858q8551q7163q2718p6125o8414n9847n0735m1998l4320k7566k1629
56098A062792j6906j3391j0257o988m103k172q75M40J879L221M340N121N535N961
56084A034597O783P597P726P500P950R239J0488J1367J2495J3960J4810J4595
56072A159107J4282J4919J6312J7589J8318J8516J8260J7764J7299J6879J6454
56061A345699J6337J6723J7074J6821J6379J6432J6662J6415J6166J6917J8408
56050A530033J9537K0236K1304K2611K3304K3665K4820K6703K8226K9499L1698
56039A801636L4640L6748L7732L8975M0842M1940M1684M1414M2172M3406M4641
$$ y = [2250609, 2249393, 2240293, 2223797, 2199646, 2167277, 2126556, 2077262, 2018508, 1949812, 1872450, 1788983, 1701858, 1613307, 1526144, 1443426, 1367301, 1298887, 1239040, 1188305, 1146307, 1111987, 1084421, 1062792, 1045886, 1032495, 1022238, 1015250, 1011147, 1008975, 1008100, 1008540, 1010419, 1013640, 1017980, 1023101, 1028636, 1034597, 1041380, 1048977, 1056703, 1064203, 1072153, 1081392, 1091880, 1103247, 1115742, 1129702, 1144512, 1159107, 1173389, 1188308, 1204620, 1222209, 1240527, 1259043, 1277303, 1295067, 1312366, 1329245, 1345699, 1362036, 1378759, 1395833, 1412654, 1429033, 1445465, 1462127, 1478542, 1494708, 1511625, 1530033, 1549570, 1569806, 1591110, 1613721, 1637025, 1660690, 1685510, 1712213, 1740439, 1769938, 1801636, 1836276, 1873024, 1910756, 1949731, 1990573, 2032513, 2074197, 2115611, 2157783, 2201189, 2245830]
56028B245830M6244M7923M8551M8261M8607M9969N0969N1174N2074N4509N7484
56017B801595O0410O4125O8646P2361P4634P7027Q0716Q4876Q8601R2239R5854
56006C661084R8737J01421J05696J11687J17387J22018J27113J33458J39934J46398
55996D864933J54467J64203J73312J81078J89759K00624K12136K23585K36815
55987F600912K52575K68881K84997L03282L25139L48966L74051M02339M34350
55978I595492M67843N02735N42667N89358O40479O95583P58748Q32672R16127
55969A5541704J010348J121551J253883J407070J585053J799613K061489K376741
55961B8157452K756943L223904L799338M500917N353947O392521P640623R110070
$$ y = [2245830, 2292074, 2339997, 2388548, 2436809, 2485416, 2535385, 2586354, 2637528, 2689602, 2744111, 2801595, 2862005, 2926130, 2994776, 3067137, 3141771, 3218798, 3299514, 3384390, 3472991, 3565230, 3661084, 3759821, 3861242, 3966938, 4078625, 4196012, 4318030, 4445143, 4578601, 4718535, 4864933, 5019400, 5183603, 5356915, 5537993, 5727752, 5928376, 6140512, 6364097, 6600912, 6853487, 7122368, 7407365, 7710647, 8035786, 8384752, 8758803, 9161142, 9595492, 10063335, 10566070, 11108737, 11698095, 12338574, 13034157, 13792905, 14625577, 15541704, 16552052, 17673603, 18927486, 20334556, 21919609, 23719222, 25780711, 28157452, 30914395, 34138299, 37937637, 42438554, 47792501, 54185022, 61825645, 70935715]
55953G0935715J0834462J2897203J5419428J8529616K2305517K6605092L0805487
55946B08332520L3719417L3967514L0669962K3920716J4665918M180478o359104
55939C43097421j5975261k3844378k9343952l2190676l2517677l0812290k7756953
55932A50656234k4049395k0259397j6759324j3732002j1221284r187401p554083
55925D7893348o244145n194660m353145l672987l117618k662609k288758j977284
55917A8382142j714076j492544j307773j151892j018082r04251q08907p27262
55909I257355o54790n90871n35519m85858m39197l96599l60172l29222l01784
55900E163343k77551k56741k38201k20936k05495j92023j79107j66146j54542
$$ y = [70935715, 81770177, 94667380, 110086808, 128616424, 150921941, 177527033, 208332520, 242051937, 276019451, 306689413, 330610129, 345276047, 349456525, 343097421, 327122160, 303277782, 273933830, 241743154, 209225477, 178413187, 150656234, 126606839, 106347442, 89588118, 75856116, 64634832, 55447431, 47893348, 41649203, 36454543, 32101398, 28428411, 25310793, 22648184, 20359426, 18382142, 16668066, 15175522, 13867749, 12715857, 11697775, 10793524, 9984617, 9257355, 8602565, 8011694, 7476175, 6990317, 6551120, 6154521, 5794349, 5465127, 5163343, 4885792, 4629051, 4390850, 4169914, 3964419, 3772396, 3593289, 3427143, 3272601]
55891C272601j44967j35851j26187j17211j09707j02189r3644q5538p9170p3392
55881B204745o6890o0508n5431n1208m7503m5597m6227m7932m9379n1362n4511
55870A628197n7098n7283n5781n4211n2340m9138m5116m1569l8609l5768l3406
55859A107878l1894l0466k8455k6561k5487k4520k2853k1058j9858j8751j7282
55848H40693j6389j6906j7884j7854j6761j5365j3953j2854j2918j4078j4756
55837F70975j4007j2944j2723j2636j1716j0683j0494j0393r258p658o683n907
55825E45873m561l598m348n970o532o004n942o640o858o230n746n732n259l876
55811D68577k297r63N49K381L884M691N215N801O218O248O036N654M887L537J538
$$ y = [3272601, 3127634, 2991783, 2865596, 2748385, 2638678, 2536489, 2442845, 2357307, 2278137, 2204745, 2137855, 2077347, 2021916, 1970708, 1923205, 1877608, 1831381, 1783449, 1734070, 1682708, 1628197, 1571099, 1513816, 1458035, 1403824, 1351484, 1302346, 1257230, 1215661, 1177052, 1141284, 1107878, 1075984, 1045518, 1017063, 990502, 965015, 940495, 917642, 896584, 876726, 857975, 840693, 824304, 807398, 789514, 771660, 754899, 739534, 725581, 712727, 699809, 685731, 670975, 656968, 644024, 631301, 618665, 606949, 596266, 585772, 575379, 566121, 558463, 551780, 545873, 541312, 537714, 533366, 527396, 520864, 514860, 508918, 502278, 495420, 489190, 483444, 477712, 472453, 468577, 466280, 465317, 465866, 468247, 472131, 476822, 482037, 487838, 494056, 500304, 506340, 511994, 516881, 520418, 521956]
55796E21956j065l843o104p756r476j1500j2949j3058j2356j1680j0780r027o975
55783D05387n949o371p498q535r141r144q701q372q245p425n324k862j406j042
55769C15372r87j134j883k868l290l336l945n105n720n235m256l364k414j322
55755B70513n42l84n49o49o63p39j021j613k332k623k295k055k663l805m575m823
55739B39182n117n518n367m375l185k518k434k508k340j828j277j209j695k131
55725A97680k064j879k151k683k823k450j958j561j312j460k028k343j713m67
55711A70788M57O91M97j2p82j194n65P42J576J433Q72M77K06k12q76j749k502
55694A69847k489j523m66k43m97j54Q64J556J395R63Q03P31N89P88J683K958M019
$$ y = [521956, 520891, 517048, 510944, 503188, 493712, 482212, 469263, 456205, 443849, 432169, 421389, 412362, 405387, 399438, 393067, 385569, 377034, 367893, 358749, 350048, 341676, 333431, 326006, 320682, 317820, 316414, 315372, 314385, 313251, 311368, 308500, 305210, 301874, 297929, 292824, 287104, 281869, 277613, 274249, 271835, 270513, 269971, 269587, 269038, 268389, 267726, 266987, 265966, 264353, 262021, 259398, 257103, 255048, 252385, 248580, 244005, 239182, 234065, 228547, 223180, 218805, 215620, 213102, 210668, 208160, 205820, 203992, 202715, 201506, 199811, 197680, 195616, 193737, 191586, 188903, 186080, 183630, 181672, 180111, 178799, 177339, 175311, 172968, 171255, 170788, 171245, 171936, 172433, 172421, 171639, 170445, 169880, 170622, 172198, 173631, 174503, 174980, 175186, 174974, 174098, 172349, 169847, 167358, 165835, 165369, 165126, 164629, 164475, 165339, 166895, 168290, 169253, 170056, 170787, 171376, 172164, 173847, 176805, 180824]
55677A80824M449L998K787J562J104J182Q05l56j548k058j993j708j238o17j01
55662A87092K54P06J288J762K238L068M022M333L891L517L644L594K656J120m64
55647B22721k233m377o136o508n748n232n789o805p113o277m872l792l361l052
55633A51426k216j109p54j497k251j748j85J022R71Q2p86j246j261p94q6K49j32
55616A39685p73j008q51q74j293j724j827j692j433r73m06k07o54j381j863k012
55600A20714j939j482o16O8m8o26p61k38L26N77P91J034Q72K87K4M94J106J235
55582A21818J179J554K261K768L005L302L821M599N759P149Q163Q504Q701R275
55568A91858R823R610Q549O959M851K270j44j902l621o166r028j0646j0383r176
$$ y = [180824, 185273, 189271, 192058, 193620, 194724, 195906, 196711, 196355, 194807, 192749, 190756, 189048, 187810, 187193, 187092, 187346, 188052, 189340, 191102, 193340, 196408, 200430, 204763, 208654, 212171, 215815, 219409, 222065, 223185, 222721, 220488, 216111, 209975, 203467, 197719, 192487, 186698, 179893, 172780, 166503, 161631, 157839, 154478, 151426, 149210, 148101, 147347, 145850, 143599, 141851, 141666, 142688, 143659, 143741, 142955, 141709, 140448, 139654, 139568, 139817, 139685, 138912, 137904, 137053, 136179, 134886, 133162, 131335, 129643, 128210, 127237, 126831, 126624, 125970, 124589, 122726, 120714, 118775, 117293, 116677, 116745, 116697, 116071, 115310, 115072, 115398, 115975, 116766, 117800, 118672, 118959, 118983, 119477, 120583, 121818, 122997, 124551, 126812, 129580, 132585, 135887, 139708, 144307, 150066, 157215, 165378, 173882, 182583, 191858, 201681, 211291, 219840, 226799, 231650, 233920, 233776, 231874, 228253, 222087, 213059, 202413, 192030, 182854]
55554A82854q124p388o738o243n963n520m515l038j532m34Mj43m96p48r04r35
55538A30137n81M9J40p90j882j810o17K66j57j429k511k883k570j876j340j357
55522A10789j711j920k016k368k734k374j257l18k31o48r46j045j134j156j021
55507H9910q67p99o83m03l1L58O78O87K85j18j10L2k03n23j71O98J015L38n33
55488H9560q26p49p45o48j94L15N03N49Q23J268J548J501J111N02J02L18Q67J001
55470I6806N16r1n77j209j880j923j220n62m37l58OO0o37j420j523j260j243j120
55452H1928j99J162J907J699J045K85n47j121j009m41nK75P20J102Q56J38k73
55435H7522j44mj25j77l7o6l36l36J40N69M70Q9j12j21j09L3M42Q81J005Q62P63
$$ y = [182854, 174730, 167342, 160604, 154361, 148398, 142878, 138363, 135325, 133793, 133359, 133363, 133220, 132724, 131976, 131072, 130137, 129556, 129605, 129745, 128955, 127073, 125263, 124646, 124912, 124755, 123326, 120815, 117932, 115362, 113486, 112146, 110789, 109078, 107158, 105142, 102774, 100040, 97666, 96409, 96091, 95860, 95212, 94266, 93221, 92087, 90931, 89910, 89043, 88244, 87561, 87158, 87127, 87485, 88163, 88850, 89135, 89017, 88907, 88939, 88736, 88213, 88042, 88740, 89755, 90093, 89560, 88734, 87985, 87240, 86592, 86398, 86713, 87216, 87765, 88588, 89856, 91404, 92905, 94016, 94518, 94620, 94938, 95805, 96806, 97322, 97231, 96654, 95445, 93565, 91642, 90422, 89860, 89423, 89065, 89071, 89131, 88494, 87074, 85551, 84291, 83048, 81928, 81729, 82891, 84798, 86497, 87542, 87827, 87280, 86159, 85150, 84709, 84704, 84979, 85699, 86801, 87657, 87795, 87522, 87378, 87374, 87249, 87072, 87035, 86969, 86633, 86297, 86437, 87006, 87476, 87565, 87453, 87332, 87223, 87256, 87698, 88579, 89584, 90446, 91209]
55414I1209Q62J101J414J732J841J553R33K38l50q35j292j723j971j797j108j85
55398I1622M56M95K0o51j220j445j190o16j91k21m27k38M21R34P99L87M17Q26
55380I0178P28k72j335j394n23K29J51n75j402j867j611o46L05L78l62r66q78
55363H0138n66o16q41o72L1R30J566J546P81j47l35L56J053J060P28O83P55L78
55345H6828l04n88l24j41m94j074j308j089p56o50p80q63o77l45j26M6M12Q04
55327G8571P02J80J10R60J895J760O26l43l96J09M75M66K15j01l27l97m67o97
55309H3341r09p35j25O01J154J398J181M65l89q21o71k47K54R00J554J665R54
55292H9570J8j96M60J070P10m99j582j863j530j032m18L43Q17N22j55k52M53J009
$$ y = [91209, 92071, 93172, 94586, 96318, 98159, 99712, 100645, 100883, 100533, 99698, 98406, 96683, 94712, 92915, 91807, 91622, 92078, 92573, 92593, 91942, 90722, 89277, 88087, 87471, 87280, 87059, 86632, 86394, 86815, 87749, 88548, 88935, 89352, 90178, 90906, 90634, 89299, 87905, 87382, 87611, 87762, 87187, 85785, 83918, 82307, 81661, 81966, 82344, 81982, 81016, 80138, 79572, 78956, 78115, 77443, 77474, 78404, 79970, 81516, 82297, 82150, 81815, 82171, 83224, 84284, 85012, 85695, 86450, 86828, 86524, 85936, 85612, 85471, 84977, 83903, 82595, 81506, 80750, 80100, 79320, 78457, 77780, 77435, 77309, 77355, 77767, 78571, 79273, 79453, 79563, 80523, 82418, 84178, 84804, 84461, 84065, 84174, 84649, 85115, 85330, 85229, 84902, 84505, 84038, 83341, 82432, 81697, 81572, 82173, 83327, 84725, 85906, 86371, 85982, 85161, 84490, 84243, 84497, 85397, 86951, 88616, 89570, 89588, 89392, 89852, 90922, 91632, 91133, 89551, 87688, 86158, 85126, 84708, 85051, 85868, 86390, 86235, 85983, 86436, 87445]
55274H7445M98p88j763j740q70K27R25R09M59K36N68J136J457J408J065M70k29
55257I1413p50j032j250j311q59n4L34%l24L9O38O22Kn68q93j223j412j060l81
55238H1931p6k72l48N6N50O48L15k63r00j229q10L07J455J959J683R29J72j36
55220H5971J37O45R32Q77O04K06j26JO86J261R76L8o07m98j01Oj83l34k30J34
55200I0395N31N23q6q66j180j007r05j122j264q81MJ009J682J627Q46n0l36M0
55182H8960M59M51J09k44m28m09l10m11p49q61k78P54J495J612J417J244J149
55165I3960J180J410J594J297M49n05j116j228q73l10o2m16q99p75p6M03K13k40
55147I4006l60o0L44N55M29M2k73k46lJ55J45J0l20p10o58N6Q40J012P11M61K38
$$ y = [87445, 87943, 87155, 85392, 83652, 82782, 83009, 83934, 84843, 85302, 85538, 86106, 87242, 88699, 90107, 91172, 91642, 91413, 90663, 89631, 88381, 87070, 86211, 86157, 86491, 86491, 86167, 86206, 86844, 87466, 87468, 86900, 86007, 84784, 83372, 82312, 81931, 81855, 81583, 81235, 81291, 81841, 82489, 82804, 82541, 81641, 80412, 79602, 79909, 81364, 83323, 85006, 85935, 86107, 85971, 86108, 86753, 87685, 88562, 89166, 89372, 89246, 89247, 89933, 91194, 92170, 92208, 91601, 91103, 91002, 91008, 90825, 90491, 90261, 90395, 90926, 91449, 91363, 90497, 89317, 88310, 87405, 86283, 85019, 84138, 84142, 85151, 86833, 88460, 89306, 89256, 88920, 88960, 89419, 89870, 89979, 89735, 89307, 88898, 88588, 88177, 87428, 86567, 86289, 87043, 88538, 90150, 91567, 92811, 93960, 95140, 96550, 98144, 99441, 99890, 99385, 98269, 97041, 96168, 95858, 95796, 95380, 94481, 93706, 93630, 94033, 94246, 94006, 93646, 93586, 93930, 94485, 94914, 94956, 94683, 94437, 94434, 94589, 94734, 94744, 94424, 93714, 93056, 93112, 93952, 94964, 95675, 96136, 96374]
55126I6374j76l53J87Q00L94p91j353q09j80k18l71m3L43K46N4L53R85J455J677
55107I8574J736J528J156J015J068O95k40r41q18k50K68Q77J566J623P61m6K25
55090A08797J140J481Q94J6o32r84j074j020j097j161o01O04J404J110N31P17
55074A10125J263J060J36n65q41j240j580r96L94J297J045M01J72P3m42j143j501
55057A07658j462j221p48j37J71J7j04J88M08j66j313j969j503m72R1j49n76n13
55039I8200m4K28J00L6M90J345K144K440J833K21j631k415j627j37J040J859K453
55022A06535K139L23k013l099k497j339m74K80R26P81k34r30l47R18J642J556
55006A04167J185P77K65q5J18N89O13L5n48o25k10N20J453K232K272J477N86L60
$$ y = [96374, 96198, 95845, 96032, 96832, 97226, 96435, 95082, 94273, 94093, 93875, 93504, 93461, 93804, 94050, 94104, 94457, 95442, 96897, 98574, 100310, 101838, 102994, 104009, 105077, 105772, 105532, 104591, 103773, 103523, 103791, 104668, 106234, 107857, 108618, 108572, 108797, 109937, 111418, 112312, 112328, 111696, 110712, 109638, 108618, 107521, 106360, 105759, 106363, 107767, 108877, 109408, 110125, 111388, 112448, 112584, 112019, 111178, 109938, 108358, 107362, 107756, 109053, 110098, 110499, 110671, 110744, 110302, 109159, 107658, 106196, 104975, 104227, 104090, 104261, 104278, 104174, 104362, 104770, 104604, 103291, 101322, 99819, 99347, 99438, 99289, 98713, 98200, 98156, 98384, 98484, 98520, 99010, 100355, 102499, 104939, 106772, 106993, 105362, 102947, 101320, 101183, 102223, 104082, 106535, 108674, 108997, 106984, 103885, 101388, 100049, 99575, 99855, 100781, 101562, 101328, 100398, 100051, 100969, 102611, 104167, 105352, 106129, 106394, 106309, 106427, 107016, 107629, 107664, 107116, 106491, 106281, 106801, 108254, 110486, 112758, 114235, 114821, 115181]
54988A15181O01M29m02j047o91K25N13j80r35q80k78R8R4J15K54K44M4j06k10
54969A13069n01q57p94j44O71J092Q47M9p57p92J46J238J576J386J560K130K117
54952A22036J085r5n30m47n71r29r95n68L3M42M05k03j105j597j195j42R69J765
54934A18358K069J744J028O61J244K550L828M538M595M184L709L584L762L771
54920A59625L487L307L250K523O67j389k387k495l004m378n677o032n650n044
54906A36803m169k953j942j652j732j414o14P9K63Q1k27n37o36k61M65J109J494
54889A24157J910K619L373L678L359K754K420K734L595M483M862M662M192L630
54875A72428K814J626K46j133k533l869m683m655m222m147m528m701m222l400
$$ y = [115181, 115782, 116211, 115809, 114762, 114071, 114296, 114809, 114629, 113694, 112814, 112536, 112634, 112728, 112843, 113097, 113341, 113385, 113279, 113069, 112568, 111711, 110917, 110773, 111444, 112536, 113383, 113432, 112675, 111883, 112029, 113267, 114843, 116229, 117789, 119919, 122036, 123121, 123026, 122496, 122049, 121478, 120549, 119554, 118986, 119019, 119461, 119866, 119663, 118558, 116961, 115766, 115624, 116593, 118358, 120427, 122171, 123199, 123860, 125104, 127654, 131482, 136020, 140615, 144799, 148508, 152092, 155854, 159625, 163112, 166419, 169669, 172192, 172859, 171470, 169083, 166588, 163584, 159206, 153529, 147497, 141847, 136803, 132634, 129681, 127739, 126087, 124355, 122941, 122327, 122406, 122669, 122750, 122523, 121986, 121350, 121089, 121554, 122663, 124157, 126067, 128686, 132059, 135737, 139096, 141850, 144270, 147004, 150599, 155082, 159944, 164606, 168798, 172428, 175242, 176868, 177114, 175981, 173448, 169579, 164896, 160241, 156019, 151872, 147344, 142643, 138421, 135021]
54861A35021k676k036j358q57o94n05O0N33J22j047j839j526p24n33j147j785
54845A19009j855j637j670j868j650q10O6K46k96q78q95l57K91O08M13j37n48
54828A08032l78K21O20N13K68K81L77J77j69j66K79P41Q89Q36Q13Q95J006J055
54810A16290R35O28K73L4j0K63R51J760K028J483O45J03k44p18j034p01RL25J56
54791A23176J42M95O03J06m71n07j03L43P79J300J749J910J859J740J570J459
54775A36150J667K208K792L288L864M509M943N141N374N479M813L224J452J56
54761A85060p75j532j874j865k306l549m595m356l262k546k392k038j472j639
54747A50859k772l756l574k483j336n56j90k62o15q14o32k29K79R18J433J456
$$ y = [135021, 132345, 130309, 128951, 128094, 127400, 126895, 126955, 127488, 127610, 126563, 124724, 123198, 122474, 121941, 120794, 119009, 117154, 115517, 113847, 111979, 110329, 109519, 109585, 109831, 109535, 108657, 107762, 107405, 107696, 108304, 108717, 108580, 108032, 107654, 107875, 108495, 109008, 109276, 109557, 109934, 110111, 109942, 109776, 110055, 110796, 111685, 112521, 113334, 114229, 115235, 116290, 117225, 117853, 118126, 118160, 118150, 118413, 119364, 121124, 123152, 124635, 125280, 125383, 125139, 124421, 123387, 122686, 122695, 123020, 123176, 123318, 123813, 124416, 124522, 124051, 123544, 123441, 123784, 124563, 125863, 127612, 129522, 131381, 133121, 134691, 136150, 137817, 140025, 142817, 146105, 149969, 154478, 159421, 164562, 169936, 175415, 180228, 183452, 184904, 185060, 184285, 182753, 180879, 179014, 176708, 173159, 168564, 164208, 160946, 158400, 156008, 153970, 152498, 150859, 148087, 144331, 140757, 138274, 136938, 136382, 136192, 135930, 135315, 134501, 133869, 133640, 133919, 134837, 136270, 137726]
54731A37726J304J869L273M447M528M022L843L883L432K588K179K410K480J717
54717A79701L12j256k833m305n280n526n376n279n185m695l726k668j923j500
54703A30461j158p65m70m74o72o57k55J62J22k20k51J44L20j63q12r65q66j223
54685A22258j914j987j069j8K64o9l49m24m61k38N13J309J385Q95P11R36N80q08
54667A21514k124k027p37L11K93l32p69p72m69k8K77J24l79o52l18L16O76O41
54649A15545N73P16Q96Q50O17M80N56O40M87J75J6J62L93L72Rm51o17k91L02O64
54629A22094N27J52p6k03n06q35o58R7P85Q71O40O17P37N37k8m79m37oM02L37
54609A24568m06j381j626o71O80J180O47J31M55J222J505J033M01L55J106K140
$$ y = [137726, 139030, 140899, 144172, 148619, 153147, 157169, 161012, 164895, 168327, 170915, 173094, 175504, 177984, 179701, 180013, 178757, 175924, 171619, 166339, 160813, 155437, 150158, 144973, 140278, 136552, 133884, 131961, 130461, 129303, 128538, 128068, 127594, 126922, 126265, 126010, 126172, 126294, 126074, 125823, 125967, 126287, 126124, 125312, 124347, 123481, 122258, 120344, 118357, 117288, 117270, 117534, 117465, 117116, 116692, 116231, 115993, 116506, 117815, 119200, 120095, 120806, 121742, 122322, 121514, 119390, 117363, 116626, 116937, 117230, 116898, 116129, 115357, 114888, 114860, 115137, 115261, 114882, 114230, 113912, 114228, 114904, 115545, 116118, 116834, 117730, 118580, 119197, 119677, 120233, 120873, 121360, 121535, 121551, 121713, 122106, 122478, 122487, 122036, 121419, 121128, 121430, 122094, 122621, 122773, 122697, 122494, 121988, 121153, 120495, 120592, 121377, 122248, 122888, 123505, 124242, 124779, 124751, 124272, 123835, 123829, 124231, 124568, 124162, 122781, 121155, 120484, 121164, 122344, 122991, 123122, 123577, 124799, 126304, 127337, 127738, 128093, 129199, 131339]
54593A31339K503J639O3j057j143p46o79j051j414j556j603j542j145m45J19K42
54577A23524J61L13P47J096J093Q38N22J48l09o13m77K3N01P44Q29P92N63M21
54559A30916Q69J792K200J435K07k46J78M34p4p48q59m90m4N22J342J979J767
54542A41180O91n83j389j500j004k01M66O83N19K58P5l0j19l36p76j177j031k39
54524A35487N35N45j73q79r95n71k6L13M35O36J113J541J282L30m06j68O23R62
54506A40584O37K62J34j36p36j201j185j004j013j012p32m43m90o27m26k8J30
54489A32714J28M31J005J220Q23L61M17Q62J151J043P23N21P38J476K364K678
54473A48655K051R62K18J13L22N03O33P80Q89Q62O68L04j40m16l03J01M36M90
$$ y = [131339, 133842, 135481, 135544, 134487, 133344, 132598, 131919, 130868, 129454, 127898, 126295, 124753, 123608, 123163, 123282, 123524, 123685, 123998, 124745, 125841, 126934, 127772, 128294, 128442, 128133, 127520, 127043, 127066, 127567, 128311, 129140, 129932, 130495, 130916, 131785, 133577, 135777, 137212, 137419, 137173, 137351, 137785, 137711, 136963, 136104, 135614, 135570, 136092, 137434, 139413, 141180, 141871, 141288, 139899, 138399, 137395, 137194, 137660, 138343, 138862, 139120, 139195, 139165, 139046, 138710, 137934, 136757, 135726, 135487, 136022, 136567, 136394, 135515, 134520, 133949, 133923, 134236, 134671, 135307, 136420, 137961, 139243, 139573, 139167, 138999, 139622, 140584, 141221, 141483, 141617, 141481, 140745, 139544, 138359, 137355, 136342, 135330, 134598, 134155, 133665, 133038, 132612, 132584, 132714, 132842, 133273, 134278, 135498, 136321, 136682, 137099, 137961, 139112, 140155, 140878, 141399, 142137, 143613, 145977, 148655, 150706, 151668, 151886, 151999, 152321, 152824, 153457, 154237, 155126, 155988, 156656, 156960, 156820, 156404, 156101, 156202, 156638, 157128]
54455A57128K99r8p28j389j617j211o09m45q20j214j157p68n60p98j139r96k33
54438A43645O11R13O81M06K94L6m89p37j55R49J650J506R63N95M10J08k87m24
54420A50675j47K99N93O59N97M09l7p30j321j382q67k42J3o6k9M09J034J408J341
54401A52616J044Q35P91O81K71l05n56j10Q35J653J832J382P03J77j58n28j029
54384A60134j361j144m84k8k12o53n28M74J793K563K372J562R14J015J737K401
54368A70555K482K054J464Q55K73p8j20k63r13j738j936j279l42K91N24L20m68
54351A71681j556k122j750j079r58j370j637j411r23m59j49j61n79j108j317j130
54335A53972p50k91J54K97N0n2M68J114R14r6p72m96o4l82j034r21P9R59R57L69
$$ y = [157128, 157427, 157329, 156601, 155212, 153595, 152384, 151775, 151330, 150510, 149296, 148139, 147371, 146811, 146013, 144874, 143878, 143645, 144256, 145169, 145850, 146256, 146550, 146586, 146097, 145360, 145205, 146154, 147804, 149310, 150273, 150868, 151278, 151386, 151099, 150675, 150528, 150827, 151420, 152079, 152676, 153085, 153048, 152318, 150997, 149615, 148748, 148506, 148519, 148453, 148424, 148833, 149867, 151275, 152616, 153660, 154495, 155286, 155967, 156238, 155933, 155377, 155267, 156102, 157755, 159587, 160969, 161672, 161849, 161691, 161163, 160134, 158773, 157629, 157145, 157117, 156905, 156252, 155724, 156198, 157991, 160554, 162926, 164488, 165402, 166417, 168154, 170555, 173037, 175091, 176555, 177410, 177683, 177605, 177485, 177222, 176309, 174571, 172635, 171356, 171014, 171305, 171829, 172149, 171681, 170125, 168003, 166253, 165174, 164216, 162846, 161209, 159798, 158875, 158416, 158267, 158106, 157527, 156419, 155102, 153972, 153222, 152931, 153085, 153382, 153432, 153380, 153848, 154962, 155876, 155780, 155008, 154512, 154448, 154066, 153032, 152111, 152190, 153149, 154106, 154475]
54315A54475j15k61k93m56p99j186j358j130n94L6O69J246J482J076K11m80n36
54298A51987n4N87J085J203P90R5k57P0O04N72j99j096j447j140n18N3M29O25
54280A53389O49M18n1l97j37O78J270J020L59K52P93J029M21j90K68J486K116
54263A63373J660J105J373J937J609L01p94p69o3L11Q3k31k83k91m71o39o37p68
54245A66806j259j664j317m42n5n63j110p69J11M39j2l48J02R47J473J544J346
54228A65229P62l52j569k083j581m98M76R21P73K79j16k24l95j057j906k009r13
54211A55737O49J437R68j70j115j509j472j163o33pM18M13J12j15n5J64L20L34
54193A54313K48N6j99k91%O03J163J443J481J413J305J231J296J491J567J267
$$ y = [154475, 154360, 154099, 153806, 153350, 152551, 151365, 150007, 148877, 148283, 148319, 148988, 150234, 151716, 152792, 153003, 152523, 151987, 151933, 152520, 153605, 154808, 155598, 155693, 155436, 155506, 156110, 156682, 156483, 155387, 153940, 152800, 152282, 152335, 152764, 153389, 154038, 154456, 154405, 154008, 153871, 154549, 155819, 156839, 157198, 157450, 158243, 159272, 159693, 159503, 159771, 161257, 163373, 165033, 166138, 167511, 169448, 171057, 171358, 170564, 169795, 169732, 170043, 170126, 169895, 169612, 169321, 168850, 168211, 167574, 166806, 165547, 163883, 162566, 162124, 162069, 161506, 160396, 159627, 159738, 160177, 160165, 159817, 159919, 160866, 162339, 163883, 165229, 165991, 165639, 164070, 161987, 160406, 159908, 160384, 161305, 162078, 162357, 162241, 162017, 161622, 160565, 158659, 156650, 155737, 156386, 157823, 158791, 158621, 157506, 155997, 154525, 153362, 152729, 152722, 153140, 153553, 153665, 153550, 153495, 153659, 153979, 154313, 154561, 154617, 154418, 154127, 154127, 154730, 155893, 157336, 158817, 160230, 161535, 162766, 164062, 165553, 167120, 168387]
54177A68387N68l03r87j162q15m47o82j526k222k102j381p70n52m38k28n1P5L28
54159A55692N77L17m56q59k04Q67J046J30o61k97P61J350J178J022J453K034J972
54142A65922J193M15K57N44O50K97j84m44n68p73q90n64J05N60N55N03Q54J476
54124A69908J905J964J858J785J785J768J523Q68pn73o50o81r87j146p30l05q05
54107A77480k002k564j900j032j058j588j455m74M83Q84J075J311J146K14r32
54092A69588j346q31j27j9m87q56n83J65P48P91N72O16J079J735K430L133L567
54075A80175L204K034R95J132K311L198K724J238m6n31o47q69r55n25P1N2o55
54058A92906j257j124n32p7J53M54Q60J185J490K000K568K741K487K395K890L602
$$ y = [168387, 168955, 168652, 167665, 166503, 165688, 165241, 164559, 163033, 160811, 158709, 157328, 156558, 156006, 155568, 155340, 155289, 155364, 155692, 156269, 156586, 156130, 155271, 155067, 155934, 156980, 157110, 156449, 156152, 156913, 158263, 159441, 160463, 161916, 163950, 165922, 167115, 167530, 167787, 168331, 168981, 169278, 169094, 168650, 168082, 167309, 166419, 165855, 165960, 166520, 167075, 167578, 168432, 169908, 171813, 173777, 175635, 177420, 179205, 180973, 182496, 183364, 183357, 182784, 182134, 181453, 180466, 179320, 178590, 178285, 177480, 175478, 172914, 171014, 169982, 168924, 167336, 165881, 165407, 165890, 166774, 167849, 169160, 170306, 170520, 169588, 168242, 167411, 167284, 167265, 166778, 165922, 165339, 165504, 166252, 167043, 167615, 168231, 169310, 171045, 173475, 176608, 180175, 183379, 185413, 186408, 187540, 189851, 193049, 195773, 197011, 196965, 196434, 195787, 194918, 193963, 193438, 193509, 193561, 192906, 191649, 190525, 189993, 189916, 190069, 190523, 191383, 192568, 194058, 196058, 198626, 201367, 203854, 206249, 209139, 212741]
54042B12741L806L323K750K868L986N674P037P386O788N945N465N426N678O137
54028B85010O543O289N082L572K771K788K703J884Q75N83J000J253P37k86j257
54013C19547k008k772l674m460m637m073l347l334m188n064n138m574m058l695
53999B64525l116k446k279k566k419j409k07N54J253K396L487L708L188K631K027
53984B69327Q14q23k091k961m211n809o458n408l656k598k350k251k275k852l652
53969B22746l711k702j260n7O77Q08K75m30n18J05P11Q55J009J730K724L201K866
53952B29029K146J621J576J962K453K654K472K239K308K627K952L234L573L847
53938B64693L803L469L205L251L503L793M054M089L559K576J977K482L674M383
$$ y = [212741, 216547, 219870, 222620, 225488, 229474, 235148, 242185, 249571, 256359, 262304, 267769, 273195, 278873, 285010, 291553, 297842, 302924, 306496, 309267, 312055, 314758, 316642, 317517, 318100, 319100, 320353, 321090, 320804, 319547, 317539, 314767, 311093, 306633, 301996, 297923, 294576, 291242, 287054, 281990, 276852, 272278, 268220, 264525, 261409, 258963, 256684, 254118, 251699, 250290, 250083, 250637, 251890, 254286, 257773, 261481, 264669, 267300, 269327, 270141, 269318, 267227, 264266, 260055, 254246, 247788, 242380, 238724, 236126, 233776, 231525, 229250, 226398, 222746, 219035, 216333, 215073, 215016, 215693, 216501, 216776, 216346, 215828, 215933, 216644, 217499, 218508, 220238, 222962, 226163, 229029, 231175, 232796, 234372, 236334, 238787, 241441, 243913, 246152, 248460, 251087, 254039, 257273, 260846, 264693, 268496, 271965, 275170, 278421, 281924, 285717, 289771, 293860, 297419, 299995, 301972, 304454, 308128, 312511]
53924C12511M174L855M213M916N185N061N250N909O452O574O710P232P871Q274
53910C94187Q474Q466P879O606N248M386L760K753J377J34q62j912l002l675l810
53895D30009l855m171m574m744m764n027n831p082q255q697q272p651p602q039
53881C41445q161p496o394n464m951m762m675m412l855l340l354l868m303m294
53867B72116m092m004l899l573l255l366l911m461m624m303l579k570j437m41
53853B24601Q3n9o71j231j404j292j009l69N97J095L67j040j649r10Q5J38n33
53836B16799q57m14K90P06P09L86o1l02j75R9K90M70N98K86m38o02N83K266K626
53817B23259J196l65k91J258K717L179L112L237L512L480L131K913L033L199L235
$$ y = [312511, 316685, 320540, 324753, 329669, 334854, 339915, 345165, 351074, 357526, 364100, 370810, 378042, 385913, 394187, 402661, 411127, 419006, 425612, 430860, 435246, 439006, 441759, 443136, 443270, 442408, 440496, 437494, 433819, 430009, 426154, 421983, 417409, 412665, 407901, 402874, 397043, 389961, 381706, 373009, 364737, 357086, 349484, 341445, 333284, 325788, 319394, 313930, 308979, 304217, 299542, 295130, 291275, 287935, 284581, 280713, 276410, 272116, 268024, 264020, 260121, 256548, 253293, 249927, 246016, 241555, 236931, 232628, 229049, 226479, 225042, 224601, 224684, 224625, 223954, 222723, 221319, 220027, 219018, 218649, 219246, 220341, 220708, 219668, 218019, 217109, 217194, 217332, 216799, 215942, 215528, 215818, 216524, 217233, 217619, 217558, 217256, 217081, 217180, 217470, 217940, 218538, 218824, 218386, 217784, 218367, 220633, 223259, 224455, 224090, 223799, 225057, 227774, 230953, 234065, 237302, 240814, 244294, 247425, 250338, 253371, 256570, 259805]
53802B59805L549M590O008O874O854O538O465O397O014N694N844N867M760K703
53788C37962J048N80O47L90p6l05o19j686l299m481m745m593m648m898m950m644
53772C01683m093l510l194l460m242m934m869m035l132k826l047l081k432j474
53758B53354j088j641k580l042k736k041j473j245j267j266r78m24J1j2l51o19
53742B32602p59r72j173r74l53J67K55K60N64Q79O74P8k70j36J31K74L74M00J63
53723B32184q2L23J423K281K099J265P69R47J424J913K374K533K066J251P89Q71
53707B54430J069J249J850K993L973M134L725L405L335L209K851K294J577R72
53693B91066J027J814K417J954Q79M76J021J390P01m84j141j233j404j738j696
$$ y = [259805, 263354, 267944, 273952, 280826, 287680, 294218, 300683, 307080, 313094, 318788, 324632, 330499, 335259, 337962, 339010, 339590, 340237, 340627, 340551, 340246, 339627, 337941, 334642, 330161, 325416, 320823, 316175, 311277, 306327, 301683, 297590, 294080, 290886, 287426, 283184, 278250, 273381, 269346, 266214, 263388, 260341, 257260, 254828, 253354, 252266, 250625, 248045, 245003, 242267, 240226, 238753, 237508, 236241, 234975, 233997, 233573, 233584, 233572, 233221, 232602, 231843, 230871, 229698, 228724, 228371, 228538, 228793, 229053, 229617, 230496, 231170, 231248, 230978, 230842, 230973, 231247, 231621, 232021, 232184, 232102, 232425, 233848, 236129, 238228, 239493, 240262, 241209, 242633, 244546, 246920, 249453, 251519, 252770, 253559, 254430, 255499, 256748, 258598, 261591, 265564, 269698, 273423, 276828, 280163, 283372, 286223, 288517, 290094, 291066, 292093, 293907, 296324, 298278, 299157, 299633, 300654, 302044, 302745, 302261, 301120, 299887, 298483, 296745, 295049]
53678B95049j136n83l06P0P54J203Q42j0n24m61l03l45k65J90O77P36M94M30O77
53659B97189R39R65P24J94n96j326j594j393j018m87M08J414J732J019l2n14l91
53642B97233k63l01m7Q12J925K695K837K515K119J920J758J167Q3p82p38j05J59
53625C12987j31o1J036K537L311L156K865L082L675M184M311L911K958J798J043
53610C50662R98J367J765K227K919L537L518K887K398K589L020K838J892Q79M32
53595C83928N26Q14J058J081O81p5p37j001j121j432j714j504q94n34p48j121
53579C77207j123q19p26j203k074k735k608j711p81n58r03j016n92k78p11j598
53563C57771k061j661o72M14J186J331Q99M66N32P57L66o36j199n56P16J388J082
$$ y = [295049, 293913, 293330, 293024, 293094, 293848, 295051, 295893, 295883, 295359, 294898, 294595, 294250, 293985, 294175, 294852, 295588, 296082, 296512, 297189, 298128, 299093, 299817, 300011, 299415, 298089, 296495, 295102, 294084, 293597, 294005, 295419, 297151, 298170, 298138, 297624, 297233, 296970, 296669, 296622, 297434, 299359, 302054, 304891, 307406, 309525, 311445, 313203, 314370, 314453, 313671, 312933, 312828, 312987, 312856, 312795, 313831, 316368, 319679, 322835, 325700, 328782, 332457, 336641, 340952, 344863, 347821, 349619, 350662, 351660, 353027, 354792, 357019, 359938, 363475, 366993, 369880, 372278, 374867, 377887, 380725, 382617, 383496, 383928, 384454, 385268, 386326, 387407, 388088, 388013, 387276, 386275, 385154, 383722, 382008, 380504, 379610, 379076, 378328, 377207, 376084, 375265, 374539, 373336, 371262, 368527, 365919, 364208, 363427, 362869, 361966, 360950, 360358, 360080, 359369, 357771, 355710, 354049, 353377, 353791, 354977, 356308, 357207, 357673, 358205, 358962, 359328, 358692, 357493, 356937, 357653, 359041, 360123]
53546C60123N16M36Q51J370J844K294K594K612K528K683L138L632M067M691N632
53531C99011O479O671O245N913O278P196Q037Q430Q544Q801R491J0630J1998J3205
53517E16929J3968J4318J4523J4803J5241J5983J7218J8892K0575K1817K2491
53506G06758K2646K2245K1357K0417J9890J9665J9222J8518J8189J8587J9117
53495I26611J8987J8301J7771J7518J6942J5903J5286J5925J7391J8407J8234
53484A117276J7234J6226J5698J5648J5801J5891J5862J5798J5561J4771J3320
53473A289086J1650J0250R074P795O348M755K657k78l521n994p417q629j0339
53460A305437j2158j3266j3510j3296j2928j2573j2581j3161j3993j4649j5259
$$ y = [360123, 360639, 361075, 361926, 363296, 365140, 367434, 370028, 372640, 375168, 377851, 380989, 384621, 388688, 393379, 399011, 405490, 412161, 418406, 424319, 430597, 437793, 445830, 454260, 462804, 471605, 481096, 491726, 503724, 516929, 530897, 545215, 559738, 574541, 589782, 605765, 622983, 641875, 662450, 684267, 706758, 729404, 751649, 773006, 793423, 813313, 832978, 852200, 870718, 888907, 907494, 926611, 945598, 963899, 981670, 999188, 1016130, 1032033, 1047319, 1063244, 1080635, 1099042, 1117276, 1134510, 1150736, 1166434, 1182082, 1197883, 1213774, 1229636, 1245434, 1260995, 1275766, 1289086, 1300736, 1310986, 1320060, 1327855, 1334203, 1338958, 1341615, 1341337, 1337816, 1331822, 1324405, 1315776, 1305437, 1293279, 1280013, 1266503, 1253207, 1240279, 1227706, 1215125, 1201964, 1187971, 1173322, 1158063]
53449A158063j6143j7039j7407j7368j7588j8144j8246j7322j5745j4217j2989
53438I75855j1989j1172j0325q994p071n067l450k105p86L27J106J956L201M275
53424I25761M416L942M055N390P538J0001J2684J5224J6838J7354J7704J8728
53412A059635K0032K0747K0923K1364K2332K3252K3775K4407K5835K8076L0543
53401A320921L2591L3912L4660L5394L6733L8860M1394M3742M5479M6509M7046
53390A757241M7450M7918M8362M8658M8824M8804M8298M7116M5582M4153M2746
53379B275152M0820L8168L5168L2176K9085K5691K2200J9000J6058J2809Q736
53368B555063L952q78n350r941j5506k2076k8501l3610l7372m0496m3208m5106
$$ y = [1158063, 1141920, 1124881, 1107474, 1090106, 1072518, 1054374, 1036128, 1018806, 1003061, 988844, 975855, 963866, 952694, 942369, 933375, 926304, 921237, 917787, 915682, 914896, 915223, 916329, 918285, 921486, 925761, 930177, 934119, 938174, 943564, 951102, 961103, 973787, 989011, 1005849, 1023203, 1040907, 1059635, 1079667, 1100414, 1121337, 1142701, 1165033, 1188285, 1212060, 1236467, 1262302, 1290378, 1320921, 1353512, 1387424, 1422084, 1457478, 1494211, 1533071, 1574465, 1618207, 1663686, 1710195, 1757241, 1804691, 1852609, 1900971, 1949629, 1998453, 2047257, 2095555, 2142671, 2188253, 2232406, 2275152, 2315972, 2354140, 2389308, 2421484, 2450569, 2476260, 2498460, 2517460, 2533518, 2546327, 2555063, 2559015, 2558137, 2552787, 2542846, 2527340, 2505264, 2476763, 2443153, 2405781, 2365285, 2322077, 2276971]
53356B276971m6069m6574m7019m7338m7419m7308m6820m5521m3466m1386l9926
53345A778125l9044l8445l8074l7865l7505l6791l5921l5041l3965l2582l1074
53334A381818k9404k7163k4366k1830k0165j8908j7297j5491j4209j3523j2890
53323A166572j2245j2138j2767j3606j4066j3922j3022j1359r567q632q698q707
53311A027843p605n543l553k332j683r51K56J785L216M397N564O857Q004Q757
53297A045012R411J0483J2071J3981J6199J8690K0855K2005K2354K2799K3586
53286A237446K3956K3371K2320K1504K0860J9876J8399J6582J4429J1984R688
53275A440415P894O269M137J394j432l960o374q960j1551j3717j5264j6422j7552
$$ y = [2276971, 2230902, 2184328, 2137309, 2089971, 2042552, 1995244, 1948424, 1902903, 1859437, 1818051, 1778125, 1739081, 1700636, 1662562, 1624697, 1587192, 1550401, 1514480, 1479439, 1445474, 1412892, 1381818, 1352414, 1325251, 1300885, 1279055, 1258890, 1239982, 1222685, 1207194, 1192985, 1179462, 1166572, 1154327, 1142189, 1129422, 1115816, 1101750, 1087828, 1074806, 1063447, 1053880, 1045248, 1036550, 1027843, 1020238, 1014695, 1011142, 1008810, 1007127, 1006176, 1006432, 1008217, 1011433, 1015830, 1021394, 1028251, 1036255, 1045012, 1054423, 1064906, 1076977, 1090958, 1107157, 1125847, 1146702, 1168707, 1191061, 1213860, 1237446, 1261402, 1284773, 1307093, 1328597, 1349457, 1369333, 1387732, 1404314, 1418743, 1430727, 1440415, 1448309, 1454578, 1458715, 1460109, 1458677, 1454717, 1448343, 1439383, 1427832, 1414115, 1398851, 1382429, 1364877]
53262A364877j8781j9994k1084k2094k3072k3971k4822k5791k6778k7230k6719
53251A104541k5607k4726k4423k4322k4007k3487k2949k2503k2230k2095k1766
53240H46426k0969k0062j9680j9800j9738j9171j8428j7659j6534j5080j4001
53229F45304j3509j2669j0691q301o926o845p072o927o795p271q298r401j0253
53216E30346j0776j1038j1200j1339j1290j0893j0345j0018r986j0010r884r578
53204D03989r045q261p336o413n559n002n180o132p078p125o326n534n254n175
53190C14569m863m373m012l927m074m311m349l937l240k752k683k655k226j489
53176B65678j006j165j700j855j135OM11n63k195l047k440j012J01L42J8k32j39
$$ y = [1364877, 1346096, 1326102, 1305018, 1282924, 1259852, 1235881, 1211059, 1185268, 1158490, 1131260, 1104541, 1078934, 1054208, 1029785, 1005463, 981456, 957969, 935020, 912517, 890287, 868192, 846426, 825457, 805395, 785715, 765915, 746177, 727006, 708578, 690919, 674385, 659305, 645304, 631795, 619126, 608435, 600134, 593208, 586363, 579291, 572364, 565569, 558298, 550000, 540599, 530346, 519570, 508532, 497332, 485993, 474703, 463810, 453465, 443447, 433461, 423451, 413567, 403989, 394944, 386683, 379347, 372934, 367375, 362373, 357193, 351061, 343983, 336858, 330532, 324998, 319744, 314569, 309706, 305333, 301321, 297394, 293320, 289009, 284660, 280723, 277483, 274731, 272048, 269393, 267167, 265678, 264672, 263507, 261807, 259952, 258817, 258823, 259234, 258671, 256476, 253429, 250989, 249977, 250078, 250420, 250438, 250206, 250067]
53159B50067j29q23k128l034k683j414l22P6J65L27M16K59P3Rk28q48j426j355
53141B37002o74L2L80M95N87O59P09Q69J115J158Q31M84O16J210J675J667J502
53124B50317J584J648J178M27L54J290K329K459J875J599K022K491K230J161j95
53109B72769j194j436j042o41p22j017r48o29q17j743k644k768k324j988j900
53094B50956j725j432j340j394j114m10P1j91p90r66p35q00j316j478p01L50O17
53077B37602J47J1P05J465J414O66m8l84n22o94r94j421j774j810j703j907k363
53060B28390k369j653r17p22n17M04J521J753J166Q83J296J581J157N77N06O83
53044B33739N06j7m02m23k49j57l26o92p92j69R79J905K187K061J795J302N57
$$ y = [250067, 249938, 249115, 246987, 243953, 241270, 239856, 239534, 239610, 239775, 240102, 240518, 240777, 240850, 240859, 240631, 239783, 238357, 237002, 236328, 236360, 236740, 237235, 237822, 238481, 239190, 240059, 241174, 242332, 243163, 243647, 244263, 245473, 247148, 248815, 250317, 251901, 253549, 254727, 255154, 255508, 256798, 259127, 261586, 263461, 265060, 267082, 269573, 271803, 272964, 272769, 271575, 270139, 269097, 268456, 267734, 266717, 265769, 265140, 264323, 262580, 259936, 257168, 254844, 252856, 250956, 249231, 247799, 246459, 245065, 243951, 243541, 243612, 243421, 242631, 241665, 240930, 240130, 238814, 237336, 236635, 236985, 237602, 237749, 237760, 238465, 239930, 241344, 242010, 241962, 241578, 241056, 240362, 239368, 237947, 236173, 234363, 232660, 230753, 228390, 226021, 224368, 223451, 222729, 222212, 222616, 224137, 225890, 227056, 227939, 229235, 230816, 231973, 232550, 233056, 233739, 234245, 234228, 233826, 233403, 233154, 232997, 232671, 231979, 231187, 231018, 231997, 233902, 236089, 238150, 239945, 241247, 241804]
53027B41804j62o47r51j046p34j03L90M99L82J87p2j60J47M14j00j135j410k81
53009B37022J295K028J741J084N42M20J063K208K685J634k33j439j478j027p20
52994B46825m94q7N71J391K125K466K508K753L182K922J506p7n17L9L15j77p06
52977B64545o48j84M07J079J463J069K82J71R31J446R48J59Q6N00M84m5l33q3
52959B72277J55j25p79j420j882k099j914j328o75l72n07q06r95j038j024r70
52943B56498q68q34r27q37j70Q05J124K39j157j852j403l50O53J290J399J016
52927B54626O20O94R49O28l13r82p31k1K59j38p54j092r50m03K80Q16J146J269
52909B55903R64N7r90j362r61n93p97j105q83l36r6k51m07m60o08p22k84R41K493
$$ y = [241804, 241642, 240995, 240044, 238998, 238264, 238161, 238551, 239050, 239432, 239619, 239547, 239387, 239534, 239948, 239848, 238713, 237303, 237022, 238317, 240345, 242086, 243170, 243712, 244132, 245195, 247403, 250088, 251722, 251489, 250050, 248572, 247545, 246825, 246331, 246244, 246815, 248206, 250331, 252797, 255305, 258058, 261240, 264162, 265668, 265591, 265074, 265113, 265428, 265251, 264545, 263897, 263713, 264120, 265199, 266662, 267731, 268013, 268184, 269115, 270561, 271509, 271668, 271754, 272254, 272738, 272693, 272360, 272277, 272432, 272307, 271528, 270108, 268226, 266127, 264213, 262885, 262210, 261838, 261331, 260525, 259530, 258492, 257468, 256498, 255630, 254796, 253869, 253032, 252862, 253667, 254791, 255030, 253873, 252021, 250618, 250268, 250921, 252211, 253610, 254626, 255246, 255940, 256889, 257517, 257204, 256222, 255491, 255470, 255729, 255591, 254837, 253745, 252795, 252392, 252672, 253488, 254634, 255903, 256867, 256924, 255934, 254572, 253611, 253018, 252221, 251116, 250233, 249897, 249801, 249550, 249143, 248683, 248075, 247353, 247069, 248010, 250503]
52890B50503L529L378J977Q0j206j364q31k26L80J059J395R43J00k67J4L07L09
52873B60080N42J450K626L347L457L276K899K082P75n87j414j513j305j437k105
52858B72173k770k799k288j960k197k545k439j990j736j870k092k125j996j772
52844B41594j386q40l49j72l71q13j271j477j176l30P74J671J977J577O67l08
52828B39767r13j049r77r38q49n58k52l34q05j138r68n96n10o10l53M33J332J959
52810B32641K268K120J175l96j573j514o91l28q44j431j336q26n87o91o56k33
52794B27098L09N95M93J36j45k6M09O06K13l51l82J31M95L15l7p0J35J84j7k69
52774B29822m37n20n28n35p12j014j047n37J98O08N56L16P9n3K06J049J980K160
$$ y = [250503, 254032, 257410, 259387, 259467, 258261, 256897, 256066, 255840, 256220, 257279, 258674, 259617, 259717, 259450, 259464, 259771, 260080, 260622, 262072, 264698, 268045, 271502, 274778, 277677, 279759, 280534, 279947, 278533, 277020, 275715, 274278, 272173, 269403, 266604, 264316, 262356, 260159, 257614, 255175, 253185, 251449, 249579, 247487, 245362, 243366, 241594, 240208, 239368, 239019, 238847, 238476, 237663, 236392, 234915, 233739, 233409, 234183, 235854, 237831, 239408, 240075, 239767, 238854, 237805, 236828, 235890, 235041, 234483, 234231, 233897, 233092, 231954, 230986, 230390, 229880, 229270, 228917, 229350, 230682, 232641, 234909, 237029, 238204, 237808, 236235, 234721, 234030, 233702, 232858, 231427, 230091, 229265, 228678, 227987, 227331, 227098, 227407, 228002, 228495, 228631, 228486, 228460, 228869, 229475, 229688, 229337, 228955, 229086, 229581, 229896, 229859, 229789, 229924, 230108, 230091, 229822, 229385, 228865, 228337, 227802, 227090, 226076, 225029, 224492, 224690, 225298, 225854, 226170, 226249, 226196, 226402, 227451, 229431, 231591]
52756B31591J536J057J444K238K437J749P67J51Q2L42N79N27K69J85M17O63O53
52739B46687O54J026J588J834J681J474J325R94M65J12J72M17N49N17K79k87j038
52722B58449j513j538j512j817k141j870r43M6N83O91O36N16L16N9k37o27j116
52705B47982j501j470r21o4P35J200J231Q72L30j08k99m09o66r77j019p38m85
52688B43693m90n20k41K66O92R30J002P74J83m03n51l99m24n72k88M65R15N15
52670B45547k55n56k32K77O85R70R82N47m7j66M75J515K400K835K844K600K298
52653B62719K046J763J311O85n8q39j473j648j269o73k78j54j08q3j81m00o11
52636B60749p30o80l14L19Q41J045J313K027K715K444J174m3m40m28p20j192j293
$$ y = [231591, 233127, 234184, 235628, 237866, 240303, 242052, 242819, 242970, 243052, 243394, 243973, 244500, 244769, 244954, 245371, 246034, 246687, 247341, 248367, 249955, 251789, 253470, 254944, 256269, 257263, 257728, 257840, 258012, 258429, 258978, 259495, 259774, 259487, 258449, 256936, 255398, 253886, 252069, 249928, 248058, 247115, 247161, 247744, 248435, 249071, 249587, 249903, 249962, 249725, 249098, 247982, 246481, 245011, 244090, 244026, 244761, 245961, 247192, 248064, 248394, 248286, 247987, 247578, 246912, 245935, 244916, 244178, 243693, 243203, 242683, 242442, 242708, 243400, 244330, 245332, 246106, 246289, 245886, 245335, 244936, 244512, 243940, 243652, 244117, 245032, 245547, 245292, 244736, 244504, 244781, 245466, 246436, 247418, 247965, 247918, 247752, 248227, 249742, 252142, 254977, 257821, 260421, 262719, 264765, 266528, 267839, 268524, 268466, 267627, 266154, 264506, 263237, 262564, 262286, 262132, 262024, 261941, 261760, 261360, 260749, 260019, 259339, 259025, 259344, 260185, 261230, 262543, 264570, 267285, 269729, 270903, 270860, 270420, 269992, 269272, 268080, 266787]
52619B66787j089j087j218q50J16R22R91O22L79K71ql91n51m16j65J79O17Q05
52601B65914L42m90q63l84M20Q60Q49O29J83n76j257j249n12K85N69M23K68L34
52583B65745O18J037J405J401R14K96M7K28L97J91j51n9O41J407J560J045M08
52566B77130l2n96j574k488k521j603n69j00jK47O32P65O56P27J025Q93k39j916
52548B70436k937k617j509p15n98n66j05M84N99K51k1M8K15K54K50K97L61N40
52530B64667J045J732K093J848J305Q94P11O97Q34R45P99O91J354K831L920L481
52514B89847J997J074J441K270K490K014J443J182J209J266Q78m14k387l969m189
52499B96152l247k286k134k578k856k574j968j426j046o94l53j98l21n50o18m17
$$ y = [266787, 265698, 264611, 263393, 262543, 262659, 263581, 264572, 265194, 265573, 265844, 265836, 265445, 264894, 264478, 264313, 264492, 265109, 265914, 266256, 265766, 264903, 264519, 264939, 265799, 266648, 267277, 267460, 266884, 265627, 264378, 263866, 264151, 264720, 265143, 265411, 265745, 266363, 267400, 268805, 270206, 271120, 271416, 271463, 271691, 272088, 272279, 272128, 272069, 272710, 274117, 275677, 276722, 277130, 277098, 276502, 274928, 272440, 269919, 268316, 267747, 267647, 267646, 267893, 268525, 269290, 269946, 270673, 271698, 272591, 272352, 270436, 267499, 264882, 263373, 262658, 262060, 261494, 261389, 261873, 262472, 262723, 262702, 262750, 262965, 263219, 263469, 263766, 264127, 264667, 265712, 267444, 269537, 271385, 272690, 273584, 274295, 274992, 275826, 276771, 277570, 278261, 279615, 282446, 286366, 289847, 291844, 292918, 294359, 296629, 299119, 301133, 302576, 303758, 304967, 306233, 307111, 306697, 304310, 300341, 296152, 292905, 290619, 288485, 285907, 283051, 280477, 278509, 277083, 276037, 275343, 274990, 274792, 274471, 273921, 273303, 272886]
52483B72886M2P16J450J938J982J696J309Q91N28N17J065J806K099J827J556J824
52467B94132K542L200L362K861J892J043Q84J291J442P43n24j697k559l277l815
52452C01520l890l542l171k919k403j385m11l39j265k235k280j467o61l33q4N13
52436B75648R74M25j062k240k074r40p9j00m97n66k76q3k10l82j84M76J271J755
52418B71856J790J721K017K731L379L452K990K577K788L719M983O118O937P496
52404C24554P782P540O504M778K810R84o33k081l272m135m786n322n525n135m368
52389C19695l731l307k632j504m35M4J46M47R70J289J321J436J695J683J292J107
52373C19516J654K729L755M469M852M770M108L105K153J417Q41L77m7n44r60q95
$$ y = [272886, 272928, 273644, 275094, 277032, 279014, 280710, 282019, 282910, 283438, 283955, 285020, 286826, 288925, 290752, 292308, 294132, 296674, 299874, 303236, 306097, 307989, 309032, 309916, 311207, 312649, 313392, 312868, 311171, 308612, 305335, 301520, 297630, 294088, 290917, 287998, 285595, 284210, 283799, 283460, 282195, 279960, 277680, 276213, 275552, 275219, 275135, 275648, 276622, 277047, 275985, 273745, 271671, 270731, 270652, 270552, 270055, 269489, 269213, 269130, 268920, 268538, 268354, 268830, 270101, 271856, 273646, 275367, 277384, 280115, 283494, 286946, 289936, 292513, 295301, 299020, 304003, 310121, 317058, 324554, 332336, 339876, 346380, 351158, 353968, 354952, 354319, 352238, 348966, 344831, 340045, 334723, 329198, 324063, 319695, 315964, 312657, 310025, 308521, 308086, 308130, 308276, 308723, 309693, 310982, 312303, 313739, 315434, 317117, 318409, 319516, 321170, 323899, 327654, 332123, 336975, 341745, 345853, 348958, 351111, 352528, 353369, 353746, 353699, 353155, 352195, 351300]
52357C51300l59Jk44n80k96L45M48q3l50J55Q10Q85O75R90J908K645K611K128
52339C62989K002K631L657M428M694M723M811M981N276N982P191Q452R300R894
52325D41011J0586J1181J1325J1413J2085J2913J2644J1154R950J0143J0968J1239
52313E76612J1222J1966J3341J4276J4611J5288J6620J7733J8111J8394J9123
52302G47297J9726J9579J9113J8974J8694J7309J4892J2441J0353Q122N621L662
52290I15783K757K142P10j509l409m158l884l204k624k451k748l184l220k736
52276H88265k187j982j887j377m40L53O16O52J037J945L058M095N075O102P145
52261I10470Q170R297J0571J1744J2518J3007J3687J4752J5874J6668J7105J7137
$$ y = [351300, 350941, 350942, 350698, 350118, 349822, 350167, 350615, 350532, 350182, 350337, 351147, 352032, 352707, 353697, 355605, 358250, 360861, 362989, 364991, 367622, 371279, 375707, 380401, 385124, 389935, 394916, 400192, 406174, 413365, 421817, 431117, 441011, 451597, 462778, 474103, 485516, 497601, 510514, 523158, 534312, 544262, 554405, 565373, 576612, 587834, 599800, 613141, 627417, 642028, 657316, 673936, 691669, 709780, 728174, 747297, 767023, 786602, 805715, 824689, 843383, 860692, 875584, 888025, 898378, 906500, 912121, 915783, 918540, 920682, 921392, 919883, 916474, 912316, 908432, 905228, 902604, 900153, 897405, 894221, 891001, 888265, 886078, 884096, 882209, 880832, 880392, 880745, 881361, 882013, 883050, 884995, 888053, 892148, 897223, 903325, 910470, 918640, 927937, 938508, 950252, 962770, 975777, 989464, 1004216, 1020090, 1036758, 1053863, 1071000]
52249A071000J6267J4049J0959Q189O400N099L461J382o25k129k995l238l152
52236A124667l464m733o565p854p948p300o843p015p548p966q003p660p106o572
52222A028090o247o136n969n350m207l044k464k388k063j048K25J110J560J860
52208I93929J927J574J236J692K984M231M705M628M693N289O353P542Q363Q486
52194A057632Q132P827P641P075N811M116K362O07j163k773m147n407o523p195
52180A073995p294p058o675o132n633n526n608n206m309l872m409m999m444k871
52166I99959j279j0J330K673L271K776J697O73n6l48n3N76R38P25J78l68p15o04
52148A011363J23J101J702J739J442P30o96k453l426l026j926j092o29L1J153
$$ y = [1071000, 1087267, 1101316, 1112275, 1120464, 1126864, 1131963, 1135424, 1136806, 1136181, 1134052, 1131057, 1127819, 1124667, 1121203, 1116470, 1109905, 1102051, 1094103, 1086803, 1079960, 1072945, 1065397, 1057431, 1049428, 1041768, 1034662, 1028090, 1021843, 1015707, 1009738, 1004388, 1000181, 997137, 994673, 992285, 990222, 989174, 989399, 990509, 992069, 993929, 995856, 997430, 998666, 1000358, 1003342, 1007573, 1012278, 1016906, 1021599, 1026888, 1033241, 1040783, 1049146, 1057632, 1065764, 1073591, 1081232, 1088307, 1094118, 1098234, 1100596, 1101203, 1100040, 1097267, 1093120, 1087713, 1081190, 1073995, 1066701, 1059643, 1052968, 1046836, 1041203, 1035677, 1030069, 1024863, 1020554, 1016682, 1012273, 1007274, 1002830, 999959, 998680, 998670, 1000000, 1002673, 1005944, 1008720, 1010417, 1011090, 1011034, 1010686, 1010633, 1011209, 1012147, 1012872, 1013050, 1012682, 1011967, 1011363, 1011486, 1012587, 1014289, 1016028, 1017470, 1018200, 1017504, 1015051, 1011625, 1008599, 1006673, 1005581, 1004952, 1004983, 1006136]
52133A006136K474L653M584N379O305P533Q804R666J0274J1497J3864J6681J8552
52120A125402J8695J7557J6314J6032J6953J8301J8936J8454J7444J6563J5776
$$ y = [1006136, 1008610, 1012263, 1016847, 1022226, 1028531, 1036064, 1044868, 1054534, 1064808, 1076305, 1090169, 1106850, 1125402, 1144097, 1161654, 1177968, 1194000, 1210953, 1229254, 1248190, 1266644, 1284088, 1300651, 1316427]
$$ [...]
##END NTUPLES=NMR SPECTRUM
##END=
