##TITLE=AC1730_SEN00003_9275787_UknHwYGCLf
##JCAMPDX= 6.0         $$ Bruker NMR JCAMP-DX V2.0
##DATA TYPE= NMR SPECTRUM
##DATA CLASS= NTUPLES
##ORIGIN= BRUKER
##OWNER= Administrator
$$ 1.72 TOPSPIN		Version 2.1
$$ 2015-07-14 19:34:44.057 -0700  Administrator@X
$$ Compression mode = diff/dup
##.OBSERVE FREQUENCY= 400.02188249412
##.OBSERVE NUCLEUS= ^1H
##.ACQUISITION MODE= SIMULTANEOUS (DQD)
##.ACQUISITION SCHEME= undefined
##.AVERAGES= 8
##.DIGITISER RES= 22
##SPECTROMETER/DATA SYSTEM= spect
##.PULSE SEQUENCE= zg30
##.SOLVENT NAME= COFFEE_meoh
##.SHIFT REFERENCE= INTERNAL, COFFEE_meoh, 1, 14.98509
##AUDIT TRAIL= $$ (NUMBER, WHEN, WHO, WHERE, PROCESS, VERSION, WHAT)
$$ ##TITLE= Audit trail, TOPSPIN		Version 2.1
$$ ##JCAMPDX= 5.01
$$ ##ORIGIN= Bruker BioSpin GmbH
$$ ##OWNER= Administrator
$$ $$ E:\/data/COFFEE/nmr/AC1730_SEN00003_9275787_UknHwYGCLf/10/pdata/1/auditp.txt
$$ ##AUDIT TRAIL=  $$ (NUMBER, WHEN, WHO, WHERE, PROCESS, VERSION, WHAT)
(   1,<2015-07-14 19:34:36.650 -0700>,<Administrator>,<X>,<go>,<TOPSPIN 2.1>,
      <created by zg
	started at 2015-07-14 19:33:30.869 -0700,
	POWCHK enabled, PULCHK disabled,
       configuration hash MD5:
       21 0F 79 D6 B3 7B B4 F6 88 20 88 DB 03 48 BD 9F
       data hash MD5: 64K
       45 BA BA EC 83 C4 AB FB 2C FB 64 96 49 72 8E 81>)
(   2,<2015-07-14 19:34:39.994 -0700>,<Administrator>,<X>,<proc1d>,<TOPSPIN 2.1>,
      <Start of raw data processing
       efp LB = 0 FT_mod = 6 PKNL = 1 PHC0 = 0 PHC1 = 0 SI = 32K 
       data hash MD5: 32K
       6D 92 54 23 9D D9 F1 F4 60 B0 E3 60 EA 7A 1A B5>)
(   3,<2015-07-14 19:34:40.400 -0700>,<Administrator>,<X>,<proc1d>,<TOPSPIN 2.1>,
      <pk PHC0 = 90.81848 PHC1 = 0 
       data hash MD5: 32K
       F7 79 93 1D 70 4F 9F D2 D1 57 4D 3B 60 97 EF 0E>)
(   4,<2015-07-14 19:34:40.510 -0700>,<Administrator>,<X>,<proc1d>,<TOPSPIN 2.1>,
      <abs ABSG = 1 
       data hash MD5: 32K
       B6 F3 8C 0B A7 DE A9 B6 CC EC BD 10 A3 B4 91 97>)
(   5,<2015-07-14 19:34:40.572 -0700>,<Administrator>,<X>,<proc1d>,<TOPSPIN 2.1>,
      <abs ABSG = 2 
       data hash MD5: 32K
       68 6A 2C 83 8E 89 01 BE 7A 11 64 A9 B2 FF 2B 7A>)
(   6,<2015-07-14 19:34:40.635 -0700>,<Administrator>,<X>,<proc1d>,<TOPSPIN 2.1>,
      <abs ABSG = 3 
       data hash MD5: 32K
       99 C3 20 1B CE D3 4E F1 4E 8F AE 88 92 1D 44 9E>)
(   7,<2015-07-14 19:34:40.697 -0700>,<Administrator>,<X>,<proc1d>,<TOPSPIN 2.1>,
      <abs ABSG = 4 
       data hash MD5: 32K
       FB 6C 44 19 03 96 E7 FB 15 EC 3D 50 E6 D7 6E FC>)
(   8,<2015-07-14 19:34:40.760 -0700>,<Administrator>,<X>,<proc1d>,<TOPSPIN 2.1>,
      <abs ABSG = 5 
       data hash MD5: 32K
       6E DF 47 A7 87 FD F9 6B 85 55 8F C1 35 CB DB 72>)
$$ ##END=
$$ 
$$ $$ hash MD5
$$ $$ E8 4E 37 F5 0B F1 07 F3 83 D2 51 A6 B6 07 B7 F3
##$RELAX= 
##$RELAX= 
##$RELAX= 
##$RELAX= 
##$RELAX= 
##$RELAX= 
##$RELAX= 
$$ Bruker specific parameters
$$ --------------------------
##$DU= <E:\>
##$EXPNO= 10
##$NAME= <AC1730_SEN00003_9275787_UknHwYGCLf>
$$ [...]
150 150 150 150 150 150 150 150
##$TP07= 0
##$TPNAME0= <>
##$TPNAME1= <>
##$TPNAME2= <>
##$TPNAME3= <>
##$TPNAME4= <>
##$TPNAME5= <>
##$TPNAME6= <>
##$TPNAME7= <>
##$TPOAL= (0..7)
0.5 0.5 0.5 0.5 0.5 0.5 0.5 0.5
##$TPOFFS= (0..7)
0 0 0 0 0 0 0 0
##$TUNHIN= 0
##$TUNHOUT= 0
##$TUNXOUT= 0
##$USERA1= <user>
##$USERA2= <user>
##$USERA3= <user>
##$USERA4= <user>
##$USERA5= <user>
##$V9= 5
##$VALIST= <valist>
##$VCLIST= <CCCCCCCCCCCCCCC>
##$VD= 0
##$VDLIST= <DDDDDDDDDDDDDDD>
##$VPLIST= <PPPPPPPPPPPPPPP>
##$VTLIST= <TTTTTTTTTTTTTTT>
##$WBST= 2048
##$WBSW= 25
##$XGAIN= (0..3)
0 0 0 0
##$XL= 0
##$YL= 0
##$YMAX_a= 610578
##$YMIN_a= -524900
##$ZGOPTNS= <>
##$ZL1= 120
##$ZL2= 120
##$ZL3= 120
##$ZL4= 120
##$ABSF1= 14.98509
##$ABSF2= -5.573092
##$ABSG= 5
##$ABSL= 3
##$ALPHA= 0
##$AQORDER= 0
##$ASSFAC= 0
##$ASSFACI= 0
##$ASSFACX= 0
##$ASSWID= 0
##$AUNMP= <proc_prof1d_extract_pilot.lims>
##$AXLEFT= 0
##$AXNAME= <>
##$AXNUC= <1H>
##$AXRIGHT= 0
##$AXTYPE= 0
##$AXUNIT= <>
##$AZFE= 0.1
##$AZFW= 0.1
##$BCFW= 0
##$BC_mod= 0
##$BYTORDP= 0
##$COROFFS= 0
##$CY= 15
##$DATMOD= 1
##$DC= 0
##$DFILT= <>
##$DTYPP= 0
##$F1P= 0
##$F2P= 0
##$FCOR= 0.5
##$FTSIZE= 32768
##$FT_mod= 6
##$GAMMA= 0
##$GB= 0
##$INTBC= 1
##$INTSCL= 1
##$ISEN= 128
##$LB= 0
##$LEV0= 0
##$LPBIN= 0
##$MAXI= 10000
##$MC2= 0
##$MEAN= 0
##$ME_mod= 0
##$MI= 0
##$NCOEF= 0
##$NC_proc= -8
##$NLEV= 6
##$NOISF1= 0
##$NOISF2= 0
##$NSP= 0
##$NTH_PI= 0
##$NZP= 0
##$OFFSET= 14.98509
##$PC= 1
##$PHC0= 90.81848
##$PHC1= 0
##$PH_mod= 1
##$PKNL= yes
##$PPARMOD= 0
##$PPDIAG= 0
##$PPIPTYP= 0
##$PPMPNUM= 2147483647
##$PPRESOL= 1
##$PSCAL= 4
##$PSIGN= 0
##$PYNMP= <proc.py>
##$REVERSE= no
##$SF= 400.02
##$SI= 32768
##$SIGF1= 0
##$SIGF2= 0
##$SINO= 400
##$SIOLD= 32768
##$SPECTYP= <>
##$SREGLST= <1H.CDCl3>
##$SSB= 0
##$STSI= 32768
##$STSR= 0
##$SW_p= 8223.68421052631
##$SYMM= 0
##$S_DEV= 0
##$TDeff= 65536
##$TDoff= 0
##$TI= <>
##$TILT= no
##$TM1= 0
##$TM2= 0
##$TOPLEV= 0
##$USERP1= <user>
##$USERP2= <user>
##$USERP3= <user>
##$USERP4= <user>
##$USERP5= <user>
##$WDW= 1
##$XDIM= 32768
##$YMAX_p= 441862783
##$YMIN_p= -701281
##$CURPLOT= <Network HP LaserJet P1505>
##$CURPRIN= <$Network HP LaserJet P1505>
##$DFORMAT= <normdp>
##$LAYOUT= <+/1D_H.xwp>
##$LFORMAT= <normlp>
##$PFORMAT= <normpl>
##$SURQMSG= 1
$$ End of Bruker specific parameters
$$ ---------------------------------
##NTUPLES= NMR SPECTRUM
##VAR_NAME=  FREQUENCY,     SPECTRUM/REAL,   SPECTRUM/IMAG
##SYMBOL=    X,             R,               I
##VAR_TYPE=  INDEPENDENT,   DEPENDENT,       DEPENDENT
##VAR_FORM=  AFFN,          ASDF,            ASDF
##VAR_DIM=   32768,         32768,           32768
##UNITS=     HZ,            ARBITRARY UNITS, ARBITRARY UNITS
##FACTOR=    0.250966925370066, 1,           1
##FIRST=     8223.43324360094, -114920,      -128106
##LAST=      0,             19735,           -177139
##MIN=       0,             -701281,         0
##MAX=       8223.43324360094, 441862783,    0
$$ Real data points
##PAGE= N=1
##DATA TABLE= (X++(R..R)), XYDATA
$$ [...]
19549c66004C9179J0667c39384J58291l81510H9844K14129b4003k54449m3474
19539c21926J32338e6484d312o8000j52356C1695b01701E7472K10430g2400b7811
19527F3435a05200o5228J7896j90945a46396F5093g2431I7053b71724E4194a66509
19515b0311j80459O5479C0424c11777K1832O3851O6113E9198L22651I1402b21480
19503F956d3346j53048N0323a2059j51594F1110a57073B21425a59306A38135i813
19491a41372i974G9041a18371k48648J39209C10450E6781a35349A80357a14869
19480A67734e2101E5519a6119B5791O9669D1224b6739j10913j60728A19430a06956
19468a93888f608C8918d21420i8319j28004A87096A5490g4237j01159h3371k03851
$$ plain form
19549 -366004 39179 49846 -339384 -181093 -562603 89844 303973 -24003 -278452 -321926
19539 -321926 -189588 -56484 -4312 -72312 -224668 31695 -201701 57472 267902 -72400 -27811
19527 63435 -105200 -170428 -152532 -343477 -146396 65093 -72431 97053 -271724 54194 -166509
19515 -20311 -200770 -135291 30424 -311777 -289945 -226094 -159981 59198 381849 91402 -221480
19503 6956 -43346 -196394 -146071 -12059 -163653 61110 -157073 221425 -159306 138135 -9813
19491 -141372 -9974 79041 -118371 -367019 -227810 310450 56781 -135349 180357 -114869
19480 167734 -52101 55519 -16119 25791 95460 41224 -26739 -137652 -298380 119430 -106956
19468 -193888 -6608 38918 -421420 -98319 -226323 187096 15490 -74237 -175396 -83371 -287222
19457b87222A87367a042I0498i1209A55012B1530a35379A43742a60187k57817
19447d18004K04681O7439A8433O1337g231k34815A31428k897a9997r0973H1435
19435a71771A21230a87580p400j81704i3144m9329B15003a68044c5192m03367
19425d38559B86724a37552A04470J0468g0645G156Q9553b28237a9962m119A522
19413a41249O4105j2166p9956D1265G244J44143b8457j20396D2699J05024a72154
19401H1677l1020J77111a49209q3285Q5819A3707K0443a12275j73336O6526D5297
19389c81498C09002g0553b3393k67420P2885D7438a12018j32220A20985b12106
19378C29743a08357c4494C16035c09134H8178C0047O101K05794a80358H4708a7497
$$ plain form
19457 -287222 187367 -1042 90498 -91209 155012 21530 -135379 143742 -160187 -418004
19447 -418004 -213323 -145884 18433 79770 -7231 -242046 131428 128531 -19997 -110970 81435
19435 -171771 121230 -187580 -194980 -376684 -93144 -142473 215003 -168044 -35192 -438559
19425 -438559 286724 -137552 104470 114938 -70645 7156 96709 -228237 -19962 -24081 1522
19413 -141249 -77144 -89310 -169266 41265 7244 151387 -28457 -148853 42699 147723 -172154
19401 81677 50657 227768 -149209 -232494 -146675 13707 34150 -112275 -285611 -219085 45297
19389 -381498 309002 -70553 -23393 -290813 -217928 47438 -112018 -244238 120985 -212106
19378 329743 -108357 -34494 316035 -309134 88178 30047 36148 241942 -180358 84708 -17497
19366i0561C27203d27598F7769h5819k65706C8462b56275e4364A16901d8970G4081
19354b19107A27519L6506e6961C5230a45348k8625Q5693A30990k9804O249b08446
19342B7817a10238C89282E3330d834j8993p4974a4010n295j03452E7006a12267
19330d4495m66j43694F4298J20021c6174k81987a32507o7880N2515B07978j3307
19319A94671b1399k18615B5419F180a45433j77781f7184A12128b06756J1661A20074
19307B2880L30037E3691A8914b35402a6304B588J4344d5669n9270M1571A80075
19295b62813q2417A16551a71671j27726J23324M66A50008l7409C0369b21291i1548
19283a07905E7804a86537r2317B4272g0778k26639a30175M3455j11672B26243
$$ plain form
19366 -90561 327203 -427598 67769 -85819 -351525 38462 -256275 -54364 116901 -48970 74081
19354 -219107 127519 164025 -56961 35230 -145348 -173973 -88280 130990 101186 107435 -208446
19342 27817 -110238 389282 53330 -4834 -23827 -98801 -14010 -19305 -122757 57006 -112267
19330 -44495 -44961 -188655 64298 184319 -36174 -318161 -132507 -200387 -147872 207978 194671
19319 194671 -21399 -240014 25419 6180 -145433 -323214 -67184 112128 -206756 -195095 120074
19307 22880 352917 53691 18914 -235402 -16304 2588 16932 -45669 -104939 -63368 180075
19295 -262813 -345230 116551 -171671 -299397 -176073 -175607 150008 112599 30369 -221291 -91548
19283 -107905 57804 -186537 -278854 24272 -70778 -297417 -130175 -86720 -198392 226243
19272b06193m1213A21885a05957N1457j44717h310l03618Q9291C07414c00314
19261a38752l2136j2598f47m5543G9339e2825k15118J05533k78985d8994l48656
19250c97650J27416a16248k5480M2290H571a55184j06683f0513B1036f4452m1410
19239a05862j02230c6257k47641A80144m3149C8500a44462A82176a86646j75864
19229c62510P2245D4043M3301b54920C25618b49681g1072k10062A06499E1230
19218b62239A61263F3329b03399A96823c12253C2429A0275h2673J0820r2385A025
19206i3776k08147a21945E2946a07248a9582j7997n4455k65779C2585c1409G5266
19194A64755c938l77937R7403B7144a66030b4308r8644B59160p862c1359A0576
$$ plain form
19272 -206193 -247406 121885 -105957 -54500 -199217 -8310 -311928 -222637 307414 -300314
19261 -138752 -170888 -183486 -647 -46190 79339 -52825 -267943 -162410 -441395 -48994 -397650
19250 -397650 -270234 -116248 -141728 -99438 8571 -155184 -261867 -60513 21036 -64452 -105862
19239 -105862 -208092 -36257 -283898 180144 136995 38500 -144462 182176 -186646 -362510
19229 -362510 -290265 44043 87344 -254920 325618 -249681 -71072 -281134 106499 51230
19218 -262239 161263 63329 -203399 196823 -312253 32429 10275 -82673 -71853 -164238 1025
19206 -93776 -301923 -121945 52946 -107248 -19582 -37579 -92034 -357813 32585 -31409 75266
19194 164755 -3938 -381875 -284472 27144 -166030 -24308 -122952 259160 251298 -31359 10576
19182a70201J0588b4248D156c12794e9658o0349C1753d6998j38304Q7776b8273
19170D4177b07464K0343i3344j47866F9156J1009r733Q8741c31832A06651a93418
19158i4687b5643I7758J03559a89034E7119K0866a62113K9208N8211j52501B04434
19146A05187Q3938F0284M3462a19914k6317A74030G3626J09829b5480l12139J44730
19135a92889f6848D1934b13325A94584c05001C23712a57200N8024A20364i8032
19124G4241J80943f6605B27978b2984j53244C4168h0287j84077B57045c27598
19113b687G2738e8386r8044B20577j00345k0143m1251a50622c1493G9106C442
19101b96909H611a96725E1704a34131D6095b18774D092P1328K54257e8720a0608
$$ plain form
19182 -170201 -159613 -24248 4156 -312794 -59658 -120007 31753 -46998 -185302 -97526 -28273
19170 44177 -207464 -187121 -93344 -241210 69156 80165 70432 159173 -331832 106651 -193418
19158 -94687 -25643 97758 201317 -189034 57119 77985 -162113 -132905 -74694 -227195 204434
19146 105187 189125 60284 103746 -119914 -146231 174030 73626 183455 -25480 -337619 -192889
19135 -192889 -66848 41934 -213325 194584 -305001 323712 -157200 -99176 120364 -98032
19124 74241 255184 -66605 227978 -22984 -176228 34168 -80287 -264364 257045 -327598
19113 -2687 72738 -58386 -156430 220577 120232 100089 58838 -150622 -31493 79106 3442
19101 -296909 8611 -196725 51704 -134131 46095 -218774 4092 75420 329677 -58720 -10608
19089c2163B78b8213j68669r5806B40453c446q9605j71566i1308j75562C9871
19077d30957H1466r708a93983L9577d5727C7947a22749G0669f9781R984k20600
19066b80397b501A86783C7867c65997a08152A06109a9204l2401o8534j04298d7698
19054a92299h0245A81144b9841a989I1734P5463d08894a39464M2937B35648b09100
19042a46462o2773e6005k2504K3637n9390a1555C7415a98372f9183F1300a0891
19030F5197j9556L7164P4593D7119h6285M0111F5373i8052B39143a35660d1484
19018e3741k27524a07817n2274E6858a28993c5422A82389a7908j33540A04692
19007a27933j09896a16480o0012Q464E9094K69361d12052B80227i9859b194j4463
$$ plain form
19089 -32163 278 -28213 -196882 -292688 240453 -3446 -93051 -264617 -91308 -266870 39871
19077 -430957 81466 71758 -193983 -154406 -45727 37947 -122749 70669 -69781 -59797 -280397
19066 -280397 -2501 186783 37867 -365997 -108152 106109 -19204 -51605 -120139 -224437 -47698
19054 -192299 -80245 181144 -29841 -1989 91734 167197 -408894 -139464 -96527 235648 -209100
19042 -146462 -209235 -56005 -78509 -54872 -114262 -11555 37415 -198372 -69183 61300 -10891
19030 65197 45641 82805 157398 47119 -86285 -46174 65373 -98052 239143 -135660 -41484
19018 -53741 -281265 -107817 -160091 56858 -128993 -35422 182389 -17908 -151448 104692
19007 -127933 -237829 -116480 -176492 -168028 59094 328455 -412052 280227 -99859 -2194 -16657
18996a6657k90747g5004E8485d0465I6168a68875E1139a86590Q3323r070F256
18984F5874f2937j78293a2513r3639l9565P206C0636f0045j45228N8368G7352
18972A20582b945j39438C1603a74978B20519i246k06414N685I5387a81721n0244
18961b31965C355P1013a30022d2258b0991B79356G8265i5710k2903p620M3650
18950h2583k67980i8880j55011o8461E96847d25726a25717j44314G4737N9111
18940A33848a57139A89342i715r1281p1970j87946e7527j62403f787A44602a90098
18928B0048F353J50528c46310j954a09470k32080J55005A46558J29563e3014B10222
18916b70476a30468A6296f0908j30238o5627A45643K3965e8057k74860a51748
$$ plain form
18996 -16657 -307404 -75004 58485 -40465 96168 -168875 51139 -186590 -103267 -112337 6256
18984 65874 -62937 -241230 -12513 -106152 -145717 -138511 30636 -60045 -205273 -146905 77352
18972 120582 -2945 -142383 31603 -174978 220519 -9246 -215660 -209975 95387 -181721 -231965
18961 -231965 3355 74368 -130022 -42258 -20991 279356 78265 -95710 -118613 -126233 -82583
18950 -82583 -350563 -98880 -253891 -322352 596847 -425726 -125717 -270031 74737 133848
18940 133848 -157139 189342 -9715 -100996 -172966 -360912 -57527 -219930 -6787 144602 -190098
18928 20048 6353 156881 -346310 -348264 -109470 -341550 -186545 146558 276121 -53014 210222
18916 -270476 -130468 16296 -60908 -191146 -256773 145643 169608 -58057 -332917 -151748
18905D1962J55099D2874b33180M3340N4940N057F2476a25121o8627B50891H793
18893A2235b2895B56057a34949B65164b59924c4610G6744a21511j69574A36307
18882a67771B22808c5203j77083o3963q9470Q8938a25755e00j80423D8539a26499
18870a01986A50300a97470F2933c30027A7402b4065k28411K0455e3618j42676
18860a96294A52173E7019M0274a21039B15108e6244a9148m0545B48561D7984b26817
18848b65164A21371m4750d9978q1781k6223J7249j735n3659H0310K523L4522b66994
18835F0834L6127B7790P0626c4891B1885a12973k71214I0093G601b3736k1112
18824d4848j70260b9053j75204j05489f7594A67536D738J56837a9419k65443f9393
$$ plain form
18905 41962 197061 42874 -233180 -189840 -134900 -129843 62476 -125121 -193748 250891 8793
18893 12235 -22895 256057 -134949 265164 -259924 -34610 76744 -121511 -291085 136307
18882 -167771 222808 -35203 -212286 -276249 -365719 -276781 -125755 -500 -180923 48539 -126499
18870 -101986 150300 -197470 62933 -330027 17402 -24065 -252476 -232021 -53618 -196294
18860 -196294 152173 57019 97293 -121039 215108 -56244 -19148 -59693 248561 47984 -226817
18848 -265164 121371 76621 -49978 -131759 -157982 -140733 -142468 -196127 80310 82833 117355 -266994
18835 60834 96961 27790 98416 -34891 21885 -112973 -384187 90093 7601 -23736 -44848
18824 -44848 -215108 -29053 -204257 -309746 -67594 167536 4738 161575 -19419 -284862 -69393
18812A38680a93021A01637K27921A19135g1765m2698M9712A47484d3640e023A03555
18800f7870G1830g4287a629m05577J93221B5799Q3707A6670b19339A38630b0964
18788C19614j33319R0196b25379A44035d1037p5690H3970A857M6763b29950A28962
18776b73996J12479A40653a72280n8273C1876J18578h5042j06276G7793b7850
18765a22733b9105m18776B57640e98409A30356b9332n3751A11160g6356j7519
18755i3875p7741K6859o3566F5615b4032j67937I0755M9728i1947A1417K06199
18744B17616A5470a70959k7095B4508a26048e2556A00497j9523c8154C00529B184
18732b37707A92692J6764a07557a3075A92338B7899c92827O5047A35091a65568
$$ plain form
18812 138680 -193021 101637 329558 119135 -71765 -114463 -64751 147484 -43640 -5023 103555
18800 -67870 71830 -74287 -1629 -407206 -213985 25799 109506 16670 -219339 138630 -20964
18788 319614 186295 276491 -225379 144035 -41037 -116727 83970 1857 48620 -229950 128962
18776 -273996 -161517 140653 -172280 -230553 31876 150454 -85042 -191318 77793 -27850
18765 -122733 -29105 -447881 257640 -598409 130356 -29332 -83083 111160 -76356 -93875
18755 -93875 -171616 -144757 -208323 65615 -24032 -191969 90755 140483 -91947 11417 217616
18744 217616 15470 -170959 -198054 24508 -126048 -52556 100497 80974 -38154 300529 2184
18732 -237707 192692 209456 -107557 -13075 192338 27899 -392827 -327780 135091 -165568
18721a19302l0442B7627J89795b78793i6122c8355A6904d32215B6260e4211B06411
18709a21080A6844J03540a32042A90589b9120j25038L7899K8816J7514C49383
18698d1345C3483a64427f1262D4361j8099K7972f2967B62703p6652B2973g9026
18686f0350k51369Q6838a09010n4562l02474a93643A46871c2564k3997B98632
18675b09086g4457j98318f7394H9438d60533A30655A6656b04713h5863j21832
18665b07695c3328r8682b2090A97114c06255R9463N6017o5294D8949a28225H7331
18653b30202g2283I7509N2591a48059I5318a79356o9698c0784m98024a61589N4344
18642a07245E995J04674j9449O9922a24156A67792C4670J58537B5643c30967J16293
$$ plain form
18721 -119302 -149744 27627 217422 -278793 -96122 -38355 16904 -432215 26260 -54211 206411
18709 -121080 16844 120384 -132042 190589 -29120 -154158 -116259 -87443 -69929 349383
18698 -41345 33483 -164427 -61262 44361 26262 54234 -62967 262703 186051 22973 -79026
18686 -60350 -311719 -224881 -109010 -163572 -466046 -193643 146871 -32564 -56561 298632
18675 -209086 -74457 -272775 -67394 89438 -460533 130655 16656 -204713 -85863 -207695
18665 -207695 -33328 -132010 -22090 197114 -306255 -206792 -150775 -216069 48949 -128225 87331
18653 -230202 -72283 97509 150100 -148059 95318 -179356 -249054 -30784 -528808 -161589 -107245
18642 -107245 5995 110669 91220 161142 -124156 167792 34670 193207 25643 -330967 -214674
18631b14674A49155f7965B38769a94022j92263A15620J1280c8925q0885B28119
18620a27362M6004O680R794j03528C98322a41546B55787a53431H2814a75706B91495
18608a31616p7877M2764f3756A82856N1260J1016e1581E3017A7809h3073m13596
18597d96669J51553D2592a34514H3145a88840C9464K27343j7260b01851A31772
18586b07748a01509B11459M9046d00404H3853c98827h7705k05219J19318K0769
18576a52837N5103r9177A90503F6986R5176b2688j25397B7067a80970H7450l4337
18565E3113b34818A14203a67564d1897o7030E3281I232J50518p9451c20776A21229
18553d1224b0038k79636B14423H6367b02761M5172O2170j67109A63956i0635d2369
$$ plain form
18631 -214674 149155 -67965 238769 -194022 -386285 115620 126900 -38925 -119810 228119
18620 -127362 -81358 -74678 -64884 -168412 398322 -141546 255787 -153431 82814 -175706 291495
18608 -131616 -209493 -166729 -63756 182856 234116 245132 -51581 53017 17809 -83073 -496669
18597 -496669 -345116 42592 -134514 83145 -188840 39464 266807 249547 -201851 131772
18586 -207748 -101509 211459 260505 -400404 83853 -398827 -87705 -292924 -173606 -152837
18576 -152837 -97734 -196911 190503 66986 162162 -22688 -148085 27067 -180970 87450 53113
18565 53113 -234818 114203 -167564 -41897 -108927 53281 9232 159750 80299 -320776 121229
18553 -41224 -20038 -299674 214423 86367 -202761 -157589 -95419 -262528 163956 -90635 -42369
18541b81098J01511M2426D736c75433e5594A3442L0764b81337E5252B3908b80374
18529a18684h013l78751L9846J36923g5121L0454j79310A29448h5787A86692J09384
18518B96076c55867g0818C8152a84047n3638B12980a28678q5330A24890p905k7745
18507H9240c07257A79636H7056P0119b09578a2186D35957a96306G115g0621p7408
18496a48029B68547J2791B7415K6212a08270A08123g9817h525n06567i8991A79415
18484G029g5087j28863A67949a5029C5999h4758q0044f7735B2323K44278b2824
18472a75178M9422A25157J97243B4883a27015d3479A6839c88886J84953b1972
18461f7747m1370G4829c27873F0670A1956a57340c7144k01845D697R9272g0454
$$ plain form
18541 -281098 -179587 -137161 4736 -375433 -55594 13442 44206 -281337 55252 23908 -280374
18529 -118684 -8013 -386764 -346918 -209995 -75121 -44667 -223977 129448 -85787 186692 296076
18518 296076 -355867 -70818 38152 -184047 -237685 212980 -128678 -214008 124890 116985 89240
18507 89240 -307257 179636 87056 157175 -209578 -12186 435957 -196306 7115 -70621 -148029
18496 -148029 268547 281338 27415 53627 -108270 108123 -79817 -8525 -515092 -98991 179415
18484 7029 -75087 -203950 167949 -15029 35999 -84758 -164802 -67735 22323 266601 -22824
18472 -175178 -125756 125157 322400 24883 -127015 -43479 16839 -388886 -203933 -21972
18461 -67747 -109117 74829 -327873 60670 11956 -157340 -37144 -238989 4697 103969 -70454
18449A09377m8573j407N7235m4007j4204b427A72561c4283j90678O5493F7768
18437e7551H9749A2775J13959l858B1608c05110C9323b05907q2377N5580d418
18425b18110d9320j77376i1239D46259j56389g7709l88901C489f9033k74185a48882
18413a2019q0157j61741J20019j77278J12621i590j41479A40922a61094A06453
18402b02104O8164E2094c21172A93285E7774o857j8336P1417a22566B5292J1834
18391C7126a1039k01378f7752G7173b46318A38474o2855h5632A82735D8043g113
18379B62609c20225a49817j39305N0236C7650J16800E7310a27566o5812g0113
18368A18257c334j07341j22965H752J94004p7620a70025A03568a27941C5661K80011
$$ plain form
18449 109377 60804 59397 116632 72625 58421 -2427 172561 -34283 -224961 -159468 67768
18437 -57551 89749 12775 126734 122876 21608 -305110 39323 -205907 -288284 -232704 -4418
18425 -218110 -49320 -226696 -91239 446259 289870 -77709 -466610 3489 -69033 -343218 -148882
18413 -12019 -92176 -253917 -133898 -311176 -198555 -9590 -151069 140922 -161094 106453
18402 -202104 -133940 52094 -321172 193285 57774 50917 32581 103998 -122566 25292 37126
18391 37126 -11039 -212417 -67752 77173 -246318 138474 75619 -85632 182735 48043 -7113
18379 262609 -320225 -149817 -289122 -238886 37650 154450 57310 -127566 -193378 -70113
18368 118257 -3334 -110675 -233640 8752 202756 125136 -170025 103568 -127941 35661 315672
18357C15672G6319C4694e2140A14352b66136B54231d17864E9073b46125g789q3
18346g872A65618G1010J56500b87598H7489J8142a42734B87057f0197k949a4459
18334E307K01813a65249D6802Q204b38220R7681a6416C8391b58452B44326d2088
18322d9261B026a66629B49186a19436k54588a7464B34515D688b40485I959b12687
18310c15019a39462O4325A63297B3168b00855l7824N7880B76950c5386o6909J2016
18299i0279A25135b01967D14640g7907j4885D49304a22629G4804k4572J19513
18289A69745F7601c1889A1615c39944h8146j35732a01415A12245A1389l954f9313
18277a84425g4765J9649A0319b9955F4777a77353O374A5835J94055b5573j28427
$$ plain form
18357 315672 76319 34694 -52140 114352 -266136 254231 -417864 59073 -246125 -7789 -7872
18346 -7872 165618 71010 227510 -287598 87489 105631 -142734 287057 -60197 -63146 -14459
18334 5307 207120 -165249 46802 55006 -238220 -140539 -16416 38391 -258452 244326 -42088
18322 -49261 2026 -166629 249186 -119436 -374024 -17464 234515 4688 -240485 9959 -212687
18310 -315019 -139462 -75137 163297 23168 -200855 -238679 -180799 276950 -35386 -102295 -90279
18299 -90279 125135 -201967 414640 -77907 -92792 449304 -122629 74804 50232 169745
18289 169745 67601 -31889 11615 -339944 -88146 -223878 -101415 112245 11389 7435 -69313
18277 -184425 -74765 -55116 10319 -29955 64777 -177353 -170979 15835 209890 -25573 -154000
18266a54000n0016l60598a56750G0656L698a86377J237r8263A64151b22131E7152
18254a01770l08790F4935R531N4990D4882e4318j66575A95592e5968J7413C5702
18242f9570j08142c409A16485B1973K69723a12801A25620a99408C6146b88709
18231G2148K8693j9832J37415c278p2717a4710A4172K82562A06920g1028H0523
18219D0388f8929l45567A37744i1516a7138A26500a86324A06531D2813a07245
18208i3676A80959d5288G6146b56478g7978k93695B02076E4483J53058f0541C6051
18196c0646C20509d3532o7615b3713A84683a55265A12315g656j62352D3936a80267
18184f3471m4507r5595N1703A58254a23139A39711c96813d168j67207I2354a49177
$$ plain form
18266 -154000 -204016 -564614 -156750 70656 74354 -186377 -185140 -283403 164151 -222131 57152
18254 -101770 -410560 64935 74466 129456 44882 -54318 -220893 195592 -55968 -38555 35702
18242 -69570 -177712 -3409 116485 21973 291696 -112801 125620 -199408 36146 -288709
18231 72148 100841 81009 218424 -3278 -75995 -14710 14172 296734 106920 -71028 80523
18219 40388 -68929 -414496 137744 -91516 -17138 126500 -186324 106531 42813 -107245
18208 -93676 180959 -45288 76146 -256478 -77978 -371673 202076 54483 207541 -60541 36051
18196 -30646 320509 -43532 -111147 -23713 184683 -155265 112315 -7656 -170008 43936 -180267
18184 -63471 -107978 -203573 -151870 158254 -123139 139711 -396813 -4168 -171375 92354 -149177
18172B5379Q1637b64399D0613o782a69661g3382L4379D1485a9436D9913a56742
18160c46358a48156c1828m452G6815a38337M8530r5372F2560b65470M994N9579
18149b00897n4915d0819A66533h0350n5513f3761A45865b83852j9906Q9476a03194
18137a22750a0632A70841b9753A6910L85607A44071N5954G0195i1599F1976R6274
18126A58250J85592a9014j39309b9261l20126J27862K3506C4240b3989m02705
18116d26694G3678b30293A30179d6219p4117k37192J60619h3308a1572A18777
18105B51133H5303b69833J23811J2618j54175a14698A98692c98994A26107b01862
18094i824j28374F4793c90885P6200a20384E7288K68136D1392e5098A50400a92435
$$ plain form
18172 25379 107016 -264399 40613 33831 -169661 -73382 -39003 41485 -19436 49913 -156742
18160 -346358 -148156 -31828 -36280 76815 -138337 -89807 -185179 62560 -265470 -260476 -200897
18149 -200897 -255812 -40819 166533 -80350 -135863 -63761 145865 -283852 -303758 -214282 -103194
18137 -122750 -10632 170841 -29753 16910 402517 144071 200025 70195 -91599 61976 158250
18126 158250 343842 -19014 -158323 -29261 -349387 -221525 -198019 34240 -23989 -426694
18116 -426694 73678 -230293 130179 -46219 -120336 -357528 -196909 -83308 -11572 118777
18105 251133 85303 -269833 -146022 -133404 -287579 -114698 198692 -398994 126107 -201862
18094 -9824 -138198 64793 -390885 -314685 -120384 57288 325424 41392 -55098 150400 -192435
18082c44922Q6507A82460j6872J91054A28438a84423P8124C49967b58612P8101
18072a80511C4522J41923a2424k4619A99009f811l53875g8951E6131A1271J10114
18061A21385a13420I7657m1605a68207c2457k77354D689i6339A79275H7827i0354
18049I8386a73108A0097a0065j9948l36497e0413j01691j0330g3239j43441h368
18037c2326j33956C3171b73862C18797C1736J67668c49506A82009a96594Q3782
18027a12812F2429d2102B9726b8531A27230B7257d06327B46116L4021E8058a30232
18015a79626A01332o968O4193h0173A60991N5536C7909c940C42765b10927B22407
18003A1274a2458j08402m9515O7668c7246n43978A95263P4402b39575k27989a62687
$$ plain form
18082 -344922 -258415 182460 165588 356642 128438 -184423 -106299 349967 -258612 -180511
18072 -180511 34522 176445 -12424 -37043 199009 -6811 -360686 -78951 56131 11271 121385
18061 121385 -113420 97657 56052 -168207 -32457 -309811 4689 -96339 179275 87827 -90354
18049 98386 -173108 10097 -10065 -30013 -366510 -50413 -152104 -162434 -73239 -216680 -8368
18037 -32326 -166282 33171 -273862 318797 31736 199404 -349506 182009 -196594 -112812
18027 -112812 62429 -42102 29726 -28531 127230 27257 -406327 246116 280137 58058 -130232
18015 -179626 101332 94364 158557 -80173 160991 216527 37909 -3940 342765 -210927 222407
18003 11274 -12458 -120860 -170375 -102707 -37246 -581224 195263 269665 -239575 -467564 -162687
17991D53021e1814B76197f2765a7560I0950k9412b39395N8124a2944l6973D0914
17979E0279a17435F6824a93233A37490a52458N6556H5131c33574B02912G859a67326
17967A92344a10663C4793a12461A83808A5927P2448g4131c1182A98438d3475e931
17955a77173B1385K06782D7104d3755a570C433h6176K5239F3501K79506I6798
17943a32099A79972l5557h1297m1827A1700J6859M5712J5701c11170L2871c8589
17931G462N702C718P4490P9422c65854a43674a4143f875A17312d3956H7379j9142
17919F8237a0331k02749F982g2774J2769j64989I754Q2569K320J1807b03621h9782
17906a59418P2590F7878c37851d7784E3534a18898K3016H6631j6362a592A06989
$$ plain form
17991 453021 -51814 276197 -62765 -17560 90950 61538 -239395 -181271 -12944 -49917 40914
17979 50279 -117435 66824 -193233 137490 -152458 -95902 85131 -333574 202912 7859 -167326
17967 192344 -110663 34793 -112461 183808 15927 88375 -74131 -31182 198438 -43475 -5931
17955 -177173 21385 228167 47104 -43755 -1570 3433 -86176 -60937 63501 343007 96798
17943 -132099 179972 144415 -81297 -123124 11700 28559 74271 89972 -311170 -278299 -38589
17931 7462 13164 3718 78208 157630 -365854 -143674 -14143 -6875 117312 -43956 87379 68237
17919 68237 -10331 -213080 6982 -72774 -60005 -224994 9754 92323 94643 106450 -203621 -89782
17906 -159418 -86828 67878 -337851 -47784 53534 -118898 -95882 86631 70269 -1592 106989
17894H7858b74424l3166M0093A08763a36681j52427C5121b58518o2803C10860
17883C96168d4788j8040l4075C58342a36681o5853c0439j27132d5259B53296h0144
17871a50367j80659A67369b71707A14022m8864c1576o2412A73567e1173A17458
17860b65101A92220b8431B88032A12309K6574c5622r9925A34181m3143L4418k636
17849A22820J77747b9869k11281J4481e9344k859j49781A96594R0611C029a40870
17837b90302C09680d8164k16278A51079a06336C81J76294k3774h751q9772B49220
17825b34135f9843D1241a73347C11754a22257B09585p654J51493I9863d4273j17554
17814a61827j46701a35070j23745a24258C3943a69325Q0130b8495k25681A94991
$$ plain form
17894 87858 -274424 -307590 -267497 108763 -136681 -289108 35121 -258518 -321321 310860
17883 396168 -44788 -62828 -96903 358342 -136681 -202534 -30439 -157571 -45259 253296 -80144
17871 -150367 -331026 167369 -271707 114022 65158 -31576 -93988 173567 -51173 117458
17860 -265101 192220 -28431 288032 112309 138883 -35622 -135547 134181 91038 125456 122820
17849 122820 300567 -29869 -241150 -226669 -59344 -62203 -211984 196594 287205 3029 -140870
17837 -290302 309680 -48164 -264442 151079 -106336 381 176675 152901 -8751 -98523 249220
17825 -234135 -69843 41241 -173347 311754 -122257 209585 201931 353424 99863 -44273 -161827
17814 -161827 -308528 -135070 -258815 -124258 33943 -169325 -89195 -28495 -254176 194991
17803B48163a7358A06485C9647N0149c06639B86533a08225I8015C9693a36254
17792c5985A0413b70413A88K25788f9091A36210k9430c69358J29406H3153C7302
17780A57066F1360a84688J6436H4506L8479K57004A76269a34050o8399A63687
17769H5223k229O0485b53977e3162C4725i7467b842A02720N4802e48175a34441
17757C29142A10467L5929c4137o2016L2740k43928A45605a01305M6095J7139J622
17746c6449l1954j3694l85716A43339b9617j563p4481l6402a4073r798A92852
17734b62109a04814a23k4522A95656a9881B61159a56524A25835a31466M6297A98743
17722A31896J17376M1171m0978a31490D727e9651j9427G6534k7787P4007a66733
$$ plain form
17803 248163 -17358 106485 39647 89796 -306639 286533 -108225 98015 39693 -136254
17792 -35985 10413 -270413 188 225976 -69091 136210 106780 -369358 -239952 83153 37302
17780 157066 61360 -184688 -168252 84506 122985 379989 176269 -134050 -202449 163687
17769 85223 82994 143479 -253977 -53162 34725 -97467 -2842 102720 157522 -548175 -134441
17757 329142 110467 146396 -34137 -96153 -63413 -307341 145605 -101305 -55210 -38071 -36449
17746 -36449 -68403 -82097 -467813 143339 -29617 -31180 -105661 -142063 -14073 -23871 192852
17734 -262109 -104814 -123 -24645 195656 -19881 261159 -156524 125835 -131466 -85169 198743
17722 131896 249272 290443 249465 -131490 4727 -59651 -79078 76534 48747 122754 -166733
17710C24161H5591A1012a23794A3592c64718M4302M1164F3532a00021n570j42811
17699b48402a11718G6755J56569a58274B21557B7336a26257C59221a07671A74810
17688A60841k4242J19646L2740r6830D4968R1053g2868B318J00258D1761K66897
17677C08658I0603h9151a3197o0991k14755A34398q497o2224a57378A62670F1354
17665A98311e2423D0315e5735k56829d3482j71219D19895j94618F8114J08439
17655A76553m0190K20481E1647L9773a49824m4023A27482d17544A04910O6123
17645A71033b12489A38505F1185K18400h705A88303F9421a16601D1991a07437
17634b88414c9719A88825j3164J90778j52125f8115A72750d6489A09932B7598
$$ plain form
17710 324161 85591 11012 -123794 13592 -364718 -320416 -279252 63532 -100021 -105591 -248402
17699 -248402 -111718 76755 233324 -158274 221557 27336 -126257 359221 -107671 174810
17688 160841 136599 256245 288985 192155 44968 136021 -72868 2318 102576 41761 308658
17677 308658 90603 -89151 -13197 -74188 -288943 134398 125901 63677 -157378 162670 61354
17665 198311 -52423 40315 -55735 -312564 -43482 -214701 419895 225277 68114 176553
17655 176553 136363 356844 51647 91420 -149824 -193847 127482 -417544 104910 171033
17645 171033 -212489 138505 61185 279585 -8705 188303 69421 -116601 41991 -107437
17634 -288414 -39719 188825 175661 366439 214314 -68115 172750 -46489 109932 27598
17623g3054A85809J9130k1458E4718Q5153Q4130a72413k18441A83276G6304J85697
17612B62001j20000l6175j8367O2697e206A98438b0435g819A59192b91132g9790
17600i3438j3809B81559c6612B43321b57158A91004n6084g8875j55809R8797B6576
17588b3142a231A34526i4073B8695K17750a87003A84504b71598f5966B089c5646
17576c50040A93529q4653J37122F291b02451B94251H2393l9779J4726P1761L6034
17565A65135O4845E7355R2992a53129j06881b1411A8805a24743A25088n9075N1439
17554A17452a38498h409G4921P8230d3722A71594L9617n4224E3593J30264J27959
17543C11816D5511R8341J78289A60185A4571f0225B25601a3676A28412J62736
$$ plain form
17623 -73054 185809 204939 183481 54718 139871 224001 -172413 -390854 183276 76304 262001
17612 262001 142001 105826 87459 150156 -5206 198438 -20435 -7819 159192 -291132 -79790
17600 -93438 -107247 281559 -36612 243321 -257158 191004 134920 -78875 -234684 -135887 26576
17588 -23142 -1231 134526 -94073 28695 246445 -187003 184504 -271598 -65966 2089 -35646
17576 -350040 193529 108876 245998 6291 -202451 294251 82393 42614 57340 129101 165135
17565 165135 229980 57355 150347 -153129 -260010 -21411 18805 -124743 125088 66013 117452
17554 117452 -138498 -8409 74921 153151 -43722 171594 211211 156987 53593 183857 311816
17543 311816 45511 143852 322141 160185 14571 -60225 225601 -13676 128412 291148
17533B91148D2243b9019G1809L157K03498a24620j9770G9377a49275G1548A932
17521d1153Q620A50675a6516A86451K34242A70963b72331B8962a36434K4871A29697
17509A43822L55101A45698J91397h680E7126c5270A85390a58278C0056b7443j15789
17498a43232j88869C7371a58366B02523c7886A15259J2773D7964a26328B16085
17487A42211M647p09J55929j15941J34004a57244F3987Q4825n6097c2990A27747
17475d3997A27395j5581l644o13l6752B3119K8618J44038n0232Q0301G6897b5056
17462F0969i4940B38527a93449I3582O8343j8306K73561r142l0227d55124B31191
17450C97496o3036j49176L22610k21679j05085G1757B5271M8643K99800A82422
$$ plain form
17533 291148 42243 -29019 71809 74966 278464 -124620 -144390 79377 -149275 71548 1932
17521 -41153 -32533 150675 -16516 186451 420693 170963 -272331 28962 -136434 -111563 129697
17509 143822 498923 145698 337095 -8680 57126 -35270 185390 -158278 30056 -27443 -143232
17498 -143232 -332101 37371 -158366 202523 -37886 115259 128032 47964 -126328 216085
17487 142211 146858 146149 302078 186137 320141 -157244 63987 148812 92715 -32990 127747
17475 -43997 127395 111814 108170 107557 70805 23119 51737 195775 145543 225844 76897 -25056
17462 60969 -94940 238527 -193449 93582 161925 143619 417180 408038 377811 -455124 231191
17450 397496 334460 185284 507894 286215 181130 71757 25271 73914 373714 182422
17439B04993M3842J31011n7182a4178C29344a297F3992g0655F4440K19801J63041
17428D47282A96062J85598j44565c0270C95976J46318A73746M4857J69611l3932
17418C54282K8982k1498D0696L51186A51311J77373n8675a88756C86196A32307
17407C97187q0187E1325b91529C15786I2420B672L40216j70502p4339e0114A46381
17395B85350P1831F143h1193B51344O3115K47727B58925K8836i9802B09906o7243
17384A42663o5754K32382f8721A22248E0614d4255B20369a707r8516A03824g7562
17372B13959b08747B53825j25449D9613J48309a41897C20267a05894C2553L26719
17362C59272a88539P7691D20768q6361h2299C30807j27462r8179K75060b43544
$$ plain form
17439 204993 248835 379846 322664 -14178 329344 -1297 63992 -70655 64440 284241 447282
17428 447282 196062 381660 237095 -30270 395976 542294 173746 218603 388214 354282
17418 354282 383264 361766 40696 391882 151311 328684 270009 -188756 386196 132307
17407 397187 317000 51325 -291529 315786 92420 2672 342888 172386 98047 -50114 146381
17395 285350 357181 6143 -81193 251344 314459 562186 258925 287761 -99802 209906 142663
17384 142663 76909 309291 -68721 122248 50614 -44255 220369 -1707 -100223 103824 -77562
17372 213959 -208747 253825 128376 49613 197922 -141897 320267 -105894 32553 359272
17362 359272 -188539 -110848 420768 334407 -82299 330807 203345 105166 380226 -243544
17351C56796A22354L44633A91524i4543A6009a04790E3395a54592C82868A6658
17340a2858A82928k4001a26426b7256O99F140R4105K05254q7925m5223J05596
17329B77947b50255M8470E5496J08904J35737C4983K52337j00642a904A93269
17318C52674n6588R0268A17216J34726m7874r4076J55567A19112K53152H3639
17307A30224f6857C69941F7587J76978k5388n7515b4930A28865K26038A37940
17296H2311L28218p0042a53A95949K81190A16258R2836N6914q4479a04788C36983
17284B46136J38246e9840A46113B2680J33067K37391A21798L782J00326K36399
17274D62305c5781B73319j19415J77313K03701C6140K47803J11598j93982K05483
$$ plain form
17351 356796 122354 466987 191524 -94543 16009 -104790 53395 -154592 382868 16658
17340 -12858 182928 158927 -126426 -27256 -26557 6140 100245 305499 217574 172351 277947
17329 277947 -250255 -201785 55496 164400 300137 34983 287320 186678 -1904 193269
17318 352674 296086 386354 117216 251942 204068 109992 265559 119112 372264 83639
17307 130224 -66857 369941 67587 244565 219177 161662 -24930 128865 354903 137940
17296 82311 410529 340487 -153 195949 477139 116258 209094 266008 181529 -104788 336983
17284 246136 384382 -59840 146113 22680 155747 393138 121798 125580 225906 462305
17274 462305 -35781 273319 153904 331217 534918 36140 283943 395541 201559 407042
17264D07042R847A0445M473O2161N6129a0295A41651Q5371O8394j46015L1874
17253A81275K4352J0076l918r2887P1255b21666C33220Q6951J91117A85595J34031
17242C19626A21958D0000J57798O840K73981n7429j85175J71942A94428R6509
17232B90937j10035m1468J94233L1718r1667j7495K56061k47040o3942F0808c8788
17220B79186K6130K6823J32072k07683r2434J58084E2850L53190A76954R4373
17210B71327A26052P072L1413G8302L9637N34148j58148k06676m837A14688n3702
17199F0986J17036J09171N9515A6552M24391A82987q0050K03952C9837K11578
17189B51415Q5702H3260L99419j49226J12805J38076F2696J85663K92173A68685
$$ plain form
17264 407042 416889 10445 14918 77079 133208 -10295 141651 227022 295416 149401 181275
17253 181275 205627 215703 211785 118898 190153 -221666 333220 420171 611288 185595 319626
17242 319626 121958 40000 197798 204638 478619 421190 236015 407957 194428 290937
17232 290937 180902 139434 333667 365385 273718 256223 512284 265244 201302 60808 -38788
17220 279186 305316 332139 464211 256528 164094 322178 52850 406040 176954 271327
17210 271327 126052 133124 164537 78302 117939 652087 493939 287263 282426 114688 60986
17199 60986 178022 287193 346708 16552 440943 182987 102937 306889 39837 251415
17189 251415 337117 83260 482679 333453 446258 584334 62696 248359 540532 168685
17178A82469K71807J33028k15082j77436G3753M39530A69355L3745R6680M5744
17168C45524J13284A11848B9348K93843l7125K93358B09442J89815j16311L4119
17158C17065j26683I3857J8632r475K80154k3331j01023o2181J5488J34152l6978
17147C09295O4837J18457H1265K36744J7475B9321M63464C2740N25364o5171l6247
17136D56686O4046K91049B74486j23705J65175J03096j050L2719j14914J14868
17126D50675B04383k7420K11534j83145J85140l6801k0823n8573K9707K40407
17116E44409B08568K2203L3007K66974A30571J29821K78301k09360k1688J59306
17106D66951J82156k85421j26798M74607l9L0670B87088O1691L4929R7939j33548
$$ plain form
17178 182469 454276 587304 372222 194786 73753 513283 169355 203100 299780 345524
17168 345524 458808 111848 29348 323191 286066 579424 209442 399257 282946 317065
17158 317065 190382 93857 112489 103014 383168 359837 258814 196633 212121 346273 309295
17147 309295 374132 492589 81265 318009 335484 29321 492785 32740 558104 492933 456686
17136 456686 520732 811781 274486 150781 315956 419052 418002 450721 335807 450675
17126 450675 204383 176963 388497 205352 390492 353691 332868 274295 304002 544409
17116 544409 208568 230771 263778 530752 130571 260392 538693 329333 307645 466951
17106 466951 649107 363686 236888 711495 711456 742126 287088 348779 383708 481647 348099
17095C48099A63775J8051L57153A53538M30790k56823p5986J09150O0918L8320
17085D59907k15793J41656J85594k3469k14808Q919J24318M6741k51831J58548
17075D19782O1142K67035k18872m1336j36423q4525L42755j26321J41902r3024
17065E32115J20974n9583j23664j24362J94231j14887j02996K16756O4673K46626
17055H49883m13026K63443B79743J07739M02897k89260J81627k50601J39869o3885
17045E08129A86609K94752q8095J53429n4841K01003C39129L70002j964J41455
17035H48622q4106j37701J67279P410j13314J10142l74457O7843J72891j65441
17025D99168j73387K94601K47213k72556r561J52014j33488O8688j38647J90932
$$ plain form
17095 348099 163775 181826 538979 153538 584328 327505 251519 360669 421587 459907
17085 459907 244114 385770 571364 547895 333087 342006 466324 513065 261234 419782
17075 419782 480924 747959 529087 487751 351328 266803 609558 483237 625139 532115
17065 532115 653089 593506 469842 345480 539711 424824 321828 538584 603257 849883
17055 849883 436857 700300 279743 387482 790379 501119 682746 432145 572014 508129
17045 508129 186609 481361 393266 546695 491854 692857 339129 709131 707167 848622
17035 848622 764516 626815 794094 801504 688190 798332 423875 491718 664609 499168
17025 499168 325781 620382 867595 595039 585478 737492 604004 672692 534045 724977
17015G24977M4088L0981M0179j03674p0957J35287l07254O33228m51948J69514
17005H44421n2285k1377K9578l2550n6066j64222N35415M8126l47027j75090K92133
16994I01056p0079M7599j73594K6220N7128J68038k56399K34507j91663J59530
16984I02343K69797k75601o4263Q1928J2969M5153l1161k54282N21183n54899
16974F53167Q9472K72744o7883o7255j4222l3072J42941K05538m47970L43229
16964A076689j05282p584k41822K51219J84481k69251K36230j27432K34681k32529
16954I99400K74201m51551N28568l39045L4158L78407q3887l18088O57778n11418
16944A168523k3288P5775r8679J35197K61667k08495k85610J74955P2850J0804
$$ plain form
17015 724977 769065 800046 840225 736551 665594 800881 493627 1126855 674907 844421
17005 844421 792136 770759 800337 767787 711721 547499 1082914 1131040 784013 608923 901056
16994 901056 830977 878576 704982 731202 788330 956368 699969 934476 742813 902343
16984 902343 1172140 896539 832276 914204 927173 972326 941165 686883 1208066 653167
16974 653167 742639 1015383 947500 880245 866023 832951 975892 1181430 733460 1076689
16964 1076689 971407 963823 722001 973220 1157701 888450 1124680 997248 1231929 999400
16954 999400 1273601 822050 1350618 1011573 1045731 1424138 1340251 1022163 1679941 1168523
16944 1168523 1145235 1221010 1122331 1257528 1519195 1310700 1025090 1200045 1272895 1283699
16934A283699j87320O60146n10372K55201j47766R7064j45863L24284k97155j94244
16924A137674L57737j61437J90585j8525q9932r0919L12297r7288j31890j83584
16914A224718J18533J43582K81732j27929N0364l50188L95377l72837J57664K6231
16904A547247L18116l60907J89675L67243k81909j61606O28697p32959J7249J90042
16894A720888k11799N85538l49858J36550J22233k19653M235L96080N5421k27314
16884B012321l3431J08907q6955J4737K11501O902M18581m46991Q1989J79331
16874B466892k83995M76921j80360L12047k59487q425J37270p1571J83614j03747
16864B669159K13829n09k36369N0942K78376l10952M11597k43515K49123J97391
$$ plain form
16934 1283699 1096379 1756525 1246153 1501354 1353588 1450652 1304789 1629073 1331918 1137674
16924 1137674 1495411 1333974 1524559 1506034 1416102 1325183 1637480 1540192 1408302 1224718
16914 1224718 1343251 1486833 1768565 1640636 1691000 1340812 1736189 1363352 1521016 1547247
16904 1547247 1865363 1504456 1694131 2061374 1779465 1617859 2246556 1513597 1530846 1720888
16894 1720888 1509089 2094627 1744769 1881319 2003552 1783899 1788134 2184214 2239635 2012321
16884 2012321 1978890 2087797 2000842 2015579 2227080 2233982 2652563 2205572 2287561 2466892
16874 2466892 2182897 2659818 2479458 2791505 2532018 2523593 2660863 2589292 2772906 2669159
16864 2669159 2882988 2882479 2646110 2697052 2975428 2664476 3076073 2832558 3081681 3279072
16854C279072j18357J08768N6130j90430M60416k07397K34689M2010J02216j24378
16844C642739m0242K75089q3452J18750j98165N26181j37k12985L42807n44607
16834C825978K42338N56325n87906R3575N79478k96475L66087j95738N13088n380
16824E091370j7244O9689Q0467K51119O2303m9401L71024J3755l968N28525l39426
16813F058213K79269k71457L91812q0871L65999K23842K58122j6332J5158M03323
16803G627078j06342O28306n3805Q0709M12420J71508O28659n13138N12887J14417
16793I502699L21974K86862J52586N25829N3432O73225j69601O06342K23262L22520
16783A2499130K10885N90651L59061K20462N36945L11971N80504N05825L83593
$$ plain form
16854 3279072 3160715 3269483 3325613 3135183 3595599 3388202 3622891 3664901 3767117 3642739
16844 3642739 3602497 3877586 3794134 3912884 3714719 4240900 4240763 4027778 4370585 3825978
16834 3825978 4068316 4624641 4036735 4130310 4709788 4413313 4779400 4583662 5096750 5091370
16824 5091370 5074126 5143815 5224282 5475401 5537704 5488303 5859327 5873082 5869114 6397639 6058213
16813 6058213 6337482 6066025 6457837 6376966 6742965 6966807 7224929 7208597 7223755 7627078
16803 7627078 7520736 8149042 8095237 8175946 8588366 8759874 9388533 8875395 9388282 9502699
16793 9502699 9824673 10111535 10264121 10789950 10843382 11516607 11347006 11953348 12176610 12499130
16783 12499130 12710015 13300666 13659727 13880189 14417134 14729105 15309609 15815434 16199027
16774A6199027M99964M07582R32545M77997J045706N40897N27180P74812R12879
16765B2318589Q13935L90853J242319P32433J207344O39956J504508R46575J443267
16756C1239779J408746J381414J522988J291094J895517J805548J890456K135090
16748D4570632K133550J976025K583490K673270K735173L036550L460186L045411
16740F6214287L920068L338421M469824M038878M976014M625014N121065M964961
16732A01668532N851210N748466N920409O457361O060976O682222N946194O110280
16724A50445650O108219N086911M557085M269725L077174K394875J167958P2438
16716A77180035r31400j858563k835139l865229m532395n033920o025065n765114
$$ plain form
16774 16199027 16698991 17106573 18039118 18517115 19562821 20103718 20630898 21405710 22318589
16765 22318589 23132524 23523377 24765696 25498129 26705473 27345429 28849937 29796512 31239779
16756 31239779 32648525 34029939 35552927 36844021 38739538 40545086 42435542 44570632
16748 44570632 46704182 48680207 51263697 53936967 56672140 59708690 63168876 66214287
16740 66214287 70134355 73472776 77942600 81981478 86957492 91582506 96703571 101668532
16732 101668532 107519742 113268208 119188617 125645978 131706954 138389176 144335370 150445650
16724 150445650 156553869 161640780 166197865 170467590 173544764 175939639 177107597 177180035
16716 177180035 176248635 174390072 171554933 167689704 163157309 158123389 152098324 146333210
16708A46333210o816403o300103o587732o512042o473236o406023n538309n680513
16700I6018849n331230n178304m832183m453136m421069l901247l665224l577556
16692F0658900l164264l054532k778988k616965k632025k634474j497340k241674
16684D0038638j913345j613012j708863j760289j324855j071270j578493r13619
16676B8154892j105294j346194j131445r14766q18057j054548q81280o80191q26845
16667A9396272o352j281148l69840n82443q14476o15568n61490j26685q42346
16658A4195924m87912Q0931n78620n28703m02162l28199o25751N3149m87229n10248
16648A0381180j39245l5799n29824p3343m30857k15534k01857m42301k131k32246
$$ plain form
16708 146333210 139516807 133216704 126628972 120116930 113643694 107237671 101699362 96018849
16700 96018849 90687619 85509315 80677132 76223996 71802927 67901680 64236456 60658900
16692 60658900 57494636 54440104 51661116 49044151 46412126 43777652 42280312 40038638
16684 40038638 38125293 36512281 34803418 33043129 31718274 30647004 29068511 28154892
16676 28154892 27049598 25703404 24571959 23657193 22839136 21784588 20903308 20223117 19396272
16667 19396272 19389920 18108772 17738932 17156489 16342013 15726445 15164955 15038270 14195924
16658 14195924 13708012 13788943 13210323 12681620 12279458 11951259 11325508 11378657 10891428 10381180
16648 10381180 10241935 10206136 9676312 9602969 9172112 8956578 8754721 8312420 8310289 8078043
16638H078043k53525j50008m49540J23289l07206l17731l3075j84654l33400M06232
16628F578425l60175j74597q053r8674j89970m55515J59002k64819J06513j58646
16618E133491L4041k70263J45039l50669m2666n19458K97537j45271R6432M4783
16608D422996o49315L60071l91459J5550j60236L07228m9557q0453k82779k92852
16598C199194L15887l61600J34856k6164l75889K49784j2225j01901M2388j67168
16588B897162l39581M74352l13806r622l77001J26606J88177l41785J54134R4411
16578B553047j30778q563k32977J4153J1686j04450N91041k45530k44781j4259
16568B188589N0412m14914L17298q3115j08330M04483m22876k7873j65259o7758
$$ plain form
16638 8078043 7824518 7674510 7224970 7348259 7041053 6723322 6690247 6505593 6172193 6578425
16628 6578425 6218250 6043653 6035600 5936926 5746956 5291441 5450443 5185624 5292137 5133491
16618 5133491 5167532 4897269 5042308 4691639 4648973 4129515 4427052 4281781 4378213 4422996
16608 4422996 3773681 4133752 3742293 3757843 3597607 3904835 3855278 3774825 3492046 3199194
16598 3199194 3515081 3153481 3288337 3262173 2886284 3136068 3123843 3021942 3064330 2897162
16588 2897162 2557581 3031933 2718127 2708505 2331504 2458110 2646287 2304502 2458636 2553047
16578 2553047 2422269 2413706 2180729 2194882 2206568 2102118 2693159 2447629 2202848 2188589
16568 2188589 2239001 1824087 2141385 2058270 1949940 2354423 1931547 1903674 1738415 1670657
16558A670657J77759k5581q5031l4776r314N892O8804J63319l75603r0390l4140
16547A431596K48128o0072k17719J97803n6891o2027j3521j48062O3401m28131
16537I54505O61489j81059K31314n25884L75042k36667O8096M69199p47970L44440
16527A412505l59806J72763J31883j12015j26277m9265K4895k65244M34295l31320
16517I32414K97177k3511p3442m5524l80878L37072L4448R3246k03022J04375
16507A072355j39706L26476j61443o5894j22410K26450P2185l39104J17459j47476
16497H38892L06201l98266L20982k56463m1676O9317R8040R8433n2601k9206j01831
16486H51822n2245l04926K04645L1250j15874J80949o2470p8775L9060l2965R6570
$$ plain form
16558 1670657 1848416 1822835 1737804 1703028 1693714 1699606 1768410 1931729 1556126 1465736 1431596
16547 1431596 1679724 1619652 1401933 1599736 1542845 1480818 1467297 1319235 1382636 954505
16537 954505 1615994 1434935 1666249 1140365 1515407 1278740 1346836 1816035 1068065 1412505
16527 1412505 1052699 1225462 1357345 1245330 1119053 1069788 1094683 829439 1263734 932414
16517 932414 1229591 1206080 1132638 1087114 706236 1043308 1077756 1171002 967980 1072355
16507 1072355 932649 1259125 1097682 1031788 909378 1135828 1208013 868909 986368 838892
16497 838892 1145093 746827 1067809 811346 769670 838987 937027 1035460 982859 953653 851822
16486 851822 799577 494651 699296 730546 614672 795621 733151 654376 693436 660471 757041
16475G57041J07507q2477j71347l1463K8248M6345j74333K45926L8463j29184
16465F34726N6520n9476q2963B64071K31459o4219L29628l61571J15820P0534
16455E85722Q3072q6683j12767k705L3799q3430J29958j84656K04874p107p0335
16444D89742K3051J09072J33519C27823J67307K60870l25064Q96N5074l58K69434
16433G55982j88200j81264q0411p5651r3102O62360C07350N13688l87008r0958
16423C43072A66772K85996k03358J39591m7122j34405n9726M20403j04541P9697
16413E43307k16251L3164p5156J65079j3655j92881j03463J49820J96207J1232
16403D97403R2868B13781l1281L20539B48412J73085N5509K10487A33727K21118
$$ plain form
16475 757041 864548 782071 610724 579261 607509 653854 479521 725447 763910 634726
16465 634726 691246 631770 548807 264071 495530 431311 760939 399368 515188 585722
16455 585722 668794 582111 469344 466639 500438 417008 546966 362310 567184 560077 489742
16444 489742 512793 621865 755384 327823 495130 756000 430936 431832 486906 486548 755982
16433 755982 567782 386518 306107 230456 137354 799714 307350 821038 434030 343072
16423 343072 166772 452768 249410 389001 341879 207474 147748 568151 463610 543307
16413 543307 327056 360220 285064 450143 436488 243607 140144 289964 486171 497403
16403 497403 590271 213781 182500 503039 248412 421497 477006 687493 133727 354845
16393C54845l0842M14024C57122K46159p3531I7239K44436K90535B54325j21795
16383A32530C764O93987k73407Q3415A82302O1811l9653K43078N8551A61628J76629
16372C38257A04834K02131J73395p5290A29763J02360n2871L34123k26984j26221
16362A60170H317K29088J09904j23171m6254L48736B47150K01371e3639D23902
16351C12586K0588p8485J01396l7691m6406J1649N4230e5266F3986J03868a601
16339B63017M107n3395J13008j59366J47442A8814K04055E5011J49611G5494L63775
16328D39269j99444j2930H2144L71127j59593n774A05518m311b44368A26015J7201
16317A43216B0593Q8181J42643K4631I2943Q6470P7380R0614A57240k2918K58257
$$ plain form
16393 354845 324003 738027 357122 603281 529750 97239 341675 632210 254325 132530
16383 132530 3764 697751 424344 507759 182302 244113 204460 447538 506089 161628 338257
16372 338257 104834 306965 480360 405070 129763 232123 179252 513375 286391 160170
16362 160170 8317 237405 347309 224138 177884 526620 247150 448521 -53639 423902
16351 312586 333174 254689 356085 318394 271988 283637 337867 -55266 63986 167854 -1601
16339 263017 267124 213729 326737 167371 314813 18814 222869 55011 204622 75494 439269
16328 439269 239825 226895 82144 453271 293678 287904 105518 101207 -244368 126015 143216
16317 143216 20593 108774 251417 276048 92943 179413 256793 347407 157240 134322 392579
16306C92579C3873K62248r5430q9052N9195K29147e274B48K84828l7075b9859
16294B40469p1909a55954C22088a36031A87073J17816k6380q6491K1312n6981
16284A56349C3225h0260A32558K33817J20732e379A63102J70652a4465A05827
16273C10168a82743i0313C8294k214a6365B62931D8242N9770d8932G734K6229
16262C3963L03591A67473K20235A31787e6991m1025B72438E8814a16471E1582
16251f2237A26123P0618M9645j02733d3571B5139c7849J3910D9169N4340J88865
16240B92374j37458L1788G5628f8004j18417A14684f1668p0172M878j16323A92659
16228c07253D1558a65050A40411g7440B76662i8326B12182d6071B09443l7768
$$ plain form
16306 392579 33873 296121 200691 111639 170834 399981 -5274 248 285076 248001 -29859
16294 240469 168560 -155954 322088 -136031 187073 304889 278509 192018 213330 156349
16284 156349 33225 -80260 132558 366375 487107 -5379 163102 333754 -14465 105827
16273 310168 -182743 -90313 38294 36080 -16365 262931 48242 108012 -48932 7734 33963
16262 33963 337554 167473 387708 131787 -56991 -98016 272438 58814 -116471 51582
16251 -62237 126123 196741 246386 143653 -43571 25139 -37849 -23939 49169 103509 292374
16240 292374 154916 186704 75628 -68004 -186421 114684 -61668 -131840 -126962 -243285 192659
16228 -307253 41558 -165050 140411 -77440 276662 -98326 212182 -46071 209443 171675
16218A71675L5794b39590G8412f919B11143a30052A7977M1129a91132A24287J65713
16207B90000Q348b2546j47288B30678i6912K0908k6654A74730b6040H4979J91419
16196B76398A5020g0921q2068B33587d7091q8758B31946b05892L1211c5598r375
16185d4973A39388O1396A8800J2195K44879n3315j7167m047G3544a46942O1824
16174h5118A87341H127P9433P6956R3760H5209k191j1194M2200K3102a2856A08860
16161a96883B70059a10006F1568a42043D9005j1936J25435Q7247f1597M295F1295
16149a20423I7650R123m4764c4379n16965b27425A72549C4930j3864d35789C228
16137c22025E6281c1265k34475f931j16680C0493a85302j6746M3677B06176i0109
$$ plain form
16218 171675 207469 -239590 78412 -6919 211143 -130052 17977 59106 -191132 124287 290000
16207 290000 298348 -22546 -169834 230678 -96912 -76004 -102658 174730 -26040 84979 276398
16196 276398 15020 -70921 -152989 233587 -47091 -135849 231946 -205892 -174681 -35598 -44973
16185 -44973 139388 200784 18800 30995 275874 222559 205392 201345 73544 -146942 -85118
16174 -85118 187341 8127 87560 164516 258276 85209 83018 71824 114024 137126 -12856 108860
16161 -196883 270059 -110006 61568 -142043 49005 37069 162504 249751 -61597 -57302 61295
16149 -120423 97650 106773 62009 -34379 -551344 -227425 172549 34930 21066 -435789 3228
16137 -322025 56281 -31265 -265740 -6931 -123611 30493 -185302 -202048 -158371 206176 -90109
16125I0842d9420A7709J54355b46262a7364A73238I86J29679H614J85103g149
16113A07038i3178A71771D7215c33771B84810g1495A39136i2985A32115m0967
16103I1148J3456K10824i9514A60980P243J00396a95499C42022a21300q2021c0106
16091A17893E7687J3029b61543b0968q886i03m5548q5589A83386a90813h6357
16079G2060J58148a68542l2654A20906c81346B48707a66193a5362A01486J50745
16069B52231D9935o066O1975J07276b0364F011e2082j54622b8079C3581K67793
16058C01374b10005H2671L32695c7670k56340C3799K35309a03241A0506d1821
16047f9476a0985j42855b1087j44438c5581P432k5674H608a78432b8127a0345
$$ plain form
16125 90842 -49420 17709 172064 -246262 -17364 173238 986 130665 8614 193717 -7149
16113 107038 -93178 171771 47215 -333771 284810 -71495 139136 -92985 132115 91148
16103 91148 104604 315428 -99514 160980 168223 268619 -195499 342022 -121300 -203321 -30106
16091 117893 57687 70716 -261543 -20968 -29854 -903 -46451 -132040 183386 -190813 -86357
16079 72060 230208 -168542 -201196 120906 -381346 248707 -166193 -15362 101486 252231
16069 252231 49935 43869 105844 213120 -20364 6011 -52082 -206704 -28079 33581 301374
16058 301374 -210005 82671 415366 -37670 -294010 33799 269108 -103241 10506 -41821
16047 -69476 -10985 -153840 -21087 -165525 -35581 -28149 -53823 8608 -178432 -28127 -10345
16035D6080b17327A22498b2891j87873C25616c6278A10513A9228K76501c6801
16024g8315J6342B14415r277B5084a09972L5880E0783g6905A59267D3983L4674
16013G8657k7273a19881n6177A91716a54943m4901K3298j86929H0183h1903n5570
16002a37473k37703a48475J2196M6822E4294M3515a55350B88059G4496b63367
15991B1276a16960A13144d8039C8485N3632k9521K7303B0612K73896J92725j54953
15980C32280h2441j25657a0696C51016A30579e02610a86144E2851A7848J83646
15970B01494C8501R5751C1413f773A34317a67220C0610M0562b4583j09259E37874
15958G6126L7706a37051O3707j30815E8859J44658E6691b98671j1113I236a15175
$$ plain form
16035 46080 -217327 122498 -22891 -210764 325616 -36278 110513 19228 295729 -36801
16024 -78315 -61973 214415 205138 25084 -109972 -74092 50783 -76905 159267 43983 78657
16013 78657 51384 -119881 -176058 191716 -154943 -199844 -176546 -363475 80183 -81903 -137473
16002 -137473 -375176 -148475 -136279 -89457 54294 97809 -155350 288059 74496 -263367
15991 21276 -116960 113144 -48039 38485 92117 62596 89899 20612 294508 487233 332280
15980 332280 -82441 -208098 -10696 351016 130579 -502610 -186144 52851 17848 201494
15970 201494 38501 134252 31413 -6773 134317 -167220 30610 71172 -24583 -133842 537874
15958 76126 113832 -137051 -73344 -204159 58859 203517 56691 -298671 -309784 9236 -115175
15946a97812A53856N9411I7126o627M8152f5558j33406o4198G125a40064p6621
15935b16685G4141a66319k4952K5514a7592H5284g9244E5512a50556A60230a08024
15923B24904d2563p0703b2708r7255b3044k09069E4791R1364g5034l1883A14398
15911a32494j17552J08951C2064A2881R3712m2379j7829c03941A8565L43883f8464
15899A97313a48940J0136K8439K662j3154j50042m6711e5959l0117a9393F7839
15887h8101J0745r6209K3018c1477A6756N3648O4697m0986a02924B2438b8209
15875a8986B64152I7245g2484k4026B2577b26573c2888j50521B31635A04462e3244
15863B1995P5841J3522c0731M859j21976A9365h8619j28406f0229E7385b62235
$$ plain form
15946 -197812 153856 213267 97126 90499 138651 -65558 -198964 -263162 7125 -140064 -216685
15935 -216685 74141 -166319 -191271 -165757 -17592 85284 -79244 55512 -150556 160230 -108024
15923 224904 -42563 -113266 -22708 -119963 -23044 -232113 54791 146155 -75034 -106917 114398
15911 -132494 -250046 -141095 32064 12881 106593 64214 46385 -303941 18565 362448 -68464
15899 197313 -148940 -138804 -110365 -107703 -120857 -270899 -317610 -55959 -86076 -19393 67839
15887 -88101 -77356 -173565 -150547 -31477 16756 70404 135101 94115 -102924 22438 -28209
15875 -18986 264152 97245 -72484 -96510 22577 -226573 -32888 -183409 231635 104462 -53244
15863 21995 97836 111358 -30731 -25872 -147848 19365 -88619 -217025 -60229 57385 -262235
15851a97725d1345A64319b71539B6404a50056H2672J0410b2165j14957p028j67636
15840c11786f547j50463a0506A08292M6142C0492K23568a10872H5718a70370a0688
15828C72386I3556g1006R77q1567O8985D8452J33075a53499c2478H177O6837b78298
15815e40195a53026j30749H4532a04421E0459c12225G3858a8232l8493A38974
15804a70054m4015j94723D8375C993a85299Q7830F204c30197B10701c5642F1778
15792b00576A97603A0819P5214a20364L7723k64504c4593j36726b7044k78839
15782c05883g6036k59431g1204N651F5484b1203A4503b05865A68389m9116b04967
15770a47835D2005L27039R6457E9407a22804m1090j3010o4817f9826C82381g8766
$$ plain form
15851 -197725 -41345 164319 -271539 26404 -150056 82672 93082 -22165 -137122 -144150 -311786
15840 -311786 -6547 -157010 -10506 108292 154434 30492 254060 -110872 85718 -170370 -10688
15828 372386 93556 -71006 -70029 -151596 -82611 48452 181527 -153499 -32478 8177 75014 -278298
15815 -540195 -153026 -283775 84532 -104421 50459 -312225 73858 -18232 -56725 138974
15804 -170054 -214069 -408792 48375 3993 -185299 -97469 6204 -330197 210701 -35642 61778
15792 -200576 197603 10819 86033 -120364 -82641 -347145 -34593 -171319 -27044 -305883
15782 -305883 -76036 -335467 -71204 -65553 65484 -21203 14503 -205865 168389 119273 -204967
15770 -147835 42005 369044 465501 59407 -122804 -163894 -176904 -241721 -69826 382381 -78766
15758B8991K86276a67796A92741b989j75085O9388C67550h3708j8641L5623j00558
15747a67284C64668b69273B6859f8574o5357B59878C5019a12666k08308C3773
15736a93936j23171A40372N633b04714a9344C79143d2236K0436B17967a2478A4503
15724i0916A48124a65622a6588A91401D3695b29905A00395m7613b736o2344F4028
15712c84527A54920E4276a37034h755D2356J27102b0717I0697B8204M02336b15459
15700A54022m9434C370b03778c6701H3877c87761A17622n7806B0524a2804G8301
15688b83870C22331A24548a01872M7524q2082C34686F4955K62a66692g0019B83747
15676C0171b88157a5589o6262a2950k1916j44451D53535c443C27618a20136j60024
$$ plain form
15758 28991 315267 -167796 192741 -2989 -178074 -108686 367550 -83708 -102349 -66726 -167284
15747 -167284 364668 -269273 26859 -68574 -133931 259878 35019 -112666 -320974 33773
15736 -193936 -317107 140372 146005 -204714 -19344 379143 -42236 -21800 217967 -12478 14503
15724 -90916 148124 -165622 -16588 191401 43695 -229905 100395 52782 -2736 -65080 64028
15712 -384527 154920 54276 -137034 -8755 42356 169458 -20717 90697 28204 430540 -215459
15700 154022 104588 3370 -203778 -36701 83877 -387761 117622 59816 20524 -12804 78301
15688 -283870 322331 124548 -101872 -54348 -136430 334686 64955 65217 -166692 -70019 283747
15676 30171 -288157 -15589 -81851 -12950 -34866 -179317 453535 -3443 327618 -120136 -280160
15665b80160e2760k81404i2223j52894A99562a32763E1550k0843J20268O363b88192
15653a87107d9543A30797d4001l5583G686a57294A28062h16E674J4600a18428
15641a19051B12758N581K849E9570B4128O1063c62341a41121C46987a06593q1516
15630a88109c3419p4157b6113q1503A39740k9688K2020i5337D6448R8510f1637
15618b16681A09463a076j0439j65641g3363C77580a6065k09623c8080j20628e2226
15606A37003d9808j92393j47465B7588d7531B7050M3858K9748h6659D0016Q2279
15595A22295c4712r001A27076h3518a5376j45237A41440F1721A7260J13177J7407
15584A47844J42025i2027j9675C1434h3705l0720k11840C20560l0130I9509j137
$$ plain form
15665 -280160 -52760 -334164 -92223 -245117 199562 -132763 51550 30707 150975 157338 -288192
15653 -187107 -49543 130797 -44001 -79584 7686 -157294 128062 -816 5674 20274 -118428
15641 -119051 212758 218339 221188 59570 24128 85191 -362341 -141121 346987 -106593 -188109
15630 -188109 -33419 -107576 -26113 -107616 139740 110052 132072 -95337 46448 144958 -61637
15618 -216681 109463 -1076 -11515 -177156 -73363 377580 -16065 -225688 -38080 -158708 -52226
15606 137003 -49808 -242201 -389666 27588 -47531 27050 70908 100656 -86659 40016 122295
15595 122295 -34712 -43713 127076 -83518 -15376 -160613 141440 61721 17260 130437 147844
15584 147844 289869 -92027 -111702 31434 -83705 -114425 -326265 320560 290430 99509 98372
15573I8372m162P490b09089i5946A43935c18479J8384B38599a19257A99109f4151
15561c02027A50172n7742j5510R1677a55009g286l5167a3952A22498f1633K8590
15550c3043k5614b7102B06796J62239a64544l4295b0395l654q3759p3024P1441
15539a09391F6634J25759J53954A63201a41152D2780a48739A07967G280L4015
15529D1295A4352K98429a60232E6371b12067C34103A4955a70507c0812A52312
15518D24326a16155B44581A18456n446E0411b10320A70179H4039K02757a90424
15507b771j8294B54825j05928a97950K8877J7494o102b6703B9050e7708k06206
15496b63914b4016C97194j40538O3125a67118A07871N4685K10231H4690a97203
$$ plain form
15573 98372 94210 101700 -209089 -95946 143935 -318479 -300095 238599 -119257 199109 -64151
15561 -302027 150172 92430 76920 168597 -155009 -7286 -42453 -13952 122498 -61633 -33043
15550 -33043 -58657 -27102 206796 369035 -164544 -198839 -20395 -24049 -107808 -180832 -109391
15539 -109391 66634 192393 346347 163201 -141152 42780 -148739 107967 7280 41295
15529 41295 14352 312781 -160232 56371 -212067 334103 14955 -170507 -30812 152312
15518 424326 -116155 244581 118456 113010 50411 -210320 170179 84039 286796 -190424
15507 -2771 -21065 254825 148897 -197950 -169073 -151579 -157681 -26703 29050 -57708 -263914
15496 -263914 -24016 397194 256656 319781 -167118 107871 162556 372787 84690 -197203
15485a30129A5678K09786h4712j0392B5304a64065B62464c64254O6724g5739j92859
15474b68598d5652j07464A31266i3360l7026A23728n4476C384d3693E1663Q0974
15463A32637D7444K16704A99b95966B59093c70114A5123L29921A03392C6509J7926
15452E4435d4473E9829a20857M164K4449r6003J8483j49993A41469Q744d2429
15440H9835L8235l7207c0021p6068B6043j725b95959r0716C6951J71505O0116
15429B68572J33196I2234b07901e1012k65438b6211k36037b1367R521p5811F008
15417i043A08825h2842a8364l47933A79821n5582M6306K3343a30101b4253B42124
15405e2124k9550D54921b4873j34069I8885r067i6749c4535n6337A21398B2403
$$ plain form
15485 -130129 15678 225464 -84712 -95104 25304 -164065 262464 -364254 -297530 -75739 -268598
15474 -268598 -45652 -153116 131266 -93360 -130386 123728 69252 3384 -43693 51663 132637
15463 132637 47444 264148 199 -295966 259093 -370114 15123 345044 103392 36509 54435
15452 54435 -44473 59829 -120857 -116693 -92244 -188247 -169764 -319757 141469 150213 -42429
15440 89835 128070 90863 -30021 -106089 26043 24318 -295959 -386675 36951 208456 268572
15429 268572 401768 92234 -207901 -51012 -316450 -26211 -262248 -21367 -11846 -87657 6008
15417 -9043 108825 -82842 -18364 -366297 179821 124239 170545 193888 -130101 -24253 242124
15405 -52124 -81674 454921 -24873 -158942 98885 89818 -96749 -34535 -90872 121398 22403
15393E8132j5408J65044J0I9567J69686b1292m3417L1911J4264n2630B5076J34131
15381A59207G8981b67924E0257N1509b27095c7153C280a63867a8340m8168Q097
15370e8411q7137k76832A11546K94548A11271c128F1176k8249O8196J2200K14845
15359C28168C1847J89668a48897b7957B1629d672A57573c5788o495k88261A35598
15347B50634b37684A06418e8268a5736B8218O7931K4073b89156I3602b80797D2298
15335e0289B39613b84613a03487d3899K0177A11355c27089C55822b0078k46634
15325b66712B2883b74938c3298l03891J59888B97180p2172E6017P9191g5751M279
15314g1472H2922a7739j71357F6750M6626L6275b69689I3347h7377c8363p9424
$$ plain form
15393 58132 42724 207768 207778 99567 269253 -21292 -64709 -32798 -18534 -71164 25076 159207
15381 159207 78981 -267924 50257 101766 -227095 -37153 3280 -163867 -18340 -66508 -58411
15370 -58411 -145548 -422380 111546 406094 111271 -3128 61176 32927 101123 113323 328168
15359 328168 31847 221515 -148897 -27957 21629 -4672 157573 -35788 -42283 -330544 135598
15347 250634 -237684 106418 -58268 -15736 28218 96149 120222 -289156 93602 -280797 42298
15335 -50289 239613 -284613 -103487 -43899 -23722 111355 -327089 355822 -20078 -266712
15325 -266712 22883 -274938 -33298 -337189 -177301 297180 225008 56017 135208 -75751 -71472
15314 -71472 82922 -17739 -189096 66750 113376 149651 -269689 93347 -87377 -38363 -117787
15303a17787J5690A02108K74613a5692B43133q4903Q512p6542k9715K7634k708
15292H5411b81759I6455K71550C4307J76874N8469m5189B848J75457J70414a9236
15280A01151l0229L3356L9788a94699B63868a83095L9109E9259K6374K02423i8726
15268e659C9355j1482o625b83246G267a94281A35959m7518f8739k7084c8358A62161
15255e4153k17825A9626K11913e8418B33667K00313K62378O99196l83464J01447
15245A113537M05248F07552F8010b20075B3760N300M9485l0792J77471J08254
15235C33478A38126F3420O2911c44921C9575j5683Q8037K56120a42256l5002B52560
15223a21617A7087K09997q0809n9700J54123A17980K22104A3408L28379G3703
$$ plain form
15303 -117787 -102097 102108 376721 -15692 243133 158230 166742 90200 60485 88119 85411
15292 85411 -281759 96455 368005 34307 211181 269650 224461 2848 178305 348719 -19236
15280 101151 70922 104278 144066 -194699 263868 -183095 -143986 59259 85633 288056 -98726
15268 -5659 39355 27873 21248 -283246 7267 -194281 135959 88441 -68739 -95823 -38358 162161
15255 -54153 -271978 19626 231539 -58418 233667 433980 696358 1395554 1012090 1113537
15245 1113537 1518785 607552 68010 -220075 23760 29060 78545 47753 225224 333478
15235 333478 138126 63420 126331 -344921 39575 23892 111929 368049 -142256 -177258 252560
15223 -121617 17087 227084 146275 86575 240698 117980 340084 13408 341787 73703
15212C7852b09412A85688Q5604a32712l4352L7315A93612n7681l9881g5307I8597
15200D6692c18030J00170d3401a1204E57181B02407Q0833a07553j2358D71465
15189c4415C7843J15820b07409I0794K3437J04157a00510C3182M4436c6434A20138
15177E4006O4493B9887K81819f0630B49200e0631D86837B04053E0016d0943H5837
15165a04671j27396B55385L0175H1569b25397B73551g6744D09751c7412C24355
15154c440A30178J41841F8771K57924E0899M5060a61657C1474J62914j5074m1953
15143A37361a4440G6027J42503E4321a15440a3704B7525K25141l5301H4814l3093
15132E1721K28441F2698a3788j63832B3179b7795A33130L6359J22898k6042b5412
$$ plain form
15212 37852 -209412 185688 271292 -132712 -167064 -129749 193612 135931 96050 -75307 98597
15200 46692 -318030 -217860 -43401 -11204 557181 202407 283240 -107553 -119911 471465
15189 -34415 37843 153663 -207409 90794 114231 218388 -100510 33182 77618 -36434 120138
15177 54006 118499 29887 311706 -60630 249200 -50631 486837 204053 50016 -40943 85837
15165 -104671 -232067 255385 285560 81569 -225397 273551 -76744 409751 -37412 324355
15154 -3440 130178 272019 68771 326695 50899 95959 -161657 31474 194388 179314 137361
15143 137361 -14440 76027 218530 54321 -115440 -13704 27525 252666 217365 84814 51721
15132 51721 280162 62698 -13788 -177620 23179 -27795 133130 169489 292387 266345 -25412
15120B8770K72347a90180A28424a16343n7110I2315p512J55117Q155b1517A30449
15108d6334B11849d1344J4514O082A98576J80648a7169D05801J56964B42521p7881
15097A64640o1552a57269E56580A51728j9262d5490A06548l5572J98977a56B63137
15085e1811H7358K02387o9401j2754b48341I8367j8892J60187a39096c7242C26044
15073B23025r326p2204J3175J98713G2077K49332a62077g6854B05459J52599r4970
15062B63088R5253E0964K30296I5670J90146C6945J21679E5227K6342K07943a7455
15050C02939F9796K04265B9237F254j687L47650j51878A0073K87715J67169j67721
15039B97236j02716b17498I4445J22661k4128B5724K13762B9919M09194B14627
$$ plain form
15120 28770 301117 -190180 128424 -116343 -173453 92315 84803 239920 248075 -21517 130449
15108 -46334 211849 -41344 -26830 -20748 198576 379224 -17169 405801 562765 242521 164640
15097 164640 103088 -157269 556580 151728 132466 -45490 106548 70976 269953 -156 263137
15085 -51811 87358 289745 220344 207590 -248341 98367 79475 239662 -139096 -37242 326044
15073 223025 213699 141495 154670 353383 72077 321409 -162077 -76854 205459 358058 263088
15062 263088 358341 50964 281260 95670 285816 36945 158624 55227 81569 289512 -17455
15050 302939 69796 274061 29237 6254 4567 352217 200339 10073 297788 464957 297236
15039 297236 194520 -217498 94445 217106 192978 25724 239486 29919 439113 214627
15028C46465j31484O6920g7728A78039d1117B92092j43058j0188J35922a5651
15017B28243n3608f6727B55029l537K16745A51126N6667b53432A8973K5798J48511
15006A93282J08816m9466j09798F1724K22173B0462b05622d058B982K10232L91089
14995F04303A3828Q0742F585g4081D35592r1965j12506H762e3733A53267J25078
14984B78345k2756J83263a56049C01123I5990K13606P0075A53827q282h8248A78538
14972a592F4240L08625G212K27854K13741A67305P5807i2810A99930n507C2079
14960E58844q6264n3029j74845o2157m6976J68667j33815B3411L88234j49543
14950B62102R6755K26158B03702p8424J05749R1780n1188J3522M3950q4938A20680
$$ plain form
15028 346465 214981 281901 -77728 178039 -41117 292092 149034 138846 274768 -15651
15017 228243 174635 -66727 255029 251492 468237 151126 207793 -253432 18973 44771 193282
15006 193282 302098 252632 142834 61724 283897 20462 -205622 -4058 2982 213214 604303
14995 604303 13828 94570 6585 -74081 435592 343627 231121 8762 -53733 153267 278345
14984 278345 255589 438852 -156049 301123 95990 309596 379671 153827 145545 -88248 178538
14972 -1592 64240 372865 7212 235066 448807 167305 243112 -92810 199930 194423 32079
14960 558844 472580 419551 244706 182549 135573 304240 170425 23411 411645 262102
14950 262102 358857 585015 203702 125278 231027 322807 271619 285141 329091 244153 120680
14938A09626K79119j09527n9665F087K32262r9981K72055A32081J55241k2529
14928B64793J474n1282Q8548K02270o8925A83732J04646B1709M63816j45328Q1229
14917D21426A63233G3951J02126L85186j10120A71435K11353J25684k38867A06727
14906F69001l28747o4402M9559r4212J7525J46702J1216P3390A16608J53420L00517
14895E70545k32532O2569j05813q7889J92328K5428n4773l307o7788O7688J54777
14884E21233L9155k65819L19514R9590C27504l8023r2894N3401J23011j51174
14874B21825Q2889F4729k1930K53294P0720J76649i2862C26208M1150j13053o8013
14863A86292K59182j3546J43102A70840L82333j03348k07436K17908J52879B69431
$$ plain form
14938 109626 388745 279218 219553 6087 238349 138368 410423 132081 287322 264793
14928 264793 266267 214985 303533 505803 436878 183732 288378 21709 485525 340197 421426
14917 421426 163233 73951 176077 561263 451143 171435 382788 508472 269605 106727
14906 669001 340254 275852 325411 231199 248724 395426 406642 480032 116608 270028 570545
14895 570545 338013 400582 294769 206880 399208 424636 369863 366556 298768 366456 521233
14884 521233 560388 294569 614083 713673 327504 289481 196587 249988 372999 221825
14874 221825 304714 64729 42799 296093 366813 543462 -92862 326208 367358 254305 186292
14863 186292 445474 431928 575030 170840 553173 449825 242389 460297 613176 269431
14852C15190M13088j44392j92491J42751q6409K55971o981J14824C27661M21534
14842G49195A39316M66127j10240q1280j79883k4443N44059j26900k80615r0006
14832B56135J0375L59584B31483M0399L77374l08081J42105j45337K61086R638
14822F08667k46722j60168J21523J91021J6154j12736J30678j87744J4231P1686
14812D46590j35645J40068o5139L72460C52217L25578J1695J9114k02291j46287
14802C60026l0160L83979k42115M4641J20008O5410B40848M04858j02158J18750
14792F62298j25925j76352J32658H3941L06150j54260M58161M4J16122l42651
14782D67507K40891l2434j00279R2822j81765m1606n8449k0180M14333k74156
$$ plain form
14852 315190 728278 583886 391395 534146 447737 703708 696727 811551 327661 749195
14842 749195 139316 605443 495203 413923 234040 209597 753656 626756 346141 256135
14832 256135 266510 626094 231483 271882 649256 341175 483280 337943 599029 608667
14822 608667 361945 201777 323300 514321 530475 417739 548417 360673 374904 446590
14812 446590 310945 451013 385874 758334 352217 677795 689490 708604 506313 360026
14802 360026 329866 713845 471730 516371 636379 701789 240848 645706 543548 662298
14792 662298 536373 360021 492679 83941 390091 235831 693992 694036 810158 467507
14782 467507 708398 675964 575685 668507 486742 445136 386687 366507 780840 506684
14772E06684j67549K62182j18240K26356Q0374j69989j01187K24082k26871J11692
14762F27534j05785L00207q3552j35877l086k19424L06867P755j66393K09583
14752G37829l36367j1456N44367m53721L87385m29338K85120J72638q8534j7487
14742G90436l3201R4987k57430J35978J0025l25637L35930J72698r8373k6456
14732G98957j52517J28485k0807o316N6456r9178k76947N78878m02756N58K79657
14721H84470q7908J97938m049k63406M5937J64584J6615k28027J7659J79713k08699
14710G14827L7006k37343q753L37972j05740J469J24824m6762j70618K91548j7517
14699I20913Q7057r3017K2236k08596K29297k64153K84262k28329J98190L79783
$$ plain form
14772 506684 339135 601317 483077 709433 789807 619818 518631 742713 515842 627534
14762 627534 521749 821956 738404 602527 599441 380017 686884 694639 528246 737829
14752 737829 401462 390006 934373 480652 868037 438699 723819 896457 807923 790436
14742 790436 757235 852222 594792 730770 740795 415158 751088 923786 825413 798957
14732 798957 646440 774925 754118 747802 804258 705080 428133 1007011 604255 604813 884470
14721 884470 796562 994500 990451 727045 772982 937566 954181 726154 743813 923526 714827
14710 714827 751833 514490 505737 843709 737969 739438 864262 817500 646882 938430 920913
14699 920913 1007970 914953 937189 728593 957890 693737 977999 749670 947860 1327643
14689A327643j00088l42819M38146k65254J60596k78698k9841K9667n3936M33252
14679A318668l79072n6853j98401l3434N41675k09487r1084L27444j39969j39321
14669I40166J21389J28188j71851J97434k86111K48672l22806q0127M33023k14032
14659I93945L30993j95708J13669k23822J9440K1907j99390n3024L94872j2696
14649A190186J3764J55531j21295l03976K14995j51919L85744l17880K1110J5778
14639A102038L10514l73965J29275q0609K70903J98712k04832J45560j00008J20569
14629A518157Q5765m20200L97284k06658L5248j86209K0466L5779j69971M52723
14619A562384j95245k9861K74020k12623M6040j15307L61346l28449K34332n6079
$$ plain form
14689 1327643 1227555 884736 1322882 1057628 1218224 939526 909685 939352 885416 1318668
14679 1318668 939596 882743 684342 650908 1192583 983096 892012 1219456 1079487 940166
14669 940166 1061555 1189743 1017892 1215326 929215 1177887 855081 774954 1207977 993945
14659 993945 1324938 1129230 1242899 1019077 1038517 1060424 861034 808010 1202882 1190186
14649 1190186 1203950 1359481 1238186 934210 1149205 997286 1383030 1065150 1086260 1102038
14639 1102038 1412552 1038587 1167862 1087253 1358156 1556868 1352036 1497596 1397588 1518157
14629 1518157 1603922 1183722 1581006 1374348 1409596 1223387 1243853 1279632 1109661 1562384
14619 1562384 1367139 1337278 1611298 1398675 1444715 1329408 1690754 1362305 1596637 1540558
14609A540558k26235J62798L49735n64185M53889l55436M41368m64813K55452
14600A593131N3558l30508K95546J62096L8517K91030m55158J19230P4289J02721
14590A944452m17878K65859j93859K33108k47088j54518O29884k50326K77204
14581B086838j13331O271l68229K91418K39417l09357L91375N6672l15090K9078
14571A995062J23135l060J9066J26551n6848P9891J47103j19009K70805j3982
14561B568714J74161j76750M03833J80884r3297K35714K6062M33089R7195M13747
14551D263352O46659J043328J613971M593676P200391J7746329N136465B0708373
14542I501748D682678j653053n84658o89928k96086Q08569k42332J44831l26270
$$ plain form
14609 1540558 1314323 1477121 1826856 1262671 1716560 1361124 1802492 1337679 1593131
14600 1593131 1646689 1316181 1611727 1773823 1812340 2103370 1648212 1767442 1841731 1944452
14590 1944452 1526574 1792433 1598574 1831682 1584594 1430076 2059960 1809634 2086838
14581 2086838 1973507 1979778 1611549 1902967 2142384 1833027 2224402 2281074 1965984 1995062
14571 1995062 2118197 2115137 2134203 2260754 2203906 2283797 2430900 2311891 2582696 2568714
14561 2568714 2742875 2566125 2969958 3150842 3057545 3293259 3319321 3752410 3849605 4263352
14551 4263352 4910011 5953339 7567310 12160986 19361377 37107706 42244171 20708373
14542 9501748 4682678 3029625 2444967 1755039 1458953 2267522 2025190 2170021 1843751
14533A843751J81071p3410M48127l08701K23977j29340P1294J2290K17353J40077
14523B626489j05942p6817P7938p4R3117k32689Q498M5549K80515L9348O0090
14512B816022K1684K39728m74417K59938p9042J9110K38145l2988j05799J41022
14502C043403r4327J98959j89649J77495K00781r6074k55262M70597r1634L38328
14492C702617n07942J61823M2882k00054K2740L80045j80956K07874J85190j39220
14482C674999m8761M18099j85103l2618K90267j64602Q7852L36866j10620N5292
14472D321671j47675j70123l4229M30018j65693M14411k72115J98490m26594N27905
14462D676066K30326k06706L17611o37917K47496J81208K48748J02438j24276
$$ plain form
14533 1843751 2024822 1951412 2399539 2090838 2314815 2185475 2256769 2269059 2486412 2626489
14523 2626489 2520547 2443730 2521668 2521594 2614711 2382022 2390520 2436069 2716584 2755932 2816022
14512 2816022 2837706 3077434 2603017 2862955 2783913 2803023 3041168 3008180 2902381 3043403
14502 3043403 2949076 3148035 2958386 3135881 3336662 3240588 2985326 3455923 3364289 3702617
14492 3702617 3194675 3356498 3399380 3199326 3222066 3602111 3421155 3629029 3814219 3674999
14482 3674999 3626238 4044337 3859234 3826616 4116883 3952281 4040133 4376999 4266379 4321671
14472 4321671 4173996 4003873 3969644 4399662 4233969 4648380 4376265 4574755 4148161 4676066
14462 4676066 4906392 4699686 5017297 4379380 4626876 4808084 5056832 5159270 5034994
14453E034994M7973J62392K00722j19865n7642J11164P3177K00138j56534J56972
14443E653491k88414M04891M16863l91587Q9786M26122n8908J57255m0938l2132
14433F336429r410L40281j18291K17550M72632q8651o543k57640L62481L43122
14423G591960q0055K5232L96805k59937Q5558K53376K41001J40431p4928K28666
14413H548109N2062J85615L02245j96279J76185J63833q230K58691K60208R9349
14403I841788n2634M27581K79768k11230L18956K67321r7960L08234K21134K51819
14393A1554777J95546J06689P5882K20821M87555J24225O1166M66087L51134n1561
14383A3592321J34318L04991K92836M76400j23823L25082L74775N76697Q5535
$$ plain form
14453 5034994 5082967 5245359 5446081 5326216 5268574 5379738 5452915 5653053 5496519 5653491
14443 5653491 5365077 5769968 6186831 5795244 5885030 6311152 6252244 6409499 6368561 6336429
14433 6336429 6327019 6667300 6549009 6766559 7239191 7150540 7143997 6886357 7248838 7591960
14423 7591960 7511905 7537137 7933942 7674005 7759563 8012939 8253940 8394371 8319443 8548109
14413 8548109 8600171 8785786 9088031 8891752 9067937 9231770 9223540 9482231 9742439 9841788
14403 9841788 9789154 10216735 10496503 10285273 10604229 10871550 10773590 11081824 11302958 11554777
14393 11554777 11750323 11857012 11932894 12153715 12641270 12765495 12826661 13292748 13643882 13592321
14383 13592321 13726639 14031630 14324466 14800866 14677043 15002125 15376900 15953597 16039132
14374A6039132M487K46710L61220P19740L49753M66473L06868L00285J93933M25634
14364A9414235L73361N39555N90169M49712K03783N67355K79829O72258R37351
14355B4027608M06142N31697O93590L71961K17018R28801P16269P61728M12020
14346B9066834Q44663J060403P08143Q86665R43775P52805J179423M15885J071575
14337C6930171J118279J398473J082410R53917J170822J549615J072304J992822
14329D7268813J046096J514304J863409J731188J580765K105197K062805J731105
14321F0903682K514353J948081K516213K264643K460563K947132K751168L316911
14313H1622746L087121L221483L341441L942479M058143M406945M117189M899078
$$ plain form
14374 16039132 16043619 16290329 16651549 17371289 17721042 18187515 18494383 18794668 18988601 19414235
14364 19414235 19787596 20327151 20917320 21367032 21570815 22138170 22417999 23090257 24027608
14355 24027608 24433750 24965447 25659037 26030998 26248016 27176817 27893086 28654814 29066834
14346 29066834 29911497 30971900 31680043 32566708 33510483 34263288 35442711 35858596 36930171
14337 36930171 38048450 39446923 40529333 41483250 42654072 44203687 45275991 47268813
14329 47268813 48314909 49829213 51692622 53423810 55004575 57109772 59172577 60903682
14321 60903682 63418035 65366116 67882329 70146972 72607535 75554667 78305835 81622746
14313 81622746 84709867 87931350 91272791 95215270 99273413 103680358 107797547 112696625
14305A12696625M810226M979745N623320N855324O215362O304391O888499P416161
14297A60789653P477221Q117933Q505304R277059R384553R859733J0754090J1055888
14289B35221434J1346571J1957636J2703804J2756057J3130975J3555537J3760971
14282C24432985J3959283J4008107J3965706J3701196J3147821J2429076J1451922
14275D17096096J0114041Q022230M008453P72711R97665Q51587k7870o130519
14267D35704394m059064n266482p907518j0152008j1853868j3446842j4347962
14260C68670650j5033284j5004255j5515717j4886755j4910149j3312437j3667106
14253B66340947j3382901j2541926j2048141j1289436j1061480j0142094r789975
$$ plain form
14305 112696625 117506851 122486596 128109916 133965240 140180602 146484993 153373492 160789653
14297 160789653 168266874 176384807 184890111 194167170 203551723 213411456 224165546 235221434
14289 235221434 246568005 258525641 271229445 283985502 297116477 310672014 324432985
14282 324432985 338392268 352400375 366366081 380067277 393215098 405644174 417096096
14275 417096096 427210137 435232367 439240820 440013531 441011196 441862783 441834913 435704394
14267 435704394 431645330 426378848 418471330 408319322 396465454 383018612 368670650
14260 368670650 353637366 338633111 323117394 308230639 293320490 280008053 266340947
14253 266340947 252958046 240416120 228367979 217078543 206017063 195874969 186084994
14246A86084994r005166q408311q028549p478577p661942o670365o136801n810404
14238A26884879n581225n026688n222352n196411m225552l939689m078059l195470
14230I0419433l553053l649151l398322k939761k775986k393640k996174k176444
14222F6536902k333131k202590j971751k432725j692148j654690k000191j703435
14214E0546241j046805j729072j247541j624181j613828j116185r81719o53806
14206D0533104j221628j217057j383153r83272q29277n37751j110682p32368j088719
14197C1429197o63597q61740r51834n78560o11674j095468p26133k34904p16932
14188B4988355m55321o49768p25066l81600l68872j42143r42435n25467l16040
$$ plain form
14246 186084994 177079828 168671517 160642968 153164391 145502449 138832084 132695283 126884879
14238 126884879 121303654 116276966 111054614 105858203 101632651 97692962 93614903 90419433
14230 90419433 86866380 83217229 79818907 76879146 74103160 71709520 68713346 66536902
14222 66536902 64203771 62001181 60029430 57596705 55904557 54249867 52249676 50546241
14214 50546241 49499436 47770364 46522823 44898642 43284814 42168629 41186910 40533104
14206 40533104 39311476 38094419 36711266 35727994 34898717 34360966 33250284 32517916 31429197
14197 31429197 30765600 29903860 28952026 28373466 27761792 26666324 25940191 25705287 24988355
14188 24988355 24533034 23883266 23158200 22776600 22407728 22265585 21323150 20797683 20481643
14179B0481643m83301m16537k87800n50533J9500p23795l76250l28034j04504
14170A7230389m35609j51962p52960l32300j62574k94774k14845m06635r6163
14161A4382567m58396k82170n9778l22615m26955J68277n63279M2596l95563L4670
14151A2119354k86055n40646J58157k39257j68592l27392O541P344k53978k26010
14141A0249466m35501K00326l22189N7800m23214J39033j4734m69787k73891K79374
14131H986683j49676k86670r334k48364P1517j39272l33996K4925k55570J16388
14121G776631l25558P0347J8935j36821n8927m11169l7406R9378J03375m20065
14111F678720r7461J71171q0745k38139j62954k56841J29505o8744J26864k20965
$$ plain form
14179 20481643 19998342 19581805 19294005 18743472 18762972 18039177 17662927 17334893 17230389
14170 17230389 16794780 16642818 15889858 15557558 15394984 15100210 14885365 14478730 14382567
14161 14382567 13924171 13642001 13582223 13259608 12832653 13000930 12437651 12480247 12084684 12119354
14151 12119354 11833299 11292653 11450810 11211553 11042961 10715569 10722110 10729454 10475476 10249466
14141 10249466 9813965 10014291 9692102 9749902 9326688 9465721 9450987 8981200 8707309 8986683
14131 8986683 8837007 8550337 8541003 8292639 8364156 8224884 7890888 7915813 7660243 7776631
14121 7776631 7451073 7521420 7540355 7403534 7344607 6933438 6896032 6995410 7098785 6678720
14111 6678720 6581259 6752430 6671685 6433546 6270592 6013751 6143256 6074512 6201376 5980411
14101E980411k4103k67737K72317m12000k08604R6940j79442j8881J21416j84648
14091E175669J89539p5004j08985P6309j63850n1519k52346J2923J93406j89276
14081D806866k40310M2658k01506j81761m9459K60528R1554p0028l60976M82073
14071D579639n09309R1656R7760R8789k76865K62353k52553J30453m82406K78557
14061D018074k43021k48455K03376K62601p8446k79220m0807L60429n19641j07311
14051C327579j74350j59705L88439J3734j70008l8553K88817j93451n2836j94128
14041C035538N2294j01245K38197j08548L0611k70463K66237p7627k84790Q6144
14031B866348L00109q341m60316J02132k51583K60419J57541j51293k81142P806
$$ plain form
14101 5980411 5956308 5688571 5960888 5548888 5340284 5437224 5257782 5238901 5360317 5175669
14091 5175669 5365208 5290204 5181219 5257528 5093678 5042159 4789813 4802736 4996142 4806866
14081 4806866 4566556 4609214 4407708 4225947 4176488 4437016 4528570 4458542 4097566 4579639
14071 4579639 4070330 4161986 4259746 4358535 4081670 4344023 4091470 4221923 3739517 4018074
14061 4018074 3775053 3526598 3729974 3992575 3914129 3634909 3594102 3954531 3434890 3327579
14051 3327579 3153229 2993524 3381963 3395697 3225689 3187136 3475953 3282502 3229666 3035538
14041 3035538 3087832 2986587 3224784 3116236 3146847 2876384 3142621 3064994 2780204 2866348
14031 2866348 3166457 3158116 2697800 2799932 2548349 2808768 2966309 2815016 2533874 2541680
14021B541680R3441p0862j3098j38315J92696r7246r7896l2853O3161J86220l16387
14010B310541k02173M12405k0324j96749J71140k47336q8782J30877P0771J9370
14000B359740j11397L366l49968L28562l7680p3372k34797L64018J02502l0025
13990B320949O91509J083134K691963O147002J6579602J4461709k0619850r831194
13982A3524824n441964k219220j118266j090946k82059m35433N22157q06923q4524
13973B567646M6108k04093J48723q2919k69104J48910k4024m41792J66124M5186
13963B100765k58222J47533L42754o45298K56409n0303m3819J76813O2903l93539
13953A695996j143L24846j99088N17009m89893J12446k58851R0782k15990K24766
$$ plain form
14021 2541680 2635121 2564259 2551161 2412846 2605542 2508296 2410400 2377547 2440708 2626928 2310541
14010 2310541 2108368 2520773 2500449 2303700 2474840 2227504 2138722 2269599 2340370 2359740
14000 2359740 2248343 2251709 1901741 2230303 2192623 2119251 1884454 2248472 2350974 2320949
13990 2320949 3012458 4095592 6787555 12934557 29514159 43975868 23356018 13524824
13982 13524824 8082860 5863640 4745374 3654428 3372369 2936936 3459093 2652170 2567646
13973 2567646 2613754 2409661 2558384 2475465 2206361 2355271 2331247 1889455 2055579 2100765
13963 2100765 1842543 1990076 2332830 1687532 1943941 1893638 1849819 2026632 2089535 1695996
13953 1695996 1694853 2019699 1820611 2337620 1847727 1960173 1701322 1792104 1576114 1800880
13943A800880k99363L65500n46990N26985k87658J29161K26503l94016K44531
13934A765533m70140J3772K03070L53616j28709J75067k23285j03140k34738R0686
13924A441732L32417n84292M1517M90092n64038n1396L13584J40904o1280J3291
13914A512531m8133Q1715k89922j02706J86378J16319p096m5924j43300J85287
13904A445149k36062l5754O3274K57038l22659J93236n3198j77480j17029M15070
13894A431585k44020R345J5620k81859L03748k9456O2429q3585J78110k45795
13884A116122J07936m30715J17919K37333k6419p683Q9298k09271J69110J0733
13874A174363M29352n01236j74128K3608j73361L04827Q8613R2684l8080o8635
$$ plain form
13943 1800880 1501517 1867017 1320027 1847012 1559354 1688515 1915018 1521002 1765533
13934 1765533 1295393 1309165 1512235 1865851 1737142 1912209 1688924 1585784 1351046 1441732
13924 1441732 1774149 1189857 1231374 1721466 1157428 1106032 1419616 1560520 1499240 1512531
13914 1512531 1464398 1546113 1256191 1153485 1339863 1456182 1449086 1403162 1259862 1445149
13904 1445149 1209087 1173333 1236607 1493645 1170986 1364222 1311024 1133544 1016515 1431585
13894 1431585 1187565 1196910 1212530 930671 1234419 1204963 1267392 1183807 1361917 1116122
13884 1116122 1224058 793343 911262 1148595 1122176 1114493 1203791 994520 1163630 1174363
13874 1174363 1603715 1102479 928351 951959 778598 1083425 1172038 1264722 1226642 1158007
13864A158007k19627K78104k84492J14237J03621j8307J25046m16248K96668j84574
13854I52435r4187K27049j47800n1886J28274p5880o1850J16025l94243J47414
13844G45351J32136Q5003j67867J41902k24449L08407m85595K67167J55480K07632
13834A165167k02386m0773n9615P3998J42646l0260o1756j62040O5374j3789k2234
13823H54332R1392P8434l83675j08421M41554o7884K04469l66240m3037N19259
13813A220183m27704O8762N8950PJ2958k58428R1413J51272j76611j24894L92410
13802A008318l69506K0837L2913B53646N30998Q1845j99425O0912K82040j55897
13792H54119C10342N55338j23799k768k52982L26739k18038J27916k25055J55825
$$ plain form
13864 1158007 938380 1216484 931992 1046229 1149850 1131543 1256589 840341 1137009 952435
13854 952435 858248 1085297 937497 885611 1013885 938005 876155 992180 597937 745351
13844 745351 877487 962490 794623 936525 712076 1020483 534888 802055 957535 1165167
13834 1165167 962781 922008 862393 936391 1079037 1048777 987021 824981 890355 876566 854332
13823 854332 945724 1024158 640483 532062 973616 905732 1110201 743961 700924 1220183
13813 1220183 792479 861241 920191 920198 933156 674728 766141 917413 740802 615908 1008318
13802 1008318 638812 659649 692562 253646 784644 866489 667064 727976 1010016 854119
13792 854119 310342 865680 741881 739113 486131 812870 594832 722748 497693 653518
13782F53518J54897j42899J41661k1411j20347J19588L0689r2147L6421Q6203
13772H46173m00069K16528r2765R9346K29793k12349j13788M3798J59579M7096
13762H23342l41841L33503l94974J51985K3574j1707m1524J01959K11954l82530
13752D73741N525k6598L00843C65846q819J5888K28426P8930L32544l93181k44478
13741C75156K09814L5065O4538j65944R7319j83309K94397B77652K79404J35774
13731F92830B30651N43521k60378k26495J37123N7864l2429J38147H857M65232
13721D74089L00895r0801k57058O2758A61989L88568k40735R3366m1693L04022
13711F65517l15935R5563J93240j37899L7272j30157J41672J4291m8753J37149
$$ plain form
13782 653518 808415 665516 807177 785766 665419 785007 815696 723549 759970 846173
13772 846173 446104 662632 569867 669213 899006 686657 572869 616667 776246 823342
13762 823342 481501 815004 420030 572015 595589 583882 542358 644317 856271 473741
13752 473741 479266 452668 753511 365846 357027 372915 601341 680271 1012815 619634 375156
13741 375156 584970 620035 684573 518629 615948 432639 727036 277652 557056 692830
13731 692830 230651 774172 513794 287299 424422 482286 449857 588004 8857 474089
13721 474089 774984 684183 427125 489883 161989 550557 309822 403188 361495 665517
13711 665517 349582 445145 638385 500486 537758 407601 549273 563564 514811 651960
13701F51960A17169M09303B00976N40144A20764O51308l02349k3311j24052J75565
13691D97925m383L5781O4426J20184k49077B04942h752C43922l6913J82330j39059
13680C50280M3081J09958j49114J66338M0135k55147l8136K53665j35051p8495
13670C07514J51093r2879L5505K19544j38000j35869A6332N92500B76508J85507
13660D62015J89254B44187K96144j96671J19074J00423A43552O27791l51216j17433
13650C02694J16013j26004J09435j85237M2838K89534b0906A79224J18702o3522
13640B34404K45882A01089K47328r8261J01823N28309B68626K60927j39383h217
13629E40953j76627j50892M2805J8384M87306A86662J74833J25229H2341K56761
$$ plain form
13701 651960 117169 526472 200976 741120 120764 772072 469723 446412 322360 497925
13691 497925 493542 529323 593749 713933 464856 204942 -8752 343922 307009 489339 350280
13680 350280 393361 503319 354205 520543 560678 305531 267395 521060 386009 307514
13670 307514 458607 365728 401233 620777 482777 346908 16332 608832 276508 462015
13660 462015 651269 244187 540331 343660 462734 563157 143552 771343 420127 302694
13650 302694 418707 292703 402138 216901 259739 549273 -20906 179224 297926 234404
13640 234404 480286 101089 348417 250156 351979 880288 268626 529553 390170 -8217
13629 540953 364326 213434 256239 274623 761929 186662 361495 486724 82341 339102
13619C39102A52613P0689L05567M5174B07730J60145k720J28232J15420A66022
13608A96189K91468r0819j33681Q1095K36083A80863k0752J90054J61391k01623
13598C09933J82673k37514J20907O1445m0434K33515B06483P2823r4927K95337
13588D79716j89670j44069L78102A74404o1417J67258J78323B26492J8111n9530
13578A85073K03640A73648L49260j68112J0018A15080L55253j26151L8475A12337
13567B15804G4296M0177J23529g9867A81871C3722a71396C17498m5150J75650
13557D47998k07824J12442L1471m1358M428H4722L84157o6571K08729A42504L22342
13546D64846A23716K81191A93299d7259D85504j18653M26512A88982P9191M3390
$$ plain form
13619 339102 152613 223302 528869 574043 207730 367875 365155 493387 608807 166022
13608 196189 487657 396838 263157 344252 580335 180863 160111 350165 511556 309933
13598 309933 492606 255092 375999 437444 397010 630525 206483 279306 184379 479716
13588 479716 290046 145977 524079 174404 112987 280245 458568 226492 244603 185073
13578 185073 388713 173648 522908 354796 364814 115080 470333 344182 382657 112337
13567 215804 74296 114473 238002 -79867 181871 33722 -171396 317498 272348 447998
13557 447998 240174 352616 384087 342729 347157 84722 468879 402308 611037 142504 464846
13546 464846 123716 404907 193299 -47259 485504 366851 793363 188982 268173 311563
13536C11563m3639k0170N8311j08358J66209R4813k07729o4539m705n8027K39686
13525C63415k1824k3899R5068J37915e1471B8206J9329N01043n7345m8293J5112
13514D58052a46082B25127J00400J19855h662j45733I0502K89915j76299J41101
13504C45219j1798E9714N4782M7204K59845j02033L10411l05706H550K99736A05209
13492B49865P4004P7488j04457m6701K03759A39180P9250O1735B7943J28566m7196
13481A09313O0179L8796G0898L56790h5500j09758C76086j24822P4234o7093J1587
13470B69992M8723G6375K35809J41556k5427j65532F7298J68126I0297O9134l5562
13459A23869K2979K86940F1826L32806o5994j05044J65766j93476q3528h6878
$$ plain form
13536 311563 267924 247754 306065 197707 363916 458729 251000 186461 181756 123729 363415
13525 363415 341591 317692 412760 550675 -51471 28206 47535 548578 491233 442940 458052
13514 458052 -146082 225127 325527 445382 -8662 -154395 90502 380417 204118 345219
13504 345219 333421 59714 114496 161700 421545 319512 629923 324217 8550 308286 105209
13492 249865 323869 401357 296900 250199 453958 139180 218430 280165 27943 156509 109313
13481 109313 169492 208288 70898 427688 -85500 -195258 376086 251264 325498 258405 269992
13470 269992 318715 76375 312184 453740 428313 262781 67298 235424 90297 159431 123869
13459 123869 146848 433788 61826 394632 328638 223594 389360 195884 112356 -86878
13448D65777h6477K0214B21628Q8944L1690A24432J85957j0805n3895j17529a67071
13436A59043R0033L8291p1369K63113B28353o482N7778d2766F0499O8107b1457
13424F564K05724F1760K38166j18487M5218J42393A04347O7029o4139f3452B49335
13412A22479i360D7535J11564M6382H8350K15342j25827K77974A66956L8071q1750
13401A23277C6890L3796K44729G1237c19633A24438N1964J38647o0197e8465C06046
13389A15115E190K06051r0352g722F0207Q7678J27556h7335D3642J37852K38627
13378D20121a7123A39847J5599m2342J70994H4126J21052f7688C01428r6065b9849
13366B02590q1960L69487A43959L8656m6906K4208N6737a31636H8650k4772d4766
$$ plain form
13448 465777 -86477 -66263 221628 310572 342262 124432 310389 299584 245689 128160 -167071
13436 159043 249076 287367 215998 479111 228353 221871 279649 -42766 60499 128606 -21457
13424 6564 212288 61760 299926 181439 226657 369050 104347 171376 107237 -63452 249335
13412 122479 -9360 47535 159099 205481 88350 303692 177865 455839 166956 205027 123277
13401 123277 36890 70686 315415 71237 -319633 124438 176402 315049 254852 -58465 306046
13389 115115 5190 211241 120889 -7722 60207 147885 275441 -87335 43642 181494 420121
13378 420121 -17123 139847 155446 113104 284098 84126 205178 -67688 301428 205363 -29849
13366 202590 120630 490117 143959 182615 135709 159917 216654 -131636 88650 63878 -44766
13354b7506B38539N0522J71674B24347L4395j19971N4192K53840j61200Q957A9789
13342D26541B9741K74499K56178j08471d3474E11135I2772L6041R9161b84049
13331C39142C2569J96007A04690J30810a890B85457G3556B7888g4421A90615c6619
13319D5166J15161K34452p9791A23631j269K75484I0786J646O5132e383A06521
13307D78116A86994r2379k9354i3854A30576b30354D38233A31835D1925K65325
13297C07250g8997L4914A13119b1045D19167a85763A67929F256L80073A27317
13286A31145J10072J5512A05832g0506B9982h5946A94619m2809J78122H2608J42128
13275B24736e0677A62451a78225C33495b54976C2122i7596B67059b15806e7520
$$ plain form
13354 -27506 238539 289061 460735 224347 258742 138771 192963 446803 285603 294560 19789
13342 426541 29741 304240 560418 451947 -43474 511135 92772 128813 227974 -284049
13331 339142 32569 228576 104690 235500 -1890 285457 73556 27888 -74421 190615 -36619
13319 45166 160327 394779 314988 123631 122362 397846 90786 92432 157564 -5383 106521
13307 478116 186994 94615 65261 -93854 130576 -230354 438233 131835 41925 307250
13297 307250 -78997 -44083 113119 -21045 419167 -185763 167929 6256 386329 127317
13286 131145 241217 256729 105832 -70506 29982 -85946 194619 151810 329932 82608 224736
13275 224736 -50677 162451 -178225 333495 -254976 32122 -97596 267059 -215806 -57520
13264C8408K04002p3087g8707A16186K15741a3186A44281h5032F6544i3077K9727
13253f3350k40036A99606o7717P2088E1419J99664m1010J97313E265a81498B921
13241A75952H4440P6671b7837B22290n970A01320K16168F829b08360D69091C8067
13229C29591H9752P6812C0465L10354A31552b58411A36238L41580C9878J86143
13219B26021M2055r6808b5840A80192J16286a05768A53099L5475a18239A77225
13208G7468k2292K38938a76332D760J32918K2435a15638A92685a22867r1880E7165
13196C3995a69475F193K50772L33301a7583j96935C82916f9077A4558b7165I3037
13184c4586A84101B0735P4451b2214q0082k1394C41177a2382B94882c4589B12045
$$ plain form
13264 38408 242410 169323 -78707 116186 331927 -13186 144281 -85032 66544 -93077 -63350
13253 -63350 -303386 199606 131889 203977 51419 251083 210073 407386 5265 -181498 2921
13241 175952 84440 161111 -27837 222290 216320 101320 317488 6829 -208360 469091 38067
13229 329591 89752 166564 30465 340819 131552 -258411 136238 477818 39878 226021
13219 226021 268076 171268 -25840 180192 296478 -105768 153099 188574 -118239 177225
13208 77468 55176 294114 -176332 4760 137678 160113 -115638 192685 -122867 -214747 57165
13196 33995 -169475 6193 256965 590266 -17583 -214518 382916 -69077 14558 -27165 93037
13184 -34586 184101 20735 95186 -22214 -102296 -123690 341177 -12382 294882 -34589 212045
13172B01075o6601l8438j0828M69793A32095K06931j63991F7705Q3360J7499a7124
13160B59258O3049m446k4022r0066J87958j39595c14468i1163c3358j19556N9246
13149i3668k63334e8832m2637B95308o4201d2967B00608a47935A11092K5879D5096
13137A75155n2536a48615D09727j34073A16905j3724a01527K6863G3205J94698
13127B67903A02334J90527o1462d3011P500j9614l5280A16185a8838A67423a43938
13115A34432M5767D7744C549b61642B49868a4451B12437J0956o6971b28261F0535
13103a07696d7612P822D81007b226l07052A98088H7224K93542A19917Q3579q451
13092A95045j3880g5341j16715B27088c8909B655i9071A15452M690J44985A9863
$$ plain form
13172 201075 134474 96036 85208 555001 132095 339026 175035 67705 151065 168564 -17124
13160 259258 322307 317861 293839 203773 391731 252136 -314468 -91163 -33358 -152914 -93668
13149 -93668 -357002 -58832 -101469 295308 231107 -42967 200608 -147935 111092 136971 45096
13137 175155 122619 -148615 409727 275654 116905 103181 -101527 -74664 73205 267903
13127 267903 102334 292861 231399 -43011 -35511 -55125 -90405 116185 -18838 167423 -143938
13115 134432 180199 47744 3549 -261642 249868 -14451 212437 223393 156422 -228261 60535
13103 -107696 -47612 -39790 481007 -2226 -309278 198088 87224 380766 119917 203496 195045
13092 195045 181165 -75341 -192056 227088 -38909 2655 -99071 115452 120142 265127 19863
13080D0254I425j820a30410B78327e7445j40990A6710J59144G469K92624d3824
13068A44373N2559K18538c4982R18C32572A0827K52720e2138A2396M13904a71379
13056c5797n6200A40313C5126a51120C8033K07708j09194J71281d0845B66635
13045B51203j05463a1426A20793a07207B65614P0602j61060a39546A25843C3216
13034G1288J73709a18776a6429C56488I1064i0580a7684A20659f9405C55008A68561
13022B20529c9811j68161a03969A21853J65948j19242J1595m1329B2880J80285
13012B03165R8178f9160A58522f6911B68184a06287j3839C5065K04560q4983a07163
13000f9244A46309J85732l3803A42036g1525B37203h6672k25867D73067b64089
$$ plain form
13080 40254 9425 7605 -130410 278327 -57445 -198435 16710 175854 7469 300093 -43824
13068 144373 196932 415470 -34982 -34064 332572 10827 263547 -52138 12396 426300 -171379
13056 -35797 -91997 140313 35126 -151120 38033 245741 136547 307828 -40845 266635
13045 251203 145740 -11426 120793 -107207 265614 336216 175156 -139546 125843 33216
13034 71288 244997 -118776 -16429 356488 91064 -90580 -17684 120659 -69405 355008 168561
13022 220529 -39811 -207972 -103969 121853 287801 168559 180154 138825 22880 203165
13012 203165 301343 -69160 158522 -66911 268184 -106287 -120126 35065 239625 154642 -107163
13000 -69244 146309 332041 298238 142036 -71525 237203 -86672 -312539 473067 -264089
12989A07445D8621a63689C3711L42309J10955j81694b5094A51634M4839H89J3526
12978A4415R7337K26615c52806A84768c35311D219J195K67812b18921A45116b24924
12966F038P3421h6048m675c8990A79612a09987A89583J2171a41434L3449F5043
12954b1473A9297g2116F7453c73830D4716c6556n9452A94369b08789A64555D1803
12942H8723g9752L5583k22343H2647N0533a09649D05327b08142d7603G999d70651
12930A08949a98228E3856N6667P5213k7517D7496a3875o7624K4472B68748b6519
12918c3823A14005a6164j32912r1793D15223A85894R8453K1192H0093P4198p5397
12907G8894l8047J60412b02303b8941j15410j46H0913J78703K03038b35849B74123
$$ plain form
12989 107445 48621 -163689 33711 376020 486975 305281 -25094 151634 196473 889 14415
12978 14415 111752 338367 -352806 184768 -335311 4219 5414 273226 -218921 145116 -224924
12966 6038 79459 -86048 -90723 -38990 179612 -109987 189583 201754 -141434 -107985 65043
12954 -21473 19297 -72116 67453 -373830 44716 -36556 -96008 194369 -208789 164555 41803
12942 88723 -79752 -44169 -266512 82647 133180 -109649 405327 -208142 -47603 7999 -470651
12930 108949 -198228 53856 110523 185736 158219 47496 -13875 -81499 -57027 268748 -26519
12918 -33823 114005 -16164 -149076 -240869 415223 185894 284347 305539 80093 154291 78894
12907 78894 40847 201259 -202303 -28941 -144351 -144497 80913 259616 462654 -235849 274123
12895B03110K2585b90163G0619e7380B74408G0178J60195b84814G5015n155L0011
12884I9871l7752P148b91889D1302i9103j23655M0504A13505R4070g2636A57008
12872D8789a40448D1983i9198b1611l8561B34042b1296j9238B02464I7183c78459
12860a55981a9197A88782K5379m0185a63302j7793f0549l4964m2779L6264F5458
12848A5508h2140o2531A93230j7507H2081J17496K10393A65255a38822G2827M115
12837G6942d1891j02512a9002k34031J2883B16724a12074B6460a27314j30369
12827b57683o7730A54318b6417B39836b95517f2886B69111p3650a92527l6000
12817b28527P9122A76420d5512H2270g8430A6385a8181A29561a0741j10554B6216
$$ plain form
12895 203110 225695 -290163 70619 -57380 274408 70178 230373 -284814 75015 69860 99871
12884 99871 62119 69267 -291889 41302 -99103 -222758 -182254 113505 207575 -72636 157008
12872 48789 -140448 41983 -99198 -21611 -60172 234042 -21296 -40534 202464 97183 -378459
12860 -155981 -19197 188782 214161 173976 -163302 -181095 -60549 -95513 -138292 -102028 65458
12848 15508 -82140 -144671 193230 175723 82081 199577 409970 165255 -138822 72827 76942
12837 76942 -41891 -144403 -19002 -253033 -240150 216724 -112074 26460 -127314 -257683
12827 -257683 -325413 154318 -26417 239836 -295517 -62886 269111 195461 -192527 -228527
12817 -228527 -149405 176420 -45512 82270 -78430 16385 -18181 129561 -10741 -121295 26216
12805c0614B21319J1902a43717A27178b9977A84450F4389L8154B3786d95248b0386
12793i1663A7497c6398l8096H6585b86536B34968d287I0098C8303d99676J81102
12782c18574h3720F7004a51278B5177b19462O1454C34361d3223D6659J31928l3265
12771A45322m5702d9940A37881a33592L1213b8823l7457B22818D234i7339k88764
12760c86103F3086h0517D8370k2701P5557a17503A31984b6208j09266M2025c9529
12748C33879H438J51420n1408a5557A88822e1033A09562B3945a17436d4816I4489
12736C42326m6188C4249a27378A97283G9174c3720q7941G162b23001B57991a68736
12724B79936C6122c8987r4620J1673A8774a68021A8958J14678J76759j52391K58993
$$ plain form
12805 -30614 221319 233221 -143717 127178 -29977 184450 64389 102543 23786 -495248 -20386
12793 -91663 17497 -36398 -74494 86585 -286536 234968 -4287 90098 38303 -499676 -318574
12782 -318574 -83720 67004 -151278 25177 -219462 -158008 334361 -43223 46659 178587 145322
12771 145322 99620 -49940 137881 -133592 -102379 -28823 -66280 222818 4234 -97339 -386103
12760 -386103 63086 -80517 48370 25669 101226 -117503 131984 -26208 -135474 -93449 -39529
12748 333879 8438 159858 108450 -15557 188822 -51033 109562 23945 -117436 -44816 94489
12736 342326 296138 34249 -127378 197283 79174 -33720 -121661 7162 -223001 257991 -168736
12724 279936 36122 -38987 -133607 -121934 18774 -168021 18958 133636 310395 158004 416997
12713D16997B141K30749e1583B64272o30J424A27002J10132m7189R4171j30616
12702A53500J47437A5856M1876f1156l3085H823g675F5536J82272j13349D8322
12690B77123o3872c54744H0337A0776J31857e3336E6414J51863i6136l8095B57960
12678A74362G8592g1136j74787G4453L38456f0147A73019Q9947a07772c6479A44664
12666B54367e9775I6566a7349A07061R6271m6126N8958r0101M7349n6929B9257
12654a43457k4255H2716a70711A18975d5914n8899A66812a56377N7685q2467e8859
12642a45458A0320K29787D4695b03164A44850a28538B23149a47274B1785O5233
12632H7018D1120K58670A14431J48269j12240b281C24749a31966A18459K3043
$$ plain form
12713 416997 2141 232890 -51583 264272 263642 265066 127002 237134 189945 284116 153500
12702 153500 300937 15856 57732 -61156 -94241 8823 -7675 65536 247808 134459 48322
12690 277123 213251 -354744 80337 10776 142633 -53336 56414 208277 -96136 -134231 257960
12678 174362 78592 -71136 -245923 74453 412909 -60147 173019 262966 -107772 -36479 144664
12666 254367 -59775 96566 -17349 107061 203332 157206 216164 126063 173412 116483 29257
12654 -143457 -167712 82716 -170711 118975 -45914 -104813 166812 -156377 -98692 -181159 -58859
12642 -145458 10320 240107 44695 -203164 144850 -128538 223149 -147274 21785 87018
12632 87018 41120 299790 114431 262700 150460 -2281 324749 -131966 118459 141502
12622A41502M36540d2078H0463g8156q5493H9235j6739c7703j19532A49038c3207
12610a02811e741C35029C072M18229A36810l8966R6464a15383D51168b0536I7012
12598G3169b6654l5176E01149A40994f229j65261H3989j7999J60376B4188b8909
12586d1139E1456N3587M6284a10956B40227c717J408k21947a3628A90269B2154
12574F1593J09009a92087e9247B34741a5344C0197j0426b1051A81571a17590j295
12563a18885B88582c0791j11393k2872f6726a036A06805m3943K27603j07062b30197
12551g4487L0182A70551l8907b9129A25353H035K3051h0979A2838O5207M8913
12540A26958j0220k5629b08136P6650a3434C15126p7461F0429B1212a09345L4271
$$ plain form
12622 141502 578042 -42078 80463 -78156 -163649 89235 72496 -37703 -157235 149038 -33207
12610 -102811 -5741 335029 3072 421301 136810 97844 194308 -115383 451168 -20536 97012
12598 73169 -26654 -61830 501149 140994 -6229 -171490 83989 65990 226366 24188 -28909
12586 -41139 51456 105043 151327 -110956 240227 -3717 -2309 -224256 -13628 190269 22154
12574 61593 170602 -192087 -59247 234741 -15344 30197 19771 -21051 181571 -117590 -118885
12563 -118885 288582 -30791 -142184 -165056 -66726 -1036 106805 62862 290465 183403 -230197
12551 -74487 -44305 170551 131644 -29129 125353 8035 31086 -80979 12838 78045 126958
12540 126958 116738 91109 -208136 -131486 -13434 315126 237665 60429 21212 -109345 -75074
12529g5074E3256a77198g15G5972q492c5178L692j86266B04371F7350a27656m2846
12517a70502d7820k73408c3755E7664f1130A93881B548a30303d3300I9553D7027
12505F9729J8032Q3831a87904C84728F2783a68805E9486B6580a32907l7059B52991
12493a57959I0794M2881j4459Q49c81539a20780D8086A312L10974k4756a81884
12481i3118k429A9507J46541a10151d3701B09620E5129D548a51332C14585h4067
12469A35878b36013J05289b3638B19135b15161j757H5741L0127a34991N464d2724
12457b19994Q2951A88308d4606C2832b0202j3952a1940B40057g7583C52485c53343
12445B0756e6522b5742G809L6957K76716A22449a01344A53388b92317a07721B91116
$$ plain form
12529 -75074 53256 -177198 -715 75972 67480 -35178 -31486 -217752 204371 67350 -127656 -170502
12517 -170502 -47820 -321228 -33755 57664 -61130 193881 2548 -130303 -43300 99553 47027
12505 69729 87761 171592 -187904 384728 62783 -168805 59486 26580 -132907 -169966 252991
12493 -157959 90794 133675 119216 120065 -381539 -120780 48086 1312 312286 287530 -181884
12481 -93118 -95547 19507 166048 -110151 -43701 209620 55129 4548 -151332 314585 -84067
12469 135878 -236013 -130724 -23638 219135 -215161 -216918 85741 115868 -134991 -129527 -42724
12457 -219994 -137043 188308 -44606 32832 -20202 -34154 -11940 240057 -77583 352485 -353343
12445 20756 -56522 -25742 7809 44766 321482 122449 -101344 153388 -292317 -107721 291116
12433E7355K30443I3603c6986D35098j06523a78278A54205R025a25365o555j54931
12422b86851c0407k20115Q9337N0978r4219h5593D09300a82297f7334l37558O4776
12411c40116E1278c2983C3328J01820E4727b86662D2786a02881M0153R335J9219
12400c4174j37419k2056O904d3300j44421j29987f8708l1864F9487J9085m3965
12389D4607J14540l2333q889N5206a2650A13341i0870j06292B8942J74695Q8347
12378B91984C0985p73b46267A3325a5348A3754Q2590a69742M1919a3613j33228
12367a46841k8391h1181j01472B38854b20616Q6081C0986h5418A98874D2336f642
12355a03005D4146J83637C765J43736k1692E005b83384i4957A7514h4084C9031
$$ plain form
12433 57355 287798 93603 -36986 435098 328575 -178278 154205 163230 -125365 -131920 -286851
12422 -286851 -30407 -250522 -161185 -110207 -204426 -85593 409300 -182297 -67334 -404892 -340116
12411 -340116 51278 -32983 33328 135148 54727 -286662 42786 -102881 -62728 -53393 -34174
12400 -34174 -171593 -193649 -186745 -43300 -187721 -317708 -68708 -100572 69487 88572 44607
12389 44607 159147 126814 117925 173131 -12650 113341 -90870 -197162 28942 203637 291984
12378 291984 30985 30212 -246267 13325 -15348 13754 96344 -169742 -127823 -13613 -146841
12367 -146841 -175232 -81181 -182653 238854 -220616 -134535 30986 -85418 198874 42336 -6642
12355 -103005 44146 227783 3765 147501 125809 5005 -283384 -94957 17514 -84084 39031
12343A28573g1947A98314c6659A45032F2271h69j16123A18752R7134J8704b35835
12331I5005J99963b88629m6794R7393A84102a01757a3550m2096j61191H385K40854
12320B49239r8469i5620F5060J41372K93751a41021j3180j7927c5997k43618A34943
12308b67297i3360j15324a5943r8735j62254A76001a85267G611J93667i8763A76502
12296A59701N9626A07832f1265r6470A48818D5295b16334A92985b4620A5779N5709
12285G1488a27068b2622A39266C2518p832a4594A31652n4168a03267A31099k4548
12274A06551J91517B1229K87052r1344M9539A3996J44602D6306h427j05989B7235
12262B8214a5754A12367b51629C63520G9853i9531I8942R075K23126a7831D89851
$$ plain form
12343 128573 -71947 198314 -36659 145032 62271 -869 -116992 118752 215886 234590 -235835
12331 95005 294968 -288629 -335423 -238030 184102 -101757 -13550 -55646 -216837 8385 249239
12320 249239 150770 -95620 65060 206432 500183 -141021 -154201 -172128 -35997 -279615 134943
12308 -267297 -93360 -208684 -15943 -114678 -276932 176001 -185267 7611 201278 -98763 176502
12296 159701 219327 107832 -61265 -157735 148818 45295 -216334 192985 -24620 15779 71488
12285 71488 -127068 -22622 139266 32518 24686 -14594 131652 77484 -103267 131099 106551
12274 106551 298068 21229 308281 216937 266476 13996 158598 46306 -8427 -114416 27235
12262 28214 -15754 112367 -251629 363520 79853 -99531 98942 108017 331143 -17831 489851
12250e6386I2748K60625n1924h6390A20765L6288m698d1324A49455a02789C10808
12238C8539J16866j5995D4025P2622N263N5773J37534A43191J95822j35152E6644
12226B53307H7687o207M5447J11592E506J36694b2524C59014j3440J19370A30560
12214D24454I8673K35950h8145A4803K9014P3525A2916f3262k40183B83767d7850
12202A37956e7133B70993j03898J24256B3106L42282A30685B6924J58838H6850
12191B25502o2964F7244L3727e5842H9829J41728G9243A5549P9803a11419r890
12180a21309H7751J76670i2426A44088R701m2724M8502o8943J21942q5346f3198
12168i5893k02575g1046A17465K40406A9994M81833i9597E9604J46176B3911K29768
$$ plain form
12250 -56386 92748 353373 301449 -86390 120765 157053 152355 -41324 149455 -102789 310808
12238 38539 155405 139410 44025 116647 121910 177683 315217 143191 339013 203861 56644
12226 253307 87687 81480 126927 238519 5506 142200 -22524 359014 345574 464944 130560
12214 424454 98673 334623 -88145 14803 43817 117342 12916 -63262 -303445 283767 -47850
12202 137956 -57133 270993 167095 291351 23106 365388 130685 26924 185762 86850
12191 225502 162538 67244 100971 -55842 89829 231557 79243 15549 95352 -111419 -121309
12180 -121309 87751 264421 -92426 144088 153789 111065 159567 90624 212566 127220 -63198
12168 -95893 -298468 -71046 117465 357871 19994 501827 -99597 59604 205780 23911 253679
12157B53679r5639L2669H1262k2541J975J49731j00464a43451k2132A22022a12092
12145D41823G1859a93789K9622A78591G63J20620K85052j04564b46826E5426b4874
12133D9679b00045A9191K102a1866o607l14124a6608B38112r9619A6397R4968
12122A11365a29255j10029F6014A7701e1748j87905m35F8760M0260a6084j36119
12111a52203l207A08233a8286p6430A96172G0392c1261H8371a18636j2984A85644
12099H0646c34745a8225F2030a62016C772b1226E8750c48122e0710q6095B08949
12087i01o2779C6631d04288A70507b33643I0266j7119L54412J91342J221512E85592
12075E52412A66104a27847k9832G1502B3426O8438b48278a01712C19192c66694
$$ plain form
12157 253679 158040 190709 81262 58721 60696 210427 109963 -143451 -165583 122022 -112092
12145 441823 71859 -193789 -164167 178591 763 121383 406435 301871 -246826 55426 -24874
12133 49679 -200045 19191 21293 -11866 -18473 -332597 -16608 238112 138493 16397 111365
12122 111365 -129255 -239284 66014 17701 -51748 -239653 -240088 68760 109020 -16084 -152203
12111 -152203 -155410 108233 -18286 -94716 196172 70392 -31261 88371 -118636 -131620 185644
12099 80646 -334745 -18225 62030 -162016 3772 -21226 58750 -348122 -50710 -136805 208949
12087 -901 -63680 36631 -404288 170507 -233643 90266 73147 427559 618901 1840413 585592
12075 552412 166104 -127847 -157679 71502 23426 91864 -248278 -101712 319192 -366694
12064e3471H9774J30896D1851a62706P6723k01562a27518n0441g2435a0858n1117
12053f1975A68478a0453k5081A82176b6711C5626j5015L11817c12009A17028J35794
12042B52822a82689A40102b54146c4931o8117K2026A93099E2809P7495Q6485b0531
12030h7780H8558L5558C5619A399i0610b8504B43123D217J44396i7465J8004j47402
12018b26863a7264E7202c45673i0020A19409a28234j2325i785n2982B60521C6652
12006b15171b522k93078M3394e1295j3155j49182J5684A23875d10665H2022K2527
11995A04549O7532b4305A56460J9004m0702D0661O1882a40463j2056A37143b24106
11983a1639j86860P4686e9595G2068e10210a46450e2910j87382C5450c14212C4705
$$ plain form
12064 -53471 89774 220670 41851 -162706 -85983 -287545 -127518 -177959 -72435 -10858 -61975
12053 -61975 168478 -10453 -35534 182176 -26711 35626 20611 332428 -312009 117028 252822
12042 252822 -182689 140102 -254146 -34931 -103048 -81022 193099 52809 130304 216789 -20531
12030 -87780 88558 124116 35619 1399 -90610 -28504 243123 4217 148613 -97465 -79461 -226863
12018 -226863 -17264 57202 -345673 -90020 119409 -128234 -140559 -9785 -62767 260521 36652
12006 -215171 -2522 -295600 -252206 -51295 -64450 -213632 -197948 123875 -410665 82022 104549
11995 104549 172081 -24305 156460 175464 134762 40661 102543 -140463 -152519 137143 -224106
11983 -11639 -198499 -123813 -59595 72068 -510210 -146450 -52910 -240292 35450 -314212 34705
11971f5624D2032L3579e1578j4499o2907j95455A40051J50314E5041R200a09458
11959F4331b02357l4558a12036A2750b9699j84741e0346B1574N532o579a28985
11947A60185L1452a85846P6801B22642D1588d5271I4886I372a52288L9219E0707
11935b89629G7603a74240A27890i1222B44522d4592k45883G7643r756a41726O2521
11924g9205J996C82964a43561A63501j2101b05365R3950A46388d78894F9890e1874
11912a53900C58443a60186r2230C30205b20494b2202n8883m5236b22F4987K1801
11901H6788k751l4231j1132R1423E0949J8159J19066a94806n5962m0367j6553
11890c07688E4495J54360k6630a3425j31322l0080C35309K7714e2634j45231A9369
$$ plain form
11971 -65624 42032 75611 -51578 -66077 -128984 -324439 140051 290365 55041 64241 -109458
11959 64331 -202357 -236915 -112036 12750 -29699 -214440 -50346 21574 27106 20527 -128985
11947 160185 191637 -185846 -109045 222642 41588 -45271 94886 9372 -152288 -113069 50707
11935 -289629 77603 -174240 127890 -91222 244522 -44592 -290475 77643 67887 -141726 -79205
11924 -79205 -77209 382964 -143561 163501 151400 -205365 -111415 146388 -478894 69890 -51874
11912 -153900 358443 -160186 -252416 330205 -220494 -22202 -81085 -126321 -222 64987 86788
11901 86788 84037 49806 38674 130097 50949 69108 188174 -194806 -250768 -291135 -307688
11890 -307688 54495 208855 182225 -13425 -144747 -174827 335309 363023 -52634 -197865 19369
11878f9408j7572j19944e3630E18381h4434N223c0325A4629a80054A99009K5168
11867B24177E6168J94517e5837j03719q435B76141I906J53190c7263A10905K146
11856A13051f411j39076L9439k54531A19368a45327B64278A9871g1447L1659A52484
11844a55405k36296a49306f1705F1188c95409a82566E3274h4375l0670A88257
11833a22134j2049d5987B1099b4371Q165A33127a95455M4302B4260B001K2140
11822B4141L5444J47480b89093E4266c31874A1727a4869C277Q1003b29442A2908
11810h5749j2072D4274L2860a90478c9271n5618F7010Q9224p3101a37692m433
11799a42125M3915B20785D2830h2693G9841J61438b29252j41632a26694d2775
$$ plain form
11878 -69408 -86980 -206924 -53630 518381 -84434 -79211 -30325 14629 -180054 199009 224177
11867 224177 56168 250685 -55837 -159556 -167991 276141 9906 163096 -37263 110905 113051
11856 113051 -6411 -145487 -106048 -360579 119368 -145327 264278 19871 -71447 -39788 152484
11844 -155405 -391701 -149306 -61705 61188 -395409 -182566 53274 -84375 -115045 188257
11833 -122134 -134183 -45987 21099 -24371 -16206 133127 -195455 -151153 24260 2001 24141
11822 24141 59585 207065 -289093 54266 -331874 11727 -14869 3277 84280 -229442 12908
11810 -85749 -97821 44274 77134 -190478 -39271 -94889 67010 156234 83133 -137692 -142125
11799 -142125 -98210 220785 42830 -82693 79841 241279 -229252 -370884 -126694 -42775
11788b48120M6175K4901n3468f4651F7923K21423b5755n6414l5349n9668B23404
11776b53210C20991e7343G4398a84625B41729r609g3251A9622b47756B06503c14061
11764G1315K90964H9776a53093A61792J19621A0660K24609I4412a62295o110d255
11752b03753e7264G2504a1709j54130j30144J23899h610j75965l3061A47956d0126
11740E7156N8864D634g119A1656J94400c7117r1766B56910j26087c12140n7386
11729c69526C67930b3622j2843j42318B64841I111J22585K14060E9601L40457
11719D00058E0140a62909c8935k1368A35038b94217A01573a5956B55838c69803
11708a31474e8587B63361k3590a41306A36765K5748c5694C2651o926a11551L8517
$$ plain form
11788 -248120 -201945 -177044 -230512 -64651 67923 289346 -25755 -82169 -117518 -177186 223404
11776 -253210 320991 -57343 74398 -184625 241729 232120 -73251 19622 -247756 206503 -314061
11764 71315 362279 89776 -153093 161792 281413 10660 235269 94412 -162295 -168405 -4255
11752 -203753 -57264 72504 -11709 -165839 -295983 -172084 -8610 -184575 -217636 147956 -40126
11740 57156 116020 4634 -7119 11656 206056 -37117 -128883 256910 130823 -312140 -369526
11729 -369526 367930 -23622 -36465 -178783 264841 9111 131696 345756 59601 400058
11719 400058 50140 -162909 -38935 -60303 135038 -294217 101573 -15956 255838 -369803
11708 -131474 -58587 263361 239771 -141306 136765 162513 -35694 32651 25725 -111551 -73034
11697g3034j17411B80295A20487b2841a150B07953G1134a63413C3314d2993C98334
11685B77634a37289a5545G0772K44222a5745I5767d0926C83233c8093B07891a34462
11673i4628A41597J7580R4741i6471L091d2158E4783b8124C83532a0012j79109
11662a89121A15136h2207I8609L4688J82299j57366a46123g0552q3362C4365a37501
11650c543k43750a4678j24856a4529k95957P9339m6734C3095h3489a0250G5629
11638g0329q3579A33282a20547A03773J95650c7617C29471a8607B33390b99771
11627A03908A6617M2226K4798J35556d6291C06970j35704J59325h3198B28124
11616A09265h3809j55382C026P9759a17495d2623D4205Q2081e3385j39132B02765
$$ plain form
11697 -73034 -190445 280295 120487 -22841 -1150 207953 71134 -163413 33314 -42993 398334
11685 277634 -137289 -15545 70772 314994 -15745 95767 -40926 383233 -38093 207891 -134462
11673 -94628 141597 159177 253918 -96471 -93380 -42158 54783 -28124 383532 -10012 -189121
11662 -189121 115136 -82207 98609 133297 315596 158230 -146123 -70552 -153914 34365 -137501
11650 -3543 -247293 -14678 -139534 -14529 -310486 -231147 -277881 33095 -83489 -10250 75629
11638 -70329 -153908 133282 -120547 103773 299423 -37617 329471 -18607 233390 -299771
11627 103908 16617 58843 83641 219197 -46291 306970 171266 330591 -83198 228124
11616 109265 -83809 -239191 3026 82785 -117495 -42623 44205 126286 -53385 -192517 202765
11604B59666a80570M608D32463f3303A31341N5834c58215A96046E9048P6241n4406
11593H0883a37162A52540c3300A80605m1186h2315B49994l8550m8297e734A60424
11581f9439p6571D5930f883C69227b42214A76167J05826J3718p9933E0562O3215
11570A13777A7195K63326o4722b7457j9463l30088B69503b8940C16922b86794
11559H7149J05672n4029J4202f2400K0482p0122q8160C76788b86739A50923L7404
11548A88327A6557b88411A83549J04119E1647g0007A1004K11952a24930k2649
11538a47579B48617j21975K92566g2095G8420J76746b37439e228F1976b0431D8531
11526a93779A75562l8088m3564p693K44344j44898b8490F3105g1755D60567A41992
$$ plain form
11604 259666 -180570 -175962 432463 -63303 131341 187175 -358215 196046 59048 135289 80883
11593 80883 -137162 152540 -33300 180605 139419 -82315 249994 211444 163147 -5734 160424
11581 -69439 -146010 45930 -6883 369227 -242214 176167 281993 295711 215778 50562 113777
11570 113777 17195 280521 215799 -27457 -46920 -377008 269503 -28940 316922 -286794
11559 87149 192821 138792 152994 -62400 -41918 -112040 -200200 376788 -286739 150923 188327
11548 188327 16557 -288411 183549 287668 51647 -70007 11004 222956 -124930 -147579
11538 -147579 248617 126642 419208 -72095 78420 255166 -237439 -5228 61976 -20431 48531
11526 -193779 175562 137474 93910 86217 330561 185663 -28490 63105 -71755 460567 141992
11514B69284A6800j209J63723N3657B331K976J69069B1407L8061A2900M42479
11503D55379A28356K15198A12891J22010J65449b62597B91448j45259g448m5138
11493e2586A75725N1446J08076r4407j13124D0838e8149B89362E3240a39051A73020
11481B16157k7350B0635d5507j81382C5136J50399p7147K4714J43819B4276J97909
11470B22185C8487R0280o3287K30694A02462a81951E1688L7642a21338L8621k7837
11459a10554A14266a15524A46918E7454p719i7231C44331j50317b5084H53K30780
11448B31633a06246A70091L5682E0662a2015B27417K7371j7892l3120I3766E378
11436A11316l2040L9040a59958F5354a16603F8200K17665c4017j42137k4300C34189
$$ plain form
11514 269284 16800 15591 179314 232971 2331 5307 174376 21407 59468 12900 455379
11503 455379 128356 343554 112891 234901 400350 -262597 291448 146189 -7448 -52586
11493 -52586 175725 227171 335247 240840 127716 40838 -58149 289362 53240 -139051 173020
11481 216157 188807 20635 -45507 -226889 35136 185535 108388 133102 276921 24276 222185
11470 222185 38487 128767 65480 296174 102462 -181951 51688 89330 -121338 -82717 -110554
11459 -110554 114266 -115524 146918 57454 49735 -97231 344331 194014 -25084 853 231633
11448 231633 -106246 170091 205773 50662 -12015 227417 254788 236896 203776 93766 5378
11436 111316 79276 118316 -159958 65354 -116603 68200 285865 -34017 -176154 -200454 334189
11424A96818J7907O0614a13099B7872b5501A21818Q0839b4841j68821O7928A3576
11412B88261i630B26339F3441c9949G8897l5465M8216a26509B32291i6055F8801
11400A12500e2057j74859h0471C3981Q3292e53838F413J72174a41089A51709P5063
11389B26772c9028o8183b3578m8013A47731D8879K5992a51000e4153A79342i8161
11377g7080p6988q924B58169A13636a50114p6286i2636A11129i3348B13382a9149
11365e6235C31820d0775l17716o8581B01931N0129f5106G4579J80064c29144a41495
11353b72525B10404G2331h0283C2839m548d4041a7461k11658H0029h4642B06698
11341b29417h720A59698m6763A9840a30701j17407n5341a45933A3027O0437l0381
$$ plain form
11424 196818 214725 275339 -113099 27872 -25501 121818 202657 -24841 -193662 -125734 13576
11412 288261 -9630 226339 63441 -39949 78897 43432 91648 -126509 232291 -96055 68801
11400 112500 -52057 -226916 -80471 33981 117273 -553838 6413 178587 -141089 151709 226772
11389 226772 -39028 -107211 -23578 -71591 147731 48879 74871 -151000 -54153 179342 -98161
11377 -77080 -154068 -162992 258169 113636 -150114 -226400 -92636 111129 -93348 213382 -19149
11365 -56235 331820 -40775 -358491 -427072 201931 252060 -65106 74579 254643 -329144 -141495
11353 -272525 210404 72331 -80283 32839 28291 -44041 -17461 -229119 80029 -84642 206698
11341 -229417 -8720 159698 112935 19840 -130701 -248108 -303449 -145933 13027 73464 43083
11330D3083J51692e0533A02676i8272j48923D7541J2243M3270J8964K5568G3753
11318B63008C3154b17915C05216j39465c13357C6986a52814B76777A7104d9720
11307a78852A22679A7672b274B62431J0876a93763R5174B00028N1570c697r5086
11296i8783j34518O5334J5852f7956A32077a05554c1470j03403l20948a04459
11285c47329P4936B9915N4399k3505a56375G3827a04596j7885E397J09688a97407
11273f9161G0262A8544c67776G4777a67186d502j86916A62958l4072F2354e0945
11261F9816L11153g4220m8515h374A18300B7307b16795f1679C2591a4643k82758
11250b97401G5343d38568L4237O5679a51511B09601b95390E4166g4472A3534J3998
$$ plain form
11330 43083 194775 -50533 102676 -98272 -247195 47541 59784 103054 122018 147586 73753
11318 263008 33154 -217915 305216 165751 -313357 36986 -152814 276777 17104 -49720
11307 -178852 122679 17672 -2274 262431 273307 -193763 -98589 200028 251598 -3697 -98783
11296 -98783 -233301 -167967 -152115 -67956 132077 -105554 -31470 -134873 -455821 -104459
11285 -347329 -272393 29915 84314 60809 -156375 73827 -104596 -122481 5397 115085 -197407
11273 -69161 70262 18544 -367776 74777 -167186 -4502 -191418 162958 128886 62354 -50945
11261 69816 380969 -74220 -122735 -8374 118300 27307 -216795 -61679 32591 -14643 -297401
11250 -297401 75343 -438568 -404331 -338652 -151511 209601 -295390 54166 -74472 13534 27532
11239B7532p869i2143j46461E2966b538j0286j26541f3812l51915a41922A01012
11227a50003A25443m9681c04973E4306h8809n1795k7913l0696l5208D7746e1557
11215E9554J28761r0313d0398k18286g41E708e2441j33541L8886f045m0395j46141
11203a92581K1079m1084A00549e0479A65595E7331b83415C7848b39006A75070
11192C8662a69817B25399B2409J67387e3145P279r4552k89366c1273q3673e2195
11180A04706a85923h5132J6477A44035m2674a09380C7980Q0101a30267L128k98655
11169d25794a76103A12967m1836M5813a11655I6680b8781H1116a83188b3287J0546
11158a2741j59366g5609q2442g6727j82976R6706C24074d47575i0678j17496A48956
$$ plain form
11239 27532 19663 -92143 -238604 52966 -2538 -12824 -139365 -63812 -415727 -141922 101012
11227 -150003 125443 75762 -304973 54306 -88809 -140604 -168517 -199213 -234421 47746 -51557
11215 59554 188315 98002 -40398 -258684 -741 5708 -52441 -185982 -147096 -6045 -46440 -192581
11203 -192581 -171502 -212586 100549 -50479 165595 57331 -283415 37848 -239006 175070
11192 38662 -169817 225399 22409 189796 -53145 -45866 -140418 -429784 -31273 -114946 -52195
11180 104706 -185923 -85132 -68655 144035 101361 -109380 37980 118081 -130267 -127139 -425794
11169 -425794 -176103 112967 71131 116944 -111655 96680 -28781 81116 -183188 -23287 -12741
11158 -12741 -172107 -75609 -158051 -76727 -259703 -162997 324074 -447575 -90678 -208174 148956
11146I1871J12018a39199A6719J11178b21738M4550H1158M0151l6515g0253R93
11135f9260C06601j10991p3351a16245J211E776c3023A97355g5885A29716Q6467
11124B16183b3425A8339N72412A21922n3625K42495j01831c63D23599b4297E50778
11112g5425A12954g1841B54365j25617E1139Q4535e6051l8422B79177C3131J23276
11101A56407b32706A63691k5938J13866O9648e4479F0446L67874a28956C45470
11090B38844l7728r9835J75604H3188b13970B63093Q911h9352A01706J16177J31332
11079C49215j14248i3385B32607J63093n1553N059D13J17284O3504J59944k7103
11068C14042N2190j52331K92735A93401k2509K45506j11831R0066J57988r8958
$$ plain form
11146 91871 203889 -139199 16719 127897 -221738 -177188 81158 121309 84794 -70253 -69260
11135 -69260 306601 195610 122259 -116245 -115034 5776 -33023 197355 -75885 129716 216183
11124 216183 -23425 18339 590751 121922 68297 310792 208961 -363 423599 -24297 550778
11112 -75425 112954 -71841 254365 128748 51139 135674 -56051 -94473 279177 33131 156407
11101 156407 -232706 163691 137753 251619 321267 -54479 60446 428320 -128956 345470
11090 238844 201116 101281 276885 83188 -213970 263093 272004 -89352 101706 217883 349215
11079 349215 234967 -93385 232607 395700 344147 349206 413 117697 181201 341145 314042
11068 314042 366232 213901 506636 193401 170892 416398 304567 394633 552621 453663
11058D53663P188J98274k40538J23720j70048M03913k20692M39852C16776K70509
11048E87285L07001q666k66439p9333p222K14714j00411J70794r5148C60916K48858
11037F09774J52298j09523B86146K26208J3884k16337L45901k06989N094R9788
11027E53695j42324J99938L9883K12305j08289k56327n9055J7895J85393B32700
11016D52963J57399j8936p2177K37561j39065B39097J24904B3935O06894R1228
11006G22057k41502L16822A85140N91944j89552j57650J69879K3888k21090m698
10996C97861L05781r216C17747L81937J2512j22365Q9710l4405l4956k2130L87896
10985I75946l27388N13989l42977J54246O6688J39473k34913J98067O24642j05116
$$ plain form
11058 453663 460851 659125 418587 542307 372259 776172 555480 995332 316776 587285
11048 587285 894286 885620 619181 539848 532626 747340 646929 817723 722575 360916 609774
11037 609774 762072 652549 286146 512354 526238 309901 655802 448813 453907 553695
11027 553695 411371 611309 651192 863497 755208 498881 439826 457721 643114 232700
11016 452963 610362 591426 519249 756810 617745 239097 364001 23935 630829 722057
11006 722057 480555 797377 185140 777084 587532 429882 599761 623649 402559 397861
10996 397861 703642 694426 317747 699684 712196 589831 679541 645136 610180 588050 975946
10985 975946 648558 1162547 819570 973816 1040504 1179977 945064 1143131 1767773 1662657
10975A662657k64482M22010M81538j0905M47987n04469Q4713l84195L76948l65514
10965A946288p1463k54560k37975Q2352O7344J57674j40154K18627j38158J25195
10955A755170j99450L2427k67626j00217k54978j00052l57783J17466J46324B52376
10944B52514B3516K18725R3148A08498J91430e1970A259P8987e7690n1947j769
10933a11406A68453d6569l91894A39812l8322h5544A03553R7799J02568h5468
10922e786D9949L1832d0572l3868j057H1219b80237E1954O5266m5872i0416J8295
10910g2121a0060p2750A34412D0506J33209A7129b89849B51447A07471K38519
10900C45990h1514b9578r2118N278K4700a5030j70049M7767A63971j9987B205
$$ plain form
10975 1662657 1398175 1820185 2301723 2290818 2738805 2234336 2319049 1934854 2311802 1946288
10965 1946288 1874825 1620265 1382290 1464642 1531986 1689660 1549506 1768133 1629975 1755170
10955 1755170 1555720 1588147 1320521 1220304 965326 865274 507491 624957 771281 252376
10944 252514 23516 242241 335389 108498 299928 -51970 1259 80246 -57690 -109637 -111406
10933 -111406 168453 -46569 -438463 139812 101490 -85544 103553 201352 303920 -85468
10922 -5786 49949 81781 -40572 -74440 -75497 81219 -280237 51954 117220 71348 -90416 -72121
10910 -72121 -10060 -82810 134412 40506 173715 17129 -289849 251447 107471 345990
10900 345990 -81514 -29578 -121696 -116418 -91718 -15030 -185079 -137312 163971 143984 2205
10888B19117c04357b797l19185J44276B02855M2732B661J35112j759e0564q7628
10877a38192C2788c1420R314A47564o9421E68a82643A06718M6622h8386K602A59894
10864a47816C8725a63300A32636o5390K00085F5300K44054A0299a1281A33313
10853d1789J2711A49528O3516e1735I2996R8949C6578a82807A870a98840a2418
10841b3543j27213A9044b3412A83772p6228D4159b35631H9623e4147b1490B44061
10829b37062C29097H0258L2982P5722A7216P2208a9747n5666j20984a2636j1643
10818b4279F444R4897J59306j18377b46473C346b71625b4050E9606a73022q1441
10807b54463i3636j38455A48820i6736J2176j72144E2052a53530q3671a06149
$$ plain form
10888 219117 -304357 -2797 -321982 -177706 202855 245587 2661 137773 136014 -50564 -138192
10877 -138192 32788 -31420 -22106 147564 78143 568 -182643 106718 153340 -88386 -85784 159894
10864 -147816 38725 -163300 132636 67246 267331 65300 309354 10299 -11281 133313
10853 -41789 -29078 149528 213044 -51735 92996 191945 36578 -182807 1870 -198840 -12418
10841 -23543 -150756 19044 -23412 183772 107544 44159 -235631 89623 -54147 -21490 244061
10829 -237062 329097 80258 113240 188962 17216 89424 -19747 -75413 -196397 -12636 -24279
10818 -24279 6444 101341 260647 142270 -246473 3346 -271625 -24050 59606 -173022 -254463
10807 -254463 -93636 -232091 148820 -96736 -84560 -256704 52052 -153530 -237201 -106149
10796b38283a2184o1041q2292o5835e3425h136j26488A2081b06619c1598B82004
10784A4103a34554j67638j78733b18468J166K0520O0620q6397k9829A7787a59070
10772D8363e5524E8494a69036b5197j27978c6825k3038b1238R875F3346a32418
10760a58750N8867M6511l19819J15519A15241h6161N692G6160K06272a74835I4214
10748a45381K5253K3490B30994A5348J80687g1652A95503D5632g7036D5879b0723
10736c7457j39969A9072a63358O1531K0372j20532A27866D6205K75598A9815P2674
10725I2489k8182J12476p3594c95610D9784Q8770b13190R4067a7472M050o0657
10714g4079k25543j59751B90493a74953A27339i8266j50391g3247F1044c93937
$$ plain form
10796 -238283 -12184 -73225 -155517 -221352 -53425 -8136 -134624 12081 -206619 -31598 282004
10784 14103 -134554 -302192 -480925 -218468 -217302 -196782 -136162 -222559 -252388 17787 -159070
10772 48363 -55524 58494 -169036 -25197 -153175 -36825 -59863 -21238 -11363 63346 -132418
10760 -158750 -99883 -53372 -373191 -257672 115241 -86161 -80469 76160 282432 -174835 94214
10748 -145381 -120128 -96638 230994 15348 196035 -71652 195503 45632 -77036 45879 -20723
10736 -37457 -177426 19072 -163358 -101827 -81455 -201987 127866 46205 321803 19815 92489
10725 92489 64307 176783 103189 -395610 49784 138554 -213190 -119123 -17472 -13422 -74079
10714 -74079 -299622 -459373 290493 -174953 127339 -98266 -248657 -73247 61044 -393937
10703i012k38588M146A29293d942j62803A38418i6783j41958B93339b41004R6817
10692a44187A8591j724d11215a41900C30578D8377k981a71156g6196j36564j1989
10681b24749B52893b80461B45967a91976M2656D0356a3717j11420C68935a12031
10670a61709D5429F047b19098a04564l7080G9793K8764a43662H8716B5323a78383
10658C5573a79356j11676h6769D1445b1496n1686D0517J67730C8093p627q643
10647B1823d31616f6316A67000f3012n6555c8054J9017C1791b50058a23748D16328
10635h9482C18466j23827a41653O5302D3812o730f8419E7724A8394h0043A13277
10623a14467e7019A29994g962l9464e248j0037j28487O7927J0392K3954j42307
$$ plain form
10703 -9012 -247600 -243454 129293 -4942 -167745 138418 -96783 -238741 293339 -241004 -144187
10692 -144187 18591 16867 -411215 -141900 330578 48377 45396 -171156 -76196 -212760 -224749
10681 -224749 252893 -280461 245967 -191976 -149320 40356 -13717 -125137 368935 -112031
10670 -161709 45429 6047 -219098 -104564 -141644 79793 108557 -143662 88716 25323 -178383
10658 35573 -179356 -291032 -86769 41445 -21496 -73182 40517 208247 38093 30466 21823
10647 21823 -431616 -66316 167000 -63012 -119567 -38054 -19037 31791 -250058 -123748 416328
10635 -89482 318466 194639 -141653 -76351 43812 37082 -68419 57724 18394 -80043 113277
10623 -114467 -57019 129994 -7962 -47426 -5248 -15285 -143772 -75845 -65453 -41499 -183806
10612a83806l9241q090J8924D33818a77092F1296A1471J36885a89265o6607h5301
10600b20672c668k3561A7754b62638A55203d2746F1530i2356p0775f2287H399
10588B11983c8933j31663a5607j62495A17452J11187b97161H5738a53640k0411
10578a74051j66692B38299b62001a12118o8544o1917A0954K11350b10976I6000
10567a38109e9655j75019b4201j9208G9614J10268b16317a5072j00913A7415i9040
10555a29338j1921C05784a72390D1864K9427C0701L3732b43988g5095j11837B44428
10543A13185N1531K09195j17585a4752A58189n0561b49570h9236i397j06884B405
10531a75508K940E978J82672l2266a00018A7738a41093l5019j5233c5778D0041
$$ plain form
10612 -183806 -223047 -231137 -212213 433818 -177092 61296 11471 148356 -189265 -255872 -85301
10600 -220672 -3668 -27229 17754 -262638 155203 -42746 61530 -92356 -163131 -62287 8399
10588 211983 -38933 -170596 -15607 -178102 117452 228639 -297161 85738 -153640 -174051
10578 -174051 -340743 238299 -262001 -112118 -180662 -242579 10954 222304 -210976 96000
10567 -138109 -59655 -234674 -24201 -43409 79614 189882 -216317 -15072 -115985 17415 -99040
10555 -129338 -141259 305784 -172390 41864 71291 30701 64433 -243988 -75095 -186932 244428
10543 113185 164716 373911 256326 -14752 158189 107628 -249570 -89236 -9397 -116281 2405
10531 -175508 -172568 5978 188650 156384 -100018 17738 -141093 -176112 -191345 -35778 40041
10519a09351j6219j59045h7635j23281P3134A69112p5028b04716d0562l61359
10509d01921K2933b7505D5032f0829D5352d8150k27124g5155p5756A93997b3135
10497A25343Q5589a3563l55298J44679i5544j57607M6107c2318D24967b99934
10486c6445B25962b06077A40080R2403b665C31291j23602K66914k28204d711n0894
10475e5605A29508J96197j13349i3948c2461m7096j54865C86538a63607C12877
10464D5758b55178a23844C8384a13156j84304Q7518b8569A17185M9305f9049k5634
10453i4683p327M4792e037l33963b6483k79120J9368J17726A96440B3925d0702
10441A76088b07168f1677A58617g178F8593j8602b55484C64299c93878g4303A23106
$$ plain form
10519 -109351 -125570 -284615 -87635 -210916 -137782 169112 94084 -204716 -40562 -401921
10509 -401921 -378988 -27505 45032 -60829 45352 -48150 -275274 -75155 -150911 193997 -23135
10497 125343 210932 -13563 -368861 -224182 -95544 -253151 -207044 -32318 424967 -299934
10486 -36445 225962 -206077 140080 232483 -2665 331291 207689 474603 246399 -4711 -55605
10475 -55605 129508 325705 212356 -93948 -32461 -79557 -234422 386538 -163607 312877
10464 45758 -255178 -123844 38384 -113156 -297460 -209942 -28569 117185 166490 -69049 -94683
10453 -94683 -102010 -57218 -5037 -339000 -26483 -305603 -286235 -168509 196440 23925 -40702
10441 176088 -207168 -61677 158617 -7178 68593 49991 -255484 364299 -393878 -74303 123106
10429A40886c2139p6653A13839a32658a9622j04159j88533a25954c3600h091k83094
10418b91185f2756k90122a22505G0408c96974J63869m7826E5776c46424A4283
10407a71081h1306A87367O0341a35248I3127J95923b2942E395h5920I4278R967
10396A04245L2161D658K0761a94748Q2810G3959a59265B23575a49062E3703c273
10384B34781a7642G1209L18290j62903j9144L9988O5815j07638o9938B6231K23973
10373B50204J17913A49374J28983G9620C368L65504K61416A36814K05100M92426
10363H34340k53360B61197j09465N5992L25633a59061G8670K42251A51660j2786
10353A38874J35353K04770N15470D18063j85257J95321A28924a26356C21782J04907
$$ plain form
10429 140886 -32139 -108792 113839 -132658 -19622 -123781 -312314 -125954 -33600 -8091 -291185
10418 -291185 -62756 -352878 -122505 70408 -396974 -233105 -280931 55776 -346424 14283
10407 -171081 -81306 187367 247708 -135248 93127 289050 -22942 5395 -85920 94278 104245
10396 104245 136406 4658 25419 -194748 -111938 73959 -159265 223575 -149062 53703 -3273
10384 234781 -17642 71209 389499 226596 207452 247440 313255 205617 135679 26231 250204
10373 250204 368117 149374 278357 79620 3368 368872 630288 136814 341914 834340
10363 834340 580980 261197 151732 207724 533357 -159061 78670 320921 151660 138874
10353 138874 274227 478997 994467 418063 232806 428127 128924 -126356 321782 426689
10343D26689j50197D6393h5525F4718L56048A84156c19697H3889c9183B21352
10332A8000L1033L09821c51135B5645a07918d0728J6026n6634F5142K87819F72
10320A53100N3240k5173d0919A4112M8577O0322G657M77258E6353K2124a87495
10308D7141b60657A10492a70981A53213b82992E6674R7159B3110N7859M7393d12698
10296a7707B14386d7040k4229E3873J52464r8769Q2075a2884I4518c72004a1893
10284g606G0668j3150a86312L5451f606a587j06743d2804B56064q9822i8315I2944
10271b11083E379J08579B4859f2478A35934b5324B08181b40935c4215C7516R1513
10260A29029L0211K7662O0207K34125A98153C8918O24745H1499a08355A8674a41765
$$ plain form
10343 426689 276492 46393 -85525 64718 420766 184156 -319697 83889 -39183 221352
10332 18000 49033 358854 -351135 25645 -107918 -40728 -24702 -81336 65142 352961 672
10320 153100 206340 181167 -40919 14112 62689 123011 7657 484915 56353 78477 -187495
10308 47141 -260657 110492 -170981 153213 -282992 56674 153833 23110 80969 128362 -412698
10296 -17707 214386 -47040 -71269 53873 206337 107568 189643 -12884 94518 -372004 -11893
10284 -7606 70668 57518 -186312 -150861 -6606 -1587 -108330 -42804 256064 166242 -98315 92944
10271 -211083 5379 113958 24859 -62478 135934 -25324 208181 -240935 -34215 37516 129029
10260 129029 159240 186902 247109 481234 198153 38918 663663 81499 -108355 18674 -141765
10248B3536Q2476A6143c17634L6535i4757j89182h0667A72684K2884k3876a74324
10236b20970h2315J2341H2462a44049N5020C7532b83226g3906J874m7289r304
10225a28625m0537A05801g5594E0095b14077D8998b41197E4903b19142B06584
10214G3566i1086B1718a3424A23873h4504A08483a87749M5007B37501i4742A06301
10202a81746A34264K9994p0713C0472a7622l39197n9401D46850a43322A40245
10191h644j45189H4911K0801E0808c88713a03974M035l32252e6369F2812a41802
10179G1256b10132h1284j48631A55844m2061M4417a61410J4045e5010Q135B5792
10167A13897Q7614j9714a29147a8009o9268A9335a9426j6058p4135A6953c0690
$$ plain form
10248 23536 106012 16143 -317634 -281099 -94757 -283939 -80667 172684 195568 171692 -174324
10236 -220970 -82315 -69974 82462 -144049 -89029 37532 -283226 -73906 -72032 -119321 -128625
10225 -128625 -169162 105801 -75594 50095 -214077 48998 -241197 54903 -219142 206584
10214 73566 -91086 21718 -13424 123873 -84504 108483 -187749 -142742 237501 -94742 106301
10202 -181746 134264 164258 93545 30472 -17622 -356819 -416220 446850 -143322 140245
10191 -8644 -153833 84911 105712 50808 -388713 -103974 -99939 -432191 -56369 62812 -141802
10179 71256 -210132 -81284 -229915 155844 113783 158200 -161410 -147365 -55010 -46875 25792
10167 113897 201511 181797 -129147 -18009 -87277 19335 -19426 -35484 -109619 16953 -30690
10155I5117a78349D6615b11276B16615b28691A21154d64651K22483K7165F704
10144A4359f2122k31626f2676G1217a43462Q754A01177K03565g6125j10433E7585
10132I7548a00562A44538l6486c07836N6741b0247I1646b81140A74043a89888
10121b85160h5979j53647j57578F3624J50381C2022J05360g7545a8725q4352k24240
10110c27317a43405J020A9894a51036H7305a37283G9199c09439H7368L01498d4154
10098a52711L3195K8701j52962B7575K35848i0376j56699j80352C59476b07953
10087B97019f3501k08511L5991c9155A91870a47682k9111D9862a98641J2837I3015
10075C9702c84186E0224a8223j90174R3438F8114a60109L3464j10360c4829p173
$$ plain form
10155 95117 -178349 46615 -211276 216615 -228691 121154 -464651 -242168 -215003 6704
10144 14359 -62122 -293748 -62676 71217 -143462 -134708 101177 304742 -76125 -186558 57585
10132 97548 -100562 144538 108052 -307836 -251095 -20247 91646 -281140 174043 -189888
10121 -285160 -85979 -239626 -397204 63624 214005 32022 137382 -77545 -18725 -103077 -327317
10110 -327317 -143405 -142385 19894 -151036 87305 -137283 79199 -309439 87368 388866 -44154
10098 -152711 -119516 -90815 -243777 27575 263423 -90376 -247075 -427427 359476 -207953
10087 297019 -63501 -272012 -236021 -39155 191870 -147682 -176793 49862 -198641 -185804 93015
10075 39702 -384186 50224 -18223 -208397 -114959 68114 -160109 -126645 -237005 -34829 -42002
10064d2002m28485a26955F0585l897J7644k9183c83120A02501L04911A6104h6106
10052I0927J77249F6145a43133q9577a01504j48608A80963l8276c60614A0328
10041c31763a47293L7657j3875B42681a00650I0147l078b65070J25153l3301A89391
10029e57717A35582a43463J6912A76684C0023e38255C29137b43130e3371E111
10018a71639O9573j22398b5058j63266f2053A24836a8407r2839C4205c17196A967
10006B51628b22204a03554I1814g0678m0872A06625N9542a1009A5150a34011F2050
9994a37345b8392p4335m1427B0356b78419R4250A31933i2833C6250a11926H9351
9982f6903j52450f3247j3822j15969C1558Q7042k552R790a68904B9805i3121J2041
$$ plain form
10064 -42002 -470487 -126955 60585 56688 74332 45149 -383120 102501 407412 16104 -86106
10052 90927 268176 66145 -143133 -232710 -101504 -250112 180963 142687 -360614 10328
10041 -331763 -147293 -109636 -123511 242681 -100650 90147 87069 -265070 -139917 -173218 189391
10029 -557717 135582 -143463 -126551 176684 30023 -538255 329137 -243130 -53371 5111
10018 -171639 -102066 -224464 -25058 -188324 -62053 124836 -18407 -111246 34205 -317196 1967
10006 251628 -222204 -103554 91814 -70678 -111550 106625 166167 -11009 15150 -134011 62050
9994 -137345 -28392 -102727 -144154 20356 -278419 -184169 131933 -92833 36250 -111926 89351
9982 -66903 -219353 -63247 -77069 -193038 31558 118600 116048 125838 -168904 29805 -93121 -81080
9970h1080k59143i4900M918j35916M9363B4704O5205e0709k48970h8757c177I9405
9957a34290k75170J72159c3029k37356j15506H0018h5483D1501a02510E4211m631
9946D9580K1730a07923m3930j33798C9619c83363b6466k74518G3647c73789g4813
9934b25365c5378o9278f279A24891D285O721K42744j25284a59416A88822K8934
9923B17756a5051l9529j27123I3036c55818A77057n2169J52207h7121q7180a6390
9911b72929A13079d56583b2092k711B447b13439A40450d992l9744A0501K11098
9900B21599f6926k26822J35394A59096a09521C18595b14628m4546b2030o4384
9890h6414c7225A16034g8228B5139a58342A43905c26848Q4151A51882J82160D2986
$$ plain form
9970 -81080 -340223 -94900 -89982 -225898 -176535 24704 89909 -50709 -299679 -88757 -3177 99405
9957 -134290 -409460 -237301 -33029 -270385 -385891 80018 -85483 41501 -102510 54211 49580
9946 49580 71310 -107923 -151853 -285651 39619 -383363 -26466 -300984 73647 -373789 -74813
9934 -225365 -35378 -104656 -6279 124891 4285 11006 253750 128466 -159416 188822 217756
9923 217756 -15051 -54580 -181703 93036 -355818 177057 124888 277095 -87121 -174301 -16390
9911 -272929 113079 -456583 -22092 -24803 2447 -213439 140450 -4992 -44736 10501 221599
9900 221599 -66926 -293748 -158354 159096 -109521 318595 -214628 -259174 -22030 -86414
9890 -86414 -37225 116034 -78228 25139 -158342 143905 -326848 -242697 151882 334042 42986
9878a48920b7715p8718c6029j50745b0058B72827a84047j33371J34153j6878q1850
9867b81993J05218K8065r9308a6224B66859q2077A2378K9190A2814e677m32890
9856d38567h8741D6645j6924c86737C31178d19616E278P6400a51616k54133B1074
9844b54460O0084P9054j07261B20892A05114f35697b58790N5706l1227J10464
9834a23847Q782c9631k01141I568i878j11546k33801A43103d764j16113j0501
9823a31378M1899B5590a55857N6480E0912b21417B4569a83894D5683e6933D5928
9811A14069A3752d44416J46205a34762B03444l7851e0479H1265J10919e3794A66837
9799a79054l38236a85337j7506c9499k77441B88667j36292a46895H0584a6645
$$ plain form
9878 -148920 -27715 -106433 -36029 -186774 -20058 272827 -184047 -317418 -183265 -200143 -281993
9867 -281993 -176775 -148710 -248018 -16224 266859 184782 12378 41568 12814 -5677 -438567
9856 -438567 -88741 46645 29721 -386737 331178 -419616 5278 81678 -151616 -405749 21074
9844 -254460 -194376 -115322 -222583 220892 105114 -635697 -258790 -203084 -234311 -123847
9834 -123847 -115065 -39631 -240772 9568 -9878 -121424 -355225 143103 -4764 -120877 -131378
9823 -131378 -89479 25590 -155857 -99377 50912 -221417 24569 -183894 45683 -56933 45928
9811 114069 13752 -444416 -298211 -134762 203444 165593 -50479 81265 192184 -53794 166837
9799 -179054 -517290 -185337 -202843 -39499 -316940 288667 152375 -146895 80584 -16645
9788A982P5970b4163I6683g3409j07404O7546L9388A19997j0199h0153j89005
9777b69158A3403h379j07992G5325b74166B29715d19548J27010a45386b1792j58950
9766a80742Q9049n4280m4851C83014I4564c26569E8358K6956g6693G8152J34313
9755B12465a34699I3500a41571B90314a47029B17350r6966C1372Q5141B0965b16617
9743b18217N1603j28467I4171c11643J32630g4246j68133J00750L4654j28919
9733b35894A53221g7165b8031j10816I4360a09189A01422A9177b19784B74241
9722b04415A66145D2607f6633A59990b16931H7667M114b28626N6097e7376E8188
9710A85461d7736m3732m9443j809j40303i0642f00C4380A4839m220a36289G8225
$$ plain form
9788 1982 77952 -24163 96683 -73409 -180813 -113267 -73879 119997 109798 -80153 -269158
9777 -269158 13403 -8379 -116371 75325 -274166 229715 -419548 -292538 -145386 -21792 -180742
9766 -180742 -91693 -145973 -190824 383014 94564 -326569 58358 85314 -76693 78152 212465
9755 212465 -134699 93500 -141571 290314 -147029 217350 120384 31372 116513 20965 -216617
9743 -218217 -166614 -295081 94171 -311643 -179013 -74246 -242379 -141629 -106975 -235894
9733 -235894 153221 -77165 -28031 -138847 94360 -109189 101422 19177 -219784 274241
9722 -204415 166145 42607 -66633 159990 -216931 87667 91781 -228626 -172529 -57376 58188
9710 185461 -47736 -91468 -140911 -142720 -283023 -90642 -600 34380 14839 10619 -136289 78225
9697b40051A46702a23947l9411j47288d0212k9070k0327A83700c91901a30185
9686A34037L4772a74761A07946b02320A04146A4440K30199D9774e7706A52336
9675d13075A47574o116K0870a65061J6427k01997a05540H8022l1393P6656a93586
9663a11653d9441j18801E6079a46939j64758D2599J9079B6700d693o6600g191
9651E9300g9421j25958k06314g3961c6890l1148g225j71525m751o2679Q694J11215
9639a26271o4945B8492J36811k8281f8388j36536n6186e0983p9540K856E4476
9627E2295c05325B1263L8275L2917J29108a99116l8482i7898R654a8240A09385
9615a83583A60767b8094r6978B16200E3089b0848G1399a33012A73062a27399N9075
$$ plain form
9697 -240051 146702 -123947 -163358 -310646 -40212 -69282 -89609 183700 -391901 -130185
9686 134037 168809 -174761 107946 -202320 104146 14440 244639 49774 -57706 152336
9675 -413075 147574 141458 162328 -165061 -148634 -350631 -105540 88022 56629 133285 -193586
9663 -111653 -49441 -168242 56079 -146939 -311697 42599 61678 26700 -4693 -71293 -7191
9651 59300 -79421 -205379 -411693 -73961 -36890 -68038 -7225 -178750 -183501 -246180 -237486 -126271
9639 -126271 -191216 28492 165303 137022 -68388 -204924 -261110 -50983 -130523 -127667 54476
9627 52295 -305325 21263 59538 92455 221563 -199116 -237598 -97898 -88244 -18240 109385
9615 -183583 160767 -28094 -125072 216200 53089 -20848 71399 -133012 173062 -127399 -68324
9604f8324A59418M8784b85680N6628j72160a15970B32176B9054d3944C6643c5863
9592c87945D7827b01951p2258B0790H843K5690P1060f06981b29410B42508b70715
9580b15566a1102D6534i1207E7656e4745n1293k6319A3077L0a80778b116A08209
9567a43336k4464M9692A3171M7201J12753b02166A35097l4543b26189i0135L921
9556h6214I2918B7627c15480P4364C48712b24251C2074a1281m29383b0627j38352
9545a58979K741j99046J48934f15A49586a14005k1966A16513N3735f307j05393
9534a11700j30521A74190E3513i5986k02783a33419P981M7667q6779O1530j35080
9523b38100K9332Q2053j30775J01590B15516H9R77b52533J01432c4239D3597K49189
$$ plain form
9604 -68324 159418 208202 -285680 -229052 -401212 -115970 232176 29054 -43944 36643 -35863
9592 -387945 47827 -201951 -274209 20790 8843 34533 105593 -606981 -229410 242508 -270715
9580 -215566 -11102 46534 -91207 57656 -54745 -106038 -132357 13077 13107 -180778 -2116 108209
9567 -143336 -167800 -118108 13171 60372 173125 -202166 135097 100554 -226189 -90135 -86214
9556 -86214 92918 27627 -315480 -241116 348712 -224251 32074 -11281 -440664 -20627 -158979
9545 -158979 -156238 -355284 -206350 -615 149586 -114005 -135971 116513 170248 -6307 -111700
9534 -111700 -242221 174190 53513 -95986 -298769 -133419 -125438 -77771 -164550 -103020 -238100
9523 -238100 -208768 -126715 -257490 -155900 215516 89 1066 -252533 -151101 -34239 43597 292786
9511B92786i8520A23527d2336B44094j17378L2035a64571r0407M1491d6711m4754
9500i1465A8582I236K7462h6249k6130p6305C64050a72164A51133C968h1044h75
9487A20091J2364D0467c5958j32989a5734B00775G8280a77881f2264l9587A05793
9475A29486a93928I9780g8731k19656a16558j09001B22282D3453a38937B02470
9464A20113D4570I803a1715j72159I2095b54041b0616k04373M1819A73301a54050
9452C8774I408L1241c63978a66356j34072I0524a61164A10136b04271F7626K58647
9441C26273b21263B01992B6931K44895j8687E5617a37128j87617R4395E1949J52389
9430B04338a07210L4524k31533J34438j13642C3840K70486h8082L0637b0969k76800
$$ plain form
9511 292786 -98520 123527 -42336 244094 126716 158751 -164571 -254978 -213487 -46711 -91465
9500 -91465 18582 9236 36698 -86249 -112379 -188684 364050 -172164 151133 3968 -81044 -875
9487 120091 132455 40467 -35958 -168947 -15734 200775 78280 -177881 -62264 -101851 105793
9475 129486 -193928 99780 -78731 -298387 -116558 -225559 222282 43453 -138937 202470
9464 120113 44570 9803 -11715 -183874 92095 -254041 -20616 -224989 -183170 173301 -154050
9452 38774 9408 40649 -363978 -166356 -300428 90524 -161164 110136 -204271 67626 326273
9441 326273 -221263 201992 26931 271826 253139 55617 -137128 -324745 -230350 51949 204338
9430 204338 -107210 -72686 -304219 -169781 -283423 33840 304326 -88082 -57445 -20969 -297769
9419b97769h2958A0506c6156p49A98287I4378d03233h0825C9883b92860R3875
9408a98985a6826m5113H291J70476K326b64517j17623D8738A5118i1494L7226
9397e4268k66962a32618C40698A49883d5486b1968j49555M3240k26651b4612j65040
9386a89652i4239k636l0923e4480k88149B53090g7279A74934F1043b62750A7947
9374d03179J72550c3822k53048e3809r5235F6166O8546m3316l2557b15722k8004
9363b43726f6192l81170K22034j00529G8684a86188j22838h3566G323K4727b94375
9351h1928k386A18274J52457F7934l0755c70924a4167k38126a11817B0879J53570
9340A74449L6098P2451a65813J9957j33203F7081a8367k16025j34046h1804c7265
$$ plain form
9419 -297769 -82958 10506 -36156 -36905 198287 94378 -403233 -80825 39883 -292860 -198985
9408 -198985 -16826 -61939 8291 178767 181093 -264517 -382140 48738 15118 -91494 -54268
9397 -54268 -321230 -132618 340698 149883 -45486 -21968 -171523 -128283 -354934 -24612 -189652
9386 -189652 -94239 -96875 -127798 -54480 -342629 253090 -77279 174934 61043 -262750 17947
9374 -403179 -230629 -33822 -286870 -53809 -149044 66166 134712 91396 58839 -215722 -243726
9363 -243726 -66192 -447362 -225328 -325857 78684 -186188 -309026 -83566 7323 32050 -294375
9351 -81928 -84314 118274 270731 67934 37179 -370924 -14167 -252293 -111817 20879 174449
9340 174449 210547 282998 -165813 -145856 -279059 67081 -18367 -234392 -368438 -81804 -37265
9328A84322O0683d6380A54276j414M7190a34021j39767J30621K3935j19053E3789
9316I8490K88293A25506a90417P1330A86731c39265H5250J54831h858D2283a23742
9304H7760J8631i6541c8955E19330A56560E5550O1016c53656J36985A03393k9798
9293G3595a70916j9984Q132Q8088J7575C7219K86911b8255o3082G7580B9073a26728
9280d02252H3583d7780k29025J31708n6421A9244a80011j94059f63l44118B69248
9268g4249j71717C33697c47166H2371a50720j65806a04454A56621e3670k59563
9258c13233b0927k03894M3410O4441A14589J09452a23705A43854E0854a10352
9247A45412i9053k3689C27336A97K03837a49677a8779a825k08144R1953j66459
$$ plain form
9328 184322 245005 -46380 154276 152862 200052 -134021 -273788 -143167 -119232 -238285 53789
9316 98490 386783 125506 -190417 -119087 186731 -339265 85250 240081 -8858 42283 -123742
9304 87760 106391 -96541 -38955 519330 156560 55550 116566 -353656 -216671 103393 73595
9293 73595 -170916 -190900 -182768 -94680 -77105 37219 324130 -28255 -91337 77580 29073 -126728
9280 -402252 83583 -47780 -276805 -145097 -201518 19244 -180011 -374070 -663 -344781 269248
9268 -74249 -245966 333697 -347166 82371 -150720 -316526 -104454 156621 -53670 -313233
9258 -313233 -20927 -224821 -181411 -116970 114589 224041 -123705 143854 50854 -110352
9247 145412 -99053 -122742 327336 197 204034 -149677 -18779 -1825 -209969 -118016 -284475
9236b84475B17812n3318a54338B00017a02166j1121j807K7243p3861B18621j8388
9225B00233a27380f006B48160a66975M9408q8651a2887l1B4415a67080N9712A36330
9212F3190b22555r799P3144o6390E7779a52174f8693k07972J29776O1206A49131
9200B43174a28481E9283h0639A79963F1226a85632j30435F5372h430A44934a04235
9188c25248B8884i020m6706I0643b08778k6480a5422A40887i250j69896A68319
9176h0136B91166a45779f7968k60247a1972m92890b27773a03474M2747A37222
9165c8552l3932k16211a09498A92755H0956k3561a10452e1662j08596j46275Q1005
9154b25528o8910P8864Q2714r2914n4636P4840e3728A69585c99943C23698a22534
$$ plain form
9236 -284475 217812 164494 -154338 200017 -102166 -113287 -115094 -87851 -161712 218621 200233
9225 200233 -127380 -6006 248160 -166975 -117567 -206218 -12887 -12918 24415 -167080 -107368 136330
9212 63190 -222555 -232354 -159210 -225600 57779 -152174 -68693 -276665 -146889 -85683 149131
9200 243174 -128481 59283 -80639 179963 61226 -185632 -316067 65372 -8430 144934 -104235
9188 -325248 28884 -9020 -55726 90643 -208778 -235258 -15422 140887 -9250 -179146 168319
9176 -80136 291166 -145779 -67968 -328215 -11972 -504862 -227773 -103474 -60727 137222
9165 -38552 -72484 -288695 -109498 192755 80956 57395 -110452 -51662 -160258 -306533 -225528
9154 -225528 -294438 -215574 -132860 -225774 -280410 -205570 -53728 169585 -399943 323698 -122534
9142b7215A79447n4505i5886q5448k1080Q3208L1305j41076i1995j24241b8446
9130c637j76458L5618b4774j2707B43362i5563k67805E7340M7690C2711N4324
9119H7035a99659c0836G6149a26309E0149c21447A47760J47412h8589L7816l54943
9108d05716b7535q5770D56632H7258P4157b31514A37665b71023m7945J01543I1763
9096a74341b1778k61244J14538A81845b1411C3648R2714b87586H3277g4003j1262
9085h5265k19713j60954D1654g4991E8171M8446a15298d2827l62500H4842J02671
9074A87513a89478h9701D0169c52600C32880a0880k07569H006J86563a48693A3329
9062a63154d7824k35999A04097J86126b1221j40083M5485B03716C7159M7937c1845
$$ plain form
9142 -27215 179447 124942 -95886 -181334 -202414 -119206 -87901 -228977 -91995 -216236 -28446
9130 -3637 -180095 -144477 -24774 -37481 243362 -95563 -363368 57340 105030 32711 87035
9119 87035 -199659 -30836 76149 -126309 50149 -321447 147760 295172 -88589 -50773 -405716
9108 -405716 -27535 -113305 456632 87258 161415 -231514 137665 -271023 -318968 -217425 91763
9096 -174341 -21778 -283022 -168484 181845 -21411 33648 126362 -287586 83277 -74003 -85265
9085 -85265 -304978 -465932 41654 -74991 58171 106617 -115298 -42827 -405327 84842 187513
9074 187513 -189478 -89701 40169 -352600 332880 -10880 -218449 8006 194569 -148693 13329
9062 -163154 -47824 -283823 104097 290223 -21221 -161304 -115819 203716 37159 85096 -31845
9050a81668A19089a33718B78921a54322E21d3420r8217D8501a79435e1832m4212
9039i6044A17717b52885E9a63275j59901d4660k11311B21104k1145B5552N6844
9028H2396M8927a53896j6600J8813A87323a75356A66478c63424J80933A54701
9017I3483a51635j05580B14237b76009a33293d5353k37092P7119k0859j41698
9007c67883A08448N6777k8171A2952O296b29044j35933A66400h9565c6176n1022
8996h7198A08859a71145F3642a72055B00806b17816E7263c19587G966a23701j9978
8985a43679j0282G5935M300a32834k42862a22273C9785K57197i2648I7533Q0897
8974A78430a3431j11767I3647J04162f8949C14439I9711c12835D953J0636J8530
$$ plain form
9050 -181668 119089 -133718 278921 -154322 521 -43420 -141637 48501 -179435 -51832 -96044
9039 -96044 117717 -252885 59 -163275 -323176 -44660 -255971 221104 199959 25552 82396
9028 82396 131323 -153896 -170496 -151683 187323 -175356 166478 -363424 -182491 154701
9017 93483 -151635 -257215 214237 -276009 -133293 -45353 -282445 -205326 -226185 -367883
9007 -367883 108448 165225 137054 12952 19248 -229044 -364977 166400 -89565 -36176 -87198
8996 -87198 108859 -171145 63642 -172055 200806 -217816 57263 -319587 7966 -123701 -143679
8985 -143679 -153961 75935 80235 -132834 -375696 -122273 39785 296982 -92648 97533 178430
8974 178430 -13431 -125198 93647 197809 -68949 314439 99711 -312835 4953 15589 34119
8963C4119B773P6816b68E8253c08058r794b2829k60037g3719C32693A53774C0978
8950B22742o9115a76347g2328A00720b3055H847J95577a03533A14873f9787A49332
8938B117h8625B19714a1222j78464L6503A13797a21785p8165I4165m7042a52197
8926B8408d0506o1223j9093A7692J69901M33273B86933J8861j05322a67714j17604
8915b85318M7448B1988J65736d3666J0312k70545a8647B38190a00031b6561P550
8904a9011B2555a12011K4289J7039a571A93890c26632A30410a61108N8842B83889
8892a16718A39834c9443J2279p7856J3876d5516j08645M8633j39210J19071j3372
8881a39039e3656B56704a99832d8322b2955m8557l95054a264k20660e9077l30168
$$ plain form
8963 34119 2773 79589 -268 58253 -308058 -317852 -22829 -282866 -73719 332693 153774 30978
8950 222742 153627 -176347 -72328 100720 -23055 8847 204424 -103533 114873 -69787 149332
8938 2117 -88625 219714 -11222 -189686 -153183 113797 -121785 -199950 94165 47123 -152197
8926 28408 -40506 -101729 -120822 17692 187593 620866 286933 305794 200472 -167714 -285318
8915 -285318 -237870 21988 187724 -43666 -33354 -303899 -18647 238190 -100031 -26561 -19011
8904 -19011 22555 -112011 -87722 -70683 -1571 193890 -326632 130410 -161108 -102266 283889
8892 -116718 139834 -39443 -27164 -105020 -91144 -45516 -154161 -105528 -244738 -125667 -139039
8881 -139039 -53656 256704 -199832 -48322 -22955 -71512 -466566 -1264 -221924 -59077 -389245
8870c89245E3828a08044A63917c8710p5127k1934j07275A50057b78413A96519
8859B24531E7880b58523m299f8772A61990a64436l36964C0339j4336c14705E60
8847A45805A6512b1243A58807a39477F0672J23654D3321a39782N510j12526i3349
8835b3412j93172q3838A03981a49086G5543c0681C7071Q1092C2188b26491E2504
$$ plain form
8870 -389245 53828 -108044 163917 -38710 -113837 -135771 -243046 150057 -278413 196519
8859 224531 57880 -258523 -262822 -68772 161990 -164436 -501400 30339 16003 -314705 560
8847 145805 16512 -21243 158807 -139477 60672 184326 43321 -139782 -134272 -246798 -93349
8835 -23412 -216584 -300422 103981 -149086 75543 -30681 37071 118163 32188 -226491 52504
$$ [...]
##END NTUPLES=NMR SPECTRUM
##END=
