##TITLE=AC1730_SEN00003_9275787_UknHwYGCLf
##JCAMPDX= 6.0         $$ Bruker NMR JCAMP-DX V2.0
##DATA TYPE= NMR SPECTRUM
##DATA CLASS= NTUPLES
##ORIGIN= BRUKER
##OWNER= Administrator
$$ 1.72 TOPSPIN		Version 2.1
$$ 2015-07-14 19:47:49.166 -0700  Administrator@X
$$ Compression mode = diff/dup
##.OBSERVE FREQUENCY= 400.02188249412
##.OBSERVE NUCLEUS= ^1H
##.ACQUISITION MODE= SIMULTANEOUS (DQD)
##.ACQUISITION SCHEME= undefined
##.AVERAGES= 64
##.DIGITISER RES= 22
##SPECTROMETER/DATA SYSTEM= spect
##.PULSE SEQUENCE= noesygpps1d.comp
##.SOLVENT NAME= COFFEE_meoh
##.SHIFT REFERENCE= INTERNAL, COFFEE_meoh, 1, 14.96101
##AUDIT TRAIL= $$ (NUMBER, WHEN, WHO, WHERE, PROCESS, VERSION, WHAT)
$$ ##TITLE= Audit trail, TOPSPIN		Version 2.1
$$ ##JCAMPDX= 5.01
$$ ##ORIGIN= Bruker BioSpin GmbH
$$ ##OWNER= Administrator
$$ $$ E:\/data/COFFEE/nmr/AC1730_SEN00003_9275787_UknHwYGCLf/12/pdata/1/auditp.txt
$$ ##AUDIT TRAIL=  $$ (NUMBER, WHEN, WHO, WHERE, PROCESS, VERSION, WHAT)
(   1,<2015-07-14 19:47:42.916 -0700>,<Administrator>,<X>,<go>,<TOPSPIN 2.1>,
      <created by zg
	started at 2015-07-14 19:36:13.322 -0700,
	POWCHK enabled, PULCHK disabled,
       configuration hash MD5:
       21 0F 79 D6 B3 7B B4 F6 88 20 88 DB 03 48 BD 9F
       data hash MD5: 64K
       DA 45 7A E2 B6 40 6A 4B B7 39 18 5E D4 6F 83 12>)
(   2,<2015-07-14 19:47:46.197 -0700>,<Administrator>,<X>,<proc1d>,<TOPSPIN 2.1>,
      <Start of raw data processing
       efp LB = 0.3 FT_mod = 6 PKNL = 1 PHC0 = 0 PHC1 = 0 SI = 128K 
       data hash MD5: 128K
       99 F8 CC 3C C4 66 F5 02 FB 3C C7 45 B4 9B D8 B2>)
(   3,<2015-07-14 19:47:47.291 -0700>,<Administrator>,<X>,<proc1d>,<TOPSPIN 2.1>,
      <pk PHC0 = -86.67114 PHC1 = 0 
       data hash MD5: 128K
       A7 EB 7C 84 61 87 AC 23 9A 24 D4 CA CD 63 E1 86>)
(   4,<2015-07-14 19:47:48.010 -0700>,<Administrator>,<X>,<proc1d>,<TOPSPIN 2.1>,
      <abs ABSG = 1 
       data hash MD5: 128K
       31 EA 23 D9 DA C5 5D 65 5D AB 1A 3A 2E 3C C5 5E>)
(   5,<2015-07-14 19:47:48.432 -0700>,<Administrator>,<X>,<proc1d>,<TOPSPIN 2.1>,
      <abs ABSG = 2 
       data hash MD5: 128K
       B7 77 8C 69 0E A0 E9 3F 7E D6 CE FF 82 89 91 C6>)
(   6,<2015-07-14 19:47:48.541 -0700>,<Administrator>,<X>,<proc1d>,<TOPSPIN 2.1>,
      <abs ABSG = 3 
       data hash MD5: 128K
       AA 63 3E EA 35 8F 62 A0 0A 7D 65 54 4D 2F 26 F8>)
(   7,<2015-07-14 19:47:48.650 -0700>,<Administrator>,<X>,<proc1d>,<TOPSPIN 2.1>,
      <abs ABSG = 4 
       data hash MD5: 128K
       27 64 D8 14 BB 4E 4A BE C4 70 06 BF 0C D9 A8 AB>)
(   8,<2015-07-14 19:47:48.838 -0700>,<Administrator>,<X>,<proc1d>,<TOPSPIN 2.1>,
      <abs ABSG = 5 
       data hash MD5: 128K
       42 46 2A BA FC 19 D7 78 E8 7B AC E2 A3 E4 F7 2E>)
$$ ##END=
$$ 
$$ $$ hash MD5
$$ $$ C5 A6 2E 26 B2 12 C7 8F 6C 0A 0D ED 61 67 A1 DB
##$RELAX= 
##$RELAX= 
##$RELAX= 
##$RELAX= 
##$RELAX= 
##$RELAX= 
##$RELAX= 
##$RELAX= 
$$ Bruker specific parameters
$$ --------------------------
##$DU= <E:\>
##$EXPNO= 12
$$ [...]
##$TP07= 0
##$TPNAME0= <>
##$TPNAME1= <>
##$TPNAME2= <>
##$TPNAME3= <>
##$TPNAME4= <>
##$TPNAME5= <>
##$TPNAME6= <>
##$TPNAME7= <>
##$TPOAL= (0..7)
0.5 0.5 0.5 0.5 0.5 0.5 0.5 0.5
##$TPOFFS= (0..7)
0 0 0 0 0 0 0 0
##$TUNHIN= 0
##$TUNHOUT= 0
##$TUNXOUT= 0
##$USERA1= <user>
##$USERA2= <user>
##$USERA3= <user>
##$USERA4= <user>
##$USERA5= <user>
##$V9= 5
##$VALIST= <valist>
##$VCLIST= <CCCCCCCCCCCCCCC>
##$VD= 0
##$VDLIST= <DDDDDDDDDDDDDDD>
##$VPLIST= <PPPPPPPPPPPPPPP>
##$VTLIST= <TTTTTTTTTTTTTTT>
##$WBST= 2048
##$WBSW= 25
##$XGAIN= (0..3)
0 0 0 0
##$XL= 0
##$YL= 0
##$YMAX_a= 6193477
##$YMIN_a= -11625538
##$ZGOPTNS= <>
##$ZL1= 120
##$ZL2= 120
##$ZL3= 120
##$ZL4= 120
##$ABSF1= 14.96101
##$ABSF2= -5.597172
##$ABSG= 5
##$ABSL= 3
##$ALPHA= 0
##$AQORDER= 0
##$ASSFAC= 0
##$ASSFACI= 0
##$ASSFACX= 0
##$ASSWID= 0
##$AUNMP= <proc_prof1d_extract.lims>
##$AXLEFT= 0
##$AXNAME= <>
##$AXNUC= <1H>
##$AXRIGHT= 0
##$AXTYPE= 0
##$AXUNIT= <>
##$AZFE= 0.1
##$AZFW= 0.1
##$BCFW= 0
##$BC_mod= 0
##$BYTORDP= 0
##$COROFFS= 0
##$CY= 15
##$DATMOD= 1
##$DC= 0
##$DFILT= <>
##$DTYPP= 0
##$F1P= 0
##$F2P= 0
##$FCOR= 0.5
##$FTSIZE= 131072
##$FT_mod= 6
##$GAMMA= 0
##$GB= 0
##$INTBC= 1
##$INTSCL= 1
##$ISEN= 128
##$LB= 0.3
##$LEV0= 0
##$LPBIN= 0
##$MAXI= 10000
##$MC2= 0
##$MEAN= 0
##$ME_mod= 0
##$MI= 0
##$NCOEF= 0
##$NC_proc= -2
##$NLEV= 6
##$NOISF1= 0
##$NOISF2= 0
##$NSP= 0
##$NTH_PI= 0
##$NZP= 0
##$OFFSET= 14.96101
##$PC= 1
##$PHC0= -86.67114
##$PHC1= 0
##$PH_mod= 1
##$PKNL= yes
##$PPARMOD= 0
##$PPDIAG= 0
##$PPIPTYP= 0
##$PPMPNUM= 2147483647
##$PPRESOL= 1
##$PSCAL= 4
##$PSIGN= 0
##$PYNMP= <proc.py>
##$REVERSE= no
##$SF= 400.020009630852
##$SI= 131072
##$SIGF1= 0
##$SIGF2= 0
##$SINO= 400
##$SIOLD= 131072
##$SPECTYP= <>
##$SREGLST= <1H.CDCl3>
##$SSB= 0
##$STSI= 131072
##$STSR= 0
##$SW_p= 8223.68421052631
##$SYMM= 0
##$S_DEV= 0
##$TDeff= 65536
##$TDoff= 0
##$TI= <>
##$TILT= no
##$TM1= 0
##$TM2= 0
##$TOPLEV= 0
##$USERP1= <user>
##$USERP2= <user>
##$USERP3= <user>
##$USERP4= <user>
##$USERP5= <user>
##$WDW= 1
##$XDIM= 131072
##$YMAX_p= 414382870
##$YMIN_p= -11721
##$CURPLOT= <Network HP LaserJet P1505>
##$CURPRIN= <$Network HP LaserJet P1505>
##$DFORMAT= <normdp>
##$LAYOUT= <+/1D_H.xwp>
##$LFORMAT= <normlp>
##$PFORMAT= <normpl>
##$SURQMSG= 1
$$ End of Bruker specific parameters
$$ ---------------------------------
##NTUPLES= NMR SPECTRUM
##VAR_NAME=  FREQUENCY,     SPECTRUM/REAL,   SPECTRUM/IMAG
##SYMBOL=    X,             R,               I
##VAR_TYPE=  INDEPENDENT,   DEPENDENT,       DEPENDENT
##VAR_FORM=  AFFN,          ASDF,            ASDF
##VAR_DIM=   131072,        131072,          131072
##UNITS=     HZ,            ARBITRARY UNITS, ARBITRARY UNITS
##FACTOR=    0.0627417313425164, 1,          1
##FIRST=     8223.62146879497, 1033,         -55402
##LAST=      0,             2604,            -54951
##MIN=       0,             -11721,          0
##MAX=       8223.62146879497, 414382870,    0
$$ Real data points
##PAGE= N=1
##DATA TABLE= (X++(R..R)), XYDATA
$$ [...]
65143 258078 274819 292937 313099 335553 359450 383407 406294 427438 446581 463962 480176
65132 480176 495742 510764 524856 537072 545943 550074 549062 543829 535929 526578 516239 504865 492308
65119 492308 478547 463566 447087 428575 407775 385315 362625 341112 321367 303152 286124
65108 286124 270481 256796 245247 235255 226093 217602 209955 202874 195722 188513 182197 177550 174226
65095 174226 171274 168211 165069 161802 158345 155176 153165 152692 153290 154159 154715 154743 154437 154251 154298 153951 152516
65078 152516 150291 148435 147706 147830 148202 148672 149422 150470 151621 152569 152865 152141 150636 149175 148351 147961 147460
65061 147460 146688 145910 145385 145155 145078 144867 144380 144048 144681 146506 148701 150261 151083 151776 152620 153222 153138 152338
65043 152338 151037 149485 148024 146964 146218 145353 144116 142636 141006 139034 136672 134377 132680 131586 130758
65028 130758 130181 130103 130348 130225 129459 128780 129084 130246 131327 131894 132487 133569 134669 135039 134759 134574 134793 134961
65010 134961 134692 134277 134308 135107 136695 138934 141401 143390 144462 144948 145710 147405 150048 153116 155916 157993
64994 157993 159390 160464 161369 161853 161748 161454 161660 162592 163841 164955 165994 167364 169217 171176 172655 173420
64978 173420 173758 174063 174278 173880 172508 170499 168611 167177 165763 163809 161486 159570 158434 157470 155807
64963 155807 153372 150868 148744 146757 144665 142829 141719 141197 140746 140173 139545 138620 136992 134868 133089
64948 133089 132215 131990 131853 131601 131347 131288 131712 132811 134161 134797 134212 133068 132535 133128 134496 136131 137817
64931 137817 139406 140593 141047 140660 139689 138695 138152 137937 137374 136011 134185 132622 131628 130992 130496 130213 130343
64914 130343 131072 132568 134797 137332 139626 141497 143164 144813 146379 147823 149366 151295 153640 156118
64900 156118 158389 160384 162422 164963 168263 172358 177356 183416 190298 197193 203220 207892 211003 212499
64886 212499 212882 213315 214642 216346 217129 216544 215452 214667 213781 211775 208418 204579 201263 198758 196749 194926
64870 194926 193294 191950 190726 189240 187326 185250 183401 181925 180872 180457 180784 181358 181303 180203 178385
64855 178385 176294 173917 170999 167506 163668 159776 156174 153304 151498 150746 150687 150786 150563 149928 149316 149240 149666
64838 149666 150124 150420 150819 151374 151591 151109 150295 149760 149563 149429 149439 149957 150940 151877 152427 152732 153114 153969 155870
64819 155870 159135 163113 166506 168790 170896 174119 178737 184116 189733 195443 200960 205857 210280 215074
64805 215074 220841 227152 232976 237666 241207 243666 244707 243762 240535 235358 229065 222403 215547 208321
64791 208321 200925 194204 188958 185179 182239 179715 177728 176489 175883 175588 175386 175217 175110 175150 175389 175772
64775 175772 176302 177246 178995 181690 185229 189575 194700 200214 205530 210639 216217 222653 229308 235243 240346
64760 240346 245252 250322 255290 259880 264269 268758 273367 277824 281672 284398 285814 286318 286431 286069 284704
64745 284704 282191 278874 274778 269368 262465 254842 247421 240281 232942 225367 218135 211799 206606 202780
64731 202780 200495 199436 198794 197888 196641 195368 194347 193655 193215 192902 192696 192723 193021 193373 193622 194155 195699
64714 195699 198493 201850 204757 206797 208322 209802 211236 212235 212499 212049 211000 209289 206804 203697 200407
64699 200407 197273 194241 191038 187573 184073 180840 177966 175310 172783 170659 169439 169234 169423 169244 168729
64684 168729 168701 169783 171738 174002 176441 179308 182737 186722 191413 197015 203444 210397 217730 225492 233626
64669 233626 241903 250033 257505 263407 266830 267539 265976 262622 257728 251642 245006 238415 232208 226671
64655 226671 222128 218652 215929 213546 211242 208856 206408 204342 203278 203320 203956 204901 206669 209917 214530
64640 214530 219812 225484 232006 239899 249106 259163 269732 280741 292030 303050 313051 321703 329401
64627 329401 336658 343148 347686 349345 348335 345611 341923 337601 332900 328055 323001 317502 311590 305539
64613 305539 299442 293210 286980 281069 275364 269269 262588 256047 250501 245794 240861 234965 228449 222184
64599 222184 216601 211430 206175 200605 194922 189731 185817 183647 182918 182727 182350 181792 181486 181676 182336 183556
64583 183556 185624 188612 192188 195903 199432 202521 205075 207441 210266 213796 217647 221382 224965 228308
64569 228308 230801 231792 231195 229165 225580 220605 215497 211797 209526 206995 202779 197231 191752 187283 184025
64554 184025 181950 180802 179902 178684 177312 176295 175662 175111 174744 174990 175785 176523 176999 177826 179577 181893
64538 181893 183824 184812 185106 185304 185734 186260 186518 186305 185744 185065 184355 183636 183002 182459 181782 180868 180137 180149 180842
64519 180842 181595 182182 183131 184864 186913 188476 189455 190421 191684 192998 194235 195782 197990 200655 203451
64504 203451 206577 210460 214951 219385 223644 228637 235303 243334 251310 257966 262923 266291 268153 268641
64490 268641 268038 266483 263824 260073 255702 251200 246586 241824 237466 234388 232848 232213 231631 230667 229350
64475 229350 227979 226899 226107 225060 223244 220879 218662 216810 214938 212963 211540 211261 211899 212781 213539
64460 213539 214161 214689 215318 216479 218344 220427 222053 223099 223896 224630 225241 225741 226195 226467 226482 226703 227918
64443 227918 230479 234076 238247 242742 247348 251841 256300 261197 266966 273641 280997 288951 297824 308378
64429 308378 321498 337521 355849 375521 396257 418806 444374 474095 509027 550187 598294
64418 598294 653686 716548 786848 863697 944883 1027224 1107408 1182732 1251525 1313164 1367382
64407 1367382 1413357 1449582 1474700 1488150 1489888 1480019 1459159 1428769 1390491 1345108 1292534 1232713
64395 1232713 1166087 1093351 1015569 934975 855166 779818 711042 649073 593377 543737 500315
64384 500315 463094 431532 404725 381766 362004 345086 330747 318500 307641 297653 288608 280930
64372 280930 274737 269543 264752 260205 256035 252113 247951 243184 237896 232427 227112 222304 218390 215534
64358 215534 213554 212200 211469 211482 212177 213269 214493 215830 217635 220580 225223 231405 238252 244940 251240
64343 251240 257060 261806 264775 266067 266481 266390 265282 262740 259302 255930 252969 250264 248042 246980 247268
64328 247268 248173 248851 249227 249842 251063 252750 254485 255859 256605 256692 256278 255414 253925 251668 248838 245815
64312 245815 242863 240162 237976 236391 234934 232732 229216 224517 219296 214418 210674 208321 206741 204950
64298 204950 202629 200386 198888 198131 197771 197692 197807 197685 197060 196564 197345 199773 202995 205936 208448 211303
64282 211303 215261 220292 225592 230316 234381 238527 243463 249105 254838 260332 265751 271303 277011 282822
64268 282822 288397 292778 294880 294528 292579 289896 286778 283610 281298 280449 280557 280666 280584 280845 281642 282388
64252 282388 282260 280647 277167 271821 265205 258127 250926 243625 236668 230854 226384 222562 218768 215247
64238 215247 212582 210830 209609 208744 208262 207968 207549 207126 207254 208227 209686 210999 211822 212192 212245 212014 211474
64221 211474 210746 210194 210186 210616 210832 210265 209035 207710 206540 205283 203745 202095 200490 198825 197180 196154
64205 196154 196311 197366 198401 198904 199250 200061 201458 203152 204995 207130 209681 212528 215478 218567 222192
64190 222192 226886 232870 239842 247353 255422 264602 275359 287496 300128 311983 321732 328415 331765
64177 331765 331873 328562 321618 311905 301502 292017 283131 273617 263542 254435 247192 240956 234558 228224
64163 228224 223029 219203 215838 212157 208369 205279 203509 203131 203630 204171 204248 204088 204230 204841 205807 207300
64147 207300 209731 213091 216821 220479 224123 227856 231327 233991 235671 236615 237089 237083 236348 234607 231846 228554
64131 228554 225647 223987 223864 224872 226275 227513 228446 229175 229771 230374 231469 233672 237005 240678 243948
64116 243948 247063 250987 256324 262872 270201 278226 287073 296684 306674 316364 324888 331525 336101 338966
64102 338966 340628 341654 342810 344880 348222 352808 358646 365723 373455 380807 387233 393006 398234 402117
64088 402117 403745 403284 401674 399309 395700 390461 383965 376847 369368 361547 353515 345411 337196 328880
64074 328880 320836 313686 307933 303766 301029 299244 297809 296315 294629 292649 290243 287568 285219 283773
64060 283773 283267 283306 283565 283976 284572 285459 286917 289204 292147 295161 297825 300334 303303 307285 312532 319049
64044 319049 326617 334819 343251 351807 360750 370485 381288 393120 405616 418233 430386 441476 450861
64031 450861 458069 463065 466084 467043 465427 461092 455023 448880 443762 439748 436544 433970 431578 428419
64017 428419 423848 418368 413050 408110 402530 395258 386360 376833 367638 359299 352210 346815 343290 341189
64003 341189 339613 337823 335798 334221 333863 334922 336968 339487 342347 345708 349642 353936 358174 361884
63989 361884 364773 366973 369010 371326 373837 376118 378041 380037 382703 386390 391270 397536 405202 413780
63975 413780 422519 431063 439640 448549 457738 467099 476965 487999 500668 515069 531171 548850 567654
63962 567654 586983 606815 628070 651955 679044 709196 742314 778900 819898 866292 919079
63951 919079 979469 1048894 1128802 1220606 1325780 1445744 1581354 1732551 1898709 2079285
63941 2079285 2273851 2481375 2699832 2926673 3159335 3394746 3628480 3854858 4067983
63932 4067983 4262461 4433461 4576893 4689816 4770226 4816248 4826070 4798873 4735348 4636983 4505597
63921 4505597 4344151 4157497 3951514 3731636 3502775 3270143 3038972 2813216 2595275
63912 2595275 2387241 2191718 2011068 1846376 1697580 1564243 1445859 1341670 1250577 1171176
63902 1171176 1101840 1041010 987580 940794 899747 863304 830587 801157 774570 750107 727204
63891 727204 705767 685763 666709 647869 628875 609948 591689 574788 559730 546566 534983
63880 534983 524658 515430 507238 500220 494838 491510 490023 489836 491068 494622 500944 509188 518124 527547
63866 527547 538159 550177 562675 574413 584959 594799 604496 613926 622439 629755 636342 642577 647756
63853 647756 650706 651329 650700 649311 646165 640264 632219 623423 614179 603746 591955 579626 567267 554373
63839 554373 540342 525298 509621 493317 476298 458898 441737 425273 409653 394723 380165
63828 380165 365967 352783 341380 331675 322769 313976 305344 297136 289434 282407 276395 271427 267146
63815 267146 263373 260182 257292 254126 250762 248093 246558 245429 243965 242587 242112 242334 242300 241678 240950 240405
63799 240405 239753 238742 237413 235698 233452 230900 228440 225984 223190 220393 218526 217841 217414 216255 214348
63784 214348 212251 210253 208434 207115 206639 206850 207170 207110 206528 205556 204541 203885 203763 204103 204822 205714 206071
63767 206071 205041 202728 200485 199617 200077 200829 201083 200687 199714 198408 197461 197603 198780 200219 201367 202283
63751 202283 203099 203653 203880 204111 204746 205908 207487 209265 210888 212117 213224 214751 216780 218855 220712
63736 220712 222570 224512 226163 227393 228772 230790 232988 234520 235422 236702 239272 243290 248406 254058
63722 254058 259496 264108 268010 271892 276065 279955 282741 284210 284846 285325 286036 286791 286795 285197 281884 277653
63706 277653 273479 269875 267055 265319 264843 265215 265667 265844 266126 267081 268791 270820 272725 274457 276291 278463
63690 278463 280951 283535 285954 287944 289260 289926 290437 291474 293229 295094 296168 296082 295255 294394 293847 293463
63674 293463 292942 292228 291562 291271 291600 292671 294416 296489 298409 299936 301239 302588 303939 304906 305071 304209
63658 304209 302295 299451 295849 291620 286932 282188 277905 274254 270902 267540 264389 261961 260544 260120
63644 260120 260558 261513 262417 263039 263876 265485 267612 269566 271314 273479 276248 279111 281888 285151 289200
63629 289200 293419 297284 301420 306832 313413 319989 325826 331493 338249 347001 357749 369612 381423
63616 381423 392799 404653 418416 434786 453513 474128 496445 520440 546136 573654 602921
63605 602921 633233 663418 692427 719375 742973 761456 773456 778887 778959 775455 770004 763712 757212
63592 757212 750933 745153 739635 733448 725471 715064 702046 686185 667198 645301 621414 596691
63580 596691 572061 548296 526170 506312 489027 474397 462507 453437 447032 442689 439482 436769
63568 436769 434769 434292 435781 438859 442995 448235 454863 462593 470655 478604 486629 495103 504333 514696
63554 514696 526537 539775 553999 569067 585397 603709 624839 649753 679186 712990 749900
63543 749900 787758 823628 854014 875947 888430 892597 890421 883650 873903 862972 852462 843372
63531 843372 836183 830917 826789 822290 816020 807189 795145 778978 758111 732971 704640 674132 642441
63518 642441 610930 580989 553246 527520 503500 481153 460585 441930 425392 411046 398574
63507 398574 387441 377320 368114 359697 351961 345068 339296 334605 330628 327156 324334 322277 320716 319185
63493 319185 317472 315798 314612 314218 314538 315231 316043 316947 317909 318732 319260 319628 320143 321078 322722 325411 329154
63476 329154 333338 337156 340373 343380 346487 349472 351908 353556 354204 353405 350818 346744 342018 337270 332592
63461 332592 328101 324513 322715 322678 323190 322915 321555 319839 318632 318367 319106 320644 322512 324379 326697 330583
63445 330583 336719 344531 352730 360497 367924 375473 383506 392426 402939 415815 431472 449970 471281
63432 471281 495064 519963 543501 563359 578887 591058 600999 609221 616438 624252 634252 646876
63420 646876 661937 679909 701750 727581 756613 788468 823430 860936 898675 933785 964208
63409 964208 988395 1004625 1011855 1011070 1004958 996225 986631 977243 968677 960883 953147 944480 933732 919508
63395 919508 900449 875870 846144 812704 777792 743668 711487 681018 651701 623693 597593
63384 597593 573641 551881 532747 516707 503417 492009 482310 475082 470915 469454 469867 471613 474592
63371 474592 479045 485477 494199 504737 516132 527979 540792 555159 571034 588089 606328 625963
63359 625963 647063 669697 694263 721290 751007 783235 817448 852543 886574 917085 941950
63348 941950 960040 971234 975941 974717 968392 958485 947078 935938 925765 916397 907401 898068 887091
63335 887091 872975 855011 833490 808932 781532 751609 720184 688777 658729 630793 605145
63324 605145 581670 560492 542316 528070 518066 511644 507490 503921 498933 490681 478441 463050
63312 463050 446304 430068 415771 404018 394286 385397 376757 368936 362774 358218 354522 351287 348734
63299 348734 346938 345334 343232 340551 337798 335442 333427 331353 329008 326599 324378 322206 319728 316940
63285 316940 314289 312122 310338 308648 306912 305064 302971 300619 298224 295994 294008 292490 291880 292308 293266
63270 293266 294153 294913 295766 296506 296591 295954 295266 295305 296381 298425 301206 304293 307175 309706 312235 315038 317879
63253 317879 320381 322664 325218 328204 331281 334254 337541 341762 347047 353027 359330 365872 372739 380187
63239 380187 388750 399018 411073 424365 438320 452860 468215 484439 501428 519212 537857 557005
63227 557005 575817 593555 610152 626207 642433 659114 676059 693064 710249 727770 745318
63216 745318 762343 778843 795432 812328 828763 843755 856999 868440 877368 882685 883895 881110
63204 881110 874208 862892 847650 829797 810317 789470 767903 747276 729119 713613 700148 688680
63192 688680 679769 673591 669638 667459 667126 668910 672954 679425 688610 700636 715162 731477 748882
63179 748882 767091 786239 806461 827469 848725 869904 890871 911281 930709 949277 967540
63168 967540 985454 1001940 1015894 1027141 1035903 1041700 1043443 1040393 1032422 1019446 1001247 977986
63156 977986 950498 920012 887805 854983 822146 789319 756580 724707 694826 667497 642536
63145 642536 619684 598993 580559 564318 550191 538079 527694 518770 511390 505633 500904 496152
63133 496152 490943 485891 481877 479249 477917 477757 478628 480340 482901 486523 491139 496309 501838 508083 515190
63118 515190 522326 528165 532064 534404 535883 536954 537911 539061 540587 542418 544331 546034 547175 547560 547479
63103 547479 547540 547995 548314 547680 545897 543719 542203 541782 541969 541925 541237 540124 538976 537863 536581 535060 533548
63086 533548 532369 531599 531125 530980 531490 532998 535496 538639 542087 545669 549205 552410 555225 558159 561988
63071 561988 567024 572867 579036 585666 593391 602584 612927 623797 634951 646755 659857 674698 691345
63058 691345 709671 729637 751443 775422 801827 830724 862069 895805 931831 969952 1009970
63047 1009970 1051782 1095206 1139734 1184619 1229296 1273556 1317262 1360099 1401790 1442419 1482348
63036 1482348 1521908 1561303 1600616 1639623 1677684 1714087 1748442 1780452 1809326 1833685 1852010
63025 1852010 1862913 1865136 1857852 1841154 1815957 1783257 1743809 1698540 1648868 1596444 1542953 1490285
63013 1490285 1440359 1394472 1353198 1317162 1287356 1264274 1247332 1235826 1230132 1231235 1239267 1253261
63001 1253261 1272296 1296094 1324357 1356233 1390750 1427242 1465026 1503138 1540789 1577882 1614742
62990 1614742 1651559 1688261 1724623 1760221 1794464 1826890 1857210 1884746 1908015 1925140 1934648
62979 1934648 1935685 1927697 1910319 1883584 1847972 1804173 1753001 1695558 1633260 1567632 1500175 1432438
62967 1432438 1365997 1302178 1241839 1185446 1133216 1085074 1040620 999390 961174 925949 893512
62956 893512 863427 835394 809431 785512 763237 742094 721904 702725 684455 666897 650193
62945 650193 634728 620485 606850 593270 579806 566851 554628 543272 533104 524408 517002 510424
62933 510424 504465 499228 494652 490336 485939 481581 477703 474648 472421 470815 469647 468834 468195 467366 466098
62918 466098 464602 463324 462319 461179 459563 457465 454817 451343 447086 442677 438699 435090 431592 428413
62904 428413 425913 423869 421661 419110 416625 414600 413161 412435 412478 412888 413032 412773 412515 412438 412250 411844 411657
62887 411657 412006 412485 412432 411752 410961 410547 410581 410916 411507 412475 413851 415306 416263 416461 416297 416361 416700 416806 416280
62868 416280 415216 413925 412610 411366 410215 409108 408129 407648 407966 408813 409556 409912 410172 410753 411860 413493
62852 413493 415372 416924 417905 419019 421263 424500 427331 428712 429133 429755 430863 431735 431762 431120 430356 429706
62836 429706 428936 427734 426235 425076 424718 424782 424402 423235 421808 420816 420528 420971 422194 424080 426285 428515
62820 428515 430587 432214 433253 434230 435907 438182 440152 441581 443445 446497 450111 453382 456618 460754
62806 460754 465733 470556 474743 478762 483065 487675 492815 498993 506186 513632 520800 528014 535824 544253
62792 544253 553045 562361 573037 586281 603055 623353 646133 670460 696784 726625 761035 799904
62780 799904 842866 890115 941938 997978 1057497 1120063 1185556 1253613 1323346 1393350 1461666
62769 1461666 1525944 1583992 1634197 1675338 1706283 1726116 1734400 1731047 1716085 1689781 1652943 1606896
62757 1606896 1553192 1493507 1429724 1363891 1297939 1233280 1170481 1109376 1049813 992414 938378
62746 938378 888473 842523 800006 760802 725038 692609 663363 637615 615847 597756 582013
62735 582013 567261 553140 540178 528925 519514 511863 505889 501332 497695 494601 492191 490993 491438
62722 491438 493606 497264 501893 506710 511063 514969 519085 524056 530228 538139 548772 562753 579453
62709 579453 597512 616332 636601 659371 685230 714605 748223 786616 829450 875909 925718
62698 925718 979380 1037454 1100062 1167140 1238655 1314259 1392981 1473464 1554254 1633553 1708834
62687 1708834 1777192 1836181 1884176 1919910 1941992 1949155 1940906 1917780 1881018 1832114 1772647 1704358
62675 1704358 1629253 1549694 1468295 1387522 1309100 1233718 1161385 1092214 1026918 966463 911183
62664 911183 860433 813350 769940 731052 697126 667319 640194 615073 592321 572429 555282
62653 555282 540260 526594 513482 500388 487544 475805 465715 456917 448750 441101 434351 428648
62641 428648 423669 419058 414784 411070 408211 406480 406011 406713 408280 410114 411177 410275 406940 402004 397040
62626 397040 393198 390695 389233 388493 388183 388005 387854 388049 389190 391672 395226 398974 402159 404929 408163
62611 408163 412419 417272 421937 426272 430815 435987 441723 447962 455126 463835 474263 485908 498138
62598 498138 511033 525612 543041 563628 586878 612485 640740 671699 704523 738093 771926
62587 771926 805900 839342 870999 899726 924564 944299 957665 964161 964088 957732 945098 926595
62575 926595 903385 876748 847522 816463 784704 753429 723296 694382 666530 639651 613931
62564 613931 589876 567945 548088 529979 513683 499694 488215 478845 471081 464714 459510 454991
62552 454991 450815 447038 443722 440648 437690 435144 433417 432639 432769 433678 434913 435793 436097 436297 436855 437633
62536 437633 438350 439174 440440 442150 444144 446447 449082 451938 455268 459852 466099 473451 481328 490241 501189
62521 501189 514295 529006 545402 564255 585776 609398 635127 664069 697106 733812 773252
62510 773252 815210 859964 907309 956385 1006126 1055225 1101902 1144290 1181083 1211547 1235150
62499 1235150 1251574 1260840 1263069 1258360 1247361 1231743 1213578 1194368 1175159 1157364 1142749 1132474
62487 1132474 1126738 1125579 1129534 1139270 1154939 1176194 1202529 1233328 1267793 1304955 1343382 1380626
62475 1380626 1413372 1438720 1455415 1463697 1464229 1457399 1443222 1421176 1390173 1349441 1299868 1244185
62463 1244185 1185523 1125921 1066222 1006921 948738 892620 839663 790962 747218 708514 674701
62452 674701 645930 622404 603598 588107 574505 562233 551552 542918 536579 532600 530913 531237 533060
62439 533060 535836 539222 543164 547733 552830 558065 562953 567168 570449 572300 572007 569149 564032 557528
62425 557528 550535 543572 536711 529691 522131 513900 505357 497173 489791 483052 476430 469627 462945 457020
62411 457020 452205 448260 444647 441052 437552 434333 431375 428466 425459 422541 420247 419109 419156 419783 420293
62396 420293 420565 421021 421973 423245 424528 425820 427327 429142 431286 433898 437023 440274 443154 445807 449069
62381 449069 453528 458804 464132 469404 475193 481806 488899 496182 503980 512688 522011 531288 540454 550191
62367 550191 561128 573354 586811 601690 618236 636569 657026 680453 707786 739411 775092
62356 775092 814376 856947 902789 952126 1004867 1059836 1114714 1166939 1214424 1255335 1287822
62345 1287822 1310697 1324205 1329640 1328273 1320951 1308298 1290548 1267334 1238404 1204665 1167880 1129337
62333 1129337 1089528 1049234 1010116 973896 941590 913740 890547 871253 854187 838234 823850
62322 823850 811847 801634 791511 780532 769133 757889 746459 734068 720477 706080 691430
62311 691430 677006 663177 650054 637384 624788 612159 599840 588433 578354 569434 560998 552425
62299 552425 543603 534829 526474 518865 512294 506891 502598 499379 497287 496166 495598 495406 495937 497489 499645
62284 499645 501642 503303 505186 507852 511383 515585 520179 524732 528880 532828 537299 542816 549267 556330
62270 556330 564051 572778 582654 593362 604390 615626 627787 642094 659292 679161 701355 726515
62258 726515 755900 789881 827572 868345 913060 963105 1018424 1077058 1136418 1194320 1248728
62247 1248728 1297285 1337759 1368936 1390869 1404332 1410169 1408943 1400855 1385798 1363536 1333959 1297285
62235 1297285 1254255 1206229 1155015 1102371 1049572 997568 947500 900792 858524 820837 787231
62224 787231 757350 731208 708724 689437 672836 658640 646559 636074 626786 618748 612090 606468
62212 606468 601299 596474 592362 589074 586139 583170 580519 578951 578796 579707 581260 583522 586899 591491 596816
62197 596816 602283 607810 613759 620235 626798 633042 639163 645619 652351 658835 664940 671388 679117 688397
62183 688397 698710 709403 720231 731244 742194 752249 760523 766935 772314 777478 782520 787309 792405
62170 792405 798966 807820 819169 833256 850763 872316 898074 928043 962288 1000330 1040548 1080650
62158 1080650 1118705 1153381 1183348 1206985 1223024 1231389 1233292 1230410 1223915 1214110 1200811 1183806
62146 1183806 1162857 1137546 1107699 1074136 1038721 1003466 969669 937940 908648 882079 858400
62135 858400 837767 820364 806151 794738 785671 778634 773164 768461 763824 759074 754200 748865 742812
62122 742812 736655 731588 728228 726278 725561 726725 730321 735455 739941 741870 740746 737185 732006 725874
62108 725874 719574 714101 710153 707398 704405 699493 691856 681920 670764 659408 648613 638963 630798
62095 630798 624149 618977 615347 613156 611882 611037 610898 612305 615565 619974 624705 629818 635930 643144 650930
62080 650930 659089 668233 679109 691803 705937 721389 738464 757477 778364 800640 823526 846247
62068 846247 868416 890109 911501 932626 953718 975585 999296 1025451 1053886 1083794 1113725
62057 1113725 1141513 1164780 1181875 1192365 1196715 1195854 1190987 1183243 1172984 1159545 1141901 1119561
62045 1119561 1092788 1062169 1028242 991528 952716 912757 872768 833707 796096 760185 726357
62034 726357 695110 666517 640060 615270 592308 571633 553334 537190 523256 511835 502769 495189
62022 495189 488193 481418 474731 467734 460029 451844 444021 437310 431854 427319 423249 419272 415274 411530
62008 411530 408490 406347 404963 404327 404834 406802 409894 413377 416967 421062 425968 431198 435811 439328 442082
61993 442082 444778 447914 451527 455109 457750 458679 457887 456043 453636 450405 445785 439686 432559 424884 417063
61978 417063 409793 403973 399889 396781 393589 389967 386261 382696 379107 375427 371869 368430 364717 360663
61964 360663 356994 354486 352976 351637 350162 349054 348695 348659 348226 347199 345945 344962 344728 345699 348024 351270
61948 351270 354707 357906 360980 364348 368434 373516 379745 387288 396435 407261 419137 430918 441951
61935 441951 452721 464182 476607 489446 502133 514556 526699 538265 548834 558105 565813 571723
61923 571723 575915 578887 581027 582022 581030 577584 572204 566026 559923 554190 549064 545221 543455 543992 546495
61908 546495 550726 556797 564682 573927 584075 594938 606133 616658 625455 632180 637012 639884 640367
61895 640367 638236 633719 627206 619178 610380 601606 593152 584774 576204 567411 558457 549544 541229 534110
61881 534110 528087 522272 515772 508297 500015 491263 482529 474274 466503 458851 451233 444132 438142 433650
61867 433650 431033 430616 432017 434063 435833 437599 440318 444429 449597 455473 462237 470387 480272 491872
61853 491872 504844 518909 534261 551331 569990 589360 608809 628754 649962 672216 694319
61842 694319 715307 734949 752878 767945 778903 785390 787812 786571 781898 774359 765061 755215 745776
61829 745776 737559 731356 727677 726532 727720 731255 737272 745577 755462 765948 775964 784352 790124 792932
61815 792932 792981 790247 784098 774056 760724 745550 729712 713590 697210 680699 664199 647773
61803 647773 631553 615749 600384 585343 570771 557107 544583 533019 522289 512657 504399 497336
61791 497336 491022 485241 480084 475608 471673 468104 464946 462502 460960 459880 458250 455400 451744 448246
61777 448246 445246 442386 439650 437756 437192 437463 437699 437579 437250 436792 436303 436193 436845 438188 440031 442513
61761 442513 445689 448892 451243 452796 454604 457508 461303 465221 468717 471540 473456 474332 474421 474200 473816
61746 473816 472807 470515 466768 462140 457422 452932 448534 444253 440522 437679 435510 433569 431807 430562
61732 430562 430037 429988 429973 429810 429831 430640 432449 434597 436022 436305 436067 436287 437502 439709 442620 445720 448382
61715 448382 450277 451580 452669 453854 455384 457273 458882 459165 457691 455080 452142 449001 445395 441367
61701 441367 437167 432856 428529 424604 421330 418332 415130 411841 408794 405795 402402 398729 395298 392274
61687 392274 389462 386863 384543 382111 379148 376058 373696 372110 370468 368336 366220 364616 363355 362235
61673 362235 361579 361644 362027 362169 362049 361922 361687 360992 359787 358452 357511 357402 358309 359978 361847 363540 365155
61656 365155 366980 369109 371347 373329 374758 375765 376933 378651 380526 381811 382362 382686 383118 383513 383849
61641 383849 384547 385967 388081 390832 394288 398187 401811 404693 407070 409280 411055 411790 411259 409721 407529
61626 407529 404913 401965 398549 394373 389411 384151 379304 375319 372276 370013 368254 366790 365665 365012
61612 365012 364675 364133 362869 360679 357766 354680 351991 349651 346935 343418 339781 337000 334940 332504 329146
61597 329146 325358 321603 317752 313909 310795 308694 306806 304354 301702 299671 298270 296881 295286 293741
61583 293741 292366 291166 290463 290498 290767 290430 289392 288335 287683 287137 286281 285155 284128 283546 283536 283822 283790 283169
61565 283169 282613 283183 285142 287658 289776 291315 292647 293930 294887 295257 295290 295642 296801 298658 300738 302711
61549 302711 304450 305714 306239 306255 306443 307112 307786 307886 307514 307296 307735 309001 310941 313009 314499 315275 315967
61532 315967 317079 318276 318924 319020 319042 319197 319316 319305 319148 318661 317711 316537 315411 314204 312787 311600 311217
61515 311217 311478 311661 311431 311109 311099 311615 312848 314785 316868 318423 319396 320168 320776 320965 320915 321129 321518 321365
61497 321365 320430 319390 318884 318760 318597 318474 318796 319715 321094 322731 324374 325782 326960 328093 329156 329936
61481 329936 330487 331156 332106 333276 334850 337112 339636 341276 341351 340327 338950 337333 335413 333778 333250 333830
61465 333830 334685 335131 335126 334878 334436 333732 332725 331440 330090 329060 328588 328541 328701 329096 329822 330709 331504 332259
61447 332259 333258 334646 336410 338536 340858 342875 344199 345164 346597 348852 351403 353563 355315 357225 359738
61432 359738 362742 365773 368466 370818 373089 375418 377527 378858 379068 378375 377452 377009 377445 378782 380811
61417 380811 383268 385889 388391 390534 392242 393633 394832 395773 396176 395780 394680 393479 392935 393258 393776 393509
61401 393509 392119 390116 388141 386355 384665 383226 382304 381777 381118 379996 378612 377302 376019 374440 372523
61386 372523 370705 369452 368768 368275 367717 367212 366953 366867 366694 366305 365779 365253 364868 364857 365461 366662 368114 369468
61368 369468 370679 371868 372949 373608 373719 373666 374006 374801 375558 376027 376841 378990 382677 387073 391334 395526
61352 395526 400299 405966 412274 418892 425681 432375 438377 443101 446502 449168 451882 454971 458051 460488
61338 460488 462158 463616 465475 467818 470274 472395 473787 474241 473993 473573 473108 472186 470769 469796 470088 470943
61322 470943 470691 468693 466044 464120 463243 463081 463586 464892 466775 468883 471342 474666 479229 485181 492673
61307 492673 501731 512023 523097 534760 546878 558937 570150 579928 587948 593914 597733 599874 601058
61294 601058 601402 600273 597177 592437 586680 579988 572014 562880 553471 544680 536660 529046 521669 514723
61280 514723 508381 502698 497945 494604 492790 491971 491537 491364 491535 491836 492054 492591 494128 496620 499147 501010
61264 501010 502523 504492 507301 510872 515241 520680 527233 534353 541066 546492 550289 552735 554332 555406
61250 555406 556187 557060 558345 559809 560756 560745 559937 558690 557215 555774 554742 554215 553900 553702 554006 554988 556003
61233 556003 556165 555379 554350 553809 554217 555995 559329 563604 567682 571034 574210 577984 582398 586959 591451
61218 591451 596140 601345 607173 613604 620481 627403 633959 640127 646119 651687 655967 658365 659418 660343
61204 660343 661831 663750 666045 669248 673792 679359 685507 692597 701405 711998 723714 736287 750160
61191 750160 765299 780288 793099 802526 808649 812287 814401 815747 816647 817068 817004 816503 815235 812476 807856
61176 807856 801832 795100 787949 780512 773153 766021 758557 750174 741261 732792 724984 717092 708648 700152
61162 700152 692233 684730 676975 668626 659884 651307 643737 638064 634613 632949 632569 633501 635887 639348 643327
61147 643327 647859 653292 659096 663590 665267 664150 661626 659210 657755 657518 658408 660059 662020 664195 667036
61132 667036 671241 677293 685294 695095 706469 719224 733220 748329 764525 782132 801831 824078
61120 824078 848467 873985 900037 926934 955220 984907 1015650 1047304 1079783 1112564 1144906
61109 1144906 1176613 1208063 1239382 1269965 1298964 1325920 1350701 1373121 1392771 1408980 1420868
61098 1420868 1427743 1429645 1427281 1421235 1411463 1397653 1379841 1358588 1334766 1309346 1283084 1256248
61086 1256248 1228798 1200829 1172639 1144402 1116289 1089006 1063598 1040358 1018383 996664 975278
61075 975278 955066 936536 919592 904149 890271 877723 865908 854467 843651 833969 825663 818575
61063 818575 812349 806739 801801 797753 794640 792296 790709 790174 790905 792732 795353 798698 802873 808022 814401
61048 814401 822263 831409 841266 851727 863520 877305 892804 909306 926745 945690 966489 989014
61036 989014 1013088 1038602 1065272 1092810 1121365 1151368 1183117 1216921 1253330 1292533 1333609
61025 1333609 1375084 1416260 1457437 1499101 1541810 1586969 1636860 1693585 1758611 1833351 1919188
61014 1919188 2016481 2124517 2243457 2376320 2528941 2708413 2921721 3175184 3474909 3828544
61004 3828544 4247487 4747668 5348710 6073837 6952235 8022039 9328739 10911032 12767008
60995 12767008 14807566 16830088 18555316 19734179 20267028 20251560 19926945 19563523 19373873
60986 19373873 19471660 19850935 20368862 20763595 20743246 20117725 18886301 17217795 15347950
60977 15347950 13477148 11727930 10156923 8781739 7598195 6589272 5732972 5008640
60969 5008640 4398875 3888428 3463110 3109422 2814496 2566659 2356377 2176341 2020593
60960 2020593 1884121 1763350 1656214 1561227 1476844 1401866 1335807 1278381 1228934 1186629 1150557
60949 1150557 1119228 1090404 1062214 1034227 1006970 980673 955114 930515 907695 886994 867634
60938 867634 848546 829542 811290 794269 778113 762031 745652 729353 713773 699091 684897
60927 684897 670823 657150 644544 633264 622948 613207 604102 595827 588217 580912 573899 567550 562057
60914 562057 557064 551994 546627 541292 536544 532703 529633 526938 524313 521684 519054 516407 513820 511477
60900 511477 509391 507320 505177 503383 502430 502121 501595 500157 497799 494848 491444 487578 483381 479124 475079
60885 475079 471456 468280 465164 461480 456943 451918 446989 442446 438307 434572 431276 428533 426740 426439
60871 426439 427635 429512 431191 432543 433936 435433 436765 437964 439456 441502 443996 446899 450405 454547
60857 454547 458997 463331 467209 470242 472029 472499 471975 470902 469736 468988 468857 468729 467541 464888 461408
60842 461408 457907 454517 450949 447118 443089 438666 433488 427436 420700 413608 406608 400205 394584 389409
60828 389409 384277 379301 375018 371752 369263 366994 364559 362044 359898 358377 357100 355408 353284 351502
60814 351502 350656 350349 349744 348643 347583 346924 346324 345173 343277 341022 339084 338027 338014 338785 339991 341462
60798 341462 343117 344778 346262 347559 348725 349674 350277 350606 350916 351437 352295 353498 354803 355708 355840 355285
60782 355285 354376 353271 351964 350529 349074 347513 345734 343872 342092 340193 337906 335622 334280 334298 334952
60767 334952 335116 334357 333093 331979 331476 331833 333029 334672 336153 337013 337181 337021 337249 338512 340690 342705
60751 342705 343329 342274 340285 338308 336923 336567 337735 340515 344132 347414 349660 350842 351027 350035 347799
60736 347799 344748 341638 339076 337287 336159 335359 334525 333521 332466 331496 330628 329929 329593 329731 330205 330840
60720 330840 331629 332564 333448 334153 334945 336245 338038 339723 340591 340385 339469 338595 338372 338772 339272 339547 339804 340170
60702 340170 340116 338938 336598 333629 330417 327175 324460 322852 322026 320944 319212 317527 316449 315564 314530
60687 314530 314174 315601 318529 321422 323186 324030 324768 326064 328398 331881 335795 338972 341065 342966 345572
60672 345572 348635 351327 353526 355764 357972 359074 358234 356071 354104 353109 352460 351136 348919 346397 344142
60657 344142 342404 341458 341700 343160 345206 346975 348010 348410 348610 349099 350159 351706 353526 355664 358255
60642 358255 360878 362532 362589 361442 359841 357873 355110 351599 348158 345613 344128 343339 342776 342082 341199 340520
60626 340520 340609 341587 342943 344043 344712 345149 345428 345269 344381 342952 341652 341052 341135 341516 342026 342768 343658 344353
60608 344353 344775 345263 345968 346588 347015 347717 348936 350003 350143 349643 349431 349715 349975 350231 351249 353222 355255
60591 355255 356724 358297 360883 364171 367014 368860 370025 370779 371023 370828 370527 370117 369269 368231 368129 369909
60575 369909 373229 376825 379861 382600 385840 390082 395361 401614 408886 417153 426143 435520 445220 455414
60561 455414 465998 476181 484680 490410 492991 492734 490189 485770 479777 472763 465746 459870 455814 453605
60547 453605 453004 453867 456043 459203 463099 467908 473971 481124 488598 495880 503546 512999 525426 541111
60533 541111 559590 579955 600811 620335 636886 649612 658282 662687 662641 658621 651949 644025 635521
60520 635521 626469 616845 606792 596547 586544 577528 570157 564422 559749 555790 552901 551725 552473 554704
60506 554704 557757 561366 565946 572375 581454 593573 608862 627574 650223 677414 709531 746321
60494 746321 786620 828671 871064 913330 955364 996444 1035212 1070579 1102169 1129586 1151613
60483 1151613 1166456 1172705 1169816 1157808 1136790 1106897 1068567 1022872 971699 917623 863396 811250
60471 811250 762471 717587 676922 640869 609533 582304 558184 536638 517842 501973 488550
60460 488550 476744 466079 456513 448057 440690 434532 429624 425540 421572 417344 413008 408852 405074 401873
60446 401873 399304 397013 394525 391882 389603 387982 386901 386415 386862 388012 388655 387602 384916 381712 378967
60431 378967 376967 375677 375079 375096 375523 376090 376398 375961 374678 373168 372226 371969 371973 372236 373444 376006 379245
60414 379245 381965 383622 384648 385753 387224 388831 390139 390873 391195 391644 392626 393988 395283 396434 397849
60399 397849 399819 402149 404600 407405 410966 415156 419263 422732 425692 428675 431978 435381 438377 440630
60385 440630 442298 443853 445441 446622 447038 447233 448289 450602 453487 456101 458252 460126 461893 464025 467305
60370 467305 471817 476293 479264 480667 481595 482729 483878 485040 486881 489849 493569 497523 501711 506314
60356 506314 511293 516763 523260 531217 540568 551174 563048 575612 587303 596641 603387 608013 610304
60343 610304 609368 604998 598184 590057 581009 571227 561460 552661 545072 538271 532107 527085 523497 520501
60329 520501 516615 511256 505414 500509 496882 493807 490725 487786 485209 482880 480945 480188 481293 484124
60315 484124 488208 493617 500826 510003 521006 533816 548182 562851 575956 586447 594717 601708 607955
60302 607955 613774 619686 626016 632236 637209 640072 640534 638367 632981 623759 610721 594854 577784 561080
60288 561080 545714 532052 520273 510631 503243 497712 493158 488804 484540 480859 478213 476495 475226
60275 475226 474060 472828 471087 468077 463500 458129 453313 449819 447409 445398 443240 440531 436991 432840
60261 432840 428952 426204 424625 423470 422138 420810 420122 420478 421777 423619 425576 427435 429426 432093 435630
60246 435630 439357 442247 444044 445462 447102 448611 449312 449287 449218 449346 449228 448522 447378 446018 444600 443713
60230 443713 444242 446251 448618 450381 452028 454682 458351 461794 464137 465833 467855 470571 473791 477368
60216 477368 481341 485722 490591 496306 503313 511671 520885 530212 539145 547674 556094 564498 572502 579610
60202 579610 585775 591381 596750 601927 606987 612196 617643 622967 627645 631404 634122 635484 635067 632818
60188 632818 629218 624892 620150 614994 609447 603755 598211 592891 587661 582475 577572 573227 569353 565490
60174 565490 561302 556999 553161 550166 547886 545910 543929 541877 539871 538178 537103 536648 536282 535318 533662
60159 533662 531993 531010 530690 530525 530293 530259 530683 531504 532509 533502 534285 534815 535439 536558 537897 538580 538241 537717
60141 537717 538259 540262 543181 546536 550500 555467 561380 567700 573843 579559 584912 589937 594389 597973
60127 597973 600774 603211 605547 607775 610067 612842 616061 618933 620858 622399 624693 628016 631513 634354
60113 634354 636538 638443 640132 641396 642148 642486 642599 642702 642801 642406 640893 638337 635631 633484 631627 629355
60097 629355 626605 624017 621991 620144 617843 614972 612007 609553 608018 607591 608215 609390 610159 609587 607432
60082 607432 604310 601168 598629 596796 595341 593567 590599 585966 580121 574163 568935 564412 559907 554671
60068 554671 548413 541553 535021 529530 524903 520330 515354 510318 505737 501576 497509 493665 490673 488919
60054 488919 488107 487672 487399 487492 488232 489776 492191 495473 499542 504293 509589 515085 520190 524519 528391 532562
60038 532562 537304 542024 545942 548863 551055 552741 554101 555461 556880 557726 557232 555454 552984 549687 544560
60023 544560 537149 528374 519431 510534 501306 491829 482543 473521 464734 456794 450543 445926 442087 438626
60009 438626 435967 434274 432786 430676 428062 425693 423951 422544 421019 419303 417834 417234 417667 418550 419154
59994 419154 419509 420292 421829 423654 425270 426837 428820 431337 434216 437447 441110 444974 448475 451108 452689
59979 452689 453307 453139 452270 450672 448468 446185 444408 443113 441665 439623 437243 435003 432991 431067 429385
59964 429385 428404 428421 429391 431098 433284 435634 437867 439885 441747 443498 445060 446223 446740 446636 446388 446549
59948 446549 447095 447395 447026 446403 446364 447267 448710 449993 450626 450499 449851 449182 448975 449384 450154 450875 451346 451816
59930 451816 452861 454965 458174 462162 466463 470459 473294 474219 473172 470809 467847 464578 461111 457832
59916 457832 455366 454064 453682 453579 453327 453165 453807 455676 458474 461620 464857 468130 471124 473491 475395
59901 475395 477203 478645 478965 478140 477238 477155 477552 477564 477062 476630 476623 476966 477853 479907 483503 488291 493530 498653
59883 498653 503375 507606 511460 515310 519632 524669 530113 535192 539247 542237 544540 546277 547153 546983 546017
59868 546017 544550 542603 540215 537771 535689 533953 532239 530355 528350 526357 524529 523011 521866 521231
59854 521231 521617 523639 527304 531953 537168 543328 550924 559745 569139 578583 587483 594826 599762 602418
59840 602418 603610 603935 603780 604059 606034 610125 615279 619706 621956 621504 618861 615289 611980 609276 606796
59825 606796 604074 600658 595912 589474 581939 574400 567181 559681 551647 543927 537604 532955 529649 527434
59811 527434 526142 525317 524421 523241 521810 520108 518133 516097 514268 512802 511856 511595 511853 512094 512027 511994 512365
59794 512365 512848 512817 512176 511413 510888 510546 510354 510531 511148 511746 511636 510501 508616 506513 504499 502526 500531
59777 500531 498809 497802 497492 497259 496575 495647 495096 495113 495259 495122 494960 495549 497486 500611 504080 507053 509350
59760 509350 511393 513563 515878 518372 521404 525301 529946 535086 540840 547464 554706 561919 568818 575686
59746 575686 582778 589937 596943 603786 610371 616316 621365 625710 629640 633074 635726 637534 638676 639399
59732 639399 640105 641307 643099 644843 645816 646064 646227 646630 646984 646949 646505 645740 644695 643482 642090 640038 636751
59715 636751 632479 628308 625014 622350 619774 617350 615500 614368 613937 614434 615949 617870 619400 620584 622259
59700 622259 624977 628487 632289 636125 639858 643374 646845 650648 654807 658821 662187 664797 666681 667712
59686 667712 667751 666916 665569 664168 663032 661992 660366 657676 654345 651212 648359 644999 640611 635540 630275
59671 630275 624728 618635 612137 605514 598795 592074 585853 580594 576201 572397 569340 567443 566773 567049 567994
59656 567994 569355 570869 572633 575196 578756 582535 585566 587929 590596 594039 597543 599937 600512 599206
59642 599206 596391 592620 588183 582855 576324 568887 561374 554440 548255 542836 538220 534327 531044 528462
59628 528462 526584 524822 522301 518781 514815 510869 506821 502495 498169 494158 490242 485918 481054 476025
59614 476025 471381 467615 465090 463928 463955 464796 465964 466997 467780 468784 470636 473346 476204 478492 479978
59599 479978 480680 480669 480338 480386 481149 482266 483389 484867 487210 490102 492579 494126 495035 495536 495163 493352 490375
59582 490375 487241 484793 483146 481946 480848 479675 478368 476969 475546 473999 472080 469791 467696 466560
59568 466560 466578 467214 467844 468338 468800 469044 468691 467748 466729 466128 465954 465902 465765 465589 465534 465747 466344 467388 468797
59549 468797 470240 471283 471867 472658 474673 478336 483066 488017 493108 499151 507056 517263 529970 545528
59535 545528 564102 584567 603685 616896 620872 615906 605721 594675 585223 577864 572614 569648 568774
59522 568774 569249 570331 571529 572273 571966 570532 568385 565578 561553 556074 549989 544559 540231 536443 532443
59507 532443 527943 523036 517861 512469 506902 501399 496485 492649 489813 487304 484532 481558 478864 476759
59493 476759 475227 474234 473846 473981 474314 474541 474679 475019 475822 477171 479077 481597 484668 487894 490793 493372
59477 493372 496230 499894 504205 508609 512887 517211 521550 525428 528408 530543 532254 533980 535950 538054
59463 538054 539829 540805 541028 541084 541558 542667 544505 547358 551551 557028 563224 569401 575111 580447 585767
59448 585767 591080 595826 599460 602162 604596 606920 608361 607931 605367 601267 596496 591662 587028 582709
59434 582709 578811 575393 572338 569459 566846 564956 564199 564566 565833 568012 571353 576018 582021 589396 598221
59419 598221 608577 620696 634902 651051 668326 686080 704766 725581 749211 775169 801766
59408 801766 825865 843061 849684 845541 834243 820464 807319 796391 789163 787297 791707 801820
59396 801820 815378 828400 835930 834099 822197 802823 780098 757680 737744 720854 706454 693770
59384 693770 682532 672918 665021 658554 652991 647910 643347 639873 638038 637585 637510 637075 636441 636120 636193 636492
59368 636492 637142 638377 639952 641281 642194 643188 644869 647450 650835 654884 659526 664785 670787 677632 685266
59353 685266 693576 702555 712284 722791 734044 745950 758315 770942 783844 797166 810701 823664
59341 823664 835178 844871 852795 858869 862694 863896 862472 858746 853074 845596 836206 824762 811391
59328 811391 796627 781314 766334 752189 738640 724950 710769 696694 683674 672012 661325
59317 661325 651329 642119 633692 625815 618553 612349 607304 602831 598389 594176 590756 588343 586797 586126
59303 586126 586686 589087 594091 602370 614063 628567 644536 659587 670230 673154 667439 655334 640567
59290 640567 626031 613001 601706 591982 583743 577343 573293 571420 570764 570636 571262 572997 575576 578735
59276 578735 583003 589060 596692 605138 614221 624351 635640 647747 660454 673627 686702 698960
59264 698960 710293 721015 730887 739034 744906 748710 750815 751369 750636 749029 746551 742753 737618 732099
59250 732099 727382 723830 720916 718081 715434 713584 712858 712723 712181 710738 708751 706753 704911 703345 702389
59235 702389 702000 701366 699740 697352 694772 691710 687320 681613 675715 670552 665954 661174 655661 649184 641841
59220 641841 634179 626774 619487 611687 603357 595466 589004 584142 580530 577879 575942 574377 573023 572059
59206 572059 571691 571971 572964 574659 576580 578038 579071 580609 583300 586649 589712 592255 594669 597053 599027
59191 599027 600404 601456 602371 602885 602728 602174 601891 602282 603167 604089 604681 604626 603497 601082 597944 595314 594179
59174 594179 594556 595750 597021 597852 597970 597526 597089 597126 597606 598345 599431 600918 602446 603641 604666 605836
59158 605836 606876 607184 606650 605591 603909 601083 597040 592353 587366 581783 575392 568602 561952 555584 549554
59143 549554 544207 539831 536198 532790 529295 525627 521695 517384 512652 507566 502464 498092 495194 493773
59129 493773 493054 492338 491644 491438 492088 493806 496817 501229 506841 513302 520411 528262 537141 547238 558267
59114 558267 569495 580353 590935 601619 612367 622839 633056 643393 653808 663536 671736 678100
59102 678100 682788 686191 688837 691116 692897 693686 693232 691676 689119 685540 681186 676580 672044 667625 663617
59087 663617 660620 658940 658387 658760 659934 661193 661140 658820 654595 649512 644100 638189 631676 624947 618538
59072 618538 612670 607151 601661 596149 590919 586175 581581 576587 571129 565678 560657 556194 552433 549583
59058 549583 547579 546167 545390 545455 545998 546097 545267 543956 542799 541975 541566 541963 543298 544900 545889 546139 546209 546510
59040 546510 546994 547529 548124 548745 549231 549494 549717 550289 551571 553634 556263 559306 562889 567133 571859 576944
59024 576944 582819 590098 598762 608214 618143 628795 640218 651804 662714 672315 680050 685395 688235
59011 688235 688915 687791 685110 681400 677517 674078 671270 669234 668154 667932 668395 669868 672878 677155 681695
58996 681695 686033 690586 695455 699769 702775 704738 706112 706565 705587 703462 700740 697217 692279 686058 679538
58981 679538 673737 669401 667196 667389 669386 672233 675670 680190 686137 693258 701219 710138 720411 732134
58967 732134 744762 757383 769447 781207 793133 804983 815902 825429 833745 840751 845710 848243
58955 848243 848978 848608 846746 842346 834907 824805 812829 799997 787428 775817 765098 754969 745409
58942 745409 736422 727845 719894 713341 708548 704733 700843 696774 693115 690051 687234 684454 681812 679467
58928 679467 677785 677377 678337 679761 680693 681319 682548 684678 687145 689333 690926 691736 692033 692972 695845 700845
58912 700845 707082 713708 720466 727333 734404 742118 750873 760329 769695 778738 787955 797767 808049 818397
58898 818397 828265 836929 843929 849609 854659 859173 862790 865781 869271 874256 880937 889214 899246 911264
58884 911264 925148 940296 955654 969925 982211 992453 1000897 1007163 1010403 1010431 1008220 1005107 1001800
58871 1001800 998200 993872 988601 982682 976642 970524 963667 955456 946006 935751 924684 912558 899609
58858 899609 886447 873304 859935 846234 832423 818607 804603 790285 775800 761515 748019
58847 748019 735982 725621 716428 707779 699531 691628 683512 674517 664631 654332 643895 633426 623359
58834 623359 614241 606160 598966 592834 587995 584150 580811 578089 576423 575704 575424 575546 576488 578331 580779
58819 580779 583899 588132 593562 599820 606578 613434 619497 623996 627285 630360 633389 635602 636604 636763
58805 636763 636208 634576 632038 629502 627319 624769 621346 617676 614488 611460 607778 603251 598137 592406
58791 592406 585925 579111 572728 567197 562571 559008 556827 556204 557130 559556 563294 567926 573056 578573 584520
58776 584520 590856 597410 603869 609662 614016 616210 615791 612715 607465 600907 593712 586091 578306 571065
58762 571065 564906 559397 553597 547280 541167 536049 532191 529539 527873 526719 525680 524949 525054 526052 527381
58747 527381 528499 529272 529911 530996 533295 537001 541344 545576 550000 555263 561008 566307 571242 576883 583580
58732 583580 590447 596776 602864 609045 614965 620347 625598 631056 636366 641195 645915 651013 656335 661443
58718 661443 666253 670895 675423 680103 685526 691980 699022 705972 712455 718184 722613 725199 725776 724490
58704 724490 721580 717244 711311 703097 692031 678410 663068 646450 628651 610256 592321 575476
58692 575476 559754 545282 532313 520584 509630 499822 492016 485972 480227 473940 467824 462760 458566
58679 458566 454777 451678 449760 448854 448551 448903 450008 451498 453065 455061 457962 461667 465826 470510 476153
58664 476153 483293 492557 504217 517256 529417 538647 544147 545915 544089 539191 532305 524498 516536
58651 516536 509308 503634 499248 494892 489952 485198 481408 478200 474922 471730 468937 466183 463268 461050
58637 461050 460413 460862 461260 461563 462710 464986 467535 469530 470931 471972 472629 472799 472623 472436 472582 473184 473939
58620 473939 474350 474280 474069 474120 474823 476858 480777 486064 491329 495756 499691 503525 506896 509457 511568 513556
58604 513556 515057 515814 516433 517578 518963 519891 520259 520264 519683 518252 516415 514945 514072 513609 513589 514223 515520
58587 515520 517528 520661 525333 531583 539368 548687 559049 569459 579395 589186 598891 607552 614304 619651
58573 619651 624892 630755 637348 644928 653905 664311 676001 689207 704387 721810 741613 763926
58561 763926 788541 814864 842415 870859 899218 925714 948732 967380 980954 988870 991561 990466
58549 990466 986608 980131 971739 963328 956259 949957 943137 935489 927149 917461 905420 890717 873315
58536 873315 852786 829210 804147 779586 756402 734727 715140 698326 684023 671422 660325
58525 660325 651028 643497 637422 632563 628296 623580 618241 613499 610208 607366 603528 598980 595209 592780
58511 592780 591058 589614 588625 588113 587853 587852 588091 588199 588101 588327 588911 588854 587692 586652 587004 588137 588687 588822
58493 588822 589864 592229 595267 598664 602486 606279 609736 613924 620333 628827 637902 646774 655985 666233
58479 666233 677857 691139 705833 720687 734649 748026 761167 772630 780201 783282 782702 778764
58467 778764 771334 761637 752005 743754 736826 731430 728399 727869 729171 732082 736826 742978 749893 758100
58453 758100 768706 781430 794681 807351 818920 827980 832625 832479 828658 821727 811433 798593 785285
58440 785285 772729 760668 749254 739826 733233 728866 725947 724520 724669 725948 728007 730779 733925 737252
58426 737252 741656 748367 757320 767565 778978 791881 805056 816090 823917 829219 832108 831403 826805
58413 826805 819929 812407 804475 796031 787548 779219 770557 761566 753160 745925 739630 734282 730342 727547
58399 727547 724866 722089 720219 719992 721279 724083 728649 734264 739404 743499 747233 750845 753650 755538
58385 755538 757482 760194 763619 767998 773915 781055 788393 795793 803781 811650 817627 821323 824232 827394
58371 827394 830385 833082 836479 840999 845698 849935 854463 860241 867561 876768 888312 901667 915665
58358 915665 930175 945884 962243 977496 990971 1003441 1014912 1024137 1030865 1036514 1041944 1046531
58346 1046531 1050068 1053566 1057471 1061038 1064238 1068355 1073946 1080131 1086666 1094866 1105667 1118543 1133017
58333 1133017 1149466 1167840 1187376 1208018 1230185 1252811 1273725 1292276 1309256 1323999 1334411
58322 1334411 1340538 1345208 1350172 1354381 1357178 1360293 1365175 1370977 1376762 1383411 1391835 1401512 1412131 1424492
58308 1424492 1438497 1452565 1466207 1480858 1497001 1513069 1528402 1544677 1562921 1581732 1599926
58297 1599926 1618422 1637971 1657679 1677290 1698348 1721567 1745692 1770463 1797827 1828535 1860404
58286 1860404 1891722 1923526 1956689 1989807 2022037 2055156 2090682 2127740 2165814 2206722 2251718
58275 2251718 2299499 2349020 2401197 2455680 2509175 2559429 2607866 2656122 2703360 2749536 2797777
58264 2797777 2850577 2906757 2964968 3026865 3093927 3164437 3236651 3311642 3389943 3468788 3545988
58253 3545988 3623296 3702769 3783347 3864411 3949102 4040361 4137086 4237843 4344849 4460375 4582786
58242 4582786 4710201 4844670 4988695 5141047 5300123 5467925 5646629 5834952 6032169
58233 6032169 6241907 6467471 6707206 6959038 7225726 7511059 7814975 8137152 8481161
58224 8481161 8850236 9243434 9661018 10108974 10593312 11115254 11677282 12287871 12954093
58215 12954093 13675925 14454831 15301911 16230785 17249763 18369702 19613080 21006878 22574077
58206 22574077 24342267 26353956 28659203 31308227 34366203 37929641 42114155 47030174
58198 47030174 52782612 59490051 67298806 76401200 87075594 99718288 114828412 132975723
58190 132975723 154813070 181102424 212590972 249550087 290961302 333704360 372470316
58183 372470316 401002978 414382870 411020251 392985473 364572849 330346359 293969461
58176 293969461 258037677 224292962 193750551 166792547 143375129 123257737 106116475
58169 106116475 91579445 79276639 68886029 60126017 52731298 46465801 41145015
58162 41145015 36622231 32763168 29450211 26596403 24133787 21994630 20117714 18462577
58154 18462577 17001308 15702548 14535811 13483698 12536520 11680321 10900851 10192920 9554430
58145 9554430 8976017 8446402 7962820 7526498 7132216 6771173 6439592 6135690 5852395
58136 5852395 5581861 5323951 5082457 4856248 4641499 4439025 4251665 4077222 3911188
58127 3911188 3753891 3608155 3472420 3342748 3219310 3104487 2996689 2892254 2791581
58118 2791581 2697570 2609770 2525579 2445426 2371310 2301851 2234063 2168500 2107637 2050708 1994957
58107 1994957 1940423 1888710 1838553 1787463 1736499 1688790 1644502 1601648 1560662 1523730 1490660
58096 1490660 1459567 1430650 1405217 1382054 1358754 1335605 1314294 1293902 1272234 1250196 1230776
58085 1230776 1214349 1198663 1182807 1167495 1152131 1135273 1117553 1100709 1084174 1065821 1045462
58074 1045462 1024490 1002818 979479 955655 933825 914323 895696 877860 861871 847186 832263
58063 832263 817432 804272 792651 781188 770027 760263 751187 741012 729744 718544 706984 693965
58051 693965 680742 669847 661343 653087 644325 636130 628659 621027 613648 607740 602677 596745 590344 585475
58037 585475 582109 578091 572785 567912 564474 561475 557984 553828 548071 539422 528651 518178 508870 499484
58023 499484 489522 480252 472531 465827 459889 455368 452413 450498 449824 450976 453127 454594 455292 456664 459107
58008 459107 461433 462991 464343 465712 466629 467161 467689 467572 465941 463551 461831 460486 458290 455886 455127
57993 455127 455746 455496 453838 452650 452682 452056 449142 444499 439032 432642 425788 420110 416131 412179 406881
57978 406881 401193 396787 393867 391585 389282 386403 382429 377760 373651 370685 368337 366316 364920 363727
57964 363727 361522 358136 354892 352682 350972 349252 347916 347105 346135 344811 343940 343752 343100 341086 338440
57949 338440 336528 335907 336369 337448 338457 338962 339529 341064 343310 345158 346528 348560 351747 355387 359215
57934 359215 364039 370250 377129 384157 391580 399042 405036 408462 409581 408857 406086 401299 395318 388706
57920 388706 381206 372760 364056 355609 347386 339749 333563 328895 324805 320918 317976 316420 315790 316080 318260
57905 318260 322651 328057 333296 338359 343194 346599 347416 345980 343438 340384 336917 333263 329575 325757
57891 325757 322053 319094 316952 315065 313537 313435 315111 317226 318179 317803 316981 316363 316079 315983 315589 314330
57875 314330 312339 310425 309081 308314 308496 310296 313378 316343 318474 320599 323757 328011 332983 338477 344004
57860 344004 348782 352821 357121 362271 367783 373234 378963 385104 391004 396163 400708 404490 406886 408004
57846 408004 408795 409354 408481 405729 402478 399939 397371 393488 388525 383627 379072 374395 369567 364863 360120
57831 360120 355209 350764 347509 345340 343868 343236 343651 344719 346052 347870 350268 352620 354556 356769 359970
57816 359970 363728 367252 370586 374025 376985 378460 378095 375959 371938 366324 360336 355008 350028 344669
57802 344669 339261 334696 331019 327726 325016 323506 322863 321908 320063 317735 315300 312640 309759 307103 305139
57787 305139 304069 303854 304085 304126 303872 304058 305361 307603 310329 313611 317593 321785 325599 329150 332724 335841
57771 335841 337694 338230 338010 337276 335924 334055 331657 328017 322392 315271 308172 302207 297484 293723 290664
57756 290664 287812 284624 281231 278591 277710 278904 281667 284941 287688 289618 291347 293701 297037 301316
57742 301316 306288 311287 315364 318158 320364 322954 326267 330101 334147 337887 340622 342229 343508 345265
57728 345265 347435 349561 351641 353857 355895 357198 357649 357512 356930 355985 354987 354313 354181 354737 355917 357026
57712 357026 357117 356092 354711 353231 350969 347728 344625 342633 341133 338904 335862 332885 330605 329431 330143
57697 330143 333186 337656 342076 345923 349460 352427 354040 354135 353213 351463 348784 345693 343151 341364 339754
57682 339754 338235 337613 338487 340585 343499 347436 352930 360396 370181 382593 397573 414767 434219 456948
57668 456948 484765 519616 562781 614017 670691 727090 774535 803410 807281 786396 747058 697323
57656 697323 643498 590030 540501 497157 460231 429054 403471 383351 367453 354026 342308
57645 342308 332475 324533 318241 313782 311295 309907 308265 305987 303706 301809 300074 298471 297385 296945
57631 296945 296824 296727 296530 296101 295552 295357 295581 295387 294037 291973 290086 288410 286480 284486 282962 281722
57615 281722 280269 278975 278559 278658 278269 277550 277772 279333 281132 282138 282341 281942 280878 279569 278926 279024 278761
57598 278761 277372 275405 273713 272303 270782 269147 267547 265815 263793 261654 259477 256990 254121 251426
57584 251426 249639 249005 249175 249402 248933 247709 246696 247006 248604 250346 251198 250894 249548 247379 244881 242623
57568 242623 240765 239227 238155 237653 237310 236723 236294 236659 237597 238456 239429 241261 243723 245609 246477 247262 248846
57551 248846 251066 253488 256214 259558 263703 268888 275021 280918 284922 286630 287126 287298 287005 286220 285748
57536 285748 286108 286668 286648 286136 285500 284653 283680 283430 284643 286957 289448 291693 293762 295663 297353 298905
57520 298905 300254 301221 302139 303894 306979 311042 315661 320847 326376 331407 335405 338857 342495 346317 349848
57505 349848 352787 354835 355486 354657 353162 352018 351526 351325 350893 349731 347688 345489 344286 344291 344510 344244 344089
57488 344089 344902 346560 348482 350691 353544 356935 360509 364210 367901 370986 373216 375379 378364 381882
57474 381882 384922 387113 388745 389796 389936 389493 389490 390564 392428 394507 396525 398416 400190 401996 403971
57459 403971 406035 408152 410648 413876 417612 421237 424476 427605 430951 434578 438459 442604 446928 451229
57445 451229 455419 459637 464103 468883 473725 478235 482339 486506 491258 496568 502047 507550 513011 517825
57431 517825 521315 524068 527962 534247 542119 549717 556156 562002 568131 574794 581676 588363 594647 600630
57417 600630 606585 612693 618990 625430 631698 637149 641539 645782 651320 658575 666627 674509 682087 689457
57403 689457 696329 702489 708196 713696 718940 724196 730240 737428 745137 752667 760099 767830 775912 784411
57389 784411 793774 804169 815016 825767 836646 848039 859786 871687 884066 897056 909884 921667
57377 921667 932476 942867 952947 962746 972940 984163 995920 1007110 1017352 1026916 1035816 1044079
57365 1044079 1052616 1062584 1073861 1085268 1096385 1108056 1120924 1134473 1147885 1160930 1173559 1185413
57353 1185413 1196317 1206753 1217337 1228231 1239405 1251033 1263210 1275583 1287753 1299941 1312838
57342 1312838 1326790 1341302 1355496 1369014 1382436 1396782 1412662 1429992 1448383 1467485 1486977
57331 1486977 1506662 1526741 1547608 1569228 1591094 1612954 1635123 1657798 1680589 1703051 1725279
57320 1725279 1747581 1769997 1792548 1815630 1839746 1865113 1891720 1919297 1946959 1973520 1998726
57309 1998726 2023668 2049536 2076459 2103987 2131965 2160207 2188026 2215022 2241935 2269808 2298658
57298 2298658 2327812 2357235 2387528 2418835 2450712 2483009 2515960 2549331 2582354 2614699 2646902
57287 2646902 2679687 2713333 2747749 2782712 2817937 2853215 2888437 2923304 2957462 2991263 3025886
57276 3025886 3062209 3099993 3138614 3177862 3217292 3255669 3292288 3328370 3365909 3405417 3445934
57265 3445934 3486908 3528601 3570729 3612232 3652827 3693577 3735574 3778979 3823590 3869186 3914937
57254 3914937 3959630 4003059 4046361 4090453 4134999 4179377 4223748 4268515 4313544 4358681 4404363
57243 4404363 4450947 4497931 4544633 4591297 4638735 4687119 4735806 4784292 4832681 4881111 4929153
57232 4929153 4976030 5021266 5064965 5107517 5149106 5189620 5228971 5267240 5304428 5340448 5375595
57221 5375595 5410634 5445961 5481081 5515455 5549603 5584662 5621024 5658072 5695217 5732464 5770033
57210 5770033 5808139 5847197 5887592 5929150 5971448 6014585 6058884 6103749 6147673 6189702 6230206
57199 6230206 6269983 6309283 6347971 6385919 6422716 6457531 6489775 6519603 6547461 6573540 6597954
57188 6597954 6621049 6643123 6664086 6683695 6701920 6718847 6734401 6748341 6760496 6771023 6780574
57177 6780574 6790038 6799805 6809415 6818245 6826386 6834384 6842228 6849019 6853482 6854385 6850675 6841835 6828103 6809843
57163 6809843 6786878 6758889 6726142 6689080 6647492 6601035 6550434 6497157 6441874 6384275 6324674
57152 6324674 6264795 6206608 6151255 6099475 6052122 6009573 5971149 5935721 5902465 5870672 5839347
57141 5839347 5807502 5774477 5739564 5701632 5659520 5612711 5561426 5506334 5448354 5388529 5328002
57130 5328002 5268142 5210470 5156062 5105136 5057550 5013446 4972879 4935040 4898610 4862938 4828330
57119 4828330 4795243 4763827 4734347 4707599 4684765 4667208 4656239 4652728 4657185 4670600 4694988 4732908
57107 4732908 4787197 4861837 4962496 5095541 5267323 5485476 5760629 6106450 6539189 7078495
57097 7078495 7748086 8574683 9587034 10816333 12295142 14053169 16114109 18496469
57089 18496469 21213736 24269881 27654100 31335926 35250877 39275743 43221418 46873155
57081 46873155 50060769 52699199 54765904 56248982 57123149 57366485 56984619 56015029 54516786
57072 54516786 52561482 50228422 47599848 44756029 41771391 38710836 35627902 32568636
57064 32568636 29578931 26706875 23997153 21484056 19189060 17121377 15278461 13647791
57056 13647791 12211287 10949644 9843954 8875897 8028437 7286444 6636503 6066849 5567653
57047 5567653 5130417 4746841 4408995 4110492 3846286 3611273 3400363 3210127 3038895
57038 3038895 2884788 2744883 2616791 2499776 2393648 2297740 2211741 2136653 2074132 2025577
57028 2025577 1992421 1976424 1978368 1995663 2020363 2038938 2035568 1999115 1929236 1835669 1731093
57017 1731093 1624747 1521712 1425167 1337145 1257934 1186533 1121911 1063288 1009737 960442 915255
57006 915255 874472 838198 806199 777969 752620 729209 707515 688073 671179 656477 643810
56995 643810 633800 627068 623518 622869 625328 631182 640232 652186 667177 685320 706191 729171 753783
56982 753783 778965 802281 820510 830964 832220 824324 809113 789930 770004 750797 732145 713822
56970 713822 696457 681056 668154 657634 649051 642057 636702 633452 632936 635693 642119 652425 666568
56957 666568 684274 704861 726509 745649 757744 759406 750022 731608 707519 681252 655599 632042
56945 632042 610724 591262 573694 558705 547074 539029 534098 531651 531683 534939 542174 553589 569346
56932 569346 590224 616846 647823 679050 705086 721196 724511 714388 692568 662838 629679 596505
56920 596505 564752 534395 505286 478038 453706 432813 415051 399940 387227 376481 366972 358539
56908 358539 352046 348213 346263 344562 342455 340674 339946 340013 340144 339927 339385 338913 339242 340854 343341 345953
56892 345953 348860 353244 360046 369360 381218 396171 414552 435541 457145 476631 490920 497497
56880 497497 495750 487339 475028 461238 447546 434839 423548 414078 407211 403732 403643 406196 410869
56867 410869 417826 427427 439943 456035 476882 503502 536253 575003 618853 665104 708833 744075
56855 744075 765667 770631 759014 734148 701487 666334 632265 601253 574496 552741 536351 525540
56843 525540 520428 520954 527184 539793 559687 587081 621676 664016 715969 779185 852949 933015
56831 933015 1011426 1077383 1119998 1132427 1114561 1072170 1013703 947348 879489 814370 754529
56820 754529 701413 655510 616369 583386 556848 537707 526350 522343 525501 536433 555737 583556
56808 583556 620273 666506 721047 778682 830484 866616 879828 868101 835245 788658 735666
56797 735666 681373 629109 581396 539751 504399 475018 451523 433767 421165 413217 410032 411831
56785 411831 418359 429200 444311 463872 487912 515996 546277 574428 594556 602235 596538 579109
56773 579109 552387 519433 484274 450748 420820 394569 371401 350752 332135 315447 301014
56762 301014 288810 278086 268304 259868 253171 247546 242060 236855 232727 229743 227231 224850 222717 220707
56748 220707 218538 216413 214687 213088 211166 209334 208492 208636 208847 208644 208413 208338 207893 206704 205181 203935
56732 203935 203193 202979 203264 203642 203470 202685 202059 202340 203496 204993 206430 207627 208414 208712 208774 209131 210207
56715 210207 211896 213498 214278 214213 213961 213975 213978 213531 212733 212023 211689 211972 213224 215335 217320 218187 218125 218188 218857
56696 218857 219545 219579 219072 218581 218359 218271 218276 218732 220083 222232 224333 225448 225424 224824 224063 223100 222067 221524 221774
56677 221774 222476 223294 224330 225535 226280 226092 225303 224427 223400 222026 220622 219514 218349 216631 214605 212888
56661 212888 211593 210514 209765 209491 209253 208517 207521 206889 206683 206602 206844 207880 209504 210937 211812 212350 212695
56644 212695 212801 212839 212974 212922 212489 212352 213428 215495 217300 218051 218044 217846 217618 217325 216937 216341 215628 215305 215631
56625 215631 216023 215843 215503 215770 216267 215774 214108 212530 212098 212607 213353 213937 214013 213236 211983 211268 211477 211886
56607 211886 211856 211768 212253 213133 213711 213660 213105 212190 211040 209895 208975 208358 208171 208593 209521 210494 211109 211283 211122
56588 211122 210797 210508 210287 209927 209397 209109 209422 210156 211089 212505 214565 216464 217148 216732 216362 216748 217774
56571 217774 219493 222402 226399 230386 233378 235468 237461 240126 244027 249468 256427 265000 275839 289456
56557 289456 304994 320439 334053 344965 352553 356379 356993 355813 353809 351111 348023 345357 343308
56544 343308 341030 338004 335019 333105 332145 331183 329539 327042 323674 319620 315294 310833 305983 300843 296152
56529 296152 292288 288469 283609 277695 271778 266824 263097 260511 259035 258588 258740 258674 257660 255771 253957
56514 253957 253003 252526 251462 249404 246892 244478 242247 240393 239476 239677 240313 240480 239902 238956 238206 238041 238501
56497 238501 239295 240111 240800 241095 240577 239324 238096 237251 236034 233778 231304 230011 229942 230008 229894 230322 231396
56480 231396 232165 232202 232257 232895 233762 234620 235857 237369 238126 237650 236921 237072 238074 239348 240747 242204 243251
56463 243251 243655 243804 243824 243190 241867 240942 241293 242377 243144 243451 243708 243815 243373 242514 241660 240824 239869 239105
56445 239105 239043 239875 241602 244177 247076 249311 250330 250381 249677 247979 245502 243395 242557 242614 242668 242440 242034
56428 242034 241358 240484 239978 240091 240189 239639 238752 238203 238137 238446 239303 240673 241920 242643 243360 244664 246275 247647
56410 247647 248926 250505 252169 253463 254446 255394 256205 256806 257642 259058 260617 261630 261916 261587 260693 259637
56394 259637 259268 259882 260786 261323 261632 261793 261236 259844 258688 258750 259648 260487 261153 261777 261922 261528 261832 263939
56376 263939 267059 269487 270856 272039 273344 274332 275220 276921 279488 281770 282863 283013 282920 282971 283244 283582
56360 283582 283579 283031 282334 282055 282419 283635 286155 289973 294212 298091 301740 305280 307877 308720 308441 308444 309227
56343 309227 310286 311238 311992 312231 311736 310972 310471 310127 309957 310888 313618 317330 320819 324420 329319 335263
56327 335263 340449 343755 345804 347761 350257 353569 357694 362000 365626 368340 370365 371622 371971 371918 372111
56312 372111 372364 372098 371457 371023 370792 370472 370517 371760 374228 377371 381145 385759 390681 395096 399131 403477
56296 403477 408018 412012 415395 418697 421947 424909 428153 432555 437911 443408 449204 456115 463885 471305
56282 471305 478080 485066 492630 500339 508416 517863 528778 539969 550689 561486 572984 585134 598117
56269 598117 612683 629042 646436 664250 682639 701822 721855 743448 767923 795895 826922
56258 826922 860760 898089 939756 986245 1038204 1096634 1162307 1235699 1317519 1408456 1508393
56247 1508393 1616747 1733503 1858938 1992463 2132730 2278562 2428504 2579576 2727811
56238 2727811 2869984 3003476 3124537 3228294 3310794 3369823 3403841 3411842 3394611 3354587 3294029
56227 3294029 3214574 3118801 3010621 2893591 2770093 2642454 2513376 2384771 2257582 2133228
56217 2133228 2013866 1900726 1793575 1692339 1597873 1510572 1429622 1354319 1284845 1221069
56207 1221069 1161846 1106251 1054406 1006544 962418 922158 886487 855373 827643 802533 780495
56196 780495 761858 745853 731598 718964 707833 697601 688010 679501 672216 665682 659882 655428 652263
56183 652263 649387 646382 643919 642264 640597 638452 636571 635655 635433 635597 636456 638037 639700 641280 643526
56168 643526 646876 650862 655099 659640 664079 667733 671158 675962 682632 690073 697713 706304 716061 726037
56154 726037 736311 748859 764909 783137 801900 821794 844481 870256 898452 929425 964806
56143 964806 1006462 1056282 1116186 1187184 1268755 1359505 1457401 1558791 1658410 1751313 1834206
56132 1834206 1905000 1962904 2009872 2050408 2088609 2125985 2162201 2196049 2224845 2244835 2253916
56121 2253916 2253241 2245450 2232492 2215601 2195323 2170043 2135782 2088862 2028140 1954358 1869236 1776392
56109 1776392 1681468 1589686 1504001 1426113 1357542 1298569 1247767 1203954 1167339 1137753 1113422
56098 1113422 1092843 1076353 1064467 1056108 1049921 1046012 1044937 1046155 1048864 1053172 1059220 1066239 1073592
56085 1073592 1081537 1090024 1098108 1105563 1113576 1122787 1132211 1141162 1150603 1161394 1172908 1184606 1197322
56072 1197322 1211659 1226727 1241681 1256905 1272568 1287846 1302775 1318945 1337039 1355654 1373846
56061 1373846 1392793 1413489 1434883 1455783 1476500 1497127 1516418 1534035 1551686 1570458 1589309
56050 1589309 1607831 1627900 1650701 1674655 1698377 1723109 1750050 1777816 1804940 1832473 1861779
56039 1861779 1892250 1923622 1957943 1996668 2038308 2081575 2128135 2179345 2232858 2285624 2337961
56028 2337961 2391632 2446236 2500563 2555243 2610997 2666528 2721136 2777052 2836316 2897916 2960917
56017 2960917 3027454 3099297 3174520 3251015 3330282 3414021 3500293 3587252 3677612 3774909 3878130
56006 3878130 3984496 4094754 4211201 4333288 4459917 4593336 4735953 4886032 5041393
55997 5041393 5204481 5378803 5563391 5756144 5959537 6177385 6408937 6651991 6908937
55988 6908937 7183760 7476061 7784173 8111185 8461622 8835427 9231881 9656253 10115715
55979 10115715 10612007 11145182 11720951 12346869 13025297 13758319 14555880 15430967 16391444
55970 16391444 17446153 18614897 19923060 21391852 23045126 24921506 27069602 29539255
55962 29539255 32393051 35721294 39628869 44210803 49559080 55795179 63087377 71651326
55954 71651326 81765628 93794226 108177775 125409739 146056764 170810618 200432320
55947 200432320 235401322 275182345 317315697 356965168 387707830 403702578 402161885
55940 402161885 384462974 355137965 319631871 282446406 246509799 213427876 183913716
55933 183913716 158103069 135805561 116705043 100451587 86677919 75026176 65185210
55926 65185210 56888232 49887203 43956679 38916253 34625380 30958952 27804962 25078539
55918 25078539 22717054 20661882 18858387 17268614 15867664 14628804 13523989 12535350
55910 12535350 11652951 10862905 10148528 9500549 8915121 8383590 7894200 7441997 7027453
55901 7027453 6647049 6294127 5967083 5667686 5392675 5135397 4894434 4672471 4467893
55892 4467893 4275392 4093952 3926554 3772611 3627941 3491702 3366533 3252222 3145687
55883 3145687 3046682 2957014 2874225 2792138 2707795 2622551 2536881 2449888 2363719 2282711 2207637
55872 2207637 2135527 2065115 1997711 1932905 1868347 1803917 1741686 1681786 1622600 1564827 1511036
55861 1511036 1461365 1413856 1368742 1328058 1291263 1255686 1221331 1190913 1164937 1140893 1117523
55850 1117523 1095805 1075361 1053931 1031079 1008770 987733 966662 945513 926175 909284 893424
55839 893424 878004 863903 850950 837627 823618 809899 796257 781489 766117 752065 739630
55828 739630 727570 716012 706280 697961 689206 679879 671285 662787 652013 638710 625246 612917 600850
55815 600850 588993 578940 571068 563759 556262 549635 544204 538797 533214 528917 526525 525131 524727 526740
55801 526740 531415 537113 543029 550209 559008 567774 575018 580889 585652 588640 589438 588329 584977 578532
55787 578532 569535 559925 550774 541763 532981 525000 516836 506162 492287 476950 461726 446749 432516
55774 432516 420630 411853 405372 400784 398918 399845 401920 403660 405017 406163 406760 407091 408132 409739 410310
55759 410310 408970 406566 403939 400866 397300 393985 391080 387648 383146 377977 372075 364507 355081 344926
55745 344926 334998 325418 316620 309544 304166 299362 294648 290598 287196 283428 278944 274469 270270 265877
55731 265877 261656 258776 257118 255042 251776 248234 244964 241206 236664 232239 228241 223698 218328 213376
55717 213376 209610 206328 203248 201443 201263 201131 199761 198010 197260 197404 197745 198553 200327 202617 204749 206772
55701 206772 208678 209739 209552 208727 207744 206217 204036 201988 200449 198714 196491 194799 194534 195395 197031
55686 197031 199797 203432 206505 208340 210166 213207 216917 220355 224006 228779 234234 239204 243385 247053
55672 247053 250012 251995 253373 254429 254782 254527 254992 257202 260419 263366 266048 269116 272147 273890 273884 272791
55656 272791 271446 270367 269716 269029 267431 264678 261434 258170 254739 251427 249167 247948 246209 242744 238132
55641 238132 233345 228178 222189 216017 210428 204966 198941 193001 188378 185179 182692 180759 179580 178664
55627 178664 177231 175322 173484 171789 170068 168609 167687 166980 166357 166576 168136 170090 171068 170933 170358 169369
55611 169369 167512 165013 162567 160311 158037 155997 154471 152900 150592 147950 145991 144923 144201 143680 143660
55596 143660 144021 144292 144392 144463 144207 143279 142091 141393 141263 141303 141497 142081 142885 143642 144654 146351 148501 150577
55578 150577 152555 154613 156521 158195 160408 164013 168799 174007 179608 186177 193795 201920 209993 217331
55564 217331 222838 225816 226749 226423 224636 220748 215108 208883 202696 196462 190262 184331 178356 171912 165489
55549 165489 160149 156201 153159 150866 149637 149311 149117 148571 147752 146736 145555 144642 144523 145050 145679 146401
55533 146401 147647 149423 151302 153106 154756 155637 155074 153441 151859 150682 149115 146426 142846 139082 135574
55518 135574 132321 129040 125436 121693 118471 116047 113846 111355 109029 107564 106807 106175 105692 105647 105604 104817
55502 104817 103401 102086 101079 100193 99767 100305 101325 101808 101743 102021 102792 103188 102883 102688 103200 103998 104591 105236
55484 105236 106302 107617 108874 109993 110732 110629 109713 108684 108107 107947 108051 108473 109145 109784 110262 110526 110209
55467 110209 109037 107618 107023 107407 107718 106962 105094 102680 100437 99160 99271 100220 101051 101660 102717 104340
55451 104340 105820 106826 107880 109313 110701 111746 112804 114038 114843 114663 113696 112311 110524 108514 106967
55436 106967 106196 105559 104379 102978 102193 102246 102720 103345 104259 105644 107439 109234 110294 110057 108860 107762
55420 107762 107404 107475 107485 107519 107860 108374 108756 108981 109081 108796 107913 106660 105396 104188 103085 102538 103057 104465
55402 104465 105836 106222 105425 104135 103324 103280 103289 102569 101419 100980 101732 102790 102941 102036 101067 101115 102383 104040
55384 104040 104895 104496 103645 103549 104496 105658 106111 105580 104269 102651 101541 101726 103113 104697 105597 105749 105436
55367 105436 104754 103889 103375 103552 104058 104255 103934 103339 102710 102075 101321 100284 98937 97605 96793 96734 97320 98388
55349 98388 99690 100619 100531 99573 98714 98744 99551 100501 101091 101107 100617 100088 100111 100738 101416 101731 101836 101982 102102 102095 102134
55328 102134 102356 102548 102360 101558 99946 97478 94697 92640 91989 92538 93614 94715 95598 96222 96868 97903
55312 97903 99160 99930 99844 99362 99118 99138 99052 98701 98230 97887 98054 99108 100867 102449 103125 103109 103178 103650 104021
55293 104021 103499 101665 98843 96072 94512 94545 95522 96551 97378 98278 99316 100094 100255 100034 100120 100898 101847
55276 101847 101930 100752 99111 98155 98225 98872 99693 100594 101392 101885 102344 103284 104611 105595 105824 105585 105166 104436
55258 104436 103413 102570 102183 101903 101384 100844 100594 100441 100023 99424 99014 98942 99155 99665 100469 101374 102152 102691 102888
55239 102888 102699 102376 102286 102349 102053 101162 100048 99186 98815 99150 100319 101790 102498 101980 100970 100524 100966 101930
55221 101930 102897 103373 103037 102154 101399 100977 100384 99295 98104 97208 96437 95658 95281 95563 95984 96015 95970 96363 96890
55202 96890 96851 96265 95798 95798 96144 96818 97945 99310 100488 101332 101874 101996 101746 101700 102297 103047 103074 102358 101692 101517
55182 101517 101494 101257 100925 100749 100857 101382 102397 103633 104752 105904 107464 109272 110664 111375 111831 112412 112919
55165 112919 112985 112616 112078 111570 111193 111008 111003 111117 111326 111522 111427 110858 110001 109173 108454 107790 107227 106680 105756 104290
55145 104290 102873 102248 102319 102419 102523 103358 105094 106680 106973 106072 105053 104724 105049 105572 105888 105725 105018 104063
55127 104063 103374 103275 103672 104327 105225 106517 108098 109422 109941 109612 108792 107714 106441 105318 104959 105589 106707
55110 106707 107677 108368 108997 109657 110308 110933 111401 111480 111288 111390 112022 112606 112549 112227 112541 113650 114825 115512 115895
55091 115895 116252 116356 115790 114555 113139 112220 112307 113418 115036 116574 117843 118881 119518 119513 119059 118697 118717 119035
55073 119035 119651 120742 122148 123210 123383 122833 122259 122256 122914 123833 124466 124559 124280 123867 123340 122728 122344 122454 122769
55054 122769 122640 121750 120322 118773 117488 116842 116956 117357 117247 116261 114780 113507 112927 113087 113596 113924 113952
55037 113952 114090 114510 114563 113544 111883 110872 111127 111969 112532 112787 113155 113652 113984 114113 114272 114572 114952 115320
55019 115320 115443 114935 113744 112521 112071 112431 112898 113011 113110 113716 114653 115210 115091 114817 115039 115780 116666 117647
55001 117647 119000 120659 122049 122759 122964 122941 122607 121856 121014 120557 120605 121061 121886 122832 123201 122516 121296 120563
54983 120563 120639 120945 120983 120880 120880 120839 120497 119888 119283 118991 119235 119901 120372 120092 119379 119231 120161 121613 122761 123457
54963 123457 124143 125156 126518 128182 130096 132017 133470 133971 133348 131927 130396 129265 128488 127706 126770 125795
54947 125795 124855 123995 123480 123616 124295 125067 125692 126190 126384 125931 124931 123979 123361 122700 121754 121120 121646 123436
54929 123436 125841 128240 130415 132295 133815 135141 136730 139061 142412 146829 152149 158110 164535 171305
54915 171305 178015 183774 187630 189199 188766 186852 183880 180233 176316 172395 168463 164377 160108 155799
54901 155799 151683 148026 145101 143014 141453 139775 137586 135213 133443 132729 132805 133142 133528 134142 135216 136816
54885 136816 138778 140721 142263 143408 144651 146561 149337 152807 156675 160671 164705 169007 173817 178817
54871 178817 183133 186176 188152 189384 189429 187446 183347 178132 173021 168600 164814 161449 158395 155582 152779
54856 152779 149597 145890 142119 139002 136708 134809 133188 132369 132514 132647 131565 129325 127127 125879 125429
54841 125429 125080 124293 122857 121029 119552 119092 119524 120073 120123 119631 118974 118767 119502 120888 121854 121799 121473 121837
54823 121837 122432 121915 120118 118402 117763 117647 117096 116167 115627 115875 116722 117782 118617 118900 118782 118804 119234 119876
54805 119876 120666 121851 123385 124696 125371 125568 125472 124927 123992 123269 123232 123632 123968 124201 124655 125546 126915 128688
54787 128688 130467 131590 131667 130839 129422 127739 126358 125914 126427 127352 128495 130345 133194 136558 139762 142510
54771 142510 144595 145772 146412 147630 150192 153723 157461 161293 165541 170288 175455 181071 186906 192229
54757 192229 196428 199412 201046 200798 198518 194883 190467 185037 178538 172022 166642 162252 158101 154403
54743 154403 151987 150667 149259 147292 145545 144660 144275 143835 143309 142723 141783 140484 139493 139419 140191 141504 143431
54726 143431 146157 149405 152602 155485 158319 161585 165558 170078 174631 178749 182269 185037 186560 186287
54712 186287 184286 181332 178279 175466 172684 169494 165657 161442 157463 154049 151021 148277 146209 145064
54698 145064 144209 142680 140417 138363 137236 136698 135944 134728 133531 132901 132843 132868 132601 132221 132140 132337 132381 132147
54680 132147 131969 131868 131269 129920 128544 127956 127972 127865 127483 127172 126867 126141 125060 124145 123530 122917 122393 122514
54662 122514 123449 124701 125827 126816 127617 127905 127525 126692 125632 124487 123576 123224 123333 123669 124473 126058 127838
54645 127838 128697 128484 128274 128782 129387 129244 128531 127962 127658 127238 126615 126065 125740 125637 125776 125990 125836 125186 124682
54626 124682 125147 126665 128562 130059 130610 129964 128412 126814 125891 125579 125370 125165 125323 126006 126904 127684 128334
54609 128334 128991 129651 130175 130476 130648 130890 131256 131537 131561 131567 131951 132576 132782 132273 131537 131073 130643 129806 128899 128734
54589 128734 129418 130147 130324 130295 130667 131376 131876 131953 131855 131763 131682 131847 132639 133805 134277 133325 131619 130557 130580 130830
54569 130830 130541 130047 129993 130246 130258 130120 130431 131265 131943 131946 131410 130659 129815 129103 129032 129943 131631 133590 135370
54550 135370 136655 137362 137837 138622 139841 141079 141927 142301 142162 141402 140234 139356 139356 140182 141351 142467 143376
54533 143376 144094 144760 145461 146008 146128 145911 145679 145378 144599 143363 142370 142126 142280 142170 141579 140598 139258 137809
54515 137809 136926 136950 137229 136929 136302 136371 137346 138184 137995 137213 136885 137279 137762 137848 137786 138002 138413 138611 138522 138567 139089
54494 139089 139899 140565 140999 141452 141974 142199 141805 140935 140001 139252 138688 138253 137906 137620 137476 137730 138621 140142
54476 140142 142098 144330 146766 149322 151830 154049 155715 156652 156943 156883 156727 156537 156364 156422 156913 157695 158262
54459 158262 158197 157629 157130 157029 156920 156105 154552 153073 152341 152080 151529 150463 149284 148325 147608 147245 147416 147878
54441 147878 148036 147682 147250 147119 147148 147064 146849 146460 145672 144592 143918 144222 145234 146219 146805 147063 147057 146822 146636
54422 146636 146857 147509 148346 149193 149908 150202 149990 149825 150442 151782 152880 152949 152261 151806 152332 153876 155940 157820
54404 157820 158928 159138 158906 158896 159373 160069 160657 161164 161733 162145 161950 161184 160562 160669 161182 161324 160976 160906 161820
54385 161820 163532 165168 165949 165690 164781 163808 163042 162301 161441 160845 161109 162292 163847 165266 166452 167438 168227
54368 168227 168998 170099 171737 173932 176711 179870 182593 183991 184172 184149 184458 184464 183362 181260 178878 176759
54352 176759 175239 174635 174839 175017 174260 172319 169469 166124 162967 160853 159919 159174 157652 155673 154353 154155
54336 154155 154625 155290 156092 156969 157645 157853 157357 156030 154397 153754 154955 157241 159029 159782 160265 161067 161806
54319 161806 162003 161851 161731 161665 161634 161885 162454 162839 162619 162079 161841 162062 162308 162070 161227 160115 159255 158850 158528
54300 158528 157839 156957 156532 156772 157081 156744 155702 154547 153990 154353 155318 156114 156265 156117 156285 156697 156742 156367
54282 156367 156299 156912 157575 157596 157296 157524 158413 159297 159757 160136 160837 161613 161950 161972 162545 164252 166505 167998 168100
54263 168100 167396 166778 166459 166266 166386 167106 168027 168374 168104 167965 168309 168663 168736 168982 169652 170089 169732 169267 169806
54244 169806 171168 171930 171313 170223 170124 171392 173174 174520 175198 175451 175330 174555 173011 171157 169640 168558
54228 168558 167433 165997 164614 163689 163048 162322 161631 161350 161323 160960 160206 159763 160040 160430 160115 159312 159045 159691
54210 159691 160411 160309 159714 159719 160638 161507 161311 160232 159281 159024 159151 159185 159062 158898 158680 158507 158811 159905 161395
54191 161395 162469 162844 163152 164168 165833 167246 167629 167102 166398 166025 165901 165777 165707 165993 166861 168250 169748
54174 169748 170601 170117 168399 166545 165739 166042 166324 165424 163286 161010 159909 160421 161730 162513 162209 161409 160914
54157 160914 160780 160702 160926 161977 163543 164492 164281 163677 163596 163774 163247 161881 160726 160801 162008 163445 164443 165085
54139 165085 165786 166619 167155 166970 166109 164957 163824 162909 162510 162820 163477 163805 163723 164019 165375 167410 169113
54122 169113 170074 170912 172494 175048 178082 180969 183555 186319 189884 194295 198799 202478 204960 206447 207204
54107 207204 207264 206577 205181 203169 200621 197649 194461 191341 188558 186261 184446 183079 182182 181683 181258 180538
54091 180538 179559 178776 178528 178674 178884 179051 179191 179112 178464 177151 175563 174347 174009 174682 176099 177770 179266
54074 179266 180475 181629 183094 185001 187012 188552 189396 189898 190480 191045 191196 190922 190675 190809 191329 192275 193841
54057 193841 195921 197945 199475 200676 201895 203106 204110 205032 206157 207433 208580 209691 211285 213690
54043 213690 216667 219794 223042 226816 231495 237009 242886 248712 254516 260622 267182 274016 280885 287665
54029 287665 294197 300258 305826 311036 315639 318873 320248 320303 320158 320398 320770 320862 320693 320519 320412 320135 319230
54012 319230 317199 313849 309581 305113 300751 296091 290575 284222 277678 271630 266351 261842 258188 255560
53998 255560 253830 252396 250636 248497 246459 244874 243537 242008 240229 238724 238237 239162 241212 243670 246112
53983 246112 248851 252532 257377 263114 269456 276079 281988 285569 285715 282637 277247 270179 261891 253337
53969 253337 245805 240004 235754 232580 230254 228774 228171 228363 228947 229221 228782 228077 227966 228783 230195 231930
53953 231930 234029 236259 237904 238553 238711 239186 240146 241240 242428 244171 246723 249678 252473 255097 258036
53938 258036 261598 265552 269509 273444 277590 281908 285932 289362 292591 296345 300780 305209 308889 311968
53924 311968 315462 320245 326129 332076 337371 342488 348602 356210 364486 372241 379342 386854 395674 405340
53910 405340 414417 421993 428526 435051 441696 447270 450474 451272 450765 449771 447988 444730 440139 435284 431108
53895 431108 427601 424060 419889 414982 409430 403053 395399 386257 376070 365781 356282 348041 341001 334625
53881 334625 328215 321641 315711 311387 308560 306045 302853 299023 295016 290887 286458 281842 277312 272948
53867 272948 268815 265178 262068 258950 255404 251903 249264 247491 245746 243491 240980 238601 236321 234062
53853 234062 232101 230736 229776 228656 226999 224988 223310 222678 223208 224291 225203 225719 226030 226323 226738 227364
53837 227364 227836 227279 225309 222883 221409 221079 220835 220032 219233 219136 219531 219857 220118 220665 221496 222332 223106 223837
53819 223837 224300 224274 224005 224024 224661 225995 228030 230533 232925 234785 236421 238610 241787 245740 250031 254429
53803 254429 258952 263735 268882 274391 280198 286279 292532 298611 304176 309342 314496 319491 323533 326199
53789 326199 328173 330521 333438 336176 338049 339059 339578 339829 339674 338687 336437 332954 328792 324427 319776
53774 319776 314640 309366 304554 300154 295463 290139 284789 280281 276789 273728 270381 266422 262049 257890
53760 257890 254622 252478 251092 249893 248553 246982 245133 243011 240828 238931 237536 236604 235986 235600 235421
53745 235421 235363 235229 234799 234004 233034 232192 231580 230941 229942 228689 227816 227853 228587 229273 229467 229349 229164 228783 228157
53726 228157 227833 228502 230118 231984 233652 235291 237139 239151 241235 243321 244991 245681 245572 245794 247189
53711 247189 249269 250916 251827 252700 254146 256052 258090 260292 262840 265545 267817 269196 269985 271387 274740
53696 274740 280364 287175 293597 298755 302718 305911 308602 310783 312150 312288 311189 309474 307838 306394
53682 306394 304905 303468 302490 302033 301674 301067 300246 299305 298221 297081 296099 295223 294109 292666 291423 291055
53666 291055 291728 293019 294335 295349 296199 297323 298871 300248 300537 299496 297849 296462 295533 294835 294426 294651
53650 294651 295474 296260 296489 296485 297101 298632 300294 301127 301294 302017 304134 307160 310115 312817 315777 319030 321797
53633 321797 323396 323964 324099 324250 324598 325122 325538 325572 325471 325875 327001 328378 329690 331393 334145 337878 341928
53616 341928 345847 349639 353308 356602 359248 361217 362819 364676 367420 371167 375354 379294 382744 385816
53602 385816 388627 391353 394309 397542 400489 402481 403513 404114 404590 404849 404895 404931 404905 404445 403426 402130 400707
53585 400707 398940 396845 395086 394289 394169 393791 392640 391083 389738 388683 387383 385228 382085 378489 375298
53570 375298 373096 371826 371022 370331 369751 369436 369420 369600 369831 370005 370063 370038 370038 370113 370152 369988 369673 369632 370406 372167
53550 372167 374463 376529 377872 378631 379374 380542 382035 383375 384310 385225 386831 389488 392946 396752 400720
53535 400720 405003 409890 415640 422293 429499 436730 443852 451264 459292 467723 476276 485311 495573 507261
53521 507261 519801 532612 545664 559154 573052 587256 601903 617250 633461 650727 669370
53510 669370 689530 710928 733257 756670 781498 807487 833663 859107 883671 907793 931778
53499 931778 955383 978075 999560 1020001 1039783 1059199 1078485 1097979 1117907 1137941 1157336
53488 1157336 1175720 1193537 1211415 1229317 1246670 1263208 1279299 1295464 1311959 1328926 1346508
53477 1346508 1364510 1382148 1398407 1412627 1424652 1434549 1442419 1448380 1452471 1454453 1453790 1449993 1443016
53464 1443016 1433343 1421649 1408444 1394075 1378985 1363724 1348539 1333154 1317185 1300697 1284034
53453 1284034 1267141 1249350 1230083 1209559 1188731 1168551 1149350 1130743 1112030 1092812 1073375
53442 1073375 1054469 1036793 1020790 1006847 995318 986225 979209 973955 970404 968332 966973 965478 963695
53429 963695 962279 962118 963828 967575 972960 979141 985544 992557 1001173 1011879 1024239 1037727 1052501
53416 1052501 1069043 1087397 1107248 1128562 1151606 1176323 1202159 1228679 1256028 1284554 1314331
53405 1314331 1345325 1377790 1412095 1448239 1485921 1525118 1566274 1609783 1655551 1703236 1752687
53394 1752687 1803850 1856414 1909887 1964035 2018968 2074678 2130685 2186224 2240651 2293642 2345140
53383 2345140 2395211 2443826 2490694 2535430 2577903 2618203 2656089 2690665 2720828 2746058 2766549
53372 2766549 2782629 2794306 2801414 2803945 2801971 2795206 2782838 2763900 2737919 2705230 2666766 2623574
53360 2623574 2576580 2526712 2475026 2422496 2369620 2316328 2262447 2208342 2155080 2103834 2055079
53349 2055079 2008418 1963214 1919169 1876218 1834143 1792615 1751484 1710627 1669618 1628094 1586576
53338 1586576 1546437 1508738 1473468 1440203 1409072 1380569 1354709 1330976 1309093 1289325 1271936
53327 1271936 1256793 1243530 1231657 1220262 1208025 1193920 1177998 1161398 1145666 1131959 1120541
53316 1120541 1110817 1101877 1093107 1084375 1075980 1068717 1063752 1061814 1062376 1064067 1066047 1068655 1072606 1078126
53302 1078126 1085144 1093852 1104482 1116812 1130454 1145536 1162541 1181503 1201849 1223152 1245594 1269467
53290 1269467 1294629 1320725 1347607 1375084 1402348 1428191 1451952 1473972 1494914 1514814 1533083
53279 1533083 1549281 1563462 1575623 1585174 1591293 1593702 1592809 1589133 1582868 1574001 1562612 1548932 1533286
53266 1533286 1516029 1497365 1477126 1454969 1430940 1405673 1379892 1353805 1327162 1299758 1271689
53255 1271689 1243170 1214331 1185277 1156252 1127643 1099797 1072817 1046550 1020822 995598 970820
53244 970820 946123 921019 895463 870118 845860 822996 801069 779415 757911 737175 718002
53233 718002 700595 684383 668704 653538 639465 627034 616377 607354 599690 592909 586357 579431
53221 579431 571662 562626 552078 540249 527703 514825 501691 488464 475524 463071 451012 439542
53209 439542 429441 421393 415171 409866 404728 399523 394195 388623 382687 376312 369451 362227 355018 348166
53195 348166 341667 335331 329167 323390 318095 313099 308039 302597 296830 291451 287406 284872 282903 280446
53181 280446 277528 275034 273492 272527 271410 269678 267266 264561 262333 261157 260766 260392 259761 259262 259049 258532
53165 258532 257161 255278 253774 253085 252864 252483 251572 250147 248534 247176 246314 245833 245408 244779 243854 242691
53149 242691 241529 240741 240672 241432 242781 244146 244925 244946 244562 244130 243551 242606 241527 240800 240517 240464 240869 242367
53131 242367 244944 247527 249111 249922 250906 252359 253652 254166 253944 253363 252731 252397 252875 254492 256995 259693
53115 259693 262008 263845 265474 267121 268646 269684 270008 269628 268526 266594 264064 261773 260600 260620 261075
53100 261075 261195 260810 260114 259155 257803 256084 254308 252850 251885 251324 250913 250423 249825 249284 248913 248560 247892
53083 247892 246719 245158 243437 241638 239698 237704 236075 235371 235876 237283 238773 239488 239111 238057 237081
53068 237081 236638 236660 236835 236923 236782 236336 235621 234737 233671 232347 231006 230277 230640 231895 233380 234587 235388
53051 235388 235818 235979 236075 236302 236687 237213 237929 238623 238602 237327 235272 233696 233373 233919 234427 234387 233852 233134 232637
53032 232637 232678 233227 234000 234882 235920 236812 236939 236237 235587 235871 236949 238008 238663 239095 239280 238764 237370 235660
53014 235660 234455 234125 234476 235135 235893 236783 237897 239095 239959 240106 239496 238325 236848 235465 234732 234906 235587
52997 235587 236159 236556 237170 238064 238795 239167 239722 241116 243256 245374 246869 247744 248308 248771 249234 249880 250942
52980 250942 252522 254535 256855 259400 261976 264223 265860 266951 267697 267993 267487 266254 265093 264853 265587
52965 265587 266609 267277 267458 267332 267048 266654 266161 265640 265278 265247 265354 265015 263871 262285 260911 259786 258264
52948 258264 255911 253148 250839 249458 248772 248148 247091 245690 244614 244463 245059 245618 245628 245302 245071 244990 244856
52931 244856 244593 244239 243747 243122 242624 242544 242854 243308 243811 244378 244801 244689 244002 243283 243128 243499 243726 243222 242132
52912 242132 241184 240941 241271 241554 241270 240304 238877 237430 236490 236293 236461 236389 236083 236280 237503 239276 240592
52895 240592 240994 240887 240919 241371 242088 242649 242675 242292 242259 243251 244963 246315 246645 246330 246110 246239 246573 247081 247802
52876 247802 248477 248749 248726 249004 250008 251558 253124 254314 255071 255634 256367 257472 258794 260034 261154 262393
52860 262393 263843 265196 266006 266003 265116 263394 261095 258643 256273 253814 251014 247967 245053 242529 240397
52845 240397 238583 236993 235398 233553 231535 229780 228647 228110 227973 228190 228752 229312 229246 228220 226669 225563
52829 225563 225644 226840 228414 229644 230357 230810 231148 231084 230215 228576 226763 225441 224838 224804 225294 226502 228412
52812 228412 230502 232157 233341 234518 235934 237260 238005 237973 237130 235411 233042 230838 229671 229556 229599 228930
52796 228930 227546 226136 225288 224939 224517 223590 222411 221749 222089 223161 224430 225823 227566 229419 230616 230703
52780 230703 230083 229530 229451 229800 230345 230786 230849 230584 230381 230458 230494 230066 229224 228358 227616 226862 226145 225771 225788 225744 225194
52759 225194 224271 223530 223344 223672 224399 225571 227131 228590 229367 229538 229923 231173 232928 234246 234812 235281 236391
52742 236391 238133 240003 241773 243645 245821 248174 250318 251838 252559 252751 252970 253523 254180 254562 254656 254728 254813
52725 254813 254572 253715 252427 251282 250757 250795 250833 250374 249540 248961 249032 249444 249517 248885 247706 246405 245361 244762
52707 244762 244554 244495 244308 243767 242762 241470 240459 240295 240927 241706 242121 242277 242529 242940 243286 243338 242925 242038
52689 242038 241097 240806 241451 242569 243558 244299 244849 244944 244257 242954 241477 239966 238360 236931 236179 236232 236745
52672 236745 237374 237989 238552 239203 240298 241838 243020 242957 241881 240996 241044 241580 241804 241566 241353 241762 243258 245962
52654 245962 249389 252706 255480 257901 260130 261843 262619 262435 261549 260228 258827 257761 257126 256568 255727 254563
52638 254563 253179 251734 250698 250705 251822 253323 254530 255520 256740 258346 260325 262801 265596 267770 268291
52623 268291 267129 265179 263115 260890 258442 256325 255289 255492 256338 257027 257121 256698 256053 255260 254072 252321
52607 252321 250343 248838 248312 248681 249356 249641 249261 248654 248674 249755 251426 252812 253556 254114 255110 256596 258020
52590 258020 258864 259152 259248 259227 258787 257960 257565 258422 260195 261620 262008 261989 262488 263501 264335 264631 264582 264395 264123
52571 264123 263932 264004 264201 264232 264147 264184 264134 263395 261835 260143 259072 258660 258457 258204 257931 257507 256598 255196 253902
52552 253902 253366 253493 253458 252602 251156 249889 249213 248930 248816 249071 250010 251571 253338 254853 255807 256142 256141 256199
52534 256199 256367 256375 256282 256685 257926 259387 260032 259461 258044 256279 254588 253611 253952 255473 257317 258836 260083
52517 260083 261216 261953 262038 261922 262486 264122 266425 268798 271126 273714 276728 279864 282626 284839 286693
52502 286693 288259 289186 289079 288000 286351 284343 281896 279002 275914 272960 270450 268752 268114 268248 268382
52487 268382 267916 266934 265974 265454 265422 265701 266118 266632 267285 267997 268529 268782 269061 269762 270801 271697 272296 273107 274705
52468 274705 277008 279399 281417 283147 284953 286998 289112 291101 293152 295722 298844 301686 303148 302872
52454 302872 301389 299329 296914 294287 291747 289361 286773 283864 281245 279581 278638 277519 275736 273546
52440 273546 271249 268769 266074 263506 261463 260079 259455 259696 260391 260529 259564 258364 258402 259996 261962 263167
52424 263167 263797 264763 266407 268420 270619 273068 275424 276920 277274 277187 277650 279071 281260 283940 287024 290691
52408 290691 295426 301736 309463 317670 325573 333393 341779 350425 357665 361522 360972 356371 349182 341353
52394 341353 334374 328554 323336 318390 314102 310865 308319 305759 303151 301263 300656 300855 300810 300081 299304 299380
52378 299380 300469 302046 303775 305846 308423 311260 314179 317519 321658 326394 331313 336511 342281 348156
52364 348156 352981 356093 357850 358808 359004 358389 357402 356603 356057 355531 355074 354939 355179 355686 356460 357436 358209 358378
52346 358378 358143 358140 358712 359667 360812 362338 364543 367373 370436 373445 376625 380637 385960 392340 399109 406137
52330 406137 414088 423486 433901 444539 455370 467112 480220 494485 509625 525639 542354 559130
52318 559130 575413 591271 607085 622898 638285 652807 666428 679611 693060 707180 721759
52307 721759 736316 750736 765249 779797 793867 807120 819782 832161 844088 855172 865302
52296 865302 874549 882849 890085 896255 901130 903927 903783 900584 895069 888225 880866 873563 866496 859415
52282 859415 852158 845195 839257 834519 830713 828022 827220 828662 831740 835667 840369 846211 853267 861300
52268 861300 870168 879727 889530 899103 908487 918148 928382 939136 950354 962110 974323 986648 998775
52255 998775 1010762 1023017 1035943 1049415 1062544 1074188 1083873 1091938 1098668 1103707 1106576 1107325 1106223
52242 1106223 1103253 1098548 1092884 1086954 1080338 1072095 1062301 1052135 1042366 1032703 1022882 1013472 1005139 997917
52228 997917 991676 986521 982155 977643 972615 968084 965250 963905 962903 961811 961165 961302 961896 962709 963989
52213 963989 966049 969056 973283 978885 985403 992066 998581 1004993 1010838 1015331 1018568 1021743 1025796 1030515
52199 1030515 1035294 1040070 1045047 1050101 1055103 1060421 1066492 1073071 1079424 1085196 1090775 1096814 1103462 1109882
52185 1109882 1114458 1115901 1114395 1111300 1107576 1102941 1096780 1089238 1080911 1071988 1062409 1052605 1043427 1035442
52171 1035442 1028774 1023366 1018839 1014341 1009362 1004735 1002068 1001985 1003506 1005292 1006936 1008761 1011039 1013824
52157 1013824 1017094 1020509 1023306 1024991 1025954 1026959 1028109 1028746 1028332 1027051 1025495 1024148 1023330 1023292 1024068 1025341
52141 1025341 1026650 1027655 1028124 1027765 1026308 1023837 1020954 1018597 1017597 1018256 1020249 1023101 1026866 1032284 1040148
52126 1040148 1050583 1063107 1077277 1093039 1110496 1129611 1150182 1171858 1194076 1216295 1238476
52115 1238476 1261076 1284364 1307914 1330973 1353051 1373869 1392936 1409653 1423807 1435652 1445534
52104 1445534 1453718 1460605 1466701 1472305 1477411 1481943 1485779 1488499 1489443 1488145 1484565 1478884 1471321 1462051
52090 1462051 1451039 1437955 1422670 1405842 1388623 1371727 1355228 1339358 1324930 1312689 1302696
52079 1302696 1294652 1288378 1283689 1280263 1278164 1278079 1280478 1284791 1290018 1295969 1303277 1312359 1323011 1334980
52065 1334980 1348147 1361932 1375206 1387262 1398432 1409339 1419894 1429536 1438217 1446611 1455301 1464166
52053 1464166 1472630 1480077 1485802 1488957 1489003 1486241 1481496 1475126 1466582 1455099 1440647 1423961 1405838
52040 1405838 1386744 1367082 1347403 1328205 1309778 1292377 1276280 1261532 1247854 1235062 1223366
52029 1223366 1213001 1203656 1194533 1184979 1174909 1164662 1154583 1144699 1134720 1124375 1113822 1103606
52017 1103606 1094150 1085387 1076909 1068332 1059493 1050482 1041539 1032739 1023692 1013830 1003023 991622 979764
52004 979764 967017 952880 937255 920192 901703 882278 863168 845476 829180 813642 798901
51993 798901 785766 774613 764732 755066 745058 734602 723689 712443 701122 689727 677858 665257
51981 665257 652286 639527 627012 614121 600270 585554 570711 556612 543844 532787 523926 517776
51969 517776 514299 512660 511927 511998 513579 517287 523056 530359 538527 546733 554082 560097 564952 568971 571975
51954 571975 573300 572477 569865 566610 564009 562808 563120 564989 568809 575043 583773 594871 608350 623957
51940 623957 640368 655396 667358 675987 681863 685405 686791 686488 685273 683640 681488 678388 673931 667738
51926 667738 659373 648490 635156 620050 604214 588423 572778 557057 541491 526943 514197 503198
51914 503198 493170 483396 473785 464829 457136 451001 446365 443167 441621 441994 444131 447504 451730 456776
51900 456776 462498 468227 473003 476119 477343 476768 474574 470760 465023 457136 447610 437681 428441 420205
51886 420205 412987 407233 403555 401890 401499 401908 403392 406344 410574 415561 421129 427478 434631 442149 449452
51871 449452 456171 462122 467086 470738 472723 472815 471056 467831 463728 459241 454610 449957 445528 441772 439224
51856 439224 438360 439427 442226 446076 450166 453978 457234 459408 459593 457096 452111 445633 438713 431931 425493
51841 425493 419552 414284 409717 405652 401860 398382 395565 393726 392794 392441 392520 393147 394329 395786 397341
51826 397341 399162 401343 403453 404849 405289 404859 403448 400809 397238 393707 391037 389246 387913 386912 386488
51811 386488 386783 387655 388970 390807 393240 395987 398357 399595 399347 397890 395973 394451 393906 394373 395301 395979
51795 395979 396160 396140 396087 395558 394024 391754 389730 388697 388650 389209 390065 390903 391379 391454 391444 391435 390973 389673 387914
51776 387914 386543 385946 385791 385675 385749 386626 388945 393133 399310 407117 415662 423911 431349 438172 444635 450276
51760 450276 454037 455241 454095 451093 446317 439821 432345 424970 417945 410520 402202 393679 386177 380306
51746 380306 375896 372616 370180 368154 366152 364390 363673 364655 367284 371055 375596 380837 386737 393016 399221
51731 399221 404932 409758 413223 414934 415116 414858 415540 417935 421899 426692 431258 434333 434917 433002 429591
51716 429591 425818 422235 419082 416759 415577 415144 414403 412393 408937 404743 400986 398666 398078 398827 400354
51701 400354 402397 404887 407539 409630 410204 408635 405316 401776 399715 399712 401033 402705 404304 405549 405698
51686 405698 404029 400776 397037 393720 390924 388363 386060 384413 383792 384197 385318 386908 389018 391732 394670
51671 394670 397067 398525 399524 401052 403931 408660 415510 424286 434008 443186 450481 455016 456292 454260
51657 454260 449546 443340 436901 431203 426934 424649 424877 428138 434645 443756 453752 462404 467935 469619
51643 469619 467820 463657 458323 452311 445313 437033 427919 418838 410180 401721 393279 385187 378014 372144
51629 372144 367640 364266 361624 359539 358340 358466 359686 360977 361328 360521 359021 357273 355338 353125 350782
51614 350782 348716 347165 345831 344109 341790 339396 337634 336642 335983 335375 335170 336018 338203 341422 345189
51599 345189 349359 354223 360174 367424 376055 386108 397269 408485 418144 424747 427370 425821 420857
51586 420857 414250 407948 402849 398678 395179 392831 392103 392675 394080 396690 401351 408228 416616 425760 435165
51571 435165 444201 452306 459880 468314 478665 490500 502324 512946 522284 531205 540978 552856 567863
51558 567863 586665 609452 635862 665115 696211 727752 757597 783255 803112 817136 826075 830185
51546 830185 829139 822872 811961 797219 779399 759206 737076 712942 686746 659268 632016 606187
51534 606187 582063 559438 538159 518200 499663 482853 468054 455176 443977 434613 427521 422645
51522 422645 419160 416039 412559 408301 403274 398174 393982 390956 388385 385515 382386 379605 377661 376693
51508 376693 376553 376863 377210 377406 377330 376645 375156 373464 372670 373227 374544 375825 376759 377303 377539 378008 379469
51491 379469 381856 384098 385438 386291 387322 388326 388717 388527 388053 386965 384667 381351 377790 374177 370054
51476 370054 365420 361041 357415 354180 350852 347554 344634 342000 339272 336328 333353 330571 328192 326470
51462 326470 325568 325397 325723 326358 327158 327954 328612 329155 329816 331031 333236 336522 340502 344711 349164 354403
51446 354403 361013 369239 379010 390120 402283 415114 428064 440244 450294 456639 458185 455000 448477
51433 448477 440780 433834 428488 424409 420621 416146 410403 403484 396216 389650 384240 379629 375339 371375
51419 371375 367919 364754 361442 358040 355266 353880 354115 355690 358117 360919 363754 366455 368921 370982
51405 370982 372535 373770 375163 377181 380012 383477 387096 390325 392888 394926 396798 398822 401253 404385
51391 404385 408491 413698 419997 427330 435604 444695 454545 465240 477071 490605 506691 526186 549518
51378 549518 576614 607286 641591 679740 721600 766031 810428 851076 884556 909132 924798
51367 924798 932202 931942 924714 911312 892121 867104 836699 802286 765470 727348 688848 651244
51355 651244 615707 582679 552309 525249 502354 483686 468420 455756 445372 437016 430143 424079
51343 424079 418222 412076 405454 398601 391877 385345 378991 373107 368087 363969 360621 358127 356464 354960
51329 354960 352770 349899 347161 345071 343395 341855 340634 339966 339768 339907 340357 340882 341059 340869 340789 341143 341833
51312 341833 342915 344819 347589 350437 352497 353693 354417 354773 354626 354080 353408 352689 351977 351587 351745 352093 351997
51295 351997 351265 350208 349099 347968 346832 345742 344716 343971 344096 345499 347805 350291 352907 356310 360799
51280 360799 365789 370583 375140 379694 383947 387105 388608 388512 387313 385692 384320 383541 383187 382954 382959 383682
51264 383682 385358 387667 390080 392203 393644 393874 392592 390141 387258 384427 381683 379036 376746 375011
51250 375011 373613 372101 370281 368420 366980 366205 365886 365415 364200 362145 359701 357388 355397 353703 352379
51235 352379 351519 350960 350295 349261 347996 346850 346027 345430 344779 343884 342833 341951 341551 341736 342347 343029 343408
51218 343408 343442 343585 344386 345856 347494 349028 350789 353148 355915 358628 361183 363786 366463 369087 371797
51203 371797 374893 378255 381270 383497 385051 386180 386795 386645 385802 384684 383646 382674 381548 380245 379133
51188 379133 378655 378820 379166 379300 379290 379399 379616 379645 379158 377893 375783 373302 371389 370627 370609 370500 370008 369369
51170 369369 368607 367480 366113 365062 364625 364595 364832 365567 367002 369011 371396 373999 376452 378337 379743 381176
51154 381176 382735 383901 384335 384309 384084 383479 382475 381680 381623 381963 381938 381273 380168 378723 376922 374980 373154
51137 373154 371448 369929 369085 369332 370317 371245 371760 371959 371803 371183 370507 370521 371457 372929 374702 376883 379213
51120 379213 380947 381882 382855 384623 386675 387856 388034 388416 390056 392573 394739 396031 397136 398920 401313
51105 401313 403479 404857 405630 406171 406504 406588 406841 407880 409759 411715 412808 412690 411835 411177 411464 412694 414155
51088 414155 415132 415557 415834 416148 416281 416086 415830 415900 416337 416835 417166 417574 418726 421171 424714 428404 431391
51071 431391 433754 436275 439462 443129 447022 451537 457517 465514 475524 487430 501476 518208 538081
51058 538081 561054 586237 611594 634184 651348 662262 668383 672202 675586 679379 684032 689624 695079
51045 695079 698306 697981 694853 690573 685398 677882 666910 653298 639145 626363 616255 609699 606607
51032 606607 605122 602138 595205 583917 569658 554424 540043 527921 518846 512860 509586 508747 510235
51019 510235 513721 518514 524016 530128 537041 544764 553093 561917 571192 580555 589251 596619 602520 607189
51005 607189 610849 613553 615196 615523 614249 611371 607290 602522 597487 592672 588779 586412 585709 586467 588500
50990 588500 591580 595184 598734 602218 606349 612056 619967 630348 643175 658114 674551 691733 708696
50977 708696 724163 737006 747186 756051 765415 776438 789633 805710 825776 850459 879252 911120
50965 911120 945631 983178 1024210 1068630 1115991 1165842 1217684 1270869 1324832 1379187 1433281
50954 1433281 1485810 1535227 1580551 1621548 1658290 1690965 1720095 1746385 1770079 1790769 1808222
50943 1808222 1823288 1837751 1853210 1870007 1887088 1902789 1915835 1925707 1932261 1935397 1935301 1932517 1927188
50930 1927188 1918449 1905185 1887218 1864988 1838166 1805683 1767437 1724929 1679527 1630948 1578334
50919 1578334 1522231 1464532 1406960 1350578 1296512 1245943 1199218 1155841 1115560 1078811 1045938
50908 1045938 1016674 990572 967306 946368 927050 909069 892668 877862 864065 850773 838182
50897 838182 826819 816910 808396 801261 795569 791371 788700 787315 786418 785109 783316 781850 781288 781294 781372 781834
50881 781834 783504 786736 791166 796273 801794 807623 813705 820074 826908 834537 843432 853946 866008 879241
50867 879241 893447 908698 924952 941957 959702 978602 999036 1021105 1045144 1072057 1102724
50856 1102724 1137305 1175589 1217892 1265301 1319048 1379888 1447949 1522985 1604788 1693417 1788864
50845 1788864 1890470 1996999 2107412 2221263 2338240 2457702 2578654 2699464 2817171
50836 2817171 2927716 3027597 3115129 3189830 3251205 3298887 3333512 3356603 3369765 3374829 3374579 3372353
50824 3372353 3370697 3371146 3375350 3385429 3402751 3426912 3456147 3487917 3518541 3543162 3557225 3558106
50812 3558106 3544786 3516187 3470568 3406688 3324990 3227380 3116147 2993400 2861365 2722886
50802 2722886 2581439 2440668 2303844 2173608 2051909 1939915 1838032 1746252 1664619 1593283
50792 1593283 1532129 1480568 1437796 1403065 1375574 1354251 1337860 1325313 1315773 1308471 1302618 1297586
50780 1297586 1293149 1289420 1286360 1283347 1279349 1273685 1266506 1258398 1249616 1239928 1229117 1217318 1204861
50767 1204861 1192019 1178998 1165875 1152404 1138091 1122650 1106290 1089469 1072569 1055955 1040193
50756 1040193 1025949 1013677 1003509 995445 989573 986123 985302 987105 991328 997886 1007001 1018832 1033001
50743 1033001 1048856 1066319 1086145 1109097 1135192 1164081 1195955 1231614 1271688 1316111 1364394
50732 1364394 1415988 1470361 1527038 1585775 1646408 1708264 1769972 1830183 1888456 1945168 2000519
50721 2000519 2053819 2103752 2149028 2188600 2221431 2246335 2262136 2267991 2263804 2250673 2231001 2207941
50709 2207941 2184448 2162780 2144724 2131915 2125597 2126142 2132976 2144958 2160682 2178567 2196960 2214276
50697 2214276 2228795 2238156 2239296 2229247 2206204 2169938 2121343 2061816 1993115 1917675 1838741 1759804
50685 1759804 1683671 1611956 1545424 1484689 1430534 1383703 1344653 1313458 1289781 1272949 1262285
50674 1262285 1257455 1258381 1264843 1276444 1292897 1313882 1338312 1364087 1389064 1412271 1433906 1454251
50662 1454251 1472985 1489660 1504409 1517929 1530960 1544016 1557487 1571654 1586540 1601891 1617466
50651 1617466 1633332 1649838 1667298 1685736 1705015 1725260 1747143 1771574 1799054 1829411 1862264
50640 1862264 1897648 1935962 1977263 2020840 2065612 2110793 2155884 2200080 2242092 2280869 2316404
50629 2316404 2349719 2382160 2414919 2448778 2483396 2516100 2541545 2553361 2547080 2522361 2483083
50618 2483083 2435564 2386169 2339649 2298823 2265230 2239675 2222157 2211702 2206842 2206456 2209990 2216804
50606 2216804 2225466 2233716 2238948 2238666 2230794 2213885 2187232 2150809 2105140 2051141 1989897 1922582
50594 1922582 1850710 1776326 1701624 1628217 1557010 1488847 1424939 1366391 1313569 1266278 1224352
50583 1224352 1187645 1155580 1127254 1102172 1080457 1062193 1046901 1033984 1023418 1015638 1010870 1008923
50571 1008923 1009656 1013236 1019690 1028452 1038749 1050434 1064091 1080109 1097918 1116489 1135451 1155258
50559 1155258 1176233 1198017 1220259 1243287 1267590 1293022 1319174 1346359 1375378 1406219 1437733
50548 1437733 1468854 1499468 1529696 1558963 1586500 1612447 1637877 1663869 1691122 1720450 1753053
50537 1753053 1790098 1832218 1879570 1932255 1990602 2055087 2125853 2202356 2283783 2370017 2461890
50526 2461890 2560242 2664998 2775344 2890313 3008610 3128123 3246187 3360333 3468370 3567966
50516 3567966 3656742 3732750 3794382 3839890 3867587 3876552 3866672 3838086 3791266 3727725 3649973 3560625
50504 3560625 3462150 3357706 3251506 3147959 3050885 2963696 2889583 2830931 2788899 2763827 2755588
50493 2755588 2763216 2784825 2818312 2861480 2910922 2961363 3006817 3041966 3061930 3061697 3037356 2988146
50481 2988146 2916556 2826485 2721965 2607270 2486800 2364131 2241706 2121599 2005914 1896182
50471 1896182 1793170 1697705 1611031 1533812 1465294 1404005 1349004 1299998 1256676 1218614 1185758
50460 1185758 1158444 1136776 1120189 1107679 1098391 1092118 1089374 1090800 1096356 1105199 1116497 1130051
50448 1130051 1145943 1163846 1183074 1203284 1224778 1248081 1273281 1299624 1325483 1348763 1367547
50437 1367547 1380575 1387338 1388125 1384174 1377470 1369903 1362547 1355798 1350028 1345788 1343523 1343418 1345620 1350263
50423 1350263 1357226 1366119 1376702 1389204 1404096 1421731 1442349 1466300 1494026 1525899 1562239 1603493
50411 1603493 1650090 1701976 1758368 1818120 1880219 1943795 2007740 2070557 2130649 2186651 2237529
50400 2237529 2282631 2321670 2354330 2379673 2396135 2402267 2397310 2380861 2352365 2311478 2258963 2196998
50388 2196998 2128545 2056584 1983726 1912092 1843415 1779361 1721710 1671942 1630830 1598783 1576477
50377 1576477 1564600 1562846 1569607 1582857 1600993 1622612 1645809 1667932 1685874 1696620 1698023 1689430
50365 1689430 1671454 1645075 1611264 1571470 1527916 1483112 1439368 1398654 1361985 1328229 1294124
50354 1294124 1256411 1214048 1168198 1120740 1073581 1028916 988762 953810 923393 896820 874178
50343 874178 855690 840991 829491 820914 815066 811483 809764 810018 812497 816911 822381 828024 833372 838360
50329 838360 843144 847865 852455 856815 861214 866274 872417 879529 887325 895730 904686 913878 922989 931981
50315 931981 940768 948792 955332 960207 963836 966706 969183 971871 975690 981301 988628 997079 1006135 1015730
50301 1015730 1026305 1038616 1053328 1070663 1090545 1113127 1138981 1168658 1202308 1240089 1282804
50290 1282804 1331513 1385642 1440861 1488845 1519901 1527295 1510444 1474797 1428742 1379927 1333284
50279 1333284 1291208 1254738 1224459 1200656 1183099 1171062 1163696 1160341 1160441 1163380 1168701 1176548 1187620
50266 1187620 1202450 1220758 1241517 1263474 1285481 1306471 1325513 1342115 1356474 1369353 1381594
50255 1381594 1393664 1405526 1416831 1427112 1435729 1441715 1443907 1441318 1433367 1419853 1401011 1377844
50243 1377844 1352247 1326552 1302764 1282196 1265515 1252832 1243631 1236784 1230685 1223324 1212493 1196480
50231 1196480 1175061 1149771 1122986 1096538 1071092 1046597 1023048 1000757 980065 960994 943221
50220 943221 926286 909774 893417 877228 861579 847001 833785 821823 810945 801219 792750 785259
50208 785259 778167 771096 764134 757646 752084 747946 745468 744114 742742 740630 738185 736348 735474 735095 734620
50193 734620 733748 732171 729402 725265 720325 715530 711550 708615 706744 705769 705187 704428 703451 702812 702912 703358
50177 703358 703342 702548 701360 700175 698938 697567 696482 696255 696899 697936 699157 700870 703372 706710 711198
50162 711198 717636 726536 737403 749350 762317 777173 794639 814643 836946 861960 890747 924428
50150 924428 963711 1008633 1058314 1111085 1165105 1218891 1271252 1320999 1367125 1409315 1448051
50139 1448051 1484178 1518535 1551860 1584618 1616446 1645731 1669928 1686489 1693498 1689577 1673681 1645494
50127 1645494 1606159 1558303 1505041 1448960 1391969 1335680 1281537 1230634 1183788 1141733 1104927
50116 1104927 1073018 1044838 1019136 995313 973429 953688 936090 920474 906711 894758 884510
50105 884510 875648 867740 860509 853880 847765 842005 836651 831965 827841 823471 818010 811476 804586 797872
50091 797872 791549 786173 782694 781551 782284 784387 788036 793541 800559 808427 816957 826221 835733 844560
50077 844560 852399 860010 868311 877373 886460 894780 901961 907926 912587 915798 917627 918564 919226 919735 919571
50062 919571 918251 915906 912958 909452 905187 900423 895914 892048 888398 884480 880699 878196 877764 879138
50048 879138 881368 883768 886469 890161 895427 902428 911189 921964 935134 950861 968934 988848 1009856
50035 1009856 1031211 1052823 1075657 1101030 1129420 1160348 1193477 1229185 1267539 1307076 1345272
50024 1345272 1380172 1411048 1437572 1459143 1475503 1487567 1497049 1505291 1512677 1518807 1522485 1521448
50012 1521448 1512806 1494501 1466396 1429817 1386337 1337310 1284312 1229386 1174653 1121974 1073055
50001 1073055 1029406 991870 960392 934471 913672 897510 885141 875527 867814 861292 855184 848926
49989 848926 842646 836916 831860 826710 820362 812128 801856 789712 776172 762045 748132 734753 721779
49976 721779 709142 697170 686330 676775 668281 660599 653739 647870 642981 638732 634681 630636 626764
49963 626764 623339 620409 617738 615090 612517 610355 608964 608624 609636 612362 617019 623483 631315 639930
49949 639930 648748 657357 665638 673581 680868 686889 691361 694687 697407 699517 700711 701076 701010 700507 698993
49934 698993 695805 690366 682091 670981 658366 646170 635050 624161 613195 603656 597137 593096 589516
49921 589516 585448 581727 579319 578177 577917 578519 579869 581447 583021 585069 588023 591545 595023 598385 602019
49906 602019 606234 611248 617369 624685 632780 641134 649744 659034 669242 680068 690683 699903 706683
49893 706683 710871 713338 715022 715887 715092 712047 706931 700226 692144 682701 672177 661247 650645 640704
49879 640704 631280 622187 613568 605736 598736 592400 586862 582670 580189 579163 579058 579632 580864 582511 584086
49864 584086 585335 586623 588749 592373 597494 603493 609806 616573 624398 633497 643371 653402 663404 673416
49850 673416 683191 692072 699232 703955 706052 706198 705538 704704 703437 701293 698264 694422 689409 682783 674630
49835 674630 665419 655560 645614 636610 629466 624119 619810 616220 613789 612931 613516 615186 617615 620339 622974
49820 622974 625901 630160 636309 643833 651979 660662 670022 679454 687811 694527 700007 704896 709400 713438
49806 713438 717052 720334 723069 724629 724250 721524 716803 711142 705692 700983 696714 692121 686468 679331
49792 679331 670714 661029 650878 640769 631035 621948 613750 606607 600685 596270 593557 592186 591271 590124
49778 590124 588866 588080 587985 588329 589042 590525 593110 596617 600804 605913 612268 619447 626378 632345 637418
49763 637418 641838 645465 648231 650690 653616 657116 660564 663383 665511 666921 666924 664242 657945 648455 637630
49748 637630 627656 619648 613395 608435 605028 603735 604277 605380 605880 605708 605599 606099 607089 608182 609383 611326
49732 611326 614890 620479 627609 635160 642067 647782 652267 655822 658997 662448 666732 672225 679218 687923
49718 687923 698324 710182 723310 737622 752577 766569 777208 782576 782318 777539 769805 760344 750005
49705 750005 739551 729759 721325 714857 710869 709707 711489 715999 722292 728253 731080 728926 722221 713121
49691 713121 703691 694922 687317 681588 678413 677942 679949 684172 690164 697095 704228 711590 719945 730153
49677 730153 742741 757999 776239 797857 822750 849104 872771 888853 894842 892207 884642 875183
49665 875183 865361 856332 849522 846086 846553 851173 859860 871443 883349 892183 894497 887664 871306 848288
49651 848288 823367 800099 779302 760520 744021 730617 720217 711669 704102 697774 693501 691659
49639 691659 691858 693325 695472 698092 700914 703110 703634 702132 699122 695150 690276 684596 678595 672502 665879
49624 665879 658515 651304 645447 641011 637081 633212 629861 627364 625296 623192 621245 619932 619402 619616 620655
49609 620655 622475 624575 626274 627289 627862 628396 629058 629656 629885 629819 630048 631029 632375 633144 632902 632167 631709
49592 631709 631820 632388 633200 633928 634157 633854 633572 633890 634763 635645 636079 635929 635257 634313 633498 633067 632935 632981 633362
49573 633362 634273 635570 637003 638787 641546 645618 650700 656327 662542 669978 679228 690091 701456 712027
49559 712027 721187 728901 734827 738096 738325 736395 733628 730438 726430 721636 716883 712846 709498 706785
49545 706785 705132 704840 705553 706805 708577 710705 712230 712220 711142 710578 711482 713377 715515 718176 722424 728965
49529 728965 737696 748144 759948 773006 787512 803867 822363 842837 864615 886557 907058 924273
49517 924273 936816 944476 948204 949418 949389 949248 950293 953932 961030 971260 983158 994920 1005034 1012129
49503 1012129 1014605 1011073 1001379 986913 969667 951118 932131 913565 896486 881663 869141 858381
49491 858381 848805 840196 832678 826346 820964 816175 812054 809233 808233 808798 810066 811356 812528 813654
49477 813654 814597 815076 814956 814398 813760 813432 813679 814547 815872 817421 819082 821006 823541 826899 830965 835512
49461 835512 840525 845910 850949 854600 856652 858131 860006 861780 862009 860107 857007 853950 851248 848506
49447 848506 845500 842434 839580 837120 835231 834048 833595 833817 834531 835325 835811 836190 837272 839770 843847 849646
49431 849646 857867 869301 883839 900347 917540 934751 951954 969564 988440 1009920 1035574 1066350
49419 1066350 1101030 1134756 1159663 1168610 1159741 1137707 1110270 1083596 1060366 1041167 1026360 1016429
49407 1016429 1011418 1010800 1013865 1019993 1028662 1039543 1052514 1067317 1083156 1098892 1113762 1127741
49395 1127741 1141155 1154203 1167020 1179865 1192824 1205375 1216602 1225864 1232908 1237294 1238245 1235400
49383 1235400 1229464 1221686 1212779 1202706 1191463 1179654 1168168 1157632 1148353 1140498 1134020 1128559 1123773
49370 1123773 1119745 1116855 1115201 1114464 1114333 1114725 1115356 1115465 1114340 1112010 1108977 1105304 1100463 1094147 1086665
49355 1086665 1078229 1068349 1056602 1043866 1032215 1023381 1017509 1013397 1009616 1005403 1000847 996445 992416
49342 992416 988509 984555 980951 978176 975974 973585 970860 968645 967946 969313 973261 980563 991468 1004864
49328 1004864 1018732 1031204 1040828 1046288 1046771 1042756 1035946 1028176 1020554 1013458 1006812 1000171 992880 984342
49314 984342 974154 962301 949578 937554 927432 918923 910835 902821 895865 890845 887410 884799 883078
49301 883078 882811 883892 885536 887355 889712 892924 896778 900918 905149 909072 911967 913440 913870 913870 913530 912517
49285 912517 910659 908066 904805 900973 897089 894029 892438 892420 893903 897053 902150 909123 917290 925578 933120
49270 933120 939755 945869 951621 956477 959805 961749 963070 964152 964713 964612 964294 964129 963896 963615 964489 968279
49254 968279 975787 986511 999719 1015118 1032241 1049685 1065251 1076606 1081850 1080141 1072171 1059750
49242 1059750 1044600 1027743 1010028 992676 976835 962960 951056 941286 933851 928507 924714 922368
49230 922368 922020 924246 928985 935469 942659 949863 957210 965460 975131 985816 996533 1006678 1016403 1026094
49216 1026094 1035745 1044924 1053200 1060470 1066844 1072280 1076448 1079174 1081024 1083204 1086777 1092147 1099342 1108426
49202 1108426 1119397 1131911 1145440 1159609 1174213 1189065 1204004 1218867 1233308 1246893 1259607
49191 1259607 1271948 1284203 1296005 1306986 1317592 1328648 1340228 1351497 1361714 1370951 1379863 1389244
49179 1389244 1399898 1412583 1427867 1446216 1468106 1493755 1522985 1555833 1593199 1636156 1684155
49168 1684155 1734072 1781007 1819891 1846806 1860036 1860767 1852656 1840099 1826488 1813721 1802760 1794266
49156 1794266 1788711 1785994 1785033 1784102 1781999 1778910 1775845 1773415 1771629 1770724 1771490 1774525 1779710 1786614 1794967
49141 1794967 1804525 1814972 1826298 1838884 1852940 1868213 1884487 1901939 1920655 1940222 1960166
49130 1960166 1980441 2001087 2021771 2042154 2062494 2083409 2105127 2127358 2149835 2172656 2196152
49119 2196152 2220693 2246596 2274082 2303414 2335139 2370064 2409054 2453251 2504500 2565055 2636858
49108 2636858 2722015 2824219 2947890 3093334 3251913 3407726 3546929 3667884 3782799 3907277
49098 3907277 4044027 4173751 4262971 4285250 4239256 4148405 4042908 3940046 3837980 3724654
49088 3724654 3591491 3440852 3283985 3133774 2998936 2882869 2785599 2705556 2640141 2586247
49078 2586247 2541280 2503730 2472811 2447846 2427981 2411959 2398046 2384625 2371117 2357955 2345597
49067 2345597 2334003 2323224 2313821 2306130 2299503 2292912 2286190 2280194 2275706 2272527 2269795 2266939 2264253
49054 2264253 2262642 2262893 2265105 2268784 2273449 2279057 2285881 2294071 2303276 2312416 2319770 2323654 2323437 2320026
49040 2320026 2315222 2310505 2306367 2302659 2299491 2297703 2298427 2302175 2308414 2316042 2324105 2332009 2339368 2346027
49026 2346027 2352050 2357304 2361130 2362895 2362873 2362088 2361193 2360014 2358394 2357000 2356862 2358359 2360999 2363985 2366766
49011 2366766 2369308 2372237 2376530 2382706 2390319 2398477 2406742 2415286 2424306 2433574 2442497 2450441 2457117 2462948
48997 2462948 2468857 2475341 2481732 2486742 2489686 2490924 2491100 2490352 2488388 2485102 2480909 2476531 2472470 2468598
48983 2468598 2464404 2459750 2455214 2451389 2448062 2444621 2441124 2438338 2436534 2434974 2432936 2430661 2428661 2426590
48969 2426590 2423650 2420012 2416932 2415220 2414286 2413116 2411699 2411026 2411959 2414652 2418971 2424946 2432640 2441814 2451879
48954 2451879 2462161 2472326 2482725 2494269 2507802 2523614 2541571 2561469 2582987 2605559 2628671
48943 2628671 2652245 2676312 2700395 2723821 2746778 2770617 2796811 2826004 2858296 2893910 2933029
48932 2933029 2975279 3019950 3066676 3115480 3166220 3218484 3272062 3327100 3383710 3441777 3501229
48921 3501229 3562142 3624435 3687734 3751606 3815635 3879110 3941051 4000811 4058544 4114853 4170029
48910 4170029 4223684 4274965 4323056 4367751 4409732 4450119 4489504 4527455 4563081 4595930 4626192
48899 4626192 4654197 4679909 4702938 4722890 4739762 4754052 4766370 4776862 4785121 4790752 4793840 4794713
48887 4794713 4793470 4790021 4784439 4776817 4766710 4753108 4735288 4713544 4688894 4662119 4633325 4602260
48875 4602260 4568631 4531982 4491679 4447443 4399853 4349926 4298143 4244245 4188128 4130590 4072867
48864 4072867 4015663 3959019 3903032 3848247 3795224 3744085 3694701 3647131 3601658 3558567 3518035
48853 3518035 3480221 3445260 3413136 3383619 3356376 3331275 3308635 3289080 3272929 3259752 3248710
48842 3248710 3239380 3232034 3227085 3224537 3224190 3226201 3231097 3239241 3250440 3264150 3279938 3297607 3316926
48829 3316926 3337390 3358294 3378990 3399053 3418341 3437108 3455963 3475450 3495638 3516312 3537511
48818 3537511 3559425 3581718 3603464 3624088 3643902 3663330 3682130 3700061 3717839 3736500 3755896
48807 3755896 3774862 3793053 3811642 3831761 3853110 3874835 3897122 3921009 3946808 3973499 3999745
48796 3999745 4024898 4048905 4071673 4092814 4111904 4128896 4144309 4158877 4172866 4185777 4196823
48785 4196823 4205602 4212254 4217184 4220733 4222852 4222885 4219871 4213240 4203046 4189404 4171969 4150261 4124221
48772 4124221 4094204 4060590 4023680 3983760 3941029 3895628 3847956 3798698 3748345 3697014 3645013
48761 3645013 3593213 3542379 3492527 3443469 3395748 3350370 3307698 3267235 3228536 3191770 3157334
48750 3157334 3125446 3096166 3069327 3044285 3020211 2996900 2974991 2955297 2938280 2924214 2913350
48739 2913350 2905617 2900547 2897796 2897370 2899066 2901942 2904726 2906595 2907420 2907521 2907601 2908634 2911247 2914975 2918463
48724 2918463 2920706 2922054 2923825 2926937 2931064 2935201 2938780 2941929 2944742 2946850 2947966 2948516 2949339 2950898
48710 2950898 2953114 2955756 2958593 2961317 2963785 2966281 2969181 2972365 2975368 2978077 2980794 2983551 2985914 2987633
48696 2987633 2989060 2990737 2992962 2996007 3000298 3006008 3012671 3019485 3025820 3031301 3035697 3039088 3042012 3045187
48682 3045187 3049136 3054132 3060280 3067480 3075465 3084033 3093139 3102713 3112623 3122905 3133825 3145713 3159009
48669 3159009 3174364 3192092 3211264 3229715 3245123 3255591 3259048 3252900 3235194 3205906 3166599 3119085
48657 3119085 3065002 3006330 2945380 2884116 2823959 2766255 2712241 2662455 2616787 2575326 2538530
48646 2538530 2506291 2477463 2450836 2426180 2403831 2383514 2364133 2344612 2324429 2303417 2281571
48635 2281571 2259230 2237032 2215417 2194356 2173658 2153308 2133311 2113419 2093260 2072661 2051720
48624 2051720 2030638 2009743 1989547 1970514 1952677 1935679 1919352 1904119 1890800 1880006 1871726
48613 1871726 1865334 1860039 1855560 1852443 1851479 1852599 1854505 1855535 1854766 1852162 1848000 1842619 1836706 1831375
48599 1831375 1827713 1826246 1826738 1828346 1830093 1831504 1832807 1834228 1835201 1834602 1831804 1827088 1820879 1812997 1802954
48584 1802954 1790723 1776854 1761921 1746121 1729398 1711861 1694155 1677491 1663073 1651211 1641036
48573 1641036 1631343 1621791 1613212 1606761 1602878 1601079 1600672 1601468 1603667 1607086 1610789 1613640 1614995 1614557 1611789
48558 1611789 1605930 1596684 1584563 1570493 1555439 1540460 1526675 1514873 1505285 1497756 1491789 1486414
48546 1486414 1480529 1473654 1465968 1457402 1447211 1434915 1421250 1407568 1394513 1381862 1369584 1358366
48534 1358366 1348886 1341030 1334172 1328020 1322976 1319741 1318736 1319865 1322823 1327667 1334970 1345283 1358333
48521 1358333 1372626 1385627 1394331 1396151 1389994 1376865 1359389 1340547 1322548 1306479 1292633 1281078
48509 1281078 1272021 1265741 1262282 1261485 1263395 1268385 1276615 1287441 1299796 1313225 1328246 1345223 1362744
48496 1362744 1377390 1385469 1385233 1377453 1364175 1347390 1328903 1310588 1293870 1278969 1265148 1251660
48484 1251660 1238125 1224306 1210307 1197014 1185553 1176059 1167612 1159588 1152366 1146351 1141019 1135572 1130104
48471 1130104 1125500 1122381 1120542 1119236 1117655 1115486 1113315 1112228 1112647 1113896 1115180 1116576 1118709 1121922
48457 1121922 1126201 1131428 1137137 1142394 1146462 1149263 1150717 1150160 1147155 1142462 1137373 1132300 1126786 1120731
48443 1120731 1114748 1109275 1103987 1098233 1091575 1083911 1075534 1066948 1058250 1048952 1038847 1028689 1019364
48430 1019364 1010847 1002738 995405 989551 984839 980105 974918 969865 965235 960581 955859 951872 949051 946757
48416 946757 944262 941575 938726 935141 930505 925611 921470 918021 914488 910687 907208 904428 902106 900045
48402 900045 898538 897895 897811 897519 896586 895383 894672 894758 895250 895673 895925 895998 895673 894896 894150 893977 894403 895322 897098
48383 897098 900226 904620 909804 915476 921238 926163 929575 932084 934963 938660 942818 947497 953238 959991
48369 959991 967208 975247 985576 999207 1015720 1033836 1051819 1067220 1077634 1082567 1083881 1084023 1084479
48356 1084479 1085974 1088939 1093332 1098907 1106113 1115938 1128672 1143798 1161226 1181507 1204640 1230048
48344 1230048 1258056 1290040 1326597 1366951 1410809 1459595 1515343 1579673 1654368 1741554 1842796
48333 1842796 1959701 2096272 2259213 2455067 2688268 2962585 3283183 3657570 4097500
48324 4097500 4621600 5254649 6023909 6959427 8101197 9505519 11237360 13335133 15742028
48315 15742028 18230820 20394891 21769395 22044088 21219913 19583793 17531459 15390022
48307 15390022 13352808 11509658 9893453 8504198 7322538 6323643 5484392 4782238
48299 4782238 4195206 3705375 3298878 2962134 2681484 2446550 2250492 2086675 1948114
48290 1948114 1830201 1730742 1646859 1574594 1511810 1458576 1414035 1375471 1341226 1312032 1288445
48279 1288445 1268994 1251902 1236896 1224316 1213941 1205607 1199654 1195898 1193364 1191727 1191955 1194809 1199683
48266 1199683 1205466 1211665 1218252 1225426 1233998 1245003 1258280 1271965 1283647 1291352 1293570 1289657 1280693
48253 1280693 1268951 1256029 1242289 1228240 1215196 1204048 1194508 1186176 1179341 1174033 1169227 1163886
48241 1163886 1158139 1152684 1147653 1142810 1138358 1134749 1132003 1129783 1127813 1125779 1123179 1119721 1115561 1110778
48227 1110778 1105073 1098362 1091199 1084139 1077035 1069321 1060573 1050438 1038530 1024957 1010579 996130 981301
48214 981301 965152 947291 928248 908930 890088 872137 855042 838442 822150 806365 791177
48203 791177 776147 760815 745467 730994 718011 706451 695976 686469 678027 670679 664219 658250
48191 658250 652406 646603 641102 636227 631994 627972 623567 618570 613499 609263 606351 604414 602700 600734
48177 600734 598498 596270 594502 593553 593212 592690 591443 589783 588328 587152 585961 584783 583857 582956 581554
48162 581554 579678 578056 577330 577627 578820 580550 581984 582329 581788 581480 582172 583581 585027 586158 586831 586933
48146 586933 586698 586723 587366 588513 590107 592296 594782 596667 597471 597834 598726 600255 601731 602668 603265 604043 605334
48129 605334 607083 608901 610464 611932 613836 616468 619620 622942 626157 628933 631020 632667 634415 636323
48115 636323 637921 639161 640828 643653 647554 652126 657378 663447 669980 676360 682376 688243 694177 700381
48101 700381 707319 715564 725327 736260 747656 758881 769921 781477 794055 806924 818641 828865
48089 828865 838958 850310 862703 874904 886285 897111 907587 917511 926796 935674 944303 952648
48077 952648 960745 968712 976489 983929 991050 997916 1004343 1010067 1015141 1019943 1024869 1030133 1035678 1041199
48063 1041199 1046621 1052654 1060240 1069043 1077086 1082541 1085490 1087305 1088697 1089168 1088137 1085616 1081716 1076256
48049 1076256 1069165 1060741 1051310 1040990 1029935 1018452 1006809 995173 983721 972436 960792 948082
48037 948082 934138 919486 904790 890428 876550 863171 850174 837509 825340 813710 802171
48026 802171 790118 777528 765030 753233 742235 731737 721299 710531 699380 688327 678093
48015 678093 669172 661725 655659 650538 645622 640408 634961 629426 623492 616821 609759 603062 597033 591494
48001 591494 586511 582556 579922 578496 578094 578507 579193 579490 579244 578782 578298 577795 577597 578144 579099 579338 578247
47984 578247 576481 575003 573848 572318 570110 567694 565674 564197 563052 562077 561337 560935 560765 560542 560152 559814
47968 559814 559767 559957 560212 560553 561059 561583 561876 561923 561881 561792 561642 561540 561575 561698 562018 562959 564796 567310 570332
47949 570332 574192 579088 584447 589643 594972 601078 607676 613893 619719 626055 633253 640687 647909 655147
47935 655147 662431 669250 675484 681646 687778 693122 697349 701021 704243 706051 706016 705315 705058 704455 701969
47920 701969 697643 692869 688219 682981 676776 670263 664009 657785 651373 645175 639637 634747 630405 626660
47906 626660 623335 620007 616659 613846 611934 610620 609427 608282 607386 606921 607147 608407 610707 613536 616352
47891 616352 619104 622115 625638 629618 633736 637610 641077 644394 648041 652340 657335 662882 668653 674160
47877 674160 679054 683379 687320 690808 693508 695101 695363 694226 692027 689479 687000 684293 680904 676867
47863 676867 672246 666435 658809 649985 641512 634081 626934 619356 611894 605472 600043 594933 590107 586173
47849 586173 583254 580681 577959 575425 573682 572866 572797 573465 574908 576743 578296 579335 580387 582115 584524
47834 584524 587070 589494 592201 595630 599548 603264 606444 609362 612360 615381 618175 620710 623222 625957
47820 625957 629030 632440 636095 639859 643739 648040 653276 659822 667662 676551 686501 697969 711417 726757
47806 726757 743444 761124 779880 799752 820333 840981 861117 880048 896793 910442 920591
47795 920591 927221 930382 930238 927156 921394 912994 902343 890529 878608 866770 854813 843238 833132
47782 833132 824963 818227 812410 807589 803849 800771 797845 794870 791646 787820 783431 779064 774978 770524
47768 770524 764900 758155 750890 743360 735486 727544 720188 713726 707864 702211 696687 691449 686749 682836
47754 682836 679673 676843 674095 671900 671126 672100 674349 677157 680003 682520 684599 686748 689902 694593 700527
47739 700527 707111 714157 721874 730479 740070 750618 761811 773055 783952 794692 805661 816669
47727 816669 826846 835328 841932 847097 851389 855159 858415 860807 861721 860650 857632 853246 848078 842092
47713 842092 834638 825134 813791 801598 789576 778042 766648 755125 743872 733678 724911 717127
47701 717127 709586 702088 695205 689765 686172 684145 682986 682174 681877 682815 685473 689574 694561 700501 708031
47686 708031 717349 727718 738260 748857 759925 771564 783470 795533 807961 820652 832870 843743
47674 843743 852887 860436 866736 872209 877205 881652 884886 886156 885356 883078 879912 875854 870511 863784
47660 863784 856090 847881 839137 829510 818928 807820 796684 785639 774547 763483 752908 743407
47648 743407 735394 728959 723841 719562 715842 712944 711447 711605 713014 714970 717037 719207 721684 724648
47634 724648 728177 732281 737010 742580 749299 757267 766226 775895 786503 798818 813474 830277 848339
47621 848339 866932 886071 906054 926531 946325 964211 979555 992013 1000944 1005588 1005769 1001960
47609 1001960 994585 983604 968932 950860 929780 905772 878891 849828 819975 790785 763179
47598 763179 737489 713709 691817 672072 654961 640596 628231 616702 605581 595546 587394 580899
47586 580899 575019 569122 563586 559027 555272 551424 546878 541963 537531 534132 531763 530244 529478 529259 529076
47571 529076 528368 526960 525096 523077 521008 518922 516895 514935 512847 510416 507665 504846 502232 499999
47557 499999 498233 496889 495728 494480 493125 491882 490849 489820 488560 487115 485626 483948 481757 479074
47543 479074 476433 474366 472934 471897 471165 470776 470552 470139 469399 468460 467352 465919 464309 463215 463289 464428
47527 464428 465868 466911 467370 467521 467910 469104 471205 473561 475254 475919 475866 475462 474789 473950 473245 472801 472379
47510 472379 471820 471411 471502 471983 472463 472804 473171 473696 474385 475259 476287 477247 477954 478528 479166 479730 479927 479870 480080
47491 480080 480862 481990 483072 483959 484756 485680 486990 488732 490529 491985 493380 495587 499128 503628 508449
47476 508449 513436 518671 523783 528101 531494 534607 538087 541912 545663 549222 552872 556706 560247 562810
47462 562810 564184 564810 565273 565805 566288 566553 566523 566232 565906 565908 566409 567210 568115 569341 571309 574154 577854 582681
47444 582681 589047 596830 605455 614799 625515 638156 652439 667735 683899 701132 719312 737946
47432 737946 756600 774975 792741 809803 826612 843620 860333 875349 887452 896318 902059 904597
47420 904597 903835 900188 894441 887050 877882 866769 854192 841140 828318 815698 802957 790091 777297
47407 777297 764454 751277 738020 725530 714332 704090 694282 685033 676814 669579 662778 656132 650032
47394 650032 645120 641811 640170 639950 640751 642392 645029 648774 653353 658450 664108 670433 677171 684128 691848
47379 691848 701160 711980 723120 733370 742321 749988 756285 761152 764754 767167 768145 767426 765018 760969
47365 760969 755225 747906 739442 730153 719977 708880 697266 685621 673939 661816 649017 635698
47353 635698 622219 609061 596856 586158 577027 568950 561222 553402 545509 537920 531088 525277 520518
47340 520518 516722 513753 511409 509493 507892 506540 505435 504790 504970 506030 507475 508832 510308 512464 515327
47325 515327 518377 521424 524885 528972 533124 536614 539307 541470 543136 544096 544348 544197 543911 543460 542491 540527
47309 540527 537404 533622 529957 526615 523139 519364 516010 513958 513266 513369 513991 515345 517478 519982 522508
47294 522508 525273 528873 533723 539745 546555 553887 561864 570802 580863 592139 604965 619812 636725
47281 636725 655102 673984 692127 707708 718691 724091 724761 722599 719210 715481 712001 709241 707394
47268 707394 706411 706154 706297 706270 705633 704327 702311 699286 695142 690447 685934 681664 677180 672351 667527 662823
47252 662823 657799 652022 645663 639413 634007 629823 626733 624288 622165 620363 618940 617881 617396 617950 619649
47237 619649 621968 624518 627687 631992 637152 642547 648338 655258 663333 671690 679886 688680 699100 711203
47223 711203 724076 736706 748580 759785 770679 781264 790863 798788 805262 811163 816818 821567 824616
47210 824616 825714 824799 821624 816132 808835 800513 791774 783007 774284 765188 755304 745127 735888 728198
47196 728198 721453 715013 709293 705153 702696 701420 701236 702602 705757 710454 716372 723298 730958 739106
47182 739106 747780 757130 767146 777925 790032 804054 819869 836824 854578 873238 892577 911632
47170 911632 929286 944944 958604 970662 981751 992293 1001872 1009324 1013754 1015387 1015184 1013717 1010660
47157 1010660 1005404 998006 989312 980145 970553 960043 948441 936184 923714 911008 898071 885641
47145 885641 874885 866350 859505 853399 847559 842203 837781 834447 831960 830116 829257 830114 832933 836957
47131 836957 841122 845169 849681 855027 860713 865978 870612 874823 878415 880556 880507 878392 875001 870823 865494
47116 865494 858367 849505 839792 830058 820461 810907 801580 792615 783484 773437 762634 752331 743608
47103 743608 736193 728790 720381 710962 701250 691981 683506 675787 668612 661846 655504 649699 644641 640690
47089 640690 638158 636922 636383 636034 635990 636737 638381 640414 642338 644290 646778 649859 652940 655588 658278
47074 658278 661969 666938 672329 676989 680486 683158 685393 687226 688548 689365 689793 689967 689994 689812 689141 687838
47058 687838 686339 685481 685745 686926 688613 690745 693447 696623 700021 703622 707661 712359 717885 724375 731583
47043 731583 738606 744455 749120 753632 758866 764664 770361 775747 781037 786224 791115 795956 801423 807832
47029 807832 814797 821774 828543 835059 841305 847487 853956 860588 866647 871524 875269 878092 879876 880672
47015 880672 881195 882036 882614 881708 878995 875309 871383 867151 862505 857898 853706 849642 845392 841378 838335
47000 838335 836422 835306 834849 835180 836229 837715 839525 841666 843911 846003 848181 851053 854945 859760 865459
46985 865459 872133 879487 886771 893575 900305 907560 915299 923034 930689 938794 947791 957481 967273 976734
46971 976734 985755 994346 1002551 1010522 1018408 1026088 1033177 1039383 1044773 1049535 1053664 1057006 1059540 1061353
46957 1061353 1062417 1062650 1062206 1061408 1060408 1059185 1057998 1057494 1058133 1059721 1061670 1063523 1065125 1066600 1068513
46942 1068513 1071782 1076998 1083742 1090796 1097064 1102223 1106797 1111842 1118409 1126828 1136379 1145845 1154448 1162231
46928 1162231 1169714 1177397 1185423 1193338 1200138 1204811 1207005 1207055 1205458 1202422 1197842 1191505 1183407 1173993
46914 1173993 1163927 1153429 1142116 1129816 1117274 1105521 1094688 1084093 1073565 1063987 1056269 1050369
46902 1050369 1045859 1043038 1042891 1045991 1051936 1059938 1069659 1081316 1095131 1110846 1127809 1145555 1164225
46889 1164225 1184207 1205368 1226848 1247677 1267360 1285724 1302516 1317486 1330738 1342656 1353389
46878 1353389 1362655 1370037 1375390 1378997 1381531 1383868 1386663 1389948 1393230 1396090 1398703 1401779 1406086 1411955
46864 1411955 1419178 1427305 1436209 1446360 1458391 1472252 1486911 1501101 1514383 1527332 1540641 1554223
46852 1554223 1567254 1578905 1588821 1597020 1603554 1608380 1611413 1612590 1611976 1609871 1606735 1602907 1598401 1593062
46838 1593062 1586944 1580511 1574431 1569116 1564429 1559965 1555716 1552357 1550791 1551436 1554080 1558265 1563555 1569569
46824 1569569 1576164 1583681 1592682 1603304 1615097 1627515 1640217 1652797 1664648 1675399 1685108 1693717
46812 1693717 1700636 1705277 1707757 1708701 1708542 1707419 1705518 1702999 1699756 1695694 1691130 1686441 1681424 1675598
46798 1675598 1669082 1662536 1656213 1649794 1643354 1637748 1633580 1630404 1627492 1624998 1623664 1623633 1624229 1624939 1626105
46783 1626105 1628435 1632199 1637043 1642338 1647567 1652538 1657446 1662745 1668864 1675994 1684026 1692587 1701197 1709507
46769 1709507 1717498 1725451 1733709 1742473 1751705 1761200 1770772 1780446 1790535 1801525 1813823 1827475 1842096
46756 1842096 1857205 1872730 1889094 1906637 1925055 1943587 1961658 1979203 1996395 2013240 2029372
46745 2029372 2044093 2056664 2066800 2074823 2081164 2085869 2088818 2090243 2090615 2090133 2088800 2087006 2085442 2084308
46731 2084308 2083158 2081797 2080857 2081096 2082532 2084718 2087561 2091317 2095957 2101119 2106710 2113051 2120141 2127135
46717 2127135 2132911 2137080 2140143 2142553 2143794 2142675 2138571 2132103 2124346 2115575 2105102 2092224 2076888
46704 2076888 2059405 2040055 2019201 1997336 1974658 1950885 1925835 1899969 1874020 1848268 1822510
46693 1822510 1796638 1770905 1745671 1721132 1697300 1674110 1651636 1630283 1610551 1592470 1575533
46682 1575533 1559416 1544388 1530640 1517566 1504374 1491305 1479542 1469809 1461610 1454081 1447011 1440652
46670 1440652 1434984 1429736 1425055 1421640 1420153 1420766 1423251 1427183 1431898 1436574 1440709 1444572 1449007 1454732
46656 1454732 1461798 1469597 1477197 1483734 1488773 1492465 1495159 1496740 1496554 1494224 1490337 1485955 1481571 1477041
46642 1477041 1472540 1468968 1467046 1466418 1466176 1466192 1467529 1471524 1478737 1488827 1501166 1515348 1531162 1548310
46628 1548310 1566324 1584803 1603533 1622183 1640025 1656254 1670538 1682963 1693356 1701037 1705369 1706237
46616 1706237 1703890 1698629 1690854 1681029 1669312 1655533 1639851 1623109 1606141 1589015 1571449 1553769
46604 1553769 1536847 1521091 1506056 1491194 1476666 1463249 1451724 1442381 1434753 1427750 1420352 1412481
46592 1412481 1404996 1398710 1393505 1388564 1383324 1377970 1372976 1368327 1363397 1357689 1351511 1345675 1340553 1335714
46578 1335714 1330609 1325338 1320503 1316528 1313344 1310593 1307919 1305282 1303216 1302580 1303678 1305834 1308199 1310824
46564 1310824 1314378 1318853 1323100 1325961 1327530 1329022 1331551 1335211 1339227 1342790 1345719 1348464 1351621 1355556
46550 1355556 1360349 1365813 1371562 1377375 1383642 1391075 1399827 1409241 1418782 1428750 1439680 1451488 1463828
46537 1463828 1476942 1491421 1507282 1524077 1541823 1561003 1581584 1602927 1624910 1648263 1673378
46526 1673378 1699571 1726177 1753735 1783292 1814817 1847095 1879076 1910679 1942158 1973188 2002804
46515 2002804 2030037 2054505 2076490 2096443 2114349 2129677 2142006 2151490 2158581 2163554 2166497 2167611
46503 2167611 2167197 2165445 2162475 2158537 2153996 2149119 2144005 2138651 2132951 2126698 2119709 2111958 2103516 2094380
46489 2094380 2084343 2072985 2059925 2045238 2029411 2012555 1993877 1972501 1948735 1923789 1898046
46478 1898046 1870482 1840256 1808100 1775377 1742380 1708614 1674441 1641264 1609928 1580022 1551174
46467 1551174 1524214 1500340 1479751 1461839 1446448 1434163 1425373 1419714 1416673 1416280 1418931 1424766 1433474
46454 1433474 1444574 1457623 1472211 1488001 1504847 1522755 1541517 1560389 1578181 1593721 1606354
46443 1606354 1616151 1623757 1629957 1635231 1639502 1642226 1642731 1640641 1636214 1630324 1623975 1617704 1611465 1605049
46429 1605049 1598410 1591583 1584655 1578024 1572459 1568519 1566180 1565383 1566704 1570897 1577819 1586524 1596548 1608489
46415 1608489 1623019 1639905 1658487 1678668 1700834 1725051 1750897 1778014 1806384 1836097 1867225
46404 1867225 1899802 1933461 1967147 1999586 2030083 2058535 2084772 2108364 2129069 2146833 2161155
46393 2161155 2170959 2175505 2175108 2170656 2162723 2151543 2137629 2121817 2104698 2086411 2067156 2047567
$$ [...]
##END NTUPLES=NMR SPECTRUM
##END=
