##TITLE=AC1731_SEN00004_9275852_enZKttmQui
##JCAMPDX= 6.0         $$ Bruker NMR JCAMP-DX V2.0
##DATA TYPE= NMR SPECTRUM
##DATA CLASS= NTUPLES
##ORIGIN= BRUKER
##OWNER= Administrator
$$ 1.72 TOPSPIN		Version 2.1
$$ 2015-07-14 21:23:48.635 -0700  Administrator@X
$$ Compression mode = diff/dup
##.OBSERVE FREQUENCY= 400.02188249412
##.OBSERVE NUCLEUS= ^1H
##.ACQUISITION MODE= SIMULTANEOUS (DQD)
##.ACQUISITION SCHEME= undefined
##.AVERAGES= 8
##.DIGITISER RES= 22
##SPECTROMETER/DATA SYSTEM= spect
##.PULSE SEQUENCE= zg30
##.SOLVENT NAME= COFFEE_meoh
##.SHIFT REFERENCE= INTERNAL, COFFEE_meoh, 1, 14.98509
##AUDIT TRAIL= $$ (NUMBER, WHEN, WHO, WHERE, PROCESS, VERSION, WHAT)
$$ ##TITLE= Audit trail, TOPSPIN		Version 2.1
$$ ##JCAMPDX= 5.01
$$ ##ORIGIN= Bruker BioSpin GmbH
$$ ##OWNER= Administrator
$$ $$ E:\/data/COFFEE/nmr/AC1731_SEN00004_9275852_enZKttmQui/10/pdata/1/auditp.txt
$$ ##AUDIT TRAIL=  $$ (NUMBER, WHEN, WHO, WHERE, PROCESS, VERSION, WHAT)
(   1,<2015-07-14 21:23:41.260 -0700>,<Administrator>,<X>,<go>,<TOPSPIN 2.1>,
      <created by zg
	started at 2015-07-14 21:22:35.400 -0700,
	POWCHK enabled, PULCHK disabled,
       configuration hash MD5:
       21 0F 79 D6 B3 7B B4 F6 88 20 88 DB 03 48 BD 9F
       data hash MD5: 64K
       DD 71 5B BF 17 DC BC 95 A2 14 54 90 4E E5 40 D9>)
(   2,<2015-07-14 21:23:44.416 -0700>,<Administrator>,<X>,<proc1d>,<TOPSPIN 2.1>,
      <Start of raw data processing
       efp LB = 0 FT_mod = 6 PKNL = 1 PHC0 = 0 PHC1 = 0 SI = 32K 
       data hash MD5: 32K
       74 14 9E CD 05 BB B1 DF 64 58 4E 83 E3 11 F1 B8>)
(   3,<2015-07-14 21:23:44.666 -0700>,<Administrator>,<X>,<proc1d>,<TOPSPIN 2.1>,
      <pk PHC0 = 90.60974 PHC1 = 0 
       data hash MD5: 32K
       46 12 C2 91 A8 D7 B0 E2 CE 92 17 F5 6E E6 FF 8F>)
(   4,<2015-07-14 21:23:44.947 -0700>,<Administrator>,<X>,<proc1d>,<TOPSPIN 2.1>,
      <abs ABSG = 1 
       data hash MD5: 32K
       6C 45 73 66 90 8C BA 35 E9 F4 07 42 8B 59 99 06>)
(   5,<2015-07-14 21:23:45.010 -0700>,<Administrator>,<X>,<proc1d>,<TOPSPIN 2.1>,
      <abs ABSG = 2 
       data hash MD5: 32K
       F2 BA B0 E1 D4 16 4B AF C6 DC 37 22 0F 74 F6 88>)
(   6,<2015-07-14 21:23:45.072 -0700>,<Administrator>,<X>,<proc1d>,<TOPSPIN 2.1>,
      <abs ABSG = 3 
       data hash MD5: 32K
       2A 70 63 A3 B2 CC E6 71 CD 69 77 18 EB 0B DF AE>)
(   7,<2015-07-14 21:23:45.135 -0700>,<Administrator>,<X>,<proc1d>,<TOPSPIN 2.1>,
      <abs ABSG = 4 
       data hash MD5: 32K
       77 62 A9 F6 12 41 9D A8 CC 08 A5 CB A5 D8 97 56>)
(   8,<2015-07-14 21:23:45.197 -0700>,<Administrator>,<X>,<proc1d>,<TOPSPIN 2.1>,
      <abs ABSG = 5 
       data hash MD5: 32K
       16 E5 E1 B5 B1 AB 8C D4 5C 2C 29 F2 1E 74 B3 C0>)
$$ ##END=
$$ 
$$ $$ hash MD5
$$ $$ FD 41 E8 94 6E B2 60 0B EE 4D C3 A8 B5 FC 48 D3
##$RELAX= 
##$RELAX= 
##$RELAX= 
##$RELAX= 
##$RELAX= 
##$RELAX= 
##$RELAX= 
$$ Bruker specific parameters
$$ --------------------------
##$DU= <E:\>
##$EXPNO= 10
##$NAME= <AC1731_SEN00004_9275852_enZKttmQui>
$$ [...]
150 150 150 150 150 150 150 150
##$TP07= 0
##$TPNAME0= <>
##$TPNAME1= <>
##$TPNAME2= <>
##$TPNAME3= <>
##$TPNAME4= <>
##$TPNAME5= <>
##$TPNAME6= <>
##$TPNAME7= <>
##$TPOAL= (0..7)
0.5 0.5 0.5 0.5 0.5 0.5 0.5 0.5
##$TPOFFS= (0..7)
0 0 0 0 0 0 0 0
##$TUNHIN= 0
##$TUNHOUT= 0
##$TUNXOUT= 0
##$USERA1= <user>
##$USERA2= <user>
##$USERA3= <user>
##$USERA4= <user>
##$USERA5= <user>
##$V9= 5
##$VALIST= <valist>
##$VCLIST= <CCCCCCCCCCCCCCC>
##$VD= 0
##$VDLIST= <DDDDDDDDDDDDDDD>
##$VPLIST= <PPPPPPPPPPPPPPP>
##$VTLIST= <TTTTTTTTTTTTTTT>
##$WBST= 2048
##$WBSW= 25
##$XGAIN= (0..3)
0 0 0 0
##$XL= 0
##$YL= 0
##$YMAX_a= 573489
##$YMIN_a= -496049
##$ZGOPTNS= <>
##$ZL1= 120
##$ZL2= 120
##$ZL3= 120
##$ZL4= 120
##$ABSF1= 14.98509
##$ABSF2= -5.573092
##$ABSG= 5
##$ABSL= 3
##$ALPHA= 0
##$AQORDER= 0
##$ASSFAC= 0
##$ASSFACI= 0
##$ASSFACX= 0
##$ASSWID= 0
##$AUNMP= <proc_prof1d_extract_pilot.lims>
##$AXLEFT= 0
##$AXNAME= <>
##$AXNUC= <1H>
##$AXRIGHT= 0
##$AXTYPE= 0
##$AXUNIT= <>
##$AZFE= 0.1
##$AZFW= 0.1
##$BCFW= 0
##$BC_mod= 0
##$BYTORDP= 0
##$COROFFS= 0
##$CY= 15
##$DATMOD= 1
##$DC= 0
##$DFILT= <>
##$DTYPP= 0
##$F1P= 0
##$F2P= 0
##$FCOR= 0.5
##$FTSIZE= 32768
##$FT_mod= 6
##$GAMMA= 0
##$GB= 0
##$INTBC= 1
##$INTSCL= 1
##$ISEN= 128
##$LB= 0
##$LEV0= 0
##$LPBIN= 0
##$MAXI= 10000
##$MC2= 0
##$MEAN= 0
##$ME_mod= 0
##$MI= 0
##$NCOEF= 0
##$NC_proc= -8
##$NLEV= 6
##$NOISF1= 0
##$NOISF2= 0
##$NSP= 0
##$NTH_PI= 0
##$NZP= 0
##$OFFSET= 14.98509
##$PC= 1
##$PHC0= 90.60974
##$PHC1= 0
##$PH_mod= 1
##$PKNL= yes
##$PPARMOD= 0
##$PPDIAG= 0
##$PPIPTYP= 0
##$PPMPNUM= 2147483647
##$PPRESOL= 1
##$PSCAL= 4
##$PSIGN= 0
##$PYNMP= <proc.py>
##$REVERSE= no
##$SF= 400.02
##$SI= 32768
##$SIGF1= 0
##$SIGF2= 0
##$SINO= 400
##$SIOLD= 32768
##$SPECTYP= <>
##$SREGLST= <1H.CDCl3>
##$SSB= 0
##$STSI= 32768
##$STSR= 0
##$SW_p= 8223.68421052631
##$SYMM= 0
##$S_DEV= 0
##$TDeff= 65536
##$TDoff= 0
##$TI= <>
##$TILT= no
##$TM1= 0
##$TM2= 0
##$TOPLEV= 0
##$USERP1= <user>
##$USERP2= <user>
##$USERP3= <user>
##$USERP4= <user>
##$USERP5= <user>
##$WDW= 1
##$XDIM= 32768
##$YMAX_p= 450509442
##$YMIN_p= -712791
##$CURPLOT= <Network HP LaserJet P1505>
##$CURPRIN= <$Network HP LaserJet P1505>
##$DFORMAT= <normdp>
##$LAYOUT= <+/1D_H.xwp>
##$LFORMAT= <normlp>
##$PFORMAT= <normpl>
##$SURQMSG= 1
$$ End of Bruker specific parameters
$$ ---------------------------------
##NTUPLES= NMR SPECTRUM
##VAR_NAME=  FREQUENCY,     SPECTRUM/REAL,   SPECTRUM/IMAG
##SYMBOL=    X,             R,               I
##VAR_TYPE=  INDEPENDENT,   DEPENDENT,       DEPENDENT
##VAR_FORM=  AFFN,          ASDF,            ASDF
##VAR_DIM=   32768,         32768,           32768
##UNITS=     HZ,            ARBITRARY UNITS, ARBITRARY UNITS
##FACTOR=    0.250966925370066, 1,           1
##FIRST=     8223.43324360094, -180847,      -35293
##LAST=      0,             70448,           -19286
##MIN=       0,             -712791,         0
##MAX=       8223.43324360094, 450509442,    0
$$ Real data points
##PAGE= N=1
##DATA TABLE= (X++(R..R)), XYDATA
$$ [...]
23900 11366 -44229 62788 -9294 -153738 199088 -365585 -256047 -147007 48296 46235 -553206
23888 -234696 49498 29788 -100256 -90835 131928 42446 278421 -360465 46185 -363419 91912
23876 64581 72233 -359445 532 -57783 -177183 -200209 -107238 98175 12439 -41294 -166120 172580
23863 163177 174913 -71478 -50367 -135440 6082 186759 -32977 135527 -188988 -125907 93477
23851 -302100 -187809 -105061 1301 -190633 14666 137287 -190462 2580 -66116 147345 8222
23839 161994 71148 -276092 45986 45653 375681 164720 -66362 -72102 -45031 -285921 -111686
23827 -68440 98 -104230 75390 -36542 -115919 140572 -105049 14737 -218546 315081 7116
23815 -393838 -125317 -30185 -135978 -135508 55538 209652 -106445 36263 189281 -29898 164434
23803 118047 458561 98183 15827 -7043 -228130 -140582 -226465 198831 118539 -85684 -78384
23792 -78384 28849 41979 141731 -223343 189037 91613 -36392 -210981 203026 99662 120955
23781 120955 57471 -194953 -256399 75693 -18398 -156220 -24228 141200 -178707 150438
23770 122133 97187 -86991 -63481 -63325 -339930 9376 115938 68632 -180306 8312 -196876
23758 -106031 -124577 -72207 -224572 70384 112221 113407 56681 161894 -160268 56112 -42715
23746 -44558 -187994 233454 -67609 57075 93994 -3059 -21900 -90678 58542 77426 -15232
23734 13149 -185623 221397 -92336 -20758 209068 428371 -155482 51805 -400818 -336021
23724 -336021 43340 -42780 282551 299223 -252808 -150937 147894 190768 -26845 -36270 -214641
23713 -214641 -246615 182319 -26968 128365 -16627 -178150 -163434 288665 -439178 46276
23702 53859 55600 49426 -61675 65772 -151145 149682 -141984 97422 -280255 263928 -193135
23690 24570 -250848 -125419 -41764 -359453 -1505 -276266 -72682 174812 280737 -117815
23679 88394 -296615 -212796 -43913 45613 90214 170099 62087 -283558 -13552 128462 -325550
23667 -170777 43621 -172813 -93079 -101690 -72825 387480 -200716 -161233 -120337 -31383 27588
23655 148936 204056 86750 289597 -240551 -175923 -194425 90108 -9449 51046 -82641 22399
23643 49657 -113119 -130016 40608 -44675 -100882 -113668 -456590 297683 -56889 -88198 -153089
23632 -153089 21159 123467 26964 15245 -522834 -44341 9548 -311471 27960 -11888 -51874
23621 -51874 -85230 -11797 -128909 -64497 108256 78043 257905 -70722 -80791 -43375 25129
23609 -76577 63144 93562 -38813 -29488 30639 14489 158806 229152 30548 -144212 67455
23597 167036 30415 6309 21474 -834 -35291 94877 71897 62384 233250 -54476 107085 40135
23584 47731 -73242 -16525 -206819 -100450 146907 173940 201754 87412 200273 189145 32635
23572 -30570 44692 226429 112131 -816 -345562 -147111 275555 -50328 -149981 -1177 -15304
23561 -15304 -315270 7913 389247 -82750 51398 73383 52486 36825 -51663 -99109 -364622
23550 -364622 159268 69755 -263052 153315 49897 -51971 119345 -27892 29988 -203314
23539 57252 -298737 11658 -210031 -118326 -34687 88486 69451 147313 119058 236699 -62891
23527 229434 -143471 -31597 18075 -260434 56711 -31023 77121 -11069 259954 -71401 119995
23515 59954 20498 -137221 80278 -119782 97384 -358016 35128 470207 92508 -179695 -11407
23503 -88117 -25060 -9265 234106 -74315 -226023 382709 108510 17259 -281716 -161973 163926
23491 -49237 85431 -88728 13307 -436884 -156478 403664 126345 -115228 68675 106975 -281432
23479 -6025 -5695 12427 -252752 81524 -127101 -53111 209512 152879 -71357 130294 20540
23467 -370913 289825 -68785 -431641 -17992 127469 76901 -116851 275804 -48508 75505
23456 -122246 -74377 -107183 -52109 160848 27496 79775 -85041 -136174 7758 -53676 232083
23444 -337970 87100 62300 211709 578239 25700 -171751 115232 90627 -142083 -51001
23433 11426 -300995 46617 -194696 40181 -234078 -4206 -14732 -286064 -41484 -411081 -126697
23421 -126423 -242962 -86806 14023 63227 66106 -182580 155304 -222970 -198909 93365 -56401
23409 -21868 89578 25079 -139619 2111 -114743 -32626 -475154 59097 100811 2528 -103642
23397 -45615 -24033 -111671 86565 27388 -51680 -110470 76529 439010 -299331 -77096 65588
23385 -5099 -34676 -53283 -229050 59384 -155736 -54763 -260828 248838 325335 -196022 471748
23373 352527 28421 19749 -235646 22106 164301 169325 -16954 279091 123458 -259031 7872
23361 207017 -12901 -217940 395975 89593 -51997 67227 67636 -141280 -257807 90672 -155393
23349 105310 122350 39629 -225078 -53267 252118 230578 107270 -214575 -149071 -189630 -62805
23337 122346 33331 -150824 -63718 234443 38124 -181424 -12126 -125851 -121106 196543 -164811
23325 -189045 -119276 73997 -24053 130581 -81766 5176 -41114 -133415 9811 32706 81607 -142147
23312 -61194 181928 -58409 196616 23487 -241338 -162965 64219 298414 -194427 -148437 31092
23300 -216117 2168 -97805 -394910 153565 -76272 -56333 -222927 209211 276437 -55539 -45805
23289 -45805 -132269 89453 297741 205191 -199117 -100508 -60837 -232879 -75775 84692 173122
23278 173122 51945 174426 328099 -53906 16886 147 -211267 282537 93139 -91652 -119408
23267 -119408 -142435 145275 -80246 -207931 -170064 -224267 -208873 -224372 -65484 36558 -182888
23255 80637 -95810 282303 -86508 -178623 -20587 -104581 -65873 -180376 121360 -163635 32532
23243 68795 -273797 208727 340731 173296 -70596 51821 -800 196388 -133069 305880 26626
23231 -127868 192117 -77277 56747 124671 86053 11936 -97440 121387 -46514 -527834 -190777
23219 -86701 -181611 181385 -186902 -129252 194786 -18013 -20316 17975 261203 -119379 -95324
23208 -95324 -775 123405 65240 -62286 -83715 -271032 -10923 233119 -250064 14516 9803
23197 9803 83230 -119455 48438 244570 -126147 -13192 -41301 37826 91721 304873 -248172
23185 235042 -397150 208404 -68303 135902 40745 116788 119698 -181850 -228163 182465 68544
23173 6399 -102836 -264427 2460 -43819 151944 65348 56301 -92369 -251330 97981 -196197
23161 -50685 -88751 -166109 -22999 -271686 63896 79752 -97605 -88220 162688 -330350 86616
23149 -139590 174413 51315 7663 -403331 153993 -112825 172189 105719 540185 184375
23138 29724 -19683 -173186 -41171 43509 188502 19886 76304 45571 -41327 -534755 166466
23126 -34805 -108964 -84713 252394 120739 -126568 186161 -155845 -161399 -29321 169295 -75965
23114 -6624 75754 -186128 306095 378715 -277972 -45647 1733 7991 164625 267892 148648
23103 148648 -145008 -52836 203730 -6087 32469 76563 -141319 -263587 264189 -40321 171157
23091 -62106 434926 -248590 -256249 -131934 123279 -29924 141355 -138526 -183060 -216090 -347044
23080 -347044 25184 -55331 141285 42936 -87470 42299 283577 28412 -205816 148342 207337
23069 207337 35431 -47869 295243 -70532 -68014 -103370 -247376 -23611 -31682 -140196 24465
23057 28680 -373744 -48777 5194 73811 82573 68420 14829 -52513 188364 -144389 36755
23045 -232232 -355467 -94335 1466 212126 -46343 -80029 -170788 -492518 -230791 -392669 -66673
23033 -180057 286619 35670 217980 -180138 -22524 -49054 170961 165447 250102 179382 -182170
23021 -309276 153428 -46918 -58615 -39840 -306695 -128935 206132 -195958 -27039 -8605 -96205
23010 -96205 154224 -128728 194806 -157678 -92382 -52818 43606 -154923 -224721 173586
22999 -1102 -260360 31625 -130009 -200549 38311 -382333 -132361 -67101 -49173 -14966 72990
22987 -219373 -52564 -145001 -219341 209784 87396 72675 190805 -90608 148189 -50663 -287944
22976 -287944 78647 -114167 104010 84449 12845 -36510 143033 42446 -304384 22773 -188910
22964 -47560 -129644 11419 -242583 -141946 179321 23926 139220 21578 149317 228409 -172705
22952 -92814 -14847 -125633 79060 -164621 196688 -263619 172366 -31146 235997 222216
22942 222216 110805 -251530 -40152 47208 -5021 -325401 -100314 -122583 217886 50892 -128496
22930 106050 34097 91760 289458 19985 27074 50985 109900 -46612 -325809 50725 -28187
22918 -207054 -164527 151548 7582 72829 129990 -193069 -142083 -355544 -169306 -81943 1621
22906 -65738 -32637 -51434 -92493 143249 138105 38305 122823 -22436 -22775 -366291 -141256 -37470
22893 -125646 52646 -183124 -52800 -53570 -285275 -17020 -38919 20113 175778 -128145 -68164
22882 -68164 56200 -240005 254910 71726 73399 -37896 81099 12974 66434 33517 99016
22871 99016 -320234 -82461 388486 -238535 -35712 -132375 6979 -110220 143003 -237210 -267051
22860 -267051 212770 -107908 16928 80277 -135963 144094 -109493 97686 79146 -228854
22849 -33915 295229 -118228 -33999 19712 104590 -276409 -43311 112281 -106170 14603 -231837
22837 -47285 76587 87520 -163676 307648 196479 -305654 93765 -60732 -64839 -97681 -242978
22826 -242978 15499 49059 143101 114515 -195490 -70424 -129906 199828 154596 -81793 78136
22814 -211595 -214548 -87128 46421 61328 -108063 55864 -45307 -93504 -21965 4842 149964
22803 149964 19358 191746 -279502 95528 477322 -2930 -361530 -112487 184202 244817
22793 244817 -290611 100270 -142505 -192559 39770 85011 -169934 -47039 -383415 -31489
22782 95931 -59934 -41695 -252988 -446234 -320656 -95237 192805 105729 -227393 -47396 -156643
22771 -156643 -6519 -219644 -164848 -329972 -208549 178917 -200574 108656 107755 73439 48160
22760 48160 -101944 -35666 130747 208814 166942 -55897 -165489 -33818 -18512 -26128 132450
22748 55102 -39421 -29378 -78458 -184432 -86709 145760 -614 239137 56072 -145192 -84386
22737 -84386 -155038 -6792 -22736 104318 -399500 18181 -411741 108358 365054 61538 -146826
22725 214163 -177062 -51120 33841 -57987 -42233 -212516 250972 72378 -277182 -158983
22715 -158983 239637 199808 224169 -56846 36420 -248908 31930 -146709 -28206 181311 -226170
22703 94538 -282424 -239656 18243 -25766 -115825 -320169 -13983 -346333 -56679 -191054 162292
22691 147731 214307 -109084 128488 -60039 -10191 -104029 38051 -88678 -141986 28292 139658
22680 139658 81646 -203328 -80612 80212 -110266 -154076 -131203 -4144 -3913 -181600 141353
22668 64476 19803 -57473 -29789 116189 -227497 -161832 1091 -383165 406983 -64498 36307
22656 185540 -300303 -492367 12238 120970 -268097 119904 462769 -51194 -61562 79066
22645 -5121 125348 225624 -76878 -53408 -281534 -309749 -215098 202922 -198124 -6434 -369589
22634 -369589 -173097 -80137 -52467 -241798 -109078 -342555 -212244 107565 -168041 -134035
22624 -134035 -76655 111788 118754 3396 88521 -84959 -96437 145571 -104204 -303984 164490
22612 -135985 -130650 164735 -1271 -139302 208037 -103397 216410 57892 -122017 34754 24690
22601 24690 -17871 240491 -113946 -137214 -197341 154110 146199 -112398 214110 -61156 108796
22589 239858 164784 148254 165539 5170 -80358 -123401 -35282 33540 -173899 161173 -387745
22577 -14621 -263400 -23541 -158958 -172197 -115978 192995 21835 67576 -26516 218820 -31521
22565 -103803 486104 -75202 178649 -70607 -279309 227386 -81417 78185 -161873 -111208
22555 -111208 -455757 -276038 -78886 -3253 -2847 98323 -121900 49192 171283 286590 -187475
22543 -41913 -223056 -100638 -104122 251040 -236847 -205761 -89075 -20387 27910 -149868 -258200
22532 -258200 63523 -11384 -313219 -198772 7041 113779 190790 311064 -103282 19157 494276
22521 494276 45270 -123563 33273 69022 -173322 346459 -4805 -211871 -183222 -373957 -278143
22510 -278143 171648 -260997 -14506 22192 134012 4149 -89472 -34146 -107503 20512 -126340
22498 286747 -527580 -209468 158484 69641 19306 -162670 -207085 -360494 158666 -163025
22487 -275661 58292 212763 97842 -153946 242458 70107 -120076 -159384 -107396 -187424 -215976
22476 -215976 254767 170169 57565 184340 -13508 86387 -284491 -30560 32448 -10452 66610
22464 5362 9202 117375 22831 -235303 -196390 -37555 123766 -132997 77566 -76647 141360
22452 -122511 -171586 -67198 -94359 -32389 223821 -95180 -32265 -320804 -110641 27326 155727
22441 155727 4072 -358550 -128922 40112 150949 202296 21454 -249251 155072 -53696 -39338
22430 -39338 -98877 127912 75364 -12393 -247631 178087 -93090 182347 -69806 -43391 -56783
22419 -56783 -159966 -150076 -24995 -278082 -154220 -255889 -120230 -148660 168681 2770 211015
22408 211015 173245 -115305 8095 -126521 326991 -286503 -113446 -121828 -64321 182083 259420
22397 259420 -92932 90986 73596 -173001 245494 -120671 -80852 148579 -191434 127409
22386 -165062 -348094 158117 -184897 -306328 156148 -132090 73091 111083 87669 132457
22376 132457 -105034 -97574 1003 -95826 269406 -272275 -131602 -8900 6510 -300357 -209453
22365 -209453 -318907 -142527 -61827 -45408 63628 -2175 -21457 -69299 45758 -67981 -333596
22354 -333596 112989 67565 53265 -54102 -161496 180587 -69470 -247891 186350 -236988
22343 153507 -107023 -237563 208183 -66869 11394 -59974 114426 -110390 -29161 106024
22332 29740 -115079 39738 93133 57125 -88630 -70322 176785 45139 -22375 -39381 73191
22320 63286 46741 11895 -304277 -161433 98357 -268160 -224140 101264 232904 -13031 180712
22308 248797 78572 -89670 -201440 56817 -2166 -30240 209082 131472 -32344 90696 -197794
22296 21488 -9593 218544 25591 31757 42486 73177 -7929 113688 578127 -133564 28844
22284 -62553 53017 135953 -267346 15350 107511 -56686 -29966 -52902 97903 -163860 52620
22272 72585 27768 129887 73308 -204343 131908 68213 -196853 -152822 -189411 -76560 -84094
22261 -84094 10432 200361 -42464 239881 -160334 -33010 -107256 20313 202976 172761 127222
22250 127222 -9865 33238 -150568 -47523 -14482 -214820 -343787 -164811 -465915 -203033
22239 -4721 7514 132555 57707 197405 58028 -2877 -25145 -72949 -162837 102678 -73328 62193
22226 183205 -471258 117408 -107074 -124485 -102899 -41052 -54326 -249274 -38307 7343 -264766
22214 -102338 77711 60653 -75805 -31827 126364 -97264 -204649 -258146 -9543 222810 218720
22203 218720 38695 280487 -307291 33010 263676 -5051 -145105 129755 -257299 -231742
22193 -231742 -248539 176175 -97365 20114 -102421 -169323 -72309 -120235 -307128 -77359 -67765
22182 -67765 -231452 -123340 -51106 146126 141394 -42226 -261776 -215819 -458898 134314 34412
22170 295092 114674 22524 91552 -23009 -85015 43506 18306 -211739 -172476 80751 66171
22159 66171 169841 36867 78039 -135710 15847 -150866 12132 27961 -23949 151899 43333
22147 -310975 -163732 -91926 -100078 -357560 -139041 225956 -28290 -13698 -15085 -93893 122192
22135 103769 -185022 14944 276518 347546 338794 -160115 352927 -106112 188780 242986
22125 242986 186678 240952 -200777 -230595 13699 -67714 -111703 -154605 -94181 -66368 -151505
22114 -151505 -38205 8670 -84975 111 22916 15287 -108893 -86864 291052 180188 -57155 17406
22101 -56475 259430 64854 -210002 397738 -168501 -98791 36561 -57485 -286578 -35488 49133
22089 -426771 3886 218 4158 -376260 -33825 158308 70001 -74322 -205946 -304752 -112000
22077 -22045 401482 -98791 14322 170569 -17526 -77689 -130742 -87334 58807 330678 -73322
22065 -13445 -85735 -92364 177761 -69982 -115276 -104448 47981 -337137 -40530 -37662 -199658
22054 -199658 -244240 121418 -256766 -410629 227889 134810 -203039 -231732 -267621 141329
22043 70578 93787 -41941 68726 -221293 -162137 -78969 67056 166733 -154351 -131585 -109611
22032 -109611 -307360 -93139 -293524 -114406 -178359 -24993 -82976 -172741 -218890 339858 69005
22020 -120287 85031 128496 -191492 176910 -176694 -194463 -50379 97172 -23416 59321 47284
22009 47284 -141518 183213 86550 122400 -142356 -127199 142186 245806 214869 -84512 -100737
21998 -100737 95708 -21003 -225988 -272292 22209 11908 -397541 241201 -37671 -43464 -148331
21987 -148331 -41889 -9444 -2624 124982 -212480 -105671 -104243 198292 253058 -203289 -325803
21976 -325803 -215839 -191691 -69841 -149782 -39966 20151 379285 70845 -227353 -413256 -2669
21964 -54479 -56170 -139412 299359 -200531 32100 -196422 -506917 -81455 136439 -24793 -161555
21953 -161555 -287835 75283 47936 131983 170303 -160910 -366216 330304 -29263 13257 -265738
21941 67209 -149128 328133 -318106 106607 203565 169859 -25091 -18286 -75958 74258 -274484
21929 250976 -224785 -197182 161242 -36846 -16890 -35765 -15690 -518661 -193948 -103871 -38347
21917 -227029 -336244 114249 -39659 -209069 -29664 -92677 -72627 31914 61525 -126296 131347
21905 -26298 -297120 -122876 -178440 -29407 -333130 154220 159601 223942 420942 74812 184141
21894 184141 -25226 -37208 -187462 -30189 -41925 80516 90052 -375364 138601 81992 -58968
21882 -15662 -77177 -345077 32126 411892 1155 229114 -4520 -263710 -232851 136703 66903
21870 168128 90058 -59478 -183159 -132282 175909 -125982 -107755 -14055 114160 -150977
21859 342490 49613 97409 -201082 45371 -73962 -87399 330784 234673 -13534 372806 -287163
21847 22812 -41436 -284150 -427355 -100124 -97224 105943 -71364 110592 -44640 95827 66336
21836 66336 187543 125322 -307088 166065 100958 -198037 183009 -248634 239518 -147594
21825 -74185 -186164 82860 -92300 54894 243724 -109485 -221798 -26692 47327 98654 30
21813 113241 92745 -107024 79749 -53437 331773 -28553 46412 -82878 36468 -44584 304008
21801 210620 25284 282091 -173467 129037 70754 -171469 -2527 30285 50770 -11050 113549
21789 107428 168722 -334 -205738 -182638 -281362 -102106 165044 -276771 170028 146101 222286
21778 222286 88366 146334 150244 55302 114039 63664 37592 -145703 -161859 -51414 -426146
21767 -426146 -167799 81170 26670 -22418 -86930 397433 87428 132763 -150380 -86710 105337
21755 22193 -60538 78809 -53296 -97683 3240 -308448 178827 5797 -103860 -288555 -285747
21744 -285747 171455 53635 -50955 -109546 224918 -219394 -78965 -136254 -48789 -46914 -255417
21733 -255417 117107 266121 -27362 228 145253 -295206 -35110 -116366 45694 -521537 -32274
21721 -425853 -36633 -128646 -187831 -64357 -53753 145306 -298802 -274845 -337243 -172876 -37968
21709 71904 -15311 -182209 152916 90877 -272149 3781 -36140 -289990 -152298 7270 -146418
21697 161195 64467 -173180 -7214 -293485 41422 -144861 -123570 -213520 3842 -106944 -23651
21685 -2078 128033 -292521 12477 131052 18504 -52774 12608 -2189 222692 -78454 -319799
21674 -319799 -28437 -478117 -105794 -51260 -182683 -110287 -18300 -87660 178671 -241970
21663 -9870 117699 -262240 -390841 -260063 -67420 -52409 695280 -54494 -66242 166806 27067
21651 -1976 22443 53897 -205378 -267889 -64221 -77266 12549 25392 137130 1769 103254
21640 103254 -295762 231767 201159 30833 -408754 -82828 -155777 -98256 -204923 30093 180194
21629 180194 -131370 -313948 -370439 -51541 -152264 -23443 65299 269113 -208508 -74508
21618 150087 -35524 -90620 367197 -9470 -55722 298929 58447 -31810 -128634 164326 262840
21607 262840 77917 105373 193286 -129923 234862 -112682 92983 131769 123661 -65871 44891
21595 -23753 130574 111251 178112 -154849 -30507 -150054 -167837 -170443 -199953 103516 -422658
21583 -57933 -251213 -5437 -201774 -200212 -208152 -59990 125904 103568 -122952 -55100 -316768
21572 -316768 -60273 67390 -67858 -117362 17046 -349694 -316500 55212 -333854 36699 211072
21561 211072 77178 -15310 -40148 -16690 62045 52041 -173632 137335 47577 -168668 73667
21549 -48505 214039 -70759 -191998 146897 -169640 -485411 -56036 -296082 36067 38211 -260850
21537 -138921 -92588 -19341 -143409 -81982 -108516 -46884 89833 -141291 153253 -385459 -236357
21526 -236357 252525 -278433 -133209 -136520 -283672 -34231 -352238 23148 -378800 -262962
21516 -262962 15226 -174204 -28273 106086 100722 24472 -25440 -7153 26355 -39036 22863
21504 64021 54194 -210439 -142783 110899 -202066 261256 141642 -55001 154954 60103 -72846
21492 72048 32932 121811 76707 -58520 126484 -87603 -70110 10129 168644 8715 -30084
21480 -134444 97028 -72001 99891 -61210 2790 98450 -99969 21605 -35287 -97399 -157905 -255
21467 90028 -115488 183870 244894 71568 -17260 -62012 93436 -181125 -180933 -34213 242110
21455 -23393 -35303 185324 43843 -190434 146825 -418792 -208910 -60360 374779 -171651
21444 -210013 -248713 -56754 -420463 196202 3543 -152724 251303 161947 414523 271606
21434 271606 -124582 275079 223624 -91531 3743 -156739 -143337 -286842 352081 84541 -125112
21422 27457 217200 -37683 -421899 -297961 95651 -301253 84559 -227811 -77315 -146339 20623
21410 -143460 131284 81900 -111074 -102152 -37320 -378893 -75970 -150107 -390257 -465604 127337
21398 -43437 184902 -144072 76805 22046 -46474 -78007 160012 82222 246835 76073 -310582
21386 124375 -27756 -131709 -137991 113573 262304 80874 37115 321414 -182100 9335 -106705
21374 -78112 119488 16460 201311 164165 -181886 -87307 -223084 8484 -158773 -61345 -345353
21363 -345353 -467464 -167145 55365 -192438 186460 92373 -195716 138602 82928 -56733
21352 -76605 -133063 82965 -234133 -60335 -54364 -68583 -99127 -323311 -123808 -485803 36439
21340 -287377 -216302 22290 185229 -10496 153549 -117217 -103359 -89137 -16931 -8785 -238591
21329 -238591 131510 -47441 -307462 -58216 -327694 139947 -35870 -98942 59920 89194 -55821
21317 -40852 30246 -55584 -20884 -169512 -31729 15083 157278 -224456 -222579 -7538 337030
21305 -376720 118064 25651 95964 -336462 -124631 -584064 -225482 -268232 42626 42776 -215129
21293 34308 148999 158402 236264 -230757 101059 -94807 -120654 -52578 -64434 -106136 -158111
21282 -158111 182264 -9570 181840 82413 -270833 -200373 126556 81887 15916 96823 -215779
21270 -108356 -184276 -70452 152370 -67234 99362 -363223 239237 42927 -126999 -30173 201125
21258 -171188 -250400 885 -272834 26601 55422 -90728 161343 -13460 -199436 58025 -295191
21246 106378 -399919 -223097 -172214 298337 -113521 278126 -39085 135424 44748 -153700
21235 -173660 36844 28690 -125278 -156399 -126607 -298696 -147509 288847 -98977 -28550 -61371
21224 -61371 -55494 -24756 93314 73665 12057 26780 66300 223058 418254 -57185 127028
21212 116211 -237602 -293917 6195 15205 128199 -73688 -471272 50210 86409 -62010 -127572
21201 -127572 -162728 -165470 -298813 -109580 -170402 -150427 7372 53371 -106719 88748 -119381
21189 -104262 63739 55102 233057 -58291 -38491 -62161 -188093 56706 -14118 35141 149774
21178 149774 -156541 -404618 -29469 12813 -259244 -297865 -318002 -18671 9604 -185904 -551266
21167 -551266 -319325 -70908 397922 113991 85908 -230717 -37249 -306535 -242917 -29827
21156 -24881 -1105 -127625 -210069 80541 -75512 -129244 61601 199269 -1606 -119960 -30938
21144 -31172 16859 -405504 -187599 -443314 -53949 -9417 11804 -294642 192733 -133431 -68251
21133 -68251 -65471 -176744 -1190 -72000 -127093 -22815 127134 -161010 183900 -202562 -245550
21122 -245550 200986 -243762 -249647 -130121 73939 262643 57306 -154176 330955 -153467
21111 79780 -325796 -70063 122108 -30060 -59655 -78976 203703 -221022 326502 257292 -226290
21099 -27625 -70966 -213199 -112738 78734 -336253 -200755 227954 147301 -94165 72865 -152488
21087 -115332 39531 -172049 161792 41460 -517611 51889 -185497 -147391 -2971 23594 -106427
21075 63653 231685 92566 -103697 -256074 -64123 187157 -147717 99708 -2198 -309747 258432
21063 186286 83492 552319 -246282 270697 333780 -129936 -85805 -73311 -34277 -94270 -66850
21052 -66850 -328867 3463 -198270 -30333 24483 85803 -65270 17261 -87335 -14993 67994
21040 42663 -138949 -248756 294802 -68251 402052 221930 107536 160970 49876 253555
21030 253555 -99799 -155828 43934 118360 6053 -39586 -65410 -151762 -295418 266924 -21844
21018 7022 -36413 34200 -34880 -115515 -174691 261935 -185984 61570 -218754 -113096 38096
21006 -16898 -231129 -258594 -161402 69490 179106 -306329 206308 -469 14585 -28778 -327077
20995 -327077 43038 -79506 -183495 11016 -149801 -94325 256207 127207 24618 -147408
20984 -318686 13050 -116887 281769 -136813 -290992 131286 -361745 -72464 1147 -182079
20973 -185511 -8212 77007 -76078 -10397 29798 47562 -182856 -245218 -383642 152813 16472
20961 -48122 -153202 -401564 -54573 -98745 -11338 -37537 -94265 -153799 224027 -299388 -267494
20950 -267494 -94065 17809 -115957 -128 226658 242031 -22900 -68572 75688 -153753 -327841
20939 -327841 224608 -394658 -168385 -104452 -188500 -34674 69093 -890 -203855 -36450 103670
20927 -78191 -259590 94614 -213976 16957 -156941 -134053 -44922 247592 -114672 -12189 102153
20915 -123463 31804 -47468 -308940 -105416 204309 -64609 93202 -4356 97307 -86026 -448477
20904 -448477 -65697 108483 -71080 -211349 -124707 301280 326085 243830 181449 -261403 214785
20892 -67704 91154 -7468 473248 -173293 180251 -163867 67311 -28572 -269570 220280 -458849
20880 -201847 -140122 2721 -25541 -13105 50169 76444 -163751 -146008 261204 -33814 -366748
20869 -366748 -122499 -340608 -267494 45331 -292317 8585 -260190 -267248 -207604 -98265 130084
20857 308426 -204349 -16383 -575237 5263 -171816 71279 -42955 52633 79130 104394 64070
20846 64070 230504 82608 151742 -166979 -244353 566976 60421 -65636 56017 -125793 461164
20834 125180 -399677 28219 -56005 -6992 -207713 -26124 215084 -58698 -123801 191241 51516
20822 10109 -159201 -137676 -70840 69414 -79406 -484703 73529 -372976 -104859 -7223 -170334
20811 -170334 -375154 158808 69207 291718 -51755 95607 -31705 78910 -146683 -278611
20801 -278611 102734 146974 -39726 2291 -189390 255787 201870 -1089 -342216 -245027 -160155
20790 -160155 -225657 207406 -8023 67718 -16273 -274966 -71833 -167391 66671 -317797 -23129
20778 -432862 45093 -39941 -88767 -136954 -102004 -155233 -88249 186633 -146398 -103329 236817
20766 230533 -112137 79757 -43463 201974 41278 106656 -46 -10530 -53691 -12884 208665
20754 86641 -124814 -296671 142836 -168049 -170957 25917 30662 -128008 -108106 32920 -94813
20742 -152879 -232895 410404 87184 -101760 -53501 -253927 -229746 108889 -110410 -146479
20732 -146479 -278558 -235436 -74952 155987 -59908 -214714 -43161 -77650 129505 -573234
20721 257812 -151548 -193599 -113892 -193063 285898 74507 -48817 -66765 -103373 -2079 -60689
20710 -60689 -233591 147839 -190516 3369 -536287 -69810 -120742 -131210 -142938 176275 72381
20698 52409 120204 -7129 2981 6250 -187241 177151 -180879 36140 -185351 -50643 -23750
20686 98435 145028 -282547 -44729 77856 64205 -277127 -202375 -281932 -134681 41353 -207748
20674 -65045 63805 -124885 -82498 -127981 2883 73926 -122517 -140961 216595 -81154 70558
20662 -79729 212316 -54695 6137 -315738 114714 6174 -349782 86794 -130380 -326834 -144646
20650 -247884 12421 -148312 106114 162884 -45163 -27187 10427 43812 -144229 -30192 -244829
20639 -244829 -179717 -153144 -217160 -198936 -46000 98991 -26255 -277824 -313262 -143973 124725
20627 -294819 90686 -10361 -370422 409017 -309499 -145852 -185327 -197210 -202717 119551 45359
20615 111362 -390964 48833 -87831 -56601 91740 23488 -319760 45252 -212802 -192145 -89722
20603 -272437 28916 8744 -121775 4700 -110032 283193 -2678 -125583 33121 -195921 -18566
20591 47406 -80270 -238267 -203625 115210 95022 -66610 116452 10783 -43308 224935 199789
20580 199789 227965 -168261 37999 -11776 -85441 -109097 -377854 -21407 -102731 46437 -101954
20568 -159048 -161238 275061 -64095 -322645 -200198 -239613 -122900 14958 -251098 -108688
20557 -70399 -193280 -119141 -235975 -37376 98081 105010 42314 55556 -174182 -61666 -79639
20546 -79639 -42245 168599 178409 -65182 26783 -11921 -151579 -230030 -49727 249706 -312284
20534 12931 -185988 -68554 -192729 -82675 -193115 -339297 -40586 -4467 78955 -492860 181969
20522 185561 -38846 45002 -226986 -121164 -176924 -183964 -193072 341161 160862 86088 24487
20510 301642 47580 -66601 -63798 34125 -202332 -216796 -49507 -197091 -111458 -102164 62489
20498 244191 330400 -196320 -228256 13281 -41900 -111526 -279003 -669593 136907 -262302
20487 -412406 250627 281287 49614 152220 30954 159193 -317444 -279713 168794 -226161
20476 102276 -115017 -74388 70147 -67957 -39946 -212548 12573 -237133 -159570 54040 331036
20465 331036 -278006 -30081 -62243 -50813 137924 -94212 -40333 93761 -4545 -72837 -1055
20453 -272020 -248296 -156284 236583 -47161 -110682 59590 132365 -128365 -194089 -224501 104031
20441 -217236 165568 -54725 57205 -22005 155454 -297724 244372 -107373 -146002 -46749
20430 174932 -287961 -117518 -130676 -57844 141286 55982 268801 -310915 -109677 -246132
20420 -246132 -298824 -74334 305958 -316897 331708 -450714 -293954 101707 67388 -77611
20409 -195146 102259 97508 -191995 115403 -150113 -249301 147702 89160 -65418 31094 31088
20398 31088 -438852 75414 -430221 -91814 -245241 -131246 -185037 -11091 61902 -185384 3771
20386 -176190 307294 -14584 -236074 27886 -33762 243689 -39177 -119577 28375 10205 51041
20375 51041 127061 -61268 -165628 -65195 -157203 -27120 -20949 -16628 -298355 -11723 -80712 -258849
20363 -258849 124884 -352743 136060 -31812 -15794 132487 68455 160489 471927 -77718
20352 -178396 -227872 -248408 -128209 -13328 -81157 31250 -212403 -296125 28880 -151746 -27300
20340 7711 -478628 -104346 -145166 243928 31449 -196782 -11080 -225101 -99997 -353268 72146
20328 21916 42300 161766 22897 -102508 -30327 -133601 -289198 -194780 -37941 90635 15532
20316 -100429 129386 -110526 -309173 -65926 49036 -303297 -197417 -210180 -17398 72893
20305 74139 -111595 47360 -80106 -43740 19936 -82133 170061 204081 108585 254618 22947
20293 -270922 -111130 -249151 -108843 -104576 -174737 -5514 30201 51009 -382391 -39792 202832
20281 41179 -134230 -18729 82759 72641 -274948 -136545 -85031 -120960 -102347 -305602 -22652
20269 77835 139346 -222139 -443430 195101 -207846 -45261 226476 113879 126 -165516 216092
20257 -50497 192960 -57402 7432 342791 -117098 -30074 -59 331911 34923 -163460 60340
20245 -28564 110936 -130773 113178 -89928 15932 100515 222399 178709 -401993 297490
20234 -22116 243065 64122 -119911 -150526 -205544 -34898 -244782 -350095 254908 -345516
20223 78521 -150342 -240248 32318 111647 -99369 108255 -74764 18150 -117778 -14831 227940
20211 -101640 221750 -283161 -341488 163650 -134144 -131059 149771 -72950 260578 -203555
20200 -276632 86214 -54582 -267242 -109873 222656 7484 -20348 -129405 61086 -6613 -70130
20189 -70130 35515 -69776 155080 -171098 124547 -69640 -28698 -189145 -37301 372 -102902
20177 255429 -442752 145681 71001 -215353 208597 20860 -150460 146283 -127617 -229778
20167 -229778 -130457 -7576 -133254 533553 -128320 110017 143402 -250311 -114564 169960
20156 -265853 61640 -119214 264411 -266862 -294595 -428339 -99471 289087 67865 111918
20146 111918 -200249 -166504 77232 -270840 78664 -146743 -340368 -46535 398788 80017
20135 -63523 158744 -146168 141290 -179743 -37932 -262696 -210628 -116145 164912 46960
20124 -249434 168493 185999 -17303 -185853 -44967 110661 370240 51878 -314465 -1260 -256040
20113 -256040 -295392 -342918 184319 61267 -45861 -226456 -9309 83938 74596 -238264 -287068
20102 -287068 53503 -96822 -165994 -106287 -185844 -91047 -6245 -342614 -73493 -76318 115015
20090 35600 -198275 -172134 -21354 -109682 -409287 -430348 61695 30949 80918 383196 132426
20078 -380735 175397 13847 -241432 -213235 367336 -177747 -15477 -276447 -294365 -22421
20067 -243884 -250944 239213 -9008 -62579 -105207 -110948 189955 -247382 -218130 -214871 -296368 -69376
20054 -10123 -71192 -196649 -55495 88427 171244 -193754 -20130 -8055 193631 -6939 -181439
20043 -181439 -3503 -83349 -63347 -64104 -124253 -88213 -263766 -58263 41603 227267 -173383
20031 17937 106678 -99042 -51491 97455 -164337 -86731 377093 -57090 292568 111455 -149322
20019 -321238 156993 -240456 -110009 87428 -10411 397646 -110567 -57931 55936 -11959
20008 -164766 -192706 26375 -148383 78569 370438 -258240 -71826 11566 -288764 63683 216074
19997 216074 37914 -56704 34456 -185220 -89530 -191238 -90013 -279811 -129330 22885 -461923
19985 19767 -334001 43599 -19346 47963 32265 -86299 166596 173613 130703 251309 -25933
19973 -139776 -1753 -236477 356882 -206998 -50664 74802 47615 -4399 -238779 159575 -84297
19961 203413 268049 -94897 322759 -211760 -90374 98699 -353895 -263633 -466750 1667 -145155
19949 -140515 -40556 114984 -198726 -122219 6677 -94800 129940 17621 -229124 91430 276319
19938 276319 250411 -132316 16870 220597 -31817 -92979 11632 -217199 -165614 -212983 42699
19926 59970 44759 -56645 -215010 -156117 81329 27358 -20958 -44983 -273996 185584 65703
19914 -9872 131467 -15121 -86418 -33375 -227611 -136517 -90367 -29757 -33906 -52422 -230051
19903 -230051 -67084 -84112 -223190 123314 -11078 43286 137922 115447 -299866 79214 -536678
19891 -11520 75710 121956 -9369 81136 177790 -84076 -189512 -304494 -96651 125632 95660
19880 95660 141487 -438103 -144835 -81059 356247 15021 -153581 -124384 79450 -85303 -127916
19869 -127916 -54100 -86212 -185214 -221253 -82961 -43006 -236323 -116908 65610 -93741 31936
19857 -19975 -93147 -173396 -117935 -142411 -58515 51266 -96737 -136416 4461 66508 -42372 102644
19844 195826 -242354 -27810 62204 35828 -252168 -114984 -72366 -299428 43988 -253737
19833 7932 -563651 -130068 -55584 -151456 52990 -147487 95406 -87993 -192552 -79968 136419
19821 -317242 -48397 122828 -175274 -118874 -29195 23914 260263 -28425 19130 119837 52668
19809 -91148 -277964 -249893 -288871 -230026 28843 -215933 -27195 174722 -461049 -112553 -169177
19798 -169177 -224995 147253 183874 52554 -49738 79221 -18960 15877 -32853 -183746 -194506
19787 -194506 -134314 -117892 -106201 -358117 53918 -21201 -233474 -257181 144816 -273852 37583
19775 -117711 99664 -15816 57609 -197619 -69893 -291152 -194045 -28847 -123653 8036 244195
19764 244195 -445192 42974 -152483 -97745 146867 178870 241425 384660 -143067 137084
19753 -134836 -28858 -131593 -197986 -92850 -237541 699 -490552 246195 -83101 78424 35109
19741 -1340 -128172 -282310 47843 -212617 238054 315241 131540 -102428 -22720 -67334 292553
19729 -45182 -212905 -62477 110766 -64927 -39424 -176536 -391410 33481 341332 -228408
19718 -267982 -49316 258681 -18752 -206666 -221420 -126744 -35996 -177407 -80900 102925 193643
19707 193643 -151487 259674 -265570 -390621 68628 -150669 -24773 140295 -114810 150312
19696 339019 -190770 -230872 12766 -28861 -27281 -96978 -326718 -63769 -343138 -88189 39508
19684 137354 -72761 -306886 125273 -148810 -224044 -203827 332345 -31800 136767 14355
19673 -139626 -172696 -296296 65139 -51399 178366 -288567 -51433 -70586 -111109 130819 61099
19661 -106211 26691 -11823 54784 -279724 183486 -87360 -196660 -19262 102136 67033 76981
19650 76981 -220308 -324146 -44101 67100 206463 -38980 -132184 360793 122956 -6325 -86995
19639 -86995 247082 8599 76837 -19709 174256 -165709 -294667 -8312 -167880 41229 -106462
19627 78961 -426623 -31406 -75842 -140181 13652 -112614 257638 40417 -192221 312084 51901
19615 -282667 -386723 -463143 159884 75741 -121042 -134443 47366 -187563 -290186 6344 -26014
19603 -62236 -320268 -16908 102249 -481603 -12026 -192002 -31673 -142156 -222947 -242520 60373
19591 283908 366921 -52154 -215717 35246 -266420 -122334 101034 -26621 -69845 -221840
19581 -221840 -78485 -136038 -246660 -61166 29482 -154911 96277 -108517 -378068 279675
19570 -166641 -67590 -244060 64962 -63579 188038 -210639 -173632 43865 70790 -86204 111079
19558 -145996 -125107 -155348 -259920 -84131 119942 177723 153129 -60891 -238132 15022 69872
19547 69872 -76304 -196348 -174450 -194375 -260717 -219304 -88418 -257873 126095 -156599 -8164
19535 -106120 -120132 -384590 25110 218182 -78609 -20065 92061 271159 88927 140381 -58876
19523 57049 -312906 -275737 -163789 -221123 2424 -126088 47603 -20591 -311613 155790 -172343
19511 186374 -24252 -95743 -57272 -119680 -67485 -212640 -134895 -178155 -91712 121601 52423
19499 -290500 -64083 -130096 121244 128882 -329843 115278 35691 -13302 -140397 21343 34220
19488 34220 -65405 40327 -247072 -470894 -135865 -108566 -43442 228150 -117287 -61771 -358829
19477 -358829 -196421 -182866 75732 7689 235562 32513 -95479 -121045 163845 -323616 -205034
19466 -205034 321867 -204448 117339 117904 -124659 -220731 -544701 6860 -23435 -57409 14109
19454 91808 -53606 -211001 67392 -46500 -107646 387318 -159245 -237264 175750 -22081 30286
19442 -113344 -219626 53882 86517 -304687 128226 -26184 -174005 68980 78317 48240 2932
19430 -39868 -5653 320677 119850 168120 -135091 50249 -215787 157221 192116 288491 -60866
19418 1357 27913 -257711 237810 224965 104729 114715 -149940 61009 232019 180351 15673
19406 -340762 -41237 -284104 188044 715 -98402 153463 83196 83828 10386 -259526 161160
19394 -71502 134582 74365 -292123 -159539 -85911 59369 -137801 -212159 136378 -179548
19383 -275884 -37934 -81397 -41209 -116665 -216384 -354793 -894 -409410 191483 -123670 -111322
19372 -111322 -266925 112637 -65747 115256 408209 209632 -254971 -46710 -376823 -16679
19361 -394715 -44881 141617 -64712 -117766 -175029 -77296 88311 -206102 -78196 168881 -48870
19349 12438 198008 120490 -19023 377893 -72879 -67541 -124433 -295363 -253957 -481288 -58598
19337 25614 -104489 -15888 -312485 -78285 -59304 -45710 22562 -443129 -161813 -142439 55959
19325 -47609 -359894 -311241 130593 23982 16468 -121800 -123751 56699 -50756 135307 272102
19314 272102 -278564 -167748 14176 -200541 -171188 -176004 -14380 -351588 -214331 51547 72430
19303 72430 12559 -155730 -93883 -12618 -87166 100375 44492 -208508 -238170 -44833 18190
19291 90987 162330 -222006 -82075 -334937 -183163 -180498 -17336 -57230 181698 -465330 -13583
19279 -259360 -158947 177567 -214285 -117982 -258998 41162 -222112 -274669 169067 -343352
19268 -117693 -117698 -119790 -59757 -4800 -83942 137640 56986 -57960 154293 -260658 -270674 -32942
19255 -55082 74320 -149939 75498 -112007 65740 54814 18922 15669 -263284 153631 132923
19244 132923 -89143 61493 148895 -187213 -220120 -66771 -250953 20179 100864 -168872 -143181
19233 -143181 -103318 -33572 -125773 -158007 239477 -250547 79457 -246166 -117151 127076
19222 -261995 379254 -230600 -6785 16869 -91903 223758 -31825 375198 214516 -155469
19211 235721 -201570 -145644 -230207 187175 -144639 149993 72537 -132287 -17615 6269 -129466
19199 479148 47434 139810 83552 -75393 -98774 -139639 -49882 174214 132216 -66569 -225350
19188 -225350 104313 96488 25430 104055 128506 -52603 55740 -22680 -84535 114786 -135329
19176 -303770 -84626 -359305 21365 -8774 35343 94859 -317624 -150430 -135298 -50118 -47302
19165 -47302 -320231 -105926 19663 -267044 -152363 -17837 -99191 -72006 -43398 -293697 80572
19153 -86987 -3431 -1853 -277955 -380383 -29779 -47150 88704 180283 19052 -89120 -88525 -247947
19141 -247947 131389 -405360 56198 -72084 -250406 188143 -193181 -191940 -17117 216196
19130 -172979 -396426 -225047 179294 -251056 -92092 -130924 84036 301374 -95060 -147279
19120 -147279 -145811 -166635 -126688 -16922 -19568 -196007 -68172 -467826 52118 -60528 -336363
19109 -336363 210813 -195929 -27115 -311122 291983 -101531 70097 -32850 11977 100415
19099 100415 -170287 94189 -286083 64838 -27657 139876 -317185 -140923 26464 171220
19089 171220 17670 -56391 -170897 -296511 86627 -207763 -262887 -61659 -432168 35426 79944
19078 79944 -71173 -227238 -189833 -380420 -365658 147441 -154473 -205762 -237043 -141680 -281034
19067 -281034 228821 15861 -68669 338261 -243678 -199588 -211443 -10693 12850 -504260 135018
19055 -7586 23227 82973 -33997 43327 5395 317668 -127946 -414154 -102006 84315 12637
19043 -32835 -137909 236164 -16206 -411141 115368 118528 168802 -160790 -83050 100774 325267
19032 325267 135438 20014 310137 -59179 -6628 225668 -16814 156215 -97595 3879 -109081
19020 51586 256829 408356 -180290 195431 17822 -231914 78758 68796 122351 268437 -24935
19008 81166 -30218 115514 -290589 -106755 25161 -351950 -487806 -82755 -97998 -209756
18998 -209756 35524 114044 -50400 -11576 -110073 -346257 -37263 -135881 60913 -108519 -301388
18987 -301388 49786 71299 -373648 -454811 -238673 194859 -418428 207653 -438807 250059
18976 72497 119124 115307 -61034 127737 -71402 58763 -50516 279341 224694 -227300 274353
18964 207233 -155661 223008 -39121 200775 62339 -27720 -201685 -282455 61365 -86508 -143887
18953 -143887 240064 57866 179787 43307 125594 -67868 -10212 6836 -49987 64225 83898
18942 83898 -86210 -76362 -18037 157867 -266816 131224 -300517 72170 324440 20382 -217823
18930 -38114 -82300 113298 -278529 -113994 -186793 -98413 396016 39755 -84656 -80245 -150627
18919 -150627 171117 -20237 114960 -24634 114377 -241843 -13236 15292 -476829 -64379
18908 -275354 180877 -321434 187423 -185386 -11953 -236817 -52218 12639 40237 148410
18898 148410 -13950 -170061 32242 -126897 4883 131098 -3086 -247583 -133997 -249322 -143804
18887 -143804 67196 -260251 -163664 -95677 -374942 8755 -206374 -20103 -234399 -276937 87221
18875 -218987 238363 -96668 -330561 -240073 -182899 -316776 -22847 -244568 23157 -121335
18864 -118389 78579 -72888 -156362 52734 532489 -211465 -192853 -121744 -73343 -157462 -121872
18853 -121872 244629 -235112 -266364 363857 168040 60035 -18963 -17344 -338156 184297
18842 -41150 29516 -85373 -89872 66024 -2247 -17014 49434 -291014 -138111 -58944 -245834
18831 -245834 -94173 -118624 -37909 45173 105426 -18090 -85504 174868 -184310 107332 -30102
18819 791 204862 269591 196205 -69029 -81745 -329264 63631 -149094 -89639 251159 50216
18807 31334 6907 277824 -57698 -15514 -124675 -138770 -167539 75499 16794 -47640 168427
18795 -42422 -124693 -57327 155454 48499 -136823 258172 -11310 -596385 -239845 -119282
18784 -111173 -337523 104801 -234411 32461 130835 -153447 109989 58502 81012 -125683
18773 -68775 -141086 28523 -279262 80755 78891 192805 8256 -107947 -304658 25311 -212631
18761 332804 45613 -372897 -39029 -120380 1462 -141552 173179 -145056 93735 105555 -213749
18749 51421 24292 -7273 58066 -372172 264290 5621 -112310 -300397 -363108 211559 16698
18737 -159283 149922 192187 -30735 381260 65082 -161771 -61229 -321997 -216599 -62316
18726 -36284 -58676 -250239 -116555 -199452 -84757 -372722 -137643 -72630 178343 80324 -67987
18714 -307964 -94710 -54860 201516 -257760 276376 -149237 33582 27631 -43207 -250461 -279561
18703 -279561 -86238 -289034 94523 -283661 -152343 77352 -79145 97712 -81427 -272435 -100409
18691 -409629 136253 -411362 -20849 -332797 -6277 -90691 -68655 -217850 -261569 28040 -62802
18679 -256185 -84529 117097 -393252 -103425 -72160 -287663 -36655 279174 196885 -166592
18668 -55510 119485 -273856 164666 106373 -114942 -107592 -234492 -122647 -269534 63926
18657 -121431 87013 113889 -283880 -58747 49944 -45034 -31108 117015 -154213 -5463 61684
18645 191410 126129 32446 41749 -34640 -258298 -170502 -91337 -141354 39403 -139019 134065
18633 -3677 -74826 -144686 -376024 -64042 11376 -139111 66024 237849 -200840 271230 -57920
18621 -78552 -189629 84051 337157 24077 -345874 -131127 111149 -62506 85778 56086 -74252
18609 216217 -132996 43864 22226 -45204 -85614 -55002 114511 -254492 -112385 -49984 -139229
18598 -139229 -160007 12396 -53841 -188664 67959 134001 -77279 -37706 -306065 -149115 -317273
18587 -317273 53664 27678 -32947 -143649 132406 -143560 34183 258587 125752 244453
18577 244453 167332 -111641 -53099 -60452 -10220 -22027 -271177 68861 90801 -323529 -351602
18566 -351602 -136540 -11615 -93825 -46307 -91802 -532548 -309847 30856 73964 45795 -90439
18554 152426 -94800 250072 235621 -199623 110168 238791 -225770 -78419 183576 -238412
18543 -114774 -166101 -169919 -126184 -43355 -40371 108344 115232 6423 -438747 -228805 55989 -427284
18530 192870 -26919 -142142 -262725 105920 -171956 -81748 -127144 -315389 33518 -67710
18519 111199 -281309 96196 131387 210431 -299358 -67566 -174510 -174877 47580 -222082 -258454
18508 -258454 3185 110696 -133104 -322274 -31740 -138545 99568 -149984 144458 -361216
18497 155604 -305710 54290 226679 70066 -70522 -168904 13353 -88801 -115687 152171 93797
18486 93797 -37078 -203274 -202897 1405 13680 -219770 262296 -69266 -94586 -124735 -108113 -287052
18474 -287052 -93505 -199233 11459 -75799 15748 201922 -278226 67904 -110400 -145974 -164286
18463 -164286 1938 -59536 27182 -223167 -184466 140465 -12502 -161662 242319 29151 -92409
18451 -162622 -176652 -98205 40355 112682 -465379 -1337 -95815 -150925 -71360 -51173 12459
18439 -195124 58356 -135715 -125824 62387 -53385 84912 -198031 184925 82279 -136939 -278147
18428 -278147 135046 -263505 199116 -155463 -241289 134753 -71701 -79940 -479904 -103165
18417 -2404 -29104 -5575 120629 -480439 -301150 -117220 -6356 -227475 -6653 -75574 12895
18405 -33635 388278 162731 61293 246995 -215822 -162201 -66478 7993 95261 -129003 -54943
18393 -170786 105177 -73486 -45979 -187628 75033 -246827 -197890 -290896 -220974 -129117 -130927
18382 -130927 167020 -57999 -205294 159868 -314613 -90217 76989 -16230 -31933 -149700
18372 -149700 -239956 -60053 226582 -13376 381228 100171 327755 -48092 63790 20458 -333967
18360 9850 -248100 158472 -3118 383312 39071 21384 -299003 -208791 58208 237799 -37813
18348 -359360 58304 15595 -107744 -192282 -59106 -323692 -100705 -153478 -85246 -97342 12649
18336 -291298 113239 -294941 -145307 -55100 -234655 -66283 -102496 341179 -75734 44405
18325 -15791 -40455 -184221 -130627 -2863 -23248 -138690 -116787 -104449 -247579 -51022 -28119
18314 -28119 131212 -119436 -274091 -128685 10247 64659 -45561 -155671 -208159 -29322 -169303
18303 -169303 -100141 -209502 36088 -61145 106969 258439 170641 -99970 -84410 156752 242403
18292 242403 36273 -241165 -84049 121587 -262852 -26592 -108426 -269156 -21282 -3357 -29080
18281 -29080 -244397 -140470 115084 -190970 -235751 -59049 -46850 181771 -60201 -65588 85794
18269 -88836 -147999 60613 -77803 89973 25913 42898 61924 -107541 -429731 110219 63519
18258 63519 -154450 146865 279871 290400 125140 -76876 -20135 -110876 182521 -184753
18247 -71788 -10664 32924 -294911 -185814 -176520 42235 -20203 -73405 138748 59403 229023
18236 229023 -188482 46763 -112019 -310315 -93605 -112835 -235062 185634 -37596 -215411
18226 -215411 123606 158909 9841 -94197 131813 131417 -19808 -121009 42812 -156715 -55722
18214 -712791 -246191 68077 -223705 65308 15902 1056 -281580 -294867 -77018 9092 -123004
18202 -252598 16449 -12494 -151020 -124403 196679 10475 -55973 -312067 78915 53312 177223
18191 177223 241450 177675 82268 89574 20897 -93810 -74897 259296 -219056 222833 -90275
18179 212588 113285 290423 65598 -97113 267814 -116538 94074 112978 -133234 60100 -53385
18167 -39551 -187052 226383 -51737 -132537 -3253 -59522 194458 -131573 -359507 88727 -68626
18155 -174597 -100535 -422949 -380314 -121509 413386 42926 -152464 -27067 243178 237429 -313193
18143 -83992 -224377 35658 1995 -58254 117078 -137796 -235444 -245939 170890 162956 -96811
18131 -92951 -123123 91468 -418466 -24076 38193 -212052 -194703 -300584 -32307 230907 114897
18119 45478 357643 62125 -30027 95040 -74996 -268533 253166 -80988 273463 131405 -137454
18107 -90220 -186352 -228650 25819 -363499 138190 -280699 -213379 -167957 -102201 -206930 -157190
18096 -157190 85642 -107637 -158725 57707 -56800 18064 3792 -325065 103579 6863 -134208
18084 207972 45836 45870 241740 -53104 94249 164260 -75141 -211829 -273346 -23979 40118 279216
18072 279216 247466 -368289 -44557 -292468 -28737 25350 -52768 140121 -98005 -108206 -38320
18060 42251 -34278 15249 90900 -173530 111162 -115623 295223 -50346 -52465 8833 -246093
18048 -170852 695 315598 249914 -141491 179681 -23056 238013 43237 -144078 -135156 -112800
18037 -112800 -238624 88388 -89453 -34889 301751 -30121 333963 388969 -92543 203552 -395635
18025 -79409 -24551 -258581 -60637 -96107 -51681 -175873 -98206 118909 89274 -26731 22657
18013 -38973 -16238 -227289 -77873 111596 -191837 216383 253240 -26706 -432968 29836 -124440
18001 39152 135386 -138276 -75243 119321 10595 -423084 -162584 -42855 152783 -101541
17990 168773 -47677 223244 -121665 -129879 -3135 -467243 -224232 -83906 -327248 174722 -166509
17978 88303 -50624 -82190 200171 -147697 -2837 387000 227990 175704 -11989 15694 -150113
17966 -5801 262297 -106067 64218 44748 -19028 84070 -211101 43312 -190253 1840 -112828
17954 -263323 336102 102127 322105 -242097 -352491 -104845 50605 -104174 -189545 36367
17943 91220 -367220 20447 -11006 -117078 -6727 -118038 104555 -434326 93629 276025 -163479
17931 58615 -338054 39804 78947 -232352 -79681 -24137 243826 -49963 65457 -216309 -14288
17919 -83491 293817 557 229010 -144980 108689 24719 278935 -253469 -186759 23935 -236128
17907 110757 -300271 43754 -26625 141184 70887 -112489 -1816 38216 177911 26250 -15348
17895 239577 172765 -271197 113698 -69800 -284639 106010 -50543 -46200 119717 18731 -129975
17883 -38837 34758 -100034 182770 207768 -123811 5289 321254 -74695 -49971 -187944 46032
17871 -51283 202828 88117 -49856 -223130 202882 -215990 -105913 26769 -280253 -62856
17860 -168912 99169 -109086 -253710 -30681 90654 47283 -98235 -22692 -159603 -216813 45682
17848 -231328 -237003 -88443 -132245 46654 -42338 90236 224118 -339967 -10425 121500 -158526
17836 -57932 154956 -179296 -48007 -70058 66464 -247427 -63656 26510 323700 -119231 204226
17824 99877 -272012 -78289 -133490 -9313 -262215 1197 -132804 148541 84250 -46645 181991
17812 126727 161613 -226433 -97688 -190918 -315115 -330194 -99274 -85456 15923 -149473 -255968
17801 -255968 -191045 314214 -57705 -2940 168418 -61589 -98528 -17870 -3319 52969 -33348
17789 30748 -131165 -70782 75755 -59263 -146836 8211 -304693 178671 -292141 -162401 71988
17777 357445 41374 -92690 205502 -37422 -67975 -302950 -48321 119966 13970 186862 -74812
17765 521500 39585 -61388 203257 107930 -27825 246815 233325 -2587 94589 22529 84783
17754 84783 39037 27053 -37386 -226865 229882 -17438 -164288 -172154 -68022 -352595 -202847
17743 -202847 20545 -333117 144304 -316859 -137980 127373 184827 -265823 -1403 -95912
17733 -95912 -220510 19302 165551 372871 63330 -27777 -309461 101243 -286129 56859
17722 -211606 246606 163214 230995 -187558 -275334 80167 -16280 -76102 65514 -271291 261617
17710 327873 49552 -42866 65975 139468 -93108 222386 256011 -191081 64302 -444650 -335452
17699 -335452 -138368 -370920 36453 399268 971 37182 68489 -183548 334997 -41567 -43652
17688 -43652 -87263 173078 -5279 -6111 -181076 -251630 -113789 -60000 -145319 -156690 -42396 -29527
17676 -29527 3249 131749 -63754 -145699 23444 -46911 156189 104044 -96314 355866 -134501
17664 -111565 172326 72894 -170564 67437 147965 -277869 119174 -164672 -182372 -187444 159170
17652 188127 -41255 58712 7367 185935 -22840 109563 84448 -224652 -171627 -24106 44654
17640 275355 251432 256624 118858 41200 -54166 -321261 -167164 193062 147626 20981 18070
17629 18070 50966 90281 244612 -15593 -112549 -68133 39332 -186933 -68779 -198201 -211328
17618 -211328 -244163 202482 62518 201325 -213192 91390 -192767 -5591 -282838 86132 228995
17607 228995 -141094 -153378 115709 -89148 -142586 -59306 -109454 202258 -47053 135862 168164
17596 168164 -41364 23858 -207116 219511 132271 -339 -298010 281169 -53567 20678 308029
17585 308029 176432 -28544 -365373 84032 7482 -185761 -123276 92963 -173622 67471 -214457
17573 65222 97794 -384898 -126631 322105 -214251 22300 101044 -63825 -330110 4508 226153
17562 226153 84246 11061 478060 47608 -132502 21118 -319290 149142 -75773 317322
17551 -96852 47786 -92893 23251 -87195 115711 -85687 92720 -237704 -115256 -360920 -289818
17540 -289818 16763 -40477 -231650 99395 61663 -120588 57154 173699 32753 97813 -72616
17528 -167620 -169668 32609 -116227 -18184 27821 91976 -88619 -125070 -92075 -147598 -26368
17516 -93599 352574 -80425 2241 275871 405194 -229985 40925 189278 -273513 -189658 27806
17504 132057 -111298 20574 114097 -85590 173136 225906 -110168 31000 373922 -53489 217495
17492 253473 56568 115346 -233652 265340 144147 284134 108657 94159 139162 80589
17482 80589 144082 107075 73066 180188 186397 20911 30771 318399 54601 -67814 -74648 169806
17469 171007 72042 79494 90059 101663 269036 40049 145985 228350 -244473 51890 470438
17458 470438 322831 -276339 -108712 165883 -208826 573290 83096 213136 246211 166348
17448 166348 172085 167101 154872 441172 319032 139488 -125985 223331 84229 163488 231008
17437 231008 286798 90703 401845 428136 142598 229822 105414 111359 308622 302555 302670
17426 302670 85437 66508 347624 117418 -60967 144668 254747 457566 483611 366333
17416 366333 132287 63190 137126 203408 368275 196530 7773 151869 4079 263300 141235
17405 141235 -41186 82789 203474 -43742 105973 110380 128566 -79346 190231 58991 -103197
17393 93711 378432 90897 -177523 44857 350870 176024 195470 -49861 218671 78791 209304
17382 209304 7539 171749 219018 -97121 93953 91777 199013 -95789 130138 82514 -77636
17370 -30257 -8696 103116 181794 -24825 125061 -64313 39723 496867 203060 8056 -163583
17358 39128 520646 472026 -162259 4029 316066 126216 160886 136071 -51941 88975 -233842
17346 -106096 336616 -28657 53701 -27744 157074 29503 218618 318517 83233 -42879 52282
17334 188924 60817 -10681 -128549 3760 -62116 50038 -32987 -34844 -8870 169336 65746 282495
17322 282495 -45566 540047 189049 219823 386964 -146780 122033 185056 106637 101993 -66325
17310 135309 203522 -43699 56499 123078 224617 93262 82148 -117169 28932 -91003 147685
17298 -96399 46934 344787 74863 239024 149612 218637 89201 85802 341534 164016 278223
17287 278223 -158203 137328 356222 228153 -313917 342091 245301 92411 332361 45512
17276 110265 457013 435132 45135 135696 -76266 40487 141893 163062 9467 142431 -16633
17264 11944 107920 250336 195920 244654 446247 125848 -80702 86521 -69222 50408 121619
17253 121619 64210 71162 349559 -29793 218281 496674 169060 102449 226456 -27939 52917
17241 602807 180996 249418 -81834 -138748 144590 114133 -85835 126454 3090 133508 68711
17230 68711 211121 89014 30875 199277 317891 268590 182658 194424 263062 460473 253379
17219 253379 330906 124658 -38514 513547 64889 -213728 387893 -270353 52689 -63072
17208 -147619 -60243 294143 355514 257257 500759 76819 -34860 187387 282456 306779 -104039
17196 -2575 208738 130113 284046 89738 130466 224536 178500 303847 252394 211456 452560
17185 452560 293452 17494 113104 163759 335726 82784 293608 336891 324413 289372 402877
17174 402877 348542 221080 353616 286865 415405 220994 527012 331077 -231468 201735
17163 -59263 -251716 159482 178431 399061 54826 58849 441662 401448 117806 211249 154637
17152 154637 420482 166525 456924 278816 95699 441349 351191 234552 222686 161258
17142 161258 77524 109893 232594 312850 321449 55162 371164 251646 269171 242790 81627
17130 308988 340322 374971 74036 257929 158311 422632 60547 416605 39224 206028 413262
17119 413262 259794 271306 362102 240842 402003 201433 418640 426781 40775 334910
17109 334910 304637 215345 75176 286023 288979 268693 383084 313576 382040 760535 244929
17097 167394 494887 95255 385273 349648 188369 327805 540117 320556 398192 63581
17086 68954 478123 267751 68559 269878 664701 520796 440232 618870 379383 476963
17076 476963 274321 407585 268371 267768 481506 246590 137992 105809 408319 321431
17066 321431 582657 616309 132243 581454 355782 247701 544772 516166 379195 551868
17056 551868 289148 257372 493557 525856 668958 297277 493038 395866 449237 370400
17046 370400 288757 156458 -155019 341678 699297 295756 548892 486838 620253 380442
17036 380442 282156 610767 198370 522160 450369 734549 101534 279188 661560 661437
17026 661437 499106 655228 760007 191284 582027 733375 459067 458591 901574 668697
17016 668697 624711 560951 882137 529073 837075 675383 652928 505508 508962 440507 270439
17005 270439 850231 705731 552185 617715 990457 825028 544849 548425 543167 732819
16995 732819 600538 835084 561370 455783 519120 479196 568026 587127 416148 741005
16985 741005 1175687 448165 538538 784188 523120 1191356 823416 851920 687114 796441
16975 796441 773460 858183 677236 1048825 819841 1025094 696651 574553 882166 753427
16965 753427 990743 994248 995775 1041973 1035984 906827 987396 512790 1119573 675334 808886
16954 808886 1021114 1166696 846584 588303 752008 1124428 994926 1141254 1197817 1114478
16944 1114478 801284 776538 986659 1015776 783894 1111424 1164174 1053053 735695 1199232
16934 1199232 1196591 898762 1098114 1054898 1012803 1158265 1185484 1142604 829110 1217582
16924 1217582 1023432 1135574 1271500 1088669 1469048 1274492 1635060 1337919 1167413
16915 1167413 1106969 1436698 1528898 1322068 1077597 1439739 1665803 1409865 1532191 1275254
16905 1275254 1524890 1741008 1363538 1608109 1342802 1539321 1646673 1724701 1302751 1457902
16895 1457902 1618131 1430056 1547206 1689221 1965574 1822060 1770952 1756793 1844087 2058151
16885 2058151 1904014 2005352 1888756 1801695 2111091 2133981 2105114 1677240 2224810 2007000
16875 2007000 2448881 2163492 2334892 2207436 2260541 2459753 2423521 2227646 2721731 2730668
16865 2730668 2583349 2497500 2404980 2411651 2547780 2763459 2239979 2356458 2503931 2743389
16855 2743389 2655570 2722814 2775026 3374835 2794663 3126085 2730292 2856739 3005735 3430248
16845 3430248 3263201 3196971 3394802 3176030 3433433 3343838 3264058 3401971 3593934 3568170
16835 3568170 3943854 3596506 3766385 3705937 3960982 4299216 4016790 4201302 4239375 4444625
16825 4444625 4456477 4587755 4500738 4663920 4532144 4549805 4922539 4786778 4962227 5252343
16815 5252343 5355124 5295494 5444107 5341046 5766356 5715531 6325269 6285298 6259649 6322434
16805 6322434 6634830 6978755 6489885 7233490 6889925 7404529 7435571 7348043 7699193 7960388
16795 7960388 8056152 8434771 8703383 8885805 9233619 9176819 9539609 9679283 10040016 10298394
16785 10298394 10496457 11007183 11305570 11424624 11881707 11993233 12601005 12848309 13451743
16776 13451743 13791841 14276323 14637013 15320052 15742127 16201819 16584591 17266726 17850966
16767 17850966 18505159 18953746 20198257 20542092 21531170 22106490 22869286 23680688 24898487
16758 24898487 26145264 27040679 28326191 29535133 30899346 32227529 33801908 35150009
16750 35150009 36957471 38724921 40903498 42734051 44889757 47215894 49922416 52733283
16742 52733283 55297870 58525134 62013372 65337331 69321766 73159168 77398251 82615977
16734 82615977 87284919 92419559 97938102 103621454 109828202 116003483 122143379 128758100
16726 128758100 135621550 142462341 148520969 154671043 159602251 164378187 168726959 171757889
16718 171757889 173605577 174597616 174145066 172785722 170408709 166645559 162170856 157279746
16710 157279746 151319157 145122511 138816611 131895851 125489470 118627486 112696353 106242297
16702 106242297 100194323 94482967 88773346 83640229 78602103 74457630 70290293 66122580
16694 66122580 62572025 58823653 55697439 52714397 49976646 47121133 44672964 42541327
16686 42541327 40144685 38584058 36612944 34730967 33156195 31733933 30149022 29059651
16678 29059651 27621811 26580423 25174685 24240351 23615651 22177701 21116733 20394813
16670 20394813 19830135 19080854 18686786 17758737 16911931 16300939 15813793 15292614 14665003
16661 14665003 14149464 13986315 13686875 12692824 12714761 12028397 11489307 11437646 11000161 10234239
16651 10234239 10325161 10304783 9966588 9388689 9294764 9064440 8761545 8485737 8315549 8412715
16641 8412715 7865933 7780569 7464402 7111900 6978879 6640756 6740505 6675299 6487495 6186832
16631 6186832 6259766 5812080 5785584 5665320 5838264 5463335 5178464 5246975 5126379 5018015
16621 5018015 4876755 4755153 4559490 4715068 4616469 4390068 4347015 4245634 4169336 3984291
16611 3984291 4162168 3787347 3905931 3488065 3522283 3604416 3452553 3518868 3444547 3492569
16601 3492569 3055187 3455665 2916501 3192891 2707764 3141495 2985534 2772195 3240544
16592 3240544 2647290 2727732 2593606 2592946 2465226 2692206 2473922 2265014 2524409 2215448
16582 2215448 2733853 2534310 2087398 2518565 2435004 2277283 2295874 2145027 2087808 2081858
16572 2081858 2338682 2030736 2233144 1856423 1836404 1822318 2286819 1733954 1667301 1766773
16562 1766773 1647012 1588325 1795906 1510425 1551346 1464072 1604581 1818037 1846846 1671047
16552 1671047 1551324 1452275 1670430 1303340 1456779 1506406 1575600 1478980 1476070 1383451 1448002
16541 1448002 1174428 1239916 1491532 1507243 1379046 1229249 1097071 1408592 1233591 1243857
16531 1243857 1045682 1278009 1068760 1360976 1204227 1024023 1175797 1173112 978402 1054481
16521 1054481 1042825 1237749 1180510 756983 1007089 1147617 1260007 1399614 1298643 990773
16511 990773 1186880 991737 1054161 969846 1175533 898433 884658 987202 771986 939490
16501 939490 976026 758145 821552 894263 683454 976624 838790 674682 723165 857048
16491 857048 1037668 701114 778755 733449 891471 829506 662043 716085 608019 389839
16481 389839 755719 948414 640470 636804 573460 667979 828667 644784 577223 695037
16471 695037 550177 750916 376628 243416 841716 671092 810214 376518 698640 519097
16461 519097 739265 479851 508914 529023 364805 591243 597438 749977 876913 398239
16450 453319 605661 476263 322287 669020 207915 242623 453076 818770 601139 896585
16440 896585 358933 455399 123840 145495 660525 413930 589791 672394 618715 325071
16430 325071 411217 498818 275162 271059 768447 310393 -117403 541917 21056 291959
16420 291959 419442 444359 362085 100391 337593 603278 564294 255751 -114776 285776
16409 225029 32008 219408 305364 211818 769930 233317 447628 183059 146227 476934
16399 476934 364645 359235 355518 470111 467633 76677 230049 299277 383973 322754 9653 360984
16387 360984 230378 348858 359756 282235 -14307 199828 81350 153746 114413 347975 19394
16375 212516 223898 131354 371026 291575 220110 195718 501641 439626 -89909 454950 419087
16364 419087 63476 -57520 386120 257197 316434 186718 478145 336136 500995 159012
16353 370672 277589 6086 140441 64734 25504 151707 192925 141174 119195 190171 528192
16342 528192 404052 167575 -34403 -90232 156487 438591 310024 -42450 268345 -102526
16331 237406 346423 400858 -65638 124272 80143 271197 14982 217871 19343 66254 264983
16320 264983 217734 -21815 33631 -72585 458670 167952 258095 -207473 496243 40370 -121153
16308 520134 252583 300428 242205 298828 149922 85172 -1320 57872 479814 64412 337702
16297 337702 219641 234 -14214 202996 177731 -180999 -34628 153288 487663 172237 140330
16286 140330 -23082 93873 294857 38975 182233 97309 252292 329512 -43269 209098 161873
16275 161873 114125 161636 212279 54804 47990 201270 230242 69340 161562 -19906 -194825
16264 -194825 -37592 156941 82599 -89039 312748 -67073 47141 96678 3943 111520 37442
16252 -101456 -189001 120559 -3294 176167 279353 164918 114769 54075 760 279513 125620
16240 143352 122063 389397 -274655 297539 211818 45605 177655 -27383 124636 332756
16230 332756 -50898 21825 -8821 -221872 -42370 202292 58514 -33902 136181 250808 -49771
16218 293781 50441 12802 116338 91874 65438 -93091 315850 -36655 283514 82170 70189
16207 70189 253980 137032 75017 -97630 -15388 -36072 -251730 281949 186436 25568 299663
16196 299663 214370 398272 423644 4316 408527 306780 183544 41178 -34476 499093 -263668
16184 -278923 -211419 -191255 175864 -190092 -11543 59861 138419 -385066 -1031 107034 -9069
16172 -101944 327846 257661 -100555 -32090 -58515 -24391 -218723 139898 -106991 189596
16161 323760 170980 -218104 256203 -82762 209002 -42061 211615 33877 334270 23836
16150 249820 -23382 143623 59930 102211 -25264 -10034 45407 35735 -209027 -268580 15528
16138 212671 -92413 -290999 -177373 -170930 215752 353198 -119981 60287 186567 -235053
16127 -106922 59604 206671 135363 -114334 -42815 469515 -170709 -131574 248821 -27171
16116 -213518 183150 117788 -384207 92337 -51992 -202057 -9581 -45432 -345096 204744 321132
16105 321132 101174 182276 14045 124112 117703 218710 202196 -57321 262509 -52429 101102
16093 -86395 -154488 -182889 -70283 -294474 -27903 -338315 116428 -410706 -26605 177561 -17743
16081 -8978 166656 137851 -83150 140496 -87892 43209 -126837 -228561 -89788 -28462 -322983
16070 -322983 35619 -13433 190181 -12390 -73649 79912 192237 153177 -174215 -89749 -203988
16059 -203988 102133 -180302 194675 83085 -17791 63223 -11634 153179 80883 199120
16049 199120 -400371 -4959 -233876 184021 233058 -246649 -21656 -58021 77699 191903 -206630
16037 -122007 -379350 -301442 58863 -203844 -118715 -28412 224015 -246472 99038 19994 -249396
16025 -65264 -258387 129301 -116482 -14964 2631 -40014 87180 55801 1525 -41440 66703
16013 270679 -275538 -77397 95089 -252370 -214695 -29659 129368 119321 -96791 126846 169731
16002 169731 -172070 -3441 -113145 -200123 -8365 -122510 131047 55090 -31325 138851 -157920
15990 -22643 -63507 -75390 46567 -188853 205679 170677 -358374 273637 259481 359962 255715
15979 255715 153919 285350 -145455 -276483 250595 -243920 445219 83851 -197834 10930
15968 -185544 -71416 45645 74413 109418 213781 5783 126035 141590 -228876 -161629 44726
15956 -225584 -259967 -154426 39494 -41648 256622 -260205 -248206 -461733 158097 -82620
15945 74512 -120231 19310 48807 -104744 304928 -41143 38791 168753 13104 231969 -165233
15933 -68339 -66824 -30341 8596 112982 14013 69853 -272069 -2440 -111592 -32474 -141786
15922 -141786 234064 115061 27607 -212133 -278131 -134571 -39136 213944 -13654 -177927
15912 -177927 -187028 -45581 58955 120927 -125068 -16563 -17395 -464623 -73362 -218940 -163309
15901 -163309 -21391 -259646 -144180 114859 -173851 183689 -9644 -244831 162923 -1190
15890 285968 -189760 -190827 261403 -2696 -183677 -145343 52164 19313 -166593 -231830 57181
15878 97715 -103065 -28663 460234 62381 16457 5309 -94347 -73553 -175680 59497 -6437
15866 23887 -259992 27430 -12107 -17193 63563 52316 -249195 31564 48008 -110517 -67649
15855 -67649 -338829 3999 268483 306275 -11272 -116238 120002 -175869 132528 137323 -61389
15843 -872 -236494 -321347 63279 12166 251584 86033 -265336 -164440 42066 42106 -40954 -40447
15831 -40447 -87993 357315 -117659 199590 -32392 -31559 18116 -302982 141742 -22545 19406
15819 285145 71311 141884 254149 -388328 57339 -4443 -15002 -15612 -61961 5357 203120 -79240
15806 -114371 564299 -64400 -79957 37789 150375 58041 -237055 -92742 -130337 -84991 103425
15794 60643 -388874 12622 -100239 287907 -197519 -12155 186102 8362 332873 -438924
15783 19916 -15438 37710 -254426 -94409 198608 -12939 -147135 -139944 9730 129464 408204
15772 408204 -35830 51459 -192190 -213986 -370429 -210836 -124058 68557 -195763 -66545 106978
15760 72611 48233 -66149 87032 155535 20186 104251 -370719 -91856 -183403 -28584 72294
15748 2940 118386 108158 167837 320327 -76244 78320 -118649 -15718 3452 -104980 -167038
15737 -167038 -13210 -242652 293903 -40671 14659 -100709 -158339 37848 -139402 125187
15726 -272449 -227774 -29798 -219312 -83994 -77356 -174132 -50908 126559 -365765 -14046 79048
15714 -333138 158048 64524 -491231 7365 63120 96567 -69753 33840 -84990 -14197 -250867
15703 -250867 103546 47823 -22580 69045 -99634 413639 -407733 -142686 4193 123627 122145
15692 122145 -122617 50665 90781 -142006 85863 20327 514011 122056 63360 -354939
15681 188242 65553 -46170 -325009 -3907 -97344 304092 179896 -34380 -79455 42738 -144979
15669 -405204 -1317 126693 41682 -33002 -138869 -368868 -110109 -104635 95923 229953 -377118
15657 -250925 42536 47271 -120103 -64027 -156914 86751 53938 -13618 -92958 13612 -175275
15645 71686 417480 -220959 107330 -317854 321244 170987 -41569 162975 -114619 -125655
15635 -125655 76295 -283507 -100208 98783 60725 -128022 42884 -61950 -39640 -396870 -96986
15623 131350 44968 38153 -25293 1309 18042 -63201 -58551 -49300 307436 269268 295039 -211412
15610 382678 65353 -251349 76781 88926 -264913 -26148 70656 108828 192894 73170 409241
15599 409241 111670 95205 -336730 -36372 59252 89505 -133805 -432273 -255258 -20518
15588 -165250 49740 85929 -49222 -268106 199837 -76487 -33593 -16596 -357849 12026 -252400
15576 -213012 108682 -232644 -19038 -428163 222360 137493 403038 -23233 162563 -199462
15565 -16726 38424 127739 -10144 82342 114065 -176299 -92818 -33330 -136069 -11712 -188002
15554 -188002 218624 29253 -184078 -58234 -91026 256112 135495 -214471 -34028 -235902
15544 -235902 17611 -31096 -151731 -215835 303527 -137012 -85164 -9600 -112797 -6518 -34993
15533 -34993 73059 -98392 -20835 -240418 -357398 -66416 167436 28481 225567 324352 -108353
15521 -134807 -176057 -283032 -313000 115558 149534 200654 -350341 348530 -5470 -69127 176538
15509 21076 260158 -217520 178972 -21346 -27594 43963 -316667 -142550 -113524 -143722 -240503
15498 -240503 -2258 132294 -40945 -327280 -96294 67380 83290 -21570 20979 264402 -236712
15486 86483 -1551 -91817 125531 -197305 -148669 257584 158392 -54840 -46608 -176660 174532
15474 -1242 45753 22142 -23774 87575 71357 34821 -180951 130482 61042 -150517 151660
15462 37848 11036 24015 103085 -237728 78072 -359847 -153020 -44586 20103 -312003 -116131
15450 1592 116514 107191 212890 133032 -83334 177578 -372696 -321903 -502509 -93492 -127045
15439 -127045 50330 -31608 -339516 -254063 25649 -59588 56616 59324 -33818 -214997 -301790
15428 -301790 -145817 364513 -84734 120673 -284823 -11274 -146526 25104 134821 68553
15418 68553 215021 186953 -214215 169294 -157587 -123335 11388 192375 64172 -160103
15407 33088 175891 -367889 180879 180915 -54032 84026 106708 84673 -132516 -320255 -136949
15395 121499 -80886 -241625 116298 -101868 -22283 -2651 -161930 -22046 -253471 16802 254657
15384 254657 -46193 29121 -9296 -202153 -376290 78324 161647 63398 -130284 25908 -326471
15372 147702 251240 -320075 134362 -115480 123471 61079 -293989 -12754 29560 89496
15362 89496 -187666 -70497 -69517 -96565 318343 -40066 -288141 -4145 118560 35124 108694
15351 108694 -354390 -87550 95475 88957 -32877 264067 -139300 -71266 45019 242291 270914
15340 270914 -25461 -224180 51372 -28245 338116 -143385 130688 33281 114314 -249817
15329 -172856 -6333 101096 -221604 22341 -61469 -98962 211494 120407 114571 237930 -305761
15317 60562 -17332 149974 215272 271387 70796 144996 -53891 429583 -113900 257537 -221699
15305 -206096 258973 -51002 -10654 48603 -38074 58346 -187972 -103685 65343 -221344 101583
15293 -276959 -115094 -124866 16317 -74399 -217298 -73786 -193663 -150123 196018 35825 -101976
15281 -57105 53328 67950 76139 54059 -25304 47376 -205191 -116795 47571 93182 164633 288194
15269 288194 18674 224558 -113042 284579 328199 255947 180916 180617 56575 99165 163694
15258 163694 -167130 86852 115226 -361024 18476 297511 46076 214356 151368 291037
15248 291037 906640 1086008 911856 1308637 831036 414874 -64619 -2610 271001 73253
15237 301243 -15045 -30253 -124423 138315 61423 -55704 54775 99621 -45176 -195364 263240
15225 98321 192608 53689 108429 79218 -134299 -32991 -142755 -40756 -102299 564584 -108584
15213 225102 74746 269392 118640 -180136 -158113 87232 222641 133230 205224 61150 13890
15201 14627 -40781 206263 158387 128269 180209 43774 109024 304332 301922 62773 -142041
15189 292330 -362036 98388 43929 76738 152073 278629 -135065 163833 -48302 83763 -210589
15177 -504303 -41287 -185524 -188923 250831 -67517 27739 289037 236110 108531 -128288 9922
15165 -65302 53925 108206 -148559 -94224 41470 88892 -63988 403754 14042 13908 -23256 3360
15152 -90021 -103363 342189 151146 -197008 52216 131284 386375 -166239 81801 4617 65436
15141 65436 149592 5281 -256410 60082 -120114 20623 -49327 160628 77113 109710 -14413
15129 -239612 113676 79651 150792 91106 -18761 -12491 262961 109976 248761 298707 81547
15117 -85787 -313477 140160 167933 -71328 204601 134039 86600 -138683 72884 2147 153253
15106 153253 9088 120289 218604 271858 61711 -9358 210375 277141 28628 126057 333133
15095 333133 144149 58624 15409 -137516 155700 104235 222889 35612 -70616 -167426 -72047
15083 112191 71000 -237099 -46632 35619 -32432 166441 -39531 -236667 6027 -21838 -23373
15072 -23373 144885 240852 84049 -93293 -66485 -76784 172399 129172 50476 275095 144745
15061 144745 -24355 179769 -61678 -28215 -60034 -28862 148689 -13304 -13016 248935 124628
15050 124628 349270 -115732 -528926 183920 273308 169486 332019 -277492 254958 222250
15040 222250 36385 -73602 -110317 82417 403260 500474 454151 378352 176395 139321 237965
15029 237965 -199902 27452 -143871 -71194 332115 133862 280235 159940 324855 308418
15019 308418 166656 -9804 336487 59864 247108 93148 85376 342922 -151168 -73307 394886
15007 205635 -12677 -39963 -93586 269264 230488 292914 53843 -126561 345593 208092 251911
14996 251911 151157 195762 465853 -94648 -42139 210068 182448 317456 170115 329478
14986 329478 -21333 174878 192111 478009 217419 -22319 55904 68953 365716 189048
14976 189048 -10157 465792 238161 349431 -89717 46275 28417 -61119 263870 54423 56745
14965 56745 223571 249724 46981 201064 304385 245274 152418 191060 247552 101743 343987
14954 343987 222677 253477 157479 336552 22383 173671 243687 172084 -103155 268889
14943 241237 483272 351243 117464 345508 246174 256781 110152 122363 188523 462154
14933 462154 90387 333675 297550 440363 399659 99624 282398 282407 272787 66367 294676 352629
14921 352629 -30316 190358 49236 93745 30943 -754 309946 176856 351891 577802 116434
14909 105858 314356 320831 331613 93749 220879 -74891 424579 52737 185078 -48792 236632
14897 121294 200080 -4302 180257 -36094 278097 140714 22908 164438 66680 385239 483637
14886 483637 284991 516065 383557 38070 320439 488958 415632 305085 304255 89711 450655
14875 450655 350606 249037 13015 392130 370960 347008 176735 -99218 332917 162799
14864 191163 261838 101375 529513 -195103 390091 345429 127324 247424 300314 332576
14854 332576 387713 340494 298197 456619 238516 213953 356261 419374 268012 304384 476931
14843 476931 119037 442218 398730 303337 296001 129571 442768 237812 620797 522264
14833 522264 515940 427682 432594 587929 274734 939611 361273 675257 130110 617681
14823 617681 537962 170394 469936 242527 444716 406576 67341 393191 408451 149607
14812 300489 451074 57027 509122 730447 476086 320706 41771 232270 247598 986643
14802 986643 587369 424624 558698 482611 562201 720675 369799 421455 376615 391030
14792 391030 629344 686281 419430 482376 335313 642642 462152 -10717 549121 319166
14782 319166 600183 359357 641568 490403 695632 466062 222916 468440 596678 656816
14772 656816 285165 531069 298621 373114 316756 637654 757630 246576 533669 827009
14762 827009 637611 307526 554887 510518 495007 674279 673623 291874 277674 614455 725138
14751 725138 520973 282826 338169 496534 722755 697327 461377 549997 673983 769705
14741 769705 835841 547130 621851 488833 345642 674187 608121 397048 690524 495405
14731 495405 670269 662170 426605 807195 710778 413330 582640 594030 260338 608472
14721 608472 712224 621934 568610 569926 390982 657503 700065 543763 755002 570438
14711 570438 521556 656373 795321 639725 554736 922761 724169 575948 430641 326217
14701 326217 837202 740665 610257 513603 799768 933616 1012460 470659 661681 942628
14691 942628 641955 1036700 649210 527951 275441 696498 706937 1225776 656005 990769
14681 990769 1157590 509572 359467 731900 875229 898425 686972 595600 588516 859489
14671 859489 781531 374282 628679 878767 971585 963994 935080 1129632 733007 907220
14661 907220 980823 988927 839776 703625 898769 927015 1010141 1100611 986224 839560 761332
14650 761332 1066339 662564 1210149 1132204 884883 754780 1008206 944475 788541 1165101
14640 1165101 1004134 884760 1246715 1067691 857181 1241098 1036263 1073566 907865 1162977
14630 1162977 874781 1053292 984168 1144668 1489102 895536 808925 872322 1382051 1257431
14620 1257431 923101 1125681 1329342 1139176 1183800 1244650 952428 1327049 1198800 929314
14610 929314 1083303 1168570 1116362 1205157 1011556 1600733 1385863 1474569 1254921 1049073
14600 1049073 1504807 1015028 1467758 1511445 1343629 1604319 1559351 1441239 1521242 1335773
14590 1335773 1565739 1484430 1612158 1513259 1585118 1371481 1565046 1647794 1800605 1534063
14580 1534063 1303545 1654543 1761546 1767916 1633551 1597321 1682633 1825281 1695692 1626148
14570 1626148 1892527 1900233 1663531 1861139 1827680 1757257 2184937 2222518 1796166 1721448
14560 1721448 2246809 2307028 2323622 2305232 2495120 2861640 2583596 3379105 3784311 4020853
14550 4020853 4833528 5691956 9591397 18157577 40780065 41112506 19725593 8067237
14541 3679345 2326231 1747867 1395567 1485110 1622748 1488557 1866293 2145235 1768134
14532 1768134 1967845 1692088 1896401 1622695 1654096 1763916 1645132 1810034 1930977 2057809
14522 2057809 2164342 1916509 2180817 2563036 2192305 2108792 2223261 1984245 2463019 2147510
14512 2147510 2249916 2103844 2376017 2311231 2247407 2213207 2233357 2388526 2564549 2132851
14502 2132851 2460508 2360151 2672608 2326373 2451830 2626617 2613443 2822804 3072122 2536546
14492 2536546 2907562 3068721 3230269 2631309 3025725 3044894 2895873 3271444 2906535 2950373
14482 2950373 2567271 3196841 2879955 3369885 3234485 3556203 3201519 3425461 3447244 3627914
14472 3627914 3694288 3516545 3452842 3682802 3609662 3815984 3851807 3805201 4072854 3838924
14462 3838924 3791091 4048275 3819564 3730651 4327117 3930527 4281650 4261551 4178140 4516490
14452 4516490 4456809 4810613 4476893 4881547 4756391 4514828 4769169 5071129 4941337 5113055
14442 5113055 4958312 5166720 4913310 5504562 4980052 5473626 5637538 5435774 5176822
14433 5176822 5922525 5381872 5825414 5938381 5867803 5810902 5961232 6382233 6140655 6220789
14423 6220789 6251301 6854755 6554545 6763294 6874875 6951682 7089358 7164233 7434613 7300946
14413 7300946 7410768 7733348 7396895 7848514 7576073 7898674 8171873 8511208 8065735
14404 8065735 8482648 8314339 8623638 8501621 8892427 9005144 9250332 9248125 9489821 9390688
14394 9390688 9667797 10219362 10224006 10375806 10186300 10576621 10749280 10994223 11220315 11274838
14384 11274838 11872900 11922116 11972276 12519630 12329324 12697659 12892108 13261616 13512645 13849294
14374 13849294 13906917 14249428 14483796 14437956 15068123 15046462 15748411 16121635 16370253 16664439
14364 16664439 17030412 17340250 17890722 18013982 18748990 19227476 19212592 19787010 20761831
14355 20761831 20836420 21195832 21480624 22378907 22704104 23537279 23771617 24342365 25123675
14346 25123675 25619778 26585464 26925804 28031101 28276858 29431218 30339987 30901026 32032009
14337 32032009 32923299 33650519 34819964 35661395 36955586 37646529 39332215 40137706 41864602
14328 41864602 43078905 44192091 45507918 47372313 49016683 50704556 52327066 54177444
14320 54177444 56425691 58111723 60399229 62696960 64966710 67583108 70975854 73320499
14312 73320499 76045076 79653058 82699139 85921810 90114628 94382802 98483366 102813004
14304 102813004 107655487 112662269 118587243 124075788 130479129 136953385 143791185 151331036
14296 151331036 159340744 167459192 176810626 186406347 196794286 208126528 219423096
14289 219423096 231640420 244513955 258059088 271999249 286921086 302338083 317688554
14282 317688554 333803657 349544192 365519121 381137789 395591649 409285170 422309629
14275 422309629 433292229 442587658 449013282 450509442 450125427 448635186 445969954 441074082
14267 441074082 434677792 428028293 418388899 406552725 393512438 378506386 362768316
14260 362768316 346568820 329884557 313605464 297796590 282494850 267887835 254538823
14253 254538823 240946873 228202566 216201573 204542900 194105488 183767749 174531018
14246 174531018 165305874 157005997 149614596 141989119 134889783 128172907 122269909 116778953
14238 116778953 111637091 106402389 101835954 97405944 93014533 88923351 85346800 82315286
14230 82315286 78731764 75195426 72655608 69983126 66785035 64543216 61786374 59252755
14222 59252755 57472909 55699215 54135690 52145650 49789852 48475361 46583462 44892987
14214 44892987 44038545 42636140 41135260 39802659 38975441 37644076 36595980 35974934
14206 35974934 35070339 33410411 32712746 31517120 30702316 30306252 29530546 28674170 27928287
14197 27928287 26794395 26009699 25674637 25153165 24696505 23750709 23253752 22484718 22042296
14188 22042296 21634843 21103803 20156871 20189350 19851240 19373770 19081080 18475881 17906939
14179 17906939 17511791 17544775 16959526 16797020 16494104 16323243 15757093 15569426 15022698
14170 15022698 14626925 14559884 14498455 13929475 13621104 13189058 13419693 12916706 12406000 12245134
14160 12245134 12029489 11981457 11942905 11630826 11449382 11138464 10895912 11053367 10764206 10578465
14150 10578465 10409562 10023880 9869036 9506859 9611617 9174436 9354822 9403615 8987577
14141 8987577 8750609 8638877 8851284 8838919 8589583 8072055 8185138 8242903 8113368 7906389
14131 7906389 7789220 7556391 7278417 7208320 7380243 7157483 6792806 7142917 6874326 7084119
14121 7084119 6816075 6554538 6517362 6276679 6359505 6270775 5999075 5961661 5820762 6061009
14111 6061009 5811130 5971886 5758150 5736573 5521624 5467548 5478885 5192420 5586909 5486599
14101 5486599 5085525 5093480 4773793 5165997 5042622 5089457 4836546 4940154 4909923 4901671
14091 4901671 4584304 4726871 4382958 4510236 4489579 4417443 4375470 4382375 4656869 4310827
14081 4310827 4157379 3945250 4131010 4133744 4013632 3902134 3768397 3923506 3840668 3570811
14071 3570811 3599610 4067144 3654161 3662919 3692170 3843504 3625007 3460422 3199962 3379729
14061 3379729 3413757 3362483 3299958 3668627 3430189 3565095 2907248 2944411 3528139 3028705
14051 3028705 3101520 3397093 2988061 3057597 2896586 3071926 2819802 2759687 2658714 2412331
14041 2412331 3102092 2700999 2756914 2375543 2809242 2784266 2767383 2830466 2751412 2947711
14031 2947711 2852496 2777659 2692622 2775196 2691208 2693503 2386765 2566844 2431801 2476166 2606095
14020 2606095 2174819 2185976 2126904 2228387 2366633 2411328 2180455 2291692 2402463 2034037
14010 2034037 2337446 2292598 2021399 1908959 2259690 2063809 2150462 1796496 1992388 1739038
14000 1739038 1631163 1523373 1899694 1783760 1961428 1451981 1596756 2018314 1810836
13991 1810836 2227011 2395227 2630329 5080741 11593402 32291866 44446646 23186792
13983 23186792 11521663 7345018 5147933 3532989 3215681 2852132 2789998 2860347 2838256
13974 2838256 2788334 2758538 2333013 2055082 2003360 2116461 2040316 2022057 2134612 2057925
13964 2057925 2089295 1659391 1984689 1588066 1900551 1967048 2093901 1701498 1603691 1997629
13954 1997629 1859725 1846953 2055024 1377854 1662935 1708455 1146485 1749171 1394827 1686865
13944 1686865 1485363 1527452 1881266 1637603 1872377 1661110 1357391 1726220 1223850 1573279
13934 1573279 1615418 1630090 1391030 1293302 1323657 1343439 1256338 1359002 1457651 1524470 1618697
13923 1618697 1161888 1625981 1381515 1461859 1386204 1444659 1011982 1434171 1325324 1471070
13913 1471070 1152558 886212 1098075 1222244 1201250 1428076 1304878 945338 1113184 1240670
13903 1240670 1339896 1103876 1173807 1454731 1329518 1479482 1398898 1266210 1279902 1363540
13893 1363540 1024623 1106610 1105144 1050951 1420192 1126113 1108243 1213732 949018 1043400
13883 1043400 904771 1026845 1182407 854360 1313628 1191684 1224290 1398319 1224127 904009
13873 904009 1036629 933485 1257456 1135097 865392 918998 864805 835302 496278 1065826
13863 1065826 962362 683265 650579 793621 1026826 865845 924010 984566 921602 935499
13853 935499 923626 674479 805758 969685 1059353 987050 785588 1026711 1190992 751286
13843 751286 804122 1027762 928532 704065 1007596 885070 717926 787373 912440 703552
13833 703552 960432 583133 967772 883579 913481 750423 774614 923160 625671 712462
13823 712462 1061692 548114 773606 507940 811605 855611 941344 489424 610599 407087
13813 407087 668605 663251 753626 720464 567618 770820 389830 824958 886933 762162
13803 762162 1170454 985403 809504 735552 706493 912336 750647 736432 659114 449826
13793 449826 535096 759965 969404 530582 752126 524784 610649 490932 637672 462770
13783 462770 508213 645605 576872 447075 614518 710168 229133 813984 771208 496305
13773 496305 568534 623458 409619 561528 346746 474583 413183 880474 751441 444535
13763 444535 475046 671855 614084 558988 376722 474395 561593 474206 335426 885151 485591
13752 485591 412939 678286 560311 557228 573867 402481 432337 632710 573996 468121 683226
13741 683226 412346 476127 589782 590323 408526 419975 647522 680254 494900 442122 459636
13730 459636 818028 737593 642258 623613 687346 347611 765823 432800 523427 217195
13719 527695 469753 618971 270402 425696 578798 535009 224276 281361 344182 233859
13709 233859 530496 591850 558129 480858 560694 370891 601067 565928 424494 201001
13698 613005 425511 530084 294211 680553 329743 424405 526398 457291 634521 586150
13688 586150 250207 464872 451200 550834 269267 451059 41443 527733 437323 543934
13678 543934 551032 248835 698585 562197 365490 609872 728626 209599 496852 515346
13668 515346 364802 260194 227217 325782 378980 275250 593611 322584 226955 467011
13658 467011 515663 323637 405846 181618 316362 537193 282843 398986 196998 453928
13648 453928 285432 306665 366774 374434 468339 503396 317646 264462 349166 289733 358881
13637 358881 398658 384565 377260 384413 215279 241165 381123 298120 481734 289662 305457
13626 305457 394104 466034 330334 501255 525332 345450 388378 38785 325411 428266
13616 428266 416002 245108 114378 530148 62628 257792 546350 340596 544855 430654
13606 430654 592462 346144 361837 21974 151524 135130 540230 286311 618794 505001
13596 505001 253545 163695 554384 281398 403136 346359 195039 253440 505658 -27334
13585 251088 206855 32541 346944 319296 430532 148566 206720 556980 189322 206370
13575 206370 36355 143065 148293 115790 425792 272553 254303 695719 121861 218236 279353
13564 279353 16321 316581 687298 283312 362266 377912 151309 471346 85103 460387
13554 460387 167096 -186732 400733 81255 71795 216984 57469 204644 357646 39200
13543 235850 38705 218522 153812 429841 89713 227659 499711 400520 125076 271337
13533 271337 293205 194926 374090 -19837 464635 231449 417229 283134 355654 382248
13523 382248 191100 669870 271987 232046 553719 -80615 303800 216772 202814 275325
13513 275325 159443 485243 266870 104074 299317 19328 278269 131577 116578 186261
13503 186261 -133911 431602 346384 420528 332203 65853 442319 312772 358513 376 221463
13492 221463 232879 183496 336458 168396 139442 300414 310843 223144 -14046 518780 249232
13480 281580 199251 424517 331691 205013 103299 395396 256006 200412 312500 238950
13470 238950 71961 84780 84648 418862 8273 309487 295424 76444 508169 310812 -108136
13458 -16825 119414 107483 147239 373406 294972 120951 272753 220739 138013 -84216 97038
13446 141239 141192 124649 107297 65220 155830 343797 17922 546989 271650 -25747 15815
13434 5155 174493 132030 114110 49038 -75327 47103 -136958 67409 89125 129667 351571
13423 351571 110688 47250 443783 110836 202495 267523 287777 336491 201935 185353 465935
13412 465935 346613 121065 151534 93287 71971 233331 57519 -30052 51547 297091 211765
13401 211765 466836 -82756 95794 706618 259222 122057 240295 268413 125593 268459
13391 268459 158394 246389 481059 102540 257032 -108695 247340 91590 407377 160278
13380 79248 513166 151347 334020 196467 166527 282405 216519 251546 105412 343152
13370 343152 -77983 152531 589772 201193 404790 345015 73996 -289044 532099 418766
13360 418766 -14781 323790 106668 188520 -56213 314119 207681 176564 109794 278138
13350 278138 -58496 87717 409046 109605 276177 165352 490516 482380 64077 377319
13340 377319 -8468 211988 3801 175465 287065 60930 294141 67444 215362 -3239 248985
13328 424262 87168 403551 172208 359611 -104622 135387 353205 193407 13898 104886
13318 104886 28753 285443 243444 260758 495534 188797 130666 39271 -57573 171535 430397
13307 430397 190866 42320 169808 317226 -183900 116700 232692 980 170405 138962
13297 138962 98007 150298 328552 285277 270130 -23302 40174 153238 192765 179746 101439
13286 101439 108069 86873 191296 148973 196283 25491 145706 213343 228590 289624 5018
13274 -10711 246733 -186125 305899 273968 86735 16209 -296114 97058 149709 113061 -83156
13262 303340 98279 -64942 -41269 272338 228021 -4662 243068 162216 230551 404426 15438
13250 139942 -213253 -136245 309584 190187 -226774 -128325 146132 2451 81514 -61113 -6991
13238 72240 -143752 158770 -91706 76667 244833 113074 27690 -101158 231257 -113000
13227 -16444 135618 -56429 28516 316294 -54575 41119 158222 106944 66638 246529 -100890
13215 136574 121131 240189 139220 -49516 -12601 3609 289056 343170 84080 -25666 158984
13203 42505 154131 148615 236498 -190749 127732 126887 172862 -36011 249117 6877 202704
13192 202704 215145 164165 -42446 37113 71657 -71432 -188550 192960 -4234 -114776 -189774
13181 -189774 39690 55072 -59950 -34137 -74453 142334 75461 365084 -194922 189327 24621
13169 100488 26268 -127575 176704 -183550 54990 -14787 128054 332313 -406165 220589
13158 -78356 53953 21483 -92304 -42770 64657 -45131 427324 94145 62399 -24172 10183
13146 190783 3167 -68130 -5900 347147 69203 119063 125074 -66092 253154 286416 83693 272937
13134 272937 -135160 302050 168677 338171 18311 204683 -66813 -76547 230859 266579
13124 266579 268398 -184293 213488 193814 94190 -185832 20914 -23952 362726 -46788 194517
13112 127428 112376 98380 -140503 -36063 121520 165406 58750 244668 57352 -86240 199167
13100 -126162 299864 -146943 -96445 503337 359507 95 260566 131332 -285148 75971 204718
13089 204718 -7390 289653 6693 267112 80167 122507 193921 77547 99471 -171412 -239599
13078 -239599 59599 149589 95453 1576 -188010 84357 439758 117269 82278 -157551 93193
13066 -92764 -28167 28605 -97006 17389 -100306 176913 199154 184687 212774 -51417 76697
13054 -130493 35682 -222000 169598 115931 119874 54649 13411 74564 -213955 -268920 420237
13042 -20760 -12610 130051 104370 18058 241467 -55898 -70419 -59694 -71979 -182971 45263
13030 195300 82478 -32788 213097 -91090 19954 343158 -83514 -38040 346835 -133687 218629
13018 305526 363699 -258763 31772 158523 26266 -122776 145011 150533 64641 -167541 144950
13006 115820 155873 74378 -64240 269873 162714 42114 313720 146321 282452 43785
12995 234086 69543 332661 -24294 27011 122008 220434 218322 195555 -127585 200033 -5628
12983 21480 -260780 60956 -74244 -247739 -115976 -314964 80484 -9063 309410 88478 243310
12972 243310 -213795 81840 236353 296106 -212578 119406 -156928 252165 -210134 155523
12961 -5266 345009 -205916 -14351 54747 83344 224304 -69883 -146324 383808 -54656 60897
12949 126174 -62749 171861 218416 -1301 73771 -261256 47164 82876 62986 41670 -234138
12937 93383 -70947 -180116 -143719 -80307 241163 30190 -182792 85939 -67712 315159 79960
12925 -58741 7137 78850 70031 -39899 -148250 -267767 64563 1012 8728 -206598 -884 264646
12912 -85984 260775 202179 108603 240727 132400 136079 -283020 89576 -41110 26928 60792
12901 60792 257063 314753 152328 -78980 338171 -7368 138748 13699 -170435 67110 -15083
12889 -119529 132326 -56685 418289 7387 41704 167987 -28509 -647 -163886 -150549 28874
12877 165706 -67757 218336 17576 -78796 116886 -189011 102415 88376 -121252 95561
12866 -117860 -169324 -411330 36157 232234 347458 -141436 142983 -67428 91653 132118
12856 132118 -10759 -39074 -95842 -22936 100378 -169094 -23442 -133790 -23471 576 212869
12845 212869 -246378 155629 204304 -129454 75126 120062 323652 180701 6274 179221
12835 179221 190103 -87803 156858 -295095 -127223 54667 58862 544766 -94759 -38950 -424837
12824 -424837 -252047 -106408 87786 154647 -158986 -12458 -94883 -97095 394172 -196338 -241946
12813 -241946 209233 313952 -17416 -26277 -5569 -39477 -6394 -15028 201354 444396 -18659
12801 -322586 -274981 -75890 10354 116866 181471 16518 -165789 -45918 268863 201197 -88195
12789 161103 -51166 12786 406439 88994 -9652 138412 -150736 -236679 184728 161771 -85825
12777 141256 -106497 -178783 -35277 125136 -75969 -110822 36702 96048 -155577 41602 167250
12766 167250 49439 178558 -90642 61846 82673 99250 340676 14621 52060 -173793 168055
12754 -378966 252188 143391 316441 420580 31912 140824 -28389 155270 -44461 -55014
12744 -55014 -273041 58967 -38574 57549 -145580 127442 -68809 139115 192306 -45046 106182
12732 76384 98477 -38319 -209376 159922 111012 -209021 190682 7743 -18860 -59669 29463
12720 116926 83896 250827 -7716 -107898 61803 46188 24029 136152 58867 43265 424898
12709 424898 154377 430830 104345 358641 67670 45367 285181 -92375 -177945 273532
12698 -76204 288743 -78145 142310 104537 -166718 291880 19107 82104 265090 32553 239351
12687 239351 34365 -49236 -126764 103585 -171286 -55646 205237 64838 573159 192468
12676 -36809 -17133 25777 -145364 6347 -152611 147697 9305 189082 132869 -3150 -134479
12665 -134479 -195733 -166145 202360 129720 153472 -215182 123819 209610 -201010 109964
12654 225395 -68743 93885 -42094 176819 138544 -8710 94113 -24791 -8488 186020 85119
12642 -41951 214570 39895 150434 367690 -29569 5014 127892 -48134 70784 114153 -45422
12630 427589 -108721 262449 505008 28883 192378 -122167 211905 300771 280452 150924
12620 150924 90698 232324 215449 38411 -284761 218260 172902 107675 169284 -117025 -243940
12609 -243940 432884 192153 426992 368122 3409 81131 117434 -84221 381967 -122570 383886
12597 -3957 122199 141219 246856 -48907 196125 26532 -42427 -7990 218429 323481 170183
12586 170183 339017 56362 -259716 11678 -58195 128668 -88338 -30631 221836 102132
12575 69159 119978 92827 361267 -235192 -136984 105961 53325 199922 -119677 -171815 16764
12563 -109373 -167089 -24357 -6645 95825 93562 288545 -56532 7970 -266480 316477 -470823
12551 -12763 -60870 -17833 -212942 21870 -55113 -96922 -353522 351024 33681 308824 -221430
12539 38614 -117540 42900 -305452 -169459 18772 233804 277919 41561 88144 211571 -59567
12527 -81224 -114975 -35840 -68632 -168839 241682 179164 -117996 -370956 -12291 -115811 -251840
12516 -251840 -201143 -61574 34083 102941 146619 220642 141490 132143 129536 103712 172481 285079
12504 285079 410106 -40849 92381 -23693 141105 44527 170123 -168514 11835 296252
12494 296252 -130595 65935 211889 90752 -17007 22974 70599 3558 329578 -198218 92956
12482 -297402 -121810 117156 -120655 -48149 -111435 -252318 -231010 -182614 -80998 -212685
12472 -212685 40157 -35290 108983 -86455 -254196 222236 -39157 60665 73090 -99712 -6373
12460 128064 -101275 200455 -212085 61166 172826 150693 -233167 -304489 50595 30905
12450 30905 -171061 30244 -108518 126183 -129523 -240523 270873 28513 114208 -52598
12439 -64033 -380221 27053 92638 -229421 226375 184869 132779 239522 109248 6026 224343
12428 224343 -38093 172781 -263782 -295641 302861 -87378 3807 -288515 -15717 -26871 -14395
12417 -14395 -162793 52816 119845 29769 423248 129838 187391 6319 -209646 64467 126595
12406 126595 -15610 -66245 95080 30847 225215 -50558 -185274 -167821 -87052 72576 9018
12394 -60123 -67534 76727 22927 -254406 217592 76448 66681 167143 -159364 -72350 259441
12382 -247442 136358 -11862 -91626 -27705 -167707 -483781 -27013 -113574 -44218 111648 -4509
12370 -146418 119478 -96438 -83192 7723 56498 253084 -133089 143689 24472 -42847 167852
12358 -51750 -149475 -185035 -119306 -208413 302471 -157723 175823 31119 -115462 35815 -129366
12346 144664 186193 -14299 -89701 212279 187897 58388 -31639 69725 -231061 -59550 23799
12334 -2768 -251063 -62678 -226345 -44798 121384 54154 30879 -54705 91298 162358 -139112
12322 268850 202735 -83077 -95046 -64625 111799 94250 145809 250585 -5936 87585 -120211
12310 11905 -147219 327155 -189279 206797 256776 -90780 329538 70144 239825 347111
12300 347111 -71028 71001 -104220 -66617 -175158 148392 -239133 -25678 -188644 -259178
12290 -259178 -261491 25605 24088 124855 -10567 100076 49933 62071 165231 -5208 171416
12278 178224 -8467 384759 161139 266738 57581 22424 226277 39772 413268 233181
12268 233181 414384 319296 97168 16636 155946 146035 105205 281950 63739 -32531 162239
12256 335932 78519 100781 -32236 -193777 245790 166860 36277 -215856 -103565 182831
12245 197280 -58722 27676 209361 -40503 72711 160855 279963 284545 81367 230062 -15697
12233 -18752 -59446 122790 -191463 -54601 -408180 -128171 151743 -243408 432624 253089
12223 253089 -277326 491622 158325 295985 30670 296181 92055 173252 81657 -18383
12212 340404 211642 421676 265874 -25792 -196468 243656 205232 260516 111385 -53826
12201 424626 165825 136830 -240154 172667 277163 364654 -371162 404165 363551 -96007
12190 445532 -175571 132526 1778 -119857 334683 -126870 156893 314390 -131674 111853
12179 331359 220125 144947 130856 -40708 201321 67404 -38479 7368 298166 165173 47163
12167 74276 -27373 -209696 -135730 63945 244947 -154586 56745 32223 169753 187782 -113216
12155 54942 229362 -47605 -37250 173623 -19845 -266895 -144938 -184765 161810 126330 237859
12144 237859 -340454 -23666 202675 38951 176985 -160950 -217964 306013 -28944 -131371
12134 -131371 -127526 18559 44984 278249 106190 208258 32645 -36362 25636 301730 173944
12123 173944 125718 101493 -48903 -95792 -202148 246156 -34363 -179066 180002 130161 166698
12112 166698 206772 166583 -52003 84561 -240114 92822 27409 -18516 -7358 210224 112325
12101 112325 18982 148139 254962 -32437 141080 66255 -175563 79085 -63225 -37735 107731
12089 85167 82869 -83708 85543 446279 76921 40100 -137217 -226484 106218 235287 410650
12078 410650 1100036 2192036 856139 294604 592162 351811 6507 211154 -189119 107642
12067 -208019 58751 31807 -17585 -107200 52890 412432 -47469 -117709 2014 -22569 76133
12055 -141260 93204 -162772 2312 -7148 -53383 -54132 184080 -41170 -213646 -68543 -83838 -245824
12043 -245824 337900 -84750 8352 -256031 -53176 41201 21082 17966 41696 116104 -173711
12031 287851 -117171 189318 66545 -230309 100200 -280187 157341 -24319 -51692 101485
12020 315076 122645 44820 188452 -53975 -110834 -318189 92299 63471 12088 323003 202676
12009 202676 -23155 21341 152924 -28934 256261 -103591 -50982 -239156 -6261 110523 -21279
11997 -173271 124196 -62149 45647 -57582 175032 83664 -180246 200126 -157593 146752
11986 245652 -56687 315716 239872 -303978 231289 -346692 278738 86628 -31300 -47932
11976 -47932 -159016 78239 -191845 163428 326647 -239717 5118 19223 -291924 79957 44410
11965 44410 21609 -99630 -11573 399413 -89067 -171463 -4165 -199567 76582 -33000 -198301
11954 -198301 76634 -31629 -66800 -32445 -316858 175170 -180092 9469 -94079 202630 98830
11942 -122116 -69983 93287 -513 157246 -238345 208858 1890 -42525 -146967 -180068 -95883
11931 -95883 -75181 45913 186609 -65422 100401 62659 -91351 177203 -111480 -33165 376738
11919 60895 114168 256471 75716 79634 50812 -39673 -19626 -85436 -140606 149107 -140546
11907 -295524 -90379 -27627 236223 206948 -164783 -180414 249755 163308 84485 120561 -368390
11895 127559 75026 29319 46468 -495265 10728 -75017 171002 97842 -31266 -105986 93419
11883 -66023 69849 116067 -135685 24234 -260643 64485 22405 98219 -387362 -217961 -141144
11872 -141144 -13772 -338189 264087 -56188 136771 -115729 -121620 -522686 -24978 -210224
11862 -210224 213654 95195 101383 -61890 -207296 15399 -285847 97234 -294262 -320819 6217
11850 -99926 45760 -65008 -241826 -70742 136833 94149 -58191 -27293 -42339 518012 -51276
11838 40307 -167148 7362 -50761 2706 185698 290953 -326774 -211203 -93886 269 117273
11827 117273 -249456 -64451 123556 -147698 161698 -55659 -114905 -276927 273287 -189406
11816 -108942 292854 38651 186011 -11272 -25847 -32873 -150869 97795 -89996 -71796 -296697
11805 -296697 108136 140297 -229435 45846 -253913 -346219 84842 -49453 36700 -84253 261007
11793 272806 272611 -157583 141817 -99661 289031 76399 131206 -22252 -120889 28574 33267
11782 33267 35184 198924 188568 -186615 13264 -173772 -96553 -173723 -51882 38180 -62624
11770 -17435 -57239 186655 -64117 -225193 -65457 36882 74020 -25291 -277961 -194219 -140706
11759 -140706 109140 8514 -318870 345994 -21023 -66479 172115 32042 266242 -66469 29724
11747 -24958 206361 -64356 166421 186898 268081 -27651 -245020 202117 -111175 149088
11736 -109773 -218183 -41394 179733 6211 64993 35283 268387 103149 205369 -83898 -151013
11725 -151013 -78391 258758 -110609 -258042 167502 293621 10586 37698 -246776 -41318
11714 -7024 334091 204053 339714 143189 -24602 92870 -94087 44812 134059 -54186 84925
11702 -95808 83181 98201 -36424 358528 149229 -115025 127429 173662 163884 89391 -24238
11690 -142201 366126 237220 -180416 -152814 52560 8394 -169091 81221 37768 182856 9342
11678 -69526 140786 207843 31040 23592 227393 -85876 184727 -211955 103684 -120965 30018
11666 211225 23307 165187 91823 -262353 132198 87889 252248 -259239 99419 136425
11656 136425 268610 -189637 -34313 -162830 94753 196974 82778 85879 37748 13900 -24627
11644 -188497 -352720 25574 112340 -65397 108480 119704 -131404 127046 137157 58133 5391
11632 67515 43280 62907 -22073 148073 -60917 9041 222672 184543 -71304 112125 213816
11621 213816 -11661 129663 -184108 -372551 87162 -110163 -235145 -164412 -138877 94577
11610 106159 15478 -104215 -90677 106392 -184106 -78973 88335 64344 -126143 -135547 193667
11598 -131721 -54039 197994 88982 -214530 217018 157178 432318 239587 209860 66569
11587 133901 93412 205237 337672 142375 148306 227543 -150050 49183 115401 -70787 -21441
11575 -25526 173142 306498 -101953 306044 69073 21133 -140562 -316180 -42343 199999
11564 223318 60419 78758 22733 193187 174080 121095 -27897 -12369 68157 -351824 -111971
11552 -141257 -290713 -156005 45556 149796 -238096 279761 -205063 415321 97890 204085
11542 204085 -190862 -407320 -131821 61729 -107272 -17054 63588 -212219 -69311 50207
11531 -27120 -107157 293793 196635 389458 14921 114591 198798 24928 81953 370465 298300
11520 298300 425657 123411 302700 264885 138825 -152796 194647 129751 -225922 33828
11509 72146 252110 -15860 -102298 286269 53052 104680 -61437 161465 42641 273616 184787
11498 184787 100505 -52099 143437 -67974 54697 440701 69092 301418 -4924 91081 34680
11486 -93788 100101 33346 -90320 37096 60103 171932 115134 16902 -39617 294315 5645
11474 51977 3302 -8693 195826 593695 -82911 136838 256481 244039 104002 -164703 438034
11462 150394 147123 87846 -73361 -72875 338171 288579 -6014 183211 16609 104806 193616 91927
11449 13739 57380 187115 15294 -191169 232970 8016 -30973 -43619 342156 170100 -111486
11437 70938 394125 -296064 -196702 73005 95185 -85196 -32915 383593 504060 34369 305099
11426 305099 -308904 179734 -319002 -58462 37341 82038 95323 139 121186 4180 9568
11415 9568 30714 -90196 -20716 32089 -74000 60137 122781 93662 3448 -155713 154813 172266
11403 172266 145771 -120411 154617 30125 110510 83198 71726 91237 -448832 89846 -162630
11391 353978 -154943 -42966 20112 367824 -290746 -139756 124481 -145865 -109025 -167963
11381 -167963 -35303 -8747 45420 33277 135405 66742 58081 88031 193063 108294 105604 178547
11369 178547 23259 160969 48039 110591 92445 -28834 -124271 -470440 234568 45490 -322562
11357 102210 -28560 -47315 113032 -152867 59218 -22263 -158169 319373 224432 -164211
11346 -36283 -183972 107981 -169870 -278339 89428 90694 49130 151819 244189 28850 -247205
11334 -175856 26612 110787 401049 82244 -57836 196439 3587 49799 -242662 26155 -220426
11322 -3722 50437 -212785 192824 172750 -320676 169269 -61537 132070 -427031 -223523
11312 -223523 50606 148550 172080 232485 207351 -148738 -174791 71854 210038 -105101 279574
11300 62517 78119 226259 -48321 199607 -223718 -4921 -398363 -225481 -13372 -310995 -23727
11288 -172241 -83948 26551 -111404 126858 117522 -64745 -70031 137349 -265288 -16470 132980
11276 -93624 -217231 228799 233439 123023 380405 -14024 -85329 221064 -55687 347563 -56501
11264 10612 -64405 222358 -157153 61772 -64767 113252 -503513 -83398 142202 -175855
11253 192050 -157778 -314177 226716 -197526 -50268 49728 -89097 -289081 23129 -91910
11242 78027 147167 -65940 -176049 -44728 -23432 183151 76546 -177770 8807 -347123 38784
11230 -147063 -859 -33760 -232664 -186455 100609 -145093 -133781 -379530 -193344 -222280 307116
11218 -219222 111148 41866 -126550 10614 -214114 94052 32310 -119251 120498 -153222
11207 -220747 39210 -9249 -40955 -294958 75810 -33179 94651 290009 -34014 -140422 -66843
11195 188396 -129140 -150558 121098 -125720 108991 116444 -98022 -118275 -171168 71464 -114854
11183 -198360 -277103 -263059 -123088 -289888 -188203 -475179 -36135 50651 -249430 -23647
11172 -191555 -69490 -44584 58466 -185277 90749 157682 -318164 9022 -358414 -315432 316449
11160 -26482 44469 -32207 -152168 78667 230853 -221983 -340515 -383608 -22013 49978 -10341
11148 111499 -91115 -380911 145808 -137364 169497 -2529 334526 -94668 132410 200235
11138 200235 -180992 212344 -397743 62407 -156322 211670 107543 247337 -255776 209344
11127 140194 3601 175139 119629 103881 -187870 -166878 -41121 46130 -149276 205845 -17460
11115 232413 228663 227903 359862 162979 -69040 -145786 -206466 -88461 56809 -13964 125631
11103 300745 -81963 190567 16436 363693 159344 63054 266567 314843 121354 77025
11093 77025 -87300 473497 167183 449216 28236 107929 103197 189377 505839 155733 310199
11082 310199 81442 269287 434714 88394 107079 115486 78015 237134 282769 202905 328514
11071 328514 314119 441420 177451 590959 154184 463441 405234 488761 200151 598691
11061 598691 419200 390931 448970 812861 947204 694205 440571 850309 625481 534237
11051 534237 620291 710246 637468 681817 770200 760291 822456 743204 551309 634305 514686
11040 514686 708492 753636 627536 901758 827119 599741 590304 591284 315877 747444 682026
11029 682026 363949 707252 642303 465913 445040 764322 703594 691458 503296 222313
11018 599801 301673 708365 358119 851175 292977 518250 269772 367329 326887 545609
11008 545609 904396 147513 572455 599250 460898 708074 492107 613752 502098 518760
10998 518760 428679 714780 318219 658812 568678 420598 455935 793045 894503 680814
10988 680814 649193 911465 699575 1104532 437040 934151 1065136 1117905 1342061 1500025
10978 1500025 1451744 1516472 1649435 1833810 2081313 2318023 2648909 2257094 2760865 2601753
10968 2601753 2556260 1907356 1837972 2045777 1791035 1669722 1585258 1692871 1679882 1850988
10958 1850988 2021038 1933391 1745089 1785712 1522294 1408480 1485695 1048930 1329784 1084714
10948 1084714 742464 464398 228973 447647 370411 435391 155294 87885 163487 169137
10938 169137 156162 327818 -58158 -114839 54553 235257 322658 58893 -117906 -117718 -168769
10927 -168769 750 401430 154598 201815 -216475 3072 -145837 -81468 -93276 -53183 -53065 82292
10914 -37928 7242 259488 103289 116346 205295 267624 -209495 -88996 -48249 -215734 230066
10902 13436 37712 -213691 353343 -115828 -284720 -121316 123581 85965 54628 71695
10892 71695 -230961 -73995 -4623 -8800 328899 -171998 176518 128925 -148503 -229109 85156
10880 -10887 105074 26688 -135821 79430 265204 -123601 10507 -102281 -161986 16005 140449
10869 140449 -13935 313066 -7765 139774 -83365 -57423 -86999 -31197 294688 156946 -7194
10857 -2290 -240570 259791 -12464 -187601 56382 -26597 -131802 21926 -235970 -148751 127157
10845 -17355 227021 -197306 -9791 115627 254473 129447 -63421 -407092 32582 22019 27218
10834 27218 -50846 118933 -157000 -269852 -194398 -216953 -53988 180502 -175086 20169 -41061
10822 -295513 68152 27055 -236219 173893 -11779 288082 -303781 -446752 -473064 -148840
10811 -381769 120550 -196184 -8729 249737 -14463 202468 -18334 -98585 -256728 116065
10800 -328312 -152925 103958 42975 -74369 122368 88415 -431838 111427 -16554 349892
10789 6229 -48917 -120561 98579 -214675 223211 171463 -167341 206320 120791 113772 1603
10777 70793 -173050 95203 -377443 -105189 -248974 220356 -289162 32734 -244544 -271652
10767 -271652 -149139 -130135 -223781 -250435 -192412 -215186 -222274 88658 -191418 110765 -195471
10755 117987 76251 -67639 152649 206049 222409 119711 249015 -262780 67597 -64714 -52399
10744 -52399 40795 50323 11080 46606 -67935 -419582 57195 -10639 -46477 -47258 80329 111677
10732 111677 -231549 -242182 -18630 -355344 42842 -112898 -382937 176101 -206860 -144885
10722 -144885 88288 -227896 -242261 -108532 132409 151649 -37027 365201 -200257 161855
10711 -210638 -52856 80983 -126167 -133339 38133 245084 -161101 98353 89229 188761 -526115
10699 -44656 248058 49386 -88384 86451 -220880 -168142 117608 129922 -279674 37540 -38268
10687 -113138 -12356 144874 -97892 -76666 -25288 -125011 -248538 38766 -108072 -316485 -92547
10675 91810 81828 -61643 -41726 -134615 234578 64920 -268958 30764 -70846 -122228 -12713
10663 186258 -95227 -93533 197157 89288 -82570 -314507 404317 -373521 103540 -43825 247510
10651 -88535 -51020 76710 -86535 -65967 -217215 -177861 -142397 -65125 -310545 -261844 -50 -139889
10639 -139889 -56689 194663 313621 -3429 -276971 20009 51219 711 -89405 -181027 -194640
10628 -194640 -51573 168981 -69500 -80330 -26147 43542 215544 -168354 -236624 -105550 13143
10616 -213215 78737 102049 -105757 -246597 97255 127133 -133791 168975 217305 113500
10606 113500 -72670 83794 -63922 -222539 363153 -39676 -183396 -171939 184085 -248007
10595 -64944 -228465 -240903 -274674 20097 -123361 -82492 -81060 175835 -328565 -213796 -8409
10583 -44093 -69670 56413 -55341 -139077 125835 -152658 -312629 384397 -194159 128250
10572 -126473 57686 -271095 52709 242941 -81266 -13458 1597 175910 159849 42251 156205
10561 156205 365284 128587 -296955 217241 425255 245615 181891 -106980 178155 -154324
10550 -291443 -125581 40173 -97571 -103156 96146 16404 35804 288965 -145948 -10689 -93252
10539 -93252 -182091 -32167 -138504 78429 350559 -120104 -148317 -127423 136913 -30034 -222393
10528 -222393 -100205 -75458 -165538 62311 271594 -22841 -54255 -30193 208819 -164547 -29882
10516 -451052 -235994 211445 -95165 -383983 -116914 240026 -98151 -148880 -17205 -444551
10506 -444551 -213803 108810 244283 2199 -353523 23347 148613 -114579 -180375 102265
10495 87019 -252501 -51819 99780 191251 -223168 251796 17851 213084 -88993 -65159 211263
10483 -45380 429851 316815 242678 184118 429302 24067 462453 142621 92197 -6574 409178
10471 -146236 -90726 94992 87342 191369 -25314 157725 240367 -48071 18382 45400 11072
10459 103424 -38304 -51422 123582 -199770 -234731 -251451 85479 66213 85255 93543 19159
10447 -42493 273057 31245 -368549 -158876 87470 -52551 -56912 14615 12899 -94074 -192160
10436 -192160 -64811 -75274 94696 -110771 -16874 -218174 27679 -87403 -13073 -367477 -69225
10424 -148315 12743 195426 -74605 249627 -277128 35206 -233378 -271318 21162 239120
10414 239120 121968 -212868 -268479 -396805 137225 -21460 -278574 -126012 -39041 -255172
10404 -255172 65650 -57523 -56021 71464 163691 153990 -20026 -349059 226713 -140277 118703
10392 -78632 -84002 -101523 259665 -115025 -238783 -33429 133225 -387397 -22221 319257 181363
10381 181363 90194 -20461 25503 242266 118655 169496 381501 436389 -57476 212439 107410
10370 107410 207187 251619 434196 434160 390097 165249 337638 65934 238819 16344 192333
10359 192333 278071 307001 200397 243200 201662 44761 184320 94570 292043 694083 534018
10348 534018 652644 340081 182789 250856 261462 567778 867 2261 47135 130957 154196
10337 154196 270274 -25084 352256 76205 240438 467952 164503 221391 -131433 7956
10326 193596 -193179 -22531 248974 -9460 134695 239301 288268 130632 -80452 4332 -15996
10314 437558 66010 233172 42321 58188 239031 -137907 5498 -176381 116774 -39661 -250035
10303 -250035 92935 6964 224192 213383 -227589 92517 -67104 70383 -205619 42847 72451
10292 72451 85669 -189288 114360 57662 -231755 -85642 59529 37960 48805 124584 -172767
10280 -11302 -397056 247737 190131 -54447 71749 -80699 -189233 -78770 44925 -214431 -136766
10269 -136766 -98426 -120852 359527 -107644 193473 36069 -125142 192461 -19669 256708
10258 320534 298880 -29199 325576 330320 229595 323843 -99563 -85439 -53990 -203584 -171294
10247 -171294 -354887 -21437 144665 158200 216711 144583 -118916 -250472 -96471 17613 -94811
10235 66947 139251 51760 71448 270642 -43109 265271 -387464 -38615 -100251 -3581 48554
10223 218273 -236724 -30834 163699 -261489 -5820 44889 -391943 66647 104199 -231231 -63303
10211 -407076 -135028 23239 -111978 -185148 14667 -339944 -104933 -195587 -55467 -249055
10201 -249055 -123204 111892 -109732 -127596 -491076 27269 -225458 -32182 -24551 51436 -190949
10189 -445673 -138819 182274 83097 -83560 221427 -292826 -55876 43311 -115920 101546
10178 -305017 -255595 -316925 -375121 -170575 -33094 253751 122521 99975 -103619 -67186 -128759
10167 -128759 108689 243221 -32134 -148250 -36567 167514 -250266 139503 99615 229363
10157 229363 -97590 -146837 -86251 -18750 86576 -88432 -356705 72125 135061 -56665 -36466
10146 -36466 -118703 13228 -79136 183257 -346302 -45137 -95124 129501 28379 -185117 -148376
10135 -148376 -185030 -133699 -213750 -66387 238105 58763 -6084 -154337 -135594 -391939 47163
10123 -1332 -336979 -92460 -13729 68851 -198550 -240356 -54019 -13623 -172606 -339903 -103492
10111 101462 -92230 -243472 -60714 -50111 135950 -17582 -239820 122387 -159660 58503
10100 -122689 233700 21257 64879 20489 195974 -150689 -146257 -106586 -31942 -57194 -247023
10089 -247023 -56358 367638 -53702 260329 -55468 -157873 54123 81643 -80633 9113 -137938
10077 135337 171029 -209929 -4461 65016 -128468 -101376 152980 -59162 -372290 -83093 21256
10065 -199634 -31508 -199081 160411 -112294 -288181 -111245 169852 -109628 204651 -210225
10054 -82422 368252 135075 -142840 -105156 168430 -197070 98217 52373 194772 166346
10044 166346 114238 -81343 -238702 58787 86530 -70875 -198503 -242776 -92124 53658 79012
10033 79012 24531 -251089 -236270 -266320 49206 -230158 18247 -37105 8369 -99254 -41108
10021 -11191 -126850 -107296 -68065 101323 -6357 -93003 -85673 -288519 -176466 -98981 -54059
10010 -54059 146132 7682 84917 345508 -164551 -81939 -298309 -163270 127686 -157480
9999 82119 -234310 -176945 -47170 -95504 -152318 -204044 -23106 -316943 -238059 -202192 -187548
9988 -187548 -45688 -225328 18851 -170816 -25005 -159709 -129021 15193 -384473 -197223 -44593
9976 -79130 202458 -289092 -130100 5001 -34677 121392 -22930 85635 125581 278872 -267231
9964 -107779 -135078 -59993 143166 120410 -135363 -247056 296942 -311715 -252388 -201347 -39273
9952 -109699 89753 -68058 -444514 -47719 -166622 56665 -15386 -227118 -7510 -266929 136817
9940 409942 -40661 -39317 441262 -24943 286873 263568 120956 198356 -181997 -70601 -46860
9929 -46860 -187849 9825 -209028 -348733 87408 117350 96171 -26796 -79881 138603 -224118
9917 -266720 -40977 -21891 187810 217635 52034 81631 20054 -151601 -85962 -195334 -16063
9905 80510 -417533 68778 71044 -45159 -277996 -496944 -112328 74505 -60690 -203139 1981
9893 -2194 -223701 -53665 -96738 -142499 -319124 66249 -74299 109978 287797 -518994 -262591
9882 -262591 -356775 100104 151943 78071 -233115 11695 -58998 -72692 -365349 -359060 -227353
9871 -227353 -197044 -73000 -59016 32883 -239663 -247518 -41920 -40168 116722 103095 14036 -71943
9858 25521 127570 -153872 42182 -48798 -292922 292184 -151418 -7386 -42575 138953 -16945
9846 -169097 -195024 2246 106181 83459 -199249 -288444 82005 -65390 -166716 -174056 100742
9834 -176617 106046 -353770 -120718 -154470 -203591 113818 -249865 -54067 -127618 -134169 -127128
9823 -127128 62351 1372 -79802 32628 -408322 101091 -167076 -130702 86087 -84660 -42232
9811 115253 -124380 -50664 128364 15657 -97714 17346 -19752 -249258 264992 -21238 24026
9799 -85598 -212047 -274704 -352097 34992 348070 70791 111348 49465 -211851 -95512 16300
9787 -128074 -115259 -344878 86895 -62990 -57428 90484 -279394 -27395 -94876 20241 -70651
9775 -378979 -142601 44107 -60368 29737 -134021 3098 -334408 -176782 -16311 -143865 -230137
9764 -230137 -19472 65820 173486 -29769 -368109 196558 -115659 49906 -24482 -220780 -197315
9753 -197315 -19556 196847 2440 -147865 -138564 -212186 -19079 71255 -322104 -214766 128734
9741 -8006 -12246 137312 -170488 77373 -109468 -55444 -194913 -115761 -76737 163611 -327391
9729 24298 -217700 -170039 -125912 -171019 275118 -75510 -801 154547 -206410 27521 97790
9718 97790 -38078 -533017 278989 -375733 -94563 -107127 43083 -216534 -52053 -30831 -9016
9706 260701 -169175 237039 -134600 -111532 5067 -123534 -17810 -2123 -423777 -31674 -127813
9695 -127813 1795 -132425 123997 -197234 93531 -201036 143531 -117920 3015 301841 -320304
9683 -75766 -194889 -49697 -22356 13302 -202905 210585 -45165 84445 -428285 -16576 -63283
9672 -63283 -198215 -194310 95382 64889 -7736 -173335 117984 118974 -95016 239695 -324599 -283366
9660 -283366 89809 86658 -57232 10438 -88903 -130747 -107827 -61501 -55441 -373969 -112465 203062
9647 213116 -65272 -169510 519075 95623 -67989 341714 -266044 138917 -66805 2127 -77617
9635 -238656 -141087 -268855 -304084 -377448 -191552 -87560 95327 -180531 42122 -97110 34986
9623 -219860 -499695 -262308 -101366 -120156 286535 100514 -287820 195529 -275772 -28416
9612 324913 -17878 177572 -128249 -124518 -226309 -90412 96037 -77826 84817 231900 -43086
9600 -132186 -66979 50475 -86867 18151 -87893 166880 -25094 -222633 154402 -312205 -35146
9588 268796 -47415 146892 -119566 278987 -18157 -110183 127902 17601 -202828 -390010
9578 -390010 -304692 322523 -98082 -3108 -14092 -225751 471 -229444 40216 -130475 -173676
9567 -173676 195439 -52053 -227483 -43052 20202 199807 -237947 65229 -192847 -129739 -26212
9555 -114009 92574 -381973 -112538 -54279 -21774 -263871 -180012 -26524 110606 -368579 -322687
9544 -322687 156242 8003 110135 -285353 -368643 -313594 -177964 -118958 162217 -443326 -230150
9533 -230150 186484 23488 58240 -237568 144696 217549 93859 -80467 -138690 -367100 16481
9521 98158 -925 -357831 -80318 -11042 -88627 111741 126535 454318 -225363 104778 -120721
9509 -425816 25650 -201800 221839 -89176 -51102 -211620 -163960 -197185 -83818 -97567 -116794
9498 -116794 -51821 361320 89610 -62739 -233198 -241747 -50677 -144995 -277334 69008 -231991
9486 -146060 16927 153120 345644 -97559 194116 12758 -271756 -95978 -4152 -62037 -5964
9474 -102522 -29047 -24400 -142740 -244778 -176873 -233279 152974 201098 -217852 133168 -161242
9462 -313461 -70332 13077 -302255 237620 -48591 -242254 -96764 -98754 -211567 -83035 -159294
9451 -159294 24451 -60340 -294616 -326821 -445453 189453 102479 187710 359845 -59154 81986
9439 -246595 -39522 -66364 223804 43020 387716 77585 232569 -62124 -185687 -258606 220004
9427 -40850 351115 -221510 174001 201293 29723 -256906 -77769 46178 -243210 -244268 -151013
9416 -151013 54723 -264062 -92194 -78616 126362 6420 70279 97103 -65590 -55203 -2522 -296691
9404 -296691 -157593 -94228 240803 -294267 -137299 -134335 -372148 71161 44187 70663 -154338
9392 -58610 34900 -122604 -253976 52065 -55532 106726 -186396 335984 59434 189972 133846
9381 133846 -198117 -469375 -149452 159172 18854 83832 281607 -222596 63057 -162611
9370 157998 -141297 181629 -355768 11186 83629 -281905 -212494 -138728 123222 -173646
9359 124129 -68056 -81482 -176788 61762 97285 -105153 -87087 244713 65380 -605068 -345697
9348 -345697 -268889 -195536 -146136 5266 -316817 44451 143594 -325041 -347566 -66517 -303010
9337 -303010 -26583 -140966 -164766 23928 10633 -81035 -233881 16886 206973 27598 -300525
9325 -18611 72609 -105880 -206117 -58148 -26907 760 236582 -117085 4059 77610 -69115 -416299
9313 -416299 -99593 -16664 -410950 171225 -265339 -153205 -174864 -252156 46060 -176028 228494
9301 -37542 -358264 -113112 -83062 -84560 15647 43861 149792 -117934 -26699 52515 -366875
9289 -175422 89637 -184462 -325668 -128191 -307166 250408 -175323 36135 42687 13265 155953
9278 155953 -42676 117408 -260838 -56109 -72896 -205376 224219 44472 -166095 -127256 -83498
9267 -83498 235237 -156555 -87243 -184031 -131636 9288 -195237 65249 -214407 146586 39755
9255 -301044 -11927 -25489 175652 -29339 -53437 88212 112200 -390630 -241138 -185081 16157
9243 133619 145225 -106657 -44806 246729 -122463 -141754 -92853 315517 -55027 -331779 228941
9231 -208819 3677 64778 90910 174301 -108473 96008 -33458 257108 -157783 -206209 268996
9219 -201896 -114803 -134599 -67828 -138287 50851 -56409 116088 -129160 -584569 117424 -146918
9207 134421 168179 -69570 -73940 19525 -40083 3320 39708 -502769 305020 -173851 -103679
9196 -103679 307132 -269879 -10705 -192110 -140986 -378053 -15026 -581014 90355 -211029
9185 -158767 -155857 -27590 -100023 20811 -147028 -21069 11896 82599 -463695 -58066 235992
9173 307795 79926 -187343 -195843 142383 -132842 -134619 -93673 123129 -82202 114137 28677
9161 -182156 -55333 -218072 84565 -53227 -19442 -145849 -117873 -3981 31573 173632 7303
9149 73258 190886 -60767 -113909 -470036 203201 -110228 -145140 -71138 -258220 -218864 -209548
9138 -209548 97224 -57521 6871 13024 -70725 -94288 -77818 -1098 -89961 71438 -55492 -5003
9125 -41407 -133894 -446310 199491 149619 -35409 -9372 144683 139947 277980 137296 5353
9113 -236337 58690 -14432 -89127 -188715 -45590 114640 -39883 -59358 -21129 -33314 -288407
9102 -288407 -189965 -267544 -296282 128985 -161294 -252392 -309048 -127114 4508 128960 -153943
9090 15680 -151379 36817 -17578 -318715 209146 43804 -226069 -181159 17647 -494388 -205351
9078 -218010 -248510 -125626 119935 179618 24144 -12181 -88997 195501 -49190 -35682 -85149
9067 -85149 143785 -189676 256194 -4765 -73912 -429892 -136954 -147646 -78553 64806 -267951
9055 -96265 122263 -148391 41525 159245 -60567 296593 -322580 -335298 -25241 -73916 -83899
9044 -83899 84273 82906 54531 -136704 -80912 -53404 83610 7140 -147018 -127401 -166926 50992
9031 -216861 -203298 13706 336702 184574 -193667 152459 103928 -147462 30145 -162199
9020 197724 -76277 14366 -79960 -106459 182726 44416 153441 18306 -55016 2243 26026
9009 26026 -277228 -123094 -32397 126381 5125 -3908 -217701 162911 -30848 151241 -99909
8997 82824 -37948 -81102 -53711 -147075 28610 43540 251147 -49591 -183604 -258230 177432
8985 -463468 307352 180748 5409 -27026 27840 -186360 174054 -184736 -78622 -227284 42961
8973 -155347 67830 -62158 184218 44780 258716 179535 228757 -259165 -163377 -272145 86826
8961 -4880 -200768 -50029 68673 53606 174633 -371521 73204 -207799 -108536 149415 48900
8949 -171057 30679 -121519 -106948 24896 -107603 140385 -143006 -186396 -289760 -31485 55130
8937 -139032 -52229 -127453 -9993 -237045 -237572 -67564 -256013 -439720 16266 -74869 -142470 -136313
8925 -136313 -6493 94874 -165307 420173 584984 119357 150563 -387 84745 -45519 -59490
8914 -59490 -33409 -116851 -34360 -210425 -302077 235988 -27767 -335515 131414 -112446 128212
8902 -22189 -116907 -318040 -164406 133332 -20184 -268715 -83389 200558 -371223 -296398 -15272
8890 -384154 -94388 -31573 -37510 -170254 -230260 147054 132497 24117 -138131 -113637 -126914
8879 -126914 -18368 57777 255128 21855 -58051 -159563 -257997 -307469 -280312 149998 -147656
8867 2036 -241269 -370330 16098 201179 -94709 121744 226124 -340598 69646 84572 -242677
8855 46755 62503 -193985 113322 -152835 -137434 -68680 -308547 65329 -123974 145545 -32812
8843 50482 -31082 -70146 34795 -153996 80987 -108465 -105294 -44848 -44813 -130403 286019 -9779
8830 -85948 -58930 87255 -34862 -133104 61359 285358 -131777 -192205 -239950 -199701 119358
8818 170041 7490 78549 69519 110164 -288128 56476 -65781 146845 -117031 -405947 17405
8806 317805 -278511 -208784 -70004 -57092 -85329 -315273 109850 -160661 -240093 140906 193150
8795 193150 19041 -78067 167975 135038 -49128 36660 -92763 -91461 -172291 -131340 -141625 -81004
8783 -81004 -204845 -308146 29955 -89144 -66398 290826 -175436 125451 -170811 47000 -152160
8771 144355 -265035 311543 -232154 -329069 -179101 -50381 -39945 -168324 184505 -113100
8760 -208840 158227 25414 38946 166433 6256 133891 -116396 -103681 -209836 344188 -284974
8748 -147862 72301 33656 179985 46960 -32226 -292381 -56162 23843 116074 44972 -239562
8736 -180843 -96886 -259887 38372 47238 -343545 102822 -34653 310614 133901 116794 239165
8725 239165 -149626 -286674 -61364 -69508 66814 -307648 -110435 -18364 -96174 -134369 -188579
8714 -188579 11454 -391524 26588 -272110 167977 62497 -314654 -158798 -39702 176846
8703 -212364 -72589 70805 -430865 -42645 -52404 -189992 -68530 -65778 -204036 -8185 -113985
8692 -113985 109970 -237151 345929 4237 -205583 -114558 245801 -400294 -57793 -361356
8682 -361356 278527 -17615 -119903 -111708 151720 -10388 102064 -190839 176777 -158632
8671 -320261 -105443 -300831 14109 -45341 -135139 -20613 113019 146844 64198 -126526 -131920
8660 -131920 5669 -178581 5509 435293 -166137 117849 -2059 137789 -28591 13834 -133262
8648 87359 55544 64611 -223951 -218451 51579 -59237 -126436 29482 149303 34527 81569 6710
8635 -17185 -460345 -26868 180289 -196300 -11866 -213780 350126 99648 -264554 -224792 -53075
8623 -187737 31589 12302 -101098 -110772 206545 287209 -40824 109096 -434037 -28765 10924
8611 86026 -97253 -317272 -110166 78518 125367 112308 -187392 -219820 -226729 -306308 -224786
8600 -224786 72032 -2540 169430 -93952 -3435 -136523 118610 -149169 -33802 326231 51336
8588 128484 263800 118819 -42307 -223689 -116659 -93099 43224 61704 35626 -225540 122527
8576 -110212 -262428 189278 -212101 -275766 -119875 -117893 -211254 -24329 285358 146765 -6208
8564 -222711 -174536 502170 6076 -42594 -156579 -250501 900 81913 -147092 117800 6275 -66581
8551 68266 -49011 -325616 21686 6314 -25129 190812 -27673 33938 -101227 -391880 220127
8539 153412 -77243 29592 -195490 -125637 -30737 -503368 232530 -172469 -56244 -269806 -188123
8528 -188123 -14369 -73077 268334 -50049 -317938 -149699 -88848 -81828 -471891 69874 84623
8517 84623 -127188 49609 136223 -94597 152146 -202985 -50052 -366130 -25846 58752 44259
8506 44259 -137204 169587 -159508 71839 -175080 -159201 -63063 -74270 -140478 -174673 -93039
8495 -93039 -209638 -66105 -217612 -63638 19835 -25460 258891 -72637 121989 -13290 -89099
8484 -89099 -245671 28398 249806 -112229 -90826 -131923 -91966 9506 238328 77900 -117987
8472 150466 -19908 -183843 -26849 -160695 2488 -161 -406747 -413427 160966 -65413 -322 59635
8459 -26308 33078 -42610 126228 -223965 -364089 7163 -5653 190341 -8701 -3577 23595 -219039
8446 -46486 -5878 119153 -179430 -215587 -267786 40209 -177 -258430 40814 109869 -188187 117896
8433 -195859 -256720 -195236 128491 -193008 -251495 -116134 -13415 -156914 -221744 -95992 -20836
8421 -102904 -59380 -212384 47984 102636 -99934 -561285 -127524 -135500 1934 -58561 -5849 -208498
8409 -208498 -68188 224468 259427 -293881 -189385 -59738 -72802 130713 20057 -77184 35712
8397 -322508 -48813 82435 -235591 -250360 -45751 -57863 60159 -110696 76332 -238314 35657
8385 49459 168404 -72917 -40457 61103 -111971 244478 -126652 247766 -127089 -119857 25204
8373 -107142 -115082 -17135 -184089 -154473 -128600 -192897 -69310 196787 -141149 -24304 38495
8361 17076 9361 -386631 -128894 303981 -36490 -27167 -243564 151479 151054 -130607 -30828
8349 80998 -281970 41817 -20854 226369 115432 54544 -112534 -139070 284218 -9727 239312
8337 -81166 -62786 65197 -111213 -339377 353994 -252247 -277630 -219686 -419005 -25521 -72352
8326 -72352 -28481 78314 -270079 -200157 -153552 1847 223447 122184 -209802 -366522 47303
8314 59630 -373 -147562 212668 -137806 64405 74898 226509 -167369 -62326 -2180 -295886
8303 -295886 60236 20859 57492 -19799 132521 65629 24674 189825 86810 107637 -16725
8291 15967 -150003 -440030 -147284 533443 -225139 -39848 -82510 -14455 -263449 -408162
8281 -408162 -35630 -35709 -189253 7381 -107360 -240089 44722 -13715 -130053 -378416 42591
8269 81396 -460809 -134643 -241167 -19692 -109575 -112291 -152323 -17454 111241 -189958 103263
8257 -59279 -8743 176412 -29985 56171 47222 200674 108750 -119732 59879 -236414 176265
8245 177389 -26369 -26110 39197 219356 247803 -145107 -364039 99079 85285 -411234 195289
8233 87083 26283 -177816 -390976 -211992 -57120 61838 -98077 -257159 68396 -183888 -148022
8222 -148022 -266468 -110927 117349 -322149 -102551 -74325 -173016 -94828 130622 -148543
8211 59485 -204364 61375 -186285 -322019 -351862 154337 67188 -94861 -76121 218847 -273724
8199 -115011 -53075 4492 -453635 -93794 -416330 -88754 -292597 -92282 -381381 -140654 83577
8187 -185718 -33977 -79057 70586 19063 -50918 -287915 194473 -195223 -14924 -317905 227713
8175 -295921 -136211 159926 255421 -107954 -156447 219805 -3558 125009 -341014 143453
8164 -13117 123556 -14593 31814 102846 192466 -202996 -155092 -6758 -108563 266081 -393145
8152 105398 -141529 -346232 73971 112263 -192025 -30697 -40810 -3371 -164134 -60449 448957
8140 106981 -203638 -229931 72265 -33551 43531 74996 23681 2058 -35061 152351 -52211
8128 -195671 -111535 107947 147455 -271680 -80837 -182552 -91280 -227994 -316671 -34186 -139701
8117 -139701 94459 29537 -33634 -147706 223389 4272 18907 -320220 127461 -27819 -506772
8106 -506772 -192866 59741 -120212 363012 -168902 -81225 649904 -159933 115440 5971
8095 -29691 74161 -102558 93467 -72384 219375 -312798 75718 -465521 -10227 -420002 183271
8083 55900 -58915 -93592 -321895 -80240 -420655 -100478 -28833 -88819 -29673 6092 -22061
8071 142861 -238958 -191631 -167872 65143 -16947 -55751 125106 41568 -105498 -265402 -211454
8060 -211454 -126328 -123334 149929 -211118 96351 152596 58776 -44213 -18879 35316 -356834
8048 -65786 -91339 22907 -23511 346505 56131 -140701 -68724 72401 -213551 -205152 137182
8036 109187 -565168 -208095 -133840 7116 -74499 -245576 -49194 155245 -13303 -299192 -58114
8024 -63660 -118744 -336211 -82166 29517 -54092 -200392 -165948 172874 -216206 80255 -66790
8012 -224064 3740 -387 -320435 -183684 -189445 108353 151518 173705 -12262 184863 -227678
8000 -312654 -152681 -218059 -41034 129488 161447 5805 117949 239359 176952 -216878 -112409
7989 -112409 -70756 52878 -322027 -191112 -12241 -126340 64056 15968 -140195 -155443 -43623
7977 97360 -201199 -40239 -88836 -45891 139998 189423 -183776 123328 145883 26341 -178250
7965 -159875 -80434 49839 -141786 106565 -150960 -220908 -172491 20415 -309687 -172198 -146115
7954 -146115 55125 -262479 96528 -261016 -128801 10744 -170414 339615 92053 -53373 -210186
7943 -210186 -202478 -160796 -60662 -73176 -94043 -162338 -67154 -142239 -465462 -277550 -308167
7932 -308167 35028 -171912 -91033 -226493 -195936 187242 224637 -82018 -173100 -181583 92079
7920 132179 22571 83168 -1065 -412168 -30338 14556 -114056 202209 -108898 -177094 -181439
7909 -181439 -224988 183804 -130681 -65373 125480 -196670 319358 -215160 86567 -431924
7898 342503 -206882 -106056 22118 -141230 128757 -30595 -241296 -349711 -157820 -247530
7888 -247530 -38977 27630 -34303 -92827 23364 -27756 48039 7373 55447 -50566 -259997 -54998
7875 -60160 -215720 42197 -215564 151676 96703 -245321 84346 274345 -36532 -84803 247325
7863 195020 -66694 60704 98100 12305 50871 -194156 21156 -239730 241444 162914 108563
7852 108563 47942 -22961 -82844 132457 320708 -134276 -262784 -47625 111325 -212299
7841 -147788 -166512 85256 119368 160584 -40188 41366 -104017 -505249 62889 184900 -270378
7829 399066 -87071 -57743 -206963 -126650 219286 142531 -413922 -444817 -40251 181070 -125320
7817 252162 77527 73045 134733 293480 33755 -92933 -102926 34578 -167889 -108757 -106116 -125682
7805 -125682 -97717 58627 -48871 -276787 -209706 -71058 63688 -113093 -186066 134929 -125174
7793 -89656 -69243 31832 -179313 -7893 -9464 -67807 305599 -460450 -30565 120990 10509
7781 304914 -1093 -47661 -121561 209220 -28174 -97474 268610 -172508 173351 -61511 -47732
7770 -47732 12149 223305 -4694 -9528 347424 54055 -15071 106588 -65689 -278890 -27670
7758 20492 -283048 -9161 -63649 -42245 -214805 66913 49630 -303969 139942 188944 -270282
7746 -5149 -232241 -211459 -61703 23733 -362007 -166147 -221310 -11876 -146515 -29776 13445
7734 -175863 -68932 74025 -79109 -46873 40284 -104482 -138047 -44051 -174441 192522 76619
7722 140617 -52466 -22120 -17200 177993 49767 76548 56665 308576 -45571 -214670 21754
7710 -19093 -107454 -108513 -242413 -220888 -9610 -66447 -184434 -79482 -63858 -294068 121196
7698 142867 -102908 -68543 -53979 -39210 221328 -330752 70194 384555 -68593 -21008 -71708
7687 -71708 -205382 -328310 -163495 -226378 20990 22091 -224937 -219537 -83786 -188095 -111614
7676 -111614 -336361 -110922 32024 -137607 -327674 -288947 -25234 -2195 -144552 124096 176025
7665 176025 -101862 -133718 -256143 1701 -170399 -29668 41924 -37895 251484 -227266 107688
7653 -132679 -247547 -103653 9156 -232859 -38816 -94079 -60161 48673 -204501 40993 253356
7642 253356 33868 -232741 127589 27908 -28601 83397 -304666 -291023 -150524 49504 -269998
7630 -236849 -234489 -141941 141134 126852 102135 50199 -69751 386229 -133417 -151007 -187518
7619 -187518 173333 -88297 -5883 72172 -1902 407664 109944 -290771 55372 -21471 33742
7607 -97651 -45432 -190513 110785 314150 -189632 -138196 63131 -15420 -97732 32337 158550
7596 158550 86844 -4785 209453 215044 75541 -165306 273712 56665 169379 -207717 -237024
7585 -237024 228575 -76835 63345 84772 -246997 -177157 85384 49540 59824 -99024 -67761
7574 -67761 -6554 -6687 231544 -55957 178417 -90495 -156385 -20257 -97584 98927 -68898 202102
7561 -69925 89432 90814 -297191 -268125 -125082 -42089 -413898 -82424 -117171 -95557 180921
7549 140004 3279 -61112 -34647 -145719 -56090 -169456 -76888 -63577 281009 45555 1757
7537 191920 -34370 -161196 175912 -33636 -254160 93499 270534 51299 17248 -209511 17812
7525 -218532 -88487 -168546 -167177 -111442 -18570 -278602 44122 236766 -132684 165309 229902
7514 229902 277957 -164266 -8097 179579 248571 113062 -144662 -322638 117633 -489927
7503 90245 -113369 -51971 238898 207263 -61332 -333452 133103 135659 -32905 178496 -131206
7491 34865 138586 247280 19871 125338 -31471 317761 34898 -85989 27303 11486 -209672
7479 -185535 -164929 -165418 -48195 102685 -48653 -113902 171220 -285046 -252783 86097 164703
7468 164703 -100924 -3571 112902 92320 -56386 -130379 -8846 157188 -175633 73713 -85415
7456 78750 -32264 -156957 42692 -130275 69677 -567649 58125 -153155 -48606 -77856 126744
7444 267916 -1515 234523 -5258 -27132 -236571 -292654 -136688 48751 29938 -131980 -308113
7433 -308113 118788 -82181 -228676 49490 256248 186933 354683 -101050 55120 135986 -106963
7421 9766 -72738 -135548 -51287 162868 12751 -12622 -247910 4239 198483 153703 -95864 -20633
7408 -87560 115475 396 -310310 99234 80521 -175922 -215309 154252 47472 -128409 82151
7396 200633 60167 -522650 195074 -216832 206545 94008 -154982 -77735 155578 178065
7386 178065 -8747 -161674 75138 -111359 -154169 12653 -87486 55008 225679 123156 -292770
7374 -184944 -42070 -132002 24058 20889 -24819 -32872 -369727 45150 -60643 136966 189445 -235331
7361 -125479 -86574 -121274 67776 67433 -112374 98029 116245 198317 270882 -164141 141689
7349 73842 -242731 130789 -90511 280396 63358 -270884 -284490 -31105 51544 -229807 -478378
7338 -478378 -105771 431604 -68522 93648 17780 -62981 -86189 -60231 40685 -77721 -82212
7327 -82212 -396270 -95015 35829 120681 72614 70390 241129 56067 -123798 5372 -27513 26789
7314 -312691 -154327 129017 -202921 -141271 -69304 -203954 -204810 238525 -58900 207003 80848
7302 -188967 -52032 -137469 206062 -28228 136724 107362 183647 -106180 -325717 -459256 -446348
7291 -446348 51948 -340965 -331629 -171324 42178 -494154 -80315 -66103 -59454 108163 -163203
7279 17743 -137136 -160015 122220 139554 -98043 -388459 -199459 -74876 264565 222992 -235377
7267 75636 -88977 239551 -57532 -222373 -92603 -170984 -320982 168263 -327033 -84587 427176
7255 31235 20405 68124 218447 -135061 81420 -68616 -132235 190913 303640 -51778 -62905
7244 -62905 -174890 19881 275973 -209330 90877 -52130 39921 61034 -53733 -38804 -6048
7232 -246598 -252010 -242767 41734 140735 -286182 94842 61963 -195192 83234 53845 -86488 -191494
7220 -191494 36191 -121620 124259 -19679 -28646 -224822 -65766 204677 -222876 46227 -152447
7208 -48192 84447 66177 19733 148551 -184308 63337 -33169 -71565 96372 184219 159567
7197 159567 44034 -50767 2127 142268 12174 -56052 194146 -32815 -208696 -85477 14967
7185 42548 -68184 -264393 86598 49669 -57134 -28373 -107953 -59267 23886 -473363 179652
7173 279063 -118709 -250732 -188010 131421 161385 -29483 -234443 -149803 136937 -172130
7162 118773 329624 139745 -47549 66936 -43963 170872 -258567 515335 191422 -189180
7151 212569 157447 -170676 44209 -4078 -420794 162329 -129583 -140788 -156873 -49897 -377663
7140 -377663 -98903 -137308 -198025 125621 -42832 -59802 20080 4479 18819 -22451 18373 30146
7128 30146 -334490 -64713 -124329 -119726 -43361 -318226 13796 -46954 112020 -35144 -133352
7117 -133352 13719 267244 197155 -72334 -314013 164354 -263077 392335 -250700 199453
7106 134251 -260686 110406 -189266 -13174 132311 -200274 -101468 117600 -363159 250514
7095 -45978 -193190 -153005 -265034 -297042 -221080 49661 -82489 1313 172746 202154 360492
7084 360492 -41728 -165606 18797 -25985 -147963 70099 -64540 75277 42547 218264 -76936
7072 137979 -79104 -118568 189639 91494 -20698 -276209 -54798 -25729 -44726 -128623 -278644
7061 -278644 61780 -43053 248385 -11505 252964 -54933 -125601 19427 -34105 44723 -179944
7049 48540 24458 -339805 -24083 -54196 6161 180770 -184712 62197 -74655 64474 1888 194992
7037 194992 -163810 30143 -81715 -218651 171878 126359 -343188 200270 79700 -26825 -89270
7026 -89270 74266 -136695 -81175 -78290 260550 146547 -90207 9168 -138486 98280 -87411
7014 264353 218921 -184995 -139697 -125643 35894 -174999 -139551 -156279 384081 -119672 -324119
7003 -324119 -96276 196872 46524 100284 -51388 87940 -63637 -105449 -354975 -11189 -42201
6992 -42201 103647 80468 56542 135008 -52004 -153295 120774 125890 245298 -105496 -80382
6981 -80382 87183 51593 18808 199601 28561 335842 -59545 -124357 622 14703 121190 81853
6969 81853 -88731 -252 38370 59991 -46589 -52167 118402 -73805 -60061 61193 -201945 207960
6956 36025 151556 -340569 -153425 144272 -229800 -30990 63265 -162283 225789 16600
6945 -233521 373665 152773 143612 163579 302972 249223 139381 -197763 -6566 224660 6513
6933 -62329 -250838 75319 75520 -148467 -189645 31086 -211658 111102 163363 -142088 194591
6921 65211 -313104 -64692 -116419 -32874 62785 16080 -57975 76910 34039 -68266 103486
6909 315858 -89025 63818 -89644 -172218 137951 228540 -124692 160161 -36630 -180572 -30186
6897 -261227 -436868 69130 -168439 -163677 -75909 -10844 -44437 -37123 -133398 -36649 -228549
6886 -228549 -421436 245398 -154797 202964 -67284 199516 -190471 -27053 133220 -45726
6875 -20436 -354377 -479840 -228898 -127681 22913 -111251 254980 -11114 -14989 -2688 -26709
6864 -26709 -88949 -76198 -1462 108832 -92624 -265818 239549 151257 -174064 130622 -78752
6852 -67227 -26565 130216 34426 51657 -147381 -136936 -106086 -29933 101759 -113138 -206215
6841 -206215 185986 -181762 25376 -60672 32363 46679 -37735 -189347 -120400 90278 -281967
6829 169267 -4128 -283140 -134315 116217 115808 -320762 -240699 117965 921 -136048 -154958
6818 -154958 -192841 -200887 -31453 -27171 254756 39523 349762 -45488 -34881 -190731 28323
6806 -525502 -63336 162565 -248257 79259 111975 119228 -119694 -134864 148257 51028 123414
6795 123414 95509 -209036 -14123 104946 -64569 -96453 -163469 -239344 -93806 10858 251726
6784 251726 -262511 -397680 -60285 17743 105810 -330594 -74309 -170364 -199009 -408243 113515
6772 -104673 200356 -325088 41254 -42514 274799 169509 -109451 290019 -11496 -13051 -98265
6761 -98265 -225065 53856 136494 77625 231394 -172076 -141137 -172281 -57992 -38142 -96502
6750 -96502 -58284 257702 -318031 241618 88117 73155 90258 -463333 112418 73707 -80483
6738 312891 -45974 -271727 246581 -74543 36236 11726 -66788 204355 37307 -115291 25614
6726 23983 250620 -143277 374500 -52866 155072 -53281 387516 -28002 28540 58221 87454
6715 87454 -23888 130322 -16726 -157404 31598 -197909 -363508 138670 -310750 -169937
6705 -169937 -80470 -346280 138346 -16017 283524 130341 217078 27162 166645 5061 273075
6694 273075 -142920 130363 56984 100978 245855 34027 -204668 -38227 256923 -31324 -3413
6682 650608 -115211 188219 -250386 125451 -308623 23346 -194795 -82781 -34352 164865
6671 157137 -213998 -530447 -356456 -9125 214516 -86570 20742 -453728 214466 48342 77082
6660 77082 -28892 -187952 -56663 194340 202277 -406933 98433 64178 46073 -131996 9729
6648 113749 -405839 -52410 -30861 -25830 2639 -92107 -26991 76945 307188 -75933 1850 51052
6636 51052 52674 108284 -77749 -85020 -135376 -110115 -100645 189928 75683 -246676 -251616 69989
6623 -93755 149143 -15472 -62967 -149074 -123775 224061 31031 369306 -342342 -27084 80279
6611 -238393 -175979 -299425 195120 -118870 95762 -70794 -184531 299332 -200306 -8584 163024
6599 -66801 72099 -219216 106089 101439 9953 248400 -149143 -58985 96576 -218588 -294617
6588 -294617 -118371 46522 -142343 -121869 -1235 122888 -71970 -45106 -307622 208001 -276952
6576 -39962 10477 268562 -39630 -103381 196458 243168 218988 232455 181187 40476 -207966
6564 -217979 -88737 -163334 -146842 104480 -134634 67645 48383 -218551 -191016 407483 44341
6552 90119 17274 -51205 -179747 -21524 337685 -172846 -110544 -318871 7020 7342 18260 103665
6540 103665 68070 178231 -349777 -6721 119547 108331 -125775 142229 -91682 -156341 102729
6528 100814 -112423 -169091 -211582 -328079 140721 -106677 129436 32669 -389733 325300
6517 340267 1833 137669 -91980 -158119 -171399 -99630 -44964 -62059 -268701 82640 179530
6506 179530 195710 118343 -21728 -231884 -302357 -203450 -276253 -316753 45238 -181634 194447
6494 -6242 91226 139301 -143140 -459290 -47892 8254 11243 -7374 254385 91117 196908 -140674
6481 -160753 101089 16136 -116201 101215 55211 -232153 -139234 -131095 282263 226851 970
6469 -354655 -896 -217770 -70780 -223165 13052 -177669 -443976 247510 340477 307085 194085
6458 194085 136900 78935 4201 7654 -193396 -100884 -204762 159541 119215 -184986 14069
6446 124200 -133457 -65605 493329 124205 -223689 -335056 150966 -15836 100534 95139
6436 95139 169372 -280222 -82161 85875 54376 10765 -3811 -334225 -154890 -185094 39374
6424 -212995 143287 136961 -373139 -56263 78026 -149720 -282832 -117769 -69722 38058 182129
6413 182129 189224 -13973 235920 -141673 -256808 -82202 21896 -177617 136200 -67016 106285
6401 -219767 -122539 -51051 -215883 -11473 58741 83789 -54155 -7322 -114092 -110271 52561 240911
6389 240911 -11492 130050 -334690 -150037 -49988 -152166 -379712 -204428 110318 -29163
6378 114460 179670 68459 -22908 75141 -209469 169059 -88410 -237599 -149379 -17781 -132307
6367 -132307 209802 -264140 170311 269954 146112 -35933 -284777 54439 -54039 115312
6356 219631 35285 -137639 -365758 198418 -49232 29063 243705 97423 64783 -247856 -250906
6345 -250906 204309 59681 8902 -8775 -393465 133675 -134177 -106386 141394 293447 157240
6334 157240 -25237 -132299 199730 -111905 -205065 167833 -145505 -176739 78203 -114554
6323 -116225 -58834 -108981 120559 -158963 -10845 -74858 240653 -50266 157880 106414 -162206
6311 -336320 -196926 337532 127709 148257 -117631 -302692 -70726 23854 -93597 283209
6300 -80767 -87268 -120882 -57070 -73664 21277 -170474 -122000 14554 141097 -127976 -12214
6288 87947 517737 146746 -42577 285364 12511 594069 146122 150314 103315 132218 -199823
6276 289869 215134 70481 -299273 100999 -20808 173665 -41200 -279081 -243966 -378440 19238
6264 50592 -149480 -148870 85678 -303996 443565 -47817 -343797 59786 -78633 -49982 171745
6252 -37086 116695 150186 106278 70455 -231714 74345 78639 -84850 18447 89825 140627 2690
6239 -192033 -294878 226810 -162251 -36476 -199115 -160102 -15420 55805 -3585 224329 -107040
6227 154293 -118409 -189720 243143 155838 12046 -121362 240020 -5223 -33359 -71193 -239450
6216 -239450 -293613 -128484 -156527 -250048 62879 -30242 -256661 1059 -55135 -191836 61525
6204 -67935 -250298 108514 -57841 -331507 89822 -4504 -271438 -200009 77872 48063 -340845
6192 191051 -159538 522672 -260062 93116 -116588 145030 -135765 -630 -109623 32896 116659
6181 116659 113098 49671 -281490 137372 -257040 -16864 -29287 -198743 -17118 109960 -49816
6169 21788 62342 -89831 309984 -404695 301872 294083 -172524 -42977 291249 -31178 249652
6157 -116782 196581 231941 26517 -105694 25130 -558178 -171046 -33359 276067 149710
6147 149710 -104546 -23476 43355 150929 250193 256718 69078 180609 -328259 -194938 -23404
6135 -9583 -71998 -84138 166212 347532 232874 -62539 230874 -175966 -210772 -57797 110776
6123 -75273 -244271 17331 -331657 -131349 30184 -59201 -117183 42721 -111119 -86990 -44453
6112 -44453 -9640 39959 16151 205218 -173687 126151 185099 -92247 10038 110645 48691
6100 7410 235532 105667 53895 80493 -40011 133718 -336517 -140714 258245 120268 81973
6089 81973 97038 -66000 -231001 -119357 357707 76310 56654 -55298 126360 -24649 400282
6077 229961 -127540 29390 73159 -26130 -28784 -32727 301109 54744 8276 -39404 -25133 42141
6064 -56708 200749 -121705 -66061 -52316 -63480 86336 60296 59088 225021 30454 -15969
6052 206302 96073 -197649 124932 119236 212797 -161528 -258075 114123 -122917 -77314 -266776
6041 -266776 -113578 -211564 -212091 -71303 -205723 -112149 -12101 -274606 200074 -47538 8948
6029 -81364 -82835 340610 -140024 -163513 -244860 130700 -72475 -49728 -94936 346894 60140
6017 -183679 -193797 -92262 -48855 -34403 37504 -152962 -305997 -38204 -39786 152033 98402
6006 98402 160872 148251 13634 161039 -92514 -14126 89297 -181779 84616 -149562 -150700
5995 -150700 107057 -22110 152206 -122619 -367039 -163902 -93655 225807 22969 -206347
5984 -27888 141747 -138087 -46835 -159171 -255639 166985 21998 -118453 -267095 334344
5973 -144295 -346728 -181646 28556 -25223 -222334 -52464 238082 -29749 130605 -226137
5962 39663 -178889 46400 52845 265587 189262 112969 -123751 269098 159755 -37267 -993
5950 28351 -140691 58022 31895 186740 56936 120499 27174 -47762 130738 -388957 29680
5938 149762 -53857 309386 192152 357743 93517 -107797 -179921 384529 159545 -182115
5927 -12571 -29200 -96713 217128 -223792 -342191 -73540 58852 -357245 102941 -61831 -78167
5916 -78167 174839 -79026 463468 94050 -8520 -7802 325904 -215862 5925 -171215 -40890 -12368
5903 16718 36397 -92092 -114305 -18545 30158 183706 -72566 -254893 209020 -368646 -119367
5891 229544 -158823 -97585 -70238 160369 239894 237437 -237296 -51510 -90426 19633 192650
5880 192650 -17484 29806 193478 -218460 46509 175859 410945 336375 135060 -160207
5869 -116919 -79552 -335983 -32216 28594 -526324 93324 -103403 126676 -195582 -267869 -216884
5858 -216884 -143378 -145248 139579 159705 -108237 -264780 -58512 230714 187199 195486 -49298
5846 233244 -443193 -15952 143421 38318 241634 8429 -127804 -91049 -336112 72745 108164
5835 108164 80562 -54236 -373693 139825 132150 -108606 239364 50785 47056 -129928 -193030
5824 -193030 430952 -418577 -283028 181684 197237 -100439 69451 -115408 -365378 -7872
5813 221868 -169539 -34160 -100505 -6288 131848 -206693 -313939 -15796 -268507 12500 -55041
5801 -285422 -162378 26923 8897 -17485 -182717 50380 -232002 -88162 180000 -244720 208751
5789 244237 -121806 -214299 -61952 -19889 -160525 120526 -201102 -77705 174723 322094
5779 322094 -188517 -207028 41026 -123933 -45563 6068 -425044 -77513 99704 -241324 93929
5767 39813 47951 199078 -189287 -115608 20857 -18180 -119850 -88633 -89577 138988 149711 92695
5755 92695 3590 66937 129324 -12558 11172 -175513 128688 35340 -156905 253742 -172610
5743 162784 76234 -943 -51648 -31657 -235764 -273886 -115715 -113818 3428 -223151 203024 201958
5731 201958 50822 86544 37430 -98608 -178290 -2839 307365 -156621 -118882 -103136 102261
5719 -201466 -128130 -149529 15098 67958 -94821 129349 127791 -177380 31872 -20770 -159487
5708 -159487 48492 429520 160848 -54071 40891 -363941 396325 119682 8609 89850 -139813
5696 -66059 -98565 200651 -107114 159635 -99592 -192481 96227 323025 -114050 -80008 -156228
5685 -156228 28251 -75148 162049 -260647 14835 -194291 -180448 125037 -82970 33666 350310
5674 350310 273541 -105677 4033 26631 62102 134356 19628 28059 194188 75251 -175754
5662 33557 -124489 -5155 101880 -152389 -142385 -7429 220453 -11914 98238 61506 -4632 -54700
5650 -54700 -190649 -213321 -19306 140874 260069 -152203 -537439 108958 326142 87758
5639 186122 -97785 27864 -224158 25889 -36786 162521 -149146 -417750 100108 171176 81235
5627 166954 -309205 84908 121454 13858 170402 177776 -201494 -318172 -93595 -406898 -203058
5615 -33507 164094 -155604 -38327 -12853 121624 -183032 114649 -328632 -226493 -5292 143544
5603 -162815 -51959 183002 18448 126044 61086 224204 -334702 49873 -106831 -36381 -23465
5592 -23465 168474 -24559 234032 -259353 258294 301417 -228698 -83887 4477 2098 157165
5581 157165 -79735 -70062 140662 -37874 20933 69444 33919 73868 -158800 187974 159477
5570 159477 -81132 -20820 45324 156128 -287815 -51932 -90176 170239 188862 109672 63428
5559 63428 319932 -377352 -70606 -12882 197722 -101347 127461 141520 80358 -12134 -19787
5548 -19787 2468 22864 34407 -40839 250228 28743 418598 -275129 -42488 -28676 20532
5536 -265485 190149 48143 -354984 116682 366849 -31935 153085 -11173 49394 380709
5526 380709 67993 -452523 16035 76903 111540 -159185 234496 -67262 -260292 21567 385598
5515 385598 -26488 21956 -88694 -220199 162334 73156 168202 -315065 121607 93368 -156685
5503 -88433 -152338 -138351 2574 54697 -244307 227926 -265421 25706 -10852 -162852 37903
5491 82759 165216 155602 -199476 172372 -91278 -47102 -363390 79164 155256 131199 128294 -481175
5478 468726 173497 -42384 -238524 8146 -228857 -209784 359030 183202 -37803 196170 -52568
5466 2944 110626 -83247 -247360 113840 62472 75872 -266153 -53753 -320832 -115079 -14059
5454 25795 -154619 -198199 -127423 -261050 -256740 33884 107163 58701 -93537 258295 -81191
5442 -9509 246821 56708 154107 34923 418648 -246492 -127042 35479 142817 -232748 -246591
5431 -246591 18545 250046 -53089 130932 160183 -176085 40364 -81714 173416 -242934 -62804
5419 -4769 -70651 -168060 109155 -24328 61267 29309 -2618 -134610 43497 -112063 -24533 250098
5406 -88695 60106 -369593 160274 -17905 -134578 72163 -175293 58241 -170599 -198972 69662
5394 26697 109468 68744 337859 125818 -175603 -202469 -32201 80120 -181178 79090 58018
5383 58018 185080 487219 316841 -239877 -236230 -52936 -186621 211814 11215 -8571 107321
5371 -165357 -54707 -229681 315046 25782 -121343 -263839 -61997 259484 87349 -28970 40391
5359 110703 -305725 -25705 -284552 324775 351191 -22202 -16267 -95488 39190 196257 25823
5347 -21864 3932 179890 -43444 277516 32348 190199 -37391 101872 228151 37180 -166197
5335 -230709 211306 -253430 -94255 -37238 -104598 -175329 124146 208322 23905 85847 -71640
5323 -191418 9055 94457 65501 185778 72059 -115893 -390738 -337834 -38928 -128858 25861
5311 -37853 162983 -55725 -67450 69727 -105861 109580 103251 270739 300945 148447 197666
5300 197666 -21973 48785 10848 177566 -14211 -105897 151383 83698 -154905 57234 -8895
5288 -158678 -85639 -461567 -234893 -186537 -361108 222834 224687 -198912 -18517 -95224 124042
5276 -210629 -82375 361118 175537 127478 -282744 66694 -11847 138101 249238 3663 -177538
5264 -162208 29039 -119470 -292627 167658 24048 164770 -8554 259653 72179 70043 239707
5253 239707 99059 -21943 -189593 8414 148877 -36183 122278 107885 71763 49735 -175637
5241 -8308 85061 -187877 -85059 144350 117360 -37715 83025 -77667 115033 355063 -114207
5229 924 37577 32153 -157518 -218715 395480 54928 -42769 -166409 317088 142301 -29046
5217 29053 223812 -144117 -238765 174385 -219882 -119666 169327 472401 -162391 -21829
5206 -57071 54535 117197 -257875 291 -85596 -35894 -13972 -158267 -73394 -69564 117310 91234
5194 91234 59189 -151421 175037 -59895 277832 97333 -97407 -403331 -40888 -296534 65457
5182 -89573 -33350 38873 -276265 14570 206624 -24050 353572 -38085 -191858 -150677 -83203
5171 -83203 -124290 -312135 351601 217788 164552 40794 -81621 22559 273957 -125545 -92706
5160 -92706 170668 35247 142206 73515 -164747 22846 246288 28247 -326061 -137583 -7115
5148 -113711 10536 -161703 -68748 -183520 160547 -102364 -203734 83633 372513 307237
5138 307237 -29352 -45315 -325227 -277503 -103525 171059 -38800 398343 -199174 344849
5127 165082 -245537 -172354 -61316 -310136 11461 191254 -55577 -151994 -263939 42529 -24885
5115 -193210 -312445 -289099 172463 196373 -169193 -26978 -347213 9089 -57265 -62831 -91703
5104 -91703 -125531 -1740 -172298 263370 93701 -56902 -99756 121910 -174780 -114728 -9203
5092 247691 -262508 27819 76002 132729 -18673 65089 -192748 66637 -140384 340896 122580
5080 -216794 15323 54634 74529 34794 -170759 21169 49902 -131751 -90602 89458 63016
5069 63016 -43703 2753 17334 74617 60497 -21148 321939 -230243 -51263 7377 -89522 334469
5056 -18083 140083 -249670 94360 163572 -189481 34196 408184 -108745 162978 -277707
5045 -117054 -21850 -148162 -231590 133869 113038 143634 253335 112008 85781 -389924 -25643
5033 -150086 -206454 43912 117673 97579 223446 -114952 -200225 -73285 -111350 110323 -105809
5021 81711 -21299 118518 -209597 196236 102641 209760 72148 110803 -334606 -377 -361233
5010 -361233 -150791 -116201 -256759 190780 -48013 -48107 119076 107577 394785 188189 -175707
4998 51289 298159 -196569 107594 -49778 -30070 198285 69365 245952 -129768 44511 320134
4987 320134 -105908 -179700 -113086 -22373 -245557 209331 276482 2516 -256538 142855 41737
4975 -68238 4732 354278 -255998 -85510 -198126 -27634 21795 97447 118216 -72881 -88323
4964 -88323 -154475 181564 2092 126662 -309439 55657 -18583 215956 -96151 71821 220055
4953 220055 28210 8498 -65213 -7740 -166532 -161434 220173 -124273 402585 -125043 156611
4941 -216994 143388 -27559 183465 3102 -110047 -162722 50938 303354 -202590 458279 -109006
4929 163744 103929 91258 -112399 160143 -245773 -303997 96542 -247691 -82104 -85857 -229405
4918 -229405 -142664 168457 7190 117966 21593 -78793 -148596 -176724 -253823 176456 -110818
4906 -111716 -293136 55896 145760 -194837 15787 182012 37314 196108 -25801 -12220 305458
4894 120378 65465 -194472 -362845 15522 26043 107317 264807 31560 228244 -39474 -42908
4883 -42908 393295 -145527 26895 242370 91695 151005 -63829 129965 303208 -93173 85637
4871 -57286 26281 -72238 -149468 -127436 109585 189696 28662 -86690 -138503 -258831 97326
4859 -27911 38749 -209129 -186628 -88511 15152 -31650 -221820 132562 119332 74713 39822
4848 39822 6591 40098 319664 28066 -44710 -59875 -50931 24851 45729 -78758 -106257 -132372
4836 -132372 45500 305343 103674 102173 -21328 -133201 113531 -32786 -163202 -202322 -38560
4824 -411241 192245 -298299 135927 -203096 -184860 -69809 7436 79723 10662 -215237 198792
4812 194452 241620 -100243 24221 -83408 -182227 185390 -145390 -60863 -170536 92717 27567
4800 57839 -282791 5508 103157 -48767 -17014 189122 75322 66401 -109913 -20681 -54213 -133792
4788 -133792 -385560 -78536 -142542 -48780 -112422 -35669 204363 137723 -41115 -146654 168054
4776 166580 -65667 22365 100712 46896 -259381 -18064 111149 -123655 15306 -22830 13722
4764 68978 42609 -363644 192994 -185798 167632 129924 -143530 283429 155685 141876
4754 141876 -154442 -301324 71457 -68290 30920 -338919 -126103 339566 -192506 -71894
4743 99861 -266074 -21073 179114 -196426 3222 216469 75879 35425 33945 -58191 133920
4731 134099 78048 279950 52183 125317 -228012 187563 -150584 -43533 107594 491330
4721 491330 -288260 -89909 -304967 46086 -364392 233807 215073 191951 121144 -90681 -131500
4710 -131500 -193967 169797 320798 186853 -23594 180177 51124 130676 -125869 -84116 -116752
4699 -116752 148750 204867 -178287 137730 -162476 494 -291690 -395240 -114478 -19209 67761
4687 -269133 -16815 449423 8104 27647 361820 -122673 -11679 56755 -218128 -77557 -201856
4676 -201856 -22320 323921 61214 -26125 -177157 127144 -83125 275715 48991 197521 210104
4665 210104 -111245 268041 -103408 -200810 -116705 -98377 -205447 31336 7459 -115305 15759
4653 140240 31304 18712 106687 -192946 -91110 215567 163922 -215202 187896 102569 -127748
4641 144906 -342730 -402196 160231 -53519 -205363 147353 -60965 -358927 154773 35260
4630 -65043 -106392 -228218 14492 105143 15962 -24527 126750 186029 138412 -69993 126527
4618 -163422 -183638 70301 65015 135218 47007 65732 135058 523639 -234847 117209 -177579
4606 132457 -3608 -63154 47327 -161753 70685 -59230 -121640 -66835 -80505 189237 -208981
4594 -211603 -57317 224942 123172 124340 137321 75867 31462 145050 75248 106468 -23333
4582 59857 263717 -120722 -67163 -46278 -77843 31785 249214 37187 11030 -97056 104134
4570 -65061 233756 132126 -217155 232079 332870 228607 171908 166676 -509 38843 -67095
4558 -13209 -95433 323221 -166029 -345047 1085 9109 -155054 32755 -178415 189364 -13983
4546 386194 -18113 -55019 -194345 172908 -188110 4367 -78389 200231 137871 87369 66890
4535 66890 -75390 187919 -9930 7779 148798 -47649 64227 125032 210414 -131621 -261977
4524 -261977 152828 -123209 158667 210227 -333244 177640 -329299 233465 42585 2011
4513 286460 138856 -36172 63033 -161085 90914 322610 -95367 -176589 -29759 -101557 -301205
4502 -301205 -95635 33151 -94109 -130616 168169 -93035 -391847 -159581 -352969 63413 -178813
$$ [...]
##END NTUPLES=NMR SPECTRUM
##END=
