##TITLE=AC1731_SEN00004_9275852_enZKttmQui
##JCAMPDX= 6.0         $$ Bruker NMR JCAMP-DX V2.0
##DATA TYPE= NMR SPECTRUM
##DATA CLASS= NTUPLES
##ORIGIN= BRUKER
##OWNER= Administrator
$$ 1.72 TOPSPIN		Version 2.1
$$ 2015-07-14 21:36:52.947 -0700  Administrator@X
$$ Compression mode = diff/dup
##.OBSERVE FREQUENCY= 400.02188249412
##.OBSERVE NUCLEUS= ^1H
##.ACQUISITION MODE= SIMULTANEOUS (DQD)
##.ACQUISITION SCHEME= undefined
##.AVERAGES= 64
##.DIGITISER RES= 22
##SPECTROMETER/DATA SYSTEM= spect
##.PULSE SEQUENCE= noesygpps1d.comp
##.SOLVENT NAME= COFFEE_meoh
##.SHIFT REFERENCE= INTERNAL, COFFEE_meoh, 1, 14.96097
##AUDIT TRAIL= $$ (NUMBER, WHEN, WHO, WHERE, PROCESS, VERSION, WHAT)
$$ ##TITLE= Audit trail, TOPSPIN		Version 2.1
$$ ##JCAMPDX= 5.01
$$ ##ORIGIN= Bruker BioSpin GmbH
$$ ##OWNER= Administrator
$$ $$ E:\/data/COFFEE/nmr/AC1731_SEN00004_9275852_enZKttmQui/12/pdata/1/auditp.txt
$$ ##AUDIT TRAIL=  $$ (NUMBER, WHEN, WHO, WHERE, PROCESS, VERSION, WHAT)
(   1,<2015-07-14 21:36:47.822 -0700>,<Administrator>,<X>,<go>,<TOPSPIN 2.1>,
      <created by zg
	started at 2015-07-14 21:25:18.197 -0700,
	POWCHK enabled, PULCHK disabled,
       configuration hash MD5:
       21 0F 79 D6 B3 7B B4 F6 88 20 88 DB 03 48 BD 9F
       data hash MD5: 64K
       0E 33 7B 45 E8 81 89 C3 EC FF 7B 83 B2 1E 26 63>)
(   2,<2015-07-14 21:36:50.979 -0700>,<Administrator>,<X>,<proc1d>,<TOPSPIN 2.1>,
      <Start of raw data processing
       efp LB = 0.3 FT_mod = 6 PKNL = 1 PHC0 = 0 PHC1 = 0 SI = 128K 
       data hash MD5: 128K
       3F 4A 33 56 CA 42 1A 42 CD 87 E8 45 61 2B 02 04>)
(   3,<2015-07-14 21:36:52.025 -0700>,<Administrator>,<X>,<proc1d>,<TOPSPIN 2.1>,
      <pk PHC0 = -87.47864 PHC1 = 0 
       data hash MD5: 128K
       AC 75 93 52 D5 C5 5B E2 DF 69 D7 5F 57 47 45 8E>)
(   4,<2015-07-14 21:36:52.432 -0700>,<Administrator>,<X>,<proc1d>,<TOPSPIN 2.1>,
      <abs ABSG = 1 
       data hash MD5: 128K
       84 F3 78 68 6C AF 80 C8 30 D8 13 9F 50 99 C2 BE>)
(   5,<2015-07-14 21:36:52.525 -0700>,<Administrator>,<X>,<proc1d>,<TOPSPIN 2.1>,
      <abs ABSG = 2 
       data hash MD5: 128K
       62 E4 D4 C3 F9 DB D5 B0 C7 FD EF 11 B9 C1 14 4A>)
(   6,<2015-07-14 21:36:52.604 -0700>,<Administrator>,<X>,<proc1d>,<TOPSPIN 2.1>,
      <abs ABSG = 3 
       data hash MD5: 128K
       F5 B9 15 5D 4A 06 9D ED 8F FC B6 4E 14 79 47 77>)
(   7,<2015-07-14 21:36:52.682 -0700>,<Administrator>,<X>,<proc1d>,<TOPSPIN 2.1>,
      <abs ABSG = 4 
       data hash MD5: 128K
       F7 24 10 41 05 F5 E1 80 C2 B1 CB 90 F5 1B A5 D8>)
(   8,<2015-07-14 21:36:52.775 -0700>,<Administrator>,<X>,<proc1d>,<TOPSPIN 2.1>,
      <abs ABSG = 5 
       data hash MD5: 128K
       54 4D 73 27 1C F6 36 ED 58 0E 83 25 91 CF 05 52>)
$$ ##END=
$$ 
$$ $$ hash MD5
$$ $$ 3C FA EA A8 CD 86 D8 3F 4B 67 1D F6 79 3C 83 A6
##$RELAX= 
##$RELAX= 
##$RELAX= 
##$RELAX= 
##$RELAX= 
##$RELAX= 
##$RELAX= 
##$RELAX= 
$$ Bruker specific parameters
$$ --------------------------
##$DU= <E:\>
##$EXPNO= 12
$$ [...]
##$TP07= 0
##$TPNAME0= <>
##$TPNAME1= <>
##$TPNAME2= <>
##$TPNAME3= <>
##$TPNAME4= <>
##$TPNAME5= <>
##$TPNAME6= <>
##$TPNAME7= <>
##$TPOAL= (0..7)
0.5 0.5 0.5 0.5 0.5 0.5 0.5 0.5
##$TPOFFS= (0..7)
0 0 0 0 0 0 0 0
##$TUNHIN= 0
##$TUNHOUT= 0
##$TUNXOUT= 0
##$USERA1= <user>
##$USERA2= <user>
##$USERA3= <user>
##$USERA4= <user>
##$USERA5= <user>
##$V9= 5
##$VALIST= <valist>
##$VCLIST= <CCCCCCCCCCCCCCC>
##$VD= 0
##$VDLIST= <DDDDDDDDDDDDDDD>
##$VPLIST= <PPPPPPPPPPPPPPP>
##$VTLIST= <TTTTTTTTTTTTTTT>
##$WBST= 2048
##$WBSW= 25
##$XGAIN= (0..3)
0 0 0 0
##$XL= 0
##$YL= 0
##$YMAX_a= 5845450
##$YMIN_a= -11136013
##$ZGOPTNS= <>
##$ZL1= 120
##$ZL2= 120
##$ZL3= 120
##$ZL4= 120
##$ABSF1= 14.96097
##$ABSF2= -5.597212
##$ABSG= 5
##$ABSL= 3
##$ALPHA= 0
##$AQORDER= 0
##$ASSFAC= 0
##$ASSFACI= 0
##$ASSFACX= 0
##$ASSWID= 0
##$AUNMP= <proc_prof1d_extract.lims>
##$AXLEFT= 0
##$AXNAME= <>
##$AXNUC= <1H>
##$AXRIGHT= 0
##$AXTYPE= 0
##$AXUNIT= <>
##$AZFE= 0.1
##$AZFW= 0.1
##$BCFW= 0
##$BC_mod= 0
##$BYTORDP= 0
##$COROFFS= 0
##$CY= 15
##$DATMOD= 1
##$DC= 0
##$DFILT= <>
##$DTYPP= 0
##$F1P= 0
##$F2P= 0
##$FCOR= 0.5
##$FTSIZE= 131072
##$FT_mod= 6
##$GAMMA= 0
##$GB= 0
##$INTBC= 1
##$INTSCL= 1
##$ISEN= 128
##$LB= 0.3
##$LEV0= 0
##$LPBIN= 0
##$MAXI= 10000
##$MC2= 0
##$MEAN= 0
##$ME_mod= 0
##$MI= 0
##$NCOEF= 0
##$NC_proc= -2
##$NLEV= 6
##$NOISF1= 0
##$NOISF2= 0
##$NSP= 0
##$NTH_PI= 0
##$NZP= 0
##$OFFSET= 14.96097
##$PC= 1
##$PHC0= -87.47864
##$PHC1= 0
##$PH_mod= 1
##$PKNL= yes
##$PPARMOD= 0
##$PPDIAG= 0
##$PPIPTYP= 0
##$PPMPNUM= 2147483647
##$PPRESOL= 1
##$PSCAL= 4
##$PSIGN= 0
##$PYNMP= <proc.py>
##$REVERSE= no
##$SF= 400.020009647028
##$SI= 131072
##$SIGF1= 0
##$SIGF2= 0
##$SINO= 400
##$SIOLD= 131072
##$SPECTYP= <>
##$SREGLST= <1H.CDCl3>
##$SSB= 0
##$STSI= 131072
##$STSR= 0
##$SW_p= 8223.68421052631
##$SYMM= 0
##$S_DEV= 0
##$TDeff= 65536
##$TDoff= 0
##$TI= <>
##$TILT= no
##$TM1= 0
##$TM2= 0
##$TOPLEV= 0
##$USERP1= <user>
##$USERP2= <user>
##$USERP3= <user>
##$USERP4= <user>
##$USERP5= <user>
##$WDW= 1
##$XDIM= 131072
##$YMAX_p= 425024441
##$YMIN_p= -11576
##$CURPLOT= <Network HP LaserJet P1505>
##$CURPRIN= <$Network HP LaserJet P1505>
##$DFORMAT= <normdp>
##$LAYOUT= <+/1D_H.xwp>
##$LFORMAT= <normlp>
##$PFORMAT= <normpl>
##$SURQMSG= 1
$$ End of Bruker specific parameters
$$ ---------------------------------
##NTUPLES= NMR SPECTRUM
##VAR_NAME=  FREQUENCY,     SPECTRUM/REAL,   SPECTRUM/IMAG
##SYMBOL=    X,             R,               I
##VAR_TYPE=  INDEPENDENT,   DEPENDENT,       DEPENDENT
##VAR_FORM=  AFFN,          ASDF,            ASDF
##VAR_DIM=   131072,        131072,          131072
##UNITS=     HZ,            ARBITRARY UNITS, ARBITRARY UNITS
##FACTOR=    0.0627417313425164, 1,          1
##FIRST=     8223.62146879497, 885,          -51609
##LAST=      0,             1755,            -52011
##MIN=       0,             -11576,          0
##MAX=       8223.62146879497, 425024441,    0
$$ Real data points
##PAGE= N=1
##DATA TABLE= (X++(R..R)), XYDATA
$$ [...]
$$ plain form
63919 4583217 4364266 4126754 3877575 3623516 3369993 3120620 2878171 2645546 2425713
63910 2425713 2221200 2033805 1864318 1712309 1576591 1456041 1349689 1256167 1173867 1101840
63900 1101840 1039803 986923 941271 900898 864880 832835 804000 777386 752447 728943 706454
63889 706454 684557 663299 642979 623645 605248 588054 572369 558019 544623 532360 521993
63878 521993 514080 508553 505104 503625 504151 506608 510764 516329 523131 531270 541058 552740 566356 581790
63864 581790 598731 616461 634022 650782 666700 681927 696368 709749 721816 732271 740749 747044
63852 747044 751151 752993 752413 749557 744844 738351 729616 718397 705221 690824 675382 658651 640529
63839 640529 621129 600599 579285 557749 536252 514581 492828 471859 452392 434044 416065
$$ packed form
63919D583217k18951k37512k49179k54059k53523k49373k42449k32625k19833
63910B425713k04513j87395j69487j52009j35718j20550j06352r3522q2300p2027
63900A101840o2037n2880m5652m0373l6018l2045k8835k6614k4939k3504k2489
63889G06454k1897k1258k0320j9334j8397j7194j5685j4350j3396j2263j0367
63878E21993p913n527l449j479N26K457M156N565O802Q139R788J1682J3616J5434
63864E81790J6941J7730J7561J6760J5918J5227J4441J3381J2067J0455Q478O295
63852G47044M107J842n80k856m713o493q735j1219j3176j4397j5442j6731j8122
63839F40529j9400k0530k1314k1536k1497k1671k1753k0969j9467j8348j7979
$$ plain form
63828 416065 398706 382962 369092 356401 344549 334060 325214 317316 309638 302401 296185 290804 285506
63815 285506 280088 275187 271454 268895 267077 265664 264592 263926 263619 263351 262588 260897 258278 255200 252309
63800 252309 250045 248414 247071 245670 244190 242912 242058 241456 240504 238505 235177 230919 226542 222744 219884
63785 219884 218095 217260 216830 216064 214683 213106 211908 211322 211354 211895 212424 212109 210787 209457 209164 209641 209745
63768 209745 209039 208076 207125 205643 203418 201467 201105 202464 204417 205665 205533 204032 201759 199688 198591
63753 198591 198570 199278 200488 202177 204143 205915 207151 207986 208922 210401 212426 214558 216376 217982 219945
63738 219945 222680 226023 229406 232262 234227 235303 236096 237568 240125 243057 245264 246535 247768 249917
63724 249917 253100 256890 261109 265929 271380 277151 282914 288511 293696 297901 300554 301548 301235 300017 298080
$$ packed form
63828D16065j7359j5744j3870j2691j1852j0489q846p898p678p237o216n381n298
63815B85506n418m901l733k559j818j413j072o66l07k68p63j691k619l078k891
63800B52309k264j631j343j401j480j278q54o02r52j999l328m258m377l798k860
63785B19884j789q35m30p66j381j577j198n86L2N41N29l15j322j330k93M77J04
63768B09745p06r63r51j482k225j951l62J359J953J248j32j501k273k071j097
63753A98591k1P08J210J689J966J772J236Q35R36J479K025K132J818J606J963
63738B19945K735L343L383K856J965J076P93J472K557K932K207J271J233K149
63724B49917L183L790M219M820N451N771N763N597N185M205K653R94l13j218j937
$$ plain form
63709 298080 295451 292133 288216 284083 280419 277707 275659 273506 271049 269078 268509 269383 270985 272686 274302
63694 274302 275894 277729 280349 284106 288576 292838 296400 299471 302256 304506 305942 306722 307107 306989 306083
63679 306083 304446 302536 300882 299906 299873 300766 302295 304193 306377 308695 310740 312175 313050 313500 313392 312635
63663 312635 311690 311240 311275 310983 309691 307489 304706 301219 296786 291822 287265 283631 280592 277585 274411
63648 274411 271053 267356 263356 259731 257403 256647 256975 257878 259232 260872 262295 263262 264380 266599 270220
63633 270220 274750 279601 284446 288949 292768 296097 299785 304517 310131 316071 322305 329408 337760 347124
63619 347124 357128 367856 379729 392942 407286 422512 438695 456192 475445 496890 520870
63608 520870 547378 575940 605874 636543 667006 695456 719576 737878 750487 758314 761713 760504
$$ packed form
63709B98080k629l318l917m133l664k712k048k153k457j971n69Q74J602J701J616
63694B74302J592J835K620L757M470M262L562L071K785K250J436P80L85j18r06
63679C06083j637j910j654r76l3Q93J529J898K184K318K045J435Q75M50j08p57
63663C12635r45m50L5k92j292k202k783l487m433m964m557l634l039l007l174
63648B74411l358l697m000l625k328p56L28R03J354J640J423R67J118K219L621
63633B70220M530M851M845M503L819L329L688M732N614N940O234P103Q352R364
63619C47124J0004J0728J1873J3213J4344J5226J6183J7497J9253K1445K3980
63608E20870K6508K8562K9934L0669L0463K8450K4120J8302J2609P827L399j209
$$ plain form
63596 760504 755252 747845 740397 733810 727649 721190 714168 706536 697858 687213 673690 656912 637138
63583 637138 615044 591583 567964 545482 525080 507084 491358 477645 465724 455488 447055 440646
63571 440646 436181 433232 431658 431991 434722 439342 444653 450054 455883 462352 468777 474400 479507 485109
63557 485109 491688 498866 506413 515092 526228 540592 557865 577154 598002 621022 647690 679506
63545 679506 717041 759211 802949 843701 876878 899496 910749 911412 903290 889260 873056 858074
63533 858074 846132 837425 831348 826986 823075 818181 811141 801127 787340 769068 746219 719538 690217
63520 690217 659447 628337 597890 568883 541919 517567 496085 476961 459191 442302 426772
63509 426772 413186 401366 390765 381380 373651 367515 362195 357084 352325 348280 344873 341806 339113
$$ packed form
63596G60504n252p407p448o587o161o459p022p632q678j0645j3523j6778j9774
63583F37138k2094k3461k3619k2482k0402j7996j5726j3713j1921j0236q433o409
63571D40646m465k949j574L33K731M620N311N401N829O469O425N623N107N602
63557D85109O579P178P547Q679J1136J4364J7273J9289K0848K3020K6668L1816
63545F79506L7535M2170M3738M0752L3177K2618J1253O63q122j4030j6204j4982
63533H58074j1942q707o077m362l911m894p040j0014j3787j8272k2849k6681k9321
63520F90217l0770l1110l0447k9007k6964k4352k1482j9124j7770j6889j5530
63509D26772j3586j1820j0601r385p729o136n320n111m759m045l407l067k693
$$ plain form
63496 339113 337083 335782 334971 334409 333934 333378 332694 332145 331995 332016 331678 330889 330201 330155 330774 331897 333703 336505
63478 336505 340190 344189 347930 351115 353618 355416 356681 357692 358535 359005 358807 357768 355848 353070 349465
63463 349465 345050 339925 334492 329482 325586 323074 321848 321763 322632 324002 325235 325981 326445 327132 328475 330761
63447 330761 334270 339235 345649 353139 361098 369076 377164 385950 396019 407568 420672 435858 454149
63434 454149 476458 502934 532680 563723 593242 618358 637292 650047 657990 662875 666212 669315
63422 669315 673546 680241 690329 704125 721665 743316 769786 801269 836578 873278 908569 939876
63410 939876 964868 981693 989723 990001 984624 975619 964426 952241 940393 930053 921465 913539 904336
63397 904336 892050 875639 854781 829701 801237 770775 739674 708722 678312 648917 621058
$$ packed form
63496C39113k030j301q11n62m75n56o84n49j50K1l38p89o88m6O19J123J806K802
63478C36505L685L999L741L185K503J798J265J011Q43M70j98j039j920k778l605
63463C49465m415n125n433n010l896k512j226q5Q69J370J233P46M64O87J343K286
63447C30761L509M965O414P490P959P978Q088Q786J0069J1549J3104J5186J8291
63434D54149K2309K6476K9746L1043K9519K5116J8934J2755P943M885L337L103
63422F69315M231O695J0088J3796J7540K1651K6470L1483L5309L6700L5291L1307
63410I39876K4992J6825Q030K78n377r005j1193j2185j1848j0340q588p926r203
63397I04336j2286j6411k0858k5080k8464l0462l1101l0952l0410k9395k7859
$$ plain form
63386 621058 594888 570287 547404 526746 508661 493151 480279 470344 463436 459180 457179 457400 459863
63373 459863 464248 470152 477556 486665 497337 508950 520832 532710 544834 557767 571947 587369
63361 587369 603823 621491 641067 663248 688372 716648 748230 782632 818292 853108 885229
63350 885229 913114 935183 950109 957540 958246 953606 945196 934731 923802 913416 903884 895033 886267
63337 886267 876524 864606 849638 831037 808312 781509 751938 721830 692850 665226 638546 613076
63325 613076 589963 570353 554721 543043 535315 531755 532323 535783 539187 538797 532138 519365 502636
63312 502636 484299 465815 447998 431550 417059 404736 394432 385884 378852 373149 368659 365322
63300 365322 363036 361639 360982 360856 360803 360124 358298 355380 351865 348204 344505 340656 336530 332058 327286
$$ packed form
63386F21058k6170k4601k2883k0658j8085j5510j2872r935o908m256k001K21K463
63373D59863M385N904P404R109J0672J1613J1882J1878J2124J2933J4180J5422
63361E87369J6454J7668J9576K2181K5124K8276L1582L4402L5660L4816L2121
63350H85229K7885K2069J4926P431P06m640q410j0465j0929j0386r532q851q766
63337H86267r743j1918j4968j8601k2725k6803k9571l0108k8980k7624k6680k5470
63325F13076k3113j9610j5632j1678p728l560N68L460L404l90o659j2773j6729
63312E02636j8337j8484j7817j6448j4491j2323j0304q548p032n703m490l337
63300C65322k286j397o57j26n3o79j826k918l515l661l699l849m126m472m772
$$ plain form
63285 327286 322492 318182 314814 312467 310777 309244 307682 306425 305935 306107 306131 305288 303784 302414 301546 300897
63269 300897 300438 300844 302618 305183 307389 308716 309477 310042 310471 310927 311878 313714 316507 320143 324312 328390
63253 328390 331840 334862 338256 342524 347520 352988 358906 365148 371421 377818 384965 393288 402606 412710
63239 412710 423886 436462 450400 465745 482964 502265 523020 544548 567111 591415 617393
63228 617393 644215 671301 698566 725811 752722 779523 806791 834388 861399 887470 913586
63217 913586 941069 970213 1000321 1030585 1060389 1089016 1115533 1138944 1158165 1171922 1178915 1178169
63205 1178169 1169311 1152760 1129676 1101405 1068847 1032656 994101 955251 917978 883090 850734
63194 850734 821317 795541 773729 755586 740615 728452 718863 711814 707593 706514 708408 712732 719269
$$ packed form
63285C27286m794m310l368k347j690j533j562j257m90J72K4q43j504j370q68o49
63269C00897m59M06J774K565K206J327P61N65M29M56R51J836K793L636M169M078
63253C28390L450L022L394M268M996N468N918O242O273O397P147Q323R318J0104
63239D12710J1176J2576J3938J5345J7219J9301K0755K1528K2563K4304K5978
63228F17393K6822K7086K7265K7245K6911K6801K7268K7597K7011K6071K6116
63217I13586K7483K9144L0108L0264K9804K8627K6517K3411J9221J3757O993p46
63205A178169q858j6551k3084k8271l2558l6191l8555l8850l7273l4888l2356
63194H50734k9417k5776k1812j8143j4971j2163r589p049m221j079J894M324O537
$$ plain form
63181 719269 728404 740479 755069 771183 788090 805665 823919 842532 861019 879196 897278 915578
63169 915578 934250 953217 972035 989789 1005369 1017995 1027287 1032727 1033318 1028077 1016808 1000196
63157 1000196 979202 954516 926513 895580 862539 828777 795757 764212 734031 705154 678271
63146 678271 654268 633202 614315 596956 581015 566498 553286 541478 531457 523364 516862 511676
63134 511676 507969 505911 505154 504994 504827 504284 503356 502725 503664 507055 512596 519267 526472 534294 542686 550960
63118 550960 558270 564303 569189 572944 575379 576622 577406 578514 579960 581013 581157 580743 580410 580143 579375 577996
63102 577996 576727 576328 576825 577750 578672 579215 578888 577478 575503 573867 573032 572755 572648 572605 572658 572686 572465 571998
63084 571998 571649 571927 573045 574687 576301 577702 579263 581490 584558 588323 592649 597560 603221 609865 617631
$$ packed form
63181G19269R135J2075J4590J6114J6907J7575J8254J8613J8487J8177J8082J8300
63169I15578J8672J8967J8818J7754J5580J2626R292N440N91n241j1269j6612
63157A000196k0994k4686k8003l0933l3041l3762l3020l1545l0181k8877k6883
63146F78271k4003k1066j8887j7359j5941j4517j3212j1808j0021q093o502n186
63134E11676l707k058p57j60j67n43r28o31R39L391N541O671P205P822Q392Q274
63118E50960P310O033M886L755K435J243P84J108J446J053J44m14l33k67p68j379
63102E77996j269l99M97R25R22N43l27j410j975j636q35k77j07m3N3K8k21m67
63084E71998l49K78J118J642J614J401J561K227L068L765M326M911N661O644P766
$$ plain form
63069 617631 626350 635664 645399 655691 666658 678278 690755 704678 720609 738781 759438 783033
63057 783033 809652 838611 869267 902123 938516 979260 1024169 1072850 1125237 1181088 1239697
63046 1239697 1300479 1363361 1428082 1493505 1558162 1621333 1683191 1744133 1804461 1864572 1924977
63035 1924977 1986074 2048175 2111541 2175853 2239649 2300814 2357722 2409364 2454150 2489142 2511022
63024 2511022 2517659 2508451 2483518 2443172 2388243 2320490 2242499 2157252 2067759 1976721 1886352 1798600
63012 1798600 1715499 1639017 1570449 1510141 1457916 1413603 1377117 1348329 1327104 1313350 1306787
63001 1306787 1306778 1312611 1323832 1340093 1360748 1384905 1411845 1441096 1472062 1503914 1536099 1568771
62989 1568771 1602476 1637390 1673010 1708425 1742676 1774815 1803830 1828684 1848416 1862118 1868836
$$ packed form
63069F17631Q719R314R735J0292J0967J1620J2477J3923J5931J8172K0657K3595
63057G83033K6619K8959L0656L2856L6393M0744M4909M8681N2387N5851N8609
63046A239697O0782O2882O4721O5423O4657O3171O1858O0942O0328O0111O0405
63035A924977O1097O2101O3366O4312O3796O1165N6908N1642M4786L4992K1880
63024B511022O637r208k4933m0346n4929o7753p7991q5247q9493r1038r0369q7752
63012A798600q3101p6482o8568o0308n2225m4313l6486k8788k1225j3754o563
63001A306787rN833J1221J6261K0655K4157K6940K9251L0966L1852L2185L2672
62989A568771L3705L4914L5620L5415L4251L2139K9015K4854J9732J3702O718
$$ plain form
62978 1868836 1867593 1857584 1838341 1809730 1771912 1725449 1671465 1611620 1547870 1482197 1416423
62967 1416423 1351985 1289804 1230495 1174776 1123465 1076871 1034363 994783 957341 922020 889177
62956 889177 858945 831074 805186 781073 758673 737767 717829 698365 679456 661682 645353
62945 645353 630048 615143 600528 586546 573418 561138 549804 539614 530482 522074 514301 507397
62933 507397 501374 495779 490255 485100 481037 478547 477558 477576 477936 478081 477799 477142 476129 474713 473070 471587
62917 471587 470364 468969 466916 464231 461289 458288 455251 452445 450392 449206 448192 446363 443380 439836
62903 439836 436567 433815 431194 428396 425654 423404 421765 420587 419845 419659 419997 420677 421612 422695 423442 423158
62887 423158 421710 419861 418637 418502 419203 420219 421165 421955 422773 423852 425213 426675 428024 428989 429165 428342
$$ packed form
62978A868836j243j0009j9243k8611l7818m6463n3984n9845o3750o5673o5774
62967A416423o4438o2181n9309n5719n1311m6594m2508l9580l7442l5321l2843
62956H89177l0232k7871k5888k4113k2400k0906j9938j9464j8909j7774j6329
62945F45353j5305j4905j4615j3982j3128j2280j1334j0190r132q408p773o904
62933E07397o023n595n524n155m063k490r89J8L60J45k82o57j013j416j643j483
62917D71587j223j395k053k685k942l001l037k806k053j186j014j829k983l544
62903D39836l269k752k621k798k742k250j639j178p42j86L38O80R35J083P47k84
62887D23158j448j849j224j35P01J016R46P90Q18J079J361J462J349R65J76q23
$$ plain form
62871 428342 426902 425496 424223 422500 419886 416739 413918 412127 411647 412303 413491 414584 415532 416745 418274
62856 418274 419543 420140 420383 420793 421469 422349 423635 425424 427306 428862 430339 432256 434593 436854 438728
62841 438728 440121 440746 440286 438926 437173 435267 433262 431554 430668 430552 430673 430809 431153 431630 431824 431764 432148
62824 432148 433537 435810 438639 441932 445556 449112 452356 455543 459043 462880 466837 470696 474262 477466
62810 477466 480591 484013 487674 491327 495407 500957 508282 516323 523874 530908 538133 545788 553709 562274
62796 562274 572288 583856 596137 608501 621436 636126 653556 674258 698520 726539 758527
62785 758527 794816 835746 881466 932116 988244 1050674 1119835 1195556 1277691 1366599 1462605
62774 1462605 1565080 1672258 1781772 1891123 1997823 2099454 2193643 2277696 2348298 2402027
$$ packed form
62871D28342j440j406j273j723k614l147k821j791m80O56J188J093R48J213J529
62856D18274J269N97K43M10O76Q80J286J789J882J556J477J917K337K261J874
62841D38728J393O25m60j360j753j906k005j708q86j16J21J36L44M77J94o0L84
62824D32148J389K273K829L293L624L556L244L187L500L837L957L859L566L204
62810D77466L125L422L661L653M080N550P325Q041P551P034P225P655P921Q565
62796E62274J0014J1568J2281J2364J2935J4690J7430K0702K4262K8019L1988
62785G58527L6289M0930M5720N0650N6128O2430O9161P5721Q2135Q8908R6006
62774A462605J02475J07178J09514J09351J06700J01631R4189Q4053P0602N3729
$$ plain form
62764 2402027 2436495 2450978 2445923 2422077 2380268 2321848 2249049 2164854 2072529 1975049 1874648
62753 1874648 1772846 1671002 1570711 1473498 1380362 1292074 1209842 1135037 1067969 1007402 951748
62742 951748 900472 853946 812261 774828 741062 710831 684074 660385 639218 620191 603121
62731 603121 588018 575151 564739 556419 549288 542680 536610 531365 527010 523583 521406 520815 521723 523767
62717 523767 526755 530675 535429 540948 547520 555662 565615 577313 590871 606814 625623 647257 671360
62704 671360 697894 727428 760728 798082 839090 883172 930313 981273 1037027 1098067 1164213
62693 1164213 1234899 1309392 1386630 1464879 1541594 1613780 1678708 1734377 1779287 1811965 1831062
62682 1831062 1835861 1826305 1802495 1764779 1714712 1655316 1589655 1519284 1444769 1367578 1290588 1216461
$$ packed form
62764B402027L4468J4483n055k3846m1809n8420p2799q4195r2325r7480j00401
62753A874648j01802j01844j00291r7213r3136q8288q2232p4805o7068o0567n5654
62742I51748n1276m6526m1685l7433l3766l0231k6757k3689k1167j9027j7070
62731F03121j5103j2867j0412q320p131o608o070n245m355l427k177n91R08K044
62717E23767K988L920M754N519O572Q142R953J1698J3558J5943J8809K1634K4103
62704F71360K6534K9534L3300L7354M1008M4082M7141N0960N5754O1040O6146
62693A164213P0686P4493P7238P8249P6715P2186O4928N5669M4910L2678J9097
62682A831062M799r556k3810l7716n0067n9396o5661p0371p4515p7191p6990p4127
$$ plain form
62670 1216461 1146264 1080065 1018202 961227 908979 860517 815054 772533 733331 697889 666581
62659 666581 639324 615197 592959 572210 553659 538012 525033 513962 504316 495728 487403 478577
62647 478577 469470 461163 454340 448654 443430 438468 433920 429899 426601 424438 423557 423464 423553 423794 424474 425382
62631 425382 425779 425195 423866 422254 420523 418622 416583 414528 412562 410835 409617 409212 409882 411810 414883
62616 414883 418509 421972 425208 429006 434228 440858 448031 454902 461342 467852 475014 483120 492176 502168
62602 502168 513290 525982 540760 558040 578149 601465 628523 659843 695562 735258 778323
62591 778323 824523 873993 926466 980716 1034929 1087491 1137098 1182232 1220989 1251609 1272916
62580 1272916 1284175 1284895 1275130 1255790 1228312 1193997 1153904 1109326 1062005 1013686 965535 918177
$$ packed form
62670A216461p0197o6199o1863n6975n2248m8462m5463m2521l9202l5442l1308
62659F66581k7257k4127k2238k0749j8551j5647j2979j1071r646q588q325q826
62647D78577r107q307o823n686n224m962m548m021l298k163q81r3Q9K41O80R08
62631D25382L97n84j329j612j731j901k039k055j966j727j218m05O70J928L073
62616D14883L626L463L236L798N222O630P173O871O440O510P162Q106R056R992
62602E02168J1122J2692J4778J7280K0109K3316K7058L1320L5719L9696M3065
62591G78323M6200M9470N2473N4250N4213N2562M9607M5134L8757L0620K1307
62580A272916J1259P20r765j9340k7478l4315m0093m4578m7321m8319m8151m7358
$$ plain form
62568 918177 872160 828154 786698 748048 712451 680303 651732 626147 602644 580983 561826
62557 561826 545796 532600 521291 511146 501967 493710 486222 479320 472859 466777 461261 456778 453591
62544 453591 451338 449369 447473 445990 445259 445267 445784 446472 446897 446816 446521 446576 447157 447952 448763 449864 451695 454517
62526 454517 458437 463410 469201 475719 483526 493615 506565 522230 540302 560717 583434 608402
62514 608402 636083 667488 703181 742531 784297 827701 872601 918926 966300 1013882 1060129
62503 1060129 1102924 1140393 1171560 1196005 1213246 1222943 1225497 1221933 1213289 1200643 1185708 1170878
62491 1170878 1158494 1150276 1147353 1150335 1159205 1173540 1193099 1218099 1248896 1285620 1328151 1376097
62479 1376097 1428296 1482129 1533352 1577027 1609426 1629710 1639835 1642379 1638024 1624836 1599711 1560568
$$ packed form
62568I18177m6017m4006m1456l8650l5597l2148k8571k5585k3503k1661j9157
62557E61826j6030j3196j1309j0145r179q257p488o902o461o082n516m483l187
62544D53591k253j969j896j483p31QN17O88M25q1k95N5N81P95Q11J101J831K822
62526D54517L920M973N791O518P807J0089J2950J5665J8072K0415K2717K4968
62514F08402K7681L1405L5693L9350M1766M3404M4900M6325M7374M7582M6247
62503A060129M2795L7469L1167K4445J7241R697K554l564q644j2646j4935j4830
62491A170878j2384q218k923K982Q870J4335J9559K5000L0797L6724M2531M7946
62479A376097N2199N3833N1223M3675L2399K0284J0125K544m355j3188k5125l9143
$$ plain form
62467 1560568 1507771 1444172 1373894 1300596 1226355 1151925 1077924 1005773 937680 875716 820781
62456 820781 772349 729376 691413 658632 630960 607815 588778 573836 562571 553706 546054 539473
62444 539473 534349 530611 527994 526856 527814 530631 534304 538255 542645 547454 552069 556040 559518 562542
62430 562542 564480 564594 562730 559153 554096 547859 541010 534101 527269 520277 512794 504655 496173 488202
62416 488202 481508 475966 470767 465407 459951 454418 448622 442793 437589 433108 428684 424113 420367 418334
62402 418334 417420 416258 414489 413009 412686 413570 415286 417381 419246 420421 421234 422640 425194 428508 431753
62387 431753 434309 435988 437157 438813 441945 446498 451286 455162 458083 460926 464642 469810 476622 484815
62373 484815 493701 502563 511131 519649 528602 538473 549618 562186 576140 591423 608123 626621 647689
$$ packed form
62467A560568n2797o3599p0278p3298p4241p4430p4001p2151o8093o1964n4935
62456H20781m8432m2973l7963l2781k7672k3145j9037j4942j1265q865p652o581
62444E39473n124l738k617j138R58K817L673L951M390M809M615L971L478L024
62430E62542J938J14j864l577n057o237o849o909o832o992p483q139q482p971
62416D88202o694n542n199n360n456n533n796n829n204m481m424m571l746k033
62402D18334r14j162j769j480l23Q84J716K095J865J175Q13J406K554L314L245
62387D31753K556J679J169J656L132M553M788L876K921K843L716N168O812Q193
62373D84815Q886Q862Q568Q518Q953R871J1145J2568J3954J5283J6700J8498K1068
$$ plain form
62360 647689 672275 700874 733138 768459 806995 849733 897384 949431 1004368 1060322 1115077
62349 1115077 1165893 1210076 1245966 1273175 1291977 1302815 1306400 1303737 1295670 1282467 1263980 1240055
62337 1240055 1210754 1176515 1138400 1098095 1057359 1017403 978884 942330 908358 877481 849890
62326 849890 825417 803534 783463 764610 746962 730810 715939 701317 685791 668972 651339
62315 651339 633694 616759 601127 587265 575444 565761 558141 552237 547528 543783 541298 540371 540669
62302 540669 541513 542687 544516 547015 549447 550983 551525 551621 551781 552079 552204 551708 550379 548567 546932 545685
62286 545685 544333 542395 540169 538455 537708 537758 538199 538735 539236 539829 540922 542914 545878 549727 554478 560069
62270 560069 566105 572266 578928 586916 596558 607428 619157 632095 646992 664382 684552 707797
$$ packed form
62360F47689K4586K8599L2264L5321L8536M2738M7651N2047N4937N5954N4755
62349A115077N0816M4183L5890K7209J8802J0838L585k663q067j3203j8487k3925
62337A240055k9301l4239l8115m0305m0736l9956l8519l6554l3972l0877k7591
62326H49890k4473k1883k0071j8853j7648j6152j4871j4622j5526j6819j7633
62315F51339j7645j6935j5632j3862j1821r683p620n904m709l745k485r27K98
62302E40669Q44J174J829K499K432J536N42R6J60K98J25m96j329j812j635j247
62286E45685j352j938k226j714p47N0M41N36N01N93J093J992K964L849M751N591
62270E60069O036O161O662P988R642J0870J1729J2938J4897J7390K0170K3245
$$ plain form
62258 707797 734460 764881 799609 839450 884997 936069 991641 1050155 1109702 1168054 1222734
62247 1222734 1271159 1310973 1340698 1360371 1371281 1374827 1371631 1361721 1345080 1321656 1291151 1253409
62235 1253409 1209173 1160207 1108645 1056331 1004627 954501 906714 862026 821136 784363 751631
62224 751631 722992 698819 679055 662550 647778 634135 621964 611356 601713 592660 584594 577836
62212 577836 571856 565981 560448 556087 553170 551191 549644 548461 547756 547701 548679 551052 554679 559107 564287
62197 564287 570581 577954 585659 592979 599890 606744 613708 620872 628530 636942 646025 655653 666046 677438
62183 677438 689504 701626 713692 726080 738606 749968 758683 764540 768786 772862 777240 781585 785778
62170 785778 790450 796618 805198 817059 833185 854387 880886 912430 948638 988814 1031399 1073999
$$ packed form
62258G07797K6663L0421L4728L9841M5547N1072N5572N8514N9547N8352N4680
62247A222734M8425L9814K9725J9673J0910L546l196r910j6641k3424l0505l7742
62235A253409m4236m8966n1562n2314n1704n0126m7787m4688m0890l6773l2732
62224G51631k8639k4173j9764j6505j4772j3643j2171j0608r643r053q066o758
62212E77836n980n875n533m361k917j979j547j183p05n5R78K373L627M428N180
62197E64287O294P373P705P320O911O854O964P164P658Q412R083R628J0393J1392
62183F77438J2066J2122J2066J2388J2526J1362Q715N857M246M076M378M345M193
62170G85778M672O168Q580J1861J6126K1202K6499L1544L6208M0176M2585M2600
$$ plain form
62158 1073999 1114076 1149437 1178284 1199529 1213400 1221229 1224179 1222426 1215847 1204999 1190740 1173088
62146 1173088 1151163 1124411 1093454 1059689 1024537 989300 955282 923595 894815 869007 846112
62135 846112 826279 809819 796772 786524 778028 770498 763761 757815 752392 747202 742366 738204 734806
62122 734806 732193 730765 731078 733258 737032 742264 748986 756961 765685 774653 783024 789096 791075 788685
62108 788685 783501 777558 772261 768605 767199 767276 766616 763444 757967 751300 743616 734591 725224 717701 713203
62093 713203 710952 709711 709201 709604 710667 712027 713761 715952 718217 720375 723116 727254 732567 738138 743693
62078 743693 749912 757452 766406 776871 789334 804085 820651 838189 856234 874761 893688 912632
62066 912632 931155 949176 967237 986461 1007987 1032108 1057871 1083599 1107783 1129435 1147803
$$ packed form
62158A073999M0077L5361K8847K1245J3871P829K950j753o579j0848j4259j7652
62146A173088k1925k6752l0957l3765l5152l5237l4018l1687k8780k5808k2895
62135H46112j9833j6460j3047j0248q496p530o737n946n423n190m836m162l398
62122G34806k613j428L13K180L774N232O722P975Q724Q968Q371O072J979k390
62108G88685n184n943n297l656j406P7o60l172n477o667p684r025r367p523m498
62093G13203k251j241n10M03J063J360J734K191K265K158K741M138N313N571N555
62078G43693O219P540Q954J0465J2463J4751J6566J7538J8045J8527J8927J8944
62066I12632J8523J8021J8061J9224K1526K4121K5763K5728K4184K1652J8368
$$ plain form
62055 1147803 1162107 1171675 1176292 1176356 1172780 1166590 1158275 1147291 1132308 1112215 1086953 1057370 1024389
62042 1024389 988581 950583 911607 873176 836388 801642 769037 738722 710723 684732 660394
62031 660394 637695 616839 597841 580537 565016 551617 540424 530995 522773 515447 508743 502150
62019 502150 495297 488457 482276 476967 472109 467234 462249 457214 452123 447151 442827 439685 437907 437444
62005 437444 438249 440179 442915 446275 450428 455492 461069 466535 471678 476661 481423 485524 488633 490770
61991 490770 491923 491804 490173 487097 482697 476878 469539 460837 451077 440590 429964 420089 411578 404189
61977 404189 397233 390567 384849 380700 377901 375606 373188 370732 368717 367400 366532 365646 364547 363506 362979
61962 362979 363229 364228 365781 367583 369283 370707 372055 373657 375459 376909 377527 377505 377659 378834 381414 385263
$$ packed form
62055A147803J4304R568M617O4l576o190q315j0984j4983k0093k5262k9583l2981
62042A024389l5808l7998l8976l8431l6788l4746l2605l0315k7999k5991k4338
62031F60394k2699k0856j8998j7304j5521j3399j1193r429q222p326o704o593
62019E02150o853o840o181n309m858m875m985n035n091m972m324l142j778m63
62005D37444Q05J930K736L360M153N064N577N466N143M983M762M101L109K137
61991D90770J153j19j631l076m400n819p339q702r760j0487j0626r875q511p389
61977D04189o956o666n718m149k799k295k418k456k015j317q68q86j099j041n27
61962C62979K50R99J553J802J700J424J348J602J802J450O18k2J54J175K580L849
$$ plain form
61946 385263 389953 395116 400811 407530 415613 424666 433870 443020 452896 464342 477214 490643 504176
61933 504176 518126 532757 547652 562089 575597 587919 598811 608218 616272 622707 626565 627037 624467
61920 624467 620094 614903 609174 602986 596568 590143 583996 578852 575640 574698 575692 578530 583866 592338 603709
61905 603709 617062 631456 645969 659480 670958 679880 686042 689180 689192 686565 682051 675951 668066
61892 668066 658363 647366 635920 624860 614782 605729 597163 588629 580458 573368 567326 561290 554189
61879 554189 545711 536026 525339 514137 503419 493945 485374 476742 467859 459765 453611 449455 446476
61866 446476 444099 442520 442165 443065 444962 447850 452064 457841 465004 473254 482703 493931 507486 523394
61852 523394 541234 560602 581443 603980 628410 654568 681733 708710 734377 758304 780664
$$ packed form
61946C85263M690N163N695O719Q083R053R204R150R876J1446J2872J3429J3533
61933E04176J3950J4631J4895J4437J3508J2322J0892R407Q054O435L858M72k570
61920F24467m373n191n729o188o418o425o147n144l212r42R94K838N336Q472J1371
61905F03709J3353J4394J4513J3511J1478Q922O162L138J2k627m514o100p885
61892F68066r703j0997j1446j1060j0078r053q566q534q171p090o042o036p101
61879E54189q478r685j0687j1202j0718r474q571q632q883q094o154m156k979
61866D46476k377j579l55R00J897K888M214N777P163Q250R449J1228J3555J5908
61852E23394J7840J9368K0841K2537K4430K6158K7165K6977K5667K3927K2360
$$ plain form
61841 780664 801311 819077 832403 840652 844410 844387 840582 832978 822618 811320 800364 790043 780579
61828 780579 772880 768109 766967 769703 776416 786807 799721 813347 826011 836690 844883 850167 851854
61815 851854 849088 841432 829423 814322 797164 778291 757944 736993 716689 697811 680296 663621
61803 663621 647256 630868 614419 598198 582626 568025 554599 542478 531681 522158 513969 507200
61791 507200 501548 496295 491023 486115 482189 479237 476689 474147 471578 468918 466043 463190 460844 459034
61777 459034 457170 454843 452415 450547 449441 448822 448442 448255 448240 448362 448723 449537 450974 453108 455941 459304
61761 459304 462799 466070 469193 472623 476622 480831 484583 487671 490615 493958 497381 499762 500177 498645
61747 498645 495797 492127 487753 482788 477582 472626 468314 464715 461427 457863 453943 450346 447789 446209
$$ packed form
61841G80664K0647J7766J3326Q249L758k3l805p604j0360j1298j0956j0321r464
61828G80579p699m771j142K736O713J0391J2914J3626J2664J0679Q193N284J687
61815H51854k766p656j2009j5101j7158j8873k0347k0951k0304j8878j7515j6675
61803F63621j6365j6388j6449j6221j5572j4601j3426j2121j0797r523q189o769
61791E07200n652n253n272m908l926k952k548k542k569k660k875k853k346j810
61777D59034j864k327k428j868j106o19l80j87j5J22L61Q14J437K134K833L363
61761D59304L495L271L123L430L999M209L752L088K944L343L423K381M15j532
61747D98645k848l670m374m965n206m956m312l599l288l564l920l597k557j580
$$ plain form
61733 446209 445018 444038 443654 443975 444358 444130 443519 443550 445007 447634 450349 452184 453125 454049 455845 458657 462059
61716 462059 465760 469822 474266 478802 482984 486357 488413 488747 487432 485008 482007 478607 474821 470729
61702 470729 466355 461517 456012 449973 443924 438513 434082 430364 426608 422186 417118 411907 407029 402712
61688 402712 399037 395862 392769 389531 386602 384708 383816 382972 381294 378753 375832 372819 369726 366578 363486
61673 363486 360694 358722 358152 358942 360257 361230 361762 362369 363483 365114 366890 368247 368976 369838 372208 376608
61657 376608 381939 386641 390357 393780 397162 399826 401298 402147 403222 404497 405141 404670 403681 403389 404523
61642 404523 406689 408910 410738 412661 415220 418097 420503 422365 424510 427495 430663 432671 432700 430991 428435
61627 428435 425857 423509 420990 417738 413717 409528 405778 402632 400090 398404 397794 397958 398256 398366 398367 398118
$$ packed form
61733D46209j191r80l84L21L83k28o11L1J457K627K715J835R41R24J796K812L402
61716D62059L701M062M444M536M182L373K056L34j315k424l001l400l786m092
61702D70729m374m838n505o039o049n411m431l718l756m422n068n211m878m317
61688D02712l675l175l093l238k929j894q92q44j678k541k921l013l093l148l092
61673C63486k792j972n70P90J315R73N32O07J114J631J776J357P29Q62K370M400
61657C76608N331M702L716L423L382K664J472Q49J075J275O44m71r89k92J134
61642D04523K166K221J828J923K559K877K406J862K145K985L168K008K9j709k556
61627D28435k578k348k519l252m021m189l750l146k542j686o10J64K98J10Jk49
$$ plain form
61611 398118 397036 394772 391746 388593 385218 380873 375263 369135 363512 358617 353916 349067 344392 340291
61597 340291 336594 332773 328664 324639 321076 317885 314672 311252 307924 305251 303647 303130 303364 303800 303815
61582 303815 302946 301242 299367 298148 297857 298019 297944 297371 296564 295906 295535 295254 294717 293733 292550 291798 292032 293259
61564 293259 294882 296183 296956 297714 299158 301316 303331 304367 304632 305133 306399 307853 308721 309156 310006 311746
61548 311746 314099 316636 319126 321195 322237 322068 321383 321139 321559 322110 322401 322731 323664 325337 327403 329431
61532 329431 331214 332814 334513 336601 338910 340616 340811 339386 337152 335036 333387 332096 331023 329975
61518 329975 328594 326670 324484 322473 320661 318839 317235 316450 316591 316987 317038 316985 317466 318581 319805 320629
61502 320629 320914 320722 320196 319716 319845 320969 323052 325767 328800 332010 335398 338914 342220 344771 346236
$$ packed form
61611C98118j082k264l026l153l375m345n610o128n623m895m701m849m675m101
61597C40291l697l821m109m025l563l191l213l420l328k673j604n17K34M36J5
61582C03815q69j704j875j219k91J62p5n73q07o58l71k81n37r84j183p52K34J227
61564B93259J623J301P73P58J444K158K015J036K65N01J266J454Q68M35Q50J740
61548C11746K353K537K490K069J042j69o85k44M20N51K91L30R33J673K066K028
61532C29431J783J600J699K088K309J706J95j425k234k116j649j291j073j048
61518C29975j381j924k186k011j812j822j604p85J41L96N1n3M81J115J224Q24
61502C20629K85j92n26m80J29J124K083K715L033L210L388L516L306K551J465
$$ plain form
61487 346236 346824 347096 347496 348193 349263 350797 352763 354913 356971 358947 361198 364025 367132 369553 370359
61472 370359 369476 367664 365698 363766 361699 359483 357369 355683 354661 354248 353844 352537 349929 346631 343661
61457 343661 341434 339633 337993 336775 336337 336519 336732 336513 335914 335391 335454 336389 338172 340541 343160 345778
61441 345778 348321 350810 353141 355063 356536 357984 359943 362447 365042 367420 369672 371866 373767 375209
61427 375209 376375 377418 378114 378263 378185 378433 379194 380367 382057 384518 387634 390816 393441 395107 395593 394960
61411 394960 393728 392593 391881 391451 391033 390369 389142 387203 384838 382476 380194 377923 376009 374990 374735
61396 374735 374424 373565 372508 371727 371141 370588 370502 371597 374055 377411 381048 384430 387106 388975 390543 392556
61380 392556 395304 398478 401603 404371 406663 408599 410574 412933 415510 417724 419161 419860 419938 419183 417290
$$ packed form
61487C46236N88K72M00O97J070J534J966K150K058J976K251K827L107K421Q06
61472C70359q83j812j966j932k067k216k114j686j022m13m04j307k608l298k970
61457C43661k227j801j640j218m38J82K13k19n99n23O3R35J783K369K619K618
61441C45778K543K489K331J922J473J448J959K504K595K378K252K194J901J442
61427C75209J166J043O96J49p8K48P61J173J690K461L116L182K625J666M86o33
61411C94960j232j135p12m30m18o64j227j939k365k362k282k271j914j019k55
61396C74735l11q59j057p81n86n53q6J095K458L356L637L382K676J869J568K013
61380C92556K748L174L125K768K292J936J975K359K577K214J437O99P8p55j893
$$ plain form
61365 417290 414454 411505 409302 408038 407240 406442 405710 405415 405732 406599 408010 410008 412366 414754 417406 421230
61349 421230 426943 434285 442324 450174 457112 462340 465348 466580 467280 468486 470442 472944 475776 478610
61335 478610 480927 482445 483423 484167 484378 483357 480885 477590 474356 471602 469276 467340 465975 465309 465166
61320 465166 465294 465772 466959 469000 471520 474039 476647 480037 484808 490952 498153 506358 515768 526338
61306 526338 537607 549114 560752 572566 584298 595300 604781 612067 616758 618859 618742 616860 613456
61293 613456 608638 602645 595852 588519 580702 572479 564078 555730 547510 539463 531850 525137 519675 515374
61279 515374 511703 508171 504947 502959 503093 505295 508555 511829 514744 517445 520082 522625 524935 526756
61265 526756 527825 528259 528745 530142 532984 537469 543625 551131 559159 566869 574023 580667 586284 589852 591009
$$ packed form
61365D17290k836k949k203j264p98p98p32k95L17Q67J411J998K358K388K652L824
61349D21230N713P342Q039P850O938N228L008J232P00J206J956K502K832K834
61335D78610K317J518R78P44K11j021k472l295l234k754k326j936j365o66j43
61320D65166J28M78J187K041K520K519K608L390M771O144P201Q205R410J0570
61306E26338J1269J1507J1638J1814J1732J1002R481P286M691K101j17j882l404
61293F13456m818n993o793p333p817q223q401q348q220q047p613o713n462m301
61279E15374l671l532l224j988J34K202L260L274K915K701K637K543K310J821
61265E26756J069M34M86J397K842M485O156P506Q028P710P154O644N617L568J157
$$ plain form
61250 591009 590671 590134 589834 589323 588136 586217 583678 580642 577424 574439 571812 569314 566790 564377 562162
61235 562162 559881 557216 554226 551308 548856 547244 547042 548872 552857 558344 564320 570024 575168 579772
61221 579772 584052 588380 593137 598477 604314 610506 617005 623792 630767 637681 644109 649510 653453 655880
61207 655880 657112 657596 657717 657858 658492 660089 662869 666699 671335 676904 684109 693749 705912 719868 734949
61192 734949 751216 768780 786561 802335 814275 822088 826545 828402 828253 826961 825476 824078 822240
61179 822240 819376 815395 810450 804452 797123 788418 778710 768549 758291 747960 737480 727032 717088
61166 717088 707940 699238 690160 680036 668723 656467 643648 630781 618562 607676 598468 590903
61154 590903 584932 580860 579240 580325 583690 588447 593747 598915 603206 605804 606243 604603 601108 595758
$$ packed form
61250E91009l38n37l00n11j187j919k539l036l218k985k627k498k524k413k215
61235E62162k281k665k990k918k452j612k02J830L985N487N976N704N144M604
61221E79772M280M328M757N340N837O192O499O787O975O914O428N401L943K427
61207F55880J232M84J21J41O34J597K780L830M636N569P205R640J2163J3956J5081
61192G34949J6267J7564J7781J5774J1940P813M457J857j49j292j485j398j838
61179H22240k864l981m945n998p329q705r708j0161j0258j0331j0480j0448r944
61166G17088r148q702r078j0124j1313j2256j2819j2867j2219j0886r208p565
61154E90903n971m072j620J085L365M757N300N168M291K598M39j640l495n350
$$ plain form
61140 595758 588625 580413 572362 565550 560421 556981 555168 554908 555992 558139 561234 565416 570855 577507
61126 577507 585239 594168 604706 617137 631310 646978 664262 683470 704524 726960 750515 775291
61114 775291 801163 827435 853436 879182 905098 931193 956791 981073 1003710 1025035 1045651
61103 1045651 1065736 1084601 1101045 1114183 1123798 1129940 1132626 1132054 1128742 1123135 1115367 1105671 1094738
61090 1094738 1083396 1072161 1061353 1051370 1042577 1035159 1029345 1025498 1023724 1023706 1025265 1028677 1034071 1040915
61076 1040915 1048620 1057300 1067311 1078338 1089636 1100992 1112670 1124397 1135217 1144594 1153027 1161207
61064 1161207 1168930 1175195 1179153 1180732 1180430 1178725 1175754 1171548 1166378 1160510 1153701 1145513 1136412 1127920
61050 1127920 1121194 1115900 1111047 1106471 1102750 1100060 1098065 1096860 1097133 1099223 1102738 1107224 1112669 1119165
$$ packed form
61140E95758p133q212q051o812n129l440j813k60J084K147L095M182N439O652
61126E77507P732Q929J0538J2431J4173J5668J7284J9208K1054K2436K3555K4776
61114G75291K5872K6272K6001K5746K5916K6095K5598K4282K2637K1325K0616
61103A045651K0085J8865J6444J3138R615O142K686n72l312n607p768r696j0933
61090A094738j1342j1235j0808r983q793p418n814l847j774j8J559L412N394O844
61076A040915P705Q680J0011J1027J1298J1356J1678J1727J0820R377Q433Q180
61064A161207P723O265L958J579l02j705k971m206n170n868o809q188r101q492
61050A127920o726n294m853m576l721k690j995j205K73K090L515M486N445O496
$$ plain form
61036 1119165 1126573 1134678 1143362 1152654 1162883 1174636 1188179 1203214 1219619 1238023 1258990 1282045
61024 1282045 1306226 1331158 1356657 1381826 1405865 1429785 1456208 1487507 1525174 1570670 1625268
61013 1625268 1688744 1759597 1837113 1922462 2018155 2128373 2260412 2424291 2630091 2886570
61003 2886570 3202239 3586276 4049134 4606171 5283285 6119020 7163379 8477251 10121403
60994 10121403 12111151 14342202 16551438 18384572 19558168 20002890 19878781 19469356
60986 19469356 19059197 18871710 19042826 19574077 20282847 20833338 20880025 20237033 18947664
60977 18947664 17218176 15293084 13367658 11565447 9950530 8544582 7342603 6327396
60969 6327396 5478066 4771991 4186397 3701836 3303062 2975942 2705595 2478595 2285241
$$ packed form
61036A119165P408Q105Q684R292J0229J1753J3543J5035J6405J8404K0967K3055
61024A282045K4181K4932K5499K5169K4039K3920K6423L1299L7667M5496N4598
61013A625268O3476P0853P7516Q5349R5693J10218J32039J63879K05800K56479
61003B886570L15669L84037M62858N57037O77114Q35735J044359J313872J644152
60994A0121403J989748K231051K209236J833134J173596M44722j24109m09425
60986A9469356m10159j87487J71116N31251P08770N50491M6687o42992j289369
60977A8947664j729488j925092j925426j802211j614917j405948j201979j015207
60969F327396q49330p06075n85594m84561l98774l27120k70347k27000j93354
$$ plain form
60960 2285241 2118636 1973006 1843931 1728947 1626602 1535367 1453906 1381554 1317893 1262527
60950 1262527 1215463 1176687 1144795 1116884 1090275 1063675 1036452 1008018 978625 949811 923071
60939 923071 898513 875289 852711 830355 807800 785101 763178 743086 725070 708699 693566
60928 693566 679499 666444 654520 643910 634489 625922 618221 611635 605833 599925 593652 587833 583131
60915 583131 579027 574636 570035 566122 563520 562165 561662 561478 561007 559968 558614 557253 555863 554429 553199
60900 553199 552141 550563 547853 544312 540717 537195 533062 527702 521200 514208 507503 501532 496115 490684
60886 490684 485029 479558 474630 469979 465183 460337 455861 451936 448541 445722 443291 440533 436903 432921
60872 432921 429754 427865 426706 425767 425299 425697 426724 427776 428676 429835 431770 434757 438865 444015 449877
$$ packed form
60960B285241j66605j45630j29075j14984j02345r1235q1461p2352o3661n5366
60950A262527m7064l8776l1892k7911k6609k6600k7223k8434k9393k8814k6740
60939I23071k4558k3224k2578k2356k2555k2699k1923k0092j8016j6371j5133
60928F93566j4067j3055j1924j0610r421q567p701o586n802n908o273n819m702
60915E83131m104m391m601l913k602j355n03j84m71j039j354j361j390j434j230
60900E53199j058j578k710l541l595l522m133n360o502o992o705n971n417n431
60886D90684n655n471m928m651m796m846m476l925l395k819k431k758l630l982
60872D32921l167j889j159r39m68L98J027J052R00J159J935K987M108N150N862
$$ plain form
60857 449877 455893 461516 466421 470471 473623 476020 478105 480426 483167 485972 488304 489881 490710 490924 490770
60842 490770 490531 490122 488887 486187 482149 477457 472428 466719 460062 452863 445821 439173 432599 425775 418924
60827 418924 412858 408381 405436 402970 399956 396499 393552 391557 389915 387873 385375 382714 379884 376724
60813 376724 373418 370338 367463 364386 360965 357718 355425 354331 353854 353220 352411 352199 352986 353994 354132 353473
60797 353473 353157 353826 354905 355678 356275 357145 358209 359198 360407 362385 365000 367436 369126 370216 371094 371838
60781 371838 372185 371774 370398 368287 366118 364550 363712 363292 363046 362992 363077 362966 362304 361151 360000 359305 359094
60764 359094 359124 359329 359837 360475 360635 359968 358976 358461 358539 358617 358286 357737 357221 356626 355739 354566 353287 352244 352018
60745 352018 353101 355287 357734 359703 360922 361279 360698 359437 357984 356418 354328 351555 348543 345787 343381
$$ packed form
60857D49877O016N623M905M050L152K397K085K321K741K805K332J577Q29K14j54
60842D90770k39m09j235k700m038m692n029n709o657p199p042o648o574o824o851
60827D18924o066m477k945k466l014l457k947j995j642k042k498k661k830l160
60813C76724l306l080k875l077l421l247k293j094m77o34q09k12P87J008J38o59
60797C53473l16O69J079P73N97Q70J064R89J209J978K615K436J690J090Q78P44
60781C71838L47m11j376k111k169j568q38m20k46n4Q5j11o62j153j151o95k11
60764C59094L0K05N08O38J60o67r92n15P8P8l31n49n16n95q87j173j279j043k26
60745C52018J083K186K447J969J219L57n81j261j453j566k090k773l012k756k406
$$ plain form
60730 343381 341312 339686 338364 336918 335262 333912 333326 333380 333739 334255 334775 335161 335786 337315 339601 341454
60714 341454 342132 342460 343818 346468 349554 352272 354301 355471 355858 356063 356651 357425 357839 357949 358270 358830 359008
60697 359008 358294 356643 354229 351457 349041 347374 345863 343614 340806 338631 337736 337461 336890 336027 335548 335883
60681 335883 337001 338729 340896 343323 346022 349245 353040 356830 359791 361778 363655 366379 369719 372151
60667 372151 372292 370280 367425 364660 361903 358917 356052 353784 352086 350694 349628 349039 348892 349229 350335
60652 350335 352218 354296 356073 357773 359802 362064 364399 367246 370963 374708 376835 376472 374094 370657
60638 370657 366871 363257 360121 357274 354324 351326 348663 346353 344166 342444 342001 342962 344327 345054 345102
60623 345102 345071 345241 345324 344971 344245 343666 343815 344740 345855 346660 347344 348359 349635 350755 351759 353106 354876
$$ packed form
60730C43381k069j626j322j446j656j350n86N4L59N16N20L86O25J529K286J853
60714C41454O78L28J358K650L086K718K029J170L87K05N88P74M14J10L21N60J78
60697C59008p14j651k414k772k416j667j511k249k808k175q95k75n71q63m79L35
60681C35883J118J728K167K427K699L223L795L790K961J987J877K724L340K432
60667C72151J41k012k855k765k757k986k865k268j698j392j066n89j47L37J106
60652C50335J883K078J777J700K029K262K335K847L717L745K127l63k378l437
60638C70657l786l614l136k847k950k998k663k310k187j722m43R61J365P27M8
60623C45102l1J70Q3l53p26n79J49R25J115Q05O84J015J276J120J004J347J770
$$ plain form
60606 354876 356643 358193 359690 360989 361443 360742 359482 358589 358539 359347 360904 363030 365412 367729 369716 371166
60590 371166 372184 373412 375594 378817 382453 385792 388373 389827 390006 389403 388915 389017 389508 390096 390819 391836
60574 391836 393231 395107 397497 400268 403558 408210 415134 424301 435047 447323 461750 478240 495417
60561 495417 511707 526212 538181 546560 550782 551389 549270 544727 537853 529293 519993 510609 501759 494459
60547 494459 489597 487192 486751 488128 491492 496661 503070 510377 518675 528265 539710 553980 571958 593672
60533 593672 618269 644710 672103 699369 724868 746502 762262 770995 772922 769280 761310 749786
60521 749786 735588 720238 705331 691520 678417 665492 652936 641745 633024 626968 622513 618357
60509 618357 614413 611760 611060 611781 613442 616854 623384 633515 647045 664390 686686 714565 747714
$$ packed form
60606C54876J767J550J497J299M54p01j260q93n0Q08J557K126K382K317J987J450
60590C71166J018J228K182L223L636L339K581J454J79o03m88J02M91N88P23J017
60574C91836J395J876K390K771L290M652O924R167J0746J2276J4427J6490J7177
60561D95417J6290J4505J1969Q379M222O07k119m543o874q560r300r384q850p300
60547D94459m862k405m41J377L364N169O409P307Q298R590J1445J4270J7978K1714
60533E93672K4597K6441K7393K7266K5499K1634J5760Q733J927l642p970j1524
60521G49786j4198j5350j4907j3811j3103j2925j2556j1191q721o056m455m156
60509F18357l944k653p00P21J661L412O530J0131J3530J7345K2296K7879L3149
$$ plain form
60496 747714 785789 828985 877394 930345 986657 1045032 1103892 1161285 1215378 1264894 1308914
60485 1308914 1346484 1376592 1398305 1410666 1412582 1402991 1381117 1346745 1300597 1244565 1181306 1113473
60473 1113473 1043467 973909 907790 847661 794601 748134 707121 670691 638558 610774 587308
60462 587308 567746 551234 536692 523194 510324 498276 487506 478182 469958 462370 455308 448960
60450 448960 443305 437904 432326 426722 421812 418246 415948 414157 412131 409770 407468 405514 403865 402438
60436 402438 401292 400349 399174 397320 394777 391975 389477 387814 387377 388122 389371 390193 390102 389289 388226 387232
60420 387232 386429 385863 385545 385470 385778 386810 388775 391234 393106 393447 392350 390941 390417 391216 393085 395612
60404 395612 398331 400578 401820 402305 403015 404715 407197 409607 411379 412703 414181 416134 418283 420153 421819
$$ packed form
60496G47714L8075M3196M8409N2951N6312N8375N8860N7393N4093M9516M4020
60485A308914L7570L0108K1713J2361J916r591k1874l4372m6148n6032o3259o7833
60473A113473p0006o9558o6119o0129n3060m6467m1013l6430l2133k7784k3466
60462E87308j9562j6512j4542j3498j2870j2048j0770r324q224p588p062o348
60450D48960n655n401n578n604m910l566k298j791k026k361k302j954j649j427
60436D02438j146r43j175j854k543k802k498j663m37P45J249Q22r1q13j063r94
60420C87232q03n66l18p5L08J032J965K459J872L41j097j409n24P99J869K527
60404C95612K719K247J242M85P10J700K482K410J772J324J478J953K149J870J666
$$ plain form
60389 421819 424041 427430 431607 435520 438529 440795 442697 444376 445962 447753 449843 451852 453287 453961
60375 453961 454021 453907 454377 456052 458677 461248 463194 465037 467522 470508 473197 475181 476672 477905 478873
60360 478873 479681 480694 482214 484240 486570 488947 491217 493584 496555 500344 504527 508594 512661 517189
60346 517189 522075 526529 529834 531827 532547 531900 529846 526625 522637 518296 514076 510409 507325 504414 501240
60331 501240 497714 493999 490253 486578 483086 479868 476971 474403 472063 469759 467436 465399 464060 463447
60317 463447 463188 463091 463487 464869 467350 470703 474838 480050 486774 495234 505338 516818 529426 543050
60303 543050 557717 573515 590442 608248 626297 643526 658551 669928 676529 677723 673276 663213
60291 663213 648069 629340 609355 590337 573509 559142 547104 537084 528581 521273 515392 511227
$$ packed form
60389D21819K222L389M177L913L009K266J902J679J586J791K090K009J435O74
60375D53961O0j14M70J675K625K571J946J843K485K986K689J984J491J233R68
60360D78873Q08J013J520K026K330K377K270K367K971L789M183M067M067M528
60346E17189M886M454L305J993P20o47k054l221l988m341m220l667l084k911l174
60331E01240l526l715l746l675l492l218k897k568k340k304k323k037j339o13
60317D63447k59r7L96J382K481L353M135N212O724Q460J0104J1480J2608J3624
60303E43050J4667J5798J6927J7806J8049J7229J5025J1377O601J194m447j0063
60291F63213j5144j8729j9985j9018j6828j4367j2038j0020q503p308n881m165
$$ plain form
60279 511227 508179 504852 500323 494930 489620 484933 480821 476996 473048 468671 464179 460479 458058 456310
60265 456310 454371 452313 450834 449906 448549 446124 443249 441094 440156 440007 439981 439772 439534 439635 440306 441406
60249 441406 442554 443514 444396 445492 447049 449127 451472 453496 454579 454517 453555 452020 450165 448411 447377
60234 447377 447400 448206 449335 450792 452919 455653 458331 460487 462561 465460 469539 474318 479148 483753 488132
60219 488132 492385 496829 501876 507488 513154 518762 525140 533146 542507 552145 561556 571149 581186 591091
60205 591091 600057 607851 614751 621159 627524 634220 641167 647848 653884 659247 663780 667004 668678 669084
60191 669084 668506 666840 664061 660557 656569 651774 645893 639327 632650 625803 618408 610605 602946 595651
60177 595651 588578 581862 575936 570901 566444 562516 559639 558311 558330 558799 558645 557246 554815 552169 549916
$$ packed form
60279E11227l048l327m529n393n310m687m112l825l948m377m492l700k421j748
60265D56310j939k058j479r28j357k425k875k155r38j49k6k09k38J01O71J100
60249D41406J148R60Q82J096J557K078K345K024J083o2r62j535j855j754j034
60234D47377K3Q06J129J457K127K734K678K156K074K899M079M779M830M605M379
60219D88132M253M444N047N612N666N608O378Q006R361R638R411R593J0037R905
60205E91091Q966P794O900O408O365O696O947O681O036N363M533L224J674M06
60191F69084n78j666k779l504l988m795n881o566o677o847p395p803p659p295
60177E95651p073o716n926n035m457l928k877j328J9M69j54j399k431k646k253
$$ plain form
60162 549916 547964 545992 544166 542954 542446 542303 542369 542893 544055 545648 547339 549044 550903 552976 554935
60147 554935 556064 555848 554728 554025 554837 557209 560550 564442 568648 572784 576713 581108 586920 594194 601937
60132 601937 609165 615625 621458 626756 631655 636316 640490 643467 644852 645224 645745 647187 649521 652353 655480
60117 655480 658972 662822 666771 670541 674090 677388 680075 681713 682323 682206 681139 678372 673810 668641 664180
60102 664180 660431 656396 651595 646634 642351 639009 636403 634257 632320 630398 628527 627014 626250 626383 627013
60087 627013 627217 626247 624301 622207 620248 617914 615040 612452 610878 609861 608432 606268 603394 599318 593570
60072 593570 586833 580462 574915 569597 564124 558710 553245 547099 540181 533352 527469 522656 518712 515499
60058 515499 512705 509928 507267 505190 503657 502097 500478 499618 500126 501814 504467 508387 513643 519524 525354
$$ packed form
60162E49916j952j972j826j212n08j43O6N24J162J593J691J705J859K073J959
60147E54935J129k16j120p03Q12K372L341L892M206M136L929M395N812P274P743
60132F01937P228O460N833N298M899M661M174K977J385L72N21J442K334K832L127
60117F55480L492L850L949L770L549L298K687J638O10j17j067k767m562n169m461
60102F64180l749m035m801m961m283l342k606k146j937j922j871j513p64J33O30
60087F27013K04r70j946k094j959k334k874k588j574j017j429k164k874m076n748
60072E93570o737o371n547n318n473n414n465o146o918o829n883m813l944l213
60058E15499k794k777k661k077j533j560j619q60N08J688K653L920N256N881N830
$$ plain form
60043 525354 531307 537875 545024 552428 560034 567735 574798 580235 583593 584987 584697 583178 581231 579558
60029 579558 578129 576266 573284 568874 563053 556048 548138 539484 530192 520509 510724 500870 490925 481314
60015 481314 472794 465672 459561 454025 449033 444638 440730 437307 434565 432505 430874 429650 429087 429061 428954
60000 428954 428505 428189 428401 428798 428973 429301 430556 432957 436066 439434 442940 446694 450945 455926 461508 467160
59984 467160 472451 477370 482029 486296 489804 491946 491920 489384 485183 480787 476703 472181 466823 461667 457953
59969 457953 455499 453130 450289 447386 444799 442444 440375 439096 439061 440261 442357 444940 447661 450399 453243
59954 453243 456158 458815 460932 462600 464039 465320 466461 467486 468180 468232 467901 468023 468958 469985 470200 469542
59938 469542 468338 466312 462901 458423 454208 451533 450918 452365 455720 460719 467056 474441 482337 489855
$$ packed form
60043E25354N953O568P149P404P606P701P063N437L358J394k90j519j947j673
60029E79558j429j863k982m410n821p005p910q654r292r683r785r854r945r611
60015D81314q520p122o111n536m992m395l908l423k742k060j631j224n63k6j07
60000D28954m49l16K12L97J75L28J255K401L109L368L506L754M251M981N582N652
59984D67160N291M919M659M267L508K142k6k536m201m396m084m522n358n156l714
59969D57953k454k369k841k903k587k355k069j279l5J200K096K583K721K738K844
59954D53243K915K657K117J668J439J281J141J025O94N2l31J22R35J027K15o58
59938D69542j204k026l411m478m215k675o15J447L355M999O337P385P896P518
$$ plain form
59924 489855 496279 501518 505558 507650 506701 502655 497065 492078 488933 487436 486625 485872 485371 485601 486546 487854
59908 487854 489625 492323 495690 498478 499777 500039 500190 500323 500035 499600 499798 500708 501580 501988 502337 503124 504396
59891 504396 506154 508612 511778 515237 518680 522283 526355 530895 535736 540849 546272 551874 557434 562922
59877 562922 568598 574728 581094 586862 591154 593787 595201 595675 595101 593660 592091 590798 589174 586429 582805
59862 582805 579385 576883 575234 574228 573868 574059 574464 574853 575324 576158 577722 580364 584048 588156 592042 595765
59846 595765 600048 605616 612739 621011 629135 635229 637999 637598 635098 631513 627861 625652 626248 629522 633859
59831 633859 637616 640114 641187 640590 638259 634696 630663 626600 622439 617772 612207 605808 599248 593238
59817 593238 587903 582987 578594 575326 573696 573726 575036 576899 578243 578108 576400 574031 572219 571626 571992
$$ packed form
59924D89855O424N239M040K092r49m046n590m987l145j497q11p53n01K30R45J308
59908D87854J771K698L367K788J299K62J51J33k88m35J98R10Q72M08L49P87J272
59891E04396J758K458L166L459L443L603M072M540M841N113N423N602N560N488
59877E62922N676O130O366N768M292K633J414M74n74j441j569j293j624k745l624
59862E82805l420k502j649j006l60J91M05L89M71Q34J564K642L684M108L886L723
59846E95765M283N568P123Q272Q124O094K770m01k500l585l652k209N96L274M337
59831F33859L757K498J073n97k331l563m033m063m161m667n565o399o560o010
59817E93238n335m916m393l268j630L0J310J863J344j35j708k369j812n93L66
$$ plain form
59802 571992 572442 572355 572053 572234 572590 571649 568552 564406 560987 558483 555457 550872 545178 539411 534235 530090
59786 530090 527274 525388 523345 520421 516914 513528 510585 508094 506013 504095 501909 499411 497207 495948
59772 495948 495771 496546 498353 501399 505615 510517 515426 519819 523697 527509 531540 535613 539724 544647 551161
59757 551161 558816 566233 572723 578901 585638 593193 601594 610976 620982 630464 638442 644973 650669 655772
59743 655772 660167 663870 666896 668967 669955 670475 671402 672752 673528 672814 670745 668240 666036 664215 662582
59728 662582 661138 659974 658864 657450 655882 654834 654574 654500 654058 653702 654247 655530 656495 656517 655886 654989 653888
59711 653888 652950 653081 654833 657781 661101 664358 667500 670655 674192 678480 683192 687369 690561 693474 697104
59696 697104 701669 706828 712461 718630 724968 730648 734885 737136 737047 734632 730475 725429 720112 714840 709844
$$ packed form
59802E71992M50q7l02J81L56r41l097m146l419k504l026m585n694n767n176m145
59786E30090k816j886k043k924l507l386k943k491k081j918k186k498k204j259
59772D95948j77P75J807L046M216M902M909M393L878L812M031M073M111M923O514
59757E51161P655P417O490O178O737P555Q401R382J0006R482P978O531N696N103
59743F55772M395L703L026K071R88N20R27J350P76p14k069k505k204j821j633
59728F62582j444j164j110j414j568j048k60p4m42l56N45J283R65K2o31q97j101
59711F53888r38J31J752K948L320L257L142L155L537M288M712M177L192K913L630
59696F97104M565N159N633O169O338N680M237K251q9k415m157n046n317n272m996
$$ plain form
59681 709844 705242 700872 696371 691417 685869 679791 673447 667101 660785 654406 648062 642027 636388 630995
59667 630995 625733 620617 615703 611343 608412 607610 608386 609181 609089 608777 609447 611355 613881 616612 619758 623579
59651 623579 627927 632450 636893 641082 644726 647422 648832 648774 647001 642990 636342 627593 618217 609362 600957
59636 600957 592556 584667 578452 574243 571237 568648 566300 563986 561202 557886 554611 551611 548264 543964
59622 543964 538878 533485 528034 522861 518533 515108 511862 508314 504959 502438 500588 498915 497449 496442
59608 496442 495733 495233 495601 497534 500542 503236 504801 505601 506427 507748 509546 511303 512237 512130 511881 512732
59592 512732 514942 517665 520006 521746 523090 524248 525253 525792 525264 523411 520828 518467 516649 514964 513012
59577 513012 510830 508640 506611 504854 503235 501168 498010 493773 489245 485379 482745 481438 481168 481408 481682
$$ packed form
59681G09844m602m370m501m954n548o078o344o346o316o379o344o035n639n393
59667F30995n262n116m914m360k931q02P76P95r2l12O70J908K526K731L146L821
59651F23579M348M523M443M189L644K696J410n8j773m011o648q749r376q855q405
59636F00957q401p889o215m209l006k589k348k314k784l316l275l000l347m300
59622E43964n086n393n451n173m328l425l246l548l355k521j850j673j466j007
59608D96442p09n00L68J933L008K694J565Q00Q26J321J798J757R34j07k49Q51
59592E12732K210K723K341J740J344J158J005N39n28j853k583k361j818j685j952
59577E13012k182k190k029j757j619k067l158m237m528l866k634j307k70K40K74
$$ plain form
59562 481682 481725 481305 480153 478343 476463 475036 473949 472833 471802 471378 471785 472810 474367 476668 479731
59547 479731 483092 486255 489215 492371 496081 500413 505302 510903 517858 527264 540366 558076 580243
59534 580243 604721 627200 642780 648634 645476 636649 626051 616679 610077 606239 604135 602900 602651
59521 602651 603981 606841 610237 612904 614064 613608 611780 608659 603932 597316 589158 580253 571091 561736
59507 561736 552528 544222 537152 530830 524831 519484 515204 511653 508228 504989 502426 500587 499058 497680
59493 497680 496699 496306 496468 497085 497906 498557 499062 500065 502086 504878 508020 511705 516274 521355 526244 530913
59477 530913 535794 540758 545228 549350 554076 559837 565794 570708 574030 575975 577098 577999 578915 579368 578689
59462 578689 577099 575821 575887 577264 579386 582105 585746 590530 596354 602986 610200 617691 625036 631808 637816
$$ packed form
59562D81682M3m20j152j810j880j427j087j116j031m24M07J025J557K301L063
59547D79731L361L163K960L156L710M332M889N601O955R406J3102J7710K2167
59534E80243K4478K2479J5580N854l158q827j0598r372o602l838k104j235k49
59521F02651J330K860L396K667J160m56j828l121m727o616q158q905r162r355
59507E61736r208q306p070o322n999n347m280l551l425l239k563j839j529j378
59493D97680r81l93J62O17Q21O51N05J003K021K792L142L685M569N081M889M669
59477E30913M881M964M470M122M726N761N957M914L322J945J123R01R16M53o79
59462E78689j590j278O6J377K122K719L641M784N824O632P214P491P345O772O008
$$ plain form
59447 637816 643247 648410 653194 656876 658595 657832 654375 648272 640209 631619 623903 617568 612409 608209
59433 608209 604794 601649 598169 594337 590743 587991 586444 586354 587696 590063 593355 598476 606604 617662
59419 617662 630171 642886 656041 670722 687472 705899 725542 746942 771641 800474 831173
59408 831173 857922 874292 877249 868457 852298 833408 815656 801888 793748 792230 798541 813250
59396 813250 833688 853034 863602 861675 849031 830215 809154 788172 768778 752059 738304 726972
59384 726972 717386 709278 702543 696874 691973 687962 685155 683426 682207 681123 680232 679566 678910 678215 677729
59369 677729 677459 676980 676199 675817 676563 678358 680707 683435 686460 689341 691910 695010 699620 705375 711013
59354 711013 716394 723043 732260 743605 755839 768700 782974 799100 816410 833797 850592 866645
$$ packed form
59447F37816N431N163M784L682J719p63l457o103q063q590p716o335n159m200
59433F08209l415l145l480l832l594k752j547r0J342K367L292N121Q128J1058
59419F17662J2509J2715J3155J4681J6750J8427J9643K1400K4699K8833L0699
59408H31173K6749J6370K957q792j6159j8890j7752j3768q140j518O311J4709
59396H13250K0438J9346J0568j927j2644j8816k1061k0982j9394j6719j3755j1332
59384G26972r586q108o735n669m901m011k807j729j219j084q91o66o56o95m86
59369F77729k70m79p81l82P46J795K349K728L025K881K569L100M610N755N638
59354G11013N381O649R217J1345J2234J2861J4274J6126J7310J7387J6795J6053
$$ plain form
59342 866645 881788 895564 907514 917523 925581 931266 933893 933357 930393 925649 918823 909188 896652
59329 896652 881882 865684 848771 831870 815405 799198 783049 767417 752979 739677 726959
59318 726959 714858 704081 694952 686974 679482 672101 664530 656580 648627 641358 634852 628492 621981 615940
59304 615940 611303 608688 608462 610813 615530 622261 631291 643483 658874 675437 689463 697208 696638 688384
59290 688384 675291 660656 646562 633786 622724 613643 606292 600222 595628 593172 592931 594352 597331
59277 597331 602437 609804 618733 628778 640377 653784 668106 682079 695277 707953 720139 731563
59265 731563 742129 751872 760507 767419 772023 774020 773554 771225 767635 762847 756736 749852 743281 737500
59251 737500 732111 727007 723047 721020 720590 720886 721673 723356 726168 729990 734694 740166 746077 751951 757288
$$ packed form
59342H66645J5143J3776J1950J0009Q058N685K627n36k964m744o826r635j2536
59329H96652j4770j6198j6913j6901j6465j6207j6149j5632j4438j3302j2718
59318G26959j2101j0777r129p978p492p381p571p950p953p269o506o360o511o041
59304F15940m637k615k26K351M717O731R030J2192J5391J6563J4026P745n70q254
59290F88384j3093j4635j4094j2776j1062r081p351o070m594k456k41J421K979
59277E97331N106P367Q929J0045J1599J3407J4322J3973J3198J2676J2186J1424
59265G31563J0566R743Q635O912M604J997m66k329l590m788o111o884o571n781
59251G37500n389n104l960k027m30K96P87J683K812L822M704N472N911N874N337
$$ plain form
59236 757288 761501 764141 765431 766084 766269 765205 762193 757533 751983 745742 738476 730006 720438 709934
59222 709934 698804 687574 676521 665478 654470 644213 635475 628276 622193 617109 613087 609797 606772
59209 606772 604162 602632 602415 602904 603225 602927 602164 601507 601586 602629 604327 606285 608497 611207 614467 618043
59193 618043 621673 625289 629075 633357 638225 643210 647631 651324 654743 658237 661632 664619 667131 669099
59179 669099 670297 670675 670524 670039 669118 667784 666380 665120 663835 662484 661470 661097 661128 661268 661742 662979
59163 662979 664951 667144 668934 669793 669463 668214 666554 664439 661115 655961 649104 641030 632188 623251 615125
59148 615125 608134 601728 595449 589711 585032 580953 576436 571011 564989 558754 552480 546362 540551 534975
59134 534975 529667 525116 521828 519712 518254 517215 516725 516845 517371 518041 518811 520159 523136 528615 536200
$$ packed form
59236G57288M213K640J290O53J85j064l012m660n550o241p266q470r568j0504
59222G09934j1130j1230j1053j1043j1008j0257q738p199o083n084m022l290l025
59209F06772k610j530k17M89L21k98p63o57P9J043J698J958K212K710L260L576
59193F18043L630L616L786M282M868M985M421L693L419L494L395K987K512J968
59179F69099J198L78j51m85r21j334j404j260j285j351j014l73L1J40M74J237
59163F62979J972K193J790Q59l30j249j660k115l324n154o857q074q842q937q126
59148F15125o991o406o279n738m679m079m517n425o022o235o274o118n811n576
59134E34975n308m551l288k116j458j039m90J20N26O70P70J348K977N479P585
$$ plain form
59119 536200 544413 552355 560682 570509 581820 593560 604917 615906 626947 638388 650210 661773
59107 661773 672108 680894 688799 696519 703853 710210 715481 719835 723002 724487 724263 722695 720064 716681
59093 716681 713161 710020 707256 704812 703011 701962 700999 699532 698080 697562 697754 697299 695202 691547 686823
59078 686823 681337 675355 669089 662447 655313 648042 641173 634784 628753 623456 619405 616215 612783 608636
59064 608636 604403 600742 597523 594371 591388 588907 586914 585073 583103 580916 578600 576416 574654 573404
59050 573404 572600 572231 572316 572725 573306 574120 575362 577041 578912 580601 581708 582048 581895 581731 581604 581183 580673
59033 580673 581048 582921 585692 588430 591147 594590 599212 605128 612735 622430 633745 645560 657264 669109
59019 669109 681404 693951 706250 717631 727131 733814 737402 738293 737004 734010 729968 725589 721241
$$ packed form
59119E36200Q213P942Q327R827J1311J1740J1357J0989J1041J1441J1822J1563
59107F61773J0335Q786P905P720P334O357N271M354L167J485k24j568k631l383
59093G16681l520l141k764k444j801j049r63j467j452n18J92m55k097l655m724
59078F86823n486n982o266o642p134p271o869o389o031n297m051l190l432m147
59064F08636m233l661l219l152k983k481j993j841j970k187k316k184j762j250
59050E73404q04l69Q5M09N81Q14J242J679J871J689J107L40j53j64j27m21n10
59033E80673L75J873K771K738K717L443M622N916P607R695J1315J1815J1704J1845
59019F69109J2295J2547J2299J1381R500O683L588Q91j289k994m042m379m348
$$ plain form
59006 721241 717015 713125 709969 708021 707956 710508 715664 722345 729422 736732 744460 751956 758015 762147 764644
58991 764644 765535 764442 761602 758090 754690 751121 746663 741072 734700 728254 722650 718681 716625 716356 717795
58976 717795 720922 725462 731023 737530 745175 754014 763960 775014 787113 799871 812822 825684 838124
58963 838124 849652 860175 870126 879444 886998 891791 894231 895253 894633 891254 884863 876372 866416 854695
58949 854695 840921 825576 809594 794048 780050 768049 757167 746182 735292 726020 719336 714800
58937 714800 711635 709534 708148 706765 705014 703079 700964 698390 695733 694134 694160 695091 695948 696467 696678 696362
58921 696362 695508 694660 694207 693924 693654 693877 695051 696919 699022 701460 704659 708796 713934 720398 728463 737844
58905 737844 747885 758123 768481 779157 790443 802435 814776 826928 838615 849632 859311 866816
$$ packed form
59006G21241m226l890l156j948o5K552N156O681P077P310P728P496O059M132K497
58991G64644Q91j093k840l512l400l569m458n591o372o446n604l969k056k69J439
58976G17795L127M540N561O507P645Q839R946J1054J2099J2758J2951J2862J2440
58963H38124J1528J0523R951R318P554M793K440J022o20l379o391q491r956j1721
58949H54695j3774j5345j5982j5546j3998j2001j0882j0985j0890r272o684m536
58937G14800l165k101j386j383j751j935k115k574k657j599K6R31Q57N19K11l16
58921F96362q54q48m53k83k70K23J174J868K103K438L199M137N138O464Q065R381
58905G37844J0041J0238J0358J0676J1286J1992J2341J2152J1687J1017R679P505
$$ plain form
58893 866816 872189 876610 881482 887637 895532 905624 918276 933463 950585 968254 984567 998239
58881 998239 1009498 1019281 1027702 1034017 1037971 1040194 1041115 1040358 1037553 1032988 1027190 1020576 1013795 1007599
58867 1007599 1001913 995683 988071 979286 969883 959813 948638 936193 922608 907979 892391 876090
58855 876090 859453 842923 826915 811550 796687 782604 770202 759880 750566 740758 730278 720007
58843 720007 710130 699936 689359 679328 670164 660983 651266 641957 634232 628111 622935 618382 614297
58830 614297 610279 606230 602787 600549 599320 598623 598446 599010 600337 602467 605585 609512 613591 617449 621375
58815 621375 625621 629921 633997 637882 641430 644204 646182 647871 649399 650204 649957 648972 647301 644419 640323
58800 640323 636087 632591 629450 625843 621731 617512 613177 608613 604191 600273 596588 592817 589438 587299
$$ packed form
58893H66816N373M421M872O155P895J0092J2652J5187J7122J7669J6313J3672
58881I98239J1259R783Q421O315L954K223R21p57k805m565n798o614o781o196
58867A007599n686o230p612q785r403j0070j1175j2445j3585j4629j5588j6301
58855H76090j6637j6530j6008j5365j4863j4083j2402j0322r314r808j0480j0271
58843G20007r877j0194j0577j0031r164r181r717r309p725o121n176m553m085
58830F14297m018m049l443k238j229o97j77N64J327K130L118L927M079L858L926
58815F21375M246M300M076L885L548K774J978J689J528Q05k47r85j671k882m096
58800F40323m236l496l141l607m112m219m335m564m422l918l685l771l379k139
$$ plain form
58786 587299 586622 587006 588089 589754 591940 594732 598393 603030 608518 614928 622570 631327 640323 648406 654560
58771 654560 657806 657430 653488 646618 637366 626413 615240 605439 597171 589389 581706 574878 569219 564002
58757 564002 559013 555330 553704 553322 553008 552685 552713 552742 552153 550947 549469 547949 546930 547294 549275 552289
58741 552289 556178 561515 568134 574704 580591 586827 594265 602101 609335 616409 624053 631717 638642 645441
58727 645441 653006 660664 667039 672112 676830 681254 684683 687328 690381 694578 699871 706274 713847 722082
58713 722082 730337 738522 746493 753302 758069 760967 762255 761079 756499 749042 739876 729038 715947 701087
58699 701087 685599 669523 652059 633396 614839 597240 580685 565581 552672 541965 532789 524801
58687 524801 517851 511220 504338 497958 493217 489786 486321 482500 479114 476398 473933 472108 471891 472984
$$ packed form
58786E87299o77L84J083J665K186K792L661M637N488O410P642Q757Q996Q083O154
58771F54560L246l76l942o870r252j0953j1173r801q268p782p683o828n659n217
58757E64002m989l683j626l82l14l23K8K9n89j206j478j520j019L64J981L014
58741E52289L889N337O619O570N887O236P438P836P234P074P644P664O925O799
58727F45441P565P658O375N073M718M424L429K645L053M197N293O403P573Q235
58713G22082Q255Q185P971O809M767K898J288j176m580p457r166j0838j3091j4860
58699G01087j5488j6076j7464j8663j8557j7599j6555j5104j2909j0707r176p988
58687E24801o950o631o882o380m741l431l465l821l386k716k465j825k17J093
$$ plain form
58673 472984 473880 474077 474711 476621 479320 482410 486627 492863 501262 511845 524895 539989 555435 569163
58659 569163 579596 585651 586883 583914 577917 569544 559214 548242 538446 530389 523234 516488 510645
58646 510645 505794 500976 495563 490210 485738 482024 478656 475932 474557 474906 476970 480420 484339 487564
58632 487564 489685 491250 492760 494102 495129 496097 497168 498015 498184 497442 495796 493701 492194 492119 493211 494613
58616 494613 496194 498593 502040 506059 510361 515106 520151 524956 529382 533760 537920 541049 542799 543819
58602 543819 544903 546210 547507 548561 549057 548699 547571 546016 544145 541909 539518 537325 535562 534701 535713
58587 535713 539246 544864 551851 560349 570801 582606 594311 604970 614475 622913 630566 638135 645902
58574 645902 653025 658732 663848 669917 677309 685601 695479 708571 725444 745312 767797 793425 822271
$$ packed form
58673D72984Q96J97O34J910K699L090M217O236Q399J0583J3050J5094J5446J3728
58659E69163J0433O055J232k969n997q373j0330j0972r796q057p155o746n843
58646E10645m851m818n413n353m472l714l368k724j375L49K064L450L919L225
58632D87564K121J565J510J342J027R68J071Q47J69p42j646k095j507p5J092J402
58616D94613J581K399L447M019M302M745N045M805M426M378M160L129J750J020
58602E43819J084J307J297J054M96l58j128j555j871k236k391k193j763q61J012
58587E35713L533N618O987Q498J0452J1805J1705J0659R505Q438P653P569P767
58574F45902P123N707N116O069P392Q292R878J3092J6873J9868K2485K5628K8846
$$ plain form
58561 822271 853600 886978 922134 957411 989935 1017806 1040789 1058561 1069920 1074421 1073431 1068781
58549 1068781 1061518 1052665 1044013 1037158 1032343 1028695 1024910 1019389 1010613 997910 981343 960841 936295
58536 936295 908568 879357 849947 821021 793674 769373 748665 730996 715944 703546 693373
58525 693373 684552 676881 670708 665583 660389 654984 650385 647063 644377 641907 639824 637647 634221 629556
58511 629556 625316 622803 621682 621189 621313 622132 623133 623864 624282 624123 622985 621410 620653 620954 621164 620434 619096
58494 619096 617606 615948 614502 614214 615505 618067 621920 627364 633859 640522 647922 657671 670053 683854
58480 683854 698859 716371 736627 757836 778709 799894 821574 841367 856023 863895 864823 859225
58468 859225 848702 836207 824137 813059 803113 795378 790809 789035 789322 791757 796603 803506 812149
$$ packed form
58561H22271L1329L3378L5156L5277L2524K7871K2983J7772J1359M501r90m650
58549A068781p263q853q652o855m815l648l785n521q776j2703j6567k0502k4546
58536I36295k7727k9211k9410k8926k7347k4301k0708j7669j5052j2398j0173
58525F93373q821p671o173n125n194n405m599l322k686k470k083k177l426m665
58511F29556m240k513j121m93J24Q19J001P31M18j59j138j575p57L01K10p30j338
58494F19096j490j658j446k88J291K562L853N444O495O663P400R749J2382J3801
58480F83854J5005J7512K0256K1209K0873K1185K1680J9793J4656P872R28n598
58468H59225j0523j2495j2070j1078r946p735m569j774K87K435M846O903Q643
$$ plain form
58455 812149 822613 834472 846715 859112 872224 885376 896100 902367 903813 900069 889778 872637
58443 872637 851005 828223 806438 786843 770483 757606 747538 740177 736324 735698 736316 736971 738731
58430 738731 742803 748537 754856 762150 771279 782029 793928 807271 821953 836457 849230 859868
58418 859868 867865 871654 870255 864627 856219 845513 833126 820819 809943 800091 790512 781594 773823
58405 773823 766698 759892 754127 749792 746200 743264 742272 743825 746704 749897 753881 758690 762881 765948
58391 765948 769668 775182 780676 783849 784849 784910 784017 782015 780215 779689 779504 778651 778090 778862 779906 779995 780186
58374 780186 782097 785336 788847 793242 799423 806426 813000 819879 828205 837278 846246 856439 869406 884108
58360 884108 898600 913006 928206 943060 955791 966773 977139 985891 991245 993708 995036 995300 993882
$$ packed form
58455H12149J0464J1859J2243J2397J3112J3152J0724O267J446l744j0291j7141
58443H72637k1632k2782k1785j9595j6360j2877j0068p361l853o26O18O55J760
58430G38731M072N734O319P294R129J0750J1899J3343J4682J4504J2773J0638
58418H59868P997L789j399n628q408j0706j2387j2307j0876r852r579q918p771
58405G73823p125o806n765m335l592k936r92J553K879L193L984M809M191L067
58391G65948L720N514N494L173J000O1q93k002j800n26j85q53n61P72J044Q9J91
58374G80186J911L239L511M395O181P003O574O879Q326R073Q968J0193J2967J4702
58360H84108J4492J4406J5200J4854J2731J0982J0366Q752N354K463J328K64j418
$$ plain form
58347 993882 992190 992344 994102 995932 998181 1002251 1007693 1013151 1019321 1027972 1038827 1050432 1063218 1078541
58333 1078541 1095446 1111652 1127252 1144212 1162535 1179950 1195074 1207970 1217889 1223452 1225074 1224656
58321 1224656 1223103 1220477 1217924 1216857 1216785 1216512 1216823 1219491 1224461 1230631 1238456 1248972 1261096 1272792
58307 1272792 1284096 1296258 1308948 1321179 1333908 1348666 1364654 1380161 1395633 1412195 1428556
58296 1428556 1442856 1456227 1470909 1486173 1499901 1512904 1527621 1543669 1558905 1573900 1591072
58285 1591072 1610223 1629307 1648864 1671248 1696051 1720716 1745232 1771897 1800956 1830846 1862168
58274 1862168 1896893 1934188 1971669 2010268 2053081 2099730 2146619 2192580 2239612 2288457 2338215
58263 2338215 2389908 2445509 2503668 2561152 2617986 2676262 2734740 2790052 2842617 2895801 2949840
$$ packed form
58347I93882j692J54J758J830K249M070N442N458O170Q651J0855J1605J2786J5323
58333A078541J6905J6206J5600J6960J8323J7415J5124J2896R919N563J622m18
58321A224656j553k626k553j067p2k73L11K668M970O170P825J0516J2124J1696
58307A272792J1304J2162J2690J2231J2729J4758J5988J5507J5472J6562J6361
58296A428556J4300J3371J4682J5264J3728J3003J4717J6048J5236J4995J7172
58285A591072J9151J9084J9557K2384K4803K4665K4516K6665K9059K9890L1322
58274A862168L4725L7295L7481L8599M2813M6649M6889M5961M7032M8845M9758
58263B338215N1693N5601N8159N7484N6834N8276N8478N5312N2565N3184N4039
$$ plain form
58252 2949840 3002439 3054845 3111277 3172570 3236360 3303108 3375760 3453886 3534663 3619267 3711671
58241 3711671 3811533 3915274 4023689 4141157 4267672 4399414 4537098 4685762 4846197 5014707
58231 5014707 5191547 5381306 5584836 5799384 6026752 6272377 6536353 6814882 7110629
58222 7110629 7431685 7780358 8153647 8554661 8992126 9468525 9981191 10535668 11145006
58213 11145006 11815342 12546271 13346531 14234734 15223890 16321687 17547992 18935652 20513710
58204 20513710 22309915 24372814 26772855 29584615 32898888 36861566 41674943 47551106
58196 47551106 54687284 63294040 73629605 86028142 100968453 119162866 141572221
58189 141572221 169322313 203506615 244639012 291523551 340041154 383184610 413222114
$$ packed form
58252B949840N2599N2406N6432O1293O3790O6748P2652P8126Q0777Q4604R2404
58241C711671R9862J03741J08415J17468J26515J31742J37684J48664J60435J68510
58231E014707J76840J89759K03530K14548K27368K45625K63976K78529K95747
58222G110629L21056L48673L73289M01014M37465M76399N12666N54477O09338
58213A1145006O70336P30929Q00260Q88203R89156J097797J226305J387660J578058
58204B0513710J796205K062899K400041K811760L314273L962678M813377N876163
58196D7551106P136178Q606756J0335565J2398537J4940311J8194413K2409355
58189A41572221K7750092L4184302M1132397M6884539M8517603M3143456L0037504
$$ plain form
58182 413222114 425024441 418221834 396667541 365931297 330877913 294698975 259225702
58175 259225702 225593062 194628439 166910290 142702102 121940677 104333926 89502237
58168 89502237 77065756 66661727 57950759 50639313 44487610 39292186 34876346 31100181
58160 31100181 27860736 25072814 22658797 20557185 18724212 17120078 15703948 14444992
58152 14444992 13325384 12327600 11429202 10613494 9874310 9206026 8598349 8044408 7544080
58143 7544080 7094944 6688309 6317760 5983348 5683676 5411440 5160159 4927895 4711176
58134 4711176 4502737 4299055 4103710 3919966 3746021 3580240 3424665 3280094 3143424
58125 3143424 3012959 2891002 2778503 2672399 2570939 2476495 2390445 2310075 2233060 2160368
$$ packed form
58182D13222114J1802327o802607k1554293l0736244l5053384l6178938l5473273
58175B59225702l3632640l0964623k7718149k4208188k0761425j7606751j4831689
58168H9502237j2436481j0404029q710968p311446o151703n195424m415840l776165
58160C1100181l239445k787922k414017k101612j832973j604134j416130j258956
58152A4444992j119608r97784q98398q15708p39184o68284o07677n53941n00328
58143G544080m49136m06635l70549l34412k99672k72236k51281k32264k16719
58134D711176k08439k03682j95345j83744j73945j65781j55575j44571j36670
58125C143424j30465j21957j12499j06104j01460r4444q6050q0370p7015p2692
$$ plain form
58115 2160368 2092402 2026791 1962404 1901254 1844343 1789740 1736512 1686255 1639010 1592204 1545385
58104 1545385 1501553 1461881 1423593 1385072 1348643 1316164 1286229 1258000 1233494 1213470 1194905
58093 1194905 1175173 1155273 1136592 1118057 1098852 1080663 1064741 1049668 1034152 1019116 1005081
58082 1005081 990420 974062 957114 940115 921673 901466 881523 862817 843684 823311 803606
58071 803606 785817 768475 750666 734196 720411 707851 695169 683476 673709 664581 655411 648123
58059 648123 643984 640901 636371 630736 625206 618968 610778 601380 591999 582170 571269 560457 551132 543014
58045 543014 535504 529141 524050 518820 512631 506694 501954 497291 491621 485816 480823 475887 470405 465514
58031 465514 461866 457723 451203 442797 433865 424385 414103 404207 395912 388832 382445 377586 374789 372789
$$ packed form
58115B160368o7966o5611o4387o1150n6911n4603n3228n0257m7245m6806m6819
58104A545385m3832l9672l8288l8521l6429l2479k9935k8229k4506k0024j8565
58093A194905j9732j9900j8681j8535j9205j8189j5922j5073j5516j5036j4035
58082A005081j4661j6358j6948j6999j8442k0207j9943j8706j9133k0373j9705
58071H03606j7789j7342j7809j6470j3785j2560j2682j1693r767r128r170p288
58059F48123m139l083m530n635n530o238q190r398r381r829j0901j0812r325q118
58045E43014p510o363n091n230o189n937m740m663n670n805m993m936n482m891
58031D65514l648m143o520q406q932r480j0282r896q295p080o387m859k797k000
$$ plain form
58017 372789 370459 368624 368198 368162 367252 366024 365370 364573 362825 361215 361088 361716 361558 360679 360050 359712 359546
58000 359546 360648 363941 368375 372374 376039 380174 384153 386606 387318 386677 384138 379079 372417 365716 359298
57985 359298 352743 346442 341148 336663 332380 328410 324947 321424 317557 314241 312163 310554 308596 306894
57971 306894 306198 305973 305730 306440 308891 311786 313334 313656 313859 313790 312722 311293 310603 310050 308167 305195 302809
57954 302809 301607 300637 299172 297251 294745 291531 288437 286539 285736 285352 285686 287457 290180 292754 295422
57939 295422 299545 305518 312434 319804 328100 337526 347551 357852 368603 379647 390270 399840 407912
57926 407912 413741 416410 415351 410336 401475 389826 377325 365317 353636 341731 329852 318376
57914 318376 307006 295800 286088 279178 274768 271751 269855 269346 269931 271224 273596 277276 281228 284155
$$ packed form
58017C72789k330j835m26l6r10j228o54p97j748j610j27O28j58q79o29l38j66
58000C59546J102L293M434L999L665M135L979K453P12o41k539n059o662o701o418
57985C59298o555o301n294m485m283l970l463l523l867l316k078j609j958j702
57971C06894o96k25k43P10K451K895J548L22K03o9j068j429o90n53j883k972k386
57954C02809j202r70j465j921k506l214l094j898q03l84L34J771K723K574K668
57939B95422M123N973O916P370Q296R426J0025J0301J0751J1044J0623R570Q072
57926D07912N829K669j059n015q861j1649j2501j2008j1681j1905j1879j1476
57914C18376j1370j1206r712o910m410l017j896n09N85J293K372L680L952K927
$$ plain form
57900 284155 285920 286843 286505 284680 282620 281774 281828 281573 281090 281455 282846 284615 286805 289897 293368 296244
57884 296244 298767 301845 305081 307135 307898 308572 309569 310152 310305 311151 313030 314664 314813 313592 311861 310460
57868 310460 310359 312289 315670 318816 320611 321322 321640 321838 322057 322604 323708 325478 328018 331021 333631 335468
57852 335468 337402 340417 344126 347361 349730 351437 352109 351216 349361 347709 346292 344216 341367 338471 335527
57837 335527 331787 327429 323788 321622 320406 319614 319460 320074 321145 322691 325113 328228 331282 334120 337305
57822 337305 340973 344657 348277 352046 355283 356707 356272 355419 355083 354669 353379 351243 348199 343406 336368
57807 336368 327847 318931 309978 301067 292730 285488 279227 273586 268481 263873 259563 255658 252707 250993
57793 250993 250073 249234 247950 245872 243010 240122 238261 237752 238127 239115 241008 243964 247686 251956 256824
$$ packed form
57900B84155J765R23l38j825k060q46N4k55m83L65J391J769K190L092L471K876
57884B96244K523L078L236K054P63O74R97N83J53Q46J879J634J49j221j731j401
57868C10460j01J930L381L146J795P11L18J98K19N47J104J770K540L003K610J837
57852C35468J934L015L709L235K369J707O72q93j855j652j417k076k849k896k944
57837C35527l740m358l641k166j216p92j54O14J071J546K422L115L054K838L185
57822C37305L668L684L620L769L237J424m35q53l36m14j290k136l044m793p038
57807C36368q521q916q953q911q337p242o261n641n105m608m310l905k951j714
57793B50993r20q39j284k078k862k888j861n09L75R88J893K956L722M270M868
$$ plain form
57778 256824 262047 267020 271449 275574 279636 283671 287782 291950 295616 298101 299360 299598 298371 295060
57764 295060 290194 285274 281133 277365 273439 269429 265451 261360 257315 253853 251196 249235 248285 248979 251249
57749 251249 254251 257430 260833 264349 267672 271154 275657 281187 286620 291063 294612 297542 299753 301356
57735 301356 302855 304301 305081 304919 304295 303616 302804 301946 301432 301115 300262 298677 296958 295318 293208 290543
57719 290543 288299 287273 287062 286816 286258 285460 284412 283319 282564 281973 280855 279203 277995 277762 277710 276857 275364
57702 275364 274127 273718 274273 275835 278261 281257 284816 289108 293693 297510 299839 300585 299600 296727 292720
57687 292720 288901 285510 281551 276779 272611 270246 269055 267747 266206 265200 265141 266194 269001 274302 282339
57672 282339 293423 308603 329043 355395 388574 430456 482629 544194 610660 674063 723973
$$ packed form
57778B56824N223M973M429M125M062M035M111M168L666K485J259K38j227l311
57764B95060m866m920m141l768l926m010l978m091m045l462k657j961r50O94K270
57749B51249L002L179L403L516L323L482M503N530N433M443L549K930K211J603
57735C01356J499J446P80j62o24o79q12q58n14l17q53j585j719j640k110k665
57719B90543k244j026k11k46n58p98j048j093p55n91j118j652j208k33n2q53j493
57702B75364j237m09N55J562K426K996L559M292M585L817K329P46r85k873m007
57687B92720l819l391l959m772m168k365j191j308j541j006n9J053K807N301Q037
57672B82339J1084J5180K0440K6352L3179M1882N2173O1565O6466O3403M9910
$$ plain form
57661 723973 750448 748599 721117 675996 621927 565690 512048 463829 421698 384938 352960 325825
57649 325825 303584 285786 271545 259704 249283 240250 233563 229858 228362 227513 226324 224748 223120
57636 223120 221802 221014 220527 219800 218735 217895 217682 217836 218087 218585 219229 219278 218271 216703 215207 213672 211816
57619 211816 209969 208521 207154 205378 203325 201310 199094 196303 193188 190286 187786 185740 184283 183023
57605 183023 180929 177680 174503 172814 172578 172791 172963 173126 173000 172188 170867 169333 167312 164622 161991 160215
57589 160215 158947 157387 155650 154314 153064 151172 149018 147724 147325 146648 145085 143227 141557 139721 137416
57574 137416 134995 132843 130997 129633 129058 128993 128626 127641 126484 125455 124273 122723 121026 119382 117784
57559 117784 116434 115661 115293 114753 113934 113391 113599 114628 116508 119210 122207 124878 127412 130520 134077 136859
$$ packed form
57661G23973K6475j849k7482m5121n4069n6237n3642m8219m2131l6760l1978k7135
57649C25825k2241j7798j4241j1841j0421r033o687l705j496q49j189j576j628
57636B23120j318p88m87p27j065q40k13J54K51M98O44M9j007j568j496j535j856
57619B11816j847j448j367j776k053k015k216k791l115k902k500k046j457j260
57605A83023k094l249l177j689k36K13J72J63j26q12j321j534k021k690k631j776
57589A60215j268j560j737j336j250j892k154j294l99o77j563j858j670j836k305
57574A37416k421k152j846j364n75o5l67r85j157j029j182j550j697j644j598
57559A17784j350p73l68n40q19n43K08J029J880K702K997K671K534L108L557K782
$$ plain form
57543 136859 137917 137523 136495 135329 134339 133941 134285 134970 135499 135678 135400 134439 132715 130425 127802 125101
57527 125101 122859 121705 121703 122210 122479 122202 121556 121108 121496 122746 124027 124575 124662 125077 125900 126582 127089 128087
57509 128087 129922 132199 134447 136424 137704 137863 137285 136891 136808 136237 134947 133898 133707 133359 131340 127549
57493 127549 123297 119732 117036 114971 113443 112431 111831 111529 111396 111238 110958 110703 110667 110843 111159 111726 112678
57476 112678 113771 114354 113842 112217 109989 107688 105456 103219 101035 98961 96628 93516 89854 86749 85053
57461 85053 84514 84418 84609 85301 86272 86996 87425 87924 88524 88843 88702 88195 87195 85429 83138 81128 80062 80103
57443 80103 81182 83109 85378 87382 88899 90084 91073 92018 93253 94853 96160 96377 95578 94615 94133 94226
57427 94226 94798 95515 95573 94425 92727 91766 91856 92117 91885 91444 91179 90899 90366 89722 89040 88100 87032 86594 87502
$$ packed form
57543A36859J058l94j028j166r90l98L44O85N29J79k78r61j724k290k623k701
57527A25101k242j154kN07K69k77o46m48L88J250J281N48Q7M15Q23O82N07R98
57509A28087J835K277K248J977J280J59n78l94q3n71j290j049j91l48k019l791
57493A27549m252l565k696k065j528j012o00l02j33j58k80k55l6J76L16N67R52
57476A12678J093N83n12j625k228k301k232k237k184k074k333l112l662l105j696
57461H5053n39r6J91O92R71P24M29M99O00L19j41n07j000j766k291k010j066M1
57443H0103J079J927K269K004J517J185R89R45J235J600J307K17p99r63m82R3
57427I4226N72P17N8j148j698r61R0K61k32m41k65k80n33o44o82r40j068m38R08
$$ plain form
57408 87502 89840 93234 96991 99982 101153 100463 98725 96337 92903 88391 83855 80519 78635 77636 76924
57393 76924 76193 75548 75603 76919 79061 80786 81456 81656 82187 83193 84656 86979 90360 94117 97209 99048
57377 99048 99441 98341 96240 94221 92831 91228 88123 83371 77995 72805 67736 62570 57750 54106 52004
57362 52004 50968 50210 49553 49654 51176 53851 56660 58847 60445 61968 64020 67058 71021 75204 79000
57347 79000 82661 86795 91292 95530 99532 103978 108951 113699 117901 122227 127202 132378 137142 141515
57333 141515 145568 148762 150573 151265 151465 151401 151011 150311 149166 147177 144309 141212 138519 136263 134274 132550
57317 132550 130855 128655 125994 123816 122806 122421 121640 120225 118656 117313 116289 115613 115091 114301 113168
57302 113168 112138 111381 110411 108953 107611 107094 107346 108002 109062 110465 111592 111992 112056 112248 112235 111572 110725
$$ packed form
57408H7502K338L394L757K991J171o90j738k388l434m512m536l336j884r99p12
57393G6924p31o45N5J316K142J725O70K00N31J006J463K323L381L757L092J839
57377I9048L93j100k101k019j390j603l105m752n376n190n069n166m820l644k102
57362E2004j036p58o57J01J522K675K809K187J598J523K052L038L963M183L796
57347G9000L661M134M497M238M002M446M973M748M202M326M975N176M764M373
57333A41515M053L194J811O92K00o4l90p00j145j989k868l097k693k256j989j724
57317A32550j695k200k661k178j010l85p81j415j569j343j024o76n22p90j133
57302A13168j030p57r70j458j342n17K52O56J060J403J127M00O4J92j3o63q47
$$ plain form
57285 110725 110390 110231 109369 107883 106765 106425 106248 105737 105203 105053 105112 104990 104694 104644 105214 106318 107366 107892
57267 107892 108357 109845 112593 115293 116474 116209 115849 116381 117673 119099 120181 120697 120721 120612 120641 120784 121099
57250 121099 121896 123127 124073 124159 123763 123656 124036 124609 125211 125749 125898 125581 125375 125813 126531 126744 126227 125284 124175
57231 124175 123254 123212 124334 125849 126792 127211 127735 128376 128662 128657 128884 129426 130031 130954 132697 135029 137199 139061
57213 139061 141051 143156 144919 146497 148673 151632 154622 157018 158895 160432 161622 162832 164756 167495
57199 167495 170398 173124 176214 180252 185105 190283 195540 200763 205729 210257 214383 218244 222087 226309
57185 226309 231095 236105 240931 245742 250992 256726 262752 269237 276443 284098 291831 300083 309694 320579
57171 320579 331719 342565 353575 365210 377213 389198 401207 413418 425890 438836 452577
$$ packed form
57285A10725l35j59q62j486j118l40j77n11n34j50N9j22k96n0N70J104J048N26
57267A07892M65J488K748K700J181k65l60N32J292J426J082N16K4j09K9J43L15
57250A21099P97J231R46Q6l96j07L80N73O02N38J49l17k06M38P18K13n17r43j109
57231A24175r21m2J122J515R43M19N24O41K86nK27N42O05R23J743K332K170J862
57213A39061J990K105J763J578K176K959K990K396J877J537J190J210J924K739
57199A67495K903K726L090M038M853N178N257N223M966M528M126L861L843M222
57185B26309M786N010M826M811N250N734O026O485P206P655P733Q252R611J0885
57171C20579J1140J0846J1010J1635J2003J1985J2009J2211J2472J2946J3741
$$ plain form
57160 452577 467042 481852 497012 513026 530266 548776 568589 589603 611140 632384 653353
57149 653353 674833 697338 720805 745320 771316 799000 828271 859347 892722 928400 965805
57138 965805 1004509 1044422 1085376 1127410 1171400 1218395 1268112 1318980 1369937 1421408 1474449
57127 1474449 1529886 1588613 1651842 1720457 1794417 1872791 1953866 2035482 2116276 2196785 2278670
57116 2278670 2363066 2450514 2542152 2639527 2743093 2852162 2966664 3088111 3218939 3362310
57106 3362310 3522916 3706767 3919920 4168477 4460136 4805000 5215669 5708857 6308073
57097 6308073 7044150 7953645 9078041 10463062 12154291 14190199 16598299 19395481
57089 19395481 22587499 26165992 30105497 34357118 38832082 43382157 47797979 51834204
$$ packed form
57160D52577J4465J4810J5160J6014J7240J8510J9813K1014K1537K1244K0969
57149F53353K1480K2505K3467K4515K5996K7684K9271L1076L3375L5678L7405
57138I65805L8704L9913M0954M2034M3990M6995M9717N0868N0957N1471N3041
57127A474449N5437N8727O3229O8615P3960P8374Q1075Q1616Q0794Q0509Q1885
57116B278670Q4396Q7448R1638R7375J03566J09069J14502J21447J30828J43371
57106C362310J60606J83851K13153K48557K91659L44864M10669M93188N99216
57097F308073P36077R09495J124396J385021J691229K035908K408100K797182
57089A9395481L192018L578493L939505M251621M474964M550075M415822M036225
$$ plain form
57081 51834204 55244676 57809668 59360775 59814998 59203412 57663512 55390422 52580056
57073 52580056 49398436 45979835 42435152 38857856 35327012 31908893 28657300 25614110
57065 25614110 22810505 20265827 17983372 15949269 14139457 12530134 11102727 9841821
57057 9841821 8732041 7757812 6904191 6156717 5501327 4925397 4418696 3972875 3580318
57048 3580318 3233892 2927755 2657915 2421518 2215371 2035377 1877605 1739438 1619095
57039 1619095 1514339 1422515 1341795 1271351 1210071 1156030 1107688 1064812 1027851 997273 974042
57028 974042 959889 956525 965511 989352 1030540 1086594 1145687 1189592 1203237 1182564 1134290 1069729
57016 1069729 998991 928745 862503 801634 746477 697195 653983 616706 584604 556442 531023
$$ packed form
57081E1834204L410472K564992J551107M54223o11586j539900k273090k810366
57073E2580056l181620l418601l544683l577296l530844l418119l251593l043190
57065B5614110k803605k544678k282455k034103j809812j609323j427407j260906
57057I841821j109780r74229q53621p47474o55390n75930n06701m45821l92557
57048C580318l46426l06137k69840k36397k06147j79994j57772j38167j20343
57039A619095j04756r1824q0720p0444o1280n4041m8342m2876l6961l0578k3231
57028I74042j4153l364Q986K3841M1188N6054N9093M3905J3645k0673m8274o4561
57016A069729p0738p0246o6242o0869n5157m9282m3212l7277l2102k8162k5419
$$ plain form
57005 531023 507720 486683 468414 452974 439638 427461 416135 406101 397795 390953 384812 378945
56993 378945 373803 370342 369170 370056 372290 375491 379959 386252 394639 405132 417699 431781 445374
56980 445374 455141 457980 452693 440207 422658 402497 381908 362297 344136 327546 312835 300236
56968 300236 289513 280522 273951 270766 270945 273553 278167 285455 296171 310461 328520 350922 377204
56955 377204 404333 427332 441683 445242 438566 424137 405138 384270 363268 343224 324958 308904
56943 308904 295051 283279 273559 265833 260154 257118 257688 262410 271276 284510 302892 327006 356573
56930 356573 390414 425943 458286 481206 490291 485265 469007 445127 416982 387695 359400 332564
56918 332564 307028 283462 262852 245008 228884 214355 202460 193713 187170 181441 175785 169978
$$ packed form
57005E31023k3303k1037j8269j5440j3336j2177j1326j0034q306o842o141n867
56993C78945n142l461j172Q86K234L201M468O293Q387J0493J2567J4082J3593
56980D45374R767K839n287j2486j7549k0161k0589j9611j8161j6590j4711j2599
56968C00236j0723q991o571l185J79K608M614P288J0716J4290J8059K2402K6282
56955C77204K7129K2999J4351L559o676j4429j8999k0868k1002k0044j8266j6054
56943C08904j3853j1772r720p726n679l036N70M722Q866J3234J8382K4114K9567
56930C56573L3841L5529L2343K2920R085n026j6258k3880k8145k9287k8295k6836
56918C32564k5536k3566k0610j7844j6124j4529j1895q747o543n729n656n807
$$ plain form
56906 169978 163971 158095 153008 149095 146279 144448 143562 143268 143066 143021 143748 145539 148015 150772 153936 158008
56890 158008 163645 171666 182762 197036 214158 233753 254966 275577 292314 302470 305100 300920
56878 300920 291690 279710 267051 254842 243547 233889 226925 223147 222153 223394 226789 232505 240802
56865 240802 252322 268016 288541 314230 345773 384155 429181 477993 525083 563670 587700
56854 587700 593982 583515 560743 531114 499056 467609 438808 413748 392703 375745 363268 355813
56842 355813 353679 356923 365587 379939 400838 429939 469157 519771 582019 654873 734794 814114
56830 814114 881492 925575 939578 923604 883667 828614 766802 704096 643912 588408 539219
56819 539219 497317 462956 436092 416615 404119 397948 397789 403927 416860 437119 465701 504053
$$ packed form
56906A69978o007n876n087l913k816j831q86k94k02m5P27J791K476K757L164M072
56890A58008N637Q021J1096J4274J7122J9595K1213K0611J6737J0156K630m180
56878C00920r230j1980j2659j2209j1295r658o964l778r94J241L395N716Q297
56865B40802J1520J5694K0525K5689L1543L8382M5026M8812M7090L8587K4030
56854E87700O282j0467k2772k9629l2058l1447k8801k5060k1045j6958j2477p455
56842C55813k134L244Q664J4352K0899K9101L9218N0614O2248P2854P9921P9320
56830H14114O7378M4083J4003j5974l9937n5053o1812o2706o0184n5504m9189
56819E39219m1902l4361k6864j9477j2496o171j59O138J2933K0259K8582L8352
$$ plain form
56807 504053 552741 609504 668213 719706 754465 766152 753989 722339 678040 627745 576713
56796 576713 528562 485264 447441 415078 388093 366426 349876 338015 330187 325816 324930 328272
56784 328272 336645 350346 369477 394258 424098 456165 485440 506543 515674 511509 495348 470564
56772 470564 441134 410012 378753 348300 319542 293159 269545 248962 231411 216362 203187
56761 203187 191812 182492 175053 168906 163692 159231 154995 150435 145817 141940 138973 136385 134070 132563
56747 132563 131927 131376 130397 129365 128620 127718 126244 124719 124058 124455 125221 125450 124642 123130 121974 121988 122739
56730 122739 123150 123094 123480 124575 125316 124848 123876 123722 124787 126659 129078 131872 134357 135778 136257 136683 137652
56713 137652 138913 139796 139860 139255 138694 138934 140116 141812 143661 145525 147034 147629 147316 146789 146511 146166 145303
$$ packed form
56807E04053M8688N6763N8709N1493L4759J1687j2163l1650m4299n0295n1032
56796E76713m8151m3298l7823l2363k6985k1667j6550j1861p828m371q86L342
56784C28272Q373J3701J9131K4781K9840L2067K9275K1103R131m165j6161k4784
56772D70564k9430l1122l1259l0453k8758k6383k3614k0583j7551j5049j3175
56761B03187j1375r320p439o147n214m461m236m560m618l877k967k588k315j507
56747A32563o36n51r79j032p45r02j474j525o61L97P66K29q08j512j156J4P51
56730A22739M11n6L86J095P41m68r72j54J065J872K419K794K485J421M79M26R69
56713A37652J261Q83O4o05n61K40J182J696J849J864J509N95l13n27k78l45q63
$$ plain form
56696 145303 143968 142479 141135 140391 140693 141830 142986 143692 144156 144519 144670 145039 146563 149334 152210 154398
56680 154398 156500 159236 162055 164003 165182 166224 166883 166376 164808 163078 161451 159336 156613 154285 153480
56665 153480 154323 155960 157294 157651 157096 156226 155521 155039 154788 154950 155396 155447 154646 153481 152875 153163 153988 154941
56647 154941 155869 156732 157518 158157 158391 158054 157638 158013 159325 160662 161227 161311 161724 162738 164037 165243 166010
56630 166010 166057 165491 164693 163613 161851 159675 158133 157564 156887 155106 152759 150994 149898 148653 146897 144986
56614 144986 143305 142143 141841 142265 142557 142186 141820 142315 143329 143856 143659 143222 142683 141921 141352 141510 142024 142087
56596 142087 141867 142376 143931 145740 147066 147897 148421 148665 148789 148969 148989 148611 148245 148470 148965 148831 147978 147350
56578 147350 147702 148947 150781 153084 155556 157735 159544 161255 162833 163986 164925 166319 168429 170968 173942
$$ packed form
56696A45303j335j489j344p44L02J137J156P06M64L63J51L69J524K771K876K188
56680A54398K102K736K819J948J179J042O59n07j568j730j627k115k723k328q05
56665A53480Q43J637J334L57n55q70p05m82k51J62M46N1q01j165o06K88Q25R53
56647A54941R28Q63P86O39K34l37m16L75J312J337N65Q4M13J014J299J206P67
56630A66010M7n66p98j080j762k176j542n69o77j781k347j765j096j245j756j911
56614A44986j681j162l02M24K92l71l66M95J014N27j97m37n39p62n69J58N14O3
56596A42087k20N09J555J809J326Q31N24K44J24J80K0l78l66K25M95j34q53o28
56578A47350L52J245J834K303K472K179J809J711J578J153R39J394K110K539K974
$$ plain form
56563 173942 177882 183164 189800 198095 208775 222043 236917 251633 264332 273444 278179 278974 277089
56550 277089 273626 269224 264484 259996 255836 251633 247300 243243 239799 236931 234555 232687 231218 229916
56536 229916 228709 227618 226498 225204 223849 222474 220676 218158 215493 213696 213016 212630 211542 209423 206693
56521 206693 204169 202500 201561 200570 199119 197672 196662 195664 194074 192049 190024 187868 185447 183470 182649
56506 182649 182397 181571 180313 179847 180483 181137 181009 180482 180022 179339 178151 176847 175862 175098 174417 174081 174279 174838
56488 174838 175708 177162 179176 181113 182335 182728 182482 181845 181267 181330 182269 183784 185349 186420 186534 185709 184609
56471 184609 183879 183453 182992 182676 182873 183307 183331 182883 182466 182322 182384 182764 183530 184179 184217 184009 184239 184737 184823 184523
56451 184523 184328 184045 183192 182435 183202 185685 188538 190821 192906 195088 196623 196812 195970 194665 192949 190946
$$ packed form
56563A73942L940N282O636Q295J0680J3268J4874J4716J2699R112M735P95j885
56550B77089l463m402m740m488m160m203m333m057l444k868k376j868j469j302
56536B29916j207j091j120j294j355j375j798k518k665j797o80l86j088k119k730
56521B06693k524j669r39r91j451j447j010r98j590k025k025k156k421j977q21
56506A82649k52q26j258m66O36O54j28n27m60o83j188j304r85p64o81l36J98N59
56488A74838Q70J454K014J937J222L93k46o37n78O3R39J515J565J071J14q25j100
56471A84609p30m26m61l16J97M34K4m48m17j44O2L80P66O49L8k08K30M98Q6l00
56451A84523j95k83q53p57P67K483K853K283K085K182J535J89q42j305j716k003
$$ plain form
56435 190946 189361 188694 188575 188373 187910 187219 186273 185266 184567 184058 183170 181846 180804 180618 181151 182115 183483
56418 183483 185117 186663 188035 189365 190394 190617 190123 189576 189339 189348 189775 190860 192093 192605 192401 192230 192217
56401 192217 191823 191167 191067 191518 191552 191023 191169 192822 195286 197619 199772 201713 202627 202011 200718 200033 200330
56384 200330 201247 202437 203591 204405 205093 206209 207550 208110 207553 206776 206489 206273 205710 205422 206112 207426 208570
56367 208570 209400 210141 210736 211247 212252 214085 216176 217780 218838 219606 220038 220135 220407 221385 223073 225243 227740
56350 227740 230202 232036 233024 233451 233493 233135 232773 233063 233990 234930 235746 236837 238047 238668 238805 239520 241254
56333 241254 243315 245288 247663 250537 253093 255061 257469 261169 265753 270589 275694 280777 284702 286825
56319 286825 287865 288605 288730 287779 286146 284285 281977 279304 277302 276720 277056 277644 278704 280437 282197 283525
$$ packed form
56435A90946j585o67j19k02m63o91r46j007o99n09q88j324j042j86N33R64J368
56418A83483J634J546J372J330J029K23m94n47k37RM27J085J233N12k04j71j3
56401A92217l94o56j00M51L4n29J46J653K464K333K153J941R14o16j293o85K97
56384B00330R17J190J154Q14O88J116J341N60n57p77k87k16n63k88O90J314J144
56367B08570Q30P41N95N11J005J833K091J604J058P68M32R7K72R78J688K170K497
56350B27740K462J834R88M27M2l58l62K90R27R40Q16J091J210O21J37P15J734
56333B41254K061J973K375K874K556J968K408L700M584M836N105N083L925K123
56319B86825J040P40J25r51j633j861k308k673k002n82L36N88J060J733J760J328
$$ plain form
56303 283525 285082 287656 291173 295456 300842 307157 313200 318214 322764 327310 331193 334107 337206 341473
56289 341473 346161 350193 353974 358426 363290 367937 372941 379267 386568 393727 400489 407286 414040 420398
56275 420398 426633 433238 440259 447943 457126 467925 479069 489745 501093 514608 530111 546702
56263 546702 564605 584404 605383 626558 648802 674235 703924 737727 775983 819690 869304
56252 869304 924878 987290 1058092 1138218 1227800 1326828 1434950 1551034 1673899 1802979 1937340
56241 1937340 2074668 2212085 2347054 2476491 2596083 2701774 2791098 2861957 2911400 2937330
56231 2937330 2940470 2923001 2886162 2830808 2759381 2675346 2581290 2479288 2372339 2263424 2153622
56220 2153622 2043144 1933758 1828162 1727258 1630049 1536216 1446983 1363376 1285344 1212715
$$ packed form
56303B83525J557K574L517M283N386O315O043N014M550M546L883K914L099M267
56289C41473M688M032L781M452M864M647N004O326P301P159O762O797O754O358
56275D20398O235O605P021P684R183J0799J1144J0676J1348J3515J5503J6591
56263E46702J7903J9799K0979K1175K2244K5433K9689L3803L8256M3707M9614
56252H69304N5574O2412P0802Q0126Q9582R9028J08122J16084J22865J29080J34361
56241A937340J37328J37417J34969J29437J19592J05691Q9324P0859M9443K5930
56231B937330L140j7469l6839n5354p1427q4035r4056j02002j06949j08915j09802
56220B153622j10478j09386j05596j00904r7209r3833q9233q3607p8032p2629
$$ plain form
56210 1212715 1145496 1083121 1024659 969838 918810 871248 826847 786251 750149 717878 688323
56199 688323 661748 639266 620871 605403 592090 580660 570337 560244 550564 541960 534240 526856
56187 526856 520262 515370 512073 509593 507727 506441 504940 502568 500021 498267 497042 495819 495347 496570
56173 496570 498919 501312 503873 506910 509339 510295 511296 514448 519264 523671 527484 532404 539008 546272
56159 546272 553850 562394 571743 581129 591127 603194 617336 632333 648157 666014 686154 707846
56147 707846 731485 758564 789636 824551 864788 913383 972245 1041236 1119877 1208031 1304829
56136 1304829 1408343 1515848 1622745 1722096 1807803 1878472 1936834 1986421 2030727 2074038 2119314
56125 2119314 2164806 2205035 2235234 2253272 2258549 2252178 2237989 2220246 2199800 2174086 2139969 2094222
$$ packed form
56210A212715o7219o2375n8462n4821n1028m7562m4401m0596l6102l2271k9555
56199F88323k6575k2482j8395j5468j3313j1430j0323j0093r680q604p720p384
56187E26856o594m892l297k480j866j286j501k372k547j754j225j223m72J223
56173D96570K349K393K561L037K429R56J001L152M816M407L813M920O604P264
56159E46272P578Q544R349R386R998J2067J4142J4997J5824J7857K0140K1692
56147G07846K3639K7079L1072L4915M0237M8595N8862O8991P8641Q8154R6798
56136A304829J03514J07505J06897R9351Q5707P0669N8362M9587M4306M3311M5276
56125B119314M5492M0229L0199J8038N277o371j4189j7743k0446k5714l4117m5747
$$ plain form
56113 2094222 2032590 1952302 1855746 1749062 1637500 1524883 1416456 1318004 1231752 1156361
56103 1156361 1091058 1036485 991617 953595 921187 895125 874703 857446 842542 831175 822957
56092 822957 815402 807595 801125 796867 794069 792983 794897 798968 802505 805039 808696 814018 819052 823251
56078 823251 828514 835443 842251 848383 855650 864714 873967 883002 893667 906572 919925 932875 946594
56065 946594 961148 974909 987977 1002489 1018507 1033328 1045994 1058677 1072510 1085897 1098104
56054 1098104 1110595 1123467 1134577 1143582 1153057 1164289 1175813 1187293 1200686 1216256 1231564 1245889
56042 1245889 1261538 1279438 1297698 1315862 1336095 1358721 1381212 1403196 1427819 1456564 1487528
56031 1487528 1520404 1558061 1601114 1645918 1689986 1734442 1779127 1820693 1858001 1894361 1932034
$$ packed form
56113B094222o1632q0288r6556j06684j11562j12617j08427r8452q6252p5391
56103A156361o5303n4573m4868l8022l2408k6062k0422j7257j4904j1367q218
56092H22957p555p807o470m258k798j086J914M071L537K534L657N322N034M199
56078H23251N263O929O808O132P267R064R253R035J0665J2905J3353J2950J3719
56065I46594J4554J3761J3068J4512J6018J4821J2666J2683J3833J3387J2207
56054A098104J2491J2872J1110R005R475J1232J1524J1480J3393J5570J5308J4325
56042A245889J5649J7900J8260J8164K0233K2626K2491K1984K4623K8745L0964
56031A487528L2876L7657M3053M4804M4068M4456M4685M1566L7308L6360L7673
$$ plain form
56020 1932034 1969541 2006540 2045931 2088747 2132379 2176218 2223498 2275295 2328671 2383228 2443164
56009 2443164 2510002 2579652 2649638 2722795 2800759 2880600 2961347 3047020 3139597 3235808 3334479
55998 3334479 3439958 3554553 3674921 3799777 3933508 4078120 4229622 4386688 4554645
55989 4554645 4736432 4928277 5129056 5344820 5578925 5827198 6088434 6369975 6677121
55980 6677121 7007226 7360244 7744317 8164584 8617987 9106164 9641463 10233002 10879864
55971 10879864 11586044 12368378 13241465 14210277 15287609 16503131 17885823 19456586 21251413
55962 21251413 23334680 25780859 28671355 32130708 36343581 41513843 47826248 55467415
55954 55467415 64665866 75711658 89002823 105138461 124969406 149545870 179971717
$$ packed form
56020A932034L7507L6999L9391M2816M3632M3839M7280N1797N3376N4557N9936
56009B443164O6838O9650O9986P3157P7964P9841Q0747Q5673R2577R6211R8671
55998C334479J05479J14595J20368J24856J33731J44612J51502J57066J67957
55989D554645J81787J91845K00779K15764K34105K48273K61236K81541L07146
55980F677121L30105L53018L84073M20267M53403M88177N35299N91539O46862
55971A0879864P06180P82334Q73087R68812J077332J215522J382692J570763J794827
55962B1251413K083267K446179K890496L459353M212873N170262O312405P641167
55954E5467415R198451J1045792J3291165J6135638J9830945K4576464L0425847
$$ plain form
55947 179971717 217006227 260112946 306179165 349063475 381120681 396291903 392703335
55940 392703335 372954189 342238244 305989996 268476338 232493479 199607147 170505375
55933 170505375 145326519 123898868 105867267 90774489 78155745 67606075 58779447
55926 58779447 51367777 45111617 39812915 35313000 31468062 28157756 25297697 22822637
55918 22822637 20667072 18774297 17109440 15647164 14356015 13206720 12184369 11278904
55910 11278904 10472267 9746061 9092717 8507839 7979519 7495427 7052717 6651099 6283279
55901 6283279 5941383 5625733 5338263 5073748 4825925 4595880 4386060 4191989 4007949
55892 4007949 3835180 3676658 3529091 3387678 3253887 3131258 3018034 2910721 2810535
$$ packed form
55947A79971717L7034510M3106719M6066219M2884310L2057206J5171222l588568
55940C92703335j9749146l0715945l6248248l7513658l5982859l2886332k9101772
55933A70505375k5178856k1427651j8031601j5092778j2618744j0549670q826628
55926E8779447p411670o256160n298702m499915l844938l310306k860059k475060
55918B2822637k155565j892775j664857j462276j291149j149295j022351r05465
55910A1278904q06637p26206o53344n84878n28320m84092m42710m01618l67820
55901F283279l41896l15650k87470k64515k47823k30045k09820j94071j84040
55892D007949j72769j58522j47567j41413j33791j22629j13224j07313j00186
$$ plain form
55883 2810535 2719893 2636842 2558943 2488055 2425067 2364301 2299437 2231173 2163432 2096216 2027929
55872 2027929 1960498 1896080 1832328 1766769 1702444 1643629 1589408 1536878 1487264 1443188 1403096
55861 1403096 1363995 1326957 1294563 1265609 1237498 1211240 1189001 1169204 1149027 1129301 1112075
55850 1112075 1095632 1076818 1056142 1035977 1015838 994061 971956 951651 931785 909915 887374
55839 887374 867222 849097 830473 811463 794056 778056 761940 746440 733300 721756 710042
55828 710042 699037 690679 684174 677447 670958 666352 662591 657103 649644 641604 632757 622179 611144
55815 611144 601697 593476 585146 577565 572224 567962 562813 557852 555630 555894 556358 556785 558861 562885 567890
55800 567890 574176 582427 591090 597773 602431 606161 607831 605156 598354 589573 579461 567444 554599
$$ packed form
55883B810535r0642q3051p7899p0888o2988o0766o4864o8264o7741o7216o8287
55872B027929o7431o4418o3752o5559o4325n8815n4221n2530m9614m4076m0092
55861A403096l9101l7038l2394k8954k8111k6258k2239j9797k0177j9726j7226
55850A112075j6443j8814k0676k0165k0139k1777k2105k0305j9866k1870k2541
55839H87374k0152j8125j8624j9010j7407j6000j6116j5500j3140j1544j1714
55828G10042j1005q358o505o727o489m606l761n488p459q040q847j0578j1035
55815F11144r447q221q330p581n341m262n149m961k222K64M64M27K076M024N005
55800E67890O286Q251Q663O683M658L730J670k675o802q781j0112j2017j2845
$$ plain form
55787 554599 543059 533133 524035 516751 512947 511444 508847 503385 495473 485213 472430 458791 446817
55774 446817 436876 427708 419394 413135 408637 404625 401526 400782 401746 402079 401058 399773 398303 395466 391355
55759 391355 387491 384423 381475 378845 377608 377676 377835 377461 376191 372583 365503 356368 347572 339251 330026
55744 330026 320216 311547 304128 296694 289529 284216 280514 276416 271443 267118 263997 260930 257600 255137
55730 255137 253768 252290 250307 248720 247623 245948 243536 241363 239433 236637 232987 229799 227370 224646
55716 224646 221509 219253 218380 217979 217574 217538 217469 216339 214660 214405 216275 218916 221173 223138 224785 225592
55700 225592 225891 226560 227087 225983 223408 221259 220289 219389 218202 218151 220136 223347 227095 231734 236806 240322
55684 240322 240921 239212 236214 232280 228398 226663 228210 231981 236339 240538 243940 245431 244730 243040 241539
$$ packed form
55787E54599j1540r926r098p284l804j503k597n462p912j0260j2783j3639j1974
55774D46817r941r168q314o259m498m012l099p44R64L33j021j285j470k837m111
55759C91355l864l068k948k630j237O8J59l74j270l608p080r135q796q321r225
55744C30026r810q669p419p434p165n313l702m098m973m325l121l067l330k463
55730B55137j369j478j983j587j097j675k412k173j930k796l650l188k429k724
55716B24646l137k256q73m01m05l6o9j130j679k55J870K641K257J965J647Q07
55700B25592K99O69N27j104k575k149r70r00j187n1J985L211L748M639N072L516
55684B40322N99j709k998l934l882j735J547L771M358M199L402J491p01j690j501
$$ plain form
55669 241539 240309 239314 239132 239973 241214 242526 244393 247023 249963 253133 256972 261140 264510 266861 269130
55654 269130 271538 273046 273321 273607 274780 275911 275667 273931 271191 267425 262470 256572 249894 242309 234211
55639 234211 226615 220050 214257 209173 205109 201736 198185 194473 191546 189548 187416 184640 182018 180174
55625 180174 178717 177426 176866 177140 177362 177080 176931 177173 176861 175315 173227 171424 169620 167295 164840 162955
55609 162955 161690 160730 159908 158882 157229 155337 154280 154318 154507 154200 153841 153731 153214 151823 150135 148768
55593 148768 147478 145944 144509 143418 142291 141057 140557 141465 143378 145553 147680 149360 149805 148851 147532
55578 147532 146942 147223 148199 150151 153314 157297 161734 166885 173117 180335 188287 196750 204996 211803 216433
55563 216433 219010 219729 218536 215751 212140 207995 203022 197362 191746 186421 180928 175211 169865 165017
$$ packed form
55669B41539j230r95j82Q41J241J312J867K630K940L170L839M168L370K351K269
55654B69130K408J508K75K86J173J131k44j736k740l766m955n898o678p585q098
55639B34211p596o565n793n084m064l373l551l712k927j998k132k776k622j844
55625A80174j457j291n60K74K22k82j49K42l12j546k088j803j804k325k455j885
55609A62955j265r60q22j026j653j892j057L8J89l07l59j10n17j391j688j367
55593A48768j290j534j435j091j127j234n00R08J913K175K127J680M45r54j319
55578A47532n90K81R76J952L163L983M437N151O232P218P952Q463Q246O807M630
55563B16433K577P19j193k785l611m145m973n660n616n325n493n717n346m848
$$ plain form
55549 165017 160222 155801 152931 151842 151232 150131 149099 148858 149014 149010 149198 149971 150795 151083 151237 151941 153144
55532 153144 154453 155759 156794 156891 155845 154200 152088 148817 144273 139696 136192 133452 130781 128487 127226
55517 127226 126806 126603 126473 126340 125634 124038 122183 120730 119430 117875 116459 115697 115300 114832 114639 115164 115912
55500 115912 116072 115747 115656 115973 116252 116184 115763 115056 114341 114087 114357 114737 115202 116256 117783 118666 118233 117193
55482 117193 116438 115819 115036 114796 115881 117611 118423 117684 116080 114529 113589 113623 114676 116264 117732 118600 118322
55465 118322 116399 113301 110548 109210 108842 108492 108046 107874 107873 107756 107735 108085 108496 108598 108684 109189 109903 110401 110737
55446 110737 111087 111217 110942 110515 109977 108796 106892 105336 105200 106285 107710 109070 110245 110801 110601 110399
55430 110399 110876 111570 111693 111411 111357 111390 110918 110034 109319 108891 108545 108509 109086 109866 110182 110074 110038 110207 110504 111067
$$ packed form
55549A65017m795m421k870j089o10j101j032k41J56mJ88P73Q24K88J54P04J203
55532A53144J309J306J035R7j046j645k112l271m544m577l504k740k671k294j261
55517A27226m20k03j30j33p06j596j855j453j300j555j416p62l97m68j93N25P48
55500A15912J60l25r1L17K79o8m21p07p15k54K70L80M65J054J527Q83m33j040
55482A17193p55o19p83k40J085J730Q12p39j604j551r40L4J053J588J468Q68k78
55465A18322j923l098k753j338l68l50m46j72jj17k1L50M11J02Q6N05P14M98L36
55446A10737L50J30k75m27n38j181j904j556j36J085J425J360J175N56k00k02
55430A10399M77O94J23k82n4L3m72q84p15m28l46l6N77P80L16j08l6J69K97N63
$$ plain form
55410 111067 111699 111534 110252 109029 109168 110234 110736 110250 109595 109220 108739 107991 107334 106806 106088 105379 105318 105973
55392 105973 106766 107436 108182 108912 109219 109204 109451 110140 110926 111657 112426 112938 112647 111578 110324 109288 108586 108522
55374 108522 109279 110180 110195 109238 108152 107354 106367 104819 103114 101772 100786 99897 99011 98142 97311 96632 96233 96142
55356 96142 96534 97770 99736 101464 102050 101752 101568 101933 102507 102997 103415 103598 103246 102468 101735 101357 101465 102224
55338 102224 103387 103958 103167 101650 100855 101367 102566 103813 104967 105721 105433 104040 102445 101610 101633 101923 101820
55321 101820 100967 99517 98178 97739 98460 100056 102089 104115 105716 106831 107799 108731 109150 108650 107527 106266
55305 106266 104900 103468 102605 102828 103608 103929 103484 102531 101034 98957 97140 96733 97760 99188 100401 101645
55289 101645 103006 103975 104289 104369 104638 105020 105328 105541 105563 105219 104577 103848 103065 102300 101962 102299 102866 103145 103370
$$ packed form
55410A11067O32j65j282j223J39J066N02m86o55l75m81p48o57n28p18p09o1O55
55392A05973P93O70P46P30L07j5K47O89P86P31P69N12k91j069j254j036p02o4
55374A08522P57R01J5r57j086p98r87j548j705j342r86q89q86q69q31o79l99r1
55356I6142L92J236J966J728N86k98j84L65N74M90M18J83l52p78p33l78J08P59
55338A02224J163N71p91j517p95N12J199J247J154P54k88j393j595q35K3K90j03
55321A01820q53j450j339m39P21J596K033K026J601J115R68R32M19n00j123j261
55305A06266j366j432q63K23P80L21m45r53j497k077j817m07J027J428J213J244
55289A01645J361R69L14Q0K69L82L08K13K2l44o42p29p83p65l38L37N67K79K25
$$ plain form
55270 103370 103969 104537 104347 103621 103261 103391 103227 102407 101421 100658 100078 99905 100565 101768 102659 103129 103919 105169
55252 105169 105929 105578 104727 104134 103594 102616 101508 101088 101671 102799 103718 103884 103413 103123 103661 104477 104300 102765
55234 102765 100938 100073 100479 101724 103156 103989 103660 102578 101924 102323 103250 103976 104422 104730 104673 104012 103008
55217 103008 102127 101634 101721 102569 103986 105387 106377 106944 106937 106033 104523 103431 103357 103718 103649 103203 103075 103423 103592
55198 103592 103005 101925 101179 101282 101950 102564 103047 103953 105534 107121 107912 107996 108006 108007 107468 106215 104746 103616
55180 103616 103091 103264 103815 103803 102596 100982 100510 101648 103415 104836 105813 106399 106315 105613 104924 104592 104265 103779
55162 103779 103652 104213 104937 105201 105129 105200 105476 105702 105736 105518 104997 104334 103785 103242 102435 101708 101844 102903 103981
55143 103981 104485 104857 105596 106302 106322 105772 105288 105164 105294 105585 105935 106071 105817 105354 105000 105038 105735 107083 108410
$$ packed form
55270A03370N99N68j90p26l60J30j64q20r86p63n80j73O60J203Q91M70P90J250
55252A05169P60l51q51n93n40r78j108m20N83J128R19J66m71k90N38Q16j77j535
55234A02765j827q65M06J245J432Q33l29j082o54L99R27P26M46L08n7o61j004
55217A03008q81m93Q7Q48J417J401R90N67pr04j510j092p4L61o9m46j28L48J69
55198A03592n87j080p46J03O68O14M83R06J581J587P91Q4J0Jn39j253j469j130
55180A03616n25J73N51j2j207j614m72J138J767J421R77N86q4p02o89l32l27m86
55162A03779j27N61P24K64p2P1K76K26L4k18n21o63n49n43q07p27J36J059J078
55143A03981N04L72P39P06K0n50m84j24J30K91L50J36k54m63l54L8O97J348J327
$$ plain form
55124 108410 108905 108665 108567 108919 109059 108593 108142 108344 108835 108831 108144 107032 105630 104183 103303 103405 104191 105166 106223
55105 106223 107287 107969 108124 108302 109060 110203 111213 111993 112622 112841 112433 111810 111603 111880 112277 112667 113214 114012
55087 114012 115097 116557 118238 119566 120086 120000 119853 119937 120216 120504 120474 119876 118960 118253 117717 116772 115431 114655
55069 114655 114994 115571 115181 113892 112767 112357 112337 112466 113100 114645 116979 119462 121278 121914 121628 121224 121135
55052 121135 120971 120251 119209 118457 118170 118008 117595 116771 115621 114530 113880 113484 112752 111723 111323 112133 113427
55035 113427 114016 113632 112888 112287 111872 111595 111436 111321 111326 111733 112568 113418 114056 114778 115688 116190 115827 115140 115006
55016 115006 115450 115832 115922 116052 116369 116649 116774 116818 116736 116469 116311 116687 117657 118975 120399 121599 122072 121685 121071
54997 121071 120994 121497 122089 122435 122415 121912 121178 121027 121901 122950 122777 121078 118937 117550 117226 117554 117997 118291
$$ packed form
55124A08410M95k40r8L52J40m66m51K02M91mo87j112j402j447q80J02P86R75J057
55105A06223J064O82J55J78P58J143J010P80O29K19m08o23k07K77L97L90N47P98
55087A14012J085J460J681J328N20q6j47Q4K79K88l0n98r16p07n36r45j341p76
55069A14655L39N77l90j289j125m10k0J29O34J545K334K483J816O36k86m04q9
55052A21135j64p20j042p52k87j62m13q24j150j091o50l96p32j029m00Q10J294
55035A13427N89l84p44o01m15k77j59j15NM07Q35Q50O38P22R10N02l63o87j34
55016A15006M44L82R0J30L17K80J25M4q2k67j58L76R70J318J424J200M73l87o14
54997A21071p7N03N92L46k0n03p34j51Q74J049j73j699k141j387l24L28M43K94
$$ plain form
54979 118291 118714 119900 121957 123977 124870 124557 123834 123230 122613 121803 120953 120276 119870 119875 120367 121130 121793 122202
54961 122202 122410 122503 122711 123394 124556 125691 126474 127207 128131 128761 128527 127656 126734 125741 124298 122591 121173
54944 121173 120053 118855 117802 117604 118310 119190 119876 120766 122013 122929 122880 122242 121963 122520 123618 124741 125738
54927 125738 126980 128992 131866 135176 138661 142640 147416 152640 157840 163186 168973 174528 178576 180741
54913 180741 181824 182385 181878 179591 175741 171124 166148 160741 154965 149296 144348 140500 137674 135358 133029
54898 133029 130636 128546 127077 126306 126202 126598 127035 127092 126910 127095 128002 129440 131082 132815 134563 136123
54882 136123 137464 139036 141594 145622 150891 156551 161803 166546 171150 175608 179290 181697 183006 183472
54868 183472 182759 180363 176447 171697 166571 161215 155923 151176 147318 144605 143346 143436 143909 143586 142155
$$ packed form
54979A18291M23J186K057K020Q93l13p23o04o17q10q50o77m06NM92P63O63M09
54961A22202K08R3K08O83J162J135P83P33R24O30k34q71r22r93j443j707j418
54944A21173j120j198j053j98P06Q80O86Q90J247R16m9o38k79N57J098J123R97
54927A25738J242K012K874L310L485L979M776N224N200N346N787N555M048K165
54913A80741J083N61n07k287l850m617m976n407n776n669m948l848k826k316k329
54898A33029k393k090j469p71j04L96M37N7j82J85R07J438J642J733J748J560
54882A36123J341J572K558M028N269N660N252M743M604M458L682K407J309M66
54868A83472p13k396l916m750n126n356n292m747l858k713j259R0M73l23j431
$$ plain form
54853 142155 140171 138124 136053 133952 131963 130142 128528 127358 126734 126176 125022 123246 121391 119852 118758
54838 118758 118380 118891 119729 119927 119250 118441 118181 118319 118276 117759 116925 116204 116032 116434 116872 116808 116305 115752 115276
54819 115276 114882 114874 115454 116132 116272 116088 116365 117283 118306 119218 120377 121855 123177 124062 124639 124787 124081 122735
54801 122735 121735 121617 121807 121666 121577 122384 124127 125857 126549 125950 124705 123760 123441 123181 122475 121836 122197 123502
54783 123502 124720 125318 125835 126761 127737 128258 128441 128603 128725 128876 129596 131266 133531 135911 138631 142346 147247
54766 147247 152890 158735 164525 170275 176117 181947 187120 190760 192520 192733 191729 189405 185671 180891
54752 180891 175652 170372 165279 160433 155652 150777 146131 142409 139990 138675 138035 137591 136753 135237 133631
54737 133631 132914 133203 133553 133181 132335 131859 132486 134618 138036 141581 143900 144909 145928 148124 151480 155528
$$ packed form
54853A42155j984k047k071k101j989j821j614j170o24n58j154j776j855j539j094
54838A18758l78N11Q38J98o77q09k60J38m3n17q34p21j72M02M38o4n03n53m76
54819A15276l94qN80O78J40j84K77R18J023R12J159J478J322Q85N77J48p06j346
54801A22735j000j18J90j41q9Q07J743J730O92n99j245r45l19k60p06o39L61J305
54783A23502J218N98N17R26R76N21J83J62J22J51P20J670K265K380K720L715M901
54766A47247N643N845N790N750N842N830N173L640J760K13j004k324l734m780
54752A80891n239n280n093m846m781m875m646l722k419j315o40m44q38j516j606
54737A33631p17K89L50l72q46m76O27K132L418L545K319J009J019K196L356M048
$$ plain form
54721 155528 160208 165459 170737 175534 179809 183345 185372 185489 184412 183030 181147 177900 173117 167550
54707 167550 162005 156861 152353 148697 145918 143900 142581 141867 141485 141079 140287 138787 136695 134925 134456
54692 134456 135035 135295 134474 133334 132947 133307 133717 133859 133762 133257 132246 131159 130459 129983 129346 128657 128249 128099
54674 128099 128061 128285 128774 128917 128149 126782 125491 124340 123025 121769 121198 121482 122324 123589 125148 126296
54658 126296 126194 124952 123623 123069 123381 124278 125359 125963 125583 124576 123900 123998 124437 124729 124938 125343 125986 126758
54640 126758 127531 128035 127964 127340 126484 125571 124489 123192 121929 121060 120826 121246 122026 122734 123235 123803 124574 125265
54622 125265 125755 126548 127999 129406 129593 128369 126734 125557 124758 123977 123433 123666 124725 126011 126880 127252
54606 127252 127622 128459 129585 130332 130304 129758 129073 128302 127513 127109 127287 127510 127167 126552 126528 127342 128390 129166 129790
$$ packed form
54721A55528M680N251N278M797M275L536K027J17j077j382j883l247m783n567
54707A67550n545n144m508l656k779k018j319p14l82m06p92j500k092j770m69
54692A34456N79K60q21j140l87L60M10J42r7n05j011j087p00m76o37o89m08j50
54674A28099l8K24M89J43p68j367j291j151j315j256n71K84Q42J265J559J148
54658A26296j02j242j329n54L12Q97J081O04l80j007o76R8M39K92K09M05O43P72
54640A26758P73N04p1o24q56r13j082j297j263q69k34M20P80P08N01N68P71O91
54622A25265M90P93J451J407J87j224j635j177p99p81n44K33J059J286Q69L72
54606A27252L70Q37J126P47k8n46o85p71p89m04J78K23l43o15k4Q14J048P76O24
$$ plain form
54587 129790 130450 130944 131003 130698 130264 129816 129369 128949 128596 128439 128675 129270 129763 129673 129004 128126 127332 126822 126906 127705
54567 127705 128822 129723 130363 130979 131449 131468 131304 131690 132813 133947 134294 133820 133105 132738 132965 133540 133856 133525
54549 133525 132907 132740 133269 134145 135147 136442 137992 139236 139685 139456 139053 138876 139082 139599 140107 140296 140283 140506
54531 140506 141046 141379 140981 139916 138670 137646 136976 136619 136461 136403 136443 136594 136757 136801 136720 136525 136117 135507 135064
54512 135064 135166 135641 135895 135598 134912 134105 133319 132762 132678 132985 133257 133189 132852 132474 132220 132160 132157 131862 131202 130811
54492 130811 131536 133443 135720 137605 138896 139557 139447 138740 138092 137988 138244 138443 138581 138974 139814 141095 142721
54475 142721 144353 145411 145632 145535 146004 147393 149257 150886 151884 152216 151993 151394 150757 150546 151088 152327 153940
54458 153940 155663 157319 158545 158826 158043 156750 155610 154757 153958 153169 152506 151876 151128 150477 150276 150385 150238
$$ packed form
54587A29790O60M94N9l05m34m48m47m20l53j57K36N95M93r0o69q78p94n10Q4P99
54567A27705J117R01O40O16M70J9j64L86J123J134L47m74p15l67K27N75L16l31
54549A33525o18j67N29Q76J002J295J550J244M49k29m03j77K06N17N08J89j3K23
54531A40506N40L33l98j065j246j024o70l57j58n8M0J51J63M4q1j95m08o10m43
54512A35064J02M75K54k97o86q07p86n57q4L07K72o8l37l78k54o0lk95o60l91
54492A30811P25J907K277J885J291O61j10p07o48j04K56J99J38L93Q40J281J626
54475A42721J632J058K21r7M69J389J864J629R98L32k23n99o37k11N42J239J613
54458A53940J723J656J226K81p83j293j140q53p99p89o63o30p48o51k01J09j47
$$ plain form
54441 150238 149599 148745 147848 146751 145548 144863 145192 146279 147435 148184 148392 148069 147374 146711 146539 147076 148212
54424 148212 149559 150556 150770 150202 149228 148269 147659 147679 148394 149456 150390 151097 151766 152352 152559 152374 152168 152150 152081
54405 152081 151738 151310 151170 151524 152340 153361 154147 154470 154695 155378 156448 157258 157520 157623 157862 157944 157616 157249
54387 157249 157344 157830 158291 158577 158741 158710 158487 158459 158967 159691 159950 159603 159215 159318 159857 160512 161280 162541 164677
54368 164677 167741 171460 175505 179660 183663 187001 189091 189727 189218 188082 186792 185699 184852 183851 182273
54353 182273 180363 178899 178166 177497 176117 174108 172069 170130 167844 165053 162325 160351 159120 157960 156343
54338 156343 154536 153385 153445 154496 155971 157605 159309 160569 160588 159236 157387 156013 155271 154820 154674 155196
54322 155196 156380 157614 158231 158005 157027 155383 153164 150695 148571 147325 146964 146922 146611 146001 145531 145534 146010
$$ packed form
54441A50238o39q54q97j097j203o85L29J087J156P49K08l23o95o63j72N37J136
54424A48212J347R97K14n68r74r59o10K0P15J062R34P07O69N86K07j85k06j8o9
54405A52081l43m28j40L54Q16J021P86L23K25O83J070Q10K62J03K39Q2l28l67
54387A57249R5M86M61K86J64l1k23k8N08P24K59l47l88J03N39O55P68J261K136
54368A64677L064L719M045M155M003L338K090O36n09j136j290j093q47j001j578
54353A82273j910j464p33o69j380k009k039j939k286k791k728j974j231j160j617
54338A56343j807j151O0J051J475J634J704J260J9j352j849j374p42m51j46N22
54322A55196J184J234O17k26r78j644k219k469k124j246l61m2l11o10m70LM76
$$ plain form
54305 146010 146877 148054 149195 149729 149380 148385 147054 145483 143944 143111 143491 144794 146264 147480 148509 149471
54289 149471 150437 151642 153299 155056 156067 155870 154938 154101 153648 153294 152935 153034 154011 155560 156904 157645 158002
54272 158002 158195 158094 157718 157583 158118 159032 159796 160463 161322 161939 161418 159772 158225 157825 158398 159288 160407 161935
54254 161935 163527 164584 165061 165390 165761 166067 166427 167072 167753 167817 167036 165863 164783 163818 162838 161933 161225 160641
54236 160641 160134 159939 160300 161046 161701 162053 162426 163265 164513 165559 165839 165422 164842 164454 164140 163677 163121 162686
54218 162686 162400 162086 161580 160842 159925 158940 158034 157336 156959 157002 157439 158028 158504 158852 159168 159298 158973 158342 157911
54199 157911 157817 157567 156814 156007 155798 156084 156113 155500 154672 154247 154309 154462 154387 154198 154282 154836 155619 156262 156779 157576
54179 157576 158917 160684 162720 165019 167337 168976 169430 169015 168447 167961 167363 166734 166390 166026 164620 161730
$$ packed form
54305A46010Q67J177J141N34l49r95j331j571j539q33L80J303J470J216J029R62
54289A49471R66J205J657J757J011j97r32q37m53l54l59R9R77J549J344P41L57
54272A58002J93j01l76j35N35R14P64O67Q59O17n21j646j547m00N73Q90J119J528
54254A61935J592J057M77L29L71L06L60O45O81O4p81j173j080r65r80r05p08n84
54236A60641n07j95L61P46O55L52L73Q39J248J046K80m17n80l88l14m63n56m35
54218A62686k86l14n06p38r17r85r06o98l77M3M37N89M76L48L16J30l25o31m31
54199A57911r4k50p53q07k09K86K9o13q28m25O2J53p5j89Q4N54P83O43N17P97
54179A57576J341J767K036K299K318J639M54m15n68m86n98o29l44l64j406k890
$$ plain form
54163 161730 158464 156561 156579 157460 157923 157777 157597 157554 157115 155913 154409 153442 153420 154143 155183 156066 156269 155476
54145 155476 153905 152109 150460 149097 148359 148774 150403 152502 154123 154933 155369 156115 157509 159235 160550
54130 160550 160987 160867 160913 161420 162094 162645 163031 163071 162421 161275 160556 160989 162330 163942 165794 168335 171590
54113 171590 174998 178141 181143 184261 187506 190839 194473 198723 203637 208846 213697 217460 219524 219577 217803
54098 217803 214944 211945 209265 206583 203372 199656 195902 192303 188714 185285 182595 180898 179729 178543
54084 178543 177312 176233 175272 174384 173845 173892 174322 174873 175684 176971 178531 180020 181506 183206 184865 185964
54068 185964 186514 187112 188149 189356 190256 190686 190776 190634 190190 189296 188041 186971 186794 187664 188958 189975 190650
54051 190650 191368 192368 193710 195582 198206 201417 204643 207308 209185 210566 212220 214852 218384 222055
$$ packed form
54163A61730l266j903J8Q81M63j46j80m3m39j202j504r67k2P23J040Q83K03p93
54145A55476j571j796j649j363p38M15J629K099J621Q10M36P46J394J726J315
54130A60550M37j20M6N07O74N51L86M0o50j146p19M33J341J612J852K541L255
54113A71590L408L143L002L118L245L333L634M250M914N209M851L763K064N3j774
54098B17803k859k999k680k682l211l716l754l599l589l429k690j697j169j186
54084A78543j231j079r61q88n39M7M30N51Q11J287J560J489J486J700J659J099
54068A85964N50N98J037J207R00M30R0j42m44q94j255j070j77Q70J294J017O75
54051A90650P18J000J342J872K624L211L226K665J877J381J654K632L532L671
$$ plain form
54037 222055 225546 229619 235284 242611 250784 258960 266619 273404 279259 284533 289449 293669 296882 299552
54023 299552 302393 305317 307577 308867 309562 309952 309999 309831 309693 309254 307731 304911 301344 297330 292441 286450
54007 286450 280022 273984 268475 263286 258551 254440 250538 246204 241520 237373 234548 233009 232025 230764
53993 230764 228802 226310 223862 222020 221079 221020 221422 221448 220363 218290 216233 215133 215106 215735 216744 218062
53977 218062 219469 220754 222257 224855 229096 234585 240573 247088 255049 264871 275141 283118 286689 285624
53963 285624 281024 274166 266195 258317 251499 245907 241139 237051 234043 232508 232322 232970 233940 234934 235885
53948 235885 236809 237664 238479 239560 241193 243065 244523 245712 247791 251399 255466 258413 260191 262182 265214
53933 265214 268726 271967 274968 277987 280894 283625 286548 289849 293117 296109 299446 303966 309690 315956
$$ packed form
54037B22055L491M073N665P327Q173Q176P659O785N855N274M916M220L213K670
54023B99552K841K924K260J290O95L90M7j68j38m39j523k820l567m014m889n991
54007B86450o428o038n509n189m735m111l902m334m684m147k825j539r84j261
53993B30764j962k492k448j842r41n9M02K6j085k073k057j100k7O29J009J318
53977B18062J407J285J503K598M241N489N988O515P961R822J0270P977L571j065
53963B85624m600o858p971p878o818n592m768m088l008j535j86O48R70R94R51
53948B35885R24Q55Q15J081J633J872J458J189K079L608M067K947J778J991L032
53933B65214L512L241L001L019K907K731K923L301L268K992L337M520N724O266
$$ plain form
53919 315956 322379 329199 336784 345171 354077 363182 372423 381996 391881 401416 409722 416559 422345 427277
53905 427277 431003 433282 434372 434403 433014 430083 426365 422899 420021 417368 414434 410733 405754 399404 392290
53890 392290 385095 377801 370004 361771 353609 345712 337797 329760 321906 314421 307092 299841 293257 288193
53876 288193 284877 282570 280133 276896 273011 269051 265417 262176 259254 256472 253416 249661 245317 241056
53862 241056 237466 234563 232117 230080 228388 226628 224382 221904 220061 219412 219528 219329 218118 216241 214635
53847 214635 213750 213023 211667 209810 208491 208485 209496 210608 211183 211143 210745 210367 210241 210167 209687 208775 208086 208241
53829 208241 209077 209914 210360 210548 210731 210953 211074 210880 210284 209642 209703 210962 213113 215412 217475 219433 221415
53812 221415 223275 224924 226626 228807 231674 235122 238942 243024 247409 252198 257424 263048 269047 275431
$$ packed form
53919C15956O423O820P585Q387Q906R105R241R573R885R535Q306O837N786M932
53905D27277L726K279J090L1j389k931l718l466k878k653k934l701m979o350p114
53890C92290p195p294p797q233q162p897p915q037p854p485p329p251o584n064
53876B88193l316k307k437l237l885l960l634l241k922k782l056l755m344m261
53862B41056l590k903k446k037j692j760k246k478j843o49J16j99j211j877j606
53847B14635q85p27j356j857j319oJ011J112N75m0l98l78j26p4m80r12o89J55
53829B08241Q36Q37M46J88J83K22J21j94n96o42O1J259K151K299K063J958J982
53812B21415J860J649J702K181K867L448L820M082M385M789N226N624N999O384
$$ plain form
53798 275431 282121 288832 295117 300505 304729 307919 310535 313013 315540 318208 321127 324141 326652 328174
53784 328174 328992 329782 330548 330399 328576 325274 321232 316859 312039 306535 300329 293755 287462 282035 277478
53769 277478 273218 268743 264003 259163 254256 249287 244411 239864 235878 232700 230404 228662 227023 225462
53755 225462 224263 223322 222150 220704 219599 219177 218926 218246 217285 216553 216126 215785 215615 215876 216484 217101 217616
53738 217616 218144 218766 219629 221006 222800 224248 224638 224137 223451 222905 222452 222370 223187 224849 226587 227807 228658
53721 228658 229556 230654 231933 233382 234771 235559 235457 234993 235188 236553 238532 240078 240811 241430 242882 245259
53705 245259 247802 249870 251520 253164 255149 257753 261017 264375 267086 269383 272622 277676 283626 288644
53691 288644 291870 293769 294924 295321 294822 293713 292548 291808 291697 291971 292049 291660 291268 291460 292059 292264 291565
$$ packed form
53798B75431O690O711O285N388M224L190K616K478K527K668K919L014K511J522
53784C28174Q18P90P66j49j823l302m042m373m820n504o206o574o293n427m557
53769B77478m260m475m740m840m907m969m876m547l986l178k296j742j639j561
53755B25462j199r41j172j446j105m22k51o80r61p32m27l41j70K61O08O17N15
53738B17616N28O22Q63J377J794J448L90n01o86n46m53q2Q17J662J738J220Q51
53721B28658Q98J098J279J449J389P88j02m64J95J365J979J546P33O19J452K377
53705B45259K543K068J650J644J985K604L264L358K711K297L239N054N950N018
53691B88644L226J899J155L97m99j109j165p40j11K74P8l89l92J92N99K05o99
$$ plain form
53674 291565 290072 288094 285912 283978 282831 282673 283283 284234 284963 284877 283927 282900 282663 283195 283838 284224 284368
53657 284368 284055 282981 281543 280741 281080 282145 283353 284501 285453 285974 286138 286336 286611 286546 286094 285926 286572
53640 286572 287721 288832 290038 291987 294985 298614 302022 304414 305576 306195 307429 309918 313342 317002
53626 317002 320403 323169 324902 325589 325899 326685 328280 330426 332693 334737 336432 338033 340047 342795 346199
53611 346199 350073 354361 358926 363405 367452 370965 373964 376524 378925 381532 384346 386962 389156 391214
53597 391214 393494 395946 398188 399762 400202 399335 397728 396394 395758 395300 394458 393319 392070 390407 388110
53582 388110 385755 384053 382764 381105 379048 377327 376092 374491 371916 368944 366507 364712 363027 361316
53568 361316 360018 359342 358829 357859 356272 354403 352719 351579 351177 351476 352230 353147 354037 354761 355144 355118 354952
$$ packed form
53674B91565j493j978k182j934j147j58O10R51P29q6r50j027k37N32O43L86J44
53657B84368l13j074j438q02L39J065J208J148R52N21J64J98K75o5m52j68O46
53640B86572J149J111J206J949K998L629L408K392J162O19J234K489L424L660
53626C17002L401K766J733O87L10P86J595K146K267K044J695J601K014K748L404
53611C46199L874M288M565M479M047L513K999K560K401K607K814K616K194K058
53597C91214K280K452K242J574M40q67j607j334o36m58q42j139j249j663k297
53582C88110k355j702j289j659k057j721j235j601k575k972k437j795j685j711
53568C61316j298o76n13r70j587j869j684j140m02K99P54R17Q90P24L83k6j66
$$ plain form
53551 354952 355098 355651 356158 356169 355913 356086 357059 358553 360174 361866 363682 365438 366958 368488 370498 373150
53535 373150 376229 379599 383414 387876 393103 399271 406559 414722 423012 430888 438671 447208 456915 467436
53521 467436 478259 489239 500432 511905 524044 537628 553004 569326 585271 600547 616167
53510 616167 633127 651524 671231 692613 715827 739882 763285 785555 807433 829633 852022
53499 852022 874020 895053 914508 932003 948100 964163 981029 998241 1014995 1031352 1047920
53488 1047920 1064717 1081111 1096828 1112309 1127954 1143588 1158987 1174527 1190896 1208320 1226286
53477 1226286 1243916 1260423 1275408 1289010 1301660 1313373 1323295 1330351 1334411 1336366 1336871 1335456 1331351
53464 1331351 1324754 1316574 1307126 1295939 1282982 1269268 1255843 1242818 1229796 1216566 1202760 1187504
$$ packed form
53551C54952J46N53N07J1k56J73R73J494J621J692J816J756J520J530K010K652
53535C73150L079L370L815M462N227O168P288Q163Q290P876P783Q537R707J0521
53521D67436J0823J0980J1193J1473J2139J3584J5376J6322J5945J5276J5620
53510F16167J6960J8397J9707K1382K3214K4055K3403K2270K1878K2200K2389
53499H52022K1998K1033J9455J7495J6097J6063J6866J7212J6754J6357J6568
53488A047920J6797J6394J5717J5481J5645J5634J5399J5540J6369J7424J7966
53477A226286J7630J6507J4985J3602J2650J1713R922P056M060J955N05j415m105
53464A331351o597q180r448j1187j2957j3714j3425j3025j3022j3230j3806j5256
$$ plain form
53452 1187504 1170307 1151935 1133573 1115384 1096767 1077835 1059535 1042184 1024957 1007203 989439
53441 989439 972607 957046 942704 929796 918693 909606 902796 898614 896789 896084 895265 894170 893361 893090
53427 893090 893228 894030 896239 900380 906373 913906 922764 932766 943801 956022 969715 984871 1001134
53414 1001134 1018302 1036615 1056421 1077656 1099809 1122383 1145376 1169291 1194632 1221417 1249296
53403 1249296 1278170 1308484 1340772 1375057 1410884 1447951 1486581 1527528 1571230 1617179 1664147
53392 1664147 1711274 1758942 1808281 1859787 1912663 1965545 2017541 2068447 2118294 2166959 2214033
53381 2214033 2258853 2300838 2339998 2376954 2412226 2445538 2475889 2502170 2523817 2541186 2555394
53370 2555394 2567366 2576768 2582042 2581638 2574881 2561578 2541381 2514142 2480625 2442311 2400524 2356099
$$ packed form
53452A187504j7197j8372j8362j8189j8617j8932j8300j7351j7227j7754j7764
53441I89439j6832j5561j4342j2908j1103r087o810m182j825p05q19j095q09k71
53427H93090J38Q02K209M141N993P533Q858J0002J1035J2221J3693J5156J6263
53414A001134J7168J8313J9806K1235K2153K2574K2993K3915K5341K6785K7879
53403A249296K8874L0314L2288L4285L5827L7067L8630M0947M3702M5949M6968
53392A664147M7127M7668M9339N1506N2876N2882N1996N0906M9847M8665M7074
53381B214033M4820M1985L9160L6956L5272L3312L0351K6281K1647J7369J4208
53370B555394J1972R402N274m04o757j3303k0197k7239l3517l8314m1787m4425
$$ plain form
53358 2356099 2309771 2262328 2214272 2165677 2116607 2067516 2019142 1972082 1926506 1882299 1839498
53347 1839498 1798605 1760182 1723999 1688778 1653011 1616022 1578164 1540274 1503279 1468129 1435616
53336 1435616 1405974 1378802 1353510 1329882 1308228 1289052 1272563 1258514 1246506 1236231 1227190
53325 1227190 1218348 1208569 1197488 1185610 1173384 1160590 1146840 1132305 1117633 1103487 1090485 1079262
53313 1079262 1070042 1062284 1055183 1048490 1042570 1037786 1034237 1032040 1031429 1032413 1034628 1037703 1041686 1046988
53299 1046988 1053990 1062710 1072854 1084202 1096869 1111091 1126901 1144317 1163743 1185702 1209954 1235309
53287 1235309 1260549 1285219 1309262 1332351 1354026 1374207 1393116 1410840 1427368 1442805 1457046
53276 1457046 1469333 1478602 1484298 1486555 1485711 1482097 1476213 1468570 1459134 1447279 1432454 1414784 1394992
$$ packed form
53358B356099m6328m7443m8056m8595m9070m9091m8374m7060m5576m4207m2801
53347A839498m0893l8423l6183l5221l5767l6989l7858l7890l6995l5150l2513
53336A435616k9642k7172k5292k3628k1654j9176j6489j4049j2008j0275r041
53325A227190q842r779j1081j1878j2226j2794j3750j4535j4672j4146j3002j1223
53313A079262r220p758p101o693n920m784l549k197o11R84K215L075L983N302
53299A046988P002Q720J0144J1348J2667J4222J5810J7416J9426K1959K4252K5355
53287A235309K5240K4670K4043K3089K1675K0181J8909J7724J6528J5437J4241
53276A457046J2287R269N696K257q44l614n884p643r436j1855j4825j7670j9792
$$ plain form
53263 1394992 1373916 1352057 1329370 1305496 1280400 1254673 1228982 1203314 1177102 1150114 1122864
53252 1122864 1096067 1069969 1044442 1019555 995753 973330 951820 930175 907763 885026 862854
53241 862854 841432 820161 798760 777839 758154 739803 722494 706131 690702 676053 662358
53230 662358 650416 640849 633208 626477 620227 614626 609438 603762 596877 588827 580054 570890 561384 551182
53216 551182 539623 526430 512345 498584 485715 473527 461941 451392 442207 434222 427233 421185
53204 421185 415643 409638 402500 394575 386783 379676 373130 366682 359852 352343 344221 335944 328162 321385
53190 321385 315676 310498 305095 299306 293843 289429 285879 282462 278938 275633 272654 269752 267029 264982
53176 264982 263638 262303 260528 258680 257201 255811 253946 251621 249403 247814 247082 247163 247604 247671 247017 246080
$$ packed form
53263A394992k1076k1859k2687k3874k5096k5727k5691k5668k6212k6988k7250
53252A122864k6797k6098k5527k4887k3802k2423k1510k1645k2412k2737k2172
53241H62854k1422k1271k1401k0921j9685j8351j7309j6363j5429j4649j3695
53230F62358j1942r567p641o731o250n601n188n676o885q050q773r164r506j0202
53216E51182j1559j3193j4085j3761j2869j2188j1586j0549r185p985o989o048
53204D21185n542o005p138p925p792p107o546o448o830p509q122q277p782o777
53190C21385n709n178n403n789n463m414l550l417l524l305k979k902k723k047
53176B64982j344j335j775j848j479j390j865k325k218j589p32Q1M41O7o54r37
$$ plain form
53160 246080 245534 245548 245828 246110 246253 246067 245443 244586 243808 243129 242282 241076 239673 238600 238483 239501 240988
53143 240988 241873 241666 240787 239845 238998 238238 237843 238102 238850 239684 240484 241392 242383 243247 243962 244752 245692 246440 246475
53124 246475 245659 244612 244429 245772 248232 250826 253043 255098 257264 259572 262246 265662 269487 272482 273791
53109 273791 274005 274331 275025 275239 274210 271989 269081 266028 263289 260989 258725 256070 253314 251254 250246
53094 250246 249935 249916 250076 250118 249387 247600 245408 243766 242912 242307 241486 240582 239972 239666 239286 238587 237822 237493
53076 237493 237775 238314 238615 238458 237881 237023 236182 235810 236123 236764 237089 236797 236035 234986 233680 232276 231153
53059 231153 230546 230285 230071 229868 229892 230308 231028 231736 232139 232333 232915 234462 236752 238755 239588 239336 238733 238252
53041 238252 237863 237528 237443 237639 237748 237495 237189 237395 238151 238819 238700 237609 235890 234202 233289 233564 234690 235780
$$ packed form
53160B46080n46J4K80K82J43j86o24q57p78o79q47j206j403j073j17J018J487
53143B40988Q85k07q79r42q47p60l95K59P48Q34Q00R08R91Q64P15P90R40P48L5
53124B46475q16j047j83J343K460K594K217K055K166K308K674L416L825K995J309
53109B73791K14L26O94K14j029k221k908l053k739k300k264k655k756k060j008
53094B50246l11j9J60M2p31j787k192j642q54o05q21r04o10l06l80o99p65l29
53076B37493K82N39L01j57n77q58q41l72L13O41L25k92p62j049j306j404j123
53059B31153o07k61k14k03K4M16P20P08M03J94N82J547K290K003Q33k52o03m81
53041B38252l89l35q5J96J09k53l06K06P56O68j19j091j719j688r13K75J126J090
$$ plain form
53023 235780 236242 236337 236794 238040 239873 241648 242624 242456 241603 241035 241273 241934 242504 243177 244454 246184 247624
53006 247624 248416 248895 249363 249635 249453 248866 248028 247030 246143 245796 246119 246811 247596 248435 249239 249856 250505 251637
52988 251637 253071 253911 253772 253521 254228 255787 257294 258422 259683 261479 263671 266043 268431 270296 270901
52973 270901 270270 269400 269136 269236 268984 268374 268155 268839 270182 271706 273325 275156 276969 278202 278556 278306 277903
52956 277903 277484 276952 276356 275828 275203 274026 272032 269327 266120 262656 259528 257573 257105 257541 258080 258477
52940 258477 258833 258963 258464 257338 256110 255330 255258 255939 257184 258429 258999 258643 257683 256610 255751 255212 254886
52923 254886 254505 253923 253380 253260 253571 253897 253862 253446 252865 252363 252123 252124 252070 251657 250903 250006 248974 247747 246686
52904 246686 246510 247583 249537 251724 253697 255050 255216 253959 251969 250480 250170 250684 251318 251856 252462 253053
$$ packed form
53023B35780M62R5M57J246J833J775R76j68q53n68K38O61N70O73J277J730J440
53006B47624P92M79M68K72j82n87q38r98q87l47L23O92P85Q39Q04O17O49J132
52988B51637J434Q40j39k51P07J559J507J128J261J796K192K372K388J865O05
52973B70901o31q70k64J00k52o10k19O84J343J524J619J831J813J233L54k50m03
52956B77903m19n32n96n28o25j177j994k705l207l464l128j955m68M36N39L97
52940B58477L56J30m99j126j228p80p2O81J245J245N70l56r60j073q59n39l26
52923B54886l81n82n43j20L11L26l5m16n81n02k40Jn4m13p54q97j032j227j061
52904B46686j76J073J954K187J973J353J66j257j990j489l10N14O34N38O06N91
$$ plain form
52888 253053 253250 252999 252805 253058 253398 253143 252237 251399 251308 252046 253405 255252 257333 259118 260252 261022 262002
52871 262002 263423 265181 267305 269930 272829 275381 277166 278332 279306 280352 281407 282083 281811 280313 278029
52856 278029 275838 274183 272610 270244 266601 261895 256861 252371 248984 246602 244617 242551 240440 238506
52842 238506 236717 234928 233342 232449 232379 232639 232620 232179 231511 230654 229523 228457 228282 229514 231664 233640 234716
52825 234716 234926 234576 233792 232629 231357 230441 230225 230600 230976 230764 230103 229900 230751 232088 232899 233193 234017 235883
52807 235883 237963 239233 239712 239931 239721 238339 235680 232603 230046 228342 227457 227324 227658 227795 227068 225396
52791 225396 223487 222413 222727 223858 224618 224464 223977 223867 223970 223680 223031 222688 223049 223985 225372 227196 229078
52774 229078 230383 230982 231388 231915 232208 231841 230914 229782 228585 227395 226454 225899 225460 224783 223985 223646 224306
$$ packed form
52888B53053J97k51j94K53L40k55r06q38r1P38J359J847K081J785J134P70R80
52871B62002J421J758K124K625K899K552J785J166R74J046J055O76k72j498k284
52856B78029k191j655j573k366l643m706n034m490l387k382j985k066k111j934
52842B38506j789j789j586q93p0K60j9m41o68q57j131j066j75J232K150J976J076
52825B34716K10l50p84j163j272r16k16L75L76k12o61k03Q51J337Q11K94Q24J866
52807B35883K080J270M79K19k10j382k659l077k557j704q85j33L34J37p27j672
52791B25396j909j074L14J131P60j54m87j10J03k90o49l43L61R36J387J824J882
52774B29078J305N99M06N27K93l67r27j132j197j190r41n55m39o77p98l39O60
$$ plain form
52757 224306 226043 228380 230449 231445 231190 230277 229639 229970 231393 233482 235625 237611 239828 242634 245608
52742 245608 247788 248704 248814 248825 249005 249361 250069 251339 253038 254778 256288 257474 258141 257938 256729 254997
52726 254997 253727 253622 254327 254665 253865 252370 251149 250456 249739 248584 247189 245884 244777 244005 243763 243883
52710 243883 243861 243538 243302 243399 243523 243421 243447 244116 245419 246874 247944 248174 247379 246067 245232 245293 245664 245800 246097
52691 246097 247108 248350 248812 248462 248297 248854 249568 249776 249574 249305 248867 248004 246847 245740 244869 244390 244518
52674 244518 245084 245340 244730 243678 243079 243157 243352 243331 243522 244409 245780 247038 247976 248836 249701 250288 250441 250539 251225
52655 251225 252915 255726 259582 264044 268166 270914 271898 271464 270031 267706 264770 262132 260786 260807 261239
52640 261239 260990 259642 257471 255176 253683 253731 255199 257074 258420 259287 260399 262128 264212 266386 268707
$$ packed form
52757B24306J737K337K069R96k55r13o38L31J423K089K143J986K217K806K974
52742B45608K180R16J10J1J80L56P08J270J699J740J510J186O67k03j209j732
52726B54997j270j05P05L38q00j495j221o93p17j155j395j305j107p72k42J20
52710B43883k2l23k36R7J24j02K6O69J303J455J070K30p95j312q35O1L71J36K97
52691B46097J011J242M62l50j65N57P14K08k02k69m38q63j157j107q71m79J28
52674B44518N66K56o10j052n99P8J95k1J91Q87J371J258R38Q60Q65N87J53R8O86
52655B51225J690K811L856M462M122K748R84m34j433k325k936k638j346K1M32
52640B61239k49j348k171k295j493M8J468J875J346Q67J112J729K084K174K321
$$ plain form
52625 268707 270992 272429 272185 270293 267646 265229 263571 262749 262473 262169 261368 260098 258684 257208 255483
52610 255483 253597 252063 251318 251359 251992 253028 254082 254670 254853 255395 256794 258459 259322 259148 258736 258929 259899
52593 259899 261307 262589 263034 262147 260265 258548 258127 259318 261599 264043 265787 266484 266557 266810 267667 268880
52577 268880 269972 270749 271367 272148 273331 274771 275868 276063 275422 274481 273603 272770 271907 270926 269517 267489 265409
52560 265409 264297 264379 264646 264012 262481 260798 259423 258333 257526 257092 256844 256387 255620 254895 254683 255218 256375
52543 256375 257690 258635 259126 259644 260644 261962 263047 263622 263888 264178 264707 265577 266778 268168 269619 271090
52527 271090 272424 273189 272983 271837 270184 268475 266988 265898 265334 265386 266122 267522 269354 271352 273630 276637
52511 276637 280508 284708 288619 292214 295857 299624 303154 305957 307494 307155 304727 300876 296694 292655
$$ packed form
52625B68707K285J437k44j892k647k417j658q22k76l04q01j270j414j476j725
52610B55483j886j534p45M1O33J036J054N88J83N42J399J665Q63j74m12J93R70
52593B59899J408J282M45q87j882j717m21J191K281K444J744O97P3K53Q57J213
52577B68880J092P77O18P81J183J440J097J95o41r41q78q33q63r81j409k028k080
52560B65409j112Q2K67o34j531j683j375j090q07m34k48m57p67p25k12N35J157
52543B56375J315R45M91N18J000J318J085N75K66K90N29Q70J201J390J451J471
52527B71090J334P65k06j146j653j709j487j090n64N2P36J400J832J998K278L007
52511B76637L871M200L911L595L643L767L530K803J537l39k428l851m182m039
$$ plain form
52497 292655 288440 283867 279541 276241 273970 271958 269580 267085 265347 264983 265696 266467 266449 265671 264855 264639
52481 264639 265057 265729 266361 267004 267898 269095 270255 270911 270960 270861 271240 272334 273815 275125 276063 277182 279460
52464 279460 283250 287630 291249 293909 296749 300561 304465 306771 306780 305138 302678 299645 296021 291928 287530
52449 287530 283018 278888 275756 273701 272183 270837 269938 269800 270105 270238 270062 269949 270121 270379 270456 270314 269971
52432 269971 269311 268260 267025 266004 265458 265354 265526 265890 266529 267594 269118 270828 272166 272650 272350 271910
52416 271910 272015 272909 274462 276481 278727 280834 282660 284732 288007 293111 300110 308958 319630 331542
52402 331542 343298 353405 360973 365518 366516 363752 357986 350733 343306 336233 329485 322899 316509 310774
52388 310774 306472 304053 303124 302825 302611 302406 302173 301777 301258 300879 300871 301388 302656 304827 307717 311062 314968
$$ packed form
52497B92655m215m573m326l300k271k012k378k495j738l64P13P71j8p78q16k16
52481B64639M18O72O32O43Q94J197J160O56M9r9L79J094J481J310R38J119K278
52464B79460L790M380L619K660K840L812L904K306Rj642k460l033l624m093m398
52449B87530m512m130l132k055j518j346q99j38L05J33j76j13J72K58P7j42l43
52432B69971o60j051j235j021n46j04J72L64O39J065J524J710J338M84l00m40
52416B71910J05Q94J553K019K246K107J826K072L275N104O999Q848J0672J1912
52402C31542J1756J0107P568M545R98k764n766p253p427p073o748o586o390n735
52388C10774m302k419r29k99k14k05k33l96n19l79qN17J268K171K890L345L906
$$ plain form
52371 314968 319715 325122 330598 335856 341057 346050 349956 351962 352271 351876 351498 351070 350221 348983 347887
52356 347887 347430 347545 347678 347389 346749 346139 345881 346241 347485 349520 351608 352925 353477 354146 355706 358100 360765
52339 360765 363433 366491 370656 376289 382879 389354 395206 401158 408322 416815 425809 434946 445004 456891
52325 456891 470612 485662 501880 519294 537462 555686 573827 592294 611150 629726 647404
52314 647404 664477 681971 700673 720518 740851 761077 780967 800484 819672 838816 858422
52303 858422 878692 899149 919091 938336 957042 974835 990693 1003933 1014842 1023944 1031040 1035364
52291 1035364 1036475 1034561 1030098 1023655 1015920 1007424 998173 987922 976878 965841 955611 946501 938480
52278 938480 931540 925816 921567 919095 918550 919713 922195 925899 931132 938133 946613 955881 965404 975219
$$ packed form
52371C14968M747N407N476N258N201M993L906K006L09l95l78m28q49j238j096
52356C47887m57J15J33k89o40o10k58L60J244K035K088J317N52O69J560K394K665
52339C60765K668L058M165N633O590O475N852N952P164Q493Q994R137J0058J1887
52325D56891J3721J5050J6218J7414J8168J8224J8141J8467J8856J8576J7678
52314F47404J7073J7494J8702J9845K0333K0226J9890J9517J9188J9144J9606
52303H58422K0270K0457J9942J9245J8706J7793J5858J3240J0909R102P096M324
52291A035364J111j914m463o443p735q496r251j0251j1044j1037j0230r110q021
52278I38480o940n724m249k472n45J163K482L704N233P001Q480R268R523R815
$$ plain form
52264 975219 985804 997513 1010129 1023087 1036226 1050125 1065435 1081961 1098803 1115420 1132190
52253 1132190 1149787 1168286 1187056 1205153 1221467 1234766 1244231 1250100 1253414 1254930 1254387 1250911 1243976
52240 1243976 1233882 1221538 1207951 1193821 1179377 1164534 1149220 1133551 1117812 1102419 1087786
52229 1087786 1074021 1060724 1047405 1034089 1021184 1008750 996478 984624 974353 966610 961035 956574
52217 956574 952786 949820 947443 945095 942982 942121 942997 944958 947240 949820 952790 955708 958229 960754 963756
52202 963756 966990 970105 973564 978012 983089 987860 992375 997863 1005185 1013830 1022628 1030791 1038029 1044214
52188 1044214 1049354 1053557 1056837 1059121 1060417 1060584 1059010 1055076 1049022 1041846 1034162 1025736 1016320 1006447
52174 1006447 997027 988536 980932 974068 967855 962205 957116 952765 949413 947366 947026 948690 952148 956680
$$ packed form
52264I75219J0585J1709J2616J2958J3139J3899J5310J6526J6842J6617J6770
52253A132190J7597J8499J8770J8097J6314J3299R465N869L314J516n43l476o935
52240A243976j0094j2344j3587j4130j4444j4843j5314j5669j5739j5393j4633
52229A087786j3765j3297j3319j3316j2905j2434j2272j1854j0271p743n575m461
52217I56574l788k966k377k348k113q61Q76J961K282K580K970K918K521K525L002
52202I63756L234L115L459M448N077M771M515N488P322Q645Q798Q163P238O185
52188A044214N140M203L280K284J296J67j574l934o054p176p684q426r416r873
52174A006447r420q491p604o864o213n650n089m351l352k047l40J664L458M532
$$ plain form
52160 956680 961578 966529 971546 976770 982187 987237 990795 992095 991661 990806 990162 989288 987822 986336 985723
52145 985723 986292 987877 990337 993402 996406 998666 1000003 1000546 1000312 999399 998413 998294 999678 1002588 1006620 1011399
52129 1011399 1017074 1024568 1035030 1048866 1065559 1084563 1105934 1129820 1155745 1182760 1210030 1237075
52117 1237075 1263829 1290754 1318463 1346817 1374754 1401414 1426916 1451462 1474193 1493809 1510216
52106 1510216 1524715 1538485 1551564 1563489 1574270 1584321 1593792 1602354 1609453 1614586 1617419 1617741 1615226
52093 1615226 1609253 1599213 1585060 1567417 1547134 1524940 1501520 1477653 1454094 1431382 1409921
52082 1409921 1390225 1372931 1358477 1346714 1336960 1328525 1321191 1315177 1310833 1308557 1308762 1311520 1316324
52069 1316324 1322537 1330071 1339226 1350048 1362364 1376369 1392365 1409783 1427300 1444347 1461722 1480153
$$ packed form
52160I56680M898M951N017N224N417N050L558J300m34q55o44q74j466j486o13
52145I85723N69J585K460L065L004K260J337N43k34r13r86j19J384K910M032M779
52129A011399N675P494J0462J3836J6693J9004K1371K3886K5925K7015K7270K7045
52117A237075K6754K6925K7709K8354K7937K6660K5502K4546K2731J9616J6407
52106A510216J4499J3770J3079J1925J0781J0051R471Q562P099N133K833L22k515
52093A615226n973j0040j4153j7643k0283k2194k3420k3867k3559k2712k1461
52082A409921j9696j7294j4454j1763r754q435p334o014m344k276K05K758M804
52069A316324O213P534R155J0822J2316J4005J5996J7418J7517J7047J7375J8431
$$ plain form
52057 1480153 1499026 1517274 1534884 1552475 1569702 1585119 1597597 1606970 1613200 1615838 1614638 1610074
$$ packed form
52057A480153J8873J8248J7610J7591J7227J5417J2478R373O230K638j200m564
$$ [...]
##END NTUPLES=NMR SPECTRUM
##END=
