##TITLE=AC1732_SEN00005_9275896_cHlFfLDpW5
##JCAMPDX= 6.0         $$ Bruker NMR JCAMP-DX V2.0
##DATA TYPE= NMR SPECTRUM
##DATA CLASS= NTUPLES
##ORIGIN= BRUKER
##OWNER= Administrator
$$ 1.72 TOPSPIN		Version 2.1
$$ 2015-07-14 22:00:25.869 -0700  Administrator@X
$$ Compression mode = diff/dup
##.OBSERVE FREQUENCY= 400.02188249412
##.OBSERVE NUCLEUS= ^1H
##.ACQUISITION MODE= SIMULTANEOUS (DQD)
##.ACQUISITION SCHEME= undefined
##.AVERAGES= 8
##.DIGITISER RES= 22
##SPECTROMETER/DATA SYSTEM= spect
##.PULSE SEQUENCE= zg30
##.SOLVENT NAME= COFFEE_meoh
##.SHIFT REFERENCE= INTERNAL, COFFEE_meoh, 1, 14.98509
##AUDIT TRAIL= $$ (NUMBER, WHEN, WHO, WHERE, PROCESS, VERSION, WHAT)
$$ ##TITLE= Audit trail, TOPSPIN		Version 2.1
$$ ##JCAMPDX= 5.01
$$ ##ORIGIN= Bruker BioSpin GmbH
$$ ##OWNER= Administrator
$$ $$ E:\/data/COFFEE/nmr/AC1732_SEN00005_9275896_cHlFfLDpW5/10/pdata/1/auditp.txt
$$ ##AUDIT TRAIL=  $$ (NUMBER, WHEN, WHO, WHERE, PROCESS, VERSION, WHAT)
(   1,<2015-07-14 22:00:18.463 -0700>,<Administrator>,<X>,<go>,<TOPSPIN 2.1>,
      <created by zg
	started at 2015-07-14 21:59:12.557 -0700,
	POWCHK enabled, PULCHK disabled,
       configuration hash MD5:
       21 0F 79 D6 B3 7B B4 F6 88 20 88 DB 03 48 BD 9F
       data hash MD5: 64K
       61 04 8B A8 29 DF 27 EC 12 1B D2 B5 EC 02 6D B6>)
(   2,<2015-07-14 22:00:21.557 -0700>,<Administrator>,<X>,<proc1d>,<TOPSPIN 2.1>,
      <Start of raw data processing
       efp LB = 0 FT_mod = 6 PKNL = 1 PHC0 = 0 PHC1 = 0 SI = 32K 
       data hash MD5: 32K
       1F 77 B2 04 FA E2 69 83 04 D7 53 E1 95 B2 BE B0>)
(   3,<2015-07-14 22:00:21.979 -0700>,<Administrator>,<X>,<proc1d>,<TOPSPIN 2.1>,
      <pk PHC0 = 90.05493 PHC1 = 0 
       data hash MD5: 32K
       0B 4C 16 29 DC C1 58 F9 FE 84 4C 24 63 7C 66 0E>)
(   4,<2015-07-14 22:00:22.088 -0700>,<Administrator>,<X>,<proc1d>,<TOPSPIN 2.1>,
      <abs ABSG = 1 
       data hash MD5: 32K
       69 38 C8 74 F1 B5 E3 24 F6 DA 3F 7E A4 61 39 B8>)
(   5,<2015-07-14 22:00:22.166 -0700>,<Administrator>,<X>,<proc1d>,<TOPSPIN 2.1>,
      <abs ABSG = 2 
       data hash MD5: 32K
       38 53 73 30 20 31 96 B4 0F FC 76 F0 6C B5 E3 F4>)
(   6,<2015-07-14 22:00:22.213 -0700>,<Administrator>,<X>,<proc1d>,<TOPSPIN 2.1>,
      <abs ABSG = 3 
       data hash MD5: 32K
       DC 86 53 71 5D 19 9E 8A 52 E6 5D FE 77 F9 CA F8>)
(   7,<2015-07-14 22:00:22.291 -0700>,<Administrator>,<X>,<proc1d>,<TOPSPIN 2.1>,
      <abs ABSG = 4 
       data hash MD5: 32K
       CE 6E 3A 87 EA E7 EF 97 34 C0 52 1B 35 12 2D F2>)
(   8,<2015-07-14 22:00:22.354 -0700>,<Administrator>,<X>,<proc1d>,<TOPSPIN 2.1>,
      <abs ABSG = 5 
       data hash MD5: 32K
       7C 50 6B CD F9 F2 84 00 48 FE 09 41 AE 35 E9 89>)
$$ ##END=
$$ 
$$ $$ hash MD5
$$ $$ 37 DA BD 65 8A 63 0A 62 0C 63 22 30 54 06 09 54
##$RELAX= 
##$RELAX= 
##$RELAX= 
##$RELAX= 
##$RELAX= 
##$RELAX= 
##$RELAX= 
$$ Bruker specific parameters
$$ --------------------------
##$DU= <E:\>
##$EXPNO= 10
##$NAME= <AC1732_SEN00005_9275896_cHlFfLDpW5>
$$ [...]
150 150 150 150 150 150 150 150
##$TP07= 0
##$TPNAME0= <>
##$TPNAME1= <>
##$TPNAME2= <>
##$TPNAME3= <>
##$TPNAME4= <>
##$TPNAME5= <>
##$TPNAME6= <>
##$TPNAME7= <>
##$TPOAL= (0..7)
0.5 0.5 0.5 0.5 0.5 0.5 0.5 0.5
##$TPOFFS= (0..7)
0 0 0 0 0 0 0 0
##$TUNHIN= 0
##$TUNHOUT= 0
##$TUNXOUT= 0
##$USERA1= <user>
##$USERA2= <user>
##$USERA3= <user>
##$USERA4= <user>
##$USERA5= <user>
##$V9= 5
##$VALIST= <valist>
##$VCLIST= <CCCCCCCCCCCCCCC>
##$VD= 0
##$VDLIST= <DDDDDDDDDDDDDDD>
##$VPLIST= <PPPPPPPPPPPPPPP>
##$VTLIST= <TTTTTTTTTTTTTTT>
##$WBST= 2048
##$WBSW= 25
##$XGAIN= (0..3)
0 0 0 0
##$XL= 0
##$YL= 0
##$YMAX_a= 604904
##$YMIN_a= -522113
##$ZGOPTNS= <>
##$ZL1= 120
##$ZL2= 120
##$ZL3= 120
##$ZL4= 120
##$ABSF1= 14.98509
##$ABSF2= -5.573092
##$ABSG= 5
##$ABSL= 3
##$ALPHA= 0
##$AQORDER= 0
##$ASSFAC= 0
##$ASSFACI= 0
##$ASSFACX= 0
##$ASSWID= 0
##$AUNMP= <proc_prof1d_extract_pilot.lims>
##$AXLEFT= 0
##$AXNAME= <>
##$AXNUC= <1H>
##$AXRIGHT= 0
##$AXTYPE= 0
##$AXUNIT= <>
##$AZFE= 0.1
##$AZFW= 0.1
##$BCFW= 0
##$BC_mod= 0
##$BYTORDP= 0
##$COROFFS= 0
##$CY= 15
##$DATMOD= 1
##$DC= 0
##$DFILT= <>
##$DTYPP= 0
##$F1P= 0
##$F2P= 0
##$FCOR= 0.5
##$FTSIZE= 32768
##$FT_mod= 6
##$GAMMA= 0
##$GB= 0
##$INTBC= 1
##$INTSCL= 1
##$ISEN= 128
##$LB= 0
##$LEV0= 0
##$LPBIN= 0
##$MAXI= 10000
##$MC2= 0
##$MEAN= 0
##$ME_mod= 0
##$MI= 0
##$NCOEF= 0
##$NC_proc= -8
##$NLEV= 6
##$NOISF1= 0
##$NOISF2= 0
##$NSP= 0
##$NTH_PI= 0
##$NZP= 0
##$OFFSET= 14.98509
##$PC= 1
##$PHC0= 90.05493
##$PHC1= 0
##$PH_mod= 1
##$PKNL= yes
##$PPARMOD= 0
##$PPDIAG= 0
##$PPIPTYP= 0
##$PPMPNUM= 2147483647
##$PPRESOL= 1
##$PSCAL= 4
##$PSIGN= 0
##$PYNMP= <proc.py>
##$REVERSE= no
##$SF= 400.02
##$SI= 32768
##$SIGF1= 0
##$SIGF2= 0
##$SINO= 400
##$SIOLD= 32768
##$SPECTYP= <>
##$SREGLST= <1H.CDCl3>
##$SSB= 0
##$STSI= 32768
##$STSR= 0
##$SW_p= 8223.68421052631
##$SYMM= 0
##$S_DEV= 0
##$TDeff= 65536
##$TDoff= 0
##$TI= <>
##$TILT= no
##$TM1= 0
##$TM2= 0
##$TOPLEV= 0
##$USERP1= <user>
##$USERP2= <user>
##$USERP3= <user>
##$USERP4= <user>
##$USERP5= <user>
##$WDW= 1
##$XDIM= 32768
##$YMAX_p= 446087052
##$YMIN_p= -657165
##$CURPLOT= <Network HP LaserJet P1505>
##$CURPRIN= <$Network HP LaserJet P1505>
##$DFORMAT= <normdp>
##$LAYOUT= <+/1D_H.xwp>
##$LFORMAT= <normlp>
##$PFORMAT= <normpl>
##$SURQMSG= 1
$$ End of Bruker specific parameters
$$ ---------------------------------
##NTUPLES= NMR SPECTRUM
##VAR_NAME=  FREQUENCY,     SPECTRUM/REAL,   SPECTRUM/IMAG
##SYMBOL=    X,             R,               I
##VAR_TYPE=  INDEPENDENT,   DEPENDENT,       DEPENDENT
##VAR_FORM=  AFFN,          ASDF,            ASDF
##VAR_DIM=   32768,         32768,           32768
##UNITS=     HZ,            ARBITRARY UNITS, ARBITRARY UNITS
##FACTOR=    0.250966925370066, 1,           1
##FIRST=     8223.43324360094, -71473,       58168
##LAST=      0,             -16284,          -200981
##MIN=       0,             -657165,         0
##MAX=       8223.43324360094, 446087052,    0
$$ Real data points
##PAGE= N=1
##DATA TABLE= (X++(R..R)), XYDATA
$$ [...]
19560b37960A77072f822j80039A14748A7261d9802G395d6140j45996j6981g653
19548G1579g686k25140a4666A37856b4082I043b3714M537F8195O808a66857m220
19536a71077B4188J65351A6402b21040O285G0941f0414D1262e0746E8854a83069
19524b816l9720j33989j54447a03119H986b50076F7210c19215B82864b64952D9825
19512a19084A5991a38659A42364J15731E3702b77030d2796k72079b8202n2676
19502h0878B75956j30998B4834L73461G9807b94727e8087B02214b47660h3774
19491a87380J219K1434L7196L4274O388k40871A29986L5450B0892J41074b80582
19479f1492j48712j29840a39433l778r5359A54680a26111A82408H6033b5524n9502
$$ y = [-237960, 177072, -6822, -186861, 114748, 17261, -49802, 7395, -46140, -192136, -209117, -7653, 71579, -7686, -232826, -14666, 137856, -24082, 9043, -23714, -19177, 68195, 75003, -166857, -171077, 24188, 189539, 16402, -221040, -214755, 70941, -60414, 41262, -50746, 58854, -183069, -2816, -42536, -176525, -330972, -103119, 8986, -250076, 67210, -319215, 282864, -264952, 49825, -119084, 15991, -138659, 142364, 258095, 53702, -277030, -42796, -314875, -28202, -80878, 275956, 144958, 24834, 398295, 79807, -294727, -58087, 202214, -247660, -83774, -187380, -186161, -164727, -127531, -93257, -86869, -327740, 129986, 165436, 20892, 161966, -280582, -61492, -210204, -340044, -139433, -143211, -238570, 154680, -126111, 182408, 86033, -25524, -85026]
19468h5026k30226N2182d2214C9784b95732O6149b8280k15761B1637a62022k9212
19457a91234e5746k41102A06046f8648j69241k06087J29497a423k66632G320K02819
19446B10139M5588D4102K170K55946A20744r394k6021J97485A2641b88961C87469
19434B2727Q5175e4046n8475A66013P3379a86527n431d1592l09569B62018c30828
19422A42903D2280c77854A85690c03162c7208k35497F7015M7100b70892a2605
19411B94566c14078a34824m01486b36877d6717j33935q2978f3032j86418H360
19400a11070D2342b65914R4075f0671b8247j32547N0037a4304n6112B3655K2222
19389D5877i8158l96372G9743g912B41714A16500c35977B04055a24668H3057a07018
$$ y = [-85026, -315252, -263070, -42214, 39784, -295732, -229583, -28280, -244041, 21637, -162022, -191234, -55746, -296848, 106046, -68648, -237889, -443976, -314479, -1423, -268055, 7320, 210139, 255727, 44102, 46272, 302218, 120744, 111350, 85329, 282814, 12641, -288961, 387469, 22727, 107902, -54046, -112521, 166013, 239392, -186527, -191958, -41592, -351161, 262018, -330828, 142903, 42280, -377854, 185690, -303162, -37208, -272705, 67015, 114115, -270892, -12605, 294566, -314078, -134824, -536310, -236877, -46717, -180652, -263630, -63032, -249450, 8360, -111070, 42342, -265914, -171839, -60671, -28247, -160794, -110757, -14304, -70416, 23655, 45877, -98158, -494530, 79743, -7912, 241714, 116500, -335977, 204055, -124668, 83057, -107018]
19377A32226e4612k33207A85406a40830f887G7143C6865b50765A00082b51475
19366c61135J54574P9569O3255p6441E3976b8251E3724a80346B6793J04685c52629
19354a04571D6841b7787n5856I0025D3631B1466b13536l4212L1603r446h0352
19342E8895j6365j0097L7484a31524n1263B34973b832k2551l39226c94m1418J1093
19330c0719P806j3573A33339c04201c84j31713M9470E1793a99987E3460a78049
19318A18770B9192P9735a52096A40491b3478j00330C9744O3229g6513l9176L7101
19307g8588B3196i7927B6224a43199c9204K194l19728c2831k54417a04779B1711
19295C5936c46997R7885e0045A57494O488f0075j11668A75622i6779K8198p8465
$$ y = [132226, -54612, -287819, 185406, -140830, -6887, 77143, 36865, -250765, 100082, -251475, -361135, -206561, -126992, -63737, -140178, 53976, -28251, 53724, -180346, 26793, 131478, -352629, -104571, 46841, -27787, -83643, 90025, 43631, 21466, -213536, -247748, -216145, -225591, -80352, 58895, 42530, 32433, 69917, -131524, -182787, 234973, -2832, -25383, -364609, -394, -41812, -30719, -22913, -36486, 133339, -304201, -384, -132097, -82627, 51793, -199987, 53460, -178049, 118770, 29192, 108927, -152096, 140491, -23478, -123808, 39744, 102973, -76513, -115689, -78588, 23196, -97927, 26224, -143199, -39204, -37010, -356738, -32831, -287248, -104779, 21711, 35936, -346997, -249112, -50045, 157494, 163982, -60075, -171743, 175622, -96779, -68581, -147046]
19284a47046r4741Q6859P1689j31277H6174a89614l4917E0700a008j15793E4742
19272A01167J0911J8907c1420k24188c9874A07975a71928a8602C184K4985J6397
19261D4566O7548M2437a77714F1578j3249c9854j15577A54961a00597B81210a4802
19249E0461e5902j29017c9626A9684b84893a31036a5602n8240A92297b33223d2891
19237F0950c34611d3854H5910G0a08615k8738l8155P5378F6067b05064o5630B22668
19224F5371a49617e8154F3387a47422B60969i8673B45403C9326h2406a4603q7514
19213a02117C4771L11151a67004o2538D6246b57894L3541N0504E2497L5310a46128
19201c35677d5098b1332m7762k86213j1382a05255M0918j95786O5909A14920b35687
$$ y = [-147046, -241787, -154928, -83239, -214516, 86174, -189614, -224531, 50700, -1008, -116801, 54742, 101167, 112078, 130985, -31420, -255608, -39874, 107975, -171928, -18602, 3184, 28169, 44566, 112114, 154551, -177714, 61578, 48329, -39854, -155431, 154961, -100597, 281210, -14802, 50461, -55902, -184919, -39626, 19684, -284893, -131036, -15602, -73842, 192297, -233223, -42891, 60950, -334611, -43854, 85910, 70, -108615, -137353, -175508, -100130, 66067, -205064, -270694, 222668, 65371, -149617, -58154, 63387, -147422, 260969, -98673, 245403, 39326, -82406, -14603, -102117, 34771, 345922, -167004, -229542, 46246, -257894, -224353, -173849, 52497, 87807, -146128, -335677, -45098, -21332, -69094, -355307, -366689, -105255, -64337, -260123, -194214, 114920, -235687]
19189b49302R5408I1493B1086c60478A81426b26701r3821J55911A51293a57082
19178c5624A26662J10300G9733J30063a57281N755G1247J7961b59970j8657j72529
19167d51156a14882b0018B68439a52758A2464J43018e7955j40551B256a20536
19156d8952m0112B61021n5506K7677b5397C19647H7791a11975J0624I2377l0615
19145F1762K629i1775l9148b4434m7511A12490c8454G2920e9583J6456Q356A29085
19132A83677e4051n8778a9470j00903A59815b51993c7123m3494j25365c7574C02016
19120E4809d00628B35403k7308C1803e1133q4223j88182a1702l8280A24471a70424
19108H014J98019i4895A8156c3798D12c48031a57088n7231H4007i4408h334C11755
$$ y = [-249302, -153894, 91493, 21086, -360478, 181426, -226701, -320522, -164611, 151293, -157082, -35624, 126662, 236962, 79733, 209796, -157281, -151526, 71247, 89208, -259970, -278627, -451156, -114882, -20018, 268439, -152758, 12464, 155482, -57955, -198506, 2256, -120536, -48952, -89064, 261021, 205515, 233192, -25397, 319647, 87791, -111975, -101351, 92377, 61762, 64391, -91775, -130923, -24434, -71945, 112490, -38454, 72920, -59583, -43127, -34771, 129085, 183677, -54051, -112829, -19470, -120373, 159815, -251993, -37123, -80617, -205982, -37574, 302016, 54809, -400628, 235403, 208095, 31803, -51133, -135356, -323538, -11702, -49982, 124471, -170424, 8014, 206033, -94895, 18156, -33798, 412, -348031, -157088, -214319, 84007, -94408, -8334, 311755]
19095B7797J33854G9622a68677A61852f7131l9339M3736A7944a39787j49048c4681
19083C17763A21891c11040b1285k08896d4501J4186m24681A22521H601O1201e2824
19071g5624c6803l6984B6644J00027D0815b78803J01488K4145c0141B36594q5149
19060A51445J17625c0434l0577C8319M2804a58828A61967B9942f2576q8360H1514
19048A15121b14120d2934j93500O6695P3599k28782g9552C70777f1453A55295
19037A70815a0895k05855j25919g3974P021A1827L009J21786a38203A17199n1182
19026F6017g710j7852A0908i5560A83923E1850a46570A24672a9316o0788B511
19014E1917K40512a75675A02930b61707q0811c141j16657j80389P8340I2694a01454
$$ y = [27797, 161651, 79622, -168677, 161852, -67131, -106470, -62734, 17944, -139787, -288835, -34681, 317763, 121891, -311040, -21285, -230181, -44501, -30315, -454996, 122521, 8601, 69802, -52824, -75624, -36803, -73787, 26644, 126671, 40815, -278803, -177315, -153170, -30141, 236594, 151445, 269070, -30434, -61011, 38319, 81123, -158828, 161967, 29942, -62576, -150936, 81514, 115121, -214120, -42934, -236434, -169739, -96140, -324922, -79552, 370777, -61453, 155295, 170815, -10895, -216750, -342669, -73974, -66953, 11827, 14836, 136622, -138203, 117199, 66017, -7710, -25562, 10908, -95560, 183923, 51850, -146570, 124672, -19316, -80104, 2511, 51917, 292429, -175675, 102930, -261707, -342518, -3141, -119798, -300187, -221847, 92694, -101454]
19002A93100a83785e2642O927A75013f8286H6001b6600n3832j11433M9940l9377
18991a81302h083j46371N2468K2284l31755a59873a2491j06460A90710a00295
18980A30215n3422b2512j25812B50694H8840b2089A91381i3655m4249C1021b74303
18968d5525k9410B70173C5438P7686b89229b3641D8384K2541J61300n6968h3625
18956A15340K20091A37076E5225d3627q834j43641R2491k5476G6436B4391b70390
18944c5005o5768C25519A57907F7422c7716j08009D8082f3387I3282g9495k93233
18933c72728D17607g3023r4213l953j28411d6669q5675j51267F8635g2566B55648
18921d6507D2652c8891A33211a73778k5737A78639e5862B00634N3812a75473q7679
$$ y = [193100, -183785, -52642, -45715, 175013, -68286, 86001, -26600, -80432, -191865, -141925, -181302, -8083, -154454, -101986, -79702, -411457, -159873, -12491, -118951, 190710, -100295, 130215, 76793, -22512, -148324, 250694, 88840, -22089, 191381, -93655, -137904, 31021, -274303, -45525, -74935, 270173, 35438, 113124, -289229, -23641, 48384, 70925, 232225, 175257, -83625, 115340, 335431, 137076, 55225, -43627, -52461, -196102, -103611, -129087, 76436, 24391, -270390, -35005, -100773, 325519, 157907, 67422, -37716, -145725, 48082, -63387, 93282, -79495, -372728, 417607, -73023, -167236, -171189, -299600, -46669, -132344, -283611, 68635, -72566, 255648, -46507, 42652, -38891, 133211, -173778, -199515, 178639, -55862, 200634, 254446, -175473, -263152]
18910b63152B79021b5753l20003A89509b50885i1040j26858d5339A10581e3616
18899D3931b39318C69822I1584e4723A1929a28301C36942E1935a53422A57794
18888C6703a79937h2734k19530a24130H1779a75043b2320j82811D4737J41456
18878A86193n8269b18536I6097e55042K32450O5930g8592j88907a24120d2347
18867b10576m3149A35453E044f7556A73564C1844b7940j18640B21201i9333j07639
18856b06972B2468g2425j51763A34436K73701g0710A9686b44284a21409b1197
18845B1616b8569j78189E5485e1159j34333i815j83282g8947k01720a2879A35138
18833h8840A92364e6218k25063C55031j56343D4165g6430H2106Q0405K0591a27253
$$ y = [-263152, 279021, -25753, -345756, 189509, -250885, -91040, -217898, -45339, 110581, -53616, 43931, -239318, 369822, 91584, -54723, 11929, -128301, 336942, 51935, -153422, 157794, 36703, -179937, -82734, -302264, -124130, 81779, -175043, -22320, -205131, 44737, 186193, 127924, -218536, 96097, -555042, -322592, -256662, -78592, -267499, -124120, -42347, -210576, -253725, 135453, 5044, -67556, 173564, 31844, -27940, -146580, 221201, -99333, -206972, 22468, -72425, -224188, 134436, 408137, -70710, 19686, -244284, -121409, -21197, 21616, -28569, -206758, 55485, -51159, -185492, -9815, -193097, -78947, -280667, -12879, 135138, -88840, 192364, -56218, -281281, 355031, 198688, 44165, -76430, 82106, 162511, 183102, -127253]
18821C9264L12797E6856a81069e8238D5631K61611E5287J3651R9278N3753I6499
18809E7945j899K1737A4526a52067I2242h9317H3881c17047A18567b44748I4074
18797a55336B960a10266H6318c3829j48232B41769n2485b56609j018b2421B29154
18785c57073h456j12415d7110A65468a64824o9127a15156l4874L6689R966k3703
18774a27078j15107b0468B0053e766D7165a00264j14656N4089P240E1934f5105
18762A5043c07414p936f499B7762a22439j17786H7717b39956M4449Q0836F5750
18750b5468j35259j83852A7049L74708i2318C1702g3991A6500a32847j321F4119
18738C7529d23999a78550j10239B40815b74155A11488C2988M51603g6999j9546
$$ y = [39264, 352061, 56856, -181069, -58238, 45631, 307242, 55287, 68938, 168216, 221969, 96499, 57945, 56046, 77783, 14526, -152067, 92242, -89317, 83881, -317047, 118567, -244748, 94074, -155336, 2960, -110266, 86318, -33829, -182061, 241769, 189284, -256609, -257627, -22421, 229154, -357073, -8456, -120871, -47110, 165468, -164824, -233951, -115156, -150030, -113341, -103375, -127078, -242185, -20468, 20053, -5766, 47165, -100264, -214920, -160831, -153591, 51934, -65105, 15043, -307414, -315350, -6499, 27762, -122439, -240225, 87717, -239956, -195507, -114671, 65750, -25468, -160727, -344579, 17049, 391757, -92318, 31702, -73991, 16500, -132847, -134168, 64119, 37529, -423999, -178550, -288789, 240815, -274155, 111488, 32988, 484591, -76999, -96545]
18728i6545A98102h1547A61202E8007b7321j63059F5399R6478b32796a8756o9568
18717h8324M1508j71075G9949A8526b1839B33480D749b29555I191J65879c9785
18705a75269a2932j22086H0873f8634j96368O4267j25212a0930j23040e0260C607
18693b9209A82245C9625a57646g6478k92125A33878N052A6355a07555r761p3182
18682a90498h447q7564q1796j49268h7507o0372K821c7485C0487f1316A07234
18670A38808h7997D01191j99975g3655L4005l790j7117a3767E5619h4687j42768
18659b27455B23948a25117A55915h19G925b24255F2501b9875r6021J8677I707
18647f5427j31889H7895b15103b1596G154e224m7716A77016c9051B58277E8779
$$ y = [-96545, 198102, -81547, 161202, 58007, -27321, -190380, 65399, 161877, -232796, -18756, -88324, -46816, -217891, 79949, 18526, -21839, 233480, 4749, -229555, 9191, 175070, -39785, -175269, -12932, -135018, 80873, -68634, -265002, -200735, -325947, -10930, -133970, -50260, 3607, -29209, 182245, 39625, -157646, -76478, -368603, 133878, 138930, 16355, -107555, -117316, -190498, -8447, -96011, -177807, -327075, -87507, -147879, -145058, -37485, 30487, -61316, 107234, 138808, -87997, 401191, 201216, -73655, -39650, -43440, -60557, -13767, 55619, -84687, -227455, 223948, -125117, 155915, -819, 7925, -224255, 62501, -29875, -125896, -107219, 9707, -65427, -197316, 87895, -215103, -21596, 7154, -5224, -52940, 177016, -39051, 258277, 58779]
18635a88537B84880b08731A2552J16518b21751a04622p121j50629l0298a39436
18624c24891A72799F8194a32129p0582O1165j94089a29750D17904A56522C7468
18613A919b4700j23282C0661g9632n1253c0724o5918j52937i3664L7286K7629
18602b8749H1920D719b88456h7303B40056f4498l51434n9172A34471j322a48458
18590B97831d7781f640m5089A04073a59732C84812E7961B6254R759b9600K758
18579b6842m755q4295B9316a15879j1672N4146a040j00856J550L0608K307B24363
18566H5778N0361a5213l87959b0896k99990a45819l444f923l20640R5657K2468
18555b09438e2456A90820f39l06809O0437k1953A55170K09690a5047A27169b67367
$$ y = [-188537, 284880, -208731, 12552, 129070, -221751, -104622, -111743, -262372, -292670, -139436, -324891, 172799, 68194, -132129, -202711, -141546, -335635, -129750, 417904, 156522, 37468, 1919, -24700, -147982, 30661, -79632, -130885, -30724, -96642, -249579, -93664, -56378, -28749, 81920, 4719, -288456, -87303, 240056, -64498, -415932, -475104, 134471, 133149, -148458, 297831, -47781, -6640, -51729, 104073, -159732, 384812, 57961, 26254, 36013, -29600, -26842, -31597, -115892, 29316, -115879, -127551, -73405, -1040, -101896, -100346, -69738, -67431, 224363, 85778, 136139, -15213, -403172, -20896, -320886, -145819, -149263, -6923, -327563, -231906, -209438, -52456, 190820, -639, -307448, -247011, -268964, 155170, 364860, -15047, 127169, -267367]
18543E2484d7566C9100a24969G4671b47023C51732b51008J17594D0646K9393d4103
18531a23067A98698a0415B37303d6704A42313i7281J7591F1173P6042J23145b60582
18519a89544c2497B51328A7715J64377p186D3933b91851H806d949j90612b1559
18507B062J46470c6467l29522B1732b46510A59737E4265N7077i4299j86267H3819
18495a68794J4199E6223f3975j64118a09333d1087H3918b937l2654a4510A6683
18483a93159F5062h1731C78624A02262a22853B8558a88049b9631j8408A4766e0292
18471c246j2175k54710N6006D3739B0773a54515P6115R241A17587P0861a83587
18459A39404b07976I5461J20869c5218A44587B8732a21786H2304M0247b02302
$$ y = [52484, -47566, 39100, -124969, 74671, -247023, 351732, -251008, -133414, 40646, 70039, -44103, -123067, 198698, -10415, 237303, -46704, 142313, -97281, -79690, 61173, 137215, 260360, -260582, -189544, -32497, 251328, 17715, 182092, 174906, 43933, -291851, 8806, -4949, -195561, -21559, 2062, 148532, -36467, -365989, 21732, -246510, 159737, 54265, 111342, -94299, -280566, 83819, -168794, -154595, 56223, -63975, -228093, -109333, -41087, 83918, -2937, -35591, -14510, 16683, -193159, 65062, -81731, 378624, 102262, -122853, 28558, -188049, -29631, -48039, 14766, -50292, -3246, -15421, -270131, -214125, 43739, 20773, -154515, -78400, -69159, 117587, 188448, -183587, 139404, -207976, 95461, 216330, -35218, 144587, 28732, -121786, 82304, 122551, -202302]
18448a21499H1997e929G9582J97235a97161B72581a2005k02740J05011J1073k4619
18437a23280C84248c80250O7059d6698j3680k0187A55373b38240B933h0602A20566
18425b98419J47356O1409I7340f1376n256C2202L24663C0427b98460C0676a3060
18413A57370c37125B24820a34993A41643a22918A91612b64878A81428a20761b90
18402a30412H2880a42105A6062K5191a83131H1302a08682k1531c8657B2460K19527
18391B41987J14814d5255l730D9398L4116j7782K1226d326j4271a810A23244O9713
18379A92957a98219b1224E4316P7858B9066f3227A30412c4283m9246o164B33706
18367C05927A41552c87985a90177R3642E0979a05965j70025o4312G8968b80564
$$ y = [-121499, 81997, -5929, 79582, 276817, -197161, 272581, -12005, -214745, -109734, -98661, -123280, 384248, -380250, -313191, -46698, -60378, -80565, 155373, -238240, 2933, -80602, 120566, -298419, -151063, -89654, 97340, -61376, -66632, 32202, 356865, 30427, -298460, 30676, -13060, 157370, -337125, 224820, -134993, 141643, -122918, 191612, -264878, 181428, -120761, -290, -130412, 82880, -142105, 16062, 41253, -183131, 81302, -108682, -130213, -38657, 22460, 241987, 356801, -45255, -48985, 49398, 83514, 65732, 86958, -4326, -18597, -1810, 123244, 192957, -198219, -21224, 54316, 132174, 29066, -63227, 130412, -34283, -83529, -89693, 233706, 305927, 141552, -387985, -190177, -96535, 50979, -105965, -275990, -340302, 78968, -280564]
18356a02885r6166A28389F0466d55621K15102B92250a50901A06695g9567L0830
18346d8737j81477J1840A76255b95409N8426g7817j93044I7838c07790F7041e9523
18334c74700C23428g8674j21983C26230A41844a7550j98369e9652j27589j56682
18324c43923C0024f8145A62932a46581A69035n2188a24763n0916M8972A12267
18313b12158B6067J36861a73699E5074L35255i6024M5169A7057f5403O220B51444
18301A58569F0775c58040C2144R420a43258B48624d4564j68144M6274A0834b1112
18289A50043K05811I0708b74173O4558N1923j66984e3123J9150A58263C9994b38919
18277F29a31742G5319l657c26569i64j7014j93907R4315k9276P172K0749a2749
$$ y = [-102885, -199051, 128389, 60466, -455621, -240519, 292250, -150901, 106695, -79567, -48737, -230214, -218374, 176255, -295409, -236983, -77817, -270861, 97838, -307790, 67041, -59523, -374700, 323428, -78674, -200657, 326230, 141844, -17550, -215919, -59652, -187241, -343923, 30024, -68145, 162932, -146581, 169035, 116847, -124763, -175679, -126707, 112267, -212158, 26067, 162928, -173699, 55074, 390329, -96024, -50855, 17057, -65403, -59183, 251444, 158569, 60775, -358040, 32144, 41564, -143258, 248624, -44564, -212708, -166434, 10834, -21112, 150043, 355854, 90708, -274173, -209615, -157692, -324676, -53123, -33973, 158263, 39994, -238919, 629, -131742, 75319, 71662, -326569, -964, -17978, -211885, -117570, -146846, -139674, -118925, -12749]
18264c41614i5192I6318N0448a76043n0640H7459a33633j17569O1269B75131j11607
18253A63524c48323C40091d7158H9302h938k23136A09696E195f4797q0122J7102
18242a27817n0213A77651f7297k25764g9369B25352b41436K1731B1209c44960
18231a48195E4160a61225P1165n2580k8813L9280N7031B4163j1695K79744a48376
18219B33769D8630a58947B62798F8010h6081C5817b04797M7520g2716k08805R8698
18208a82823e1873j08628B40727a62193L0001n143q3103B22648a32345A55334
18197a3715l2344j86031B33788J38532C767b48742a21137B10906A5704L71273
18187C86977a81613R192g6401f666E0557J9571a70171G0278L53097c07472A59376
$$ y = [-341614, -95192, 96318, 146766, -176043, -226683, 87459, -133633, -251202, -189933, 275131, 163524, -348323, 340091, -47158, 89302, -8938, -232074, 109696, 5195, -64797, -144919, -127817, -178030, 177651, -67297, -293061, -79369, 225352, -241436, -219705, 21209, -344960, -148195, 54160, -161225, -90060, -142640, -171453, -132173, -75142, 24163, 12468, 292212, -148376, 233769, 48630, -158947, 262798, 68010, -86081, 35817, -204797, -157277, -72716, -281521, -182823, -51873, -160501, 240727, -162193, -132192, -137335, -220438, 222648, -132345, 155334, -13715, -46059, -232090, 233788, 372320, 3767, -248742, -121137, 210906, 15704, 386977, -181613, -172421, -76401, -6666, 50557, 70128, -170171, 70278, 423375, -307472, 159376]
18175D7215c39045P6457F6012A9366b2910C52980h1157K8440o963B21214c9302
18163a92002e6693F9209l2145h0897D7460b33072N3706n1159a8832k96923m7624
18152c63379a18341L6869B96638b22329C47924b4430A93840G1068g2409D65930
18141c1432F7075g0937a3697C3738b58378J7535r279F9997a3167k15458E7866
18129b49000A34982J04725A16873b59092N6455B1336g8057A12572M1798b20814
18118a80185e6636A25981b68738P5093e9490H062d4065k04893a06426d4118j55957
18107b00075e3961B00949L2809f4227k1655j744G7596Q6021B2650Q9447K16384
18096C28481H4322a71135b2389k68977H6331h2397G5658Q3889b14468P2102k0189
$$ y = [47215, -339045, -262588, 66012, 19366, -22910, 352980, -81157, -52717, -59680, 221214, -39302, -192002, -56693, 69209, 37064, -80897, 47460, -233072, -179366, -230525, -18832, -315755, -363379, -118341, -81472, 296638, -222329, 347924, -24430, 193840, 71068, -72409, 465930, -31432, 67075, -70937, -13697, 33738, -258378, -240843, -250122, 69997, -13167, -228625, 57866, -249000, 134982, 239707, 116873, -259092, -202637, 21336, -78057, 112572, 154370, -220814, -180185, -56636, 125981, -268738, -193645, -59490, 8062, -44065, -248958, -106426, -44118, -200075, -53961, 200949, 233758, -64227, -85882, -87626, 77596, 163617, 22650, 112097, 328481, 84322, -171135, -22389, -291366, 86331, -82397, 75658, 159547, -214468, -142366, -162555]
18085a62555B58239b25793M1539a4634k07151j4205e549H1628d54758h0256k47540
18074c27796A55796i100B5122c0939A62252a82798d432H4414b35791g5300K2792
18063e2508j01890B84700a6290j49550B73747f9036m2593C01709I9821e8107F3317
18051A442d2143A96704H7882a09323j18699B0097c8293C42787D8152j8186N4692
18040H4658a43699n8705H6992a50341j73603a12485m7236B1835J09598J79705
18030C11138a23187a7348J666A02265D235a47760D7483O4773b00765A37419b77748
18018F8203a06494a8139I2653J50415C5172a32154j50662d7898A15278d0696C76258
18006b3923E2915N9240l9736J60579b30425a04021M1780I2499J81457G9248R8465
$$ y = [-162555, 258239, -225793, -184254, -14634, -221785, -235990, -5549, 81628, -454758, -80256, -327796, 155796, -9100, 25122, -30939, 162252, -182798, -4432, 84414, -235791, -75300, -52508, -154398, 284700, -16290, -165840, 273747, -69036, -111629, 301709, 99821, -58107, 63317, 1442, -42143, 196704, 87882, -109323, -228022, 20097, -38293, 342787, 48152, 29966, 84658, -143699, -202404, 86992, -150341, -323944, -112485, -159721, 21835, 131433, 311138, -123187, -17348, -15682, 102265, 4235, -147760, 47483, 112256, -200765, 137419, -277748, 68203, -106494, -18139, 92653, 243068, 35172, -132154, -282816, -47898, 115278, -40696, 376258, -23923, 52915, 112155, 72419, 232998, -230425, -104021, -62241, 92499, 273956, 79248, 177713]
17995A77713a32243m5088h4407D0837N2013N3811k3947a57349J9471A57798G785
17983f2615n8830j71518D53059F5944b30690A54136f4696p4349A12625E4283J30207
17972A84490D1402f5828o7316A37879f6824j99231B36789a61780P0821P030j00357
17961a84286A2474K55396B7940f9915C4554f7067j70131q6400B53374a90332K295
17950a88037i381m4249A93671o8138c04453j05502L5988e135A42616C6956R0006
17939A26962a636p463k03367L5625A21397Q480l375k7599K4561a13674F7694P8516
17927A46210K6362G7978J63012C1908h0593q1553A65978a99038j17044a25660
17916a81398A22877D7279k1904j1007J65830a38824G3545f5080L0242j97128o4461
$$ y = [177713, -132243, -177331, -84407, 40837, 92850, 146661, 122714, -157349, -137878, 157798, 7785, -62615, -121445, -292963, 453059, 65944, -230690, 154136, -64696, -139045, 112625, 54283, 184490, 41402, -65828, -133144, 137879, -66824, -266055, 236789, -161780, -90959, -83929, -184286, 12474, 267870, 27940, -69915, 34554, -67067, -237198, -323598, 253374, -190332, -188037, -9381, -53630, 193671, 125533, -304453, -409955, -373967, -5135, 142616, 36956, 126962, -1636, -9099, -212466, -176841, 121397, 129877, 126502, 98903, 123464, -113674, 67694, 146210, 172572, 77978, 240990, 31908, -80593, -162146, 165978, -199038, -316082, -125660, -181398, 122877, 47279, 25375, 14368, 180198, -138824, 73545, -65080, -34838, -231966, -296427]
17905b96427P3251P9458C59799D545F2L5352b27455B116b27548q016J03319c7457
17892b04492p5323B44482b6449r9500j1300A02264a21913C6201g6903k28173A3349
17880c9967j78977A56314b22749F2767l062J09557c8436B3195N3505k4411J86334
17869B38623f0675j10354P7067M6048k6434k76594d7275r0467M4823L1168A4653
17857A62723b0271I2433i5914j40176M6949J4442P6961B68059a8610k86731A47678
17845d1546j43440G8516b0519m2986A02831e8100F4594a2030E66964b98150c9330
17833F0668a53534e256j33029N4033I7953b99625A27693A7212i7550r7418A14917
17821b08677i0280A9569K75651A9037a18361C611b81632a21552M9547j53652J10567
$$ y = [-296427, -223176, -143718, 359799, 4545, 62, 35414, -227455, 2116, -227548, -235564, -132245, -37457, -204492, -279815, 244482, -26449, -125949, -137249, 102264, -121913, 36201, -76903, -305076, 13349, -39967, -218944, 156314, -222749, 62767, 59705, 169262, -38436, 23195, 76700, 52289, 238623, -60675, -171029, -93962, -47914, -74348, -350942, -47275, -137742, -92919, -61751, 14653, 162723, -20271, 92433, -95914, -236090, -189141, -174699, -97738, 268059, -18610, -305341, 147678, -41546, -184986, 78516, -20519, -63505, 102831, -58100, 64594, -12030, 566964, -298150, -39330, 60668, -153534, -5256, -138285, -84252, 97953, -299625, 127693, 17212, -97550, -194968, 114917, -208677, -90280, 19569, 295220, 19037, -118361, 3611, -281632, -121552, -72005, -225657, -115090]
17810a15090B84926B5388J69805n9750a80100A53646B0780f1943j63996I8360
17799b31342H6984i7578A12975a58922G4957d7500j68954a06668E078a69897P2940
17788i6957a4340C8714J73977p3186n141f2438l6303K1526n5944n9367D56995
17776C31206d7573E9708P3510m6956l006R0522f0261j48698D28106h4814M822
17765g9992k069l2372d7600B78168A38299d9189g81o3556n2209i782C25464d3274
17752a55493A61027a5713j44664A57844b06028A212O9893b851j61450b312j59561
17741a61873A79744J26002j22097H4072J05534J71622b09314A6930J4824a11320
17730B25468g2068o4915B97085g0132H7798a65396C08592i8870b3035j60420D32905
$$ y = [-115090, 284926, 25388, 195193, 135443, -180100, 153646, 20780, -61943, -225939, 98360, -231342, 86984, -97578, 112975, -158922, 74957, -47500, -216454, -106668, 5078, -169897, -96957, -14340, 38714, 212691, 139505, 134364, -62438, -98741, -77215, -133159, -192526, 456995, 331206, -47573, 59708, 133218, 86262, 83256, 173778, -60261, -208959, 428106, -84814, -79992, -82061, -114433, -47600, 278168, 138299, -49189, -781, -64337, -116546, -9782, 325464, -43274, -155493, 161027, -15713, -160377, 157844, -206028, 1212, 71105, -2851, -164301, -2312, -161873, 179744, 305746, 183649, 84072, 189606, 361228, -209314, 16930, 31754, -111320, 225468, -72068, -136983, 297085, -70132, 87798, -165396, 308592, -98870, -23035, -183455, 432905]
17718f6689I348J51056E9517b3852l5079B5145J82510a49892A9205K00425a08277
17706b19033I1978a26359N2299j5902k24657j07039f7367j59532A63912M8819
17696B12731a69741m3845A51210c10165g910p7767c6704j56117a9675A82600b04248
17684b16273F5122a45119f1288B18091a67699B70264g6817r7904A57426K4563
17674A81989a05019A37259c03423B98492b679A29151g4223m31612B53916D9071
17663b61591A52132h0953b0129A02989J8128L6013a34119j1260D7166b17237A79430
17651g6894c0477A62506J0870c08370a7357A59328a56423H1351a1349C6761b1029
17639G6965f3716D2993a33812C7917d854B54511b69015C02701a8882P817B09047
$$ y = [-66689, 9348, 160404, 59517, -23852, -58931, 25145, 207655, -149892, 19205, 219630, -108277, -219033, 91978, -126359, -74060, -89962, -314619, -421658, -67367, -226899, 163912, 212731, -169741, -213586, 151210, -310165, -7910, -85677, -36704, -192821, -19675, 182600, -204248, -216273, 65122, -145119, -61288, 218091, -167699, 270264, -76817, -174721, 157426, 181989, -105019, 137259, -303423, 298492, -2679, 129151, -74223, -505835, 253916, 49071, -261591, 152132, -80953, -20129, 102989, 121117, 157130, -134119, -145379, 47166, -217237, 179430, -76894, -30477, 162506, 173376, -308370, -17357, 159328, -156423, 81351, -11349, 36761, -21029, 76965, -63716, 42993, -133812, 37917, -4854, 254511, -269015, 302701, -18882, -11065, 209047]
17627b18204B80285E4393K41053d0610C9592i6627J9171b4831l33627b9226q6726
17616a15952B94474D3652a60529M3841E57322a41073C36067a67955A07574J22046
17606B29620B903a16129k12805A96223G2715J70122B8864n855r907J29982K2180
17595A65264a88447A68387f9607p1889f5964B0237Q139K6381b72493A76586l8923
17584A37663a3323j94438g4688k04561C62993d5376B67312r6029d2848F5708g6791
17572A73684b19391a4838j23722E0618a19498A67833A7594h3671j80450E8456
17561a02409a5565H255K24000k4840a96154C6603a27616b4488C36334n5682K23039
17550E03691A13628j2118c71112e5633B09776R2267b13596Q7b2766k0384G2481
$$ y = [-218204, 280285, 54393, 295446, -40610, 39592, -96627, -77456, -24831, -358458, -29226, -115952, 294474, 43652, -160529, -116688, 557322, -141073, 336067, -167955, 107574, 229620, 2903, -116129, -328934, 196223, 72715, 242837, 28864, 23009, 13102, 143084, 165264, -188447, 168387, -69607, -141496, -65964, 20237, 28376, 54757, -272493, 176586, 137663, -13323, -207761, -74688, -279249, 362993, -45376, 267312, 171283, -42848, 65708, -76791, 173684, -219391, -14838, -138560, 50618, -119498, 167833, 17594, -83671, -264121, 58456, -102409, -15565, 8255, 232255, 207415, -196154, 36603, -127616, -24488, 336334, 280652, 503691, 113628, 101510, -371112, -55633, 209776, 302043, -213596, -213509, -22766, -43150, 72481]
17538f6710A14283a33891B26459J48209A25655E7057a10647A3670L3258a86824
17527F0423b14467B41667c36326A44238C8281f0053m0393A3417J21991J54610
17517B90018c12991Q0861G6622c3223j76947B89663A19207k6364Q1604c6188G7808
17505D8416a10104C49514j70227e0762A84321M7253m8690f4747l7214C47453f8409
17493f4170j44136c7169J6214A04272C8169K92034Q726D9657f3655A91510f6084
17481B74005f8664A74514q5312a30716A66944m1770e4879A29473R8186J06439
17471C34098q4656i7382A21765K50429B4875J83991a82648B77709n6272Q8811
17461C10248q4373A01115f1787B19123a29853C53008A60752K1273J8770J14478
$$ y = [-66710, 114283, -133891, 226459, 374668, 125655, 57057, -110647, 13670, 46928, -186824, 60423, -214467, 241667, -336326, 144238, 38281, -60053, -100446, 13417, 135408, 290018, -312991, -232130, 76622, -33223, -210170, 289663, 119207, 92843, 174447, -36188, 77808, 48416, -110104, 349514, 179287, -50762, 184321, 231574, 182884, -64747, -101961, 347453, -68409, -64170, -208306, -37169, -20955, 104272, 38169, 330203, 338929, 49657, -63655, 191510, -66084, 274005, -68664, 174514, 89202, -130716, 166944, 125174, -54879, 129473, 227659, 334098, 249442, -97382, 121765, 372194, 24875, 208866, -182648, 277709, 221437, 310248, 225875, 101115, -61787, 219123, -129853, 353008, 160752, 182025, 200795, 315273]
17451C15273l9870K92031B82907m8335R8588j26364A6180a62597C15548N6913
17441C72461p6518K2028N6238q1734k5718b4488D5364K51966N3400J53471A5100
17429B88726F0732J44145K09120B01539J30823b11522A78870Q3196K31132E7947
17418B17277o7660m7540K65222l4828j56852K00730A31303K5460a86735A70475
17407B09732D6366J95236K0843p1216K421n2231J1255j8593R189m1294K71261
17396C73237H3855m0274R1975J42967q3895q9882a93672H6561K97869a70009F1245
17384A2749L44922H7680M17580j23869R4441D7029K08588A25743P0901J41386
17374C38030D0379K4858K84990N872D3729J87615a1330A13108M17115A87168d8094
$$ y = [315273, 275403, 567434, 282907, 234572, 333160, 206796, 16180, -162597, 315548, 372461, 295943, 317971, 374209, 292475, 266757, -24488, 45364, 297330, 350730, 504201, 15100, 288726, 60732, 204877, 413997, 201539, 332362, -211522, 178870, 262066, 493198, 57947, 217277, 149617, 102077, 367299, 332471, 175619, 376349, 131303, 156763, -186735, 170475, 209732, 46366, 241602, 262445, 191229, 193650, 141419, 152674, 134081, 143270, 101976, 373237, 83855, 43581, 135556, 278523, 194628, 104746, -193672, 86561, 384430, -170009, 61245, 12749, 357671, 87680, 505260, 381391, 475832, 47029, 255617, 125743, 196644, 338030, 40379, 65237, 350227, 356099, 43729, 231344, -11330, 113108, 530223, 187168, -48094]
17362B87941e9793A52741Q616J4321m6931f6779I3377b2521E39920H2537b25580
17350a45302F690J20626F3303J96168j1312A1573J11079P3798G4385K62514j18236
17339B18663p4404a11618A83585L3061P5943f2661H933L21436E4922J71085K07420
17328D33427q8309c084A78260F8908h9047B38927j05447R2232a15929N7202C7446
17316A13130D3993F226b56712A67404g1860D8911J56183L7109P254j14074L16003
17305D51386E2686A5276L4740J57491J98222a865B07607J85562A28141l6057m999
17294H7085K95566A78552P7182j23222K19896j29959J96538p9948n1075H5135
17283a52737N3690H0704K04467n4682n794B9106a46460B10890a52210C67041A06336
$$ y = [287941, -59793, 152741, 161357, 175678, 128747, -66779, 93377, -22521, 539920, 82537, -225580, -145302, 6690, 127316, 63303, 259471, 248159, 11573, 122652, 196450, 74385, 336899, 218663, 144259, -111618, 183585, 216646, 292589, -62661, 8933, 330369, 54922, 226007, 433427, 345118, -3084, 178260, 68908, -89047, 238927, 133480, 225712, -115929, -58727, 37446, 113130, 43993, 6226, -256712, 167404, -71860, 48911, 205094, 242203, 249457, 135383, 451386, 52686, 15276, 50016, 207507, 405729, -1865, 207607, 393169, 128141, 92084, 87085, 382651, 178552, 255734, 132512, 352408, 222449, 418987, 339039, 287964, 85135, -152737, -99047, 80704, 285171, 230489, 224695, 29106, -146460, 210890, -152210, 367041, 106336]
17271A78934p6932K99702A70366J13133A03975a17475A94961Q8567h084E79328
17260A25744J34740O8630g682E68589B79499A7432M08544a95522C06129k8959
17250B77170g7330A5790l0L42846F9993C4961M57750A35689K70744j60414o4801
17239A81218p6092K63992K8151g2413A63914i7312C49728l9909H7007a71393B03972
17227A09354R4228a989C07885P4403l8558j04147l4068m4024O5117b1274m5239
17216f6513A70141a54995A1679K56454J3723A15407m5321A9137M68030B32123
17205E76254C7349O7213g2710C66131A7714L25433D3184M64325a00648B33661
17194B34683L55432k00918A35128J26710J44965k02363A6986K34441l6899n2269
$$ y = [178934, 102002, 401704, 170366, 283499, 103975, -117475, 194961, 283528, -8084, 579328, 125744, 260484, 329114, -7682, 568589, 279499, 17432, 425976, -195522, 306129, 277170, -77330, 15790, 15760, 358606, 69993, 34961, 492711, 135689, 406433, 246019, 181218, 105126, 369118, 397269, -72413, 163914, -97312, 349728, 309819, 87007, -171393, 203972, 109354, 203582, -1989, 307885, 382288, 343730, 239583, 205515, 161491, 226608, -21274, -66513, 170141, -154995, 11679, 268133, 281856, 115407, 70086, 19137, 487167, 232123, 576254, 37349, 104562, -72710, 366131, 17714, 343147, 43184, 507509, -100648, 233661, 234683, 590115, 389197, 135128, 261838, 406803, 204440, 16986, 251427, 214528, 162259]
17184A62259J80000j70838l9337J24125J47779j76228F2968N2795J68746b5898
17173A97432R1755J07640j7820K9095A95278L51911B54703q7160K20451A55215
17162C51834Q6537k07992I5428L60349j42487N7520j30388L14463j85532J42852
17152E12205m0055B04992L46602j52694J92006j10958a424E90888B59312K77382
17142E36694k00138Q7779j90377J42825l1577C1409g4758B55399B426M70879A95283
17130C04742N46316B60773K91075k55225A10776L72667B21808J4038L43188q1919
17120D97115k16773J90955P0285j43114J38420k54825L4154M0655j19383l5936
17110B01553J95894m4483A71131K45926P8203k41098r3472L31326p776l4237A77794
$$ y = [162259, 342259, 171421, 132084, 256209, 403988, 227760, 62968, 115763, 284509, -25898, 197432, 289187, 396827, 379007, 408102, 195278, 547189, 254703, 167543, 387994, 155215, 351834, 438371, 230379, 95428, 455777, 313290, 370810, 240422, 554885, 369353, 512205, 472150, 204992, 551594, 398900, 590906, 479948, -1424, 590888, 259312, 536694, 336556, 424335, 233958, 376783, 345206, 31409, -74758, 255399, 2426, 473305, 195283, 304742, 851058, 260773, 551848, 296623, 110776, 483443, 221808, 235846, 579034, 497115, 280342, 471297, 541582, 398468, 536888, 282063, 316217, 356872, 237489, 201553, 397447, 352964, 171131, 417057, 495260, 254162, 160690, 492016, 484240, 450003, 177794]
17098G58686l05937K06234o0920P77A93566L56104O3382B21226J61450r3931J66064
17087D54809K97095k63293B03813R900N45369B74330p1188L98014o2937B12848
17076C91984M27705l02049A90608P4323p6378K12885J06660A26736K03928J86053
17066E16717j12128J17900q0430P578P7354K8915P1440Q2765k78680R184p9707
17055C60908Q1980J10091J9595j27944R5747j53611M70966r9857j6664j69722
17045E71489m5528j33251K01023j27720J36880j26979j2482L9938M2473R1703
17035F37546j27768m1614K50240n8307p2273K62790J03555m56337q258J98662
17025F88236B45641L49419m6967K83349j96323p0775K27979r5654k08226K27950
$$ y = [758686, 452749, 658983, 598063, 598840, 193566, 549670, 613052, 221226, 382676, 288745, 454809, 751904, 488611, 203813, 213713, 759082, 274330, 203142, 601156, 538219, 212848, 391984, 819689, 517640, 190608, 264931, 188553, 401438, 508098, 126736, 330664, 516717, 404589, 522489, 442059, 449637, 526991, 555906, 627346, 710111, 431431, 440615, 360908, 442888, 552979, 572574, 444630, 540377, 386766, 857732, 757875, 741211, 571489, 525961, 392710, 593733, 466013, 602893, 475914, 463432, 503370, 545843, 637546, 509778, 468164, 718404, 660097, 587824, 850614, 954169, 497832, 489574, 688236, 245641, 595060, 548093, 831442, 635119, 564344, 792323, 696669, 488443, 716393]
17015G16393j80954M55610l28630m4803L15233k15840n8643P9116R0109j26767
17005G00824M3008m8718J96099q5506j56166l17231L86062j6974J36158L5414
16995H72970j30451J714J01373q2257j97968o1869L15331J28362l9658l9861q0170
16984G87516o4526p3312O4468L73299k25987j44770L51645L5807J640q6536q895
16973A010349k04284L40769k29218k14607K47332o6216q4267K80116p0920j99283
16963H09771M02312j83981K22292k53701P0621n5041k23319J34070j22442j0151
16953G90431J43367K18040J03092o2313k85677L45615J46174J3013o34252O16976
16943A394466l318k81706m16776P46683l69079L19566j3050q8702l78116L07888
$$ y = [716393, 535439, 991049, 662419, 617616, 932849, 717009, 658366, 737482, 827591, 700824, 743832, 695114, 891213, 805707, 649541, 332310, 718372, 701398, 837556, 872970, 742519, 744233, 845606, 763349, 565381, 503512, 818843, 947205, 907547, 867686, 787516, 722990, 649678, 714146, 1087445, 861458, 716688, 1068333, 1104140, 1105780, 1019244, 1010349, 806065, 1146834, 917616, 703009, 950341, 884125, 799858, 1079974, 1009054, 809771, 1212083, 1028102, 1250394, 996693, 1067314, 1012273, 788954, 923024, 800582, 790431, 933798, 1151838, 1254930, 1192617, 906940, 1252555, 1398729, 1411742, 777490, 1394466, 1391148, 1109442, 692666, 1439349, 1070270, 1389836, 1376786, 1288084, 909968, 1217856]
16933A217856j10819j12592M32053Q1957m25532P8138J64927m1334K76268m13384
16923A147538J78915j07405K01258K70602n03352J93838L4136n1192K96495l21221
16913A339612M16916n97351Q70077o23228K16415K59298k23745j98508L34091
16904A793577N5002J3767p2053J69620j45504j53244N02513m68688J3762J36768
16894A845520J35346k86576L60049j35463j24648L93106j43479K9889J19036j84631
16884B008149Q2473J55164n44916L52856r6173M98279n8439k92683L23470k48975
16874B179205M75427j02747l04153J40955L54837j85260Q5097k94058J92942j45206
16864B397039L73113M16295l02788m5609k10779J05761O5635R4545K94134n423
$$ y = [1217856, 1107037, 994445, 1426498, 1508455, 1082923, 1161061, 1325988, 1284654, 1560922, 1147538, 1326453, 1219048, 1420306, 1690908, 1187556, 1381394, 1415530, 1364338, 1660833, 1339612, 1756528, 1159177, 2029254, 1406026, 1622441, 1881739, 1657994, 1459486, 1793577, 1848579, 1862346, 1790293, 1959913, 1814409, 1661165, 2163678, 1694990, 1708752, 1845520, 1980866, 1694290, 2054339, 1918876, 1794228, 2187334, 2043855, 2073744, 2192780, 2008149, 2090622, 2245786, 1700870, 2053726, 1957553, 2455832, 2397393, 2104710, 2428180, 2179205, 2654632, 2551885, 2247732, 2388687, 2743524, 2558264, 2643361, 2349303, 2542245, 2397039, 2770152, 3186447, 2883659, 2838050, 2627271, 2733032, 2798667, 2893212, 3187346, 3181923]
16854C181923k47554J95799K7254Q0889o8342R9479K7250n5212O9212N00636k29879
16843C581455j13990J91128J04628m3000O3630M54096o67588N18997p3918J16407
16833D131845L30547k25417j63967M15632J74936l43336M10295N4115Q8643Q8746
16823D962039n6836J6240K31491K91898K500L42039j79568K96471L6457J72090
16813F114821J66625J1136k1382M31946j04113K0996M28536L19631j90641L6094
16803G213649K41854N66461k20695L80387j775O06186j90428N97878J8116j7098
16793I194535M03144J76263M5396M02774O78575j83436M14081L29321M63035K51811
16783A2175499J28655N58411K56408M66944O20389J33617K57276L88654M38596
$$ y = [3181923, 2934369, 3130168, 3157422, 3238311, 3169969, 3269448, 3296698, 3241486, 3310698, 3811334, 3581455, 3467465, 3658593, 3763221, 3720221, 3783851, 4237947, 3570359, 4089356, 4015438, 4131845, 4462392, 4236975, 4073008, 4488640, 4663576, 4320240, 4730535, 4784650, 4873293, 4962039, 4905203, 4921443, 5152934, 5444832, 5447332, 5789371, 5609803, 5906274, 5942731, 6114821, 6281446, 6292582, 6271200, 6703146, 6599033, 6620029, 7048565, 7368196, 7177555, 7213649, 7455503, 8021964, 7801269, 8181656, 8179881, 8786067, 8595639, 9193517, 9211633, 9194535, 9597679, 9773942, 9819338, 10222112, 10900687, 10717251, 11131332, 11460653, 11923688, 12175499, 12304154, 12862565, 13118973, 13585917, 14206306, 14339923, 14597199, 14985853, 15424449]
16774A5424449Q06816M80554M14295N97571O36313O01211P18333P83403M35833
16765B0898778P93384Q07845Q14379J062056Q45078J095145R06337J156501J270521
16756B9650024J330007J290701J241673J423144J619478J509973K142748J680405
16748D1888153J918999K235595K376606K475582K351330K990006K809698L422270
16740F2468239K866300M153658L264988L896136M393386M668390M755874N090821
16732I5557792N120262N666376N594544N795444O185383O175084O050681N988332
16724A42133898O081289N346723N113206M623144M096263L267115J986183J412175
16716A74059996K69851r51514j673894k693003l589294m389955n001870m923785
$$ y = [15424449, 16231265, 16711819, 17126114, 17723685, 18359998, 18961209, 19679542, 20462945, 20898778, 21692162, 22500007, 23314386, 24376442, 25221520, 26316665, 27223002, 28379503, 29650024, 30980031, 32270732, 33512405, 34935549, 36555027, 38065000, 40207748, 41888153, 43807152, 46042747, 48419353, 50894935, 53246265, 56236271, 59045969, 62468239, 65334539, 69488197, 72753185, 76649321, 81042707, 85711097, 90466971, 95557792, 100678054, 106344430, 111938974, 117734418, 123919801, 130094885, 136145566, 142133898, 148215187, 153561910, 158675116, 163298260, 167394523, 170661638, 172647821, 174059996, 174329847, 173378333, 171704439, 169011436, 165422142, 161032187, 156030317, 151106532]
16708A51106532o417715o059750o341356o144208o290593o492207n672975n903011
16700A01784717n691968n139969n012430m666741m205833m404060l872471m281589
16692F4509656l042138l090047l050460l110762k565147k479785k614759j709278
16684D2847280k388931j982634j524677j961329j050746j628424j841123j318581
16676B9150835p10629j467726p87656j083762j424152o99977r97516p73535p90909
16667B0414973q38884m43594q97921l76850o48818j052539k25006n42609n86105
16658A4802647l36407o06213l18927k29877p73153k01385o22590j29414k63738
16649A1320943m65997l22187q1448k34857l16781l96524l3607q06903J7811Q3835
$$ y = [151106532, 144688817, 138629067, 132287711, 126143503, 119852910, 113360703, 107687728, 101784717, 96092749, 90952780, 85940350, 81273609, 77067776, 72663716, 68791245, 64509656, 61467518, 58377471, 55327011, 52216249, 49651102, 47171317, 44556558, 42847280, 40458349, 38475715, 36951038, 34989709, 33938963, 32310539, 30469416, 29150835, 28440206, 26972480, 26184824, 25101062, 23676910, 22976933, 21979417, 21205882, 20414973, 19576089, 19132495, 18234574, 17857724, 17208906, 16156367, 15931361, 15388752, 14802647, 14466240, 13860027, 13541100, 13311223, 12538070, 12336685, 11714095, 11584681, 11320943, 10854946, 10532759, 10451311, 10216454, 9899673, 9503149, 9469542, 8662639, 8680450, 8764285]
16639H764285j24434m58916m16937k2470l85498L17576j80042k83941l15451j24040
16629F770132l78286m2523l36176K26278k40045j43672p0359k07788k19712J89289
16619E547138q5768m40257p7106k29380K82900n9683j97281Q3264m07563q4983
16609D331281M950P6418m32697N4676m7179l10790L48505l99215K01978k53193
16599C574734j64622K31226j18011J72416n51317L91644k07567k85687k65030
16590B777786M59312j80059l7469j1080j71629n851j47643J25749N9903l85669
16580B483350R4602m7759J2678O8370k47571J41933l09359P0877k30861M86046
16570B522306m55046j77199L84284j40235j56631j30914K57624o7767J58633m0112
$$ y = [8764285, 8639851, 8180935, 7763998, 7741528, 7356030, 7673606, 7493564, 7209623, 6894172, 6770132, 6391846, 6349323, 6013147, 6239425, 5999380, 5855708, 5785349, 5577561, 5357849, 5547138, 5461370, 5021113, 4944007, 4714627, 4997527, 4937844, 4740563, 4823827, 4416264, 4331281, 4336231, 4412649, 3979952, 4034628, 3987449, 3676659, 4025164, 3625949, 3827927, 3574734, 3410112, 3641338, 3523327, 3695743, 3144426, 3536070, 3328503, 3042816, 2777786, 3237098, 3057039, 3019570, 3008490, 2836861, 2831010, 2683367, 2809116, 2869019, 2483350, 2577952, 2530193, 2542871, 2611241, 2363670, 2505603, 2196244, 2267121, 2036260, 2522306, 2067260, 1890061, 2274345, 2134110, 1977479, 1846565, 2104189, 2036422, 2195055, 2154943]
16560B154943m53219J10317q6509J19888j49673J13230j09437P5865l3244Q6159
16550A828320j78835J82126j59909M0844n4631q326r4410K8875K16815l50140
16540A450729q0695R4073P1761L136j41176o1069J18460j67852l7056P8600k99706
16529A029205M55492m90028N23536l02331k6125R695L21891k25591m13575M48469
16519A330638k78638O9527l0191J34828J61880m22441K46574j09079L2958j23461
16509A012595R6091k72317K96202Q8172j19925k76598P3392J90920m04506K74298
16499I58324J13351K4164l05079J27744K76246k14117k9462j55654K5584J39162
16489I60263j61836K48514o108j16674k7855m1529j75762J98503j66632L6020
$$ y = [2154943, 1701724, 1812041, 1725532, 1845420, 1695747, 1808977, 1699540, 1775405, 1742161, 1828320, 1649485, 1831611, 1671702, 1712546, 1657915, 1649589, 1555179, 1584054, 1800869, 1450729, 1370034, 1464107, 1535868, 1539004, 1397828, 1336759, 1455219, 1287367, 1250311, 1328911, 1029205, 1484697, 994669, 1518205, 1215874, 1189749, 1199444, 1521335, 1295744, 882169, 1330638, 1052000, 1121527, 1091336, 1226164, 1388044, 965603, 1212177, 1103098, 1136056, 1012595, 1108686, 836369, 1132571, 1220743, 1100818, 824220, 897612, 1088532, 684026, 958324, 1071675, 1095839, 790760, 918504, 1194750, 980633, 951171, 795517, 821101, 960263, 798427, 1046941, 1040833, 924159, 896304, 854775, 679013, 877516, 710884, 746904]
16479G46904K23310m03749K24301n6201l5095m045l46654K34054j37709K47928
16469F93044k9869J58336l27469J88595m4218j06567J13901J05173j35060O2681
16459F78547j04594L50394D19311L61014J0698N045K39447D05607N9723L06278
16449G71608l01662M7524r7679O8289J18962j59419K8132k12898L73436k19910
16439D16383o4169M60052k20225r2437B40305K99520J08619r4919M4077n9038
16429E38564A45153J43453M65988k14830k11852K07614A22644J50321J3684k4300
16419B62349K4641L34124k6112B61691m5551L00060n5916l875k14193J73439K96488
16408G12143k81744P6513k7787l6711r8297A32684J67253j30110R7912o0750N04479
$$ y = [746904, 970214, 566465, 790766, 734565, 699470, 695425, 348771, 582825, 445116, 693044, 663175, 821511, 494042, 682637, 638419, 531852, 645753, 750926, 615866, 678547, 573953, 924347, 419311, 780325, 791023, 796068, 1035515, 405607, 465330, 771608, 469946, 517470, 419791, 488080, 607042, 447623, 475755, 262857, 636293, 416383, 352214, 812266, 592041, 499604, 240305, 539825, 648444, 553525, 597602, 538564, 145153, 288606, 754594, 539764, 327912, 535526, 122644, 272965, 286649, 262349, 286990, 621114, 595002, 261691, 216140, 516200, 460284, 456409, 242216, 415655, 712143, 430399, 506912, 479125, 442414, 344117, 132684, 299937, 169827, 267739, 206989, 711468]
16397G11468B02120J69439j58769K64746R1023B76423R7760J44813k32976p0579
16387B15441O0191R2242J3483J45425j90985p5339P9821Q7298O041j24819o7653
16376B41146n6674M04885B43370L1587n6877M2278L7930H168Q6640L84904k27237
16365B52475O9903j4508J21428K2780o8806J6755A42265K02412j10432b774A40832
16353C24356J09096j65109J80012J41238k40285o6491K6681q5841L5689F9130
16342C41893q1205j8451c4728C40883j67445p5900I503a19172I5847M08600C7730
16330A46947C4122n086L43510j24884H0743j3011P5405B8029L4121J09479e056
16318A1904K74436m7720F6128L6929o370N5807a25248A33413J05319M4190p7944
$$ y = [711468, 202120, 371559, 212790, 477536, 568559, 276423, 374183, 518996, 286020, 215441, 275632, 367874, 381357, 526782, 335797, 260458, 340279, 427577, 433618, 308799, 241146, 184472, 589357, 243370, 274957, 218080, 260358, 298288, 8168, 94808, 479712, 252475, 322378, 307870, 429298, 452078, 383272, 400027, 142265, 344677, 234245, -2774, 140832, 324356, 433452, 268343, 448355, 589593, 349308, 282817, 309498, 223657, 259346, 69130, 341893, 260688, 242237, -34728, 340883, 173438, 97538, 9503, -119172, 95847, 504447, 37730, 146947, 34122, 29036, 372546, 247662, 80743, 67732, 143137, 28029, 62150, 171629, -5056, 11904, 286340, 238620, 66128, 103057, 96687, 152494, -125248, 133413, 238732, 282922, 204978]
16307B04978J46003p8624q4617D7903J09018J35827E2350E523K08659O4199M6231
16296C24612j16269m9520F6906J74203P4311j29320K076a18616C47589j29239
16286B18350j07462m3907a73129C66085A79431P1436B880L55051J00596c1015
16275A25684K8115F991A744K32179C5594L01945c9494E0521J71126K59267D8078
16263C31283j38122H6358L46814C7493M064N4028k9229d591D5483K59987j40672
16252A64798E6792J43699a67B82302j34294b68461c7656A56921E7659J72145g0540
16240A74904d6899j89636Q7802A53701m0674J26598a0134l11702F6932j5031P4227
16229A26128F1640J76950I2005J92625C480c9606E14246i297C14770A0751J97784
$$ y = [204978, 350981, 272357, 187740, 47903, 156921, 292748, 52350, 5523, 214182, 278381, 324612, 208343, 158823, 66906, 241109, 315420, 186100, 188176, -118616, 347589, 218350, 110888, 66981, -173129, 366085, 179431, 250867, 2880, 357931, 458527, -31015, 125684, 153799, 6991, 1744, 233923, 35594, 337539, -39494, 50521, 221647, 480914, 48078, 331283, 193161, 86358, 433172, 37493, 41557, 95585, 66356, -4591, 45483, 305470, 164798, 56792, 200491, -167, 282302, 148008, -268461, -37656, 156921, 57659, 229804, -70540, 174904, -46899, -236535, -148733, 153701, 113027, 239625, -10134, -321836, 66932, 51901, 126128, 61640, 238590, 92005, 284630, 3480, -39606, 514246, -9297, 314770, 10751, 208535]
16218B08535a03834G2774d883A95463M6863a390B596a05163k05253D78822A08588
16206A81515f3393A80398k9143C8926J9211d4354k48783a43A50510a74792N1370
16195a23422e0692A3896N2474A8201J90778a62572B72863a11307A16442h4194
16184A10415a11371B4140G847b92033B125h1214A64946a11606G0062L60130A44174
16172G2264O3142c1750C40871A05013L4752l0451k7545Q7122N9813e8168A16755
16160a740j11941c8426k63799D0447K1518b40030E9102A7173J48010D8839h6887
16148b1806q7455B53501g9226b6166D4386b70230C4839J76136E986b1224A04839
16136H1385b20343F1420N9961a52084A07935J51967r7233i5987j29058R038g8714
$$ y = [208535, -103834, 72774, -4883, 195463, 242326, -1390, 2596, -105163, -310416, 478822, 108588, 181515, -63393, 180398, 151255, 38926, 58137, -44354, -293137, -143, 150510, -174792, -123422, -50692, 13896, 66370, 18201, 208979, -162572, 272863, -111307, 116442, -84194, 110415, -111371, 24140, 7847, -292033, 2125, -81214, 164946, -111606, 70062, 430192, 144174, 72264, 135406, -31750, 340871, 105013, 139765, 109314, 81769, 168891, 228704, -58168, 116755, -1740, -113681, -38426, -302225, 40447, 61965, -240030, 59102, 17173, 165183, 48839, -86887, -21806, -109261, 253501, -79226, -26166, 44386, -270230, 34839, 210975, 5986, -21224, 104839, 81385, -220343, 61420, 121381, -152084, 107935, 259902, 162669, -95987, -225045, -216007, -78714]
16124A61970a50421A40882a2249C24796c01879F6137g6094A24686d4913k1310
16114f6223k60985a12586F4639K6988a03627B33778B5406J84934b7751A60136
16103D51492D3040b17089H1959b5325A90614E4077I74J56821D0498K11164F7689
16091a92596D30042b96127A73915G6364j7998k4790J27273o0968L92790b73967
16080C17013j32396A5497b9340A89816i2916D7785b657B7752K799a55539C2508
16068c64563A21894Q9224p1913E4132J343f2418A74703o8142R7740I2835i9506
16056A21137J44285c7190n7934E2885c23692h750j81780a802D257a03518b4950
16044H1834b77803A55813a0137B11013e90844d9948A77408a85540a2335A75845
$$ y = [161970, -150421, 140882, -12249, 324796, -301879, 66137, -76094, 124686, -44913, -66223, -327208, -112586, 64639, 91627, -103627, 233778, 25406, 210340, -27751, 160136, 451492, 43040, -217089, 81959, -25325, 190614, 54077, 974, 157795, 40498, 251662, 67689, -192596, 430042, -296127, 173915, 76364, 58366, 33576, 160849, 99881, 492671, -273967, 317013, 184617, 15497, -29340, 189816, -92916, 47785, -2657, 27752, 30551, -155539, 32508, -364563, 121894, 211118, 139205, 54132, 55475, -62418, 174703, 106561, 204301, 92835, -99506, 121137, 265422, -37190, -95124, 52885, -323692, -8750, -190530, -1802, 4257, -103518, -24950, 81834, -277803, 155813, -10137, 211013, -590844, -49948, 177408, -185540, -12335, 175845]
16033d9558C01082b3988A35656f5589D8221a69516A80958a62336k8255e5916A68892
16021b35595B04556c52312A35896D7996j6240c18345D00418c17751f8172A10504
16010H2303j4962K13607A4586h7906K9865j19460I0421K15576A09163l9612K8476
15999I8027b29369A34367K5189D4653b92656B9335b30440E0431a87311A56489
15988b66138B08951a28412B3753J59587o3972n5319K9600O18913B00574i1676
15977A56845P5855r0545g8382n5040K7678B59642j24644J5593N7666a80631d5177
15965g1045k065d068r6660A50523a03508C69006G1687K0130K39643i125F0054
15953c02669c0180M144k49317A45974a17976j95801c5288k09757L3515j22363
$$ y = [-49558, 301082, -23988, 135656, -65589, 48221, -169516, 180958, -162336, -190591, -55916, 168892, -235595, 204556, -352312, 135896, 47996, 31756, -318345, 400418, -317751, -68172, 110504, 82303, 67341, 280948, 14586, -87906, -58041, -177501, 90421, 305997, 109163, 69551, 98027, -229369, 134367, 159556, 44653, -292656, 29335, -230440, 50431, -187311, 156489, -266138, 208951, -128412, 23753, 183340, 119368, 64049, 93649, 712562, 200574, -91676, 156845, 232700, 142155, -78382, -133422, -105744, 259642, 134998, 150591, 208257, -180631, -45177, -71045, -73110, -4068, -100728, 150523, -103508, 369006, 71687, 91817, 331460, -9125, 60054, -302669, -30180, -26036, -275353, 145974, -117976, -313777, -35288, -245045, -211530, -333893]
15943c33893A73060a56709F7723J52859C1272J73871a30139j58646l0799a00438
15932a8679r3083K8053C03542q9114a02240D2084c63720J79700k4765N8435k27285
15921c77635I8825a70627l2535L054j32415O3508B04750G0769Q9620E8451b15858
15909A19617C6737k117b54537J7855e2903k52424J898I8802k3832o683h4460j46085
15897b30545L1475N5341k9919e3666p1937E4641Q5342a99148j21757O8059R9180
15886a53666O3731n6726j64744A33088Q7155j4633G682a4642j55238K8707A7385
15874A40095b79605c5850B06559F2200J30508c7933j30122C4533b04186D561h334
15862a79283e7561k72838E7125a8745n966b744q8740k05111f3230m188B2944J71043
$$ y = [-333893, 173060, -156709, 67723, 220582, 31272, 205143, -130139, -288785, -319584, -100438, -18679, -111762, -83709, 303542, 214428, -102240, 42084, -363720, -184020, -208785, -150350, -377635, 98825, -170627, -203162, -200108, -332523, -269015, 204750, 70769, 160389, 58451, -215858, 119617, 36737, 34620, -254537, -236682, -52903, -305327, -303429, 98802, 74970, 68287, -84460, -230545, -199070, -143729, -173648, -53666, -125603, 54641, 139983, -199148, -320905, -252846, -153666, -89935, -146661, -311405, 133088, 220243, 205610, 7682, -14642, -169880, -141173, 17385, 140095, -279605, -35850, 206559, 62200, 192708, -37933, -168055, 34533, -204186, 4561, -8334, -179283, -57561, -330399, 57125, -18745, -24711, -2744, -91484, -296595, -63230, -67418, 22944, 193987]
15850A93987f8194j8035F0730Q4832h2410R820b338n9301j07661a7973D6301a18464
15837a99324h5812n8967F4533j4183q97b61888a12044A50520F700Q8739O0553
15826A55992b1318A33058J72125e0648A6549h8336A75950j0956r344G5233K41376
15815C16609c21863b7740q2332n6703f050K4C76720G1538a86953D8008q722f0648
15802d6168B9673K4517a10377D2573O4622J06588b6865G4687B6692b0266Q644
15791a1622k850k75540B09235J3151p2603a85036C24261a963l8462a5087j86449
15780b01536b6061j75668B25794N2265a45574A56275a99113j7665i5607j56568
15770b52175A42408F4730K807r122N142a76524j43478J44902H5317a47169A47083
$$ y = [193987, -68194, -86229, 60730, 145562, -82410, -72590, -2338, -61639, -169300, -17973, 46301, -118464, -199324, -85812, -144779, 64533, 50350, 49453, -261888, -112044, 150520, 6700, 95439, 155992, -21318, 133058, 305183, -50648, 16549, -88336, 175950, 164994, 155650, 75233, 316609, -321863, -27740, -110072, -166775, -6050, -6026, 376720, 71538, -186953, 48008, 39286, -60648, -46168, 29673, 54190, -110377, 42573, 107195, 213783, -26865, 74687, 26692, -20266, -11622, -14472, -290012, 209235, 222386, 149783, -185036, 324261, -1963, -40425, -15087, -201536, -26061, -201729, 225794, 278059, -145574, 156275, -199113, -216778, -95607, -252175, 142408, 64730, 67537, 58415, 63557, -176524, -320002, -175100, 85317, -147169, 147083]
15758B98393a33138B27559A8472O2336A3347K76194e715C2509b16160D7178R2330
15747A39508a21690A95803D3724a26894j6043C5274b91212A70122a22886e9448
15736g0949j76737B8774c34673B64059D8632J88709g4211j7056d3013A74569i7560
15724A38502m5545b85612F4869Q4549c04381B8378K58381b14460H5878a60532
15713h14l41942J28190e8194A32680K5981a11852k4657a6615B0173a52203D4199
15701D20487h6647L6817C01664G5586C415h0141p4357e90B38690h5350a5849q5133
15689a00982E7978k5540L1359q794c7103H1415A8929c88749a07378p7351g9262
15677d5915q0498E6496J1298a8506C1547J84708R9857K4269b0218A49925b63203
$$ y = [298393, -133138, 227559, 18472, 80808, 13347, 289541, -5715, 32509, -216160, 47178, 139508, -121690, 195803, 43724, -126894, -142937, 35274, -291212, 170122, -122886, -59448, -70949, -247686, 28774, -334673, 264059, 48632, 237341, -74211, -91267, -43013, 174569, -97560, 138502, 92957, -285612, 64869, 149418, -304381, 28378, 286759, -214460, 85878, -160532, -814, -342756, -214566, -58194, 132680, 158661, -111852, -136509, -16615, 20173, -152203, 44199, 420487, -86647, -49830, 301664, 75586, 3415, -80141, -154498, -590, 238690, -85350, -15849, -100982, 57978, 32438, 63797, 55003, -37103, 81415, 18929, -388749, -107378, -184729, -79262, -45915, -126413, 56496, 67794, -18506, 31547, 216255, 316112, 340381, -20218, 149925, -263203]
15665H916e487n1525l39250B51327d08011i4973K5138J440p4183I9874K04235
15654C04109j31077E0293b26969N7437b8273J2588j91417e4532O73P647A10760
15642A63586p6076P1463a52603A76781b31522A08071B8491e9894k49299h9501
15631B00008A6448m718b77929C8541c1031F3822O1530a90002c5859o38n2139D13736
15618A99864a32068A34096m9500a27394B71812a53348B87233G1520j5871b88764
15607F6291a00442A28868o0960J14432B1999Q8712e3765A59550a07413e1435B3467
15595C46307a86197k53082A45161b30770E1452J23445a48386L7615D0190j1188
15585B9002J47876b7154M36D27R9850a35821G95K96842g7239A62347K9878J31574
$$ y = [8916, -5487, -57012, -396262, 251327, -408011, -94973, -69835, -68395, -142578, 99874, 304109, 173032, 50293, -226969, -169532, -28273, -15685, -207102, -54532, -53859, -46212, 110760, 163586, 87510, 158973, -152603, 176781, -231522, 108071, 28491, -59894, -309193, -89501, 200008, 16448, 11730, -277929, 38541, -31031, 63822, 125352, -190002, -35859, -36497, -88636, 413736, 199864, -132068, 134096, 84596, -127394, 271812, -153348, 287233, 71520, 55649, -288764, 66291, -100442, 128868, 67908, 182340, 21999, 110711, -53765, 159550, -107413, -51435, 23467, 346307, -186197, -439279, 145161, -230770, 51452, 174897, -148386, -110771, 40190, 29002, 176878, -27154, -26718, 427, 100277, -135821, 795, 297637, -77239, 162347, 192225, 323799]
15573C23799C0911J07209K92814h1794j81388f38A23699h5567I8967l7806b99350
15561A6516L2382a7058j52144E2222b55508A05378B8314a97887H4616d40847G2790
15549F8010a14512c754m4840k37282A9271a7289m979o9200B24882a5592A33354
15537C65270A65172a12107A77004H7740b24556q4324b1196o2611A44602a22561
15526i8838A11710f3407B07918a67146M3631B41610c1448J2404j28853j82461
15516c30358A34295E4085k843K0937b08610a01266b6994l2488m0289B418c05184
15504b74600A59566i1964K3512B7096a16388A31151i0506P844j8979e878j14293
15493a20171A0899h0695C0727J05456k7483B655i8787B81238a64238o0845C11261
$$ y = [323799, 30911, 138120, 430934, -81794, -263182, -638, 123699, -85567, 98967, 61161, -299350, 16516, 48898, -17058, -169202, 52222, -255508, 105378, 28314, -197887, 84616, -440847, 72790, 68010, -114512, -3754, -48594, -285876, 19271, -17289, -22268, -91468, 224882, -15592, 133354, 365270, 165172, -112107, 177004, 87740, -224556, -308880, -21196, -83807, 144602, -122561, -98838, 111710, -63407, 207918, -167146, -123515, 241610, -31448, -19044, -147897, -330358, 134295, 54085, 51242, 72179, -208610, -101266, -26994, -59482, -99771, 2418, -305184, -274600, 159566, -91964, -68452, 27096, -116388, 131151, -90506, -82662, -101641, -5878, -120171, 10899, -80695, 30727, 136183, 108700, 2655, -98787, 281238, -164238, -225083, 311261]
15481D8472b24347j34885J36373c1709J2244A18766j3121b56508A57420j1060
15471A46360n0615f882G1198K03981B5030a20937B29505a776k93621J35532L2906
15460a26959C38761e4306A36622D7241b34011F9633b55709P1909I762f4174j2196
15449g6370A69533B02c10694l9825a311k04938c7528p9053J0290n0814G1872J73062
15437B44934f2277B23509a00039r1452O4902o8852r5517g0499B5319a01709d7009
15425a79169g0614o4450n9881A06133a18021B06441b14657D15616F4854h3698
15414a13790M6825l8061j0137k38930a08524a0523j25884A94886c13933I4044
15403A05881c8773F5564a22573B2720J78217E6444H530J30678F7533B7367J77271
$$ y = [48472, -224347, -359232, -222859, -31709, -19465, 118766, 105645, -256508, 157420, 146360, 95745, -6882, 71198, 275179, 25030, -120937, 229505, -1776, -295397, -159865, -126959, 338761, -54306, 136622, 47241, -234011, 69633, -255709, -183800, 9762, -64174, -76370, 169533, 202, -310694, -350519, -1311, -206249, -37528, -116581, -106291, -157105, 71872, 244934, -62277, 223509, -100039, -191491, -126589, -195441, -290958, -70499, 25319, -101709, -47009, -179169, -70614, -135064, -194945, 106133, -118021, 206441, -214657, 415616, 64854, -83698, -113790, -66965, -105026, -115163, -354093, -108524, -10523, -136407, 194886, -313933, 94044, 105881, -38773, 65564, -122573, 22720, 200937, 56444, 8530, 139208, 67533, 27367, 204638]
15392B04638a44118K9861F3884j5540j4322p535b7695C36272j23344O2688D6424
15380i9547l9169B71527B1957a28272A6057b0978o0245H6717a60053k89594D2885
15368A9963b8035H3702L9118j0253M8985A5520i7818j73669a35246F0678a98512
15356C65385g5514a789A98697a71297C18106A53232a94413C6483i1125C08870
15345H1546i8635b9024n9496C4699K66730a75161A07649J69775F8270K18206G556
15333A98103r6411O0954J15573d964C6284a27547A67481O4717c38242C54289A55941
15321B30983K31179g3240K8663E14519b41777D5040d5195j87755C71716a50048
15310B78311h2029B32718I0631N27769B66758C1144K24161n2285j9349A0440J66106
$$ y = [204638, -144118, -114257, 63884, 48344, 34022, 26487, -27695, 336272, 212928, 275616, 46424, -99547, -138716, 271527, 21957, -128272, 16057, -20978, -81223, 86717, -160053, -449647, 42885, 19963, -28035, 83702, 122820, 112567, 161552, 15520, -97818, -271487, -135246, 60678, -198512, 365385, -75514, -1789, 198697, -171297, 318106, 153232, -194413, 36483, -91125, 308870, 81546, -98635, -29024, -88520, 34699, 301429, -175161, 107649, 277424, 68270, 286476, 7556, 198103, 101692, 162646, 278219, -4964, 36284, -127547, 167481, 232198, -338242, 354289, 155941, 230983, 462162, -73240, -44577, 514519, -241777, 45040, -45195, -232950, 371716, -150048, 278311, -82029, 232718, 90631, 618400, 266758, 31144, 255305, 203020, 183671, 10440, 176546]
15299A76546A3763J16462J6482h5177B09938b52892B56060j07326K19890A45009
15288A38445l9858J77059L9513j18726a64139D03282G9104c3371B35355E5138
15277B59343e2019j5980F4505a06468B77739j5714a98079B6537B074J8582L6469
15266E7125J29454a00838n56B45131C2000e2153C30932e5229A80880e6519A45186
15254A80394j9134j8960G0647K72881P209M2095P29177J3014j83011L98409n76233
15243G74188B02168I0117L45149f2324A11608K03650H3028i3194j48163A1297
15232B20767F3695f3019I558J93292C906J66552P7592p7382o2544a24539B271
15220B25055G3390a4105j29368J7137B39849b096B39255a19829F4201P8948b51277
$$ y = [176546, 13763, 130225, 146707, -85177, 209938, -252892, 256060, 148734, 368624, 145009, 138445, 98587, 275646, 315159, 196433, -164139, 403282, 79104, -33371, 235355, 55138, 259343, -52019, -67999, 64505, -106468, 277739, 262025, -198079, 26537, 2074, 20656, 57125, 186579, -100838, -101394, 245131, 32000, -52153, 330932, -55229, 180880, -56519, 145186, 180394, 161260, 142300, 70647, 343528, 350737, 392832, 1122009, 1135023, 952012, 1350421, 774188, 202168, 90117, 435266, -62324, 111608, 315258, 83028, -93194, -241357, 11297, 220767, 63695, -63019, 9558, 202850, 3906, 170458, 248050, 170668, 108124, -124539, 2271, 225055, 73390, -14105, -143473, -126336, 239849, -2096, 239255, -119829, 64201, 143149, -251277]
15208F1824J28536b43789H6357a43414d1637A80728p7573e9223A42250h1946B44894
15196a13922M7467m1633B49329l4332c18571A4865J16975e1800j58714C70799
15185b60749e6357I8053b26343B97099a9848R0G3029e9706C7921b95628A47688
15173B04426B1360G284P4648B0968L21250A07879b46704i770A06086b99959g3211
15161B46536a86174A67112a5277B91535g0236A91661J4468N236q7627d625H4027
15149A44096K24108c20658B06120c6999B04350F5250Q1445P5716f3862d612B0193
15137A83608B9744J85114I9955M83756b9726A3406K08427f826I8687L24847j36818
15126B86716I8375L5967D9564J69152K39019k04035N04137C38475e5248B94696
$$ y = [61824, 190360, -243789, 86357, -143414, -41637, 180728, 103155, -59223, 142250, -81946, 244894, -113922, -66455, -108088, 249329, 214997, -318571, 14865, 131840, -51800, -210514, 370799, -260749, -56357, 98053, -226343, 297099, -19848, -19758, 73029, -59706, 37921, -295628, 147688, 204426, 21360, 7284, 81932, 20968, 342218, 107879, -246704, -9770, 106086, -299959, -73211, 246536, -186174, 167112, -15277, 291535, -70236, 191661, 206129, 211365, 123738, -4625, 84027, 144096, 368204, -320658, 206120, -36999, 204350, 65250, 146695, 222411, -63862, -4612, 20193, 183608, 29744, 214858, 99955, 583711, -29726, 13406, 221833, -6826, 98687, 423534, 286716, 98375, 134342, 49564, 218716, 457735, 253700, 757837, 338475, -55248, 294696]
15115a04956H0862L49047A192K07678G0762K9970J20817n1230L1258J15178j07268
15104B09487f4526B03179j2002m7084M3270K80036J9749A31349R9475a95758B54452
15092A04701J46523a12875A53259h104A1396K41158p2716C4651L06703C5830D321
15080A73730J02780Q242A15550J18339H7533a33467C89073a54180B84148J64835
15070D48983L761a29077K8483C18955j04986h998C99802b40287H6711l3333J45512
15059A98890i031j9683B32945B3885h706j5978B55558A00143B5422i4040A99660
15047E7179J78094D5863J69807J1231J8162f6090A38078a39575D22241j02781
15037C19460a3980B18853m6973q95F3802O1304k7588b24744A52160M9370K10223
$$ y = [-104956, 80862, 429909, 1192, 208870, 70762, 100732, 221549, 170319, 201577, 316755, 209487, -64526, 203179, 191177, 144093, 187363, 467399, 487148, 131349, 230824, -195758, 254452, 104701, 251224, -112875, 153259, -8104, 11396, 252554, 179838, 34651, 341354, 35830, 4321, 173730, 276510, 284752, 115550, 233889, 87533, -133467, 389073, -154180, 284148, 448983, 452744, -129077, -100594, 318955, 213969, -8998, 399802, -240287, 86711, 53378, 198890, -9031, -28714, 232945, 23885, -8706, -24684, 255558, 100143, 25422, -94040, 199660, 57179, 235273, 45863, 215670, 226901, 245063, -66090, 138078, -139575, 422241, 319460, -13980, 218853, 171880, 170985, 63802, 125106, 97518, -224744, 152160, 201530, 411753]
15026D11753b5935k2433j41235f835G2996a68772h0564A29061R5753n8834c9775
15014A65614d1185A13257N2397b2288B66620q304J74286A97903q2665L29511j23476
15003C21273J08859B5041L56327m1397J03940E1154O62249A27825J41613K3885
14993B93323l2992k6608f7222G2605K52492K62965k74226A13776J62450R784J23548
14982D09558P3344a42009a2597E47692I7981K65604K10937o4677j78373A54558
14971A58393K57409J8439C4676a51584D84063k08002A3590K44012P0450j57580
14961A70472K24597a593k5034I4641k6558J20622N6888J27636B3712K9326K76042
14950C29080A58179L7867J17991q5083J22754A26788n1140J52375l2094a02994
$$ y = [411753, -25935, -48368, -189603, -6835, 72996, -168772, -80564, 129061, 224814, 165980, -39775, 165614, -41185, 113257, 165654, -22288, 266620, 258316, 432602, 197903, 115238, 444749, 321273, 430132, 25041, 381368, 339971, 443911, 51154, 713403, 127825, 269438, 293323, 260331, 233723, -67222, 72605, 325097, 588062, 313836, 113776, 276226, 286010, 409558, 482902, -142009, -12597, 547692, 97981, 363585, 574522, 509845, 331472, 154558, 158393, 415802, 434241, 34676, -151584, 484063, 276061, 13590, 257602, 328052, 170472, 395069, -1593, -26627, 94641, 68083, 188705, 245593, 373229, 23712, 53038, 329080, 158179, 196046, 314037, 228954, 351708, 126788, 75648, 228023, 195929, -102994]
14939D13819A56207P2903R4952K5499M9923J40436j91845k0283A19145M12022
14929E31167D4285J81360L82191j993q1663B52899L9354P547m4217j09712A0637
14917B531M51076A52149M29254o6550A33024L43913J40715k54871d8984A78761
14906B93171K20917j58728j16344K8360J46220q3256A38752J25115L23266j83088
14896D04045j43208L5673m2479K95894B74054K04643a64904C77642J5914A75819
14885D63020q1930F2204K10671J31474J98103A83230M56656j42961j57560m6883
14875B92482B5444K15378J7537H0296M59462k13011K04579c2161A75896q3827
14865I2069L90922r8976k2865M0986J2007j28332J14831K1705M68245D01223K02762
$$ y = [413819, 156207, 229110, 324062, 349561, 399484, 539920, 348075, 327792, 119145, 531167, 44285, 225645, 607836, 605843, 524180, 252899, 292253, 299800, 255583, 145871, 10637, 2531, 453607, 152149, 581403, 514853, 133024, 476937, 617652, 362781, -48984, 178761, 293171, 514088, 355360, 239016, 267376, 413596, 330340, 138752, 263867, 587133, 404045, 260837, 296510, 254031, 549925, 274054, 478697, -164904, 377642, 393556, 175819, 463020, 381090, 62204, 272875, 404349, 602452, 183230, 639886, 496925, 339365, 292482, 25444, 240822, 258359, 80296, 539758, 326747, 531326, -32161, 175896, 92069, 482991, 384015, 361150, 402136, 414143, 285811, 400642, 422347, 890592, 401223, 603985]
14854F03985k26515r1478j34071J27516J23915K38846k41947K5078J09852o7155
14844D68026J38832A97631J32956l4225K10786J13148k93842J92541A74612L76722
14834E51334P3627n3989k27565L12696k87795L2234m3937l6280K49619k27245
14824C42699J99130A42947K98274j62088K82045j44692Q3691K29880l62237J6068
14814C83888J14070m7812K6689J7919J59563k41546J31555j98808q4228J28182
14804C89472J79084K8137l5347k6771N3486A90490J59721A03021M62705n1011
14794E14715p6827n0119R2715J34703j05523L1734j85680n9596L44182l2700J28618
14783G36222j61895r3785K699J78135k29878L35718j00318k35333j13320M98740
$$ y = [603985, 377470, 285992, 151921, 279437, 403352, 642198, 400251, 425329, 535181, 468026, 606858, 197631, 330587, 296362, 507148, 620296, 326454, 518995, 174612, 551334, 624961, 570972, 343407, 656103, 368308, 400542, 356605, 320325, 569944, 342699, 541829, 142947, 441221, 279133, 561178, 416486, 500177, 730057, 367820, 383888, 497958, 450146, 476835, 494754, 654317, 412771, 544326, 345518, 261290, 389472, 568556, 596693, 561346, 534575, 588061, 190490, 350211, 103021, 565726, 514715, 437888, 387769, 480484, 615187, 509664, 541398, 355718, 296122, 640304, 607604, 736222, 574327, 480542, 483241, 661376, 431498, 767216, 666898, 431565, 318245, 816985]
14773H16985B84477M48824B67225K05967L26194j03390k18220j48301K17333M9787
14763E96595r2867J26941R6829C30781O30298C68887K77693j44632J06399L6954
14753F45301j31965L6925l4397L21476q8407q3199j28050K22142o6853J07292
14743H00265j54950j12678M49355q2679k64458l9718K68407j6484j80048q394
14733F58618J01004q5406j81192J63068m29j7917n094L26398J31267k35736M1905
14722H96486k91903J57054K2347J9273M1572C83379L23226J993l28296N49273
14712I29575l26740K31639j69529B79749L46051N15466n168m71387m127Q2904
14702G43488K0903J45198p0379n7102P618j29143K29953r2914P7184K39252l44520
$$ y = [816985, 284477, 733301, 267225, 473192, 799386, 695996, 477776, 329475, 546808, 596595, 503728, 630669, 727498, 330781, 961079, 368887, 646580, 501948, 608347, 645301, 513336, 550261, 515864, 837340, 748933, 665734, 537684, 759826, 692973, 800265, 645315, 532637, 981992, 899313, 634855, 595137, 863544, 847060, 667012, 658618, 759622, 674216, 493024, 656092, 655663, 637746, 632652, 959050, 1090317, 854581, 896486, 604583, 761637, 783984, 803257, 844829, 383379, 706605, 708598, 380302, 929575, 602835, 834474, 664945, 279749, 625800, 1141266, 1136098, 664711, 660584, 743488, 764391, 909589, 839210, 782108, 789726, 660583, 890536, 797622, 874806, 1114058, 769538]
14691G69538J9411N3715m8514P5222j16889K93769l60153K57442j33002P0457
14681H80996K06113l00392M660L3997k0167J18886m6361k1562L23160n79535L6737
14670F36532M42778q8958j52402J86668j3756N0788l04735n913K5803L93320n0779
14659A119346j28677K09213P8098m75970N97007k22338J49891J40055l26175j046
14649A139404J25180j98131K25790j16410q3789L29808k36995K02077l74186J41561
14639A154309j02538j3205O31139l57746p7744O6683L7377p8576r624k80191M85091
14628A454975l49323L83055l27657L38356p7265l63388L30143j6852R4454J5265
14618A481763J37839n95908L65373j34741R3872k90771M07913j39822l7616J3478
$$ y = [769538, 788949, 842664, 794150, 869372, 752483, 1046252, 686099, 943541, 810539, 880996, 1087109, 786717, 791377, 825374, 805207, 924093, 877732, 856170, 1179330, 599795, 636532, 1079310, 990352, 837950, 1024618, 1010862, 1061650, 756915, 751002, 776805, 1170125, 1119346, 990669, 1199882, 1277980, 802010, 1399017, 1176679, 1326570, 1466625, 1140450, 1139404, 1264584, 1066453, 1292243, 1175833, 1092044, 1421852, 1184857, 1386934, 1012748, 1154309, 1051771, 1038566, 1669705, 1311959, 1234215, 1300898, 1338275, 1259699, 1250075, 969884, 1454975, 1105652, 1488707, 1161050, 1499406, 1422141, 1058753, 1388896, 1372044, 1466498, 1481763, 1619602, 1023694, 1389067, 1254326, 1348198, 1057427, 1465340, 1325518, 1287902, 1301380]
14608A301380K31748j56332L08016k82165K65461l01913K19741l25393N19053
14599A779596r6351M9737j54897P1044K13253l18332L07091j6858j49246q0480
14589A604557L58456j42778J14901k15584k11551J89913k75673P14128p4936m6921
14579B014512J47899m27904K41908J04965k26568J70797r1840N6395K80869k51863
14569B019170M25608k54736N44247l83834R9488j90735M48600l78550L63753j93206
14559B499805M18365k39229J46366L43217k30576J019220k07117L13643P80065
14550D843759R08345K283963M501125R728103J6393342L09832j8570348I353924
14541D561708j754797o27967n21080L52301k82497M06995k00511k79671M50700
$$ y = [1301380, 1533128, 1376796, 1684812, 1402647, 1668108, 1366195, 1585936, 1260543, 1779596, 1683245, 1732982, 1578085, 1649129, 1862382, 1544050, 1851141, 1834283, 1685037, 1604557, 1963013, 1820235, 1935136, 1719552, 1508001, 1697914, 1422241, 2136369, 2061433, 2014512, 2162411, 1734507, 1976415, 2081380, 1854812, 2025609, 1933769, 1990164, 2271033, 2019170, 2444778, 2190042, 2734289, 2350455, 2449943, 2259208, 2707808, 2329258, 2693011, 2499805, 2918170, 2678941, 2825307, 3168524, 2937948, 3957168, 3750051, 4063694, 4843759, 5752104, 8036067, 12537192, 22265295, 38658637, 38968469, 20398121, 9353924, 4561708, 2806911, 2178944, 1657864, 2010165, 1727668, 2134663, 1934152, 1654481, 2105181]
14532B105181k31802K60523j34917J371J07280j87698L04733k29237K66211M0977
14522B302622k5930O0141M4614K53982j9816j51340P5135K24202k48347j45658
14512B369605M84565l87292k72510N80198j08168J04718N7374j63459J07550K38141
14502C010722N4390k39443R2544K00710k77348L20949J03218j57006R8033k08711
14492B998058k57988M74800q6289L18397J69980j24287J63158k31199R8079l71296
14482C151413N96238j10832J54342K72399k02198k90995n6672O84429q2591J02485
14472D218018l46854M04995l13607L83384k15623M24357m10063K19683j51692
14463D212598L63871N8825l70244L75972l34208O80878m8150m84568O28979k32228
$$ y = [2105181, 1873379, 2133902, 1998985, 2000356, 2107636, 1919938, 2224671, 1995434, 2261645, 2302622, 2276692, 2336833, 2381447, 2635429, 2615613, 2464273, 2539408, 2763610, 2515263, 2369605, 2854170, 2466878, 2194368, 2774566, 2666398, 2771116, 2828490, 2665031, 2772581, 3010722, 3065112, 2825669, 2918213, 3118923, 2841575, 3162524, 3265742, 3108736, 3206769, 2998058, 2740070, 3214870, 3128581, 3446978, 3616958, 3492671, 3655829, 3424630, 3522709, 3151413, 3747651, 3636819, 3791161, 4063560, 3861362, 3570367, 3513695, 4198124, 4115533, 4218018, 3871164, 4276159, 3962552, 4345936, 4130313, 4554670, 4144607, 4364290, 4212598, 4576469, 4635294, 4265050, 4641022, 4306814, 4987692, 4939542, 4454974, 5083953, 4851725]
14453D851725K38763k47266j17457N77298o0141p306K85337m42255N21009q2665
14443E517042J53466o9192J07926q6460L80029P5583N5473k22590J53003J05298
14433F169578L43565L0026l6913J39092J70773P8506K19229o00819L66869J91215
14423G071121J03723K59356J71736j15311L29677n8147L42952j16570j61719L03816
14413H130634L86325L2692J75686N2643K75915m53635R3473M95337l416K5619
14403I211273K74744L16909J60935R0568j77512M04829J09640L91931J01332L4229
14393A0918878N35945L4636L22579K8053K72568P0930M27493L95223j65985K62869
14383A3103189L85486O5791M79310N2637P37481k02629M42220K31062J48661K84903
$$ y = [4851725, 5090488, 4843222, 4725765, 5303063, 5242922, 5235616, 5520953, 5078698, 5599707, 5517042, 5670508, 5601316, 5709242, 5622782, 6002811, 6078394, 6133867, 5911277, 6064280, 6169578, 6513143, 6543169, 6506256, 6645348, 6816121, 6894627, 7113856, 6513037, 6879906, 7071121, 7174844, 7434200, 7605936, 7490625, 7820302, 7762155, 8105107, 7988537, 7826818, 8130634, 8516959, 8549651, 8725337, 8777980, 9053895, 8600260, 8693733, 9189070, 9185654, 9211273, 9486017, 9802926, 9963861, 10054429, 9876917, 10281746, 10391386, 10783317, 10884649, 10918878, 11454823, 11489459, 11812038, 11840091, 12112659, 12183589, 12611082, 13006305, 12840320, 13103189, 13488675, 13554466, 14033776, 14086413, 14823894, 14621265, 15063485, 15294547, 15443208, 15728111]
14373A5728111L61853L60983M39454Q7620N89733K63604N46873M06103L09615
14364A9093949K05888O34657J93081M94256P31940K81153L46719Q08134L70685
14355B3160462L52619P28626O80346M78084P71704K76679Q02323O78439P54906
14346B8684188O97902O58396R25046P44603R45030R84111O75156J237972J010890
14337C6563294O36120J132426J498434R19773J468166J021522J263649J652269
14329D6155653J197624J682029J236806J909505J433982K030773J786848K053122
14321E9486342K183990K184331K427811K270408K829711K599011L057778K846827
14313G9886209L004519L221413L933253L506571M087030M077212M541090M898235
$$ y = [15728111, 16089964, 16450947, 16890401, 16978021, 17567754, 17831358, 18378231, 18784334, 19093949, 19299837, 19934494, 20127575, 20621831, 21353771, 21634924, 21981643, 22789777, 23160462, 23513081, 24241707, 24922053, 25400137, 26171841, 26448520, 27250843, 27929282, 28684188, 29382090, 30040486, 30965532, 31710135, 32655165, 33639276, 34314432, 35552404, 36563294, 37199414, 38331840, 39830274, 40750047, 42218213, 43239735, 44503384, 46155653, 47353277, 49035306, 50272112, 52181617, 53615599, 55646372, 57433220, 59486342, 61670332, 63854663, 66282474, 68552882, 71382593, 73981604, 77039382, 79886209, 82890728, 86112141, 90045394, 93551965, 97638995, 101716207, 106257297, 111155532]
14305A11155532M757671N524683N417141O126062O454977O705413O925338P681803
14297A60748620Q153130Q355023Q896335R547940R881374J0603352J0770859J1076902
14289B38033535J2347587J2229569J3132293J3626252J3796232J4385853J4524566
14282C32075887J4626204J4409240J4301864J3743915J3201815J2071586J1301669
14275D25732180R600690P297443L456739j41915j704928j978498k37649l726505
14267D38297557l981329n403110r560547j2335947j3394399j4186990j5074184
14260C64361051j5193944j5704812j5520622j5121612j4783382j3901611j3248749
14253B60886319j3228499j2500657j1806921j1485489j0576607j0203867r501938
$$ y = [111155532, 115913203, 121437886, 126855027, 132981089, 139436066, 146141479, 153066817, 160748620, 168901750, 177256773, 186153108, 195701048, 205582422, 216185774, 226956633, 238033535, 250381122, 262610691, 275742984, 289369236, 303165468, 317551321, 332075887, 346702091, 361111331, 375413195, 389157110, 402358925, 414430511, 425732180, 435332870, 442630313, 446087052, 445945137, 444240209, 442261711, 442024062, 438297557, 434316228, 428913118, 419352571, 407016624, 393622225, 379435235, 364361051, 349167107, 333462295, 317941673, 302820061, 288036679, 274135068, 260886319, 247657820, 235157163, 223350242, 211864753, 201288146, 191084279, 181582341]
14246A81582341q821532q201150p788510p354290p180947o676864o226152o022489
14238A23310407m887603n217344m974773m670530m550197m047932l653815l307142
14230H8001071l820888l315718l129619k657632l321029k122215l048439k149567
14222F4435964k322815k203227j642417k139330k102109j780613j563326j684096
14214D8998031j208604j541768j672285j588541q50219j494821q23810q74935
14206C8943048j252407j255853j012054r51799q63905j007526n23752q55134r60228
14197C0260390p32581o89623q99125o83908n44382o09048q41720n56130l04086
14188B4399787q27195m05121p78496n7497r22655L061q70024k10976p24769j42178
$$ y = [181582341, 172760809, 164559659, 156771149, 149416859, 142235912, 135559048, 129332896, 123310407, 118422804, 113205460, 108230687, 103560157, 99009960, 94962028, 91308213, 88001071, 84180183, 80864465, 77734846, 75077214, 71756185, 69633970, 66585531, 64435964, 62113149, 59909922, 58267505, 56128175, 54026066, 52245453, 50682127, 48998031, 47789427, 46247659, 44575374, 42986833, 42136614, 40641793, 39817983, 38943048, 37690641, 36434788, 35422734, 34470935, 33607030, 32599504, 32075752, 31220618, 30260390, 29527809, 28838186, 27939061, 27255153, 26710771, 26101723, 25260003, 24703873, 24399787, 23572592, 23167471, 22388975, 22331478, 21408823, 21411884, 20541860, 20330884, 19606115, 19463937]
14178A9463937o61097j44207o50603R2733l42543q90626j7481n62359J73618n30190
14168A5931182j5046l73637m47423j98642k10896n88535j17740l63581l0150l3994
14158A3551538n43996p3436n51030l5317J00982n02031k90366m9672l66761K47043
14148A1486954m21946k45609P1181m88955K99853l83296l39179o9903L5678l03026
14138I641752k30736k67367J79460j35929O4964j70798j47083n24801j17364K29976
14128H522074l38299L7360j12559n06782K29004m13319l0754j55553j53403n6759
14118G021010J60142j16209l9179k59557m0678k86197P6972P9483o6174k93866
14108F235747P0591K06522o69037N01947m25789o3693J41616j87527j26905n0458
$$ y = [19463937, 18802840, 18658633, 18008030, 18100763, 17758220, 16867594, 16850113, 16287754, 16461372, 15931182, 15916136, 15542499, 15095076, 14896434, 14685538, 14097003, 13979263, 13615682, 13585532, 13551538, 13007542, 12934106, 12383076, 12347759, 12448741, 11946710, 11656344, 11606672, 11239911, 11486954, 11065008, 10819399, 10890580, 10401625, 10701478, 10318182, 9979003, 9909100, 9944778, 9641752, 9411016, 9143649, 9323109, 9187180, 9252144, 9081346, 8934263, 8409462, 8292098, 8522074, 8183775, 8221135, 8108576, 7601794, 7830798, 7417479, 7386725, 7231172, 7077769, 7021010, 7181152, 7064943, 7025764, 6766207, 6725529, 6439332, 6516304, 6595787, 6529613, 6235747, 6306338, 6512860, 5843823, 6345770, 5919981, 5856288, 5997904, 5810377, 5683472, 5633014]
14098E633014O1232m60457N8671l14291L29338J58037l03976N329J33358l16390
14088D983865N121j18846q3940J84025q6155l52262k06560J49992p0835K82272
14078D686677n7157l4325k88319j34388K40976k20053J9603k66635J045m6772
14068C900652J44342J9565m50161J49678J99869j16298K02113j79147l37387L12537
14058C845763j39061l028L19682q03079N45765k55314Q2408Q4060j56911L47674
14048C867959m37937m83398N46332m65187K87209j67404N7841k41247N4477R094
14038C027739K50028n85828K62375J44433P0093j89491j90500l0913K47906k42914
14028B762928J14871O061r0390j29404j24453p8031J4062J61385l67072J83000
$$ y = [5633014, 5694246, 5233789, 5292460, 4978169, 5307507, 5465544, 5161568, 5166897, 5300255, 4983865, 4988986, 4870140, 4786200, 4970225, 4884070, 4531808, 4325248, 4475240, 4404405, 4686677, 4629520, 4595195, 4306876, 4172488, 4413464, 4193411, 4213014, 3946379, 3947424, 3900652, 4044994, 4064559, 3614398, 3764076, 3963945, 3847647, 4049760, 3870613, 3533226, 3845763, 3706702, 3703674, 4023356, 3220277, 3766042, 3510728, 3593136, 3677196, 3520285, 3867959, 3430022, 2946624, 3492956, 3027769, 3314978, 3147574, 3205415, 2964168, 3018645, 3027739, 3277767, 2691939, 2954314, 3098747, 3168840, 2979349, 2788849, 2757936, 3005842, 2762928, 2877799, 2883860, 2793470, 2664066, 2539613, 2461582, 2475644, 2637029, 2269957, 2452957]
14018B452957j22496N3309m4232p5820k5208L68292j07873k51229j09895k09882
14008A927923J55378J43181J62460k70578k5873k8916j9382L327k5545J18959
13998B140934j95673j87635M45084k02985Q0036k82472K92730K65846N62163Q66624
13988C784652L658467Q061399J7074646P272729j6169354j0709346n187577k356641
13980E428975j148027l21922o33927k41233Q6659j39201q21519N69529n51211
13971B228123KK56138j64621J55506j88744l26540j11301K54470l3293L6159L0992
13960B136891n45686O07628j11034N7365l67186M79342l65309j87460O3590L27255
13950B095396k48092q9291R9319n79559L96258J1029j05796K32960J19983m88642
$$ y = [2452957, 2330461, 2383770, 2339538, 2263718, 2238510, 2606802, 2498929, 2247700, 2137805, 1927923, 2083301, 2226482, 2388942, 2118364, 2092491, 2063575, 2044193, 2047520, 2021975, 2140934, 1945261, 1757626, 2202710, 1999725, 2079761, 1797289, 2090019, 2355865, 2918028, 3784652, 7443119, 15504518, 32579164, 39851893, 23682539, 12973193, 7785616, 5428975, 4280948, 3959026, 3325099, 3083866, 3170525, 3031324, 2209805, 2779334, 2228123, 2228125, 2484263, 2319642, 2475148, 2286404, 1959864, 1848563, 2103033, 2069740, 2105899, 2136891, 1591205, 2198833, 2087799, 2145164, 1777978, 2257320, 1892011, 1704551, 1768141, 2095396, 1847304, 1758013, 1857332, 1277773, 1674031, 1685060, 1579264, 1812224, 1932207, 1443565]
13940A443565K33165J52907j72807k7289N2791J75646l01649K79902k38522j54373
13930A443336Q7311j94544N5707J74723L214p9172J1800m426J51611k01977l1861
13919A415722Q9552k18581K81540j55934L23435l64122k08321L20902n07250L13466
13909A290409r37k98806K53548j36755k6390P9571o5443L09385m206k40843J09264
13898A268797k84279K03411j09671k16483K48003P9545k32148l5353L80250P037
13888A309109J09686m13936K61012k80997k114N80135o65615L17819o6509O7477
13878A216067j56824J3615J66313J67855l88255J84650j84744J28888P4286n02062
13868G19789L52322l5894K47717k97108J83087j1595m9357l26241O1346J7115
$$ y = [1443565, 1676730, 1829637, 1656830, 1629541, 1682332, 1857978, 1556329, 1836231, 1597709, 1443336, 1530647, 1336103, 1391810, 1566533, 1569747, 1490575, 1502375, 1497949, 1649560, 1447583, 1415722, 1505274, 1286693, 1568233, 1412299, 1735734, 1371612, 1163291, 1484193, 976943, 1290409, 1289472, 990666, 1244214, 1107459, 1081069, 1160640, 1095197, 1404582, 1400376, 1159533, 1268797, 984518, 1187929, 1078258, 861775, 1109778, 1189323, 957175, 921822, 1302072, 1309109, 1418795, 1004859, 1265871, 984874, 982760, 1562895, 897280, 1215099, 1148590, 1216067, 1059243, 1072858, 1239171, 1407026, 1018771, 1203421, 1018677, 1147565, 1221851, 719789, 1072111, 1036217, 1283934, 986826, 1169913, 1158318, 1108961, 782720, 844066, 861181]
13858H61181L17567r4641o5438J83251l74553J74347l02054J10623L54401k18556
13848I46128r741K41043j07824J23964m63263K14683j51648j407k4211J01328
13838H69052Q3432J35266j11912j9021m51506J03948M06674k32143N4617L68572
13828A206979l45995M4674K85072n18049Q0408j87565K81579J36002j98287j95172
13818E89646J50022J00257J49211j55137J40785l6217l51843J46287O1203R9036
13808H93250k91304j06497M13586L6012D62843K43047Q6260k30841M6090J34626
13798G42025k19466K68515M5436j54816K10806m42283N11636q5553j15571k15989
13788E44740J23693J70092k27504K04789k2248k43280k09142N25804l17054l7521
$$ y = [861181, 1178748, 1084107, 1018669, 1201920, 827367, 1001714, 699660, 810283, 1164684, 946128, 936387, 1177430, 1069606, 1193570, 730307, 944990, 793342, 791935, 767724, 869052, 952484, 1087750, 975838, 956817, 505311, 609259, 1015933, 783790, 838407, 1206979, 860984, 905658, 1190730, 672681, 753089, 565524, 847103, 983105, 784818, 589646, 739668, 839925, 989136, 833999, 974784, 938567, 586724, 733011, 794214, 893250, 601946, 495449, 909035, 945047, 462843, 705890, 792150, 561309, 607399, 742025, 522559, 791074, 836510, 681694, 892500, 450217, 961853, 876300, 760729, 544740, 668433, 838525, 611021, 815810, 793562, 550282, 341140, 866944, 549890, 512369]
13778E12369J90031k27635L24189C98163N00380B92200N08303J34951l46780K17205
13768H05879J0784k81828K24551l67548L52912K9532k6391j65824J2938J52699
13758G47704r9518n8606N4805M89917m40514j09054L558K5731j47743o2817Q4315
13747D87778L46405m16306K840J69269K25379B44776P47895k48248k55274K10726
13737F99875o2423j09477r7711J37360k7758L30361o8842R4661B80324L63781
13727F44105J65352k81044p5108j65015P5767J81986j9758k6501q2635J17897
13717E35046k5504j18824j51119J13673L15685k62581J01331B38473R4253P0998
13707D03724l4916j21516J67113O4868K461j27421J17072R2218j45957J28267
$$ y = [512369, 702400, 474765, 798954, 398163, 898543, 292200, 800503, 935454, 588674, 805879, 816663, 534835, 759386, 391838, 744750, 774282, 747891, 582067, 595005, 747704, 648186, 589580, 644385, 1134302, 693788, 584734, 588292, 614023, 466280, 403463, 487778, 834183, 417877, 420717, 589986, 815365, 244776, 992671, 744423, 489149, 699875, 637452, 527975, 430264, 567624, 539866, 870227, 801385, 896046, 280324, 644105, 809457, 528413, 453305, 288290, 364057, 546043, 526285, 499784, 417149, 535046, 509542, 390718, 239599, 353272, 668957, 406376, 507707, 238473, 332726, 403724, 368808, 247292, 414405, 479273, 481734, 354313, 471385, 563603, 417646, 545913]
13697E45913n4379J96862j03311j05165K36174C30303J47685j9237j15578K79385
13687F22558B55489K84002k63356m3093K19738n6667N3452J68921k12594A3729
13676E96480j62264K02003A67393K15317j75487L45724J76647A20100J70851J5645
13666C06596J66369l6126j81840O2349Q6770K2181J3870o0895K5603j37474M49420
13655G16823k80190A98124M10509k7611k63889P7281j5776P4968J15727B08149
13644C67512J82973A6716N54869A39353L57135m8559q5829O6334l4167K9354k7278
13633C96343j55380J05994A0632M68445j41390k5756j12593K72657k23830K36782
13623D84947J44502j70853k1231P3975A45159K04558j14106K09207J27493P4342
$$ y = [545913, 491534, 688396, 585085, 479920, 716094, 330303, 477988, 458751, 343173, 622558, 255489, 539491, 276135, 233042, 452780, 396113, 449565, 618486, 405892, 13729, 596480, 434216, 636219, 167393, 382710, 207223, 552947, 729594, 120100, 290951, 306596, 472965, 436839, 254999, 317348, 404118, 426299, 440169, 379274, 404877, 267403, 716823, 436633, 198124, 608633, 581022, 317133, 394414, 378638, 453606, 569333, 208149, 367512, 550485, 16716, 571585, 139353, 496488, 447929, 362100, 428434, 394267, 423621, 396343, 240963, 346957, 10632, 479077, 337687, 311931, 199338, 471995, 248165, 484947, 629449, 458596, 437365, 511340, 145159, 349717, 235611, 444818, 572311, 646653]
13613F46653A26261N2149M01219O0716j77744j57543o3444L96664B62047p6589
13603A85458K0971K25546j00823J07263j08857J3578J96569B55092K42053A06869
13592B95293p9233J13634K1387O8097n4824R2954A52348K67616L09146O258B69380
13580A42694K62989I4748J30584n8116J51155J9619q6170L8718A2956L83245p8567
13569C17634K07160j15075c2869E07131K2407B22949C6567M66771j28646A33853
13558E4171J14666L25356B33163e24B52946J56731P5396A36925J21312Q9276H8036
13546B77639J67254m9722J51877J06654A64423N74582D3948L38498j77212J01990
13536C07224k7389C7435M07453B08357K9586Q166J44476r6440P894j39336Q6078
$$ y = [646653, 126261, 178410, 579629, 640345, 462601, 305058, 241614, 638278, 262047, 185458, 206429, 431975, 331152, 438415, 329558, 343136, 539705, 255092, 497145, 106869, 295293, 216060, 329694, 351081, 419178, 364354, 457308, 152348, 419964, 729110, 735368, 269380, 142694, 405683, 94748, 225332, 167216, 318371, 337990, 251820, 290538, 12956, 396201, 317634, 524794, 409719, -32869, 507131, 529538, 222949, 36567, 503338, 374692, 133853, 54171, 168837, 494193, 233163, -524, 252946, 409677, 485073, 136925, 258237, 347513, 88036, 277639, 444893, 395171, 547048, 653702, 164423, 739005, 43948, 382446, 205234, 307224, 279835, 37435, 444888, 208357, 237943, 246109, 390585, 294145, 302039, 162703, 248781]
13525B48781l0009r9098J21276J35012A47883J16383A28861K74000A51463R0123
13515B41586J9959J63044k5459J62050A79259f5360A03426c6352E18277B51564
13504D14872j04158p0519L18560j57067m4738J69333B10524O583D1624N35982
13494E77606G827M39450I0169J30915J32996j03164N7515m2376j9698O6444j32249
13483A80552L04437e047C49008p7916r4101L29376A92942L37817f0801D02735
13472C30322A30191a10375B36523n6545E0288C0N24389B11100R4168j26276J41363
13461C20355n4481J13842f9013C62095D6710K30906j04768M21159n979H5777J1386
13450I7163J83374i6650r130B02975l5124m1314K4679b43630A13168E0025J14978
$$ y = [248781, 218772, 119674, 240950, 375962, 147883, 264266, 128861, 402861, 151463, 241586, 261545, 424589, 399130, 561180, 179259, -65360, 103426, -36352, 518277, 251564, 414872, 310714, 240195, 558755, 401688, 356950, 526283, 210524, 217107, 41624, 577606, 7827, 447277, 90169, 221084, 354080, 250916, 308431, 266055, 246357, 312801, 180552, 484989, -5047, 349008, 271092, 176991, 506367, 192942, 530759, -60801, 402735, 330322, 130191, -110375, 236523, 179978, 50288, 30, 524419, 211100, 305268, 178992, 320355, 265874, 379716, -69013, 362095, 46710, 277616, 172848, 594007, 588028, 85777, 97163, 280537, -96650, -105780, 202975, 167851, 126537, 151216, -243630, 113168, 50025, 165003]
13439A65003M6865b2077B36634J08351N7491A80922J35847e1819E2000M7732L38449
13428D38181j25126K03584A72704b01723C82483b3198A96843B9322O898K432R8852
13417A37504J07011n9421p4782P6292K844J62411R1605n5994j68803R7864J22357
13406D38888B1424J29932P2016o5765D5844K2740L92874A48454J99515k3895j06071
13395B18003h0257A45611o4705b9002D82770A21853C4309M0886J34678J35714
13385C45587J58086k31369Q302a58377A17486J62502j6750L1529C4081J1610L78535
13374D24226A24715o0261g9052A31192j0063J32628A05024R424A3693K48464J17024
13363C79181j31385k716a63007G0948e1748E28778B9650L01152A55888J52204
$$ y = [165003, 211868, -22077, 236634, 344985, 402476, 180922, 316769, -51819, 52000, 99732, 438181, 313055, 516639, 172704, -201723, 382483, -23198, 196843, 29322, 36220, 38652, 137504, 244515, 185094, 110312, 186604, 189448, 351859, 443464, 387470, 218667, 316531, 438888, 21424, 151356, 223372, 157607, 45844, 68584, 461458, 148454, 347969, 324074, 218003, -80257, 145611, 80906, -29002, 482770, 121853, 34309, 75195, 209873, 345587, 503673, 272304, 280606, -158377, 117486, 279988, 263238, 294767, 34081, 45691, 424226, 124715, 64454, -79052, 131192, 121129, 253757, 105024, 114448, 13693, 262157, 379181, 247796, 245080, -163007, 70948, -51748, 528778, 29650, 330802, 155888, 308092]
13353C08092j10066N0266a3712r2509A98601J28485J40128j85065g8828B00651
13342D65249J9469j26159r3250j22442m2699g8594G463K59021q3294L3202D5042
13330a53262B17769j4640J8119K7896o3392e5587B39981j5221k2740K14789j80995
13319B35814j2189N057K61976B43101K8560F9797J25391Q526a2825D40463b08165
13307C74063b806m2508B19361R668l6443K59088a11707e2654A03598J91851j00370
13296A95079A638K46375j03115E9831L2461R4708N1714L822J28511j43767D394
13284A90839a15143K0764G9175M56684A25290L53143a07666D49266k11750c6601
13273B4617J04750J21520r0036G4313A8635J80364a22762F3919J27497J001Q1130
$$ y = [308092, 198026, 248292, -13712, -106221, 198601, 327086, 467214, 282149, -78828, 200651, 465249, 484718, 358559, 265309, 142867, 100168, -78594, 7463, 266484, 183190, 216392, 45042, -153262, 217769, 203129, 221248, 249144, 185752, -55587, 239981, 224760, 202020, 416809, 235814, 223625, 228682, 490658, 243101, 271661, 69797, 195188, 203714, -12825, 440463, -208165, 374063, -2806, -45314, 219361, 229029, 192586, 451674, -111707, -52654, 103598, 295449, 195079, 1638, 248013, 144898, 59831, 92292, 187000, 238714, 242536, 371047, 227280, 4394, 190839, -115143, -94379, 79175, 535859, 125290, 478433, -107666, 449266, 237516, -36601, 24617, 129367, 250887, 160851, 74313, 18635, 198999, -122762, 63919, 191416, 192417, 273547]
13262B73547c07748B24999m6657L5204q0677K39893H6161I070a70533A63028a28191
13250A93764J29627c39515G8541K53650D0268a00555A27852K44742K8338I3520
13239A27732J71863A22261a39479d8331j57515b1778p8089A60910Q5779Q7667
13229C34356b36032A22424i768A15604O4799J7142K0283J11913r7135k7859C4989
13217B98080E07J15893h359j22360m9994E3433J43506L6911M7807j2619i4279
13205e7093A95719J53537e8589E8570d337k99819f0003j75555C3021J04414c8998
13193A9338K80348L0498rj46449l8833Q813C7711R3218g0423A66307R268O9771
13181B45346l6872o8308H706J21842E1198a76577n4128A65465F7877Q7615J38386
$$ y = [273547, -307748, 224999, 178342, 213546, 132869, 372762, 86161, 9070, -170533, 163028, -128191, 193764, 323391, -339515, 78541, 332191, 40268, -100555, 127852, 372594, 400932, 93520, 127732, 299595, 122261, -139479, -48331, -205846, -21778, -99867, 160910, 246689, 334356, -236032, 122424, -9768, 115604, 180403, 197545, 217828, 329741, 232606, 204747, 34989, 298080, 507, 116400, -8359, -130719, -180713, 53433, 196939, 233850, 281657, 269038, -94279, -57093, 195719, 349256, -58589, 58570, -4337, -304156, -60003, -235558, 33021, 137435, -38998, 19338, 299686, 330184, 330175, 183726, 144893, 153706, 37711, 130929, -70423, 166307, 175575, 245346, 208474, 140166, 8706, 130548, 51198, -176577, -230705, 165465, 67877, 155492, 293878]
13170B93878o6836B3746J86616o2477f7348a6297l8239A84777G2869P1775a66442
13158g1773B22780Q0770a41255q0580a05949B7581J48353C6760P8346f8594G8993
13146H3553g5991A6288a80964Q3612K3005B40200J6415A07923a40869C68515r1548
13135B76967d421H2039J29337k7694i7564H3793B2374J9510q271K5907b3471F066
13122A37556K17547a44527B03184i9293B05343k7625a33360I0569P9710m7840
13112A22439J441i0284k59861A35380n5762h9130F1448a52548e8112J517b0718
13100A71256o8198a67374F7677f0474B18203b2433i136B85548c34419A58750d2810
13088B08714j8170a25009B76002I4651A3447h558A688a72652E5729J4799d9960
$$ y = [293878, 227042, 23746, 210362, 147885, -67348, -16297, -54536, 184777, 72869, 144644, -166442, -71773, 222780, 303550, -141255, -221835, -105949, 27581, 175934, 36760, 115106, -68594, 78993, 83553, -75991, 16288, -180964, -97352, -74347, 240200, 256615, 107923, -140869, 368515, 276967, -4421, 82039, 211376, 183682, -97564, 83793, 22374, 41884, 33613, 59520, -23471, 6066, 137556, 355103, -144527, 203184, -99293, 205343, 177718, -133360, 90569, 170279, 122439, 123880, -90284, -350145, 135380, 79618, -89130, 61448, -152548, -58112, -56595, -20718, 171256, 103058, -167374, 67677, -60474, 218203, -22433, -9136, 285548, -334419, 158750, -42810, 208714, 190544, -125009, 276002, 94651, 13447, -8558, 1688, -172652, 55729, 70528, -49960]
13076a83908B2416K36482H8482J52213r0670h9912A76374O192p1155a18677m4223
13065a62900j22382a7488G5018b5931A97482C9348P3778K7529j0583q873B4212
13053C35849q8839C649b5465D0420N8910P5758K3392a08542A34989Q9191b01201
13041b13964A59459k8161A5350J25096N1118a53724B36704K69251A7790M93669
13031E11459A77907c08622B18680Q701G9855L0933J6303J07813d1131p9420c025
13019d1235D7216R8476M9457H9979M3321a68461A133B88K48770o9988J14378m1650
13007B51798L013C0862P9031j3281K4741K24937r9936j17154k740J74176a51700
12995F8596d9478j7528A96532h0839Q206A56131b2571m7409n2064B3334O559G72
$$ y = [-183908, 22416, 258898, 88482, 240695, 150025, -89912, 176374, 182566, 111411, -118677, -162900, -285282, -17488, 75018, -25931, 197482, 39348, 113126, 140655, 130072, 121199, 24212, 335849, 247010, 3649, -25465, 40420, 99330, 175088, 198480, -108542, 134989, 224180, -201201, -213964, 159459, 131298, 15350, 140446, 191564, -153724, 236704, 505955, 17790, 511459, 177907, -308622, 218680, 227381, 79855, 110788, 127091, 234904, -41131, -120551, -3025, -41235, 47216, 145692, 195149, 89979, 133300, -168461, 1133, 288, 249058, 179070, 293448, 251798, 254811, 30862, 109893, 96612, 121353, 346290, 246354, 129200, 126460, 300636, -151700, 68596, -49478, -67006, 196532, -80839, -72633, 156131, -22571, -69980, -122044, 23334, 29893, 772]
12982A16746O0553p3285K9700K53919j48110G1432g124H4115a06344K9350B35794
12970E5995J66118i0336F2687Q4171E0379J1066g953I1120g2440A02975b75130
12958A35932i3688k9682A40121a91346A42052R343l4364g8745F7200N2363J38123
12947B57686c7602C4962a15322D4686M7243b9256G430Q6195f7900A23395n9345
12936F4050c7544j62354B28200j350f4421k401l02297B8456K00133O2935j11651
12925A79873F8789Q394J88005d4028a7634A6646a61553n5677D1494J28635e600
12913h7492B51095B7693a34698B9120J78524B4771i3083G7565h8151F4273p482
12902E6791b65033B01250b52550A17928B6486e5599A15296b9264o0064H6664a00223
$$ y = [116746, 177299, 104014, 133714, 387633, 239523, 71432, -7124, 84115, -106344, -76994, 235794, 55995, 222113, -90336, 62687, 146858, 50379, 61445, -7953, 91120, -72440, 102975, -275130, 135932, -93688, -123370, 140121, -191346, 142052, 151395, 117031, -78745, 67200, 119563, 257686, -37602, 34962, -115322, 44686, 91929, -29256, 7430, 93625, -67900, 123395, 64050, -37544, -199898, 228200, 226850, -64421, -66822, -369119, 28456, 228589, 291524, 179873, 68789, 77183, 265188, -44028, -17634, 16646, -161553, -217230, 41494, 170129, -5600, -87492, 251095, 27693, -134698, 29120, 207644, 24771, -93083, 77565, -88151, 64273, 56791, -265033, 201250, -252550, 117928, 26486, -55599, 115296, -29264, -89328, 86664, -100223]
12890a72381R77D71199g2016B28167b94889G5158c1283a2562p5109A63862K7910
12879A91772J12559g231A43986k6775P0441G1314k5939k1050a29863N4970A08750
12867E0243b84183A86933e0377h40A07680d9101j2234j2704C47050a14653H6936
12855a3607q8030B28320b50136f8711A12660f5258a942j6291D90135a05504k12731
12844c18235C808a33160D6012f1951B18912E1984A6921R9655a43620a9525k0441
12833c9966A61012J72918a31709f2812A12339a21502F8444g2749A04504j6270
12823H8234g655l5926B35103f6003A91203A2179L6923a27317A65691b05809g3657
12811i3313B61785A1720J41151e003B96745a27699m3185P9315j33081O8107P4271
$$ y = [-172381, -171404, 471199, -72016, 228167, -294889, 75158, -31283, -12562, -87671, 163862, 191772, 304331, -7231, 143986, 117211, 187652, 71314, 45375, 24325, -129863, -74893, 108750, 50243, -284183, 186933, -50377, -840, 107680, -49101, -61335, -74039, 347050, -114653, 86936, -13607, -101637, 228320, -250136, -68711, 112660, -65258, -1942, -18233, 490135, -105504, -318235, 3808, -133160, 46012, -61951, 218912, 51984, 16921, 116576, -143620, -19525, -39966, 161012, 333930, -131709, -62812, 112339, -121502, 68444, -72749, 104504, 88234, -7655, -43581, 235103, -66003, 191203, 12179, 49102, -127317, 165691, -205809, -73657, -93313, 261785, 11720, 152871, -5003, 296745, -127699, -170884, -91569, -224650, -156543, -82272]
12800h2272l6180E4788J42221H6432J96885c12572i960A67196r402e3265p2017
12789a25282A09663m5397a16755A13152d2275G1930b06044a617E2040i868F1919
12777A67167l648c6974E9998i7630D734a344B39237G5615e3997l40468F4492a5127
12764a32568M1780j6449F0647k154P6867J61499b35723a996q8501j06392I5367
12752d1458A03362c7198B33095i650A55751g7788F6462P3190a14743K5979B56996
12740C17742j36259B3860f3152A09951J90409A43995j1509g4151A4936M20744
12730D35680b55809B53653G7070e2844G4027a48111A97771a58049b5120j02437
12720a27557b6636A24919a67747A38550O5440O4865j13826M4658g7293A34730
$$ y = [-82272, -118452, 54788, 197009, 86432, 283317, -312572, -9960, 167196, 157794, -53265, -125282, 109663, 64266, -116755, 113152, -42275, 71930, -206044, -1617, 52040, -9868, 61919, 167167, 163519, -36974, 59998, -97630, 4734, -1344, 239237, 75615, -53997, -394465, 64492, -15127, -132568, -90788, -107237, 60647, 58493, 135360, 296859, -235723, -1996, -90497, -196889, 95367, -41458, 103362, -37198, 233095, -9650, 155751, -77788, 66462, 139652, -114743, -88764, 256996, 317742, 181483, 23860, -63152, 109951, 300360, 143995, 132486, -74151, 14936, 435680, -255809, 253653, 77070, -52844, 74027, -148111, 197771, -158049, -25120, -127557, -26636, 124919, -167747, 138550, 203990, 268855, 155029, 199687, -77293, 134730]
12709E0254h7570A74675J65142j51752Q917H5216J60433J87715c42366a19001
12698c8345A16187b57345H1702P8425L0923f3389L0284B54852a14588A37497j1526
12687A25971h7059B01694R615o3383C7484K54813A27099d10743f123A52028b7689
12675G1536L43687I4533J21834Q7733b03959i23A97478J10309p3139i6574o2501
12664a59075D19192j03902A32613a15667E78L14249p1005G16K9509Q4195J8732
12653A33152m1164k164J0757a30415A06476J01472b11146C5372a54850A05362
12642i8020c2892B21259k7139I5093b93403A717K37199E3093a11467n7997c9798
12630D30808r7137K7926a71784C49717a33169A18583K1501K31854D8490K29631
$$ y = [50254, -87570, 174675, 339817, 188065, 196982, 85216, 245649, 433364, -342366, -119001, -38345, 116187, -257345, 81702, 160127, 191050, -63389, -33105, 254852, -114588, 137497, 125971, -87059, 201694, 211309, 147926, 37484, 292297, 127099, -410743, -6123, 152028, -27689, 71536, 415223, 94533, 216367, 304100, -203959, -923, 197478, 307787, 234648, -96574, -159075, 419192, 315290, 132613, -115667, 578, 314827, 243822, 716, 30225, 114420, 133152, 91988, 89824, 100581, -130415, 106476, 207948, -211146, 35372, -154850, 105362, -98020, -32892, 221259, 194120, 95093, -293403, 1717, 238916, 53093, -111467, -169464, -39798, 430808, 333671, 361597, -171784, 349717, -133169, 118583, 140084, 371938, 48490, 278121]
12620B78121G6926K19790H6893h3092j79465a21880A80455p5773d496B56205g6319
12608A89164h9029K092A24088a08800A00669R7434C4687M8347L767J57098j11755
12597A32144B812R8752K41549c18633d2927H475K82579a20909jH7714e1028j68100
12585b19128C2780J17896a34958A12653l9333d2531A6579a28622A13196J3268
12575A26464E9255a99805I795b74609A21561L0372J7234g545p1303n1358A15179
12563c24305A75069a6272A36689J16936d4967C0038a47522j4645B1406L30172
12553C51578A33351a81034B05673q6782j2973R5259b00209A09021A9039c6886
12542b36667g0121k1233C56660A01006J8795c1250p7206A16062J85666a9933A01017
$$ y = [278121, 76926, 296716, 86893, -83092, -262557, -121880, 180455, 104682, -4496, 256205, -76319, 189164, -89029, -86937, 124088, -108800, 100669, 198103, 34687, 83034, 86801, 243899, 132144, 2812, 101564, 343113, -318633, -42927, 8475, 291054, -120909, -120910, 87714, -51028, -219128, 32780, 150676, -134958, 112653, 73320, -42531, 16579, -128622, 113196, 126464, 59255, -199805, 9795, -274609, 121561, 151933, 169167, -7545, -78848, -130206, 115179, -324305, 175069, -16272, 136689, 253625, -44967, 30038, -147522, -162167, 21406, 351578, 133351, -181034, 205673, 118891, 105918, 201177, -200209, 109021, 19039, -36886, -236667, -70121, -91354, 356660, 101006, 119801, -31250, -108456, 116062, 301728, -19933, 101017]
12530A10247J28792c6184A06945J58060p5785b83793D9740M8299a62701d0217
12519A17351k51g5229A63921b6567A49060J02349a31590j22477C7734J83770H8237
12507A37027m2550b3894B18958C1854O5199a15223A47861G3013k079R3624J12112
12496B76670A08980C7983a98005O3741J4936r1039G5152m704J12389a68788C00931
12484h7981H156a70637c0983E3702k1286b6940A27113a32079F6110b5958l2023
12473e7981l06269B5007K10383b09589A70899a38958B25147n5956E1079k83A1000
12461I8643B8121b0357G1607b18542j60241f2152m6516e3422A83899q8902M03044
12450D98041j22117f4579A01719O7809f9984A67501b58662a5418j32566n5047
$$ y = [110247, 239039, -36184, 106945, 265005, 189220, -283793, 49740, 98039, -162701, -40217, 117351, 117100, -75229, 163921, -26567, 149060, 251409, -131590, -254067, 37734, 221504, 88237, 137027, 94477, -23894, 218958, 31854, 97053, -115223, 147861, 73013, 70934, 164558, 276670, 108980, 37983, -198005, -134264, -119328, -210367, 75152, 70448, 182837, -168788, 300931, -87981, 8156, -170637, -30983, 53702, 32416, -26940, 127113, -132079, 66110, -25958, -57981, -364250, 25007, 235390, -209589, 170899, -138958, 225147, 169191, 51079, 50796, 11000, 98643, 28121, -20357, 71607, -218542, -378783, -62152, -108668, -53422, 183899, 94997, 498041, 375924, -64579, 101719, 169528, -69984, 167501, -258662, -15418, -147984, -203031]
12440b03031A50873K30857b04577C10117a34780F0364e2522H5780a39885f2795
12429a20421A03702K64898b34566J10780A73273A4217J66984j5144b0897E9580
12418A75259a34839A16524f5129D28695b72123a03904G3876C0212P0630a9521
12407A33034b04156j734P8994m1424n8815f5839A230J21939a85568D76879E5011
12395D37730A54778G4205b38673e6502H8185L0793O6531p3568b31896B08094c9917
12383a32389B23906c12472a52262D0703K47485D9354a52999L5625k94065g6703
12372b55257A31636B0607b4830A78594f7691I5164a89650K1188O4915A2768M4576
12361E7344J8951k9307a0505r3518E7072a4240I5217c09028a12593A19201l4830
$$ y = [-203031, 150873, 381730, -204577, 310117, -134780, 60364, -52522, 85780, -139885, -62795, -120421, 103702, 368600, -234566, -123786, 173273, 14217, 181201, 166057, -20897, 59580, 175259, -134839, 116524, -65129, 428695, -272123, -103904, 73876, 30212, 100842, -19521, 133034, -204156, -205890, -126896, -168320, -227135, -65839, 1230, 123169, -185568, 476879, 55011, 437730, 154778, 74205, -238673, -56502, 88185, 118978, 185509, 111941, -231896, 208094, -39917, -132389, 223906, -312472, -152262, 40703, 288188, 49354, -152999, -117374, -411439, -76703, -255257, 131636, 20607, -24830, 178594, -67691, 95164, -189650, -168462, -103547, 12768, 57344, 76295, 46988, -10505, -104023, 57072, -14240, 95217, -309028, -112593, 119201, 84371]
12350H4371a33649C76757a4043A57724J20553a6871r8785J2835K8276a7203m032
12339b1235K771A54940d4332C82121g9906k17021a0489A96060a81644c4764j16414
12328a51178A0474K43041B3925a3242j98461c5376B8892L8795K26303a26771k5604
12317a52375F6987P5046J40841H9193a35670j42830a10167f676k32617a9328p3942
12306i3270j38303g8825k1434c3995A89079I3219a19393d8815F7528e75E1329
12294A07127a53869B18536c7889a5164B16151L5493L7406j07748a63373B47548
12283b54352C52059e31747b9476H5309F126c1780C09561F1119b1087B47822b3872
12271B82311p005a29315A48436B7042a64911B20295P8454j44601j1716a67631
$$ y = [84371, -133649, 376757, -14043, 157724, 278277, -16871, -115656, -102821, -74545, -17203, -21235, -18464, 154940, -44332, 382121, -79906, -296927, -10489, 196060, -181644, -34764, -151178, 10474, 253515, 23925, -13242, -211703, -35376, 28892, 67687, 293990, -126771, -152375, 66987, 142033, 282874, 89193, -135670, -278500, -110167, -6676, -239293, -19328, -93270, -231573, -78825, -100259, -33995, 189079, 93219, -119393, -48815, 67528, -575, 51329, 107127, -153869, 218536, -37889, -15164, 216151, 251644, 289050, 181302, -163373, 247548, -254352, 352059, -531747, -29476, 85309, 6126, -31780, 309561, 61119, -21087, 247822, -23872, 282311, 275306, -129315, 148436, 27042, -164911, 220295, 298749, 154148, 142432, -167631]
12260a9692B66685r6836D860K05296B3087O2387J33244J8247e5946A95994l0214
12249A65780J27213a37127f5168D5823P6106D9416K589j3412J2459E882a02726
12237C96577A29832K9719L865n2635J9908j8785e9707C04583j05712G6718N3335
12226A30053j6783k0107L26032a4123D09900H5462K41955j6534J1626A53695O73286
12215H26981C81680R8e3540A3722O46393f8803A25644a1494A37282h3520F3637
12203A682J46286K80406R1069A04276J86092j20185P031R6048a156A46083o1826
12192H4257C8643J66414l2599n1785k8801L11910a35758A45091a70678L5208j08006
12181b43476B7303J71362O5259m3705Q980J86049N203j20249R2326a49256B9058
$$ y = [-19692, 266685, 169849, 4860, 210156, 23087, 85474, 218718, 236965, -55946, 195994, 165780, 292993, -137127, -65168, 45823, 121929, 49416, 52005, 38593, 51052, 5882, -102726, 396577, 129832, 159551, 163416, 110781, 130689, 111904, -59707, 304583, 198871, 76718, 130053, 113270, 93163, 419195, -14123, 409900, 85462, 327417, 310883, 322509, 153695, 826981, 381680, 381778, -53540, 13722, 660115, -68803, 125644, -11494, 137282, -83520, 63637, 1682, 147968, 428374, 519443, 104276, 290368, 170183, 177214, 273262, -1156, 146083, 84257, 38643, 205057, 172458, 120673, 91872, 403782, -135758, 145091, -170678, -135470, -243476, 27303, 198665, 263924, 220219, 229199, 415248, 420451, 300202, 392528, -149256, 29058]
12169C39613F9225C3302B262R0643i7344A33214f3267G9245Q3931J74107B4984
12157G3316a22274A72831b66037D4274M2344e4634C92813b16562A1306J73173
12147A84479M4910b03240l5221c7377j24384O8348H3047C4274A6571a46031B41721
12135a62341M8990B41964l9834a50251A23391P8239a85626C079L40840i1156E52
12123a13988j07313c8029B01100f8781B678b29730H4681b31183B40089a61129
12112A33459R3247l0118j1047O5715a46009F3877K40500F8469J21559a19208a5323
12100a51302k65409J50537o6349A1825g9063A12869f2497D7456a01186p4045C0955
12088a07496n5820N9874J5829G4745a27207f1251j640C3815K31326J145462M9140
$$ y = [339613, 69225, 33302, 2262, 92905, -97344, 133214, -63267, 79245, 163176, 337283, 24984, 73316, -122274, 172831, -266037, 44274, 86618, -54634, 392813, -216562, 11306, 184479, 229389, -203240, -238461, -37377, -161761, -93413, 83047, 34274, 16571, -146031, 241721, -162341, -113351, 241964, 202130, -150251, 123391, 201630, -185626, 3079, 343919, -91156, 552, -113988, -221301, -38029, 201100, -68781, 2678, -229730, 84681, -231183, 240089, -161129, 133459, 226706, 196588, 185541, 251256, -146009, 63877, 304377, 68469, 190028, -119208, -15323, -151302, -416711, -266174, -332523, 11825, -79063, 112869, -62497, 47456, -101186, -175231, 30955, -107496, -163316, -103442, -87613, 74745, -127207, -61251, -62891, 33815, 265141, 1410603, 1459743]
12077A459743o63490A00732B2411L7375f6975j9781r3768h6000L7421C2361J7568
12066D9929b77593b8653k7841A96935d5620A6931c701F9759b47380a02201B2494
12054e4452E8465K03143D5918n490K97085g310F6359b6954j53658Q8745A56431
12042B83239b51930j23011B58668a69714A6151i46A734a4376F1392j9274c55012
12030a7143C2330a56091H8716h9442j63853f2049b1076A00528b78875A28964A5951
12018A43355i5954d4298k184F1798d3509E4375e4138q5616r3176N6370H5659d3655
12005i937k8811A77162a33457L0032l00333A78905a45829o046c6170k94D12K61208
11993B61620E8915b43737I42g4850H9885a35076r9987R1580B24920b457q8377
$$ y = [1459743, 796253, 100732, 22411, 59786, -66975, -86756, -180524, -86000, -48579, 32361, 49929, -277593, -28653, -56494, 196935, -45620, 16931, -3701, 69759, -247380, -102201, 22494, -54452, 58465, 261608, 45918, 40428, 337513, -7310, 66359, -26954, -180612, -91867, 156431, 283239, -251930, -374941, 258668, -169714, 16151, -946, 1734, -14376, 61392, 42118, -355012, -17143, 32330, -156091, 88716, -89442, -253295, -62049, -21076, 100528, -278875, 128964, 15951, 143355, -95954, -44298, -46482, 61798, -43509, 54375, -54138, -139754, -232930, -176560, 85659, -43655, -9937, -38748, 177162, -133457, -103425, -403758, 178905, -145829, -151875, -36170, -36464, 412, 261620, 58915, -243737, 942, -74850, 89885, -135076, -235063, -143483, 224920, -2457, -90834]
11982i0834j41710r7105b9493B20840K03225a13729C10890A52251J0367a48879
11971B92074A45217a0669j46977e7997j7973A30038a09742A08028c3932D9748
11960C1939a91019N8146B24452i4465F0402f2438A1894Q0263N1703Q205a4728
11948i8734D9712a65443A3329R4751a46844F7950R0453K421o5179k7617a76949
11936b43408k8445H0432a77405B9318c4177l15922g807q3434H4192b39033B29502
11924i5971a798l2240l31816C9302a92512F74a09541I1264J79028R121Q7056a16372
11911c06636D41918i4380D17969j42641b90545M2275A09481c3116B7441M6851
11901G4292b23035i8654j02254j95234B46662a57037n7862j64047P3674D1191
$$ y = [-90834, -232544, -329649, -29493, 220840, 424065, -113729, 310890, 152251, 162618, -148879, 292074, 145217, -10669, -157646, -57997, -75970, 130038, -109742, 108028, -33932, 49748, 31939, -191019, -132873, 224452, -94465, 60402, -62438, 11894, 92157, 143860, 152065, -14728, -98734, 49712, -165443, 13329, 108080, -146844, 67950, 158403, 160824, 95645, 68028, -176949, -243408, -271853, 80432, -177405, 29318, -34177, -350099, -7807, -91241, 84192, -239033, 229502, -95971, -1798, -34038, -365854, 39302, -192512, 674, -109541, 91264, 270292, 279413, 366469, -116372, -306636, 441918, -94380, 417969, 275328, -290545, -248270, 109481, -33116, 27441, 74292, -223035, -98654, -200908, -396142, 246662, -157037, -214899, -378946, -305272, 41191]
11890b87448B89925a93224M2552r1092D9085c58700g7036A42595P9554b67086
11879c89528B75205B5992Q7732i8201J5789A5145Q8705d07705a53748I6768g1946
11867A14687a7569k50335g2312A0037d6380l3993J417H473e9938D7473f7183q7977
11855a55160B09792E0739a24657e4834J7438A24331a54086j1278b3372k91159
11845c14531g7763J4626E7764J35213d1030k0763n2435L9209m0869C2323d5390
11833e39839A72630a41494E648a20920B06809L50303a10986c2197I154b88636
11822b26670P8931H1690g6483q936j96842n8586e7785A81270o0475b17107A53341
11810B06013A0870d2266B78971A20713b40024a0063I7820N3376b5607a0317B3274
$$ y = [-287448, 289925, -193224, -150672, -241764, 49085, -358700, -77036, 142595, 222149, -267086, -389528, 275205, 25992, 113724, -98201, -82412, 15145, 103850, -407705, -153748, 96768, -71946, 114687, -17569, -267904, -72312, 10037, -46380, -80373, -78956, 8473, -59938, 47473, -67183, -155160, 209792, 50739, -124657, -54834, -37396, 124331, -154086, -165364, -23372, -314531, -77763, -63137, 57764, 192977, -41030, -61793, -114228, -75019, -115888, 32323, -45390, -539839, 172630, -141494, 5648, -120920, 206809, 557112, -110986, -32197, 9154, -288636, -226670, -147739, 81690, -76483, -85419, -282261, -340847, -57785, 181270, 120795, -217107, 153341, 206013, 10870, -42266, 278971, 120713, -240024, -10063, 97820, 151196, -25607, -10317, 23274]
11798B86257d3485H5274b84678B33098a18905G559Q0310L47551c2640k51302A2897
11786B75600a32294A29639e8791A03180D3023a42940b8526p1213B8060b81349
11775a01542L006D5630a44741I7479i0508F4769J34595d8897p4594c8357c329
11763B48286j20058C9932J06406K9600H1333J10280a94284R1241A86559H7304
11752C29772A1474J05429J2623c40868h2546A273J64094a65198J9525A57430h3254
11740f6782A29462n3828k8069J87317a14026D3035M4520J70074c63796A70852
11729f1394k84614g8977A23542A3936a65654A35473E757J65296k3582A459a55427
11717F0882K662M0291J70415a09688j6405C3392b0022j58067B11334E123b70735
$$ y = [286257, -43485, 85274, -284678, 233098, -118905, 7559, 87869, 435420, -32640, -283942, 12897, 275600, -132294, 129639, -58791, 103180, 43023, -142940, -28526, -99739, 28060, -281349, -101542, -98536, 45630, -144741, 97479, -90508, 64769, 199364, -48897, -123491, -38357, -3329, 248286, 128228, 39932, 146338, 175938, 81333, 191613, -194284, -103043, 186559, 87304, 329772, 11474, 116903, 129526, -340868, -82546, 1273, 165367, -165198, -145673, 157430, -83254, -66782, 129462, 75634, 47565, 234882, -114026, 43035, 87555, 257629, -363796, 170852, -61394, -346008, -78977, 123542, 13936, -165654, 135473, 5757, 171053, 147471, 1459, -155427, 60882, 63544, 103835, 274250, -109688, -126093, 33392, -20022, -178089, 211334, 5123, -270735]
11705c18380A1901c4071I9787C9322f9119r4407C25036H827N6964K50136j34985
11694A80942G5137k3121a69766l9537A16914L2470J03641H8245B0200b16145b8102
11682f5083C0291K44979A26596l1795h615F3228k5538K00172a38181f8096j91224
11671b59320A53278o5110e6351B37015k9926E7149J95155a41111O6820b9084A50299
11659a31004A33013F055K4750b91596L9572h822A02369J28624c18344b4632B01285
11647g0432I7380M67498b26877j34571C950e9910A59952c43209C3310f080B32244
11635d3645N472A89526p4146M6537O2001g5309I8913b3485A91324M027b47983
11623F1654K92147A19779K32474l9681a01782R925B00120b29940A70796J4228
$$ y = [-318380, 11901, -34071, 99787, 39322, -69119, -163526, 325036, 8827, 65791, 315927, 180942, 75137, 52016, -169766, -209303, 116914, 149384, 253025, 88245, 20200, -216145, -28102, -65083, 30291, 275270, 126596, 94801, -8615, 63228, 37690, 237862, -138181, -68096, -259320, 153278, 88168, -56351, 237015, 207089, 57149, 252304, -141111, -74291, -29084, 150299, -131004, 133013, 6055, 30805, -291596, -252024, -8822, 102369, 230993, -318344, -24632, 201285, -70432, 97380, 564878, -226877, -361448, 3950, -59910, 159952, -343209, 33310, -6080, 232244, -43645, -38173, 189526, 115380, 161917, 223918, -75309, 98913, -23485, 191324, 195351, -247983, 61654, 353801, 119779, 352253, 312572, -101782, -91857, 200120, -229940, 170796, 185024]
11613A85024a41717B77756a7586p3683B88287b16462B5475b64355A96400o8144
11603A28256J4789K82611A54828D9929q61J81830l2202D6873J20574e9439A23078
11591b5964A17154o120J21322q9308J4800k7933e4560C18244o8802j23339e0267
11579D0043a7357n7438j87121B15425a62006A18581L0728N6767R7491A38555I302
11567b05772F0385d9247B66662o2021p29q5715C8294a11834B89836c35075A09382
11555B25223h3326j06050A3063K40061E6364B401b3761k45362F50b08414I6605
11543b88613E00394F770a24403A1136a77633h4061B78908b88083c2484j23110
11533a55594M5793B29891K2783j3629H3344J07374D6333Q7834f2955D8962M0512
$$ y = [185024, -141717, 277756, -17586, -91269, 288287, -216462, 25475, -264355, 196400, 128256, 143045, 425656, 154828, 49929, 49068, 230898, 198696, 46873, 167447, -59439, 123078, -25964, 117154, 111034, 232356, 143048, 157848, 129915, -54560, 318244, 249442, 126103, -50267, 40043, -17357, -74795, -261916, 215425, -162006, 118581, 149309, 206076, 303567, 138555, 9302, -205772, 60385, -49247, 266662, 204641, 203912, 118197, 38294, -111834, 289836, -335075, 109382, 225223, -83326, -189376, 13063, 253124, 56364, 2401, -23761, -269123, 650, -208414, 96605, -288613, 500394, 6770, -124403, 11136, -177633, -84061, 278908, -288083, -32484, -155594, -109801, 229891, 252674, 239045, 83344, 190718, 46333, 134167, -62955, 48962, 89474]
11522H9474Q8992J27811E0834i5396L4861B95499L7994p3426r4632J66562j61344
11511A70653Q2103K04754k1660j26985g5175A06741c7231k5473A74015p4021N9340
11500A59334J51189g2014m4827n830b9888l6463A86557I358P9805Q0384b20429
11488a94244F6413e9723E7818C863e866A3930L4762L68472N1340o1205j12054
11477B95245b59811G2362J98710A34580a88328A70032c6288B13933J54301j69508
11467A98726M9669j14798h3097B37709b36809j028D188K15211B1893J61254B1847
11455B26868d4904k3379c174j1000A92141H110R3363L9124P1565c8794j49252
11444a88046B7440c09749B98112a16704A14962H371L4867L5497a38830H9142i384
$$ y = [89474, 178466, 306277, 50834, -95396, -60535, 295499, 333493, 260067, 165435, 331997, 170653, 252756, 457510, 435850, 308865, -75175, 106741, -37231, -62704, 174015, 99994, 159334, 310523, -72014, -116841, -122671, -29888, -66351, 186557, 9358, 89163, 169547, -220429, -194244, 66413, -59723, 57818, 3863, -5866, 13930, 48692, 417164, 468504, 407299, 295245, -259811, 72362, 271072, 134580, -188328, 170032, -36288, 213933, 368234, 198726, 248395, 133597, -83097, 237709, -236809, -237837, 4188, 219399, 21893, 183147, 21847, 226868, -44904, -68283, -3174, -14174, 192141, 8110, 101473, 140597, 212162, -38794, -188046, 27440, -309749, 298112, -116704, 114962, 8371, 43238, 78735, -138830, 89142, -9384]
11432a99951Q4062A26475D6368K37669b12611D7131j2374K509J00229a05511A05304
11420d4954j16487I01K35492i9088C32131a45512A18700A3377e5152r5567H6797
11408I4333b94917A83256m220m1417D2893O6526k3615i8304b4314B77169c67629
11396B565K3399K15451F6388e2504B16507j2363a87553F9562k7587O847d4120
11384b13405B43466b59243B8320M3800K02611h9229k9595D18882A25059d801A54025
11372e8796b5648D4725f586C4012J90005A993Q0842a22504k39013I6284h4748
11360c1470B0659c46656C26024A61461a28387c6042j73846J362E9370J64793b4755
11348I1649b90943e375F7833J74267n1597m2404f5558I2734a56336A84041l5899
$$ y = [-199951, -115889, 126475, 46368, 284037, -212611, 47131, 34757, 37266, 137495, -105511, 105304, -44954, -161441, 901, 236393, -99088, 332131, -145512, 118700, 13377, -55152, -150719, 86797, 94333, -294917, 183256, 179036, 137619, 42893, 109419, 85804, -98304, -24314, 277169, -367629, 2565, 25964, 241415, 66388, -52504, 216507, 204144, -187553, 69562, 41975, 48822, -44120, -213405, 243466, -259243, 28320, 72120, 274731, -89229, -118824, 418882, 125059, -4801, 154025, -58796, -25648, 44725, -6586, 34012, 224017, 1993, 82835, -122504, -361517, 96284, -84748, -31470, 20659, -346656, 326024, 161461, -128387, -36042, -209888, -208526, 59370, 224163, -24755, 91649, -290943, -5375, 67833, 242100, 190503, 148099, -65558, 92734, -156336, 184041, 148142]
11337A48142h3374c1490j79963E8429O4712J14804C3264h0658A09962k9546K61227
11326C41643A29737J0187n6121K0723c15741C454L716L17497a237A90988f0269
11314A09915J6392B949J86473h9944k2501A9283b41121C09338J807a59053a6409
11302b30653F8573b0095B10543b41653H5234e1055j75120B01926a98185B1541
11291D7968K02223C0465i7371b923B31133P6790b55107O0982p1490J02764B18162
11279a2648A13820c7673E0605c80877A11799e587j7455k55288M4820f1591A8273
11267A3100J96163A1280a85117B13801F7002b65132b5638k50749f7713j54446
11257b22159a5930n6997F4920c16695J44477A81485B4431C915K48734F4945b1416
$$ y = [148142, -83374, -31490, -211453, 58429, 123141, 237945, 33264, -80658, 109962, 80416, 341643, 129737, 139924, 83803, 104526, -315741, 3454, 7170, 324667, -1237, 190988, -60269, 109915, 126307, 2949, 189422, -89944, -112445, 19283, -241121, 309338, 311145, -159053, -16409, -230653, 68573, -20095, 210543, -241653, 85234, -51055, -226175, 201926, -198185, 21541, 47968, 250191, 30465, -97371, -2923, 231133, 307923, -255107, -194125, -265615, -162851, 218162, -12648, 113820, -37673, 50605, -380877, 111799, -5587, -23042, -278330, -233510, -61591, 18273, 13100, 209263, 11280, -185117, 213801, 67002, -265132, -25638, -276387, -67713, -222159, -15930, -72927, 64920, -316695, -172218, 181485, 24431, 3915, 252649, 64945, -21416]
11245A28586J59611i9364m5963f5893B52617a6815m64512F6299h4212r4329j95157
11234c73698J57989A42394K17255r359a47994A03304e9796j32838K1113F1217
11223a12277b1197k04565O2869C6558J0872a81155A61704j5443d6338a8129j05294
11212a23423A7044L9759a18464o5515C7708e9215n4881K6038j57149L5674J00823
11201a08710M1462j05249k30822C52629a40759a8465b629B04026a30502A2033
11190A70062J29554j29520g9290k76525A38149a22010M2152E052a17806A74602
11179B65767a33812l1742a9541j43124e5345j50034A26956j4847k3979a63720
11168I9413f8871B9786a76531A81766p0541c26026e7611b0662k85978A48400a74729
$$ y = [128586, 288197, -99364, -145327, -65893, 252617, -16815, -481327, 66299, -84212, -178541, -373698, -215709, 142394, 359649, 350290, -147994, 103304, -59796, -192634, -171521, 61217, -112277, -21197, -225762, -162893, 36558, 47430, -181155, 161704, 146261, -46338, -18129, -123423, 17044, 56803, -118464, -183979, 37708, -59215, -114096, -88058, -245207, -209533, -108710, -67248, -172497, -403319, 352629, -140759, -18465, -2629, 204026, -130502, 12033, 170062, 299616, 170096, -79290, -355815, 138149, -122010, -79858, 5052, -117806, 174602, 265767, -133812, -165554, -19541, -162665, -55345, -205379, 126956, 112109, 88130, -163720, 99413, -68871, 29786, -176531, 181766, 111225, -326026, -57611, -20662, -306640, 148400, -174729]
11156C103f4796n9580j19677j95271A09702a43991A23187a37869j09645F9737
11145H878d7506B44039h3876G6884A458g9587j30372J3403j2800B593J56851A1690
11132E4276B4281A990P4727C7278b7817E9797K732L04811A2472J8212L0612J0784
11120G2080J68681k8745E9186K92004j59859k2935G5497i6384M2288C74214a16168
11108i508n6183j41489A71862A3207a30024C67396e9391B987J75518J29004A28820
11096B63538g0380k1325b8291E9627J19340K53566k7425g4141A89186L8107K79943
11085E07236e3628A15767h5562C75307q3278N4533O7216A86606K92675j51804
11075C27477j40514M0731k6895R6793o7222J08669L24592j54907j55396j14839
$$ y = [3103, -64796, -124376, -244053, -439324, 109702, -143991, 123187, -137869, -247514, 69737, 8878, -47506, 244039, -83876, 76884, 1458, -79587, -209959, -196556, -209356, 2593, 159444, 11690, 54276, 24281, 1990, 76717, 37278, -27817, 59797, 62529, 367340, 12472, 30684, 61296, 72080, 240761, 212016, 59186, 351190, 191331, 168396, 75497, -96384, -54096, 374214, -116168, -9508, -65691, -207180, 171862, 13207, -130024, 367396, -59391, 2987, 178505, 307509, 128820, 263538, -70380, -91705, -28291, 59627, 178967, 432533, 405108, -74141, 189186, 227293, 507236, -53628, 115767, -85562, 375307, 292029, 346562, 413778, 186606, 479281, 327477, 186963, 227694, 200799, 297592, 230370, 339039, 663631, 508724, 353328, 238489]
11065B38489R7168J93741J75865j72326Q6246k47111L02652j489q4495L14325
11055I03065k66204J1874R5176B95163M97333K8837j45315K81666D69294n8902
11045D10392K94792O4576j68362R4895k29163j07075L04270L15346j29743O7677
11035I17605r1577k11407l9811J146l8875N0224o7740j03815K81901K03995j13441
11024G88205l6388j85468L26262j56559C26481J16295L1121J83839M29869k71206
11014H16399j59713J43420j20914k41282J83570k7221o9511J84314J25314J54659
11004I89035D48203K06031l06647N47104m41706K3084j2744l774L17620j4640
10994G62531l3473k10713l5649N48498j77939l756R8844j61404j59332L89992
$$ y = [238489, 335657, 529398, 705263, 532937, 619183, 372072, 674724, 673235, 588740, 903065, 636861, 648735, 743911, 295163, 792496, 821333, 676018, 957684, 469294, 410392, 705184, 769760, 601398, 696293, 467130, 360055, 664325, 979671, 849928, 917605, 826028, 614621, 574810, 575956, 537081, 587305, 519565, 415750, 697651, 901646, 788205, 751817, 566349, 892611, 736052, 326481, 442776, 473897, 657736, 1087605, 816399, 656686, 800106, 679192, 437910, 621480, 594259, 524748, 709062, 834376, 989035, 448203, 654234, 347587, 894691, 452985, 476069, 463325, 459551, 777171, 762531, 729058, 518345, 482696, 1031194, 853255, 849499, 948343, 786939, 627607, 1017599]
10984A017599j70728q3365L22830J57192P8228k9097p116L71977k94502P52431
10974B115449J84616L58937J19210k73901J85363j8132j97957l11616n8856k96829
10964A806284K00819m41190J14437K84395j10248K7423j65378N1269J75712K15151
10954B158674k99670k96197j95608r9613l08516k09875k84426K63166r3880j25211
10944E08844B48527m9193G6529o899L83067p32f7231B80326b72851D04187j31524
10933B72663J71738l0428B3908K33624j04200B0569J75444f4896B04544B6724
10922A15502l2800B0817a51957N4622B1775b78508a10095A01009m7713J3330a22603
10910a6652G0184J28779a60973A14791a73442G8785M5469d792j26337F8880a43227
$$ y = [1017599, 846871, 763506, 1086336, 1243528, 1321756, 1292659, 1285543, 1657520, 1363018, 2115449, 2300065, 2659002, 2778212, 2504311, 2689674, 2671542, 2473585, 2161969, 2103113, 1806284, 2007103, 1565913, 1680350, 1964745, 1854497, 1881920, 1716542, 1767811, 1943523, 2158674, 1859004, 1562807, 1367199, 1267586, 959070, 749195, 464769, 727935, 634055, 508844, 248527, 199334, 76529, 69630, 452697, 451965, -67231, 280326, -272851, 404187, 272663, 444401, 413973, 23908, 257532, 153332, 20569, 196013, -64896, 204544, 26724, 115502, 82702, 20817, -151957, -97335, 21775, -278508, -110095, 101009, 53296, 66626, -122603, -16652, 70184, 198963, -160973, 114791, -173442, 78785, 124254, -4792, -131129, 68880, -143227]
10898C6722b42263E9854K97149A9704c42594O7935d0659K0064G0230d78344A80791
10886a74948b9412j51224Q6396j68153A14698j260i3453A78J12373C3156R0728
10875A23884l5489a6873Q249j0105o9258j86002C799K10317I3436a48819m25337
10864e74156D74428a51178l2730A45208g2707J2385D82307A58301j6209f0056
10853A66253i7040n8520c48q6380A35960a2677A10593K00517a61717Q555C6371
10841a44747O7554l00427A6827g2695A4017F871f7101b2704j93238i5310C11170
10829a57326p2498A05320Q2289E6015e6659D56387b66183d6933C45104f117k39681
10818b45798f481j21806K2925A4660b70537H3715c2836A01285g8451C67545a48254
$$ y = [36722, -242263, 59854, 357003, 19704, -342594, -274659, -40659, -20595, 70230, -478344, 180791, -174948, -29412, -180636, -94240, -262393, 114698, 113438, -93453, 178, 112551, 33156, 123884, 88395, -16873, -8624, -18729, -87987, -273989, 3799, 214116, 93436, -148819, -574156, 474428, -151178, -183908, 145208, -72707, -60322, 482307, 158301, 142092, -60056, 166253, -97040, -155560, -348, -86728, 135960, -12677, 110593, 311110, -161717, -153162, 36371, -144747, -77193, -377620, 16827, -72695, 14017, 6871, -67101, -22704, -215942, -95310, 311170, -157326, -229824, 105320, 187609, 56015, -56659, 456387, -266183, -46933, 345104, -6117, -245798, -6481, -128287, -105362, 14660, -270537, 83715, -32836, 101285, -78451, 367545, -148254]
10806g200j12029A5737g944k90168d2114l04036l3795I3482a15428B50130H4032
10794a34840A6506a26016N0192g082D13846k00597F1041b39376A63174a86478
10783A2599b9062A61433c22866B00601a91743d7469n4668k1026o8267c248j4962
10772a8210B99222J4426H0723i089A77661A8355b03867A84183d3843B0355a21208
10760a27787p6394h5093B7809b64339I225J34180G0850L849b80880D2587a80915
10748A84194N1254a43140P994A388b20165F0120e1503j84559b1292m2265p8994
10737a42551k80955a36116d075A01500D128K9431a15230A19495b95024i3944k5401
10726a19345E7060J04940b15806A30485c4994N321D5277c02314n8963C224O4186
$$ y = [-7200, -119229, 15737, -7944, -298112, -42114, -346150, -379945, 93482, -115428, 250130, 84032, -134840, 16506, -126016, -75824, -7082, 413846, 213249, 61041, -239376, 163174, -186478, 12599, -29062, 161433, -322866, 200601, -191743, -47469, -102137, -123163, -191430, -3248, -18210, 299222, 313648, 80723, -9089, 177661, 18355, -203867, 184183, -43843, 20355, -121208, -127787, -204181, -85093, 27809, -264339, 9225, 143405, 70850, 74699, -280880, 42587, -180915, 184194, 235448, -143140, -135146, 1388, -220165, 60120, -51503, -236062, -21292, -63557, -142551, -423506, -136116, -4075, 101500, 4128, 33559, -115230, 119495, -295024, -93944, -119345, 57060, 162000, -215806, 130485, -34994, -29673, 45277, -302314, -361277, 3224, 67410]
10715F7410N5831l977a61442c8131j53670r1626C18306j19631j73h6708m5607
10704a32315C37746H7912b4745j4390r0946a4350j83506D8928h6667C76753a82996
10692d9996j85903K5445i0783J146L9403b3747j45196H236O8983b1624p034k01415
10680b30073I064R8615a13648C30517A16493i7441C15724c4848n6419C73225i5449
10668a42832d555k77002p0395B12133A6914J20534o0172b13232D6293c10594a41050
10656A45829C9214b79400A32885a55133K2825r0228H3316a60348A39255a13134
10645a43731m5880e7015p8437j5105A12b68028O2209A44015k6294k2179b39074
10633i317k5010m4883j58289k23869g8857p0219l06238F8550K76704a82469Q7821
$$ y = [67410, 123241, 119264, -161442, -38131, -191801, -283427, 318306, 198675, 198502, -86708, -132315, 337746, 87912, -24745, -39135, -130081, -14350, -197856, 48928, -86667, 376753, -182996, -49996, -235899, -210454, -90783, -89637, -50234, -23747, -168943, 8236, 77219, -21624, -28658, -230073, 9064, 107679, -113648, 330517, 116493, -97441, 315724, -34848, -91267, 373225, -95449, -142832, -4555, -281557, -351952, 212133, 16914, 137448, 77276, -213232, 46293, -310594, -141050, 145829, 39214, -279400, 132885, -155133, -132308, -222536, 83316, -160348, 139255, -113134, -143731, -189611, -57015, -135452, -150557, 112, -268028, -205819, 144015, 117721, 95542, -239074, -9317, -34327, -79210, -237499, -461368, -78857, -149076, -455314, 68550, 345254, -182469, -94648]
10622i4648p222c9355q3306k50856a58283j84496g1490l3164A88386C9608i7574
10610B22207a82872N6382L8239m5157G2306f5683A51140B2205M1921b02004N2625
10599a49379g1228l64939N1557m2810A3346i577j44421o8998A86493b3215A67727
10587B26744o6596R6218E4769L3656b50700f700A56729b02177E5492Q1288a93130
10575B4162J18443b26145E4703J61820b5659g972l38169A30843J3043K57798H6066
10563a22808d1039B4724L8618i6039j09210B02648a182H8448a86372R495F8249
10551F5017b95145a36724A42985b99223b8277l46848C01812a74685c7771A18425
10540d1672A93367P5468a21179N1699A0412a81089f1546A75393C3443R2196b48777
$$ y = [-94648, -101870, -39355, -122661, -373517, -158283, -342779, -71490, -104654, 188386, 39608, -97574, 222207, -182872, -126490, -88251, -133408, 72306, -65683, 151140, 22205, 64126, -202004, -149379, -71228, -436167, -384610, -427420, 13346, -9577, -153998, -222996, 186493, -23215, 167727, 226744, 160148, 256366, 54769, 88425, -250700, -6700, 156729, -202177, 55492, 136780, -193130, 24162, 142605, -226145, 54703, 216523, -25659, -7972, -346141, 130843, 143886, 401684, 86066, -122808, -41039, 24724, 63342, -96039, -205249, 202648, -1182, 88448, -186372, -176877, 68249, 65017, -295145, -136724, 142985, -299223, -28277, -375125, 301812, -174685, -37771, 118425, -41672, 193367, 268835, -121179, -69480, 10412, -181089, -61546, 175393, 33443, 125639, -248777]
10528a43657k1001j37978A5068J6421O5139k7023c3124o0298B74955j23026a15556
10516a93842a8564A31681a70224A90092G547K51881c23063J41086A64393b57759
10505G4733B5025b05904A60229a75448J2856G494b07970i5151E9994a60484l2702
10494a93186H820J28292b58596C14220a8761l8213A45824d4714a9973A46173j775
10483A44398K8812K73005j0989K85232l22067j07781b2127B85794A30110J76736
10473C06846j50022b39982Q7350O1833j9798J4551H2350N6016c0038F8669a07129
10461a86272q0473A69879c85669g5220A8266J17975o6558b19578R2914a4488j97781
10450b12269B09973c21702E3968J57062b50174j11162a45684m2651Q2403j9889
$$ y = [-143657, -164658, -302636, 15068, 31489, 96628, 69605, -33124, -93422, 274955, 151929, -115556, -193842, -18564, 131681, -170224, 190092, 7547, 259428, -323063, -181977, 164393, -257759, 74733, 25025, -205904, 160229, -175448, -162592, 7494, -207970, -95151, 59994, -160484, -193186, 8820, 137112, -258596, 314220, -18761, -56974, 145824, -44714, -19973, 146173, 144398, 173210, 446215, 435226, 720458, 398391, 290610, -22127, 285794, 130110, 306846, 156824, -239982, -152632, -90799, -110597, -96046, 82350, 138366, -30038, 68669, -107129, -186272, -266745, 169879, -385669, -75220, 18266, 136241, 69683, -219578, -126664, -14488, -212269, 209973, -321702, 53968, 211030, -250174, -361336, -145684, -188335, -105932, -125821]
10440a25821j99070b6781e279k1651A5165a30571J2406A03186J02226r7700a70989
10428C189a2055j41343B7882a14011A81029e1205G7157J51952b81148A36067b51032
10416c63218j88290A08280k7286J5325c4921j4750F2487B9536b67074B59886I3203
10404B77365a41024m2140B88955I4957B5860J3953i6910A76583c6833B476N8411
10393F0887a31051q8185B32208G0130h9690L5291C55678G4939b3887j70603g2492
10381G1562K37696a21337A21070R9197R1296a0437B47947J34733j23409J03519
10371C62790C6866O8657K12389o2358K15671j80582G7432K71150Q3131k15038
10361B16675K31673j99305R7281g2245B41606G5346f4895A35811J64040J79967
$$ y = [-125821, -324891, -26781, -5279, -26930, 15165, -130571, -118165, 103186, 205412, 107712, -170989, 3189, -12055, -153398, 27882, -114011, 181029, -51205, 77157, 229109, -281148, 136067, -251032, -363218, -551508, 108280, 80994, 96319, -34921, -49671, 62487, 29536, -267074, 259886, 93203, 277365, -141024, -183164, 288955, 94957, 25860, 39813, -96910, 176583, -36833, 2476, 60887, -131051, -219236, 232208, 70130, -89690, -54399, 355678, 74939, -23887, -194490, -72492, 71562, 309258, -121337, 121070, 220267, 311563, -10437, 247947, 382680, 259271, 362790, 36866, 105523, 317912, 255554, 471225, 290643, 77432, 348582, 431713, 216675, 448348, 249043, 346324, -72245, 241606, 75346, -64895, 135811, 299851, 479818]
10351D79818k36349M24547C18454A4789K58844a15229D76603J53140j42701e8771
10340F4769J83176L2170G0665J11833b38627A10608K55147j61442n1190M4323
10330A97446j7109a30401I1903a15231C63161e4246C1697K93910K6477j05797
10320B46287C4651a83440B98773o4255a58780I8894C1489A4957L01559F5584P5711
10309A41295c53220J26852D0474a54374H3434J12974m9067a21796L6192j06040
10299a91644a1098A43404J0837B5872R8212N1306k7050e3315j26338b7780E5975
10287h9284b5914h161p6468p7043a8378l33450A41349L0584d2875m5089d3054
10275a78207j1773A75675o3007L66961E6600a71602A32259a30619e2135H7142
$$ y = [479818, 243469, 668016, 318454, 14789, 273633, -115229, 476603, 629743, 487042, -58771, 64769, 247945, 280115, 70665, 182498, -238627, 110608, 365755, 204313, 153123, 197446, 180337, -130401, 91903, -115231, 363161, -54246, 31697, 325607, 352084, 246287, 34651, -183440, 298773, 234518, -158780, 98894, 31489, 14957, 316516, 65584, 141295, -353220, -226368, 40474, -154374, 83434, 196408, 147341, -121796, -85604, -191644, -11098, 143404, 154241, 25872, 124084, 175390, 148340, -53315, -179653, -27780, 55975, -89284, -25914, -8161, -84629, -161672, -18378, -351828, 141349, 171933, -42875, -87964, -43054, -178207, -189980, 175675, 112668, 479629, 56600, -171602, 132259, -130619, -52135, 87142]
10264B8400b56565B0889J57801N0836e882A22620L14793k07030J73814J14953
10254E19150j44706E6491J17386e9295C3638b32495c5365I3929b01008p6394i3903
10242a3328A35476i1627p6369G6563b07120A9387a80722j87728a3380A18006E1924
10230f5729j20741g6431J7707F3557K838E698a34238A08624b29629a8627H0796
10218B22642a05132P680j00329C2696f4372k36002j09324a70671N7057L8761A2999
10206H211b82958G357b55153A61086c98919J89585i6272j3243C59718a68805l5438
10195b04243j40701a64197A52210N3621c08016A08394I028J76706b3569D7963
10184b29286B21Q0186h3531A22211K27046b92461B7588e8102B56269j15788b75661
$$ y = [28400, -256565, 20889, 178690, 229526, -5882, 122620, 437413, 230383, 404197, 519150, 374444, 56491, 173877, -59295, 33638, -232495, -35365, 93929, -201008, -277402, -93903, -13328, 135476, -91627, -167996, 76563, -207120, 19387, -180722, -368450, -13380, 118006, 51924, -65729, -186470, -76431, -58724, 63557, 66395, 5698, -134238, 108624, -229629, -18627, 80796, 222642, -105132, -97452, -197781, 32696, -64372, -300374, -409698, -170671, -113614, -74853, 12999, 8211, -282958, 7357, -255153, 161086, -398919, -209334, -96272, -109515, 359718, -168805, -204243, -344944, -164197, 152210, 205831, -308016, 108394, 9028, 185734, -23569, 47963, -229286, 221, 80407, -83531, 122211, 349257, -292461, 27588, -58102, 256269, 140481, -275661]
10172d781D393b12195j78446O5983a02549B8628h8818a4714C2453b19162c4505
10160d43035a19692A3956c27236G4521n357j9487K49357A12337B4144h4746m9168
10149a33914K917G6697h0618m9452B84073c47511a11711m8614n9980F8784B7763
10137a53014P5858B3277b07736A57324B6375J06341l9171b39874A98013J1292
10127B09305A8503a01463r5207L7862M9291j29032Q9043L0449A49174b41853d7046
10115b10331M5475A3351c10902J30665M3825L0710G2562G29J66996P2606a19130
10103a89343j8546a5396A38678O5410a23753P627A93504a78115H8183b75931j49082
10092d25013i9395j7740B12108n9442a23132j66273i2316j52344A55079a86190
$$ y = [-4781, 4393, -212195, -390641, -324658, -102549, 28628, -88818, -14714, 32453, -219162, -34505, -443035, -119692, 13956, -327236, 74521, 69164, 49677, 299034, 112337, 24144, -84746, -133914, -130997, 76697, -80618, -130070, 284073, -347511, -111711, -160325, -220305, 68784, 27763, -153014, -77156, 23277, -207736, 157324, 26375, 132716, 93545, -239874, 198013, 209305, 18503, -101463, -196670, -158808, -109517, -238549, -149506, -119057, 149174, -241853, -47046, -210331, -164856, 13351, -310902, -180237, -136412, -105702, 72562, 729, 167725, 240331, -119130, -189343, -207889, -15396, 138678, 204088, -123753, -116126, 193504, -178115, 88183, -275931, -425013, -99395, -117135, 212108, 152666, -123132, -289405, -92316, -244660, 155079, -186190]
10081I169a13114A11176P7313o7022m2201c61207h9722q7193A31368b17916h1606
10069D695O0138g5259A77110i7122j09053i6366L1845l9763E5774d50899b7102
10057a33680a3058k16917C05320j12547b4277j32975c3795r9255m36741B08675
10046A69750c36949a6641A02524A7771a61315O0560A1894J46291c24408J31255
10036a93153J6686A39545c23746M0682a02811j64062h9610D0654a67316N4830
10026a12486C1212N9568B2961b65396J14530A83833c3503B04897o7689J95285
10016C32493e968G4804h1325O136B768h4646k51855M9083a42588a1371B56094
10004i1740I2174c917k00479H042c5420l61403d03q4135G9571J2923a54104A32039
$$ y = [9169, -113114, 111176, 188489, 121467, 79266, -361207, -89722, -176915, 131368, -217916, -81606, 4695, 64833, -75259, 177110, -97122, -206175, -96366, -64521, -104284, 55774, -450899, -27102, -133680, -13058, -229975, 305320, 192773, -24277, -157252, -33795, -133050, -569791, 208675, 169750, -336949, -16641, 102524, 17771, -161315, -100755, 11894, 158185, -324408, -193153, -176467, 139545, -323746, -283064, -102811, -266873, -89610, 40654, -167316, -112486, 31212, 90780, 22961, -265396, -150866, 183833, -33503, 204897, 137208, 332493, -5968, 74804, -81325, -75189, 2768, -84646, -336501, -287418, -142588, -11371, 256094, -91740, 92174, -3917, -204396, 8042, -35420, -396823, -403, -84538, 79571, 92494, -154104, 132039]
9991g1853E3104a89077A99379n0544a70096k60338D2008b82117B04275G8133a92609
9979b11791A06995c49237B3330a03111j62742A09073m3891a49489M9117B8881
9968b32910R6033M2944I1241L7645O0744h59A09076C2395e4309k11604i40k71234
9956b72174A47320g5680G9635a0650n7887A47216p1630j250A6223i6364k88221
9945c84585J33555J2078J18063A66602J4077M5706a59735j36202D4487A7190b48462
9933b36855L9727f3278l8437m03815c7861j6621j82540g9835L4101g869H4124
9921I5252c8708H9275N2524c180k60103m7132D056b94687r0303c4524B60275K6287
9909B86562b03131d5725I459O9616a43875k10795Q2157a04056B7953b39533J02872
$$ y = [-71853, 53104, -189077, 199379, 148835, -170096, -430434, 42008, -282117, 204275, 78133, -192609, -211791, 106995, -349237, 23330, -103111, -265853, 109073, 65182, -149489, -100372, 28881, -232910, -136877, -93933, 91241, 128886, 189630, -859, 109076, 32395, -54309, -265913, -940, -272174, 147320, -75680, 79635, -10650, -68537, 147216, 75586, 74336, 16223, -96364, -384585, -251030, -238952, -120889, 166602, 180679, 226385, -159735, -295937, 44487, 17190, -248462, -236855, -197128, -63278, -101715, -505530, -37861, -54482, -237022, -79835, -45734, -7869, 84124, 95252, -38708, 89275, 141799, -3180, -263283, -310415, 4056, -294687, -384990, -34524, 260275, 286562, -203131, -45725, 9459, 79075, -143875, -354670, -272513, -104056, 27953, -239533, -136661]
9898a36661O3450j81552C31767j01974e77519a10735q0521k4886B4260b59967
9887B18929C3478a6536q5062o0497A16485a97874E2089i1864k7081j31156R4746
9876a55355k9652g4209l2443A45609G442b36550Q9724A11872B6188K07428b36274
9864b58392J20417d0448l2449n19471a37530I6527A482Q8836c28474A35379o5268
9853G0111i6682q9943d4336A40419o6682B2533b3272l6426a04G5167g2048J7746
9841e4302o1468n948c4774q0749d0408A62546h8003j69707J01144j31375J31709
9830a56232f8560l1502j23331P9709j1152B62475a13161D4136A3821e1658a7321
9818a77364A48338a80858L9982o0973B19261a42754e2902l8068m2509j39332C76898
$$ y = [-136661, -73211, -254763, 331767, 229793, -577519, -110735, -191256, -216142, 24260, -259967, 218929, 33478, -16536, -101598, -162095, 116485, -197874, 52089, -91864, -118945, -250101, -155355, -185007, -74209, -106652, 145609, 7442, -236550, -146826, 111872, 26188, 233616, -236274, -258392, -137975, -40448, -72897, -592368, -137530, 96527, 1482, 90318, -328474, 135379, 70111, -96682, -186625, -44336, 140419, 73737, 22533, -23272, -59698, -104, 75167, -72048, -54302, -115770, -121718, -34774, -115523, -40408, 162546, -88003, -257710, -156566, -287941, -156232, -68560, -100062, -223393, -143684, -154836, 262475, -113161, 44136, 13821, -51658, -17321, -177364, 148338, -180858, -140876, -201849, 219261, -142754, -52902, -90970, -133479, -272811, 376898]
9806B39190h3903A94379q0459a63377A05123C3799a12656c2418A71347a26166
9795c98650E3672k1596Q738g2568A64526a99483E5451f7020H9136J13452a90731
9783a49369e9074k90394e1920H0555a50187j3661e4041D7168P6449i2870B20303
9771D2809F07b83794a03505B15142b49354J11866D5762d53596d4978A14874g5199
9759a28812c3950A40601b00798H9144L695N009a34138l382j76131J4766J43644
9748a55241B40570b64252A15154a4701C397a4769k05390g9137o037L3567H2581
9736A82301b44473R614j43711A52306i7224n6029l7216P15p487L0802A66693a29275
9723F1731D153a54551l24353a78365I7705b05127a4113m5244n7333C30948a92502
$$ y = [239190, -83903, 194379, 113920, -163377, 105123, 33799, -112656, -32418, 171347, -126166, -398650, 53672, 32076, 40814, -72568, 164526, -199483, 55451, -67020, 89136, 202588, -190731, -149369, -59074, -349468, -51920, 80555, -150187, -163848, -54041, 47168, 123617, -92870, 220303, 42809, 607, -283794, -103505, 215142, -249354, -137488, 45762, -453596, -44978, 114874, -75199, -128812, -33950, 140601, -200798, 89144, 92839, 97848, -134138, -137520, -313651, -298885, -155241, 240570, -264252, 115154, -14701, 3397, -14769, -220159, -79137, -85174, -51607, 82581, 182301, -244473, -234859, -378570, 152306, -97224, -153253, -190469, -189754, -197241, -166439, 166693, -129275, 61731, 4153, -154551, -478904, -178365, 97705, -205127, -14113, -59357, -116690, 330948, -192502]
9711B26497k70g7993H3714a07650d7332j29950j63417R6615h9534m7921j97304
9700c34759a25382I883J0441a6874m8050A30896b38482H0295i7644b4838j19869
9689a44707j72269d5594H5542Q952C2379L6177J32474b4791p1012A09870q45a24697
9676a731o7378j18810e6757A13693i8779d8987b0314l24587A41025o5261P2612
9665A48376K1985o8538b65208l20646K58847A27814b6078C8681a5504A58828d81280
9653f9943j8087C1526f8826E8723a67800k85394a83545e8257j08847I1028Q7667
9642A78695c00320J27756n3635D13048G7628a31427C6674b37074R7194j602A56807
9630b01831M8571g3842L339k22011L1952E4935d4546j03835A31935j7031c63691
$$ y = [226497, 226227, -77993, 83714, -107650, -47332, -177282, -340699, -244084, -89534, -137455, -334759, -125382, 9883, 20324, -16874, -64924, 130896, -238482, 80295, -97644, -24838, -144707, -316976, -45594, 85542, 94494, 32379, 68556, 201030, -24791, -95803, 109870, 109025, -124697, -1731, -69109, -187919, -56757, 113693, -98779, -48987, -20314, -344901, 141025, 75764, 148376, 170361, 101823, -265208, -585854, -327007, 127814, -26078, 38681, -15504, 158828, -481280, -69943, -88030, 31526, -68826, 58723, -167800, -453194, -183545, -58257, -167104, 91028, 178695, -300320, -172564, -226199, 413048, 77628, -131427, 36674, -237074, -139880, -141482, 156807, -201831, -153260, -73842, -70503, -292514, -260562, 54935, -44546, -148381, 131935, 114904, -363691]
9618a02026E3657a57365j52062b7017A33625n3879l0705c06177B28130b56185
9607a39633L5421j138D2288i9255A32207q123l1197c15042e131j79812k64703
9596d49646R0161B4362j535c05218b3243A71718h6086J4218l3560B41263c69269
9584B63368E0273d0378C5637a86841l4781c9338l4661o4700e8691q561a8742A61427
9571a07590B65185a94714c614j00080c7791j17095B9599J49507c4258k66734a2485
9559h4508o2593D954c7955o6296b174j59917k1908o9376B85552j23453d732C51335
9546A97782b19460H5661b06722P1415G4813J9022a2049j16238h108j48240p2446
9535b28794e2031o4233b3368j16064n9232i407B4598a61429B84564C6624a19269
$$ y = [-102026, 53657, -157365, -309427, -27017, 133625, 79746, 49041, -306177, 228130, -256185, -139633, -104212, -105350, 42288, -99255, 132207, 124084, 92887, -315042, -5131, -184943, -449646, -359485, 24362, 22827, -305218, -23243, 171718, -86086, -71868, -105428, 241263, -369269, 263368, 50273, -40378, 35637, -186841, -221622, -39338, -73999, -138699, -58691, -67252, -18742, 161427, -107590, 265185, -194714, -3614, -103694, -37791, -154886, 29599, 179106, -34258, -300992, -12485, -84508, -147101, 4954, -37955, -104251, -2174, -162091, -183999, -253375, 285552, 162099, -4732, 351335, 197782, -219460, 85661, -206722, -135307, 74813, 93835, -12049, -128287, -8108, -156348, -228794, -52031, -116264, -23368, -139432, -198664, -9407, 24598, -161429, 284564, 36624, -119269]
9523a80675a6096A12132c34941b8025l71398a08067A7754b33501J15710K9083
9513h8708l51897A18537L8684a60537C08318H4189k5141Q8889a70526l81739H2002
9501c4977G2496b37017k3342G3693a05542A71155f4422K6265l0821n5608L7590
9490h6996j53521J4564k12430f0142j29558P4066k2047E742J61352A7965a34472
9478c37345I2548b84491A5997a4491D7251e9432B68815d19751I2090k0019c71272
9466a32107f957k13795A58371p9063J03480f4122l8353G4119d3842j2520A84010
9454a4499D0110b36982j77787a68512j34818P3643a710k55247a815A0051a4996
9442C9531e6704A89209c92635b5690n9219k90826a42519H3757A6696K96997e48071
$$ y = [-180675, -16096, 112132, -334941, -28025, -399423, -108067, 17754, -233501, -117791, -88708, -440605, 118537, 157221, -160537, 308318, 84189, 59048, 147937, -170526, -552265, 82002, -34977, 72496, -237017, -260359, 73693, -105542, 171155, -64422, -38157, -68978, -124586, -86996, -240517, -225953, -438383, -60142, -189700, -115634, -137681, 5742, 167094, 17965, -134472, -337345, 92548, -284491, 15997, -14491, 47251, -59432, 268815, -419751, 92090, 72071, -371272, -132107, -6957, -220752, 158371, 79308, 182788, -64122, -102475, 74119, -43842, -56362, 184010, -14499, 40110, -236982, -414769, -168512, -303330, -229687, -1710, -256957, -1815, 10051, -14996, 39531, -56704, 189209, -392635, -25690, -84909, -375735, -142519, 83757, 16696, 313693, -548071]
9430B1157b52018B84021f3501p6896k52232a10582j3728A73299F9967l4584K47012
9419B82395c02125a00879A37364c3151A17634h4266B41288B6907b49153e2676
9408e1335D3508P5700b17343A2972a82709K7830b8817E8550a09246N210b6470
9396b00791q1295d593l48839J05902P1072P5714J5073D1066L27930b53435n6451
9385c09886a42346B14394j01493Q0689b06737a6305l14888h3542o7352D0739Q7489
9374A28228b6745k14157O2371L8592L5440L8864k2507L8906j32125A23141g094
9362A95935e4205j6689r5207J0801P705D5066a35183n9513E5926d8171j76969
9351b25140c8984j22948p6603F2289L26065j20357B0473L75888d9813F564b18055
$$ y = [21157, -252018, 284021, -63501, -140397, -392629, -110582, -124310, 173299, 69967, 35383, 282395, -302125, -100879, 137364, -33151, 117634, -84266, 241288, 26907, -249153, -52676, -51335, 43508, 119208, -217343, 12972, -182709, -154879, -28817, 58550, -109246, -104036, -26470, -200791, -282086, -4593, -353432, -247530, -176458, -100744, -85671, 41066, 368996, -253435, -309886, -142346, 214394, 112901, 193590, -206737, -16305, -331193, -83542, -150894, 40739, 128228, -26745, -240902, -178531, -139939, -104499, -65635, -88142, -49236, -181361, 123141, -7094, 195935, -54205, -70894, -166101, -155300, -147595, 45066, -135183, -194696, 55926, -48171, -225140, -38984, -161932, -238535, 62289, 388354, 267997, 20473, 396361, -49813, 6564, -218055]
9339a70891N9801k28743g7704A84124b40327f1578A88498M299b01369A40731b62145
9327d6664A09322D7542O2390a25131A04142Q0754J3053g5221E5863f1744j88475
9316b50219D4942d6992j82882F5294J75959a5111l3770m12708I4870P1059g6640
9304B62117b05815B22478L0096n8310M5158a26912q4308A26321J74970E9099O6996
9293A26095d1628j06251P999I9037a76775d0603J9393k54837h9850D22554b5869
9281c34016b8421k10760B45055b57024Q8114k3706f7575l5250C38763b21371I856
9269D1857J40260b75070B34901e0010n04637A02080b42648k1566H4929L4132b82114
9257b7932n0771c8504A59092d6901b1171l64600a84402N6163A77313d5454J8078
$$ y = [-170891, -111090, -339833, -77704, 184124, -240327, -61578, 188498, 192797, -201369, 140731, -262145, -46664, 109322, 47542, 109932, -125131, 104142, 184896, 197949, -75221, 55863, -61744, -250219, 44942, -46992, -229874, 65294, 241253, -15111, -48881, -461589, 94870, 165929, -76640, 262117, -205815, 222478, 252574, 194264, 239422, -126912, -211220, 126321, 301291, 59099, 126095, -41628, -147879, -139880, 99037, -176775, -40603, -21210, -276047, -89850, 422554, -25869, -334016, -28421, -239181, 245055, -257024, -168910, -192616, -67575, -102825, 338763, -221371, 9856, 41857, 182117, -275070, 234901, -50010, -554647, 102080, -242648, -264214, 84929, 119061, -282114, -27932, -78703, -38504, 159092, -46901, -21171, -385771, -184402, -128239, 177313, -45454, -27376]
9246b7376l57452A54322e572A1356J2537J02831J40800c67335F3553c2099A31102
9234c63957O7859f9140A45004a93400M1153p079E4393i7470o7035B19731A06477
9222a46632h224B28885a33960K9888a5382q523j01308L1899E0254O8949a06090
9210d9276k31995B41715a15829F6566c5364P466j07307M2956L7724H2821a81839
9198c04263A28825a10699J4975c3803j57344n5912d4767C46223d8552j32714O5120
9187a16146j91610O0985A75629b90425O8952J8375Q7561a9309j55080o5820A84264
9175E6334b73449P1096n04c0469k57279i4618b0467j61117Q4882K998M3582B18583
9162a08627E6681b16766A203b44308f7408F3196a88099N1178j90580a34596K9469
$$ y = [-27376, -384828, 154322, -5572, 11356, 23893, 126724, 267524, -367335, 63553, -32099, 131102, -363957, -296098, -69140, 145004, -193400, -152247, -159326, 54393, -97470, -164505, 219731, 106477, -146632, -8224, 228885, -133960, -104072, -15382, -23905, -125213, -93314, 50254, 119203, -106090, -49276, -281271, 241715, -115829, 66566, -35364, -27898, -135205, -92249, -54525, 82821, -181839, -304263, 128825, -110699, -95724, -33803, -191147, -247059, -44767, 346223, -48552, -181266, -116146, -307756, -246771, 175629, -290425, -221473, -203098, -115537, -19309, -174389, -240209, 184264, 56334, -273449, -202353, -202857, -30469, -287748, -94618, -20467, -181584, -96702, -93704, -50122, 218583, -108627, 56681, -216766, 1203, -244308, -67408, 63196, -188099, -136921, -327501, -134596, -105127]
9151a05127J9447B11713a85200G3226A3539i7895k9066j00586Q3859a5755d843
9139a360j4289l40617A7415J82834C7044j7676a36904B63941J2295a56658j01815
9128b58473q7904G5023h4855C7614d9593j20405H7391a87765J1963j99511c2320
9116g0375D2285J72518a7495m4245j0058B64370G7010c2240A22399b8447J563
9105b6884E27804a046j73967O2132J9809h373p0079A14124a50938b0398m9l35144
9093c55591a09817k50760d1686E7585c82070B9769g8757L676l1903o1275C17215
9081A18821h8180j07684p5962B52482c88722J816d3424l22189a49567j37448B48362
9069A08472b653k6081C16008a01199j43284J4584A58537c5175l0992a831l5349
$$ y = [-105127, -85680, 211713, -185200, 73226, 13539, -97895, -126961, -227547, -143688, -15755, -4843, -1360, -15649, -356266, 17415, 200249, 37044, 19368, -136904, 263941, 276236, -156658, -258473, -346377, 75023, -84855, 37614, -49593, -169998, 87391, -187765, -175802, -375313, -32320, -70375, 42285, 214803, -17495, -61740, -71798, 264370, 77010, -32240, 122399, -28447, -26884, 527804, -1046, -175013, -112881, -93072, -8373, -78452, 114124, -150938, -20398, -20447, -355591, -109817, -360577, -41686, 57585, -382070, 29769, -78757, -75081, -106984, -168259, 317215, 118821, -88180, -195864, -271826, 252482, -388722, -386906, -43424, -365613, -149567, -287015, 248362, 108472, -2653, -28734, 316008, -101199, -244483, -229899, 158537, -35175, -66167, -1831, -37180]
9058c7180A58059p5342g1483B62600a18595l0134M6066A35128d4025a5611j64965
9047a80576J4757M600A41579L228d43281G7835b02712B5213A1133J42591D125
9035b7556k02241B89516a31226c4781C5162K79035I6025i4047H942J28875C7827
9023h3024n0887H2981a27623A49587a55496o3639D2594J0002a55797O6183A41214
9011B79502F27b60244J17256M1208K7641j37992e8960a5125j72723e0494K350
9000d8144j87525J9146G054h2072N506j1436K324m7742C44503A47305a44190I0636
8987a51277d2719C08060b79048J32035J5922c6694A00955a97977R7207c8346A88062
8975a86234h2382k0537n6752L4338A0309P1405a31425G787M9735B2502a40819
$$ y = [-37180, 158059, 82717, -71483, 262600, -118595, -148729, -102663, 135128, -44025, -15611, -180576, -165819, -161219, 141579, 144807, -443281, 77835, -202712, 25213, 11133, 153724, 4125, -27556, -229797, 289516, -131226, -34781, 35162, 314197, 96025, -94047, 8942, 137817, 37827, -83024, -133911, 82981, -127623, 149587, -155496, -219135, 42594, 52596, -155797, -89614, 141214, 279502, 627, -260244, -142988, -101780, -74139, -212131, -58960, -15125, -187848, -50494, -48144, -235669, -216523, 7054, -82072, -76566, -88002, -85678, -133420, 344503, 147305, -144190, 90636, -151277, -42719, 308060, -279048, -147013, -131091, -36694, 100955, -197977, -100770, -38346, 188062, -186234, -82382, -102919, -159671, -125333, 10309, 81714, -131425, 7787, 57522, 22502, -140819]
8963h3601c5070j29188P613n5061f9888A434a70018A42602a15806q2153A37377
8951G7710a62134A31736a51895N3787A9090J1541O5314a50333j0403O1280A06146
8939e2524a3683A10439c48295d7146j63092K1760K7407D1198O6989C5377a17182
8927b990n3364k27856J01352E2782J72333J34668J58677B31537E1962i0315j09742
8916b00057j65294e7778I653J66417b08642j70020C5426c07420C56297G4368J23398
8905A97766o2373a24299j5428e3571A9905K68305e4876J1368r9247k15706A3532
8893b61634g9188K5372e288A67074a39245D5024b3995k1992K936l16799C50160
8881A09758i0601j50120o6677A9065b25381d7761j10426F1286K0218k8549b32442
$$ y = [-83601, -35070, -164258, -156645, -211706, -69888, 1434, -170018, 142602, -115806, -197959, 137377, 77710, -162134, 131736, -151895, -98108, 19090, 30631, 95945, -150333, -160736, -99456, 106146, -52524, -13683, 110439, -348295, -47146, -210238, -188478, -161071, 41198, 108187, 35377, -117182, -2990, -56354, -284210, -182858, 52782, 225115, 359783, 518460, 231537, 51962, -90315, -200057, -365351, -57778, 9653, 176070, -208642, -378662, 35426, -307420, 356297, 74368, 197766, 135393, -124299, -139727, -53571, 19905, 288210, -54876, -43508, -142755, -358461, 13532, -261634, -79188, -53816, -5288, 167074, -139245, 45024, -23995, -45987, -43051, -359850, 350160, 109758, -90601, -240721, -307398, 19065, -225381, -47761, -158187, 61286, 81504, 52955, -232442]
8869a14017A7033a86986O058A7448M5228i3759A33818E1691j1381j6922M8268
8858G1656a47763L2001D64683A99326b09709a0627j01671A43336a63374d3281
8847A44252c05870R8123K0977B02654H1315a08647j17914B26667n8122d9335j15359
8836a64694A07954L7074b37299m9205B794a0066k82209F454J4729B370b732j69693
$$ y = [-114017, 17033, -186986, -180928, 17448, 62676, -93759, 133818, 51691, 40310, 23388, 71656, -147763, -115762, 464683, 199326, -209709, -10627, -112298, 143336, -163374, -43281, 144252, -305870, -207747, -186770, 202654, 81315, -108647, -226561, 226667, 168545, -49335, -164694, 107954, 145028, -237299, -286504, 2794, -10066, -292275, 6454, 21183, 2370, -2732, -172425]
$$ [...]
##END NTUPLES=NMR SPECTRUM
##END=
