##TITLE=AC1732_SEN00005_9275896_cHlFfLDpW5
##JCAMPDX= 6.0         $$ Bruker NMR JCAMP-DX V2.0
##DATA TYPE= NMR SPECTRUM
##DATA CLASS= NTUPLES
##ORIGIN= BRUKER
##OWNER= Administrator
$$ 1.72 TOPSPIN		Version 2.1
$$ 2015-07-14 22:13:29.807 -0700  Administrator@X
$$ Compression mode = diff/dup
##.OBSERVE FREQUENCY= 400.02188249412
##.OBSERVE NUCLEUS= ^1H
##.ACQUISITION MODE= SIMULTANEOUS (DQD)
##.ACQUISITION SCHEME= undefined
##.AVERAGES= 64
##.DIGITISER RES= 22
##SPECTROMETER/DATA SYSTEM= spect
##.PULSE SEQUENCE= noesygpps1d.comp
##.SOLVENT NAME= COFFEE_meoh
##.SHIFT REFERENCE= INTERNAL, COFFEE_meoh, 1, 14.96093
##AUDIT TRAIL= $$ (NUMBER, WHEN, WHO, WHERE, PROCESS, VERSION, WHAT)
$$ ##TITLE= Audit trail, TOPSPIN		Version 2.1
$$ ##JCAMPDX= 5.01
$$ ##ORIGIN= Bruker BioSpin GmbH
$$ ##OWNER= Administrator
$$ $$ E:\/data/COFFEE/nmr/AC1732_SEN00005_9275896_cHlFfLDpW5/12/pdata/1/auditp.txt
$$ ##AUDIT TRAIL=  $$ (NUMBER, WHEN, WHO, WHERE, PROCESS, VERSION, WHAT)
(   1,<2015-07-14 22:13:24.744 -0700>,<Administrator>,<X>,<go>,<TOPSPIN 2.1>,
      <created by zg
	started at 2015-07-14 22:01:54.979 -0700,
	POWCHK enabled, PULCHK disabled,
       configuration hash MD5:
       21 0F 79 D6 B3 7B B4 F6 88 20 88 DB 03 48 BD 9F
       data hash MD5: 64K
       E0 2E 22 6E D2 3B C5 4E 6A 7E ED F4 A8 E0 CC 2B>)
(   2,<2015-07-14 22:13:27.885 -0700>,<Administrator>,<X>,<proc1d>,<TOPSPIN 2.1>,
      <Start of raw data processing
       efp LB = 0.3 FT_mod = 6 PKNL = 1 PHC0 = 0 PHC1 = 0 SI = 128K 
       data hash MD5: 128K
       67 97 F5 BB 92 B7 10 1D 57 C0 3B 89 8F B0 7B EE>)
(   3,<2015-07-14 22:13:28.900 -0700>,<Administrator>,<X>,<proc1d>,<TOPSPIN 2.1>,
      <pk PHC0 = -88.0719 PHC1 = 0 
       data hash MD5: 128K
       0E B2 41 4B 4C 95 D3 CA CA 6F 52 FF 1F CB 62 D8>)
(   4,<2015-07-14 22:13:29.307 -0700>,<Administrator>,<X>,<proc1d>,<TOPSPIN 2.1>,
      <abs ABSG = 1 
       data hash MD5: 128K
       AA 11 D1 0F E3 D6 9A C7 A2 24 AF E5 14 86 BF AE>)
(   5,<2015-07-14 22:13:29.400 -0700>,<Administrator>,<X>,<proc1d>,<TOPSPIN 2.1>,
      <abs ABSG = 2 
       data hash MD5: 128K
       FD 75 13 AD 35 79 7B 0C 74 1D 54 03 FB 52 91 50>)
(   6,<2015-07-14 22:13:29.479 -0700>,<Administrator>,<X>,<proc1d>,<TOPSPIN 2.1>,
      <abs ABSG = 3 
       data hash MD5: 128K
       94 39 4E E6 25 05 6B 00 14 A3 F3 A4 B4 34 03 78>)
(   7,<2015-07-14 22:13:29.557 -0700>,<Administrator>,<X>,<proc1d>,<TOPSPIN 2.1>,
      <abs ABSG = 4 
       data hash MD5: 128K
       3A 87 4F F7 EB 38 DF CB BD 9E 4C 62 5F 9D 04 83>)
(   8,<2015-07-14 22:13:29.650 -0700>,<Administrator>,<X>,<proc1d>,<TOPSPIN 2.1>,
      <abs ABSG = 5 
       data hash MD5: 128K
       53 4B 3F 6E E8 6E F2 1A 9F 13 62 22 39 78 88 57>)
$$ ##END=
$$ 
$$ $$ hash MD5
$$ $$ 44 B9 EC BA 53 21 03 FF 73 E7 13 2A 1D 10 02 B5
##$RELAX= 
##$RELAX= 
##$RELAX= 
##$RELAX= 
##$RELAX= 
##$RELAX= 
##$RELAX= 
##$RELAX= 
$$ Bruker specific parameters
$$ --------------------------
##$DU= <E:\>
##$EXPNO= 12
$$ [...]
##$TP07= 0
##$TPNAME0= <>
##$TPNAME1= <>
##$TPNAME2= <>
##$TPNAME3= <>
##$TPNAME4= <>
##$TPNAME5= <>
##$TPNAME6= <>
##$TPNAME7= <>
##$TPOAL= (0..7)
0.5 0.5 0.5 0.5 0.5 0.5 0.5 0.5
##$TPOFFS= (0..7)
0 0 0 0 0 0 0 0
##$TUNHIN= 0
##$TUNHOUT= 0
##$TUNXOUT= 0
##$USERA1= <user>
##$USERA2= <user>
##$USERA3= <user>
##$USERA4= <user>
##$USERA5= <user>
##$V9= 5
##$VALIST= <valist>
##$VCLIST= <CCCCCCCCCCCCCCC>
##$VD= 0
##$VDLIST= <DDDDDDDDDDDDDDD>
##$VPLIST= <PPPPPPPPPPPPPPP>
##$VTLIST= <TTTTTTTTTTTTTTT>
##$WBST= 2048
##$WBSW= 25
##$XGAIN= (0..3)
0 0 0 0
##$XL= 0
##$YL= 0
##$YMAX_a= 6302107
##$YMIN_a= -11866383
##$ZGOPTNS= <>
##$ZL1= 120
##$ZL2= 120
##$ZL3= 120
##$ZL4= 120
##$ABSF1= 14.96093
##$ABSF2= -5.597252
##$ABSG= 5
##$ABSL= 3
##$ALPHA= 0
##$AQORDER= 0
##$ASSFAC= 0
##$ASSFACI= 0
##$ASSFACX= 0
##$ASSWID= 0
##$AUNMP= <proc_prof1d_extract.lims>
##$AXLEFT= 0
##$AXNAME= <>
##$AXNUC= <1H>
##$AXRIGHT= 0
##$AXTYPE= 0
##$AXUNIT= <>
##$AZFE= 0.1
##$AZFW= 0.1
##$BCFW= 0
##$BC_mod= 0
##$BYTORDP= 0
##$COROFFS= 0
##$CY= 15
##$DATMOD= 1
##$DC= 0
##$DFILT= <>
##$DTYPP= 0
##$F1P= 0
##$F2P= 0
##$FCOR= 0.5
##$FTSIZE= 131072
##$FT_mod= 6
##$GAMMA= 0
##$GB= 0
##$INTBC= 1
##$INTSCL= 1
##$ISEN= 128
##$LB= 0.3
##$LEV0= 0
##$LPBIN= 0
##$MAXI= 10000
##$MC2= 0
##$MEAN= 0
##$ME_mod= 0
##$MI= 0
##$NCOEF= 0
##$NC_proc= -2
##$NLEV= 6
##$NOISF1= 0
##$NOISF2= 0
##$NSP= 0
##$NTH_PI= 0
##$NZP= 0
##$OFFSET= 14.96093
##$PC= 1
##$PHC0= -88.0719
##$PHC1= 0
##$PH_mod= 1
##$PKNL= yes
##$PPARMOD= 0
##$PPDIAG= 0
##$PPIPTYP= 0
##$PPMPNUM= 2147483647
##$PPRESOL= 1
##$PSCAL= 4
##$PSIGN= 0
##$PYNMP= <proc.py>
##$REVERSE= no
##$SF= 400.020009665164
##$SI= 131072
##$SIGF1= 0
##$SIGF2= 0
##$SINO= 400
##$SIOLD= 131072
##$SPECTYP= <>
##$SREGLST= <1H.CDCl3>
##$SSB= 0
##$STSI= 131072
##$STSR= 0
##$SW_p= 8223.68421052631
##$SYMM= 0
##$S_DEV= 0
##$TDeff= 65536
##$TDoff= 0
##$TI= <>
##$TILT= no
##$TM1= 0
##$TM2= 0
##$TOPLEV= 0
##$USERP1= <user>
##$USERP2= <user>
##$USERP3= <user>
##$USERP4= <user>
##$USERP5= <user>
##$WDW= 1
##$XDIM= 131072
##$YMAX_p= 402042040
##$YMIN_p= -14891
##$CURPLOT= <Network HP LaserJet P1505>
##$CURPRIN= <$Network HP LaserJet P1505>
##$DFORMAT= <normdp>
##$LAYOUT= <+/1D_H.xwp>
##$LFORMAT= <normlp>
##$PFORMAT= <normpl>
##$SURQMSG= 1
$$ End of Bruker specific parameters
$$ ---------------------------------
##NTUPLES= NMR SPECTRUM
##VAR_NAME=  FREQUENCY,     SPECTRUM/REAL,   SPECTRUM/IMAG
##SYMBOL=    X,             R,               I
##VAR_TYPE=  INDEPENDENT,   DEPENDENT,       DEPENDENT
##VAR_FORM=  AFFN,          ASDF,            ASDF
##VAR_DIM=   131072,        131072,          131072
##UNITS=     HZ,            ARBITRARY UNITS, ARBITRARY UNITS
##FACTOR=    0.0627417313425164, 1,          1
##FIRST=     8223.62146879497, -2333,        -56046
##LAST=      0,             -379,            -56909
##MIN=       0,             -14891,          0
##MAX=       8223.62146879497, 402042040,    0
$$ Real data points
##PAGE= N=1
##DATA TABLE= (X++(R..R)), XYDATA
$$ [...]
63926F168667l7187q2491j25485j65371k01517k32840k58096k76545k88196k93568
63916D207371k93385k88335k79084k66427k51255k34263k15880j96639j77452
63907B004651j59154j41976j25772j10729r7393q5939p5831o6531n8213n1458
63897A031655m6396m2413l8745l5079l1603k8643k6395k4861k3878k3209k2641
63886F87792k1997k1091j9729j7902j5892j4063j2458j0729q616o314m190k226
63874E32585p9K242M169N272N934O940Q488R996J0833J1016J1010J1113J1165
63861F30684J0811R930Q767P623O466M999L200J560N14k32j424l361n599p600
63847F66338r273j0759j2024j2968j3728j4601j5676j6711j7299j7138j6303j5367
$$ y = [6168667, 6131480, 6048989, 5923504, 5758133, 5556616, 5323776, 5065680, 4789135, 4500939, 4207371, 3913986, 3625651, 3346567, 3080140, 2828885, 2594622, 2378742, 2182103, 2004651, 1845497, 1703521, 1577749, 1467020, 1369627, 1283688, 1207857, 1141326, 1083113, 1031655, 985259, 942846, 904101, 869022, 837419, 808776, 782381, 757520, 733642, 710433, 687792, 665795, 644704, 624975, 607073, 591181, 577118, 564660, 553931, 545315, 539001, 534811, 532585, 532506, 534748, 538917, 544189, 550123, 557063, 565551, 575547, 586380, 597396, 608406, 619519, 630684, 641495, 651425, 660192, 667815, 674281, 679280, 682480, 684040, 684554, 684322, 682898, 679537, 673938, 666338, 657065, 646306, 634282, 621314, 607586, 592985, 577309, 560598, 543299, 526161, 509858, 494491]
63835D94491j4968j5157j5366j5187j4865j4770j4682j4060j2852j1567j0551
63824C40466r646q638p636o878o406o117n825n249m261l246k845l096l211k495
63810B64917j211j94J87K27K37J60j46o73j309j869k025j674j292j506k199k563
63794B49067k264j981k386l116l317k879k411k217k039j816j839j977j577n37
63780B18711J78k40j219j479p11J72K93k79r13j109o90J55Q73R95P44P20R35P22
63762B17858j63r47q12J1O36O14J42m86r61q17N9Q63O62j87k78R37K305K584K092
63743B24112J993K493K756K399J989J892J667J008N58J006J979K541K566K727
63729B51686L228L409K877K299K566L613M665N346N873O301O189N301M119L301
$$ y = [494491, 479523, 464366, 449000, 433813, 418948, 404178, 389496, 375436, 362584, 351017, 340466, 330820, 322182, 314546, 307668, 301262, 295145, 289320, 284071, 279810, 276564, 273719, 270623, 267412, 264917, 263706, 263512, 263699, 263926, 264163, 264323, 264177, 263504, 262195, 260326, 258301, 256627, 255335, 253829, 251630, 249067, 246803, 244822, 242436, 239320, 236003, 233124, 230713, 228496, 226457, 224641, 222802, 220825, 219248, 218711, 218889, 218649, 217430, 215951, 215240, 215412, 215705, 215426, 214513, 213404, 212714, 212869, 213742, 214737, 215481, 216201, 217136, 217858, 217695, 216748, 215936, 215947, 216583, 217197, 217339, 216853, 215892, 215075, 215134, 215997, 216659, 216472, 216194, 217131, 219436, 222020, 224112, 226105, 228598, 231354, 233753, 235742, 237634, 239301, 240309, 240867, 241873, 243852, 246393, 248959, 251686, 254914, 258323, 261200, 263499, 266065, 269678, 274343, 279689, 285562, 291863, 298052, 303353, 307472, 310773]
63715C10773K896K390J388k1j494k739l595m002l994l646k989k077j146n29l84
63700B90831n33o40m97j06M79J234K073K794L220L400L511L546L245K444J428
63685C16429O94M03K66K8j42N8N45Q74P52L76J62K68N31P26P91P83P95R52J322
63666C26613J645J370K38j157j800j441j007j492k754l783m031l896l963m282
63652C00260m560m557m079l067j944j452j718j909j254r1O67Q03R37J492K143
63637B81671K421K315K173K337L036M200N290N671N335M939M963N232N420N668
63623C40671O404P810R698J1690J3337J4338J4888J5577J6723J8063J9301K0616
63611E09116K2289K4164K5943K7670K9367L0306K9413K6510K2608J8609J4293
$$ y = [310773, 313669, 316059, 317447, 317426, 315932, 313193, 309598, 305596, 301602, 297956, 294967, 292890, 291744, 291215, 290831, 290298, 289658, 289161, 289055, 289534, 290768, 292841, 295635, 298855, 302255, 305766, 309312, 312557, 315001, 316429, 317123, 317526, 317792, 317820, 317678, 317736, 318281, 319155, 319907, 320283, 320445, 320713, 321244, 321970, 322761, 323544, 324339, 325291, 326613, 328258, 329628, 329866, 328709, 326909, 325468, 324461, 322969, 320215, 316432, 312401, 308505, 304542, 300260, 295700, 291143, 287064, 283997, 282053, 280601, 278883, 276974, 275720, 275629, 276296, 277099, 278036, 279528, 281671, 284092, 286407, 288580, 290917, 293953, 298153, 303443, 309114, 314449, 319388, 324351, 329583, 335003, 340671, 347075, 354885, 364583, 376273, 389610, 403948, 418836, 434413, 451136, 469199, 488500, 509116, 531405, 555569, 581512, 609182, 638549, 668855, 698268, 724778, 747386, 765995, 780288]
63600G80288R041L235j670m609n956o883p936q621q498q150q785j0908j3828j6509
63586F90211j8518j9911k0662k0690k0322k0084j9905j8982j6764j3793j1237
63575D89343r678q623p240n250l019r56Q81K596M076N068N558N864O257O697P043
63560D98617P373P874Q559R361J0398J1905J3858J5955J8025K0276K2992K6119
63548F71312K9276L2002L3913L4721L4196L2038K7782K1126J2588L700l699q518
63536I20437j0766j1149j0522r612q854q333q013q154r300j1767j5242j9014k2490
63523G67221k5379k7551k8999k9843l0069k9356k7470k4931k2771k1374j9923
63512D79555j7471j4327j1765j0477r922r333q681q227p699o558m904l476k760
$$ y = [780288, 789329, 792564, 790894, 786285, 780329, 773446, 765510, 756889, 748391, 740241, 731456, 720548, 706720, 690211, 671693, 651782, 631120, 610430, 590108, 570024, 550119, 531137, 514373, 500580, 489343, 479665, 471042, 463802, 458552, 455533, 454577, 455458, 458054, 462130, 467198, 472756, 478620, 484877, 491574, 498617, 505990, 513864, 522423, 531784, 542182, 554087, 567945, 583900, 601925, 622201, 645193, 671312, 700588, 732590, 766503, 801224, 835420, 867458, 895240, 916366, 928954, 932654, 928955, 920437, 909671, 898522, 888000, 878388, 869534, 861201, 853188, 845034, 835734, 823967, 808725, 789711, 767221, 741842, 714291, 685292, 655449, 625380, 596024, 568554, 543623, 520852, 499478, 479555, 462084, 447757, 435992, 425515, 415593, 406260, 397579, 389352, 381653, 375095, 370191, 366715, 363955]
63499C63955k542k430k366k423k432k069j262l37K03R8l87o17j95O44J327J624
63483C50791J800K198K858L574M046M013L569L293L655M191L783K040kj056j166
63468C87587j570l026m881n984o006n508m958m228l122j942j225r93p34j01O48
63453C43957J150J570K295L233L881M191M784O039P414Q073P993P952Q533R595
63439D20660J0783J2166J4141J6846J9849K2383K3880K4255K3653K2038J9298
63428F29952J5871J2831J1025J0414J0581J1577J3627J6299J8814K1223K4360
63417G96574K8283L1620L3032L2621L1100K8295K3552J7271J0756M559j762p885
63405A028016j2047j3060j2097j1422j1881j2724j3528j5080j8082k2028k5799
$$ y = [363955, 361413, 358983, 356617, 354194, 351762, 349693, 348431, 348094, 348297, 348395, 348008, 347391, 347196, 347840, 349167, 350791, 352591, 354789, 357647, 361221, 365267, 369280, 372849, 376142, 379797, 383988, 387771, 389811, 389809, 388753, 387587, 386017, 382991, 378110, 372126, 366120, 360612, 355654, 351426, 348304, 346362, 345137, 344144, 343410, 343309, 343957, 345107, 346677, 348972, 352205, 356086, 360277, 365061, 371100, 378514, 386587, 394580, 402532, 411065, 420660, 431443, 443609, 457750, 474596, 494445, 516828, 540708, 564963, 588616, 610654, 629952, 645823, 658654, 669679, 680093, 690674, 702251, 715878, 732177, 750991, 772214, 796574, 824857, 856477, 889509, 922130, 953230, 981525, 1005077, 1022348, 1033104, 1037663, 1035901, 1028016, 1015969, 1002909, 990812, 979390, 967509, 954785, 941257, 926177, 908095, 886067, 860268]
63394H60268k8705l0623l1608l1809l1348l0079k7889k5318k3294k1931k0236
63383E57428j7486j4250j1505r274o963m497k259j15K411N088P092Q289R480J1079
63369E34518J2464J3077J3348J3966J4879J5739J6719J8169J9882K1506K3364
63358G17631K5976K8909L0926L1408L0902L0063K8640K5835K1265J5260Q613K232
63346I97660l133p161r908j1491j2086j2165j2367j2995j3950j5256j7292k0214
63334H49642k3448k6047k7499k7955k7806k7252k6193k4390k1726j8471j5223
63323E83632j2498j0380q598o887n305m342m717o767r913j2887j4655j5029j4396
63310D57258j3181j1720j0352r200p982o324m272k324r63l59l64n60m35J55O86
$$ y = [860268, 831563, 800940, 769332, 737523, 706175, 676096, 648207, 622889, 599595, 577664, 557428, 539942, 525692, 514187, 504913, 497950, 493453, 491194, 491079, 493490, 498578, 505670, 513959, 523439, 534518, 546982, 560059, 573407, 587373, 602252, 617991, 634710, 652879, 672761, 694267, 717631, 743607, 772516, 803442, 834850, 865752, 895815, 924455, 950290, 971555, 986815, 995428, 997660, 994527, 987366, 977458, 965967, 953881, 941716, 929349, 916354, 902404, 887148, 869856, 849642, 826194, 800147, 772648, 744693, 716887, 689635, 663442, 639052, 617326, 598855, 583632, 571134, 560754, 552156, 545269, 539964, 535622, 530905, 524138, 514225, 501338, 486683, 471654, 457258, 444077, 432357, 422005, 412805, 404823, 398499, 394227, 391903, 390940, 390581, 390217, 389657, 389222, 389377, 390063]
63295C90063M44p23k337l889n129n811n675m969m493m720n167n060m335l572l120
63280C31507k840k631k493k081q83Q35J901J553M17l30l61j46J31O69J246J202
63264C27696N14O8N35J576K548L359M116M551M443M235M522N168N616N818O125
63249C80890O474O452O193O397P336Q607J0003J1815J3956J5633J6455J7203J8784
63236E26198K0939K2710K3828K4864K6144K7336K8134K8660K9040K9076K8658
63225H15587K8078K7733K7691K7694K7454K6943K6510K6584K7046K7044K5851
63214A114215K3818K1916K0327J8040J4111Q886L512j464o567j2458j8904k4792
63202A160640k9037l1393l2402l2644l2226l0980k8946k6324k3199j9650j6135
$$ y = [390063, 390507, 389784, 387447, 383558, 378429, 372618, 366943, 361974, 357481, 352761, 347594, 342534, 338199, 334627, 331507, 328667, 326036, 323543, 321462, 320579, 321414, 323315, 324868, 325285, 324955, 324594, 324448, 324579, 325248, 326494, 327696, 328210, 328278, 328813, 330389, 332937, 336296, 340412, 344963, 349406, 353641, 358163, 363331, 368947, 374765, 380890, 387364, 393816, 400009, 406406, 413742, 422349, 432352, 444167, 458123, 473756, 490211, 507414, 526198, 547137, 569847, 593675, 618539, 644683, 672019, 700153, 728813, 757853, 786929, 815587, 843665, 871398, 899089, 926783, 954237, 981180, 1007690, 1034274, 1061320, 1088364, 1114215, 1138033, 1159949, 1180276, 1198316, 1212427, 1221313, 1224825, 1223361, 1216794, 1204336, 1185432, 1160640, 1131603, 1100210, 1067808, 1035164, 1002938, 971958, 943012, 916688, 893489, 873839, 857704]
63191H57704j3248j0983q658n801k713J50K963O236R866J3030J5109J6390J7618
63178H97663J9062K0252K0633K0327K0033K0164K0338J9884J8681J7157J5564
63167A109758J3768J1677R351O479K423k831q241j2869j7082k1863k7156l1663
63155A031751l4371l5544l5941l5767l4865l3434l1885l0209k7994k5201k2429
63144F84111k0249j8539j6714j4549j2424j0708r159p333n449m252l869l321j748
63131E55797K75J388J290J167K109L817N286O055O309O173N701N279N347N678
63117F11671N536M606L342K225J207J20q05j211j187j170j280j209p88l66l50
63102F20341o39q36r17j286k034k576k375j716j320j330j210o53j7L20N02P57
$$ y = [857704, 844456, 833473, 824815, 819014, 816301, 816451, 819414, 825650, 835516, 848546, 863655, 880045, 897663, 916725, 936977, 957610, 977937, 997970, 1018134, 1038472, 1058356, 1077037, 1094194, 1109758, 1123526, 1135203, 1144554, 1151033, 1153456, 1150625, 1142384, 1129515, 1112433, 1090570, 1063414, 1031751, 997380, 961836, 925895, 890128, 855263, 821829, 789944, 759735, 731741, 706540, 684111, 663862, 645323, 628609, 614060, 601636, 590928, 581769, 574436, 568987, 564735, 560866, 557545, 555797, 556072, 557460, 558750, 559917, 562026, 565843, 571129, 577184, 583493, 589666, 595367, 600646, 605993, 611671, 617207, 621813, 625155, 627380, 628587, 628707, 627902, 626691, 625504, 624334, 623054, 621845, 621057, 620691, 620341, 619702, 618866, 617949, 616663, 614629, 612053, 609678, 607962, 606642, 605312, 604102, 603449, 603432, 603752, 604254, 605011]
63086F05011Q89O71M77R93K367L985N098N370M971M423M336M958N945O781P369
63071F63644Q024Q958J0034J1031J1876J2701J3796J5409J7476J9724K2154K5123
63059H39950K8569L1678L3842L5712L8541M2518M6553M9763N2453N5382N8726
63048A313687O2130O5257O7733O9007O8839O7728O6418O5079O3380O1268N9328
63037B029854N8285N8259N8560N8195N6659N4147N0872M6349L9811L1260K1516
63026B563767J1082m00j3212k6623l9404n0930o1193p0003p6765q1001q2695q2160
63014A990463p9852p6192p1258o4795n6860m8264l9923l1901k3643j5060o850
63003A475865L55O654J2467J7910K2849K7292L1275L4529L6629L7558L7850L7986
$$ y = [605011, 605900, 606571, 607048, 608041, 610408, 614393, 619491, 624861, 629832, 634255, 638591, 643549, 649494, 656275, 663644, 671668, 680626, 690660, 701691, 713567, 726268, 740064, 755473, 772949, 792673, 814827, 839950, 868519, 900197, 934039, 969751, 1008292, 1050810, 1097363, 1147126, 1199579, 1254961, 1313687, 1375817, 1441074, 1508807, 1577814, 1646653, 1714381, 1780799, 1845878, 1909258, 1970526, 2029854, 2088139, 2146398, 2204958, 2263153, 2319812, 2373959, 2424831, 2471180, 2510991, 2542251, 2563767, 2574849, 2574449, 2561237, 2534614, 2495210, 2444280, 2383087, 2313084, 2236319, 2155318, 2072623, 1990463, 1910611, 1834419, 1763161, 1698366, 1641506, 1593242, 1553319, 1521418, 1497775, 1482715, 1475865, 1476220, 1482874, 1495341, 1513251, 1536100, 1563392, 1594667, 1629196, 1665825, 1703383, 1741233, 1779219]
62991A779219L7885L7214L6084L4971L3847L2008K8997K5220K1008J5606Q115
62980B090174p99r326j6862k4772l4241m4424n3490o0637o6085o9888p1907p2563
62968A565180p2392p1070o7951o3545n9330n5994n2773m8801m4257l9948l6399
62957I52720l3594l1129k8514k5859k4061k3668k3739k2811k0887j9351j8823
62946F80284j8380j7256j6000j5246j4448j2888j1011r786r228q657p950p571
62934E31863p495p056n901m453l391l028l128l036k255j189q79j613k318j951
62920D84170r89p36j520k434k750k649k552k541k609k847l102l016k537k064j905
62905D49919j994k193k466k687k646k378k179k166k140j896j418p15K01J123J670
$$ y = [1779219, 1817104, 1854318, 1890402, 1925373, 1959220, 1991228, 2020225, 2045445, 2066453, 2082059, 2090174, 2089375, 2080049, 2063187, 2038415, 2004174, 1959750, 1906260, 1845623, 1779538, 1709650, 1637743, 1565180, 1492788, 1421718, 1353767, 1290222, 1230892, 1174898, 1122125, 1073324, 1029067, 989119, 952720, 919126, 887997, 859483, 833624, 809563, 785895, 762156, 739345, 718458, 699107, 680284, 661904, 644648, 628648, 613402, 598954, 586066, 575055, 565269, 556041, 547384, 539434, 531863, 524368, 517312, 511411, 506958, 503567, 500539, 497411, 494375, 492120, 490931, 490052, 488439, 486121, 484170, 483181, 482445, 480925, 478491, 475741, 473092, 470540, 467999, 465390, 462543, 459441, 456425, 453888, 451824, 449919, 447925, 445732, 443266, 440579, 437933, 435555, 433376, 431210, 429070, 427174, 425756, 425041, 425242, 426365, 428035]
62890D28035J567Q44j80r65j068o33l54o08r13o47M9N62P69J042J369J247N38
62873D30654k01m18j66J71L20J44l44q20q77n52k71k44k50r4J70N36J136J902
62855D30796K528K878L076L073K634J831J109P04M67L84O87J231J345O94j54n16
62839D52767m97o27r60j048o63q3L03L93L63M66P74J058J077R69J066J310J324
62822D57992J212J632K767L758L729K975K533K906L764M675N432N791N626N387
62808E10179N724O549P062O902O696P166Q155R011R603J0443J1840J3426J4591
62795F27347J5235J5909J7318J9692K2654K5612K8269L0863L3982L8154M3445
62784I18480M9398N5401O1234O7127P3293P9521Q5404R0761R5590R9699J02685
$$ y = [428035, 429602, 430446, 430266, 429301, 428233, 427600, 427246, 426638, 425725, 425078, 425127, 425689, 426458, 427500, 428869, 430116, 430654, 430453, 430035, 429869, 430040, 430360, 430504, 430160, 429340, 428463, 427911, 427640, 427396, 427146, 427052, 427222, 427758, 428894, 430796, 433324, 436202, 439278, 442351, 444985, 446816, 447925, 448629, 449096, 449480, 450167, 451398, 452743, 453437, 453283, 452767, 452270, 451643, 450683, 449635, 448972, 448889, 449192, 449585, 449948, 450414, 451188, 452246, 453323, 454292, 455358, 456668, 457992, 459204, 460836, 463603, 467361, 471090, 474065, 476598, 479504, 483268, 487943, 493375, 499166, 504792, 510179, 515903, 522452, 529514, 536416, 543112, 550278, 558433, 567444, 577047, 587490, 599330, 612756, 627347, 642582, 658491, 675809, 695501, 718155, 743767, 772036, 802899, 836881, 875035, 918480, 967878, 1023279, 1084513, 1151640, 1224933, 1304454, 1389858, 1480619, 1576209, 1675908, 1778593]
62773A778593J04265J04291J02378R7779Q9892P8825O5312N0138L3765J6496j214
62762B520520j8748l5567n1340o5719p8079q7697r4241r8046r9819j00143r9245
62751A691876r7173r4047r0102q5559q0505p4959o8999o2844n6817n1236m6319
62740H83316m2024l7956l3669k9187k5075k1821j9326j7207j5358j3802j2164
62729F15727r923p258n107m101l824l436k636j702q42QR58K146L850O197Q742
62714E98799J0797J2197J3537J5456J8016K0858K3797K6980L0550L4302L7806
62703H43095M0891M3963M7746N2621N8227O3728O8405P2040P4926P7578Q0206
62692A523426Q2249Q2518Q0090P5018O8007N9470M9157L6778K2690P745p382k2373
$$ y = [1778593, 1882858, 1987149, 2089527, 2187306, 2277198, 2356023, 2421335, 2471473, 2505238, 2521734, 2520520, 2501772, 2466205, 2414865, 2349146, 2271067, 2183370, 2089129, 1991083, 1891264, 1791121, 1691876, 1594703, 1500656, 1410554, 1324995, 1244490, 1169531, 1100532, 1037688, 980871, 929635, 883316, 841292, 803336, 769667, 740480, 715405, 693584, 674258, 657051, 641693, 627891, 615727, 605804, 598546, 593439, 589338, 585514, 582078, 579442, 577740, 576898, 576906, 577864, 580010, 583860, 590057, 598799, 609596, 621793, 635330, 650786, 668802, 689660, 713457, 740437, 770987, 805289, 843095, 883986, 927949, 975695, 1028316, 1086543, 1150271, 1218676, 1290716, 1365642, 1443220, 1523426, 1605675, 1688193, 1768283, 1843301, 1911308, 1970778, 2019935, 2056713, 2079403, 2087148, 2079766, 2057393]
62680B057393l6812m9849o0674o9173p5763q0565q3176q3504q2336q0630p8457
62669A276454p5215p0840o6122o1690n7283n2339m6931m1673l7068l3221k9970
62658G04102k6964k3830k0629j7918j6135j5055j4132j3144j2173j1194j0111
62647E22817r080q391q066p841p441o629n213l408j949j393j428j345j063j054
62633D58516j377j479j142q88j099j341j107p54j033j809j995q64J045K601L345
62618D50619L719M220M739M878M660M600N146O267P595Q723R357R496R601J0323
62604E43943J1873J3850J5865J7999K0455K3106K5825K8939L2739L6715L9939
62593H11248M2288M4599M7401N0015N1337N1033M9498M6918M2873L6932K9191
$$ y = [2057393, 2020581, 1970732, 1910058, 1840885, 1765122, 1684557, 1601381, 1517877, 1435541, 1354911, 1276454, 1201239, 1130399, 1064277, 1002587, 945304, 892965, 846034, 804361, 767293, 734072, 704102, 677138, 653308, 632679, 614761, 598626, 583571, 569439, 556295, 544122, 532928, 522817, 513737, 505346, 497280, 489439, 481998, 475369, 470156, 466748, 464799, 463406, 461978, 460633, 459570, 458516, 457139, 455660, 454518, 453630, 452531, 451190, 450083, 449329, 448296, 446487, 444492, 443628, 444673, 447274, 450619, 454338, 458558, 463297, 468175, 472835, 477435, 482581, 488848, 496443, 505166, 514523, 524019, 533620, 543943, 555816, 569666, 585531, 603530, 623985, 647091, 672916, 701855, 734594, 771309, 811248, 853536, 898135, 945536, 995551, 1046888, 1097921, 1147419, 1194337, 1237210, 1274142, 1303333]
62582A303333K0259J0890J694p010j5203k2928l0031l6227m1360m5478m8536n0178
62570A039225m9983m8036m5136m2259l9799l7418l4628l1355k7934k4806k2281
62559F35590k0398j8829j7062j4909j2658j0664q997p650o743o258n851n260m662
62546D95649m225l617k477j186m72l35m6P07J321J209O29K63M11R07J493J991
62530D92222K433L252M965P394R594J0893J1654J2689J4284J6271J8593K1317
62518F25561K4212K6953K9648L2700L6161L9639M2792M5538M7763M9244M9935
62507A050146M9919M9012M6753M2969L7994L2210K5633J8198J0297K761l644q654
62495A353594j2468j5307j6966j6812j4413j0138m956L98N914J1832J7953K3646
$$ y = [1303333, 1323592, 1334482, 1336176, 1329166, 1313963, 1291035, 1261004, 1224777, 1183417, 1137939, 1089403, 1039225, 989242, 941206, 896070, 853811, 814012, 776594, 741966, 710611, 682677, 657871, 635590, 615192, 596363, 579301, 564392, 551734, 541070, 532073, 524423, 517680, 511422, 505571, 500311, 495649, 491424, 487807, 485330, 484144, 483672, 483337, 483291, 483998, 485319, 486528, 487157, 487420, 487831, 488738, 490231, 492222, 494655, 497907, 502872, 510266, 519860, 530753, 542407, 555096, 569380, 585651, 604244, 625561, 649773, 676726, 706374, 739074, 775235, 814874, 857666, 903204, 950967, 1000211, 1050146, 1100065, 1149077, 1195830, 1238799, 1276793, 1309003, 1334636, 1352834, 1363131, 1365892, 1362248, 1353594, 1341126, 1325819, 1308853, 1292041, 1277628, 1267490, 1262534, 1262932, 1268846, 1280678, 1298631, 1322277]
62483A322277K8447L2420L5877L8831M0749M0816L8407L3431K6274J7578Q025
62472A663132j696j1076k0088k9156l8593m7977n6265o2551o6553o8414o8444
62461A192319o7170o5248o2833n9280n4000m7569m1385l6231l1815k7799k4452
62450F74537k1760j8776j4705j0298p103n530m541l284k037j204l44J131K895
62437E88981M033M224L954L715L428K725J439k74k137l960n630o910p421p102
62423E79065o493o221o273o194n898n721n668n354m869m936n792o601o508n716
62409D96821m941m336l671l075k821k673k208j612j375j374j076m33J36O71J616
62394D69649K813L409L026K218J573J107Q65J310K563L893M560M679M753M840
$$ y = [1322277, 1350724, 1383144, 1419021, 1457852, 1498601, 1539417, 1577824, 1611255, 1637529, 1655107, 1663132, 1661436, 1650360, 1630272, 1601116, 1562523, 1514546, 1458281, 1395730, 1329177, 1260763, 1192319, 1125149, 1059901, 997068, 937788, 883788, 836219, 794834, 758603, 726788, 698989, 674537, 652777, 634001, 619296, 608998, 601895, 596365, 591824, 588540, 586503, 585299, 584955, 586086, 588981, 593014, 597238, 601192, 604907, 608335, 611060, 612499, 612225, 610088, 606128, 600498, 593588, 586167, 579065, 572572, 566351, 560078, 553884, 547986, 542265, 536597, 531243, 526374, 521438, 515646, 509045, 502537, 496821, 491880, 487544, 483873, 480798, 477977, 475304, 473096, 471484, 470109, 468735, 467659, 467226, 467362, 468033, 469649, 472462, 475871, 478897, 481115, 482688, 483795, 484660, 485970, 488533, 492426, 496986, 501665, 506418, 511258]
62380E11258M815N026N942P364Q554R223R737J0353J0773J0666J0324J0489J1585
62367F26109J3206J4546J5392J6534J8896K2348K5853K8889L2112L6236M0865
62356H90986M4984M8196N0696N2312N2398N0692M7524M2999L6696K8560J9531
62345A365574J0854L087l849r983j5180j9570k3607k7646l1660l5305l8004l9122
62333A135589l8420l6409l3993l1596k8905k5604k2126j9396j7834j6914j5816
62322H48576j4361j3118j2697j3180j4241j5448j6271j6151j5019j3648j2974
62311F91468j3025j2924j2109j1029j0261r532q232o660n950o563p558p707o901
62298E73017n997n572n317m630l356j828l99Q27J846K512K633K387K362K921L615
$$ y = [511258, 516073, 521099, 527041, 534405, 542959, 552182, 561919, 572272, 583045, 593711, 604035, 614524, 626109, 639315, 653861, 669253, 685787, 704683, 727031, 752884, 781773, 813885, 850121, 890986, 935970, 984166, 1034862, 1087174, 1139572, 1190264, 1237788, 1280787, 1317483, 1346043, 1365574, 1376428, 1379515, 1375666, 1365683, 1350503, 1330933, 1307326, 1279680, 1248020, 1212715, 1174711, 1135589, 1097169, 1060760, 1026767, 995171, 966266, 940662, 918536, 899140, 881306, 864392, 848576, 834215, 821097, 808400, 795220, 780979, 765531, 749260, 733109, 718090, 704442, 691468, 678443, 665519, 653410, 642381, 632120, 622588, 614356, 607696, 601746, 595183, 587625, 579918, 573017, 567020, 561448, 556131, 551501, 548145, 546317, 545918, 546745, 548591, 551103, 553736, 556123, 558485, 561406, 565021]
62283E65021L698L203K997L545M220M306M162M707N977P062P426P597Q247R321
62269F41489J0405J1458J2698J4077J5379J6707J8492K0990K4033K7286L0636
62258H43650L4240L8262M2546M6634N0151N2929N4633N4591N2382M8331M2887
62247A361236L5796K6716J6612P453J91o124j2752j9662k6090l1827l7056m1555
62235A272938m5020m7724m9876n0698m9271m6062m2563l9454l6256l2704k9308
62224H04002k6270k3099j9663j6567j3999j1258q109n623m792n053n077m420l532
62211F56540k691j862j252r87n27O92K220L134L434L942M881N606N955O697Q229
62196F94011R736J0303J0201J0346J0933J1288J0902J0020R247Q972R188R563
$$ y = [565021, 568719, 571922, 574919, 578464, 582684, 586990, 591152, 595859, 601836, 608898, 616324, 623921, 632168, 641489, 651894, 663352, 676050, 690127, 705506, 722213, 740705, 761695, 785728, 813014, 843650, 877890, 916152, 958698, 1005332, 1055483, 1108412, 1163045, 1217636, 1270018, 1318349, 1361236, 1397032, 1423748, 1440360, 1447813, 1448004, 1441880, 1429128, 1409466, 1383376, 1351549, 1314493, 1272938, 1227918, 1180194, 1130318, 1079620, 1030349, 984287, 941724, 902270, 866014, 833310, 804002, 777732, 754633, 734970, 718403, 704404, 693146, 685037, 679414, 674622, 669569, 664492, 660072, 656540, 653849, 651987, 650735, 649748, 649221, 649913, 652133, 655267, 658701, 662643, 667524, 673130, 679085, 685782, 694011, 703747, 714050, 724251, 734597, 745530, 756818, 767720, 777740, 786987, 795959, 805147, 814710]
62184H14710R715R499R059Q579Q161P881P657P068N720L922K613K409L197M819
62170I05009P525J1301J5327J8764K1794K5153K8890L2289L4824L6377L6533L4579
62158A208365L0571K5573K0435J4910Q497J649m527r422j3293j6653j9858k3124
62146A223123k6414k9347l1566l3076l3834l3351l1306k8386k5771k3729k1459
62135I04884j8433j5173j2388j0096q126o843o602o839o499n275l852k873k262
62122G99623j630p95K56J542K890L884M220M074L848L665L123J615j064m260o784
62107H14207p835p550o606n529m791n076o771r150j0728j0743r703q354o721m643
62093G10007k639j470j042m42Q85K539L788M390M646N014N850P196Q717J0015
$$ y = [814710, 824425, 833924, 842983, 851562, 859723, 867604, 875261, 882329, 888049, 891971, 894584, 896993, 900190, 905009, 912534, 923835, 939162, 957926, 979720, 1004873, 1033763, 1066052, 1100876, 1137253, 1173786, 1208365, 1238936, 1264509, 1284944, 1299854, 1308351, 1310000, 1305473, 1296051, 1282758, 1266105, 1246247, 1223123, 1196709, 1167362, 1135796, 1102720, 1068886, 1035535, 1004229, 975843, 950072, 926343, 904884, 886451, 871278, 858890, 848794, 840668, 833825, 827223, 820384, 813885, 808610, 804758, 801885, 799623, 797993, 797198, 797454, 798996, 801886, 805770, 809990, 814064, 817912, 821577, 824700, 826315, 825251, 820991, 814207, 806372, 798822, 792216, 786687, 781896, 776820, 770049, 760899, 750171, 739428, 729725, 721371, 714650, 710007, 707368, 705898, 704856, 704414, 705299, 707838, 711626, 716016, 720662, 725676, 731526, 738722, 747439, 757454]
62079G57454J1127J2408J3931J5310J6335J7435J9114K1140K2618K2863K2000
62068I51735K0732J9849J9840K0706K1955K2968K3504K3691K3514K2538K0307
62057A191339J6813J2385P273J670l877q495j1721j4072j6618j9964k3767k7319
62045A103647l0403l3357l6280l8520l9256l8517l7203l5940l4364l1902k8900
62034G19005k6332k4501k2697k0315j7771j5849j4607j3412j1861j0224q983q328
62022E24125q076p877p504p108p125p691q275q098o893n096l387k221j582j009
62008D42183QJ424K596L079L203L550M153M649N004N479N974O009N358M259L058
61993D99986K054J581J598J345M9j940l563m584n793p464q590q304p219o602o801
$$ y = [757454, 768581, 780989, 794920, 810230, 826565, 844000, 863114, 884254, 906872, 929735, 951735, 972467, 992316, 1012156, 1032862, 1054817, 1077785, 1101289, 1124980, 1148494, 1171032, 1191339, 1208152, 1220537, 1227810, 1229480, 1225603, 1217108, 1205387, 1191315, 1174697, 1154733, 1130966, 1103647, 1073244, 1039887, 1003607, 965087, 925831, 887314, 850111, 814171, 779807, 747905, 719005, 692673, 668172, 645475, 625160, 607389, 591540, 576933, 563521, 551660, 541436, 532453, 524125, 516049, 508172, 500668, 493560, 486435, 478744, 470469, 462371, 455478, 450382, 446995, 444774, 443192, 442183, 442191, 443615, 446211, 449290, 452493, 456043, 460196, 464845, 469849, 475328, 481302, 487311, 492669, 496928, 499986, 502040, 503621, 505219, 506564, 506613, 504673, 501110, 496526, 490733, 483269, 474679, 466375, 459156, 452554, 445753]
61978D45753p228p389p138o311m934l665l197l311l177k554k058k183k654k866
61964C87088k548j884j241q90p52n59l56n45j085j126J2J799L082L483L547L749
61948C91774M114M755N851P136Q133R033J0458J2250J3441J3723J3963J4787J5546
61935E24964J5398J4658J4160J3905J3226J2036J0911J0053Q976P359N537L923
61923F55106K433O92j416l594n310o171o259o022n683m931l464j525N07K798N785
61908F22946R212J2059J3513J3644J2986J1885J0463Q778O768M264J350j461l641
61895G22766n138o268p264q071q541q635q391p845p021o071n340n199n649o291
61881F27042o832p492q628j0067j1206j1772j2095j2414j2319j1174q985o541
$$ y = [445753, 438525, 431136, 423998, 417687, 412753, 409088, 405891, 402580, 399403, 396849, 394791, 392608, 389954, 387088, 384540, 382656, 381415, 380525, 379773, 379214, 378858, 378313, 377228, 376102, 376114, 377913, 380995, 384478, 388025, 391774, 395888, 400643, 406494, 413630, 421763, 430796, 441254, 453504, 466945, 480668, 494631, 509418, 524964, 540362, 555020, 569180, 583085, 596311, 608347, 619258, 629311, 638287, 645646, 651183, 655106, 657539, 658231, 656815, 653221, 647911, 641740, 635481, 629459, 623776, 618845, 615381, 613856, 614363, 617161, 622946, 632158, 644217, 657730, 671374, 684360, 696245, 706708, 715486, 722254, 726518, 727868, 726407, 722766, 717628, 711360, 704096, 696025, 687484, 678849, 670458, 662613, 655592, 649521, 644181, 638982, 633333, 627042, 620210, 612718, 604090, 594023, 582817, 571045, 558950, 546536, 534217, 523043, 514058, 507517]
61869E07517m727l804l234k167l18J579K513K533K922M669P134Q902R666J0543
61855E43728J2454J5021J7380J9320K1078K2513K3292K3590K3917K4303K4282
61844G70878K3672K2625K0872J7684J3046Q213M472J760r61m179p297r485j0362
61831H50938r830p892m974j919O87K979N329P612R316J0171J0300R718Q104N296
61817H95835J755j778n039q344j1788j4672j6163j6407j6476j7065j7698j7651
61805G54509j7152j7118j7842j8602j8653j7977j6950j5760j4515j3451j2657
61794E73832j1826j0635r198p875o834o089n721n687n558m860l668k525j806j445
61780D90105j238j099r56o49j19M91R40R97O20J60L03J416K982M022M176M078
$$ y = [507517, 502790, 498986, 495752, 493585, 493267, 494846, 497359, 499892, 502814, 507483, 514617, 523519, 533185, 543728, 556182, 571203, 588583, 607903, 628981, 651494, 674786, 698376, 722293, 746596, 770878, 794550, 817175, 838047, 855731, 868777, 876990, 881462, 883222, 882261, 878082, 870785, 861300, 850938, 841108, 833216, 828242, 826323, 827010, 829989, 835318, 842930, 852246, 862417, 872717, 882435, 890539, 895835, 897590, 895812, 890773, 882429, 870641, 855969, 839806, 823399, 806923, 789858, 772160, 754509, 737357, 720239, 702397, 683795, 665142, 647165, 630215, 614455, 599940, 586489, 573832, 562006, 551371, 542173, 534298, 527464, 521375, 515654, 509967, 504409, 499549, 495881, 493356, 491550, 490105, 488867, 487768, 486812, 486163, 486044, 486535, 487475, 488472, 489092, 489252, 489555, 490971, 493953, 497975, 502151, 506229]
61764E06229M565N718O918P597P730P637P540P366O923O173N270M288L078J461
61750E88493n03k605m670o435p454p515p091o940p180p233o825o478o661o860
61736E04043o176m643l354l138l546l410k163l76R04J160P90O13J000J562J683
61721D84949J328J082J470K383L278L779L866L603K909J691J16j468k792l786
61707E02408m414m604m450m310m447m673m625m348m285m557m704m333l742l538
61693D41378l820m112m003l523k963k586k530k711k863k929l249l981m466l794
61679C93848k124p41n29r32r26n14n39j236j820j577p36%L42M91P12J136J815
61662C86670K589L063L032K857L106L771M191L867L101K592K573K625K332J803
$$ y = [506229, 510794, 516512, 523430, 531027, 538757, 546394, 553934, 561300, 568223, 574396, 579666, 583954, 587032, 588493, 587990, 585385, 580715, 574280, 566826, 559311, 552220, 545280, 538100, 530867, 524042, 517564, 510903, 504043, 497867, 493224, 489870, 486732, 483186, 479776, 477613, 477237, 478141, 479301, 480091, 480704, 481704, 483266, 484949, 486277, 487359, 488829, 491212, 494490, 498269, 502135, 505738, 508647, 510338, 510454, 508986, 506194, 502408, 497994, 493390, 488940, 484630, 480183, 475510, 470885, 466537, 462252, 457695, 452991, 448658, 444916, 441378, 437558, 433446, 429443, 425920, 422957, 420371, 417841, 415130, 412267, 409338, 406089, 402108, 397642, 393848, 391724, 390983, 390454, 389522, 388596, 388082, 387543, 386307, 384487, 382910, 382174, 382174, 382516, 383007, 383719, 384855, 386670, 389259, 392322, 395354, 398211, 401317, 405088, 409279, 413146, 416247, 418839, 421412, 424037, 426369, 428172]
61648D28172J356R79M21k15l33N21K053L393L879L559K979K579K323J933J386
61633D54985J030J071J184Q65J10o30j192j953l194m576n508n697n134l926k494
61618D24941j581j492j629j281p10p87j692k686l221l552m064m650n101n519n901
61603C81075n789m874l628k847k772l060l360l577l686l699l712l671l304k587
61589C30509k032k073k356k170j433p46m63k87N3K85L3n77j119j408j552j547
61573C13117j167l55N06Q95O55J27l14o32q80q01o0J141K181K819L392L936L788
61556C28348K564J026K69L56N01M19N68J067J310R61N04M79O86O92N60O08Q26
61539C41744J034J324J866K474K804K799K575K066J182J86m51n65l54p6N0k48
$$ y = [428172, 429528, 430507, 430928, 430713, 430380, 430901, 432954, 436347, 440226, 443785, 446764, 449343, 451666, 453599, 454985, 456015, 457086, 458270, 459135, 459245, 458615, 457423, 455470, 452276, 447700, 442192, 436495, 431361, 427435, 424941, 423360, 421868, 420239, 418958, 418248, 417461, 415769, 413083, 409862, 406310, 402246, 397596, 392495, 386976, 381075, 375286, 370412, 366784, 363937, 361165, 358105, 354745, 351168, 347482, 343783, 340071, 336400, 333096, 330509, 328477, 326404, 324048, 321878, 320445, 319699, 319236, 318949, 319002, 319287, 319320, 318743, 317624, 316216, 314664, 313117, 311950, 311595, 312101, 312996, 313651, 313778, 313464, 312832, 311952, 311151, 311091, 312232, 314413, 317232, 320624, 324560, 328348, 330912, 331938, 332207, 332563, 333064, 333483, 334051, 335118, 336428, 337389, 337893, 338372, 339058, 339750, 340310, 340918, 341744, 342778, 344102, 345968, 348442, 351246, 354045, 356620, 358686, 359868, 360054, 359603, 359038, 358684, 358608, 358658, 358410]
61523C58410j048j948k304j888j040l04l5l03q31j104q02j76K65L98N94J098J609
61506C50591J632J197R83J645K987L965L724K574J667J669K143K396K403K538
61492C82114K753K639K130J585J201R02P99J167J820K061J591R48Q03J104J402
61477D05019J604J889K045J519K54r97j481j278j085j337j865k298k549k735k865
61462C93840k761k309j635j059q36r34j036q40m09j07j09j64P0N71J124J712K423
61445C87541L009L029K535K202K562L382M031M159L863L398L040K953K967K742
61431D31413K320K187K459K505J780O83m7l58o21o05K59J651K403K092J627J776
61415D51524K054J709J109J138J666J640O60m56q45o32m75o58j022j368j531j274
$$ y = [358410, 357362, 355414, 353110, 351222, 350182, 349878, 349843, 349540, 348709, 347605, 346803, 346627, 346892, 347290, 347884, 348982, 350591, 352223, 353420, 354403, 356048, 359035, 363000, 366724, 369298, 370965, 372634, 374777, 377173, 379576, 382114, 384867, 387506, 389636, 391221, 392422, 393324, 394123, 395290, 397110, 399171, 400762, 401710, 402513, 403617, 405019, 406623, 408512, 410557, 412076, 412330, 411333, 409852, 408574, 407489, 406152, 404287, 401989, 399440, 396705, 393840, 391079, 388770, 387135, 386076, 385240, 384306, 383270, 382430, 382021, 381914, 381805, 381641, 381711, 382282, 383406, 385118, 387541, 390550, 393579, 396114, 398316, 400878, 404260, 408291, 412450, 416313, 419711, 422751, 425704, 428671, 431413, 433733, 435920, 438379, 440884, 442664, 443347, 443300, 442942, 442321, 441716, 441975, 443626, 446029, 448121, 449748, 451524, 453578, 455287, 456396, 457534, 459200, 460840, 461500, 461044, 460199, 459567, 459092, 458434, 457412, 456044, 454513, 453239]
61399D53239n57J74K60m93j553k147j914j095k28K08m8r10j870k230j775j131
61383D37930j119j719k020j299J75J578K395K563K170J457R05Q23R20O70M1n00
61367D44970n95k10O02J599K111J615O53M99J582K873L248K868K649K911L273
61352D70648L609M211N070N720N922N882N615M759L371K322K375L187L724L452
61338E29867K691J918J239O20K14K30O20R84P97j89j578k481k348j636j327j709
61322E27912k043j610p25k29k77j77M98J349J922K587L953N740O949P220P381
61307E60450Q350R981J1423J2148J2061J0898Q362M937J876K7r39j889l214m711
61293F29760o101p136p526p168o463n986n936o102o324o576o708o492n932n259
$$ y = [453239, 452682, 452856, 453116, 452623, 451070, 448923, 447009, 445914, 445686, 445894, 445846, 444936, 443066, 440836, 439061, 437930, 436811, 435092, 433072, 431773, 431948, 433526, 435921, 438484, 440654, 442111, 443016, 443839, 444759, 445429, 445470, 444970, 444375, 444165, 444767, 446366, 448477, 450092, 450745, 451244, 452826, 455699, 458947, 461815, 464464, 467375, 470648, 474257, 478468, 483538, 489258, 495180, 501062, 506677, 511436, 514807, 517129, 519504, 522691, 526415, 529867, 532558, 534476, 535715, 536335, 536549, 536779, 537399, 538383, 539180, 538991, 537413, 534932, 532584, 530948, 529621, 527912, 525869, 524259, 523534, 523305, 523028, 522851, 523349, 524698, 526620, 529207, 533160, 538900, 545849, 553069, 560450, 568800, 578781, 590204, 602352, 614413, 625311, 633673, 638610, 640486, 640513, 639574, 637685, 634471, 629760, 623659, 616523, 608997, 601829, 595366, 589380, 583444, 577342, 571018, 564442, 557734, 551242, 545310, 540051]
61279E40051m535l628k563j562o22N84K155L587M204L887L194K820L005L441L673
61264E57691L594L578M085N219O716Q129Q883Q467O957N185L937L068J907M72
61250F27888l58j0J006J740J709R27m11j830k633k548k049j670j441j307j627
61235F17386k555l390l212k069q09L7O40J234J818K423L043L329L015K634K996
61220F26520L927M390M039L704L964M182L597K626K211K390K372J812J133P44
61206F67611N60M02L23M54R84K183M071O163P976R640J1487J3182J3936J3636
61192G52608J3005J2427J1314R059O113L512J678K22j171k243k691k714k858l465
61178G94796m427n463o424p321q131q739r093r273r298q928p981o789o076o214
$$ y = [540051, 535516, 531888, 529325, 527763, 527141, 527725, 529880, 533467, 537671, 541558, 544752, 547572, 550577, 554018, 557691, 561285, 564863, 568948, 574167, 580883, 589012, 597895, 606362, 613319, 618504, 622441, 625509, 627416, 627888, 627530, 627520, 628526, 630266, 631975, 632902, 632491, 630661, 628028, 625480, 623431, 621761, 620320, 619013, 617386, 614831, 611441, 608229, 606160, 605351, 605388, 606028, 607262, 609080, 611503, 614546, 617875, 620890, 623524, 626520, 630447, 634837, 638876, 642580, 646544, 650726, 654323, 656949, 659160, 661550, 663922, 665734, 666867, 667611, 668171, 668573, 668896, 669350, 670334, 672517, 676588, 682751, 690727, 700367, 711854, 725036, 738972, 752608, 765613, 778040, 789354, 798413, 804526, 808038, 809716, 809938, 808767, 806524, 803833, 801119, 798261, 794796, 790369, 784906, 778482, 771161, 763030, 754291, 745198, 735925, 726627, 717699, 709718, 702929, 696853, 690639]
61164F90639o817p199p100o778o482o094n255l825k117p03O3M13R60K113L740
61149F45558N340O343O280M992K899Q19p01j826k992m153m732m284k950j165Q25
61134F50253K956N074O816P912Q478R000R937J1331J2836J4217J5591J7141J8650
61121G90192J9697K0294K1081K2655K4836K6777K7777K7872K7650K7609K7767
61110A064207K7817K7496K6759K5599K3913K1663J9109J6672J4478J2126R012
61099A288851M929L46l955p494j0388j3002j5443j7532j9216k0720k2135k3154
61087A141087k3474k3289k3023k2691k1952k0836j9915j9570j9450j8940j7881
61076I10066j6506j4951j3267j1766j0878j0584j0317r578q517p647p182o756
$$ y = [690639, 683822, 676623, 669523, 662745, 656263, 650169, 644914, 641089, 638972, 638269, 638332, 638745, 639705, 641818, 645558, 650898, 657241, 663521, 668513, 671412, 672231, 671530, 669704, 666712, 662559, 657827, 653543, 650593, 649428, 650253, 653209, 658283, 665099, 673011, 681489, 690489, 700426, 711757, 724593, 738810, 754401, 771542, 790192, 809889, 830183, 851264, 873919, 898755, 925532, 953309, 981181, 1008831, 1036440, 1064207, 1092024, 1119520, 1146279, 1171878, 1195791, 1217454, 1236563, 1253235, 1267713, 1279839, 1288851, 1293780, 1294126, 1290171, 1282677, 1272289, 1259287, 1243844, 1226312, 1207096, 1186376, 1164241, 1141087, 1117613, 1094324, 1071301, 1048610, 1026658, 1005822, 985907, 966337, 946887, 927947, 910066, 893560, 878609, 865342, 853576, 842698, 832114, 821797, 812219, 803702, 796055, 788873, 782117]
61064G82117n881m539l219k404k097j983j861j645j054K31K009L589M661N731
61050G73655P334R046R931R837R712J0455J1872J3083J3728J4347J5642J7544
61038I16186J9276K0220K0544K0866K1489K2296K3233K4479K6041K7694K9458
61027A171782L1708L4439L6902L8406L9162L9962M1328M3560M7251N3039O0832
61016A638371O9915P9837R0784J03256J17820J35220J56464J82908K16412K58700
61006C049687L10097L69616M37071N14551O05438P13536Q44103J002320J186044
60997I032463J380237J561991J708594J791872J764162J568598J188414O94009
60989B0690340K26812q2517j89647j39440j1683J19683J82337R7742j84632o33938
$$ y = [782117, 776236, 771697, 768478, 766074, 763977, 761994, 760133, 758488, 757434, 757665, 759674, 763263, 767924, 773655, 780989, 790035, 799966, 809803, 819515, 829970, 841842, 854925, 868653, 883000, 898642, 916186, 935462, 955682, 976226, 997092, 1018581, 1040877, 1064110, 1088589, 1114630, 1142324, 1171782, 1203490, 1237929, 1274831, 1313237, 1352399, 1392361, 1433689, 1477249, 1524500, 1577539, 1638371, 1708286, 1788123, 1878907, 1982163, 2099983, 2235203, 2391667, 2574575, 2790987, 3049687, 3359784, 3729400, 4166471, 4681022, 5286460, 5999996, 6844099, 7846419, 9032463, 10412700, 11974691, 13683285, 15475157, 17239319, 18807917, 19996331, 20690340, 20917152, 20834635, 20644988, 20505548, 20493865, 20613548, 20795885, 20893627, 20708995, 20075057]
60979B0075057j131961j536910j763042j808868j725740j572247j392003j212789
60971G931497j048951r02870p70782o50601n43863m51967l74017l08628k55322
60962B624496k13301j80580j54987j34875j18543j04246r1269q0044p0815o2961
60952A412875n5790m9055m2643l6686l2105k9892k9605k9591k8960k8303k8184
60941A022061k8103k7428k6316k5126k3790k2351k1218k0431j9560j8772j8897
60930G70069j9778j9669j7362j4008j1758j1179j1098j0485r382q272p504p258
60918F22316p277o846n709m713m698n167m934l880l031k896k815k154j203o06
60904E66387n22p78j282j920k454k752k915k981k894k874l375m455n457n680n142
$$ y = [20075057, 18943096, 17406186, 15643144, 13834276, 12108536, 10536289, 9144286, 7931497, 6882546, 5979676, 5208894, 4558293, 4014430, 3562463, 3188446, 2879818, 2624496, 2411195, 2230615, 2075628, 1940753, 1822210, 1717964, 1626695, 1546651, 1475836, 1412875, 1357085, 1308030, 1265387, 1228701, 1196596, 1166704, 1137099, 1107508, 1078548, 1050245, 1022061, 993958, 966530, 940214, 915088, 891298, 868947, 847729, 827298, 807738, 788966, 770069, 750291, 730622, 713260, 699252, 687494, 676315, 665217, 654732, 645350, 637078, 629574, 622316, 615039, 608193, 602484, 597771, 593073, 587906, 582972, 579092, 576061, 573165, 570350, 568196, 566993, 566387, 565865, 565087, 563805, 561885, 559431, 556679, 553764, 550783, 547889, 545015, 541640, 537185, 531728, 526048, 520906]
60889E20906m425l888l374k696k163k336l289m372m869m664m062l267k436k040
60875D73025k432l106l052k019q59l42l26l41l06j33O22K084L454L820L286K698
60859D76073K550K673K722K461J749P86Q4j47k50m12k68K75N09m5p17p22n69j347
60841D85405k919m038m157l948m092m590n417o684p918q165p214n896m873l983
60827D11511l015k281j980j872j956k662l825m344l494k012j204j419j973k146
60813C77328j771j121o96q13j125r37k51R8l37q84p22J7O83J098J452J629J375
60796C75023Q61M66K50J77M72J141J495Q93k24q27o16j38K74P98J277J006k55
60779C82073j753k621k811k747k497j808p89l0Pn37j123j370j326j181q77j60
$$ y = [520906, 516481, 512593, 509219, 506523, 504360, 502024, 498735, 494363, 489494, 484830, 480768, 477501, 475065, 473025, 470593, 467487, 464435, 462416, 461557, 461215, 460889, 460548, 460242, 460109, 460731, 462815, 466269, 470089, 473375, 476073, 478623, 481296, 484018, 486479, 488228, 489014, 489098, 488951, 488701, 488289, 488021, 488296, 488805, 488760, 488043, 487321, 486752, 485405, 482486, 478448, 474291, 470343, 466251, 461661, 456244, 449560, 441642, 433477, 426263, 420367, 415494, 411511, 408496, 406215, 404235, 402363, 400407, 397745, 393920, 389576, 386082, 384070, 382866, 381447, 379474, 377328, 375557, 374436, 373740, 372927, 371802, 370865, 370614, 370712, 370375, 369491, 368769, 368786, 369469, 370567, 372019, 373648, 375023, 375884, 376350, 376600, 376777, 377249, 378390, 379885, 380778, 380554, 379727, 379111, 378973, 379247, 380045, 381322, 382328, 382073, 380320, 377699, 374888, 372141, 369644, 367836, 367047, 367017, 367024, 366487, 365364, 363994, 362668, 361487, 360610, 360450]
60763C60450R01J713J753J213P59P45Q67P20K93q0q0L66J016J430J365J059R95
60746C75485J337J819K182K376K265J554K69j015j797k306l037l804l804k728
60732C68796j334n44m29l67M7P21J403J846J730J061M68N60R54P36o2l10M70J147
60714C76893N68o83j105m77l0m98j190j290j074j243j835k328k428k209j799j344
60698C57928j016p80m27n9j44q07j454j441q10l1O70J250J520J352J073J199J789
60681C59812K459K912L163L263L183K984K852K932L235L640L850L507K499J059
60667D01350m89j914k951l328l120k766k476j945j012k33l11j114j776j687r59
60652C75269RR01J460J621J792K481L469L781K837J266K15K7K3n13j541k461k776
$$ y = [360450, 361351, 363064, 364817, 366030, 366789, 367534, 368401, 369121, 369414, 369334, 369254, 369620, 370636, 372066, 373431, 374490, 375485, 376822, 378641, 380823, 383199, 385464, 387018, 387287, 386272, 384475, 382169, 379132, 375328, 371524, 368796, 367462, 366918, 366489, 366122, 366169, 366890, 368293, 370139, 371869, 372930, 373398, 373958, 374912, 375648, 375586, 375276, 375746, 376893, 377461, 376778, 375673, 375196, 375166, 374668, 373478, 372188, 371114, 369871, 368036, 365708, 363280, 361071, 359272, 357928, 356912, 356132, 355705, 355646, 355502, 354695, 353241, 351800, 350990, 350959, 351629, 352879, 354399, 355751, 356824, 358023, 359812, 362271, 365183, 368346, 371609, 374792, 377776, 380628, 383560, 386795, 390435, 394285, 397792, 400291, 401350, 400861, 398947, 395996, 392668, 389548, 386782, 384306, 382361, 381349, 381116, 380805, 379691, 377915, 376228, 375269, 375278, 376179, 377639, 379260, 381052, 383533, 387002, 390783, 393620, 394886, 395101, 395128, 395151, 394638, 393097, 390636, 387860]
60635C87860k380j455m21J37j22q91j393j128k75O43J244J367R95M24J62L41M80
60618C85588J79j99j2O60J122J043P57N92N35N85P96Q64M01k20j02P95J358Q33
60600C95575j25n28m25l47j34O69J652J892J374J064J483K066K148J822J504J265
60584D10955R42N25J35j08o1L30Q57J276J671K291L047L593L908M349N136O101
60568D44947P059Q000Q893R646J0286J0762J0648R544P778O145M790K982K90k574
60554E39196m505n204n154m746l981k879j613j97J614L848O004P408P908Q123
60540E45822Q909J0601J2838J5102J7265J9401K1346K2720K3352K3304K2499K0566
60528G63725J7174J2361O563N52m736q718j1531j3656j5165j5740j5399j4692
$$ y = [387860, 385480, 384025, 383604, 383741, 383619, 382728, 381335, 380207, 379932, 380575, 381819, 383186, 384181, 384605, 384767, 385108, 385588, 385767, 385568, 385556, 386216, 387338, 388381, 389138, 389730, 390265, 390850, 391646, 392510, 392911, 392691, 392589, 393384, 394742, 395575, 395450, 394922, 394497, 394150, 394016, 394685, 396337, 398229, 399603, 400667, 402150, 404216, 406364, 408186, 409690, 410955, 411897, 412422, 412557, 412449, 412388, 412718, 413575, 414851, 416522, 418813, 421860, 425453, 429361, 433710, 438846, 444947, 452006, 460006, 468899, 478545, 488831, 499593, 510241, 519785, 527563, 533708, 538498, 541480, 541770, 539196, 534691, 529487, 524333, 519587, 515606, 512727, 511114, 510917, 512531, 516379, 522383, 529791, 537699, 545822, 554731, 565332, 578170, 593272, 610537, 629938, 651284, 674004, 697356, 720660, 743159, 763725, 780899, 793260, 799823, 800375, 795639, 786921, 775390, 761734, 746569, 730829, 715430, 700738]
60516G00738j3929j2686j0482p703n383m090l358k302n59J475L325N186P795J1525
60502F69552J5814J9771K3228K6821L1014L5412L9288M2407M4980M6944M7680
60491A042911M6676M4206M1162L8157L4995L1233K7028K3065J9517J5556J0137
60480A374643K982n575j5315k6049l6997m6855n4665o0126o3063o3228o0859n6913
60468H87980n2337m7455m2298l7180l2531k8488k5003k2120j9805j7682j5414
60457E47667j3200j1542j0567r856q983p843o475m940l444k367j988k228k761
60444D61473l222l322k985k483k241k344k390j994j380j151j491j892j854j543
60430D31181j417j426j085l51J60N9j75O2N17L65n20j236r22K18J263J672J773
$$ y = [700738, 686809, 674123, 663641, 655938, 650555, 646465, 643107, 640805, 640246, 641721, 645046, 650232, 658027, 669552, 685366, 705137, 728365, 755186, 786200, 821612, 860900, 903307, 948287, 995231, 1042911, 1089587, 1133793, 1174955, 1213112, 1248107, 1279340, 1306368, 1329433, 1348950, 1364506, 1374643, 1377625, 1372050, 1356735, 1330686, 1293689, 1246834, 1192169, 1132043, 1068980, 1005752, 944893, 887980, 835643, 788188, 745890, 708710, 676179, 647691, 622688, 600568, 580763, 563081, 547667, 534467, 522925, 512358, 502502, 493519, 485676, 479201, 474261, 470817, 468450, 466462, 464234, 461473, 458251, 454929, 451944, 449461, 447220, 444876, 442486, 440492, 439112, 437961, 436470, 434578, 432724, 431181, 429764, 428338, 427253, 426902, 427062, 427121, 426946, 427008, 427525, 427890, 427370, 426134, 425212, 425430, 426693, 428365, 430138]
60413D30138K180K995L706L777L218K451J774J234R01R02J043Q95N22O41J648
60398D58025K880L410L274L203L366L222K703K605L481M722N256M729L625K542
60384E07043J836J690K075K634K983L091L206L447L638L571L284L079L205L534
60370E48316L600L108K290J569J110Q30Q08J183J788K260K551K996L871N180O819
60355E88279Q520R724J0023R784R775J0124J0193R509Q204O402L908Q70j943m013
60341F79359n653p278q579r029q716q128p429o580n856n604n625n413m925m595
60327E85949m605m693m654m594m613m556m148l210j729N7J803L439N185P026Q506
60312E75163R393J0204J1547J3110J3863J3275J1889J0656J0066R922R658Q854
$$ y = [430138, 432318, 435313, 439019, 442796, 446014, 448465, 450239, 451473, 452374, 453276, 454319, 455214, 455736, 456377, 458025, 460905, 464315, 467589, 470792, 474158, 477380, 480083, 482688, 486169, 490891, 496147, 500876, 504501, 507043, 508879, 510569, 512644, 515278, 518261, 521352, 524558, 528005, 531643, 535214, 538498, 541577, 544782, 548316, 551916, 555024, 557314, 558883, 559993, 560823, 561631, 562814, 564602, 566862, 569413, 572409, 576280, 581460, 588279, 596799, 606523, 616546, 626330, 636105, 646229, 656422, 665931, 674135, 680537, 684445, 685315, 683372, 679359, 673706, 666428, 657849, 648820, 640104, 631976, 624547, 617967, 612111, 606507, 600882, 595469, 590544, 585949, 581344, 576651, 571997, 567403, 562790, 558234, 554086, 550876, 549147, 549204, 551007, 554446, 559631, 566657, 575163, 584556, 594760, 606307, 619417, 633280, 646555, 658444, 669100, 679166, 689088, 698746, 707600]
60300G07600P611O326M971K904k98m126p709j0813j3705j6229j7718j7833j6920
60287F24061j5463j3705j1918j0422r176p801o222m917m286m186m257m380m567
60274E22761m643m329l557k620k078k424l499m411m372l657l221l423l636l198
60260D73693k181r71K85J401J925J667J169J090J440J850K345L183M108M428L881
60245D99313K905J973J152M98L35P35J089O46n59j704k049j574p05K37J141J908
60229E05341K445K845L335L940M394M491M378M356M469M513M429M458M898N782
60215E64074O846P721Q091P851P231O669O531O946P840Q931R667R506Q450P197
60201F73551O416O030N417M388L554L536M046M093L058J284m84j950l282m550
$$ y = [707600, 715211, 721537, 726508, 729412, 729114, 724988, 717279, 706466, 692761, 676532, 658814, 640981, 624061, 608598, 594893, 582975, 572553, 563377, 555576, 549354, 544437, 540151, 535965, 531708, 527328, 522761, 518118, 513789, 510232, 507612, 505534, 503110, 499611, 495200, 490828, 487171, 483950, 480527, 476891, 473693, 471512, 470541, 470826, 472227, 474152, 475819, 476988, 478078, 479518, 481368, 483713, 486896, 491004, 495432, 499313, 502218, 504191, 505343, 505841, 506176, 506911, 508000, 508646, 508087, 506383, 504334, 502760, 502055, 502292, 503433, 505341, 507786, 510631, 513966, 517906, 522300, 526791, 531169, 535525, 539994, 544507, 548936, 553394, 558292, 564074, 570920, 578641, 586732, 594583, 601814, 608483, 615014, 621960, 629800, 638731, 648398, 657904, 666354, 673551, 679967, 685997, 691414, 695802, 699356, 702892, 706938, 711031, 714089, 715373, 714889, 712939, 709657, 705107]
60187G05107n430n618n206m577m013l603l431l645m239m873n036m533l738l293
60173F43872l466l838l764l058k148j568j512j842k291k606k662k580k544k472
60159F07521k049j241m85j63o8K57P98J071Q85O54Q32J317J679J758J703J558
60143F16027J203Q02Q29J466K225K640L041M161N907P136O971N868M951M630M408
60128F72265L875L223K774K499K236K008J926K046K373K813L059K863K405K082
60114G08447J968J885J951K450L134L320K832K237J889J417O22J00L26P26M16
60099G33720n23j268j435j251q63k27L61M84K94K65L04j42j086j915k453l242
60083G21023m449n332n291m767m615m997n503n893o148o071n514m921n030o009
$$ y = [705107, 699677, 694059, 688853, 684276, 680263, 676660, 673229, 669584, 665345, 660472, 655436, 650903, 647165, 643872, 640406, 636568, 632804, 629746, 627598, 626030, 624518, 622676, 620385, 617779, 615117, 612537, 609993, 607521, 605472, 604231, 603746, 603583, 603515, 603772, 604570, 605641, 606526, 607180, 608012, 609329, 611008, 612766, 614469, 616027, 617230, 618032, 618861, 620327, 622552, 625192, 628233, 632394, 638301, 645437, 652408, 658276, 663227, 667857, 672265, 676140, 679363, 682137, 684636, 686872, 688880, 690806, 692852, 695225, 698038, 701097, 703960, 706365, 708447, 710415, 712300, 714251, 716701, 719835, 723155, 725987, 728224, 730113, 731530, 732152, 732252, 732578, 733304, 733720, 733197, 731929, 730494, 729243, 728380, 728153, 728514, 728998, 729292, 729557, 729861, 729719, 728633, 726718, 724265, 721023, 716574, 711242, 705951, 701184, 696569, 691572, 686069, 680176, 674028, 667957, 662443, 657522, 652492, 646483]
60069F46483p173p671p220o233n402n177n412n541n208m592m044l598l084k494
60055E73634j972j521j006m57n7J97N55J141J742K131K476L170M228N085N156
60040E94502M537L937L787L690K940J526K14m05o37j207k277l298l811m031m443
60025E95024n125n764o288o959p802q323q081p281o393n451m248l137k871l527
60011E13774m190m124l659l461l377k726j477m32j97n85j034j188r72n34k56m20
59995D85142p36n73K73J382K294K945L375L515L477L692M383N111N158M238K682
59980E26358J058k08r85j423j701j770j489j072j062j648k261k184j409n63p6
59965E09565J99N05P74R06J136J748K529K957K900K790K892K802K030Q05j65o12
$$ y = [646483, 639310, 631639, 624419, 618186, 612784, 607607, 602195, 596654, 591446, 586854, 582810, 579212, 576128, 573634, 571662, 570141, 569135, 568678, 568621, 568818, 569373, 570514, 572256, 574387, 576863, 580033, 584261, 589346, 594502, 599039, 602976, 606763, 610453, 613393, 614919, 615133, 614728, 614091, 612884, 610607, 607309, 603498, 599467, 595024, 589899, 584135, 577847, 570888, 563086, 554763, 546682, 539401, 533008, 527557, 523309, 520172, 517301, 513774, 509584, 505460, 501801, 498340, 494963, 492237, 490760, 490328, 490131, 489546, 488512, 487324, 486352, 485818, 485562, 485142, 484406, 483833, 484106, 485488, 487782, 490727, 494102, 497617, 501094, 504786, 509169, 514280, 519438, 523676, 526358, 527416, 527208, 526223, 524800, 523099, 521329, 519840, 518768, 517706, 516058, 513797, 511613, 510204, 509641, 509565, 509764, 510269, 511043, 511949, 513085, 514833, 517362, 520319, 523219, 526009, 528901, 531703, 533733, 534538, 534373, 533761]
59949E33761q72j158j294j250j355j706j889j664j459j717k168k215j684p46N51
59934E13135K075L261L605L392L352L692M052M215M252M009L194J943P53j77r57
59919E53796j410j120j81P49J314J774K386L060L763M652N562N940N555M777L972
59904E94589L104K111J116M6j294k573l040k647k375k899l527l147j705j02J121
59889E78778K227L448M365M374L546K813L126M353N259M949M073M033N016N648
59875F36008M774K847J160M49O29J281J787J507L93q73j746k351k811k722j866
59860F38466q53l67k29J07O22J027J522K456L480L961L981M126M486M737N078
59845F72600O082P469Q004O935M909L119K120J701J465J217J033J132J453J368
$$ y = [533761, 532889, 531731, 530437, 529187, 527832, 526126, 524237, 522573, 521114, 519397, 517229, 515014, 513330, 512584, 513135, 515210, 518471, 522076, 525468, 528820, 532512, 536564, 540779, 545031, 549040, 552234, 554177, 554930, 554753, 553796, 552386, 551266, 551085, 551834, 553148, 554922, 557308, 560368, 564131, 568783, 574345, 580285, 585840, 590617, 594589, 597693, 599804, 600920, 600966, 599672, 597099, 594059, 591412, 589037, 586138, 582611, 579464, 577759, 577657, 578778, 581005, 584453, 588818, 593192, 596738, 599551, 602677, 607030, 612289, 617238, 621311, 625344, 630360, 636008, 640782, 643629, 644789, 645238, 645867, 647148, 648935, 650442, 650835, 649962, 648216, 645865, 643054, 640332, 638466, 637613, 637246, 637017, 637124, 637746, 638773, 640295, 642751, 646231, 650192, 654173, 658299, 662785, 667522, 672600, 678682, 686151, 694155, 701090, 705999, 709118, 711238, 712939, 714404, 715621, 716654, 717786, 719239, 720607]
59831G20607K18j824l776m828n013m953n298o300p611q435q266p379o446n759
59817F44937n178m494l478j898j10P36p9j632k237j511o55o27j004r53l65L90
59801F21842J023J200N75m76q54r9R04J114O44J54l73j289k147k101j345j072
59785F17700j844k858l144k691k048j536j333j656k295k410j503k54L17K45M28
59770E95118J151J712J692J647K098K669K909L280M378N637N973N533N628O756
59756F46181P847P998P874Q523R636R996R276Q346P920P844P699P374O899O338
59742G59751O008O191O503O084M649K913J702J056M55l92j289j884k030j853j583
59727G86281j341j148j139j477j933j958j501j324j942k616k259j115o01j289
$$ y = [720607, 720825, 719001, 715225, 710397, 705384, 700431, 695133, 688833, 681222, 672787, 664521, 657142, 650696, 644937, 639759, 635265, 631787, 629889, 629779, 630515, 630436, 628804, 626567, 625056, 624401, 623774, 622770, 621817, 621452, 621842, 622865, 624065, 624640, 624164, 623310, 623211, 624115, 625229, 625873, 626027, 625654, 624365, 622218, 620117, 618772, 617700, 615856, 612998, 609854, 607163, 605115, 603579, 602246, 600590, 598295, 595885, 594382, 594128, 594445, 594690, 595118, 596269, 597981, 599673, 601320, 603418, 606087, 608996, 612276, 616654, 622291, 628264, 633797, 639425, 646181, 654028, 662026, 669900, 678423, 688059, 698055, 707331, 715677, 723597, 731441, 739140, 746514, 753413, 759751, 765759, 771950, 778453, 784537, 789186, 792099, 793801, 794857, 795312, 794920, 793631, 791747, 789717, 787864, 786281, 784940, 783792, 782653, 781176, 779243, 777285, 775784, 774460, 772518, 769902, 767643, 766528, 765927, 764638]
59713G64638k075j729m88N04P82R46J667K948M236N029N360N834O898Q151Q821
59698H11522Q932R320J0183J0472R355P585O517O137N193L159J069N5n5j71o31
59683H88642j126j592k479l995n643o754p241p580q123q698q972q918q748q528
59669H00245q142p550o773n664m125k581j730j584j251l3J642K966L919M971N847
59654G80157N669M496L700M239N265N213L736J724k45k454n037p392r005j0122
59640G79944j1161j1939j2017j1485j0871j0454j0091r581q866p979p128o644
59628F61728o555o446o074n895o508p787q954r387q876p473n680m521m565n041
59614E67966m722l657k988l032k755j574m10j95l68N5Q22R85N71M26P17Q08N31
$$ y = [764638, 762563, 760834, 760346, 760850, 761632, 762578, 764245, 767193, 771429, 776458, 781818, 787652, 794550, 802701, 811522, 820454, 829774, 839957, 850429, 859784, 867369, 873886, 880023, 885216, 888375, 889444, 889499, 889444, 889273, 888642, 887516, 885924, 883445, 879450, 873807, 867053, 859812, 852232, 844109, 835411, 826439, 817521, 808773, 800245, 792103, 784553, 777780, 772116, 767991, 765410, 763680, 762096, 760845, 760812, 762454, 765420, 769339, 774310, 780157, 785826, 790322, 794022, 798261, 803526, 808739, 812475, 814199, 813954, 811500, 806463, 799071, 790066, 779944, 768783, 756844, 744827, 733342, 722471, 712017, 701926, 692345, 683479, 675500, 668372, 661728, 655173, 648727, 642653, 636758, 630250, 622463, 613509, 604122, 595246, 587773, 582093, 577572, 573007, 567966, 563244, 559587, 556599, 553567, 550812, 549238, 548828, 548633, 548265, 548320, 549142, 550127, 550698, 551124, 551841, 552649, 553180]
59597E53180M58P74R51P65P66J372K221K742K811K538J987J343R12O20J8r82j807
59580E70669j973j749j763k192k712k978k962k851k777k652k272j688j281j275
59566E39544j431j438j381j401j238o47m2J0k64j21N10R07P05L47J98N9j41J06
59548E34282J070K230K982L511M417N866P572R257J0737J1864J2845J4268J6290
59535F37191J7882J7345J3696P555Q34m380p000p328o391m949l350j994j268j052
59521F56791q27n08n32j075j771k489l571m999o104o563o994p850q403p747o316
59506E91042n431n508n680n251m602m366m411m191l673l319l223k784j443N30
59492E37690K300L410M040M301L945L142K900L889N238N515M713M210M623M953
$$ y = [553180, 553638, 554412, 555363, 556128, 556894, 558266, 560487, 563229, 566040, 568578, 570565, 571908, 572820, 573440, 573458, 572476, 570669, 568696, 566947, 565184, 562992, 560280, 557302, 554340, 551489, 548712, 546060, 543788, 542100, 540819, 539544, 538113, 536675, 535294, 533893, 532655, 532008, 531966, 531976, 531712, 531591, 532101, 533008, 533713, 534060, 534258, 534317, 534176, 534282, 535352, 537582, 540564, 544075, 548492, 554358, 561930, 571187, 581924, 593788, 606633, 620901, 637191, 655073, 672418, 686114, 693669, 694503, 690123, 683123, 675795, 669404, 664455, 661105, 659111, 657843, 656791, 655964, 655456, 654924, 653849, 652078, 649589, 646018, 641019, 634915, 628352, 621358, 613508, 605105, 597358, 591042, 585611, 580103, 574423, 569172, 564570, 560204, 555793, 551602, 547929, 544610, 541387, 538603, 537160, 537690, 539990, 543400, 547440, 551741, 555686, 558828, 561728, 565617, 570855, 576370, 581083, 585293, 589916, 594869]
59478E94869M324L357L103L512L868L959L830L070J405l31r33l19N46J031J260
59463F26551J345J210J165J707K621L089K893K728L090L640L937M161M593M974
59449F67704M839M222L521K850J929N27j162k675l673m189m493m677m572m116
59435F56035l549l026k341j353m84k17l21m8Q95K154L480N071P004Q832J0162
59420F82294J1242J2593J4287J5927J7250J8417J9696K1083K2313K3074K2920
59409H81096K1045J6564R492J446n086q391q463o429l449j89L171O642R752J0926
59395I28127Q253J433p324j4800j9027j9966j8677j6461j4427j2897j1318r248
59383G93668p268o262o022n452m098k651j823j439j005m83q9J90N29R96J579K207
$$ y = [594869, 599193, 602550, 605653, 609165, 613033, 616992, 620822, 623892, 625297, 624966, 624033, 623714, 624260, 625291, 626551, 627896, 629106, 630271, 631978, 634599, 637688, 640581, 643309, 646399, 650039, 653976, 658137, 662730, 667704, 672543, 676765, 680286, 683136, 685065, 685592, 684430, 681755, 678082, 673893, 669400, 664723, 660151, 656035, 652486, 649460, 647119, 645766, 645282, 645065, 644744, 644696, 645591, 647745, 651225, 656296, 663300, 672132, 682294, 693536, 706129, 720416, 736343, 753593, 772010, 791706, 812789, 835102, 858176, 881096, 902141, 918705, 928197, 929643, 924557, 916166, 907703, 901274, 897825, 897636, 900807, 907449, 917201, 928127, 936380, 937813, 930489, 915689, 896662, 876696, 858019, 841558, 827131, 814234, 802916, 793668, 786400, 780138, 774116, 768664, 764566, 761915, 760092, 758653, 757648, 757165, 757076, 757266, 757795, 758791, 760370, 762577]
59367G62577K581K385J833J655K325L561M762N641O289O888P549Q279R019R807
59353H35151J0834J2072J3006J3206J3130J3740J5216J6613J6936J6093J4549
59342I90546J2701J0920R615Q612O920L754l76m172p019r332j1508j3232j4136
59329I83293j4537j5043j5682j5951j5700j5405j5405j5284j4451j3138j2295
59318H20402j2410j2830j2546j1342r860q737q051p518o893o088n144m169l219
59305G11595k274j313k92J038K990N421P610Q940R538R760R230O956K521l181
59291G68539q548j2342j4084j3906j2285r890p341n030l106j566k82R82K517M441
59277F88099O494Q140R152J0016J1370J3052J4150J4176J3710J3550J3657J3414
$$ y = [762577, 765158, 767543, 769376, 771031, 773356, 776917, 781679, 787320, 793609, 800497, 808046, 816325, 825344, 835151, 845985, 858057, 871063, 884269, 897399, 911139, 926355, 942968, 959904, 975997, 990546, 1003247, 1014167, 1023782, 1032394, 1039314, 1043068, 1042692, 1038520, 1031501, 1022169, 1010661, 997429, 983293, 968756, 953713, 938031, 922080, 906380, 890975, 875570, 860286, 845835, 832697, 820402, 807992, 795162, 782616, 771274, 761414, 752677, 744626, 737108, 730215, 724127, 718983, 714814, 711595, 709321, 708008, 707716, 708754, 711744, 717165, 724775, 733715, 743253, 753013, 762243, 769199, 771720, 768539, 759991, 747649, 733565, 719659, 707374, 697484, 690143, 685113, 682007, 680441, 680159, 681141, 683658, 688099, 694593, 702733, 711885, 721901, 733271, 746323, 760473, 774649, 788359, 801909, 815566, 828980]
59265H28980J2615J1626J0729R808Q619O981M802K313Q2j540k811m021m833m782
59251H78568m133l619l426l166k800k735k947k817k113j435j337j639j997k531
59237H41873l357m042m178m190m852o068o800o408n551n392o193p128p516p695
59223G62503q300r035q860p512o115n793o270o367n581m368l130j808n43R0r0
59208F88821l75K3J032J952K390K594K891L202L205K885K739L208M036M436M019
59193G27058L200K583K334K388K792L376L596L160K523K149J749R13L9k21j69
59178G57470p54k114l434m220m748n100m831l926l219l301l758l847l376k576
59164G08266j674j042j120j824k487k705k798l131l601m032m467m766m591m162
$$ y = [828980, 841595, 853221, 863950, 873758, 882377, 889358, 894160, 896473, 896555, 895015, 892204, 888183, 883350, 878568, 874435, 870816, 867390, 864224, 861424, 858689, 855742, 852925, 850812, 849377, 848040, 846401, 844404, 841873, 838516, 834474, 830296, 826106, 821254, 815186, 808386, 801978, 796427, 791035, 784842, 777714, 770198, 762503, 754203, 745168, 736308, 728796, 722681, 716888, 710618, 704251, 698670, 694302, 691172, 689364, 688821, 688911, 688821, 688446, 688469, 689501, 691453, 693843, 696437, 699328, 702530, 705735, 708620, 711359, 714567, 718603, 723039, 727058, 730258, 732841, 735175, 737563, 740355, 743731, 747327, 750487, 753010, 755159, 756908, 757821, 757860, 757639, 757470, 756716, 754602, 751168, 746948, 742200, 737100, 732269, 728343, 725124, 721823, 718065, 714218, 710842, 708266, 706592, 705550, 704430, 702606, 700119, 697414, 694616, 691485, 687884, 683852, 679385, 674619, 670028, 665866]
59150F65866m356n486o608o683n864n011m434l843l259l138l631m304m680m632
59136E99937m254l669k950k098j111j01Q42J877L139M263M682M491M450M973N706
59121F20177O422P596R577J1715J2994J3202J2894J2471J1936J1449J1434J1980
59109G53847J2433J1847R855P174N103M272L972L061J396j83j184k000k980l793
59095H02820m120m249m489m542m052l252k523j798r07j65k2m70j238k275l544
59080G65174m713n490o015o495o786o767o743o999p257p052o415n757n333n137
59066F78215n057m840m296l777l885m425m327l172k052k202l272l847l277k145
59052F27641j186o10l92m04k29N01J488J991J679R69M83N12Q50R66N23m6R9J060
$$ y = [665866, 661510, 656024, 649416, 642733, 636869, 631858, 627424, 623581, 620322, 617184, 613553, 609249, 604569, 599937, 595683, 592014, 589064, 586966, 585855, 585754, 586596, 588473, 591612, 595875, 600557, 605048, 609498, 614471, 620177, 626599, 634195, 643772, 655487, 668481, 681683, 694577, 707048, 718984, 730433, 741867, 753847, 766280, 778127, 787982, 795156, 800259, 804531, 808503, 811564, 812960, 812777, 811593, 809593, 806613, 802820, 798700, 794451, 789962, 785420, 781368, 778116, 775593, 773795, 772888, 772723, 772701, 772231, 770993, 768718, 765174, 760461, 754971, 748956, 742461, 735675, 728908, 722165, 715166, 707909, 700857, 694442, 688685, 683352, 678215, 673158, 668318, 664022, 660245, 656360, 651935, 647608, 644436, 642384, 640182, 636910, 633063, 629786, 627641, 626455, 625845, 625453, 625049, 624820, 625321, 626809, 628800, 630479, 631448, 631931, 632443, 633293, 634259, 634782, 634736, 634835, 635895]
59034F35895J934K045J846K154L072M280N767P534R064R930J0566J1668J3123
59021G18878J4255J4699J4397J3153J1129R200P906O443L790M33k158l554m574
59008H03997n558n874n253m410l851l137j788r2J417K541L172L151K738K509K502
58993G92064K060P69j058k975m863o501p425p505p109o459n373l901k520j440
58979G37764k87J188K704L984N191O504P794R038J0438J1866J2730J2735J2345
58966H33994J2060J1780J1147J0113Q756P008M879K653N67j393l142m459n524
58953H88439o964q994j0984j2297j3115j3892j4450j4224j3268j2345j1884j1279
58941G44743r567o720l957k573k494k360j227K51P30m9j042j269o87K54J207J894
$$ y = [635895, 637829, 639874, 641720, 643874, 646946, 651226, 656993, 664527, 673591, 683521, 694087, 705755, 718878, 733133, 747832, 762229, 775382, 786511, 795711, 803617, 810060, 813850, 814283, 812125, 808571, 803997, 798439, 792565, 787312, 782902, 779051, 775914, 774126, 774034, 775451, 777992, 781164, 784315, 787053, 789562, 792064, 794124, 794893, 793835, 790860, 785997, 779496, 772071, 764566, 757457, 750998, 745625, 741724, 739204, 737764, 737477, 738665, 741369, 745353, 750544, 757048, 764842, 773880, 784318, 796184, 808914, 821649, 833994, 846054, 857834, 868981, 879094, 887850, 894858, 899737, 902390, 902957, 901564, 898422, 893963, 888439, 881475, 872481, 861497, 849200, 836085, 822193, 807743, 793519, 780251, 767906, 756022, 744743, 735176, 728456, 724499, 721926, 719432, 717072, 715845, 716096, 716826, 716777, 715735, 714466, 713779, 714033, 715240, 717134]
58925G17134K054J779J412J054N51M5n8K16L61K48M12J228K304L108L718M604
58909G40170N966P595R024R716R432Q717Q553R329J0533J1529J2162J2425J2090
58896H67241J1070R706Q406P319O603O550P189Q159R234J0528J1917J2780J2640
58883I89342J1692J0398R006P700O700N840M553K695R37p6n10q61j154j161j004
58868A044097r91j107j237j658k777m511o463q482j0700j3060j5247j6935j7867
58855I43062j7894j7271j6608j6195j5637j4504j3052j1822j0881j0017r376r338
58843G80467r832j0421j0969j1610j2067j1726j0568r425q997q971q509p270n670
58830F54432m259l262k620k208j865j401p16N7P05J258J998K980L714L641K966
$$ y = [717134, 719188, 720967, 722379, 723433, 723984, 724029, 723971, 724187, 724548, 724796, 725208, 726436, 728740, 731848, 735566, 740170, 746136, 753731, 762755, 772471, 781903, 790620, 799173, 808502, 819035, 830564, 842726, 855151, 867241, 878311, 888017, 896423, 903742, 910345, 916895, 924084, 932243, 941477, 952005, 963922, 976702, 989342, 1001034, 1011432, 1020438, 1028138, 1034838, 1040678, 1045231, 1047926, 1048863, 1048787, 1048277, 1047416, 1046262, 1045101, 1044097, 1043106, 1041999, 1040762, 1039104, 1036327, 1031816, 1025353, 1016871, 1006171, 993111, 977864, 960929, 943062, 925168, 907897, 891289, 875094, 859457, 844953, 831901, 820079, 809198, 799181, 789805, 780467, 770635, 760214, 749245, 737635, 725568, 713842, 703274, 693849, 684852, 675881, 667372, 660102, 654432, 650173, 646911, 644291, 642083, 640218, 638817, 638101, 638158, 638863, 640121, 642119, 645099, 648813, 652454, 655420]
58815F55420K565K960L669L862L365K659K075J456O27k13p40r40j119j553k196
58800F71897k730k882k763k863l547m566n162m853l953l128k523j604p7J531K528
58785F35305L090L997N418O616P075P259P803Q485Q660Q340Q095P996P331N480
58771G30950K569p74l923o448q192r273r806r701q982q078p439o969o315n536
58757F42083m957m524l847k879j928j050n9P99Q93J47n87n03L21J292K153L087
58741F30441M201N246N831N857N717N929O505O867O656O225O008N815N264M592
58727G11154M316M374M315M167M330M708M875M983N601O575P064O841O666P035
58713G87004P489P435O794N449L055r6k962n097p343j0419j3551j5423j5944j6179
$$ y = [655420, 657985, 660945, 664614, 668476, 671841, 674500, 676575, 678031, 678658, 678445, 677705, 676765, 675646, 674093, 671897, 669167, 666285, 663522, 660659, 657112, 652546, 647384, 642531, 638578, 635450, 632927, 631323, 631246, 632777, 635305, 638395, 642392, 647810, 654426, 661501, 668760, 676563, 685048, 693708, 702048, 710143, 718139, 725470, 730950, 733519, 732745, 728822, 722374, 714182, 704909, 695103, 685402, 676420, 668342, 660903, 653934, 647619, 642083, 637126, 632602, 628755, 625876, 623948, 622898, 622839, 623638, 624531, 624678, 624091, 623588, 623909, 625201, 627354, 630441, 634642, 639888, 645719, 651576, 657293, 663222, 669727, 676594, 683250, 689475, 695483, 701298, 706562, 711154, 715470, 719844, 724159, 728326, 732656, 737364, 742239, 747222, 752823, 759398, 766462, 773303, 779969, 787004, 794493, 801928, 808722, 814171, 817226, 817130, 814168, 809071, 801728, 791309, 777758, 762335, 746391, 730212]
58699G30212j6836j7623j8017j7913j7415j6496j5131j3509j2050j1094j0480
58688E63648r479p574n265l713l481m033m552m688m358l433k010n97L04O24O10
58673E12003N75Q63J617K661L809N202O827Q002Q136P779Q024Q815Q900P623N648
58658E96484L598J142k030n255p623q957r457r130q247p597p572p504o659n393
58644E15800m660m659m623l810k249o88K8j96m45K09J461K144J825J243R95Q13
58628E03188M22K19N19R07Q52L40m47j297j592o30J234K667L001K908L084L310
58612E18685L342L557M051M133L509K956L033L126K627K077K151K420K140J511
58598E59318J110Q66O10Q92K122L508L904L323K713K756L627N305P261Q490Q698
$$ y = [730212, 713376, 695753, 677736, 659823, 642408, 625912, 610781, 597272, 585222, 574128, 563648, 554169, 546595, 541330, 537617, 534136, 530103, 525551, 520863, 516505, 513072, 511062, 510465, 510769, 511393, 512003, 512578, 513441, 515058, 517719, 521528, 526730, 533557, 541559, 549695, 557474, 565498, 574313, 583213, 590836, 596484, 600082, 601224, 599194, 593939, 586316, 577359, 567902, 558772, 550525, 542928, 535356, 527852, 521193, 515800, 511140, 506481, 501858, 498048, 495799, 495111, 495139, 494943, 494498, 494707, 496168, 498312, 500137, 501380, 502375, 503188, 503610, 503829, 504348, 505255, 506107, 506447, 506000, 504703, 503111, 502481, 503715, 506382, 509383, 512291, 515375, 518685, 522027, 525584, 529635, 533768, 537277, 540233, 543266, 546392, 549019, 551096, 553247, 555667, 557807, 559318, 560428, 561294, 561904, 562796, 564918, 568426, 572330, 575653, 578366, 581122, 584749, 590054, 597315, 605805, 614503]
58583F14503Q848R763J0907J1389J1296J1092J0542R299P814O649N684M954N408
58570G28148P603J0464J2565J4016J5875J8421K1150K3765K5957K6945K6467K5488
58558I56864K4670K3051J9551J4855J0300N876J086l175n585o636p848r234r609
58545A014166r073r015r804j0591j1406j3302j6197j8604j9888k0973k2353k3185
58533H29775k2871k1915k0694j8926j6801j5122j3808j1753q781o243n111m781
58521F62969m412m076l964l702l205l056l295l006j863r52j239k088k186j290
58507F24635k53J80m2n02o78l60R5K58K65M13M32j19q12p44P7P57R64J404K649
58488F28619M459O370Q138R495J0252J0737J1398J2103J2593J3343J4899J6580
$$ y = [614503, 623351, 633114, 644021, 655410, 666706, 677798, 688340, 697639, 705453, 712102, 717786, 722740, 728148, 735751, 746215, 758780, 772796, 788671, 807092, 828242, 852007, 877964, 904909, 931376, 956864, 981534, 1004585, 1024136, 1038991, 1049291, 1055167, 1056253, 1053078, 1047493, 1040857, 1033009, 1023775, 1014166, 1005093, 996078, 986274, 975683, 964277, 950975, 934778, 916174, 896286, 875313, 852960, 829775, 806904, 784989, 764295, 745369, 728568, 713446, 699638, 687885, 679104, 672861, 667750, 662969, 658557, 654481, 650517, 646815, 643610, 640554, 637259, 634253, 632390, 631438, 630199, 628111, 625925, 624635, 624382, 624562, 624520, 624018, 623340, 622980, 623075, 623333, 623598, 624011, 624443, 624324, 623512, 622768, 622845, 623602, 624566, 625970, 628619, 633078, 639448, 647586, 657081, 667333, 678070, 689468, 701571, 714164, 727507, 742406, 758986]
58476G58986J6975J5699J3537J0992P859M261Q12k284n170p397q170p605o482
58463G92013m882k316P97L277M988P038R866J2475J3937J4422J4327J3506J1827
58450H91275R537O715L239n84m226p718j1250j4125j5270j4758j3622j2307j0503
58437H06403q393o594m966k893p17O15J312K544M442N897O495P055P999Q755R086
58422H37040R427R655Q914O987M473J541k001n423p558q594r687j0711j0383q708
58408H14972p295o834o323n243m406m057l166j408J5M25P57J783K894L500M043
58393G89657M822N274N100M758M385L698L273M176O031P224P334P468P852P264
58379H68316N371L514K507J796J371K247M278N748N965O211P326Q531R345J0363
$$ y = [758986, 775961, 791660, 805197, 816189, 824048, 828309, 829121, 826837, 821667, 814270, 806100, 798495, 792013, 787131, 784815, 785612, 788889, 793877, 800915, 810781, 823256, 837193, 851615, 865942, 879448, 891275, 900812, 907527, 910766, 910182, 905956, 898238, 886988, 872863, 857593, 842835, 829213, 816906, 806403, 798010, 791416, 786450, 783557, 782840, 783455, 784767, 787311, 791753, 797650, 804145, 811200, 819199, 827954, 837040, 846467, 856122, 865036, 872023, 876496, 878037, 876036, 870613, 863055, 854461, 844774, 834063, 823680, 814972, 807677, 800843, 794520, 789277, 784871, 780814, 777648, 776240, 776255, 776680, 777437, 779220, 782114, 785614, 789657, 794479, 799753, 804853, 809611, 813996, 817694, 820967, 825143, 831174, 838398, 845732, 853200, 861052, 868316, 873687, 877201, 879708, 881504, 882875, 885122, 889400, 895148, 901113, 907324, 914650, 923181, 932526, 942889]
58365I42889J1374J1150R993R925J1393J2358J1812J1340J1893J1792R709P028
58353A072656N367M176K630J623J922K423K214K350L782N440O147O558P515Q476
58339A133279R192J0877J3909J6468J7160J6988J7138J6991J6064J5515J5821
58328A299402J5244J2668R706P994O621M409K422J992K317K299K659M091N419
58315A377243N752O341Q115R633R706R787J1392J3432J4463J5280J6849J8041
58303A516034J7940J8015J9376K0348J9435J8226J8513J9117J8497J7994J9262
58292A722757K0914K1058K0860K2158K3807K3887K3462K4585K6491K7252K7392
58281A984623K8434K9705K9892K9990L1373L2957L3445L4350L7361M0892M2663
$$ y = [942889, 954263, 965413, 975406, 985331, 996724, 1009082, 1020894, 1032234, 1044127, 1055919, 1065628, 1072656, 1078023, 1082199, 1084829, 1086452, 1088374, 1090797, 1093011, 1095361, 1099143, 1104583, 1110730, 1117288, 1124803, 1133279, 1142471, 1153348, 1167257, 1183725, 1200885, 1217873, 1235011, 1252002, 1268066, 1283581, 1299402, 1314646, 1327314, 1337020, 1345014, 1351635, 1356044, 1358466, 1360458, 1362775, 1365074, 1367733, 1371824, 1377243, 1382995, 1389336, 1397451, 1407084, 1416790, 1426577, 1437969, 1451401, 1465864, 1481144, 1497993, 1516034, 1533974, 1551989, 1571365, 1591713, 1611148, 1629374, 1647887, 1667004, 1685501, 1703495, 1722757, 1743671, 1764729, 1785589, 1807747, 1831554, 1855441, 1878903, 1903488, 1929979, 1957231, 1984623, 2013057, 2042762, 2072654, 2102644, 2134017, 2166974, 2200419, 2234769, 2272130, 2313022, 2355685]
58270B355685M3671M6074M9299N1743N4111N7498O0485O1675O2816O5780O8955
58259B977792P0267P1057P3093P4745P4218P3695P5798P8828Q0046Q0860Q4064
58248C814463Q8840R3138R8068J05160J12361J17644J23370J32023J41121J47703
58238D973891J54120J63707J74484J83246J92050K04287K18114K30426K43395
58229F737720K60260K78653K95318L13218L36530L62966L88934M17557M53277
58220I844433M93278N33242N76575O28662O87231P48436Q17050R00141R96358
58211A6225406J102728J226092J376076J553413J758248K003228K305189K672090
58203C0222470L113094L652225M314704N108585O037583P121196Q383045R834599
$$ y = [2355685, 2399356, 2445430, 2494729, 2546472, 2600583, 2658081, 2718566, 2780241, 2843057, 2908837, 2977792, 3048059, 3119116, 3192209, 3266954, 3341172, 3414867, 3490665, 3569493, 3649539, 3730399, 3814463, 3903303, 3996441, 4094509, 4199669, 4312030, 4429674, 4553044, 4685067, 4826188, 4973891, 5128011, 5291718, 5466202, 5649448, 5841498, 6045785, 6263899, 6494325, 6737720, 6997980, 7276633, 7571951, 7885169, 8221699, 8584665, 8973599, 9391156, 9844433, 10337711, 10870953, 11447528, 12076190, 12763421, 13511857, 14328907, 15229048, 16225406, 17328134, 18554226, 19930302, 21483715, 23241963, 25245191, 27550380, 30222470, 33335564, 36987789, 41302493, 46411078, 52448661, 59569857, 67952902, 77787501]
58195G7787501J1497522J3431959J5717795J8415163K1542985K5028020K8603925
58188B12024870L1789922L4025777L4754775L3257899K8549982J9888661P750154
58181D02042040n760096j7801140k6359829l1086067l2833025l2658739l1274521
58174B24268623k9095600k6432049k3535607k0590151j7741646j5113247j2776987
58167G8983336j0746006r008468p548138o334468n324930m487089l801412l242742
58159B8490083k779187k390520k070173j808334j588849j402497j248049j119854
58151A4082620j007718r08455q24664p52859o84950o20304n64405n16582m70594
58142G732089m26214l88797l57994l28029k98748k75803k59889k45754k31772
$$ y = [77787501, 89285023, 102716982, 118434777, 136849940, 158392925, 183420945, 212024870, 243814792, 277840569, 312595344, 345853243, 374403225, 394291886, 402042040, 396281944, 378480804, 352120975, 321034908, 288201883, 255543144, 224268623, 195173023, 168740974, 145205367, 124615216, 106873570, 91760323, 78983336, 68237330, 59228862, 51680724, 45346256, 40021326, 35534237, 31732825, 28490083, 25710896, 23320376, 21250203, 19441869, 17853020, 16450523, 15202474, 14082620, 13074902, 12166447, 11341783, 10588924, 9903974, 9283670, 8719265, 8202683, 7732089, 7305875, 6917078, 6559084, 6231055, 5932307, 5656504, 5396615, 5150861, 4919089]
58133D919089k20884k12082k00458j86097j73918j64461j53429j40730j31216
58124C335814j25665j19345j10627j03224r8582r3548q7037q2021p9279p5648
58114B360838p0110o5630o3483o1284n7940n5273n3577n0673m6514m3787m3090
58103A749477m2107m0254l9513m0052l9551l7543l6093l5677l4681l3177l2918
58092A337911l3405l2244k9582k7799k6858k4441k0742j8483j7987j6964j5405
58081A074001j5845j8228j9306j7999j6868j7303j7664j7084j6898j7277j6550
58070H82979j4862j4433j5326j5024j3107j2175j3021j3086j1091r116q610q139
58058G34989o806o257p491q948r479j0045j0985j0741q989p939q783r666q896
$$ y = [4919089, 4698205, 4486123, 4285665, 4099568, 3925650, 3761189, 3607760, 3467030, 3335814, 3210149, 3090804, 2980177, 2876953, 2778371, 2684823, 2597786, 2515765, 2436486, 2360838, 2290728, 2225098, 2161615, 2100331, 2042391, 1987118, 1933541, 1882868, 1836354, 1792567, 1749477, 1707370, 1667116, 1627603, 1587551, 1548000, 1510457, 1474364, 1438687, 1404006, 1370829, 1337911, 1304506, 1272262, 1242680, 1214881, 1188023, 1163582, 1142840, 1124357, 1106370, 1089406, 1074001, 1058156, 1039928, 1020622, 1002623, 985755, 968452, 950788, 933704, 916806, 899529, 882979, 868117, 853684, 838358, 823334, 810227, 798052, 785031, 771945, 760854, 751738, 743128, 734989, 728183, 721926, 714435, 705487, 696008, 685963, 674978, 664237, 655248, 647309, 638526, 628860, 619964]
58045F19964p509o936o667n866n115m999m987m838n188n836n633m781m908o185
58031E40516o878o472o566p820q757q623q684r453r359p552n582m899m867m550
58017D40454m310m419m178l519l444l929l599k284j571j941j885q46l52j042j244
58002D01891n8Q27J11p46p6J336K058K497L558M586M680M580N241N852N075L173
57986D44585J264m41k158l366l625l676m401n421n772n232m154k863j880j754
57972D01106k073j734o60K3o9j8N73P35p8j041j468j803k304k343j749j397j689
57955C84011j936j869k184k955l170k600k320k700k680j812j130j094o75O31J820
57940C59337K472L774O192Q186Q586Q416Q877R403R166Q708Q440P238M357J191
$$ y = [619964, 612455, 605519, 598852, 592986, 587871, 582872, 577885, 573047, 567859, 562023, 556390, 551609, 546701, 540516, 533638, 527166, 520600, 512780, 504023, 495400, 486716, 477263, 467904, 460352, 454770, 449871, 445004, 440454, 436144, 431725, 427547, 424028, 420584, 416655, 413056, 410772, 409201, 407260, 405375, 404529, 404177, 403135, 401891, 401833, 402660, 402771, 402025, 401949, 403285, 405343, 407840, 411398, 415984, 420664, 425244, 430485, 436337, 441412, 444585, 445849, 445408, 443250, 439884, 436259, 432583, 428182, 422761, 416989, 411757, 407603, 404740, 402860, 401106, 399033, 397299, 396639, 396662, 396593, 396575, 397148, 397883, 397805, 396764, 395296, 393493, 391189, 388846, 387097, 385700, 384011, 382075, 380206, 378022, 375067, 371897, 369297, 366977, 364277, 361597, 359785, 358655, 357561, 356886, 357517, 359337, 361809, 365583, 371775, 379961, 388547, 396963, 405840, 415243, 424409, 433117, 441557, 448795, 453152, 454343]
57926D54343o49j636l024m630n676o586q065r428r600q824p864o416l945j185
57912C76815O56J511K006K179J919J704J800J641J035Q40J285R99r29l204m093
57897C86164l753l281k737j732r22j045j364p42M35R73P71N09J80n10j023p77
57881C71146l57n91j110j276j615k780l887l569k103q58j87N91J542K142K511
57866C59599L211M044M408M461M742N060N004N018N687O482O471N834N369N067
57852D30457M467L830L539K955J313o47j565j563k032l434m825n373n173m591
57838D17358l943l677l854l751k895k004j941k286k099j443r22l43P58J883K267
57823C93108K314K887L566L309K360J949K191K003J016Q6k65n04j084j953l128
$$ y = [454343, 453694, 452058, 449034, 444404, 438728, 432142, 424077, 414649, 405049, 396225, 388361, 381945, 378000, 376815, 377471, 378982, 380988, 383167, 385086, 386790, 388590, 390231, 391266, 392106, 393391, 394390, 393461, 390257, 386164, 382411, 379130, 376393, 374661, 373739, 372694, 371330, 370588, 371023, 371996, 372767, 373276, 373456, 372946, 371923, 371146, 370789, 370198, 369088, 367812, 366197, 363417, 359530, 355961, 353858, 353000, 352813, 353404, 354946, 357088, 359599, 362810, 366854, 371262, 375723, 380465, 385525, 390529, 395547, 401234, 407716, 414187, 420021, 425390, 430457, 434924, 438754, 442293, 445248, 446561, 445914, 444349, 442786, 440754, 437320, 432495, 427122, 421949, 417358, 413415, 409738, 405884, 402133, 399238, 397234, 395293, 393007, 390908, 389465, 388543, 388200, 388958, 390841, 393108, 395422, 398309, 401875, 405184, 407544, 409493, 411684, 413687, 414703, 414789, 414524, 414020, 412936, 410983, 407855]
57808D07855m653n993o521o530o701o835o219n042m176l820l544l422l778m039
57794C36582l246j677o31n88q27q36p48m46N13J885K882L395L954M536M552M135
57778C53435M163M880N548N527M743L196J137m67q54p83j703l650n279n822n713
57763C58358n276m433l727m074n111n323m192k838k084j383k54O65P99P29J236
57748C23092K146K901L472M059M528M747M846M732M039K929K243K429K931L050
57734C72144K785K472K265K283K667L129K981J950N67m31o92k80L42M33l45j394
57718C90876j852j662j332r58l80qm74j509k217k449k807l333l326k647k043j913
57702C61966j779j241m90M10J685L048L663L341K837K607K187J158p2q54r78n29
$$ y = [407855, 403202, 397209, 390688, 384158, 377457, 370622, 364403, 359361, 355185, 351365, 347821, 344399, 340621, 336582, 333336, 331659, 331028, 330440, 329613, 328777, 328029, 327583, 328096, 329981, 332863, 336258, 340212, 344748, 349300, 353435, 357598, 362478, 368026, 373553, 378296, 381492, 382629, 382162, 381308, 380525, 378822, 375172, 369893, 364071, 358358, 353082, 348649, 344922, 340848, 335737, 330414, 326222, 323384, 321300, 319917, 319663, 320328, 321127, 321856, 323092, 325238, 328139, 331611, 335670, 340198, 344945, 349791, 354523, 358562, 361491, 363734, 366163, 369094, 372144, 374929, 377401, 379666, 381949, 384616, 387745, 390726, 392676, 393243, 392812, 392120, 391840, 392182, 392615, 392270, 390876, 389024, 387362, 386030, 385072, 384692, 384684, 384210, 382701, 380484, 378035, 375228, 371895, 368569, 365922, 363879, 361966, 360187, 358946, 358456, 358866, 360551, 363599, 367262, 370603, 373440, 376047, 378234, 379392, 379320, 378466, 377488, 376959]
57686C76959J90M88j61j176j295n9J930M177O744R445J1782J3957J6904K1020
57672D60905K5817L1074L7192M4109N0868N6675O1308O3914O2334N4113L7863
57661I86172J4131j3643l9241n6798o4889o6415o4277n8939n0761m2270l6175
57650E06895l2335k8617k4022j9354j5409j2184r665p980o689n054l118j689j223
57637C39556j369j641j893k136k358k547k565k148j276l47K02J99l61j232j787
57622C18297j568j112j345k080k107j083k21m82j200j302r01p42q18o92n46q12
57606C01286j146q09J13P36N08l84j545k601l175l202l092l084k828k140j635
57591B77002j911k542k717k420k181j948j221j56M00N3p47j496k071k358k119
$$ y = [376959, 377149, 377637, 377476, 376300, 375005, 374946, 376876, 381053, 387797, 397242, 409024, 422981, 439885, 460905, 486722, 517796, 554988, 599097, 649965, 706640, 767948, 831862, 894196, 948309, 986172, 1000303, 986660, 947419, 890621, 825732, 759317, 695040, 636101, 585340, 543070, 506895, 474560, 445943, 421921, 402567, 387158, 374974, 365309, 357329, 350640, 345586, 342468, 340779, 339556, 338187, 336546, 334653, 332517, 330159, 327612, 325047, 322899, 321623, 321276, 321478, 321677, 321316, 320084, 318297, 316729, 315617, 314272, 312192, 310085, 309002, 308781, 308299, 307099, 305797, 304896, 304154, 303336, 302644, 302098, 301286, 300140, 299331, 299444, 300180, 300688, 300304, 298759, 296158, 292983, 289781, 286689, 283605, 280777, 278637, 277002, 275091, 272549, 269832, 267412, 265231, 263283, 262062, 261906, 262306, 262359, 261612, 260116, 258045, 255687, 253568]
57576B53568j512j163j440j955k038j412m70M7l68j440k265k245j725j413j423
57561B32746j263o83j35k71j173k137k173r26Q90K102K275K050K270L040L778
57546B40390L869L122J855O17l31j175j934j939o20J340K468K225J465R71M71
57531B52794m97j583k161k132j645o56O38J476J388Q71O21O49P27J118K015K756
57515B56379K509J518Q39R56J411J691J766J743J615J393J115P53L74J47o6p27
57499B73416j803k459k125j411j223j410j179n73m69j107j637j397q09n77p23
57484B54514p80n65k36R2L77N02L95K61L80P54J029Q43J58o84j248j366j250j246
57466B51930j444j531j066M4J300J949J626N74o72j590j721r06L53J143J184J175
$$ y = [253568, 252056, 250893, 249453, 247498, 245460, 244048, 243578, 243625, 243257, 241817, 239552, 237307, 235582, 234169, 232746, 231483, 230800, 230665, 230394, 229221, 227084, 224911, 223985, 224875, 226977, 229252, 231302, 233572, 236612, 240390, 244259, 247381, 249236, 249853, 249522, 248347, 246413, 244474, 243854, 245194, 247662, 249887, 251352, 252323, 252794, 252297, 250714, 248553, 246421, 244776, 244120, 244758, 246234, 247622, 248493, 249114, 249763, 250490, 251608, 253623, 256379, 258888, 260406, 261245, 262201, 263612, 265303, 267069, 268812, 270427, 271820, 272935, 273688, 274062, 274209, 274143, 273416, 271613, 269154, 267029, 265618, 264395, 262985, 261806, 261233, 260764, 259657, 258020, 256623, 255814, 255237, 254514, 253734, 253169, 252933, 253025, 253402, 253904, 254299, 254560, 254940, 255694, 256723, 257566, 257724, 257040, 255792, 254426, 253176, 251930, 250486, 248955, 247889, 247933, 249233, 251182, 252808, 253382, 252710, 251120, 249399, 248493, 248846, 249989, 251173, 252348]
57450B52348J677K179J890J031N49P66J164J338J357J274J124J312K118K931K918
57435B75976K368K301K812K993K577K313K443K234J503J233J941K678K475J700
57421C07547J162Q62N00K68K61K2m46k18J109K456K753K517K806L511L888L921
57405C32919L897L328J688k75j309j294r36l34Q10J983K363K209K447K995K960
57390C53451K366K221K815L299L200L066L331L718M046M592N186N022L816K402
57376D02531J686J696J925K037J911J512R99N79J89k31l19L10J362K208K882L943
57360D25220N444O764P524P940Q240Q424Q601Q893Q997Q529P746P188O740N852
57346E32102M652L884L696L415K771K371K644L142L314L291L421L609L548L274
$$ y = [252348, 254025, 256204, 258094, 259125, 259674, 260440, 261604, 262942, 264299, 265573, 266697, 268009, 270127, 273058, 275976, 278344, 280645, 283457, 286450, 289027, 291340, 293783, 296017, 297520, 298753, 300694, 303372, 305847, 307547, 308709, 309571, 310071, 310339, 310600, 310622, 310176, 309958, 311067, 313523, 316276, 318793, 321599, 325110, 328998, 332919, 336816, 340144, 341832, 341557, 340248, 338954, 338018, 337684, 338494, 340477, 342840, 345049, 347496, 350491, 353451, 355817, 358038, 360853, 364152, 367352, 370418, 373749, 377467, 381513, 386105, 391291, 396313, 400129, 402531, 404217, 405913, 407838, 409875, 411786, 413298, 414297, 414876, 415065, 414834, 414515, 414825, 416187, 418395, 421277, 425220, 430664, 437428, 444952, 452892, 461132, 469556, 478157, 487050, 496047, 504576, 512322, 519510, 526250, 532102, 536754, 540638, 544334, 547749, 550520, 552891, 555535, 558677, 561991, 565282, 568703, 572312, 575860, 579134]
57332E79134L060L025L048K958K737K690L254M353N283N600N729O141O434O031
57318F39477N426N629O558P088O776O440O761P280P202O453N588N223N815P328
57304G29044Q925R566R110Q307P728P394P463Q287R576J0367J0238R858R943J0347
57290H56153J0523J0327J0000R868J0276J1285J2230J2276J1647J1541J2487J3554
57278I92167J3680J3120J2911J3376J3864J3728J3045J2435J2490J3255J4170
57267A138241J4611J4583J4554J4716J4850J4953J5295J5774J5838J5347J4980
57256A303742J5376J6329J7211J7760J8098J8307J8385J8413J8464J8591J9032
57245A499708K0108K1698K3092K3677K3515K3117K2938K3195K3878K4697K5219
$$ y = [579134, 582194, 585219, 588267, 591225, 593962, 596652, 599906, 604259, 609542, 615142, 620871, 627012, 633446, 639477, 644903, 650532, 657090, 664178, 670954, 677394, 684155, 691435, 698637, 705090, 710678, 715901, 721716, 729044, 737969, 747535, 756645, 764952, 772680, 780074, 787537, 795824, 805400, 815767, 826005, 835863, 845806, 856153, 866676, 877003, 887003, 896871, 907147, 918432, 930662, 942938, 954585, 966126, 978613, 992167, 1005847, 1018967, 1031878, 1045254, 1059118, 1072846, 1085891, 1098326, 1110816, 1124071, 1138241, 1152852, 1167435, 1181989, 1196705, 1211555, 1226508, 1241803, 1257577, 1273415, 1288762, 1303742, 1319118, 1335447, 1352658, 1370418, 1388516, 1406823, 1425208, 1443621, 1462085, 1480676, 1499708, 1519816, 1541514, 1564606, 1588283, 1611798, 1634915, 1657853, 1681048, 1704926, 1729623, 1754842]
57234A754842K5302K5261K5465K5962K6566K7152K7739K8412K9211L0077L0837
57223B056826L1417L1965L2671L3512L4282L4808L5085L5325L5828L6632L7282
57212B435633L7264L6684L6076L5653L5287L5178L5635L6155L5784L4769L4694
57201B828812L6301L8305L9295L9684M0634M1993M2814M3220M4145M5560M6563
57190C287326M7076M7954M9358N0393N0530N0187M9784M9230M8505M7659M6228
57179C824230M3793M1155L9883M0507M2158M3991M5828M7340M7857M7329M6431
57168D310502M5437M3974M2045M0286L8961L7759L6745L6383L6371L5568L3450
57157D737481L0730K8170K5723K3118K0420J7667J4745J1806R070O198K728r48
$$ y = [1754842, 1780144, 1805405, 1830870, 1856832, 1883398, 1910550, 1938289, 1966701, 1995912, 2025989, 2056826, 2088243, 2120208, 2152879, 2186391, 2220673, 2255481, 2290566, 2325891, 2361719, 2398351, 2435633, 2472897, 2509581, 2545657, 2581310, 2616597, 2651775, 2687410, 2723565, 2759349, 2794118, 2828812, 2865113, 2903418, 2942713, 2982397, 3023031, 3065024, 3107838, 3151058, 3195203, 3240763, 3287326, 3334402, 3382356, 3431714, 3482107, 3532637, 3582824, 3632608, 3681838, 3730343, 3778002, 3824230, 3868023, 3909178, 3949061, 3989568, 4031726, 4075717, 4121545, 4168885, 4216742, 4264071, 4310502, 4355939, 4399913, 4441958, 4482244, 4521205, 4558964, 4595709, 4632092, 4668463, 4704031, 4737481, 4768211, 4796381, 4822104, 4845222, 4865642, 4883309, 4898054, 4909860, 4918930, 4925128, 4927856, 4926908]
57145D926908m064o771r755j2660j4290j4469j4181j3647j1803q082l276J936
57133D815846P946J5006K2284K8808L4276L8364M0165L9101L5563L0240K3642
57122E131241J6627J0572O626N460P827J4335K4461L6635M9336O1405P1699P9727
57110E515951Q6558R4062J03492J15929J33318J57482J88805K27971K78526L45569
57100G247663M32040N38340O65193Q14518R87455J183614J401753J639088J890744
57091A6800408K152170K420458K690101K948375L175246L339337L386059L241583
57083D0153737K856541K261065J565536Q90274K92011k40592p34747j194416j606375
57074D4243034j960571k252958k478964k635796k728732k768758k764902k721567
$$ y = [4926908, 4922844, 4916073, 4906318, 4893658, 4879368, 4864899, 4850718, 4837071, 4825268, 4817186, 4813910, 4815846, 4823792, 4838798, 4861082, 4889890, 4924166, 4962530, 5002695, 5041796, 5077359, 5107599, 5131241, 5147868, 5158440, 5165066, 5170526, 5178353, 5192688, 5217149, 5253784, 5303120, 5364525, 5436224, 5515951, 5602509, 5696571, 5800063, 5915992, 6049310, 6206792, 6395597, 6623568, 6902094, 7247663, 7679703, 8218043, 8883236, 9697754, 10685209, 11868823, 13270576, 14909664, 16800408, 18952578, 21373036, 24063137, 27011512, 30186758, 33526095, 36912154, 40153737, 43010278, 45271343, 46836879, 47727153, 48019164, 47778572, 47043825, 45849409, 44243034, 42282463, 40029505, 37550541, 34914745, 32186013, 29417255, 26652353, 23930786]
57066B3930786k640283k520679k362312k169288j952505j725735j500884j287628
57058G771472j094113r24927p79725o55924n51680m65255l93634l33830k84405
57049B287979k44297k11506j84200j61814j43768j28467j14686j02627r2513q3404
57039H20697p4478o6116n8671n1412m3756l6221k9232k2188j4676p206P7P995
57027D24813J6646K4688L1269L6733L9882L6301K2062j132k6186m5876n7099o0849
57015D41252n9783n6043n0530m3750l6937l1558k7670k3904j9465j5117j1708
57004F4787r010o640m923m015l257k217j354q87j14J310K505K762K730L221L848
56989D8746L990M166N245O945Q274Q905R105Q807P619N333J791l086q425j2408
$$ y = [23930786, 21290503, 18769824, 16407512, 14238224, 12285719, 10559984, 9059100, 7771472, 6677359, 5752432, 4972707, 4316783, 3765103, 3299848, 2906214, 2572384, 2287979, 2043682, 1832176, 1647976, 1486162, 1342394, 1213927, 1099241, 996614, 904101, 820697, 746219, 680103, 621432, 570020, 526264, 490043, 460811, 438623, 423947, 416741, 416818, 424813, 441459, 466147, 497416, 534149, 574031, 610332, 632394, 631262, 605076, 559200, 502101, 441252, 381469, 325426, 274896, 231146, 194209, 162651, 134981, 111077, 91612, 76495, 64787, 55777, 49137, 44214, 40199, 36942, 34725, 33371, 32484, 32370, 33680, 36185, 38947, 41677, 44898, 48746, 52736, 56902, 62147, 69092, 77366, 86271, 95376, 104183, 111802, 117135, 118926, 115840, 107415, 95007]
56975I5007j3966j3831j3164j2005r969p537n477l651j552N07J878K890M495O908
56961C0533R528J2053J4732J7540J9799K0564J9017J4813Q571J656m871j0697
56949A53238j5366j7829j7557j5502j3181j1201r325p345n136k396R29M296P261
56936E0886J0156J3472J7069K0480K3450K5615K6158K4374K0137J3459M422n836
56924B43842j4913k0921k3943k5104k4879k3229k0704j8260j6242j4432j2783
56913B8432j1333G378b56n502l947k860j734n92J45M37N86O46N65O65J308K274
56897h265L072a500C049N844P380Q858R999J0759J1687J3518J6134J8399J9402
56884A25029J9047J7178J3173P225J064l608o750r104j0414r776p352m507k234
$$ y = [95007, 81041, 67210, 54046, 42041, 32072, 24535, 19058, 15407, 13855, 14362, 16240, 19130, 23625, 30533, 40061, 52114, 66846, 84386, 104185, 124749, 143766, 158579, 167150, 168806, 163935, 153238, 137872, 120043, 102486, 86984, 73803, 62602, 53277, 45932, 40796, 38400, 39329, 43625, 50886, 61042, 74514, 91583, 112063, 135513, 161128, 187286, 211660, 231797, 245256, 249678, 243842, 228929, 208008, 184065, 158961, 134082, 110853, 90149, 71889, 55647, 41215, 28432, 17099, 7378, -256, -5758, -9705, -12565, -14299, -14891, -14746, -14309, -13723, -13077, -12512, -11847, -10539, -8265, -5193, -1500, 3049, 8893, 16273, 25131, 35130, 45889, 57576, 71094, 87228, 105627, 125029, 144076, 161254, 174427, 181652, 182716, 179108, 172358, 163254, 152840, 143064, 135712, 131205, 128971]
56871A28971m02J531L873O696R808J2769J5488J8594K2671K7417L1995L5824L8384
56858C53619L8655L5445K8134J6930L080j0721k1194k6756k8456k7999k5716k1362
56846C13659j5832j0542n672m71N086J0397J5736K2081K9414L6631M3223M9669
56834D93379N5834O0253O1290N7809M8493L2132R766j4296l4735m8375n4995n5885
56822F10670n2585m6667l9665l2686k6040j9431j2503n354J596Q240J5029K2314
56810D22918K9703L6329M1553M4973M5921M3304L5985K3410O443j2160k8690m0605
56798F49084m7575n0355m9420m5300l9467l3714k8807k4412k0059j5499j0469
56787B84007n005K14M572Q387J2272J5972J8636J9907J9674J7024J0798J479q575
$$ y = [128971, 128569, 130100, 133973, 140669, 150477, 163246, 178734, 197328, 219999, 247416, 279411, 315235, 353619, 392274, 427719, 455853, 472783, 475863, 465142, 443948, 417192, 388736, 360737, 335021, 313659, 297827, 287285, 281613, 281142, 286228, 296625, 312361, 334442, 363856, 400487, 443710, 493379, 549213, 609466, 670756, 728565, 777058, 809190, 818956, 804660, 769925, 721550, 666555, 610670, 558085, 511418, 471753, 439067, 413027, 393596, 381093, 375739, 377335, 385575, 400604, 422918, 452621, 488950, 530503, 575476, 621397, 664701, 700686, 724096, 730539, 718379, 689689, 649084, 601509, 551154, 501734, 456434, 416967, 383253, 354446, 330034, 309975, 294476, 284007, 279002, 279216, 283788, 292175, 304447, 320419, 339055, 358962, 378636, 395660, 406458, 407937, 399362]
56774C99362j7164k3689k8232l0395k9826k7309k4411k2108k0292j8466j6501
56763A40969j4604j2876j1185r483p983o824n735m450l325k990l240l078k073
56750E3123r24l46r5K83M85Q5n28o92n25n42o22l36M8j43p64r59m24K67O87J033
56730D9111J467J703J492J038O72N37N97P19P80R52J546K365K634K006J147Q04
56714F9570P43L08m37q74p95m35J03P11R12M63J7L28J053J147K99p70j244p42
56696G0357P07K439L230K513J232O42P40Q06R22J616K421K268J293P89J236J738
56680I4949J710J731K190K374J576K37p80j300j586j561r67kP28P63J10p60j250
56663I8162j172q63o00k03L48M56k80j167j149k40O61J077J222J181Q26M32L94
$$ y = [399362, 382198, 358509, 330277, 299882, 270056, 242747, 218336, 196228, 175936, 157470, 140969, 126365, 113489, 102304, 92821, 84838, 78014, 72279, 67829, 64504, 61514, 58274, 55196, 53123, 52199, 51853, 51758, 52041, 52526, 52611, 52083, 51391, 50866, 50324, 49702, 49366, 49414, 49271, 48507, 47548, 47124, 47391, 48078, 49111, 50578, 52281, 53773, 54811, 55483, 56020, 56617, 57336, 58116, 59068, 60614, 62979, 65613, 67619, 68766, 69570, 70313, 70621, 70184, 69310, 68515, 68080, 68183, 68894, 69806, 70269, 70286, 70614, 71667, 72814, 73113, 72343, 71099, 70357, 71064, 73503, 76733, 79246, 80478, 81120, 81860, 82666, 83588, 85204, 87625, 89893, 91186, 91975, 93211, 94949, 96659, 98390, 100580, 102954, 104530, 104767, 103987, 102687, 101101, 99540, 98573, 98571, 99299, 100062, 100172, 99412, 98162, 96990, 96127, 95527, 95324, 95672, 96128, 95848, 94681, 93532, 93292, 93953, 95030, 96252, 97433, 98259, 98691, 99085]
56646I9085M02j58r91j121l44N11Q66R89J169J212R91O76L33l7r1M15Q75M61n40
56627A04703j041p56m78o29p37n26m96r78j514j559j100m07K35M41K9n70q75j065
56609I2677j374j251j71J030J067K32N3R16J599J305O48K46p9l20K8P26P25k2
56591I8035j27J089K353K277J205K81j88m06j95N29J119J064Q27R61J088O92K44
56574A10848O17J739K712K981K771K643L075M192N566O619P377Q305R365J0057
56560A78867J0476J1366J2779J3655J3207J1737R658O719K944n78k666l257l101
56547B61806k809k682k795k773k138j247j153k188l467m151m348m407m265m039
56533B19344m225m808n056m733m614n169n701n422m580l778l104k535k391k688
$$ y = [99085, 99487, 99329, 98338, 97217, 96873, 97384, 98250, 99239, 100408, 101620, 102611, 103287, 103620, 103583, 103492, 103907, 104782, 105243, 104703, 103662, 102906, 102428, 101799, 101062, 100536, 100040, 99062, 97548, 95989, 94889, 94482, 94717, 95158, 95187, 94617, 93742, 92677, 91303, 90052, 89881, 90911, 91978, 92210, 92263, 93179, 94778, 96083, 96731, 96977, 96898, 96578, 96606, 97332, 98057, 98035, 97908, 98997, 101350, 103627, 104832, 105113, 104925, 104519, 104324, 104853, 105972, 107036, 107863, 108824, 109912, 110604, 110848, 111465, 113204, 115916, 118897, 121668, 124311, 127386, 131578, 137144, 143763, 151140, 159445, 168810, 178867, 189343, 200709, 213488, 227143, 240350, 252087, 261745, 268464, 271408, 270830, 268164, 264907, 261806, 258997, 256315, 253520, 250747, 248609, 247362, 246209, 244021, 240554, 236403, 232055, 227648, 223383, 219344, 215119, 210311, 205255, 200522, 195908, 190739, 185038, 179616, 175036, 171258, 168154, 165619, 163228, 160540]
56519A60540k822k482k130k059j891j519j530k050k174j382m88l77p26q34q00
56504A37276r62j006n69K5M28R13J584J785J177N04M12L60k87r82p93J07Q91J334
56486A42197J638J601R17q6q98j504j935j769q40J82O57Q38J154J345J054N31
56470A45082Q5m41r73r01j51M00L12L75J100J668J349Q01P97P95J51l84J13J006
56452A51184J145Q41J130J780J723J000O21Q18R90J049J286J212J27j385j971
56437A61550j431p93n94m39j79j45k08J49P38P88K13l19m87n04l66P2L79rp64
56418A57651j032o59q9O59J712K393J841N45m2M96J063P95J30j07J78M83L50k74
56400A66093q96p73K44J411K062K343K441J870M43p97p06L37J079J179J227J488
$$ y = [160540, 157718, 155236, 153106, 151047, 149156, 147637, 146107, 144057, 141883, 140501, 140013, 139636, 138910, 138076, 137276, 136314, 135308, 134739, 134764, 135192, 136105, 137689, 139474, 140651, 141155, 141567, 141927, 141640, 140658, 139865, 139972, 140863, 142197, 143835, 145436, 146353, 146267, 145369, 143865, 141930, 140161, 139321, 139503, 140160, 140998, 142152, 143497, 144551, 145082, 145167, 144726, 143753, 142852, 142701, 143101, 143413, 143788, 144888, 146556, 147905, 148706, 149503, 150298, 150449, 150065, 150178, 151184, 152329, 153170, 154300, 156080, 157803, 158803, 159424, 160242, 161232, 162281, 163567, 164779, 164906, 163521, 161550, 160119, 159326, 158732, 158293, 158114, 157969, 157761, 157910, 158648, 159436, 159649, 159330, 158843, 158339, 157973, 158045, 158424, 158415, 157651, 156619, 155960, 155871, 156530, 158242, 160635, 162476, 163021, 162979, 163475, 164538, 165333, 165463, 165356, 165534, 166017, 166367, 166093, 165197, 164424, 164668, 166079, 168141, 170484, 172925, 174795, 175238, 174441, 173735, 174072, 175151, 176330, 177557, 179045]
56384A79045J727J960K192J846O09n67n64J59L14j11L2R77J653J432Q81N67L55
56367A92507J73L33Q46J264J392J397J231P60L23L93P80J033J329K036K715K629
56351B11141J954J451J185O92J23N5L26K93J18N55J514K079K000J966K285K403
56335B30140J966J432J405K018L040L955M105L392K585K334K317K032J750J854
56321B64325J933J530J081J045Q99J61m02j9N08K8q81q13R6O13P03J425K762L520
56303B78514L404L340L749M137M490N293O095N736M243K927K534K682L200M362
56289C34706N658N995N358M884N174N831O613P560Q085P516O562O612P635Q350
56275D26539Q407Q704R492J0019J0140J0623J1684J2792J3958J5577J7131J7848
$$ y = [179045, 180772, 182732, 184924, 186770, 187379, 186812, 186248, 186407, 186721, 186610, 186642, 187619, 189272, 190704, 191585, 192152, 192507, 192680, 193013, 193859, 195123, 196515, 197912, 199143, 199903, 200226, 200619, 201399, 202432, 203761, 205797, 208512, 211141, 213095, 214546, 215731, 216423, 216546, 216601, 216927, 217220, 217338, 217893, 219407, 221486, 223486, 225452, 227737, 230140, 232106, 233538, 234943, 236961, 240001, 243956, 248061, 251453, 254038, 256372, 258689, 260721, 262471, 264325, 266258, 267788, 268869, 269914, 270813, 270974, 270572, 270553, 271061, 271089, 270208, 269395, 269491, 270104, 270807, 272232, 274994, 278514, 281918, 285258, 289007, 293144, 297634, 302927, 309022, 314758, 319001, 321928, 324462, 327144, 330344, 334706, 340364, 346359, 351717, 356601, 361775, 367606, 374219, 381779, 389864, 397380, 403942, 410554, 418189, 426539, 434946, 443650, 453142, 463161, 473301, 483924, 495608, 508400, 522358, 537935, 555066, 572914]
56263E72914J8484K0503K3567K6004K7827L0906L5848M1022M5312M9593N4852
56252I46832O0885O7540P5322Q3889R1830R8601J04902J10640J14460J15888J15948
56241A986737J14932J11576J05170R6500Q5923P2547N6308L8850K1291L080j5819
56230B677095l3542m8447o0973p2162q1807q9218r4389r7324r7642r5826r3445
56219A812320r1207q8222q3905p9160p4767p0296o5521o1358n8341n5707n2861
56208A030975n0201m7720m4463m0288l6472l3605l0622k6943k3712k1773k0122
56197F55054j7715j5204j3522j2214j0587r108q403q011p266o303n301m016k789
56184E34615k573l233l285k169j020n37M5R89J112M7n81M15J994K913L672M959
$$ y = [572914, 591398, 611901, 635468, 661472, 689299, 720205, 756053, 797075, 842387, 891980, 946832, 1007717, 1075257, 1150579, 1234468, 1326298, 1424899, 1529801, 1640441, 1754901, 1870789, 1986737, 2101669, 2213245, 2318415, 2414915, 2500838, 2573385, 2629693, 2668543, 2689834, 2692914, 2677095, 2643553, 2595106, 2534133, 2461971, 2380164, 2290946, 2196557, 2099233, 2001591, 1905765, 1812320, 1721113, 1632891, 1548986, 1469826, 1395059, 1324763, 1259242, 1197884, 1139543, 1083836, 1030975, 980774, 933054, 888591, 848303, 811831, 778226, 747604, 720661, 696949, 675176, 655054, 637339, 622135, 608613, 596399, 585812, 576704, 568301, 560290, 553024, 546721, 541420, 537404, 534615, 532042, 528809, 525524, 523355, 522335, 521798, 521843, 522832, 523944, 523991, 523410, 523825, 525819, 528732, 532404, 537363]
56168E37363N919N656M989N130N949O893Q214R876J0780J0490J0408J1780J3880
56155F47327J5477J6801J8681K1046K3546K6433K9761L3024L6618M2101M9975
56144I60790N8745O7213P5973Q5532R4670J01933J07121J10116J09927J06081
56134A878101R9322R0032P8020O4925N4541M9006M6479M3827L9624L3353K4165
56123B501395J2462P27r060j7335k5078l2215l9411m9052o2401p7525r1679j03795
56111B007033j13012j17221j15261j08754r9859q9085p6982o5697n6770m9169
56101A115223m1477l4146k7970k2432j7294j3648j1631r472o507m545m388l802
56089I17911j151J779K921L165L955M522M160M521O697Q609Q269P158P479Q520
$$ y = [537363, 543282, 548938, 553927, 559057, 565006, 571899, 580113, 589989, 600769, 611259, 621667, 633447, 647327, 662804, 679605, 698286, 719332, 742878, 769311, 799072, 832096, 868714, 910815, 960790, 1019535, 1086748, 1162721, 1248253, 1342923, 1444856, 1551977, 1662093, 1772020, 1878101, 1977423, 2067455, 2145475, 2210400, 2264941, 2313947, 2360426, 2404253, 2443877, 2477230, 2501395, 2513857, 2514584, 2505524, 2488189, 2463111, 2430896, 2391485, 2342433, 2280032, 2202507, 2110828, 2007033, 1894021, 1776800, 1661539, 1552785, 1452926, 1363841, 1286859, 1221162, 1164392, 1115223, 1073746, 1039600, 1011630, 989198, 971904, 958256, 946625, 937153, 930646, 926101, 921713, 917911, 916760, 918539, 921460, 924625, 928580, 933102, 937262, 941783, 948480, 957089, 965358, 972516, 979995, 988515]
56075I88515Q764R083J0698J2378J2773J3199J5033J6824J7027J7022J8237J9036
56063A158589J7862J6710J7757J9255J8631J7069J7004J7529J6440J4653J4391
56052A345890J5024J4772J4533J6012J8067J8806J9264K1140K3076K3120K2629
56041A552333K3723K5249K5274K5082K6496K7907K7333K6760K8891L2330L4509
56030A855887L6612M0724M5013M6833M7727N0144N2240N1433N0019N1487N4268
56019B382387N5118N5628N9012O3459O5438O6710P1010P6504P8896P9598Q3261
56008C137021Q9365R3802R6843J01881J08114J12232J15566J21921J30080J36131
55998D242956J41329J49733J60064J68030J74777J84746J97207K08274K19189
$$ y = [988515, 997279, 1006362, 1017060, 1029438, 1042211, 1055410, 1070443, 1087267, 1104294, 1121316, 1139553, 1158589, 1176451, 1193161, 1210918, 1230173, 1248804, 1265873, 1282877, 1300406, 1316846, 1331499, 1345890, 1360914, 1375686, 1390219, 1406231, 1424298, 1443104, 1462368, 1483508, 1506584, 1529704, 1552333, 1576056, 1601305, 1626579, 1651661, 1678157, 1706064, 1733397, 1760157, 1789048, 1821378, 1855887, 1892499, 1933223, 1978236, 2025069, 2072796, 2122940, 2175180, 2226613, 2276632, 2328119, 2382387, 2437505, 2493133, 2552145, 2615604, 2681042, 2747752, 2818762, 2895266, 2974162, 3053760, 3137021, 3226386, 3320188, 3417031, 3518912, 3627026, 3739258, 3854824, 3976745, 4106825, 4242956, 4384285, 4534018, 4694082, 4862112, 5036889, 5221635, 5418842, 5627116, 5846305]
55989E846305K33955K51167K67001K83583L05239L29505L51677L74959M05676
55980H649067M41804M77362N14684N60475O13349O67884P27498Q00103Q84773
55971A4336999R76791J082083J211819J367137J545210J756143K017284K336465
55963B6629931K719665L189201L773069M481659N316534O294613P439126Q757253
55955F8601051J0258853J1992090J4031000J6434471J9232645K2397168K5739259
55948A88686537K8846607L1188722L2235970L1337898K7555469K0014867Q831459
55941C68697529m282945j6596464k5785391l0969092l2619935l1796382k9527522
55934A97119798k6607091k3559887k0637188j7900291j5365239j3069527j1039773
$$ y = [5846305, 6080260, 6331427, 6598428, 6882011, 7187250, 7516755, 7868432, 8243391, 8649067, 9090871, 9568233, 10082917, 10643392, 11256741, 11924625, 12652123, 13452226, 14336999, 15313790, 16395873, 17607692, 18974829, 20520039, 22276182, 24293466, 26629931, 29349596, 32538797, 36311866, 40793525, 46110059, 52404672, 59843798, 68601051, 78859904, 90851994, 104882994, 121317465, 140550110, 162947278, 188686537, 217533144, 248721866, 280957836, 312295734, 339851203, 359866070, 368697529, 364414584, 347818120, 322032729, 291063637, 258443702, 226647320, 197119798, 170512707, 146952820, 126315632, 108415341, 93050102, 79980575, 68940802]
55927F8940802r270860p754178o487213n447334m589631l878788l298543k828483
55919B5385772k438248k108778j836629j613631j422315j254006j112401r96139
55911A2603625q94523q02651p24791o60381o01409n45730m99053m61702m26321
55902F987064l90535l59585l34618l10092k84568k62878k45841k28358k09406
55893D361183j93831j82475j70263j55786j43556j34994j26049j15498j07090
55884C031641j01633r5053q6260p9367p6305p4340p2324p2366p3906p3122o9694
55873B157271o7608o7922o7197o4305o2210o1632n9373n4519n0229m7824m4855
55862A509597m0626l7865l7305l6118l3322l1513l1625l1113k8909k7310k7429
$$ y = [68940802, 59669942, 51915764, 45428551, 39981217, 35391586, 31512798, 28214255, 25385772, 22947524, 20838746, 19002117, 17388486, 15966171, 14712165, 13599764, 12603625, 11709102, 10906451, 10181660, 9521279, 8919870, 8374140, 7875087, 7413385, 6987064, 6596529, 6236944, 5902326, 5592234, 5307666, 5044788, 4798947, 4570589, 4361183, 4167352, 3984877, 3814614, 3658828, 3515272, 3380278, 3254229, 3138731, 3031641, 2930008, 2834955, 2748695, 2669328, 2593023, 2518683, 2446359, 2373993, 2300087, 2226965, 2157271, 2089663, 2021741, 1954544, 1890239, 1828029, 1766397, 1707024, 1652505, 1602276, 1554452, 1509597, 1468971, 1431106, 1393801, 1357683, 1324361, 1292848, 1261223, 1230110, 1201201, 1173891, 1146462]
55851A146462k7394k6476k6412k7339k7009k5191k4360k4883k4062k1255j9293
55840H72788j9432j9303j7481j5806j5582j5400j4330j3545j3368j2323j0396
55829G05822r574j0068r583p481n973o155o506o447p527r854j1031j0151r257
55816E96215r542r504q220o966o296m856k523j369k026k284p88R59J722K556M232
55801E51310N631O115O717P521O803M107J387k62k208n316q138r594j0668j2014
55787E41391j2444j1267r700q674p684p006q270j1542j4359j5064j4640j4014
55775D06727j2365r539p349o738o140m341k597k146k026j182n63j204k204k460
55761C45873k649l635m596m380l336k287j137K48J191J391J512J654Q60r80k476
$$ y = [1146462, 1119068, 1092592, 1066180, 1038841, 1011832, 986641, 962281, 937398, 913336, 892081, 872788, 853356, 834053, 816572, 800766, 785184, 769784, 755454, 741909, 728541, 716218, 705822, 696248, 686180, 676597, 669116, 663143, 656988, 650482, 644035, 636508, 626654, 615623, 605472, 596215, 586673, 577169, 568949, 561983, 555687, 550831, 548308, 546939, 544913, 542629, 541841, 542800, 544522, 547078, 551310, 556941, 563056, 569773, 577294, 584097, 588204, 589591, 589329, 587121, 581805, 573667, 564073, 553405, 541391, 528947, 517680, 507980, 499306, 491622, 484616, 476346, 464804, 450445, 435381, 420741, 406727, 394362, 384823, 377474, 370736, 364596, 360255, 357658, 355512, 353486, 352304, 351741, 350537, 348333, 345873, 343224, 339589, 334993, 330613, 327277, 324990, 323853, 324101, 325292, 326683, 328195, 329849, 330709, 329729, 327253]
55746C27253k986l654n269o879p623q043q510q264p090o161o004n519m059k711
55732B44481k384k432k237k267k554k137j077r81k307l313k937k501l107l525
55718B10722k517j225j262k130k404j994j454n40P66J220R6j225j126q2M91M68
55702A97804N09M36k43j093j525j867k465k724k187j521j241p10M02R92K91m50
55686A84408M00K470M013M092L055J738J210K295M316N447N128M819N494O154
55672B35039N919N822O787P477O085L156O99m67q45o43J74R45J014P97Q64P70
55656B73593N6n87n50o28j577k392j804o22p74k467m195n104n709o437p013p301
55640B26489p496p481o963o190n685n417n008m451m048l941m089m230l624j754
$$ y = [327253, 324267, 320613, 315344, 308465, 300842, 292799, 284289, 276025, 268935, 262774, 256770, 251251, 247192, 244481, 242097, 239665, 237428, 235161, 232607, 230470, 229393, 228412, 226105, 222792, 219855, 217354, 214247, 210722, 208205, 206980, 205718, 203588, 201184, 199190, 197736, 197196, 197962, 199182, 199278, 198053, 196927, 196845, 197336, 197804, 198313, 198749, 198506, 197413, 195888, 194021, 191556, 188832, 186645, 185124, 183883, 183173, 183575, 184567, 184858, 184408, 184808, 187278, 191291, 195383, 198438, 200176, 201386, 203681, 207997, 213444, 218572, 223391, 228885, 235039, 240958, 246780, 253567, 261044, 267129, 270285, 270984, 270517, 269672, 269029, 269203, 270148, 271162, 271959, 272823, 273593, 273649, 273062, 272512, 271884, 270307, 267915, 266111, 265489, 264715, 262248, 258053, 252949, 247240, 240803, 233790, 226489, 218993, 211512, 204549, 198359, 192674, 187257, 182249, 177798, 173750, 169809, 165720, 161490, 157866, 156112]
55626A56112N15J585J292R92J123M92j206k224j475n20j072k267k354j670j689
55611A47634k252k108j447j530k299k521k057j859j932j275P0Q45O06K67L49K54
55595A30745l87r91j072q93q00p41o88p66q33o17k01J63N64J115J503J526J646
55578A29273K307L154L624L823M107M398M643N263O318O970O664O044N789N338
55564A97715L919J944K18j446l479n209n716n441n571o268o825p019o991o385
55550A43446m998l722l367l203k147q25o44j327j202K11J684K269K182J723R36
55535A31016L96P47J405J231M20K17O53L95r28j997j944j604j990k765l065k766
55519A19421k262j828j710k086k568k547k231k440l174l366k400r71p1M9l70j061
$$ y = [156112, 156627, 158212, 159504, 160496, 161619, 162111, 160905, 158681, 157206, 156686, 155614, 153347, 150993, 149323, 147634, 145382, 143274, 141827, 140297, 137998, 135477, 133420, 131561, 129629, 128354, 128424, 129269, 129875, 130142, 130491, 130745, 130358, 129367, 128295, 127402, 126602, 125861, 125173, 124407, 123574, 122957, 122756, 122919, 123483, 124598, 126101, 127627, 129273, 131580, 134734, 138358, 142181, 146288, 150686, 155329, 160592, 166910, 173880, 180544, 186588, 192377, 197715, 201634, 203578, 203796, 202350, 198871, 193662, 187946, 182505, 176934, 170666, 163841, 156822, 149831, 143446, 138448, 134726, 131359, 128156, 126009, 125184, 124540, 123213, 122011, 122222, 123906, 126175, 128357, 130080, 131016, 131412, 132159, 133564, 134795, 135215, 135432, 136085, 136480, 135552, 133555, 131611, 130007, 128017, 125252, 122187, 119421, 117159, 115331, 113621, 111535, 108967, 106420, 104189, 101749, 98575, 95209, 92809, 91838, 91767, 91816, 91446, 90385]
55503I0385j584j518j095j015j358j369n77N58J297J422J108N95J50l8m8rJ79
55486H7083N37P10M66J34jk38p73r93l84M29M97j1l13m23q56j301r35Q0P48P80
55466H5236O95M66m58j704k038j176k73j95m82m24p9K26L94K72k72p05k87O73
55448G9869J020M55j09j33k08p80j251j006l62R2K54J50l63r62p97K86J222J075
55430G8452K52k18o7J94K01O8LP1K03K63K37L24N84O72L72J02K80N14K20j51L51
55409H2927J488J813O55r49j679j448j037r20r78q92m78Q8L12J4k74j00J20j00
55391G8562j63P80K072K085O46n95n54l7r7m23k12M26Q59Q98O09p4q70j044m62
55372H2406Rj78l92n5K05m19j393j577j007p52j181j481j055m11l51q81j361j335
$$ y = [90385, 88801, 87283, 86188, 85173, 83815, 82446, 81869, 82427, 83724, 85146, 86254, 86849, 86999, 86961, 86913, 86904, 87083, 87620, 88330, 88796, 88930, 88929, 88691, 87918, 86925, 86541, 86970, 87467, 87456, 87143, 86720, 85864, 84563, 83628, 83708, 84456, 85236, 85931, 86397, 85939, 84235, 82197, 81021, 80748, 80553, 80071, 79647, 79568, 79794, 80188, 80460, 80188, 79483, 79196, 79869, 80889, 81344, 81235, 81102, 80894, 80114, 78863, 77857, 77495, 77587, 77841, 77991, 77628, 76666, 75869, 76155, 77377, 78452, 78704, 78486, 78419, 78613, 78814, 78882, 78885, 78956, 79159, 79422, 79659, 79983, 80567, 81239, 81611, 81713, 81993, 82507, 82727, 82576, 82927, 84415, 86228, 86883, 85934, 84255, 82807, 81770, 80850, 79872, 78980, 78502, 78590, 78902, 78916, 78642, 78542, 78662, 78562, 78399, 79179, 81251, 83336, 83982, 83387, 82833, 82796, 82699, 82276, 82064, 82490, 83349, 84247, 84856, 84782, 83912, 82868, 82406, 82415, 82237, 81845, 81790, 81995, 81576, 80183, 78606, 77599, 76847, 75666, 74185, 73130, 72719, 72368, 71487, 70126, 68791]
55354F8791q65k32L18N21J18p06j097k48J438K542K264J417J155J367J128L27
55338G8238k22j78r2l73p94j112j325j199m55M25M96k89r56r50p92r40r56l37
55320F8189O00J164J117O49J3m49m28J5N99J256J873J863Q89j65j07P08P25m25
55302G8086j309r35j85k37p45o64L6N03K87k95p13n47K76J098R88k8q31o41J68
55283G4312R33J500J711J180J94j86L24N91k15j234j261n60k34m34m58q5K50L67
55265G6695M55M33J49m5L11R36J077N18k54o86n76l9N11O53M61L82M17J15m45
55246H1068n46r6L2n65j028o64j33k14m28k1N46L78k47m37k93n12q16k80Q37J202
55226G7783L85m73l35N45J367J716J481O49l87r96j029q63p30n47m42o85j040
$$ y = [68791, 67926, 67694, 68012, 68533, 68651, 67945, 66848, 66600, 68038, 70580, 72844, 74261, 75416, 76783, 77911, 78238, 78016, 77838, 77746, 77373, 76579, 75467, 74142, 72943, 72488, 72913, 73409, 73120, 72164, 71214, 70422, 69482, 68526, 68189, 68789, 69953, 71070, 71719, 71732, 71283, 70855, 70870, 71469, 72725, 74598, 76461, 77350, 77185, 77078, 77786, 78511, 78086, 76777, 75842, 75657, 75420, 74675, 74011, 74047, 74550, 74837, 74542, 73829, 73282, 73558, 74656, 75644, 75616, 74785, 74144, 74312, 75245, 76745, 78456, 79636, 79830, 79644, 79968, 80559, 80344, 79110, 77849, 77289, 77055, 76621, 76163, 76078, 76328, 76695, 77150, 77583, 77732, 77687, 77998, 78934, 80011, 80529, 80275, 79589, 79013, 78974, 79485, 80138, 80599, 80981, 81398, 81513, 81068, 80522, 80426, 80458, 79893, 78865, 78201, 78068, 77854, 77426, 77405, 77951, 78329, 78082, 77645, 77352, 76840, 76024, 75744, 76581, 77783, 78168, 77695, 77360, 77905, 79272, 80988, 82469, 83118, 82731, 81735, 80706, 79843, 79113, 78566, 78124, 77439, 76399]
55209G6399q51L9J031J510J364Q29L42M37J172J699J098l65j471j509q65j49M65
55192H1175Q69P60Q3p45j299j469j238o42k8J25j73m29l90k84k57p1M06Q37Q18
55173G8048L83j45n21o58n81l93k20m7K15N99J102J707K167K045J263M06R6J56
55155H5622m8n93q50n01j12m29j339j887j298J62J396J503O22k92n20k04P9M8
55137H1359j51l32m92o42o39k50N50J356J565J047L25q3l00o25q53o76m63p35
55119G9961j086o51L31O59J03j37N75J237Q91J92J57M22Q2n42m54K64O61O25R41
55100H4231J719K104J694J069O90K88k74n24j94K27J84k20n42o07m65j27L55P31
55082I0339P50M05mp4K58N05J33o15r19n56k03k39n6Q13J637J423M05l44l93j87
$$ y = [76399, 75548, 75587, 76618, 78128, 79492, 80321, 80663, 81100, 82272, 83971, 85069, 84704, 83233, 81724, 80859, 80710, 81175, 82044, 82804, 82887, 82142, 80843, 79374, 78136, 77494, 77466, 77591, 77418, 76989, 76599, 76315, 76058, 75987, 76393, 77230, 78048, 78431, 78286, 77765, 77107, 76526, 76133, 75913, 75866, 76081, 76680, 77782, 79489, 81656, 83701, 84964, 85370, 85466, 85622, 85574, 84981, 84131, 83630, 83518, 83089, 81750, 79863, 78565, 78727, 80123, 81626, 82248, 81956, 81436, 81232, 81311, 81359, 81208, 80876, 80384, 79742, 79103, 78853, 79403, 80759, 82324, 83371, 83696, 83613, 83313, 82688, 81835, 81159, 80696, 79961, 78875, 78224, 78555, 79214, 79317, 79180, 79755, 80992, 81883, 82075, 82232, 82654, 82736, 82194, 81740, 82004, 82665, 83290, 84231, 85950, 88054, 89748, 90817, 91507, 91795, 91521, 90997, 90803, 91030, 91214, 90994, 90452, 89845, 89380, 89253, 89608, 90339, 91089, 91494, 91490, 91416, 91674, 92179, 92312, 91697, 90778, 90222, 90019, 89780, 89724, 90537, 92174, 93597, 94002, 93658, 93265, 93078]
55062I3078q5l1k3q2K2L65M99J65j39m1j43r98j775j315l9N38R5k30J52N10K94
55041I0817oNj16o77j212j300j173j002n19K15N44K97K46R12J677J659Q27k53
55023I0941j175j695j603j035m65o4M31R32Q71J99k90n6M13M55J84N5Q0P3Q6J03
55003H8440j49n64m24N61J565J659J113Q97J283J623J384P46K16J18M07O94O00
54986A00169K81K50N25M68k03p45l75N39R61O02J90L23P17P19J76m55o54l77p2
54967A03039r8k27N6P59J292J241Q68N85M34L51N56J124J486R60l01j297j282
54950A09546n49j0j92p82j125r72o30m03k08J46N18O13L91K7l93p23n22M58J687
54931A06877K278K045J620J507J627J849K341L185M155N053N828O262O140N743
$$ y = [93078, 92993, 92962, 92939, 92857, 92879, 93244, 93743, 93908, 93769, 93728, 93585, 92587, 90812, 89497, 89458, 89996, 90091, 89861, 90013, 90523, 90817, 90811, 90816, 90700, 90023, 88811, 87511, 86338, 85336, 84817, 85032, 85576, 85873, 86119, 87031, 88708, 90367, 91194, 90941, 89766, 88071, 86468, 85433, 84968, 84904, 85335, 86267, 87138, 87337, 87047, 86991, 87404, 87859, 88043, 88098, 88178, 88251, 88337, 88440, 88291, 87727, 87303, 87864, 89429, 91088, 92201, 93098, 94381, 96004, 97388, 98134, 98350, 98468, 98875, 99569, 100169, 100450, 100700, 101225, 101693, 101490, 100745, 100370, 100909, 101870, 102472, 102662, 102985, 103702, 104421, 104597, 104142, 103488, 103111, 103039, 102941, 102714, 102770, 103529, 104821, 106062, 106930, 107515, 107949, 108300, 108856, 109980, 111466, 112426, 112125, 110828, 109546, 108997, 108987, 108795, 108013, 106888, 105916, 105286, 104883, 104675, 104821, 105339, 105952, 106343, 106370, 105977, 105254, 104732, 105190, 106877, 109155, 111200, 112820, 114327, 115954, 117803, 120144, 123329, 127484, 132537, 138365, 144627, 150767, 156510]
54917A56510N566N385M312K122j74j530k043k476l200m053m797n156m773l715
54903A41978k764k685l351m040m347m341m027l206j956q10l07m10m96M3J145K069
54887A12495K248J974J947K337K740K992L398M138M937N520N884O063O064O103
54873A68840O292O018M454J832n50j974l084m562n852o030n349m984n480o140
54859A43431o001m863l412k580k710l126k904k103j758k372l054k734j629q22
54845A03363p19q05o63m46k75N1M68M04n18j724k104j195K10Q60M18k04k1Q52
54827I7952J615J992K258K250J276o28k245k491j642p72m72n70o50l60L99J147
54811I9059J136L78j36K73J030J206Q89Q78J360J693J369N72j86n21l41M4J23
$$ y = [156510, 162076, 167461, 171773, 173895, 173721, 172191, 170148, 167672, 164472, 160419, 155622, 150466, 145693, 141978, 139214, 136529, 133178, 129138, 124791, 120450, 116423, 113217, 111261, 110451, 110144, 109734, 109238, 109281, 110426, 112495, 114743, 116717, 118664, 121001, 123741, 126733, 130131, 134269, 139206, 144726, 150610, 156673, 162737, 168840, 175132, 181150, 185604, 187436, 186886, 184912, 181828, 177266, 171414, 165384, 160035, 155051, 149571, 143431, 137430, 132567, 129155, 126575, 123865, 120739, 117835, 115732, 113974, 111602, 108548, 105814, 104185, 103363, 102644, 101839, 101176, 100730, 100455, 100506, 100974, 101378, 100860, 99136, 97032, 95837, 96047, 96907, 97325, 97121, 97100, 97952, 99567, 101559, 103817, 106067, 107343, 106715, 104470, 101979, 100337, 99565, 99093, 98523, 97873, 97513, 97912, 99059, 100195, 100573, 100437, 100710, 101740, 102946, 103835, 104713, 106073, 107766, 109135, 109707, 109521, 109000, 108659, 108703, 108826]
54794A08826k22n29l93J5L94P60J036P99pn63j63P05R78M85k9n3K71P40J273J593
54774A15916J509J491K200L432M348M766N378O446P192O969O306O159O531O485
54760A85128N369L411J180j062l194m884n798o086o263o441o079m916l810l922
54746A42633n069n696m711k763j201m66j28L5j45n36o25k61J28J55k8K8N98J548
54728A23496K469L036L375L893M687N394N793O066O284O037M962L291J480l18
54714A79945k028l353m151m749n378n669n266m563m181l968l293k142j263j179
54700A28762j637k082k230k111j853j498q80O2Q04N10q67k287k789k495j967j271
54684A06171l58K55J06k72J6Q49J212P05Qj17L00O68M26n59j725k223j919j572
$$ y = [108826, 108604, 108075, 107682, 107697, 108091, 108851, 109887, 110686, 110679, 110116, 109953, 110658, 111636, 112121, 112092, 112039, 112310, 113050, 114323, 115916, 117425, 118916, 121116, 124548, 128896, 133662, 139040, 145486, 152678, 159647, 165953, 172112, 178643, 185128, 190497, 193908, 195088, 194026, 190832, 185948, 180150, 174064, 167801, 161360, 155281, 150365, 146555, 142633, 137564, 131868, 127157, 124394, 123193, 122727, 122599, 122634, 122489, 121953, 121328, 121067, 121195, 121350, 121322, 121350, 121948, 123496, 125965, 129001, 132376, 136269, 140956, 146350, 152143, 158209, 164493, 170530, 175492, 178783, 180263, 179945, 177917, 174564, 170413, 165664, 160286, 154617, 149351, 144788, 140607, 136639, 133346, 131204, 129941, 128762, 127125, 125043, 122813, 120702, 118849, 117351, 116471, 116533, 117337, 117847, 116980, 114693, 111904, 109409, 107442, 106171, 105813, 106068, 106174, 105902, 105918, 106767, 107979, 108684, 108692, 108575, 108875, 109543, 109969, 109410, 107685, 105462, 103543, 101971]
54666A01971j577j247o9J071J041K44m6L31M89K99N02J111J221P02M98Q50P50
54649A08141k77j180j017l02J20M40J160J889J894J261N70k5n76p51l08K73L52
54632A11664j9m53r22j422j454p05J03kq28j240q11l48n85j088r07J04J087J242
54614A03416O83J20q9j81k32K02J270K089J663L99k82O3K65n99j742j708l27J166
54596A06176J629J022O8m79l86n9j07o42j244j579j589j060K34J739K272J466
54580A07461L51jK35L24J93J81J58j15k41L24J189J471J050N97M01J57j55r4L50
54561A13836N99M11K84O00J012J038P07L12l0k42j18L32P08O91M70M66Q04J252
54543A23132J462J187N39L6J46N90N74j49q25n94M30J346J429O59n41j620k091
$$ y = [101971, 100394, 99147, 99078, 100149, 101190, 101434, 101388, 101719, 102208, 102507, 103009, 104120, 105341, 106043, 106541, 107391, 108141, 107864, 106684, 105667, 105365, 105485, 105925, 107085, 108974, 110868, 112129, 112699, 112674, 112098, 111347, 111039, 111312, 111664, 111645, 111192, 110270, 108848, 107394, 106689, 106792, 106790, 105962, 104722, 103911, 103563, 102978, 101890, 100983, 101087, 102174, 103416, 104099, 104219, 104130, 103949, 103717, 103919, 105189, 107278, 108941, 109340, 109058, 109121, 109386, 108787, 107045, 105337, 105010, 106176, 107805, 108827, 108895, 108416, 108030, 107971, 107864, 107222, 105978, 104399, 102810, 101750, 101984, 103723, 105995, 107461, 107812, 107811, 108046, 108370, 108563, 108744, 108902, 108787, 108546, 108870, 110059, 111530, 112580, 113177, 113578, 113735, 113580, 113486, 113836, 114435, 114846, 115130, 115730, 116742, 117780, 118487, 118799, 118769, 118527, 118409, 118741, 119449, 120140, 120610, 121076, 121880, 123132, 124594, 125781, 126320, 126356, 126502, 127092, 127666, 127517, 126692, 126098, 126528, 127874, 129303, 129962, 129421, 127801, 125710]
54526A25710j815j135m84J2L78M02p3o18n76m2J42l74q38n50l1k55j067j307n19
54507A16960M55Q36R43J321J636J237L11l50m81m25k72K63J018J286P53M1j01
54490A25431L64R29J181J021N55K7l00l36j19L65J020J380R66j0o99m90M19J357
54472A33061J749J373M61l19m20OL49L49J97l5m47p25k42R18J791J686R69L15
54454A41036k32r11j510j627j360j165j126r19l90J87M30J60m47q79o87p3J89
54437A30676k69q50o71L52J468J925J568P79O2m10r41j816k616k488j231K86J097
54420A26921J056N62j31q10j003m47M21R16R05O97M53J45q5n2J10K14L85P19Q52
54401A31828N05J91O16J473J648Q50J55N24J428J559N47o51j056p14l10j62J9
$$ y = [125710, 123895, 122760, 122276, 122288, 122666, 123068, 122995, 122377, 121801, 121759, 121901, 121527, 120689, 120139, 120108, 119853, 118786, 117479, 116960, 117415, 118251, 119194, 120515, 122151, 123388, 123699, 123349, 122868, 122443, 122171, 122434, 123452, 124738, 125491, 125532, 125431, 125795, 126724, 127905, 128926, 129481, 129508, 129208, 128872, 128753, 129118, 130138, 131518, 132484, 132474, 131775, 131285, 131704, 133061, 134810, 136183, 136644, 136325, 135905, 135911, 136260, 136609, 136806, 136771, 136324, 135599, 135357, 136275, 138066, 139752, 140721, 141036, 140804, 139893, 138383, 136756, 135396, 134231, 133105, 132186, 131796, 131983, 132413, 132573, 132126, 131247, 130560, 130487, 130676, 130407, 129557, 128886, 129238, 130706, 132631, 134199, 134978, 135040, 134630, 133689, 131873, 129257, 126769, 125538, 125824, 126921, 127977, 128539, 128408, 127598, 126595, 126148, 126569, 127485, 128390, 129087, 129540, 129685, 129600, 129548, 129658, 129872, 130257, 130976, 131828, 132333, 132524, 133140, 134613, 136261, 137111, 137266, 137790, 139218, 140777, 141324, 140673, 139617, 138903, 138593, 138431, 138450]
54384A38450M47Q34Q18N63N57R07J226J205R68P88P44Q06R73J193J369J512J644
54367A55004J597J263J021J345J940J868Q32l33p58o14n78p99r38q81p94p68q49
54350A57558j166j590j650j247j047j581k319k290j376l54J71K20K4k02k01M0
54334A42990P0m37j058j174r47r45j046n42O00J475J492J041O75L23k43p21o36
54317A40917n0N23P26N82K32k09o06q23q62r19j239j775k056j595n67K39L02n9
54299A32761k17j1L21O14P95P56N76N18M59j55j256j716p91N81R33L97L61J177
54281A36103J589P74l99p63m41k99n45p26n46NR21J955K434J940R73M42O24J080
54263A45121J368J406J231Q63M34J45O8J20K17L81O86J182J726J988J765J261
$$ y = [138450, 138897, 139731, 140549, 141112, 141669, 142576, 143802, 145007, 145975, 146763, 147507, 148313, 149286, 150479, 151848, 153360, 155004, 156601, 157864, 158885, 160230, 162170, 164038, 164870, 164537, 163779, 163165, 162587, 161788, 160850, 159969, 159175, 158407, 157558, 156392, 154802, 153152, 151905, 150858, 149277, 146958, 144668, 143292, 142938, 143109, 143329, 143353, 143151, 142950, 142990, 143060, 142623, 141565, 140391, 139444, 138499, 137453, 136911, 137511, 138986, 140478, 141519, 142194, 142517, 142274, 141553, 140917, 140867, 141390, 142116, 142698, 142930, 142721, 142115, 141292, 140430, 139511, 138272, 136497, 134441, 132846, 132279, 132518, 132820, 132761, 132544, 132533, 132854, 133468, 134263, 135019, 135595, 136113, 136572, 136417, 135161, 133445, 132654, 133235, 134168, 134565, 134926, 136103, 137692, 138466, 138067, 137304, 136863, 136564, 136019, 135293, 134747, 134752, 135673, 137628, 140062, 142002, 142975, 143417, 144041, 145121, 146489, 147895, 149126, 149989, 150423, 150568, 150636, 150756, 150973, 151354, 152040, 153222, 154948, 156936, 158701, 159962]
54247A59962Q23N07J55k18m37n27o15o44n51o66j274j890j646n59K82M0r15j625
54229A50202j513o04O61J501J295L40l64m04l66p33j106j015p70q13q99o85n85
54212A44142j096j700j459n06N7k18n43j67O01R95Q12L72n6l55m04j57J76L09
54194A40803J55j44l91m76m13l07j81O2M39P04O21L84N05J180J957K132J476M49
54176A48955k58l75k03j49k48k53j04qj39n10j092j724j917j238OR42J175J172
54158A44032J302J144K54q42j160n42K04L46j78j053j847k013j292k24K92J09
54142A38532q4J63N26P23J070J747K056J240k57j095o36L71Q54O72N15Q86J610
54125A48893K178K269J920J400J070J182J657K110K200J994J813J801J755J474
$$ y = [159962, 160785, 161292, 161447, 161229, 160792, 160265, 159650, 159006, 158455, 157789, 156515, 154625, 152979, 152420, 152702, 152742, 151827, 150202, 148689, 148085, 148746, 150247, 151542, 151882, 151518, 151114, 150748, 150015, 148909, 147894, 147124, 146311, 145412, 144727, 144142, 143046, 141346, 139887, 139381, 139438, 139220, 138677, 138510, 139111, 140106, 140918, 141290, 141234, 140879, 140475, 140318, 140494, 140803, 140958, 140814, 140423, 139947, 139534, 139227, 139046, 139108, 139547, 140251, 140872, 141256, 141761, 142941, 144898, 147030, 148506, 148955, 148697, 148322, 148119, 147970, 147722, 147469, 147365, 147357, 147218, 146708, 145616, 143892, 141975, 140737, 140743, 141685, 142860, 144032, 145334, 146478, 146732, 145890, 144730, 144188, 144392, 144738, 144560, 143507, 141660, 139647, 138355, 138131, 138423, 138532, 138448, 138611, 139137, 139860, 140930, 142677, 144733, 145973, 145716, 144621, 143985, 144356, 145210, 145882, 146397, 147283, 148893, 151071, 153340, 155260, 156660, 157730, 158912, 160569, 162679, 164879, 166873, 168686, 170487, 172242, 173716]
54111A73716J057O76K36m43j154j391j006m97m42q54j377j872k443k947k957k321
54095A55981j434p13r9O27J234J180L33p61j393j288o42J74Q27J151J239J320
54079A57736J478J588J494J221R59R16J176J519J566J258J049J314J664J367M41
54064A76746k58j98J10q2p16j144j041o26j97R6K03L15Q65J958L010L321K982
54047A85344K630K595K696K819L140L780M591N348N853N926N661N498N692N908
54033B47481N819N801O360P056O842N521M094L475L539L663L516L034K227J364
54019C09792Q77P23K63q60k144k840k830k644k885l830n231o360o599o113n592
54004B63727n331n060m707m615m815m779m207l430k730j942j092o92r13j077o36
$$ y = [173716, 174773, 175449, 175685, 175242, 174088, 172697, 171691, 171194, 170752, 169898, 168521, 166649, 164206, 161259, 158302, 155981, 154547, 153834, 153735, 154362, 155596, 156776, 157109, 156348, 154955, 153667, 153025, 153199, 154026, 155177, 156416, 157736, 159214, 160802, 162296, 163517, 164476, 165392, 166568, 168087, 169653, 170911, 171960, 173274, 174938, 176305, 176746, 176488, 176290, 176400, 176318, 175602, 174458, 173417, 172791, 172594, 172690, 172893, 173208, 174073, 176031, 179041, 182362, 185344, 187974, 190569, 193265, 196084, 199224, 203004, 207595, 212943, 218796, 224722, 230383, 235881, 241573, 247481, 253300, 259101, 265461, 272517, 279359, 284880, 288974, 292449, 295988, 299651, 303167, 306201, 308428, 309792, 310669, 311392, 311655, 310795, 308651, 305811, 302981, 300337, 297452, 293622, 288391, 282031, 275432, 269319, 263727, 258396, 253336, 248629, 244014, 239199, 234420, 230213, 226783, 224053, 222111, 221019, 220327, 219414, 218337, 217701]
53989B17701k2Q6j11J21R95K063K875L180K898K384K326K753K674J364n01j799
53973B38987k570l646n049n839n544m672l683k410q05N83J238J170O41q5n23k31
53957B07562N27R70Q87Q69J265J570J314Q61Q53J358K066K907L815M278L882L112
53941B38096K962L656M400M483M073L735L598L425L190L122L312L672M175M763
53927B90662N018M516L592L218L813M692N156N531O406P336P368O708O671P791
53913C68478R001R225Q722Q260P768O750N380M306L688L106K191P46j307l477
53899D32837m663m361l478l245l693m102m443n281o507p369p730q203q929r288
53885C51545r014q609q343p818o832n876n373n158n005m976m962m585l915l509
$$ y = [217701, 217679, 217765, 217654, 217775, 218770, 220833, 223708, 226888, 229786, 232170, 234496, 237249, 239923, 241287, 240786, 238987, 236417, 232771, 227722, 221883, 216339, 211667, 207984, 205574, 204769, 205352, 206590, 207760, 208401, 208316, 207793, 207562, 208089, 209059, 209946, 210815, 212080, 213650, 214964, 215825, 216678, 218036, 220102, 223009, 226824, 231102, 234984, 238096, 241058, 244714, 249114, 253597, 257670, 261405, 265003, 268428, 271618, 274740, 278052, 281724, 285899, 290662, 295680, 300196, 303788, 307006, 310819, 315511, 320667, 326198, 332604, 339940, 347308, 354016, 360687, 368478, 377479, 386704, 395426, 403686, 411454, 418204, 423584, 427890, 431578, 434684, 436875, 437621, 436314, 432837, 428174, 423813, 420335, 417090, 413397, 409295, 404852, 399571, 393064, 385695, 377965, 369762, 360833, 351545, 342531, 333922, 325579, 317761, 310929, 305053, 299680, 294522, 289517, 284541, 279579, 274994, 271079, 267570]
53871B67570l546l602l574l937m718n127m730m106l769l326k380j441j119j096
53857B21099q17n68q97j454j465j037r90j510j922j712j042k56L99N78J12n19
53841B07999n89n5M74N82L70mm25n70k75m2m82j266j445q64l58l89m04N2N10M67
53821B03286L29P66J590K044J862J450J180J177J596K503L481L892L615L146K983
53806B34900L214L713M327M848N157N477O113O937P401P209O565N727M714L624
53792C09926K842K575K495K216J920K017K260J782J65j880l191l304k799k612
53778C14412l172m152m867m932m563m281m368m684m942m943m548l787l028k754
53764B55391k982l187l040k862l045l300l062k420k040k137k171j818j623k207
$$ y = [267570, 264024, 260422, 256848, 252911, 248193, 243066, 238336, 234230, 230461, 227135, 224755, 223314, 222195, 221099, 220282, 219714, 218817, 217363, 215898, 214861, 213871, 212361, 210439, 208727, 207685, 207429, 207828, 208406, 208518, 207999, 207410, 207355, 207829, 208411, 208781, 208777, 208352, 207782, 207507, 207465, 206983, 205717, 204272, 203408, 203050, 202661, 202257, 202309, 202819, 203286, 203615, 204381, 205971, 208015, 209877, 211327, 212507, 213684, 215280, 217783, 221264, 225156, 228771, 231917, 234900, 238114, 241827, 246154, 251002, 256159, 261636, 267749, 274686, 282087, 289296, 295861, 301588, 306302, 309926, 312768, 315343, 317838, 320054, 321974, 323991, 326251, 328033, 328198, 326318, 323127, 319823, 317024, 314412, 311240, 307088, 302221, 297289, 292726, 288445, 284077, 279393, 274451, 269508, 264960, 261173, 258145, 255391, 252409, 249222, 246182, 243320, 240275, 236975, 233913, 231493, 229453, 227316, 225145, 223327, 221704, 219497]
53750B19497l151l339k361j048m27n28n92k93k11q64j676j499j88R94R20P1j53
53733B05152O39J445J470J195J456K108K321J834J188Q55P72P96J010J438J829
53718B25508J950J764J263N23M0M92J809K885K736J752J169J471J875J625J056
53703B47918R57J366J657J655J914K780L725M010L642L325L572M200M586M231
53689B89538L113J702N43k40r26j604j898j523q31m66n62p13n75j36M77J044J111
53672B88054M43m42o53j06L56J98j3M32J245J551J141N18m5p17j332j273m09M58
53654B89406N66J13k01j46L7K79O73R56O94R0l1P39J772K213J993J720J802K109
53636C04784K340K349K119J694J153N02k58q47p62N4Q61R45N79O33J338K086K432
$$ y = [219497, 216346, 213007, 210646, 209598, 209171, 208643, 208051, 207758, 207547, 206683, 205007, 203508, 203320, 204314, 205234, 205305, 205152, 205791, 207236, 208706, 209901, 211357, 213465, 215786, 217620, 218808, 219663, 220435, 221231, 222241, 223679, 225508, 227458, 229222, 230485, 231008, 231048, 231540, 233349, 236234, 238970, 240722, 241891, 243362, 245237, 246862, 247918, 248875, 250241, 251898, 253553, 255467, 258247, 261972, 265982, 269624, 272949, 276521, 280721, 285307, 289538, 292651, 294353, 294896, 294656, 293730, 292126, 290228, 288705, 287874, 287408, 286846, 286133, 285558, 285422, 285899, 286943, 288054, 288497, 288055, 287402, 287296, 287652, 287850, 287837, 288269, 289514, 291065, 292206, 292724, 292679, 291962, 290630, 289357, 288948, 289406, 289972, 290085, 289884, 289738, 289775, 290054, 290727, 291683, 292377, 292467, 292436, 293175, 294947, 297160, 299153, 300873, 302675, 304784, 307124, 309473, 311592, 313286, 314439, 314941, 314683, 313836, 313074, 313128, 313989, 314934, 315513, 316146, 317484, 319570, 322002]
53619C22002K553K588K225J442J015J696L203M536N038M833M413M196M247M148
53605C68135L447K416J928K229K420J747Q57J004K246L293L107J899N42l60o68
53590C94242n81m91o17p86q42j093j789k393k072r25K8J15l37p66j071j383j691
53573C77548j994k326k509k389k302k683l072k371l94J574K252J717Q59J99j96
53558C63913k45j7mn12j056r56l20K21N26J050J961K726K752K076J249Q26R88
53541C75178J514K054K484K946L538M122M529M761M955N265N815O569P294P856
53527D38880Q428R143R662R702R759J0683J2398J3829J4249J4016J3832J3984
53515E78565J4681J6158J8040J9359J9818K0284K1383K2436K2639K2543K3241
$$ y = [322002, 324555, 327143, 329368, 330810, 331825, 333521, 336724, 341260, 346298, 351131, 355544, 359740, 363987, 368135, 371582, 373998, 375926, 378155, 380575, 382322, 383179, 384183, 386429, 389722, 392829, 394728, 395270, 394910, 394242, 393661, 393170, 392553, 391767, 390925, 389832, 388043, 385650, 383578, 382653, 382681, 382796, 382459, 381693, 380622, 379239, 377548, 375554, 373228, 370719, 368330, 366028, 363345, 360273, 357902, 357508, 359082, 361334, 363051, 363910, 364109, 363913, 363668, 363651, 363647, 363135, 362079, 361123, 360803, 361024, 361550, 362600, 364561, 367287, 370039, 372115, 373364, 374190, 375178, 376692, 378746, 381230, 384176, 387714, 391836, 396365, 401126, 406081, 411346, 417161, 423730, 431024, 438880, 447308, 456451, 466113, 475815, 485574, 496257, 508655, 522484, 536733, 550749, 564581, 578565, 593246, 609404, 627444, 646803, 666621, 686905, 708288, 730724, 753363, 775906, 799147]
53504G99147K4590K5344K4851K3585K2129K0710J9687J9561K0217K0916K1161
53493A041898K0973K0389J9428J8583J8518J9051J9188J8458J7539J7270J7629
53482A248924J8023J8115J7945J7619J7242J6967J6726J6131J4804J2758J0355
53471A425609Q042O080M361K463J28k448m907p166r261j0944j1906j2227j2313
53458A375511j2381j2490j2819j3587j4676j5803j6888j7882j8464j8480j8444
53447A203597j8878j9344j8957j7851j7127j7122j6703j4823j2003r578q039o857
53435A026315n629m535l668k597r37R24K119K332K305L112M890O712P776Q270
53421A047389Q836R616J0468J1668J3620J5947J7741J8790J9818K1299K2811K3847
$$ y = [799147, 823737, 849081, 873932, 897517, 919646, 940356, 960043, 979604, 999821, 1020737, 1041898, 1062871, 1083260, 1102688, 1121271, 1139789, 1158840, 1178028, 1196486, 1214025, 1231295, 1248924, 1266947, 1285062, 1303007, 1320626, 1337868, 1354835, 1371561, 1387692, 1402496, 1415254, 1425609, 1433651, 1439731, 1444092, 1446555, 1446683, 1444235, 1439328, 1432162, 1422901, 1411957, 1400051, 1387824, 1375511, 1363130, 1350640, 1337821, 1324234, 1309558, 1293755, 1276867, 1258985, 1240521, 1222041, 1203597, 1184719, 1165375, 1146418, 1128567, 1111440, 1094318, 1077615, 1062792, 1050789, 1041211, 1033172, 1026315, 1020686, 1016151, 1012483, 1009886, 1008949, 1009873, 1011992, 1014324, 1016629, 1019741, 1024631, 1031343, 1039119, 1047389, 1056225, 1065841, 1076309, 1087977, 1101597, 1117544, 1135285, 1154075, 1173893, 1195192, 1218003, 1241850]
53409A241850K4600K5513K6652K7910K9415L1208L2898L4159L5319L6980L9213
53398A585717M1537M3630M5635M7771M9888N1575N2599N3169N3657N4111N4181
53387B133470N3651N2764N1845N0839M9553M8074M6541M4690M2165L9098L5867
53376B648557L2470K8722K4864K1279J7687J3460Q638L821j002o558j2993j9409
53364B759536k5083l0264l5300l9781m3144m5457m7042m7890m8072m8087m8292
53353B301124m8356m7806m6618m4919m2702m0285l8421l7413l6782l6300l6562
53342A844960l7776l8802l8381l6686l4696l2603l0037k7434k5764k4948k3792
53331A494041k1626j8978j6493j4259j2509j1934j2765j4209j5293j5756j5867
$$ y = [1241850, 1266450, 1291963, 1318615, 1346525, 1375940, 1407148, 1440046, 1474205, 1509524, 1546504, 1585717, 1627254, 1670884, 1716519, 1764290, 1814178, 1865753, 1918352, 1971521, 2025178, 2079289, 2133470, 2187121, 2239885, 2291730, 2342569, 2392122, 2440196, 2486737, 2531427, 2573592, 2612690, 2648557, 2681027, 2709749, 2734613, 2755892, 2773579, 2787039, 2795677, 2799498, 2798496, 2791938, 2778945, 2759536, 2734453, 2704189, 2668889, 2629108, 2585964, 2540507, 2493465, 2445575, 2397503, 2349416, 2301124, 2252768, 2204962, 2158344, 2113425, 2070723, 2030438, 1992017, 1954604, 1917822, 1881522, 1844960, 1807184, 1768382, 1730001, 1693315, 1658619, 1626016, 1595979, 1568545, 1542781, 1517833, 1494041, 1472415, 1453437, 1436944, 1422685, 1410176, 1398242, 1385477, 1371268, 1355975, 1340219, 1324352]
53320A324352j5933j6218j6811j7231j6708j5231j3730j2846j2015j0288p686
53309A169655n192l543k572j702o57M37J426K432L735N413P194Q798J0300J1994
53295A207718J3956J5953J7734J9237K0463K1430K2221K2955K3600K3972K3847
53284A433086K3087K1790K0311J8970J7588J5665J3139J0576Q277N699K286j464
53272A589010m415o188p504r205j1481j4067j6647j8879k0558k1833k2989k3979
53260A411265k4541k4750k4985k5345k5585k5657k5823k6160k6322k5947k5026
53249A131124k3814k2715k2154k2112k1979k1331k0704k0934k1826k2326k2010
53238H89219k1482k1106k0333j8782j7115j6085j5369j4106j2258j0615r725r385
$$ y = [1324352, 1308419, 1292201, 1275390, 1258159, 1241451, 1226220, 1212490, 1199644, 1187629, 1177341, 1169655, 1164463, 1160920, 1158348, 1156646, 1155989, 1156426, 1157852, 1160284, 1164019, 1169432, 1176626, 1185424, 1195724, 1207718, 1221674, 1237627, 1255361, 1274598, 1295061, 1316491, 1338712, 1361667, 1385267, 1409239, 1433086, 1456173, 1477963, 1498274, 1517244, 1534832, 1550497, 1563636, 1574212, 1582489, 1588188, 1590474, 1589010, 1584595, 1578407, 1570903, 1561698, 1550217, 1536150, 1519503, 1500624, 1480066, 1458233, 1435244, 1411265, 1386724, 1361974, 1336989, 1311644, 1286059, 1260402, 1234579, 1208419, 1182097, 1156150, 1131124, 1107310, 1084595, 1062441, 1040329, 1018350, 997019, 976315, 955381, 933555, 911229, 889219, 867737, 846631, 826298, 807516, 790401, 774316, 758947, 744841, 732583, 721968, 712243, 702858]
53226G02858r181q920q622q455q701r551j0910j2541j4138j5233j5395j4772j4101
53213E52338j3875j3894j3778j3529j3206j2524j1313r980r045q525q207q133
53201D16329q314q326p945p784q547r807j0377r870r045q562q223p678p075o608
53187B98168o042n129m096l256k588k018j749j993k596l251l747l745k791j096
53173B54071J27j42j390k109j680r64q89j229j300j165j341j681j446n61on07
53157B37788j501j917j570j096p98l24M31Q79N51j40m90m42m45n88m71L5M61M14
53139B30777J26O1J69N7k60j81O51J699K081J678J245J383J793J811J350R08Q69
53122B46217J208J778K413K786K602K000J374P96J29l39l1Q91J311N02q74j622
$$ y = [702858, 693677, 684757, 676135, 667680, 658979, 649428, 638518, 625977, 611839, 596606, 581211, 566439, 552338, 538463, 524569, 510791, 497262, 484056, 471532, 460219, 450239, 441194, 432669, 424462, 416329, 408015, 399689, 391744, 383960, 375413, 365606, 355229, 345359, 336314, 327752, 319529, 311851, 304776, 298168, 292126, 286997, 282901, 279645, 277057, 275039, 273290, 271297, 268701, 265450, 261703, 257958, 255167, 254071, 254198, 254056, 252666, 250557, 248877, 247913, 247024, 245795, 244495, 243330, 241989, 240308, 238862, 238301, 238295, 237788, 236287, 234370, 232800, 231704, 230906, 230582, 231013, 231892, 232443, 232303, 231813, 231371, 230926, 230338, 229867, 229902, 230363, 230777, 230903, 230964, 231133, 231190, 230930, 230749, 231400, 233099, 235180, 236858, 238103, 239486, 241279, 243090, 244440, 245348, 246217, 247425, 249203, 251616, 254402, 257004, 259004, 260378, 261174, 261303, 260964, 260933, 261824, 263135, 263637, 262763, 261141]
53106B61141j489j204j328j665j764j426p99l40n77j475k172j872q75k40m78j166
53090B42271j754k148k390k385k160j921j650j076k36L50L13r5l66k75Q3M91O56
53073B27708L82j00l02j41q7m54q75p68j33L78J45p76j624j567o28J95O6n90o09
53054B20220L35J385J767J676J594J443R46K69k26m54m67k42pk27q50j063m11
53037B25688M80Q24P08N64J95o16j167o29M68P71L0o91p55o31o53l79L89J036
53019B25632J207J455K085K306J359j63r57n86L59J171J464J113M39J75N49Q04
53003B38412K35o96j011o46l24k71k2N06P30L51j37r9O32J899L254L819K861R25
52985B50418l60nJ252K007J822J346J187J313J403J363J309J407J649J754J389
$$ y = [261141, 259652, 258448, 257120, 255455, 253691, 252265, 251466, 251126, 250549, 249074, 246902, 245030, 244155, 243915, 243437, 242271, 240517, 238369, 235979, 233594, 231434, 229513, 227863, 226787, 226551, 226901, 227214, 227119, 226753, 226478, 226561, 227052, 227708, 228090, 227990, 227688, 227547, 227460, 227006, 226131, 225363, 225230, 225608, 225753, 224977, 223353, 221786, 221158, 221353, 221419, 220829, 220220, 220555, 221940, 223707, 225383, 226977, 228420, 229366, 229635, 229409, 228955, 228488, 228246, 228239, 228012, 227162, 226099, 225688, 226168, 226992, 227700, 228264, 228459, 227843, 226676, 226047, 226515, 227286, 227316, 226625, 225870, 225239, 224586, 224207, 224596, 225632, 226839, 228294, 230379, 232685, 234044, 233881, 232924, 232338, 232697, 233868, 235332, 236445, 236884, 237059, 237608, 238412, 238647, 237951, 236940, 236294, 235970, 235699, 235677, 236183, 236913, 237264, 237127, 237028, 237660, 239559, 242813, 246632, 249493, 250418, 250058, 250053, 251305, 253312, 255134, 256480, 257667, 258980, 260383, 261746, 263055, 264462, 266111, 267865, 269254]
52970B69254O01j06l14j17P9N8r1k17k91l84n54p09o19k83j49o71j590k067j706
52951B60124j081r59j315j519j310j070j188j510j593j254o64o2M27P02O00P3
52935B48401n76q95q17p38q57q06k77K55Q3n61p01o6M47J18n28o11j73J50K70
52916B42118N41Q62P80M33M07O63M99k20o97m72j69m59r77j018p09o96r69r19
52898B38998l65K07M51M84L68j7m54m05K21Q71J208J512J886J757P73l21n22L9
52880B46691L51J17R8P62J441J370Q37O72J023J310J261J232J478J702J553J161
52864B63059R06Q63P81M54n7n99j097j580k044k355k329k018j857k372l553m614
52848B41588m588l318j781j152j545j959j582q31o64j171j533j399j416j963k179
$$ y = [269254, 269855, 269749, 269435, 269318, 269397, 269455, 269364, 269147, 268856, 268472, 267918, 267209, 266590, 266307, 266158, 265487, 263897, 261830, 260124, 259043, 258084, 256769, 255250, 253940, 252870, 251682, 250172, 248579, 247325, 246661, 246599, 247026, 247728, 248328, 248401, 247825, 246930, 246113, 245375, 244518, 243712, 243435, 243690, 243773, 243212, 242511, 242445, 242892, 243010, 242482, 241871, 241698, 241848, 242118, 242659, 243521, 244301, 244734, 245141, 245804, 246303, 246083, 245386, 244914, 244745, 244286, 243309, 242291, 241582, 240886, 239917, 238998, 238633, 238840, 239291, 239775, 240143, 240126, 239672, 239267, 239488, 240359, 241567, 243079, 244965, 246722, 247495, 247174, 246652, 246691, 247042, 247159, 247257, 248019, 249460, 250830, 251667, 252339, 253362, 254672, 255933, 257165, 258643, 260345, 261898, 263059, 263965, 264828, 265609, 266063, 266006, 265407, 264310, 262730, 260686, 258331, 256002, 253984, 252127, 249755, 246202, 241588, 237000, 233682, 231901, 230749, 229204, 227245, 225663, 224832, 224168, 222997, 221464, 220065, 218649, 216686, 214507]
52833B14507j071Q07J811J247J85L4R94K191K728K232R00n54j251q97j03K47j54
52816B23853r05j313r05J92J203J435J122J167J834K241J544P8j149j747k089
52801B26561k421k543k283j709q57J90R85J020M74J05K35L75P5k91p6N84Q26J62
52783B21412q77j309p77J47O35M90K47M04P73P54J54n95j043j211j363j490j389
52766B14962j128j049j194j050j70J050J638J201M72L88R40J367J322J239J435
52751B21423J538J177P52R88J874K657K796K490K227K174K165K013J646J130O60
52736B47710M54N97R55J295J428J335J209J243J388J390J108N98j12j082k107
52721B57409k680k543k057j772j792j829j651j233o66j28J70K85M63N86J60q48
$$ y = [214507, 213436, 214243, 216054, 217301, 217486, 217520, 218514, 220705, 223433, 225665, 226565, 226011, 224760, 223863, 223760, 224007, 223853, 222948, 221635, 220730, 220922, 222125, 223560, 224682, 225849, 227683, 229924, 231468, 231546, 230397, 228650, 226561, 224140, 221597, 219314, 217605, 216748, 216938, 217923, 218943, 219417, 219522, 219757, 220132, 220207, 219916, 219840, 220424, 221250, 221412, 220535, 219226, 218449, 218596, 219231, 219721, 219968, 220372, 221145, 221899, 222053, 221458, 220415, 219204, 217841, 216351, 214962, 213834, 212785, 211591, 210541, 210371, 211421, 213059, 214260, 214732, 215120, 216060, 217427, 218749, 219988, 221423, 222961, 224138, 224890, 225878, 227752, 230409, 233205, 235695, 237922, 240096, 242261, 244274, 245920, 247050, 247710, 248164, 248761, 249716, 251011, 252439, 253774, 254983, 256226, 257614, 259004, 260112, 260710, 260598, 259516, 257409, 254729, 252186, 250129, 248357, 246565, 244736, 243085, 241852, 241186, 241058, 241228, 241513, 241976, 242562, 242722, 241874]
52705B41874j615j453p28k28J8M91J084J161O45J25j27l99o93n89j15R8j90m59
52687B38900m22n27j037j449j331r87p21k06O78J142M91p32j484j569j324o13
52671B28809P43J908J743N98J06R52K038K199J640J128P40K34o5K94J087J725
52655B45879K129K552K850K631K016J504J132L92q66j985k269j759j081p52p96
52640B51577q69o30j50P4k58p15n36M41J713K914M108N112N252M352L273K728
52624B78386J989j35l215n196m894l434k613k675k585j923j352j373j633j672
52610B47675j508j219n95L90J234J456J090M25l40q95q65l64q1l48n69j64M04
52593B45726K65m79q78n37k2K43O26J435K179K245J823J570J642J588J073J95
$$ y = [241874, 240259, 238806, 238078, 237850, 237868, 238359, 239443, 240604, 241249, 241374, 241247, 240848, 240155, 239566, 239451, 239549, 239359, 238900, 238478, 237951, 236914, 235465, 234134, 233147, 232426, 232220, 232898, 234040, 234531, 233799, 232315, 230746, 229422, 228809, 229552, 231460, 233203, 233801, 233907, 234859, 236897, 239096, 240736, 241864, 242604, 242838, 242773, 243067, 244154, 245879, 248008, 250560, 253410, 256041, 258057, 259561, 260693, 261085, 260219, 258234, 255965, 254206, 253125, 252373, 251577, 250708, 250078, 249928, 250002, 249744, 249029, 248493, 248934, 250647, 253561, 257669, 262781, 268033, 272385, 275658, 278386, 280375, 280240, 277025, 271829, 266935, 263501, 260888, 258213, 255628, 253705, 252353, 250980, 249347, 247675, 246167, 244948, 244353, 244743, 245977, 247433, 248523, 248948, 248608, 247713, 246848, 246484, 246403, 246055, 245486, 245322, 245726, 245991, 245512, 244634, 244097, 244075, 244318, 244944, 246379, 248558, 250803, 252626, 254196, 255838, 257426, 258499, 258694]
52577B58694p77j572j889j574q93l02J8K24M63P64J144J465J324N14m82r26q34
52560B55361r14j412j669j150l49q6l97p46r71j293j589j382n69M65J487K401
52544B47187K646J517o23k227k215j127j02N80J274J815J618P56N6j6K06L15M20
52527B52080P23J033J079R10P54P30Q65J158J512J770J879J841J542R60N19P35
52511B70090J428J773J398R55J198J842J901R87k46j016j364j936l031m135m483
52496B65361l870k798j865j249q24n13l05j43l6j47n01o84k62N73J123R74L89
52479B55223j32l26j84J36L57L60M59J053J977K586K568K323K269K279K017J526
52463B74491J174J223J662K235K480K027J045J03n40j202k076k750k768k336k060
$$ y = [258694, 257917, 256345, 254456, 252882, 251989, 251687, 251705, 251929, 252392, 253156, 254300, 255765, 257089, 257603, 257121, 256195, 255361, 254447, 253035, 251366, 250216, 249867, 249781, 249384, 248638, 247667, 246374, 244785, 243403, 242834, 243299, 244786, 247187, 249833, 251350, 250727, 248500, 246285, 245158, 245056, 245636, 246910, 248725, 250343, 251099, 251155, 251139, 251345, 251660, 252080, 252803, 253836, 254915, 255825, 256579, 257309, 258174, 259332, 260844, 262614, 264493, 266334, 267876, 268836, 269355, 270090, 271518, 273291, 274689, 275644, 276842, 278684, 280585, 281572, 281326, 280310, 278946, 277010, 273979, 269844, 265361, 261491, 258693, 256828, 255579, 254755, 254242, 253937, 253794, 253758, 253611, 253110, 252426, 252164, 252737, 253860, 254834, 255223, 255091, 254765, 254581, 254717, 255074, 255434, 255893, 256946, 258923, 261509, 264077, 266400, 268669, 270948, 272965, 274491, 275665, 276888, 278550, 280785, 283265, 285292, 286337, 286440, 285900, 284698, 282622, 279872, 277104, 274768, 272708]
52448B72708k138k262k126j691j058m70l56r60j883k352j997j161m17MJ96K47
52432B54284J05k40o44r16r81q54m36L62J302J849J801J633J860K305K397K056
52416B65883J770J825K025K215K558L146L774M230M462M424M286M639N877P279
52402C18393P516O184M082J842o86l316n011n226m840m831m834m063k931k468
52388B99811k574k151r48M5J52r7L7N09Q60R70J012J114J354J787K343K894L394
52371C10512L735L697L401L454M125M673M190K889J792J328J016N03L0j61j60
52356C45024M9N84J117J120P40P15J214J619J617J688K168K645K761K833L176
52341C69070L447L298L092L407M230N223O319P559Q689R450J0007J0564J0909
$$ y = [272708, 270570, 268308, 266182, 264491, 263433, 262963, 262607, 261647, 259764, 257412, 255415, 254254, 253837, 253841, 254037, 254284, 254389, 254149, 253505, 252589, 251608, 250754, 250318, 250680, 251982, 253831, 255632, 257265, 259125, 261430, 263827, 265883, 267653, 269478, 271503, 273718, 276276, 279422, 283196, 287426, 291888, 296312, 300598, 305237, 311114, 318393, 325909, 332093, 336175, 338017, 337331, 334015, 329004, 323778, 318938, 314107, 309273, 305210, 302279, 299811, 297237, 295086, 294138, 294183, 294335, 294238, 294275, 294784, 295644, 296614, 297626, 298740, 300094, 301881, 304224, 307118, 310512, 314247, 317944, 321345, 324799, 328924, 333597, 337787, 340676, 342468, 343796, 344812, 345315, 345345, 345184, 345024, 345073, 345657, 346774, 347894, 348634, 349349, 350563, 352182, 353799, 355487, 357655, 360300, 363061, 365894, 369070, 372517, 375815, 378907, 382314, 386544, 391767, 398086, 405645, 414334, 423784, 433791, 444355, 455264]
52328D55264J0868J0957J1911J3750J5804J7570J9052K0284K1035K1099K0668
52317F38262K0296K0489K1203K1717K1340K0350J9850K0415K1343K1609K1178
52306H68052K0825K0896K0964K0598J9908J9158J8289J7135J5740J4238J2491
52295A068294J0160P186M101J689J88j054k963n671q329r981j0404j0012r253
52282A033951q375p600p056o548n597l934j905k43O64J265K465M652P232R330
52268A018301J0708J1749J2716J3435J3748J3832J3976J4308J4855J5561J6199
52257A169388J6475J6362J6117J5918J5740J5541J5320J4924J4054J2487J0094
52246A332420O808K852j118m477p157r350j0982j2000j2892j4177j5424j5712
$$ y = [455264, 466132, 477089, 489000, 502750, 518554, 536124, 555176, 575460, 596495, 617594, 638262, 658558, 679047, 700250, 721967, 743307, 763657, 783507, 803922, 825265, 846874, 868052, 888877, 909773, 930737, 951335, 971243, 990401, 1008690, 1025825, 1041565, 1055803, 1068294, 1078454, 1085640, 1089741, 1091430, 1091618, 1090564, 1087601, 1081930, 1073601, 1063620, 1053216, 1043204, 1033951, 1025576, 1017976, 1010920, 1004372, 998775, 994841, 992936, 992693, 993357, 994622, 997087, 1001739, 1008971, 1018301, 1029009, 1040758, 1053474, 1066909, 1080657, 1094489, 1108465, 1122773, 1137628, 1153189, 1169388, 1185863, 1202225, 1218342, 1234260, 1250000, 1265541, 1280861, 1295785, 1309839, 1322326, 1332420, 1339228, 1342080, 1340962, 1336485, 1329328, 1319978, 1308996, 1296996, 1284104, 1269927, 1254503, 1238791]
52234A238791j5069j4571j4782j5008j4503j3564j2857j2467j2146j1907j1668
52223A090249j0912r389p692o445n309l625j682m89m02o60l18Q65K426L638M000
52208A054255L677L389L632M135M366M239L991L775L828M597O062P258P189O175
52194A120568N538N978O792O877O028M985M452M188L172P97k122m094m725n187
52180A153247o504q187r160r360r452r449q776p552o639o269n658m257k587j395
52166A058002o98j02M57Q16J061J443J980K412K514K234J678R84K70k51j53Q52
52150A073499K236K821K043P17J6N4J15m7MM06O88O33N80P56R83J324K284L966
52132A093078N699O872P752R031J0937J3183J5451J7663J9933K2386K4795K6404
$$ y = [1238791, 1223722, 1209151, 1194369, 1179361, 1164858, 1151294, 1138437, 1125970, 1113824, 1101917, 1090249, 1079337, 1069948, 1062256, 1055811, 1050502, 1046877, 1045195, 1044706, 1044304, 1043644, 1043326, 1044191, 1046617, 1050255, 1054255, 1057932, 1061321, 1064953, 1069088, 1073454, 1077693, 1081684, 1085459, 1089287, 1093884, 1099946, 1107204, 1114393, 1120568, 1126106, 1132084, 1138876, 1145753, 1151781, 1156766, 1161218, 1165406, 1168578, 1169375, 1167253, 1163159, 1158434, 1153247, 1146743, 1138556, 1129396, 1120036, 1110584, 1101135, 1092359, 1084807, 1078168, 1071899, 1066241, 1061984, 1059397, 1058002, 1057304, 1057202, 1057659, 1058475, 1059536, 1060979, 1062959, 1065371, 1067885, 1070119, 1071797, 1072781, 1073051, 1072800, 1072647, 1073499, 1075735, 1078556, 1080599, 1081316, 1081332, 1081386, 1081501, 1081454, 1081458, 1081864, 1082552, 1083185, 1083765, 1084521, 1085504, 1086828, 1089112, 1093078, 1098777, 1105649, 1113401, 1122432, 1133369, 1146552, 1162003, 1179666, 1199599, 1221985, 1246780, 1273184]
52120A273184K6650K6067K5986K6997K8250K8562K7737K6493K5448K4619K3680
52109A563673K2347K0639J8910J7443J6000J4149J2028J0276R049P664N533K939
52097A720650N25j561l646o062r080j2722j6295j8620j9285j9259j9607k0060
52085A574978j9599j8226j7082j6757j6375j4818j2193r547p553n997m425k674
52073A429732o61J851M877P837R989J1276J2411J3897J5395J6336J6855J7565
52061A557360J8519J9086J8929J8461J8041J7266J5570J3170J0943R372Q000N915
$$ y = [1273184, 1299834, 1325901, 1351887, 1378884, 1407134, 1435696, 1463433, 1489926, 1515374, 1539993, 1563673, 1586020, 1606659, 1625569, 1643012, 1659012, 1673161, 1685189, 1695465, 1704514, 1712178, 1717711, 1720650, 1721175, 1719614, 1715968, 1709906, 1700826, 1688104, 1671809, 1653189, 1633904, 1614645, 1595038, 1574978, 1555379, 1537153, 1520071, 1503314, 1486939, 1472121, 1459928, 1450381, 1442828, 1436831, 1432406, 1429732, 1429071, 1430922, 1435799, 1443636, 1453625, 1464901, 1477312, 1491209, 1506604, 1522940, 1539795, 1557360, 1575879, 1594965, 1613894, 1632355, 1650396, 1667662, 1683232, 1696402, 1707345, 1716717, 1724717, 1730632]
$$ [...]
##END NTUPLES=NMR SPECTRUM
##END=
