##TITLE=AC1733_SEN00006_9276007_kklLlyEvKr
##JCAMPDX= 6.0         $$ Bruker NMR JCAMP-DX V2.0
##DATA TYPE= NMR SPECTRUM
##DATA CLASS= NTUPLES
##ORIGIN= BRUKER
##OWNER= Administrator
$$ 1.72 TOPSPIN		Version 2.1
$$ 2015-07-17 21:29:24.713 -0700  Administrator@X
$$ Compression mode = diff/dup
##.OBSERVE FREQUENCY= 400.02188249412
##.OBSERVE NUCLEUS= ^1H
##.ACQUISITION MODE= SIMULTANEOUS (DQD)
##.ACQUISITION SCHEME= undefined
##.AVERAGES= 8
##.DIGITISER RES= 22
##SPECTROMETER/DATA SYSTEM= spect
##.PULSE SEQUENCE= zg30
##.SOLVENT NAME= COFFEE_meoh
##.SHIFT REFERENCE= INTERNAL, COFFEE_meoh, 1, 14.98509
##AUDIT TRAIL= $$ (NUMBER, WHEN, WHO, WHERE, PROCESS, VERSION, WHAT)
$$ ##TITLE= Audit trail, TOPSPIN		Version 2.1
$$ ##JCAMPDX= 5.01
$$ ##ORIGIN= Bruker BioSpin GmbH
$$ ##OWNER= Administrator
$$ $$ E:\/data/COFFEE/nmr/AC1733_SEN00006_9276007_kklLlyEvKr/10/pdata/1/auditp.txt
$$ ##AUDIT TRAIL=  $$ (NUMBER, WHEN, WHO, WHERE, PROCESS, VERSION, WHAT)
(   1,<2015-07-17 21:29:17.963 -0700>,<Administrator>,<X>,<go>,<TOPSPIN 2.1>,
      <created by zg
	started at 2015-07-17 21:28:11.994 -0700,
	POWCHK enabled, PULCHK disabled,
       configuration hash MD5:
       21 0F 79 D6 B3 7B B4 F6 88 20 88 DB 03 48 BD 9F
       data hash MD5: 64K
       52 24 86 A1 09 F6 51 92 29 69 80 F3 09 B0 F5 ED>)
(   2,<2015-07-17 21:29:21.104 -0700>,<Administrator>,<X>,<proc1d>,<TOPSPIN 2.1>,
      <Start of raw data processing
       efp LB = 0 FT_mod = 6 PKNL = 1 PHC0 = 0 PHC1 = 0 SI = 32K 
       data hash MD5: 32K
       86 C4 5D 6F 2B 3E F8 DF D7 99 CF 24 51 3C D5 5C>)
(   3,<2015-07-17 21:29:21.432 -0700>,<Administrator>,<X>,<proc1d>,<TOPSPIN 2.1>,
      <pk PHC0 = 85.57251 PHC1 = 0 
       data hash MD5: 32K
       0B 09 69 DB A8 B0 B9 62 A3 DF 08 BA 3A BB C2 15>)
(   4,<2015-07-17 21:29:21.525 -0700>,<Administrator>,<X>,<proc1d>,<TOPSPIN 2.1>,
      <abs ABSG = 1 
       data hash MD5: 32K
       13 02 82 29 4B E9 82 E0 62 11 1F F4 B8 55 C4 2A>)
(   5,<2015-07-17 21:29:21.588 -0700>,<Administrator>,<X>,<proc1d>,<TOPSPIN 2.1>,
      <abs ABSG = 2 
       data hash MD5: 32K
       A7 80 27 4B 26 1F 71 BF 9F AF E0 11 82 D5 99 3F>)
(   6,<2015-07-17 21:29:21.635 -0700>,<Administrator>,<X>,<proc1d>,<TOPSPIN 2.1>,
      <abs ABSG = 3 
       data hash MD5: 32K
       1B 56 56 5E 4B 7D 8B F8 D7 03 F6 09 35 BA 9F 9D>)
(   7,<2015-07-17 21:29:21.682 -0700>,<Administrator>,<X>,<proc1d>,<TOPSPIN 2.1>,
      <abs ABSG = 4 
       data hash MD5: 32K
       8A 7C 24 52 1D E2 54 FD 28 44 9E DA A7 53 05 14>)
(   8,<2015-07-17 21:29:21.729 -0700>,<Administrator>,<X>,<proc1d>,<TOPSPIN 2.1>,
      <abs ABSG = 5 
       data hash MD5: 32K
       D0 38 1F 0C ED A1 2C 26 BC 32 02 CC 39 B1 BE 5F>)
$$ ##END=
$$ 
$$ $$ hash MD5
$$ $$ 9B 1B 31 61 3E DE BC B6 1A EE 9A FB 85 F8 B4 CF
##$RELAX= 
##$RELAX= 
##$RELAX= 
##$RELAX= 
##$RELAX= 
##$RELAX= 
##$RELAX= 
$$ Bruker specific parameters
$$ --------------------------
##$DU= <E:\>
##$EXPNO= 10
##$NAME= <AC1733_SEN00006_9276007_kklLlyEvKr>
$$ [...]
##$TP= (0..7)
150 150 150 150 150 150 150 150
##$TP07= 0
##$TPNAME0= <>
##$TPNAME1= <>
##$TPNAME2= <>
##$TPNAME3= <>
##$TPNAME4= <>
##$TPNAME5= <>
##$TPNAME6= <>
##$TPNAME7= <>
##$TPOAL= (0..7)
0.5 0.5 0.5 0.5 0.5 0.5 0.5 0.5
##$TPOFFS= (0..7)
0 0 0 0 0 0 0 0
##$TUNHIN= 0
##$TUNHOUT= 0
##$TUNXOUT= 0
##$USERA1= <user>
##$USERA2= <user>
##$USERA3= <user>
##$USERA4= <user>
##$USERA5= <user>
##$V9= 5
##$VALIST= <valist>
##$VCLIST= <CCCCCCCCCCCCCCC>
##$VD= 0
##$VDLIST= <DDDDDDDDDDDDDDD>
##$VPLIST= <PPPPPPPPPPPPPPP>
##$VTLIST= <TTTTTTTTTTTTTTT>
##$WBST= 2048
##$WBSW= 25
##$XGAIN= (0..3)
0 0 0 0
##$XL= 0
##$YL= 0
##$YMAX_a= 599744
##$YMIN_a= -532641
##$ZGOPTNS= <>
##$ZL1= 120
##$ZL2= 120
##$ZL3= 120
##$ZL4= 120
##$ABSF1= 14.98509
##$ABSF2= -5.573092
##$ABSG= 5
##$ABSL= 3
##$ALPHA= 0
##$AQORDER= 0
##$ASSFAC= 0
##$ASSFACI= 0
##$ASSFACX= 0
##$ASSWID= 0
##$AUNMP= <proc_prof1d_extract_pilot.lims>
##$AXLEFT= 0
##$AXNAME= <>
##$AXNUC= <1H>
##$AXRIGHT= 0
##$AXTYPE= 0
##$AXUNIT= <>
##$AZFE= 0.1
##$AZFW= 0.1
##$BCFW= 0
##$BC_mod= 0
##$BYTORDP= 0
##$COROFFS= 0
##$CY= 15
##$DATMOD= 1
##$DC= 0
##$DFILT= <>
##$DTYPP= 0
##$F1P= 0
##$F2P= 0
##$FCOR= 0.5
##$FTSIZE= 32768
##$FT_mod= 6
##$GAMMA= 0
##$GB= 0
##$INTBC= 1
##$INTSCL= 1
##$ISEN= 128
##$LB= 0
##$LEV0= 0
##$LPBIN= 0
##$MAXI= 10000
##$MC2= 0
##$MEAN= 0
##$ME_mod= 0
##$MI= 0
##$NCOEF= 0
##$NC_proc= -8
##$NLEV= 6
##$NOISF1= 0
##$NOISF2= 0
##$NSP= 0
##$NTH_PI= 0
##$NZP= 0
##$OFFSET= 14.98509
##$PC= 1
##$PHC0= 85.57251
##$PHC1= 0
##$PH_mod= 1
##$PKNL= yes
##$PPARMOD= 0
##$PPDIAG= 0
##$PPIPTYP= 0
##$PPMPNUM= 2147483647
##$PPRESOL= 1
##$PSCAL= 4
##$PSIGN= 0
##$PYNMP= <proc.py>
##$REVERSE= no
##$SF= 400.02
##$SI= 32768
##$SIGF1= 0
##$SIGF2= 0
##$SINO= 400
##$SIOLD= 32768
##$SPECTYP= <>
##$SREGLST= <1H.CDCl3>
##$SSB= 0
##$STSI= 32768
##$STSR= 0
##$SW_p= 8223.68421052631
##$SYMM= 0
##$S_DEV= 0
##$TDeff= 65536
##$TDoff= 0
##$TI= <>
##$TILT= no
##$TM1= 0
##$TM2= 0
##$TOPLEV= 0
##$USERP1= <user>
##$USERP2= <user>
##$USERP3= <user>
##$USERP4= <user>
##$USERP5= <user>
##$WDW= 1
##$XDIM= 32768
##$YMAX_p= 458014269
##$YMIN_p= -661663
##$CURPLOT= <Network HP LaserJet P1505>
##$CURPRIN= <$Network HP LaserJet P1505>
##$DFORMAT= <normdp>
##$LAYOUT= <+/1D_H.xwp>
##$LFORMAT= <normlp>
##$PFORMAT= <normpl>
##$SURQMSG= 1
$$ End of Bruker specific parameters
$$ ---------------------------------
##NTUPLES= NMR SPECTRUM
##VAR_NAME=  FREQUENCY,     SPECTRUM/REAL,   SPECTRUM/IMAG
##SYMBOL=    X,             R,               I
##VAR_TYPE=  INDEPENDENT,   DEPENDENT,       DEPENDENT
##VAR_FORM=  AFFN,          ASDF,            ASDF
##VAR_DIM=   32768,         32768,           32768
##UNITS=     HZ,            ARBITRARY UNITS, ARBITRARY UNITS
##FACTOR=    0.250966925370066, 1,           1
##FIRST=     8223.43324360094, 2874,         -5699
##LAST=      0,             -86423,          20168
##MIN=       0,             -661663,         0
##MAX=       8223.43324360094, 458014269,    0
$$ Real data points
##PAGE= N=1
##DATA TABLE= (X++(R..R)), XYDATA
$$ [...]
19551b23713E8577K74563A07519b31873c7042l02146e1004B03734o0248a37350
19540A16514a80090f2260A04333D3617b97354a28848j61547J37951A40390e9382
19529F1875M9296b04746J1826f001j51730k5682G0342J29843d54192a17865c1791
19517a24140M6793q5275f2126K3582j87753B50980a49222M5133k9478B9043E450
19505A07022h8900r7950J0876A88238a76744h1101A41640a2310B47169e416o0878
19494f6294A35150R8508J2897h7726J296q2728f4597C5395b94648J42447A96637
19482D7035a35804I4878c84469a29412d8644k8993j37469D2719e9914f302m6345
19471e2647A08697K0294a9147A62692a22951M4689n977n0025F5592A0665J80805
$$ plain form
19551 -223713 58577 333140 107519 -231873 -37042 -339188 -51004 203734 143486 -137350
19540 116514 -180090 -62260 104333 43617 -297354 -128848 -290395 -152444 140390 -59382
19529 61875 111171 -204746 -192920 -6001 -157731 -183413 70342 200185 -454192 -117865 -31791
19517 -124140 -77347 -162622 -62126 -38544 -226297 250980 -149222 -104089 -133567 29043 5450
19505 107022 -88900 -186850 -175974 188238 -176744 -81101 141640 -12310 247169 -5416 -66294
19494 -66294 135150 233658 246555 -87726 -86430 -169158 -64597 35395 -294648 -152201 196637
19482 47035 -135804 94878 -384469 -129412 -48644 -77637 -215106 42719 -59914 -6302 -52647
19471 -52647 108697 128991 -19147 162692 -122951 -78262 -84239 -134264 65592 10665 191470
19460A91470a95579g2434f910j40050k4900H7236k1212e8379j7313k48282a43812
19448B66738a74907I2050a64449G5935p088a80454I8976e4406j82128i8356J2491
19437h5865o4833B33744a91029a0030q7776A85954a56285j0595k7971M8978q039
19426a53912e4690k5399A53991p2237K489J27069h4986a4644j80895R0118m7072
19415a52493j08044Q4594j03090A55964A1367a71290I1050d67211e0483A1095
19404A21288c9111J0709B5464g1661R8A97375b14649O8599B32045a01310L1653
19393f9657I6970a57085O5636H9243b45503R6474c4297n6229A5907N3115a12437
19381b8800m19399D0J90330c6132j24483b4627C7852d7220j79226B31888r5774
$$ plain form
19460 191470 -195579 -72434 -6910 -146960 -171860 87236 66024 -58379 -75692 -323974 -143812
19448 266738 -174907 92050 -164449 75935 68847 -180454 98976 -54406 -236534 -98356 -85865
19437 -85865 -150698 233744 -191029 -10030 -97806 185954 -156285 -166880 -194851 -145873 -153912
19426 -153912 -54690 -80089 153991 81754 84243 211312 -84986 -14644 -195539 -105421 -152493
19415 -152493 -260537 -175943 -279033 155964 11367 -171290 91050 -467211 -50483 11095
19404 121288 -39111 -28402 25464 -71661 -71563 197375 -214649 -146050 232045 -101310 -69657
19393 -69657 96970 -157085 -91449 89243 -245503 -149029 -34297 -90526 15907 69022 -112437
19381 -28800 -448199 40 190370 -36132 -160615 -24627 37852 -47220 -226446 231888 136114
19370A36114c39216a08705B21622h9586m9005B15005a94755j26418a21184k02767
19360c23951m2838a38597E7417i0842I6722I512a51212L6841o5692A82900i8495
19348A99007I1733d00065a78568k00805J35337A21899E6536J8286K60461j60875
19338A74408b22770d7415b1190E1701c5077E7693K73941D7809a02962C08085c1524
19326C6891L5875A2847n503a87895k55311B48808F9488e79688B72200a07315c8004
19314B74267D8187K38606A33347a0906k03688d328l61836O511D2663l238a95081
19302a04419c6479c394J373D2151c1299k44225A93454B4423g1570k43627f1704
19290a38337A16303a06528a9212j24805f2914j7165m8472c5262k06890O4591J3621
$$ plain form
19370 136114 -339216 -108705 221622 -89586 -138591 215005 -194755 -321173 -121184 -323951
19360 -323951 -366789 -138597 57417 -90842 96722 9512 -151212 -114371 -180063 182900 -98495
19348 199007 91733 -400065 -178568 -379373 -244036 121899 56536 74822 335283 174408
19338 174408 -222770 -47415 -21190 51701 -35077 57693 331634 47809 -102962 308085 -31524
19326 36891 72766 12847 7344 -187895 -443206 248808 69488 -579688 272200 -107315 -38004
19314 274267 48187 286793 133347 -10906 -214594 -4328 -366164 -359653 42663 39425 -195081
19302 -104419 -36479 -3394 -2021 42151 -31299 -275524 193454 24423 -71570 -315197 -61704
19290 -138337 116303 -106528 -19212 -144017 -62914 -80079 -128551 -35262 -242152 -177561 -163940
19279a63940O9846q5483F8419a43902m2615c5804B11031F2325b17j69593A93057
19267i1859A13654b56069i1410l19b8066i957n6845A97980G8397M0047b44708
19255b7209A37103b47464k8022R0360e6281H007b04742d4936q513j0377A71355
19243b12763j61470C7597J17231a32511E6995g0164A07316a29832c5397B3386
19232d07385J67528H3835D261a62332f8336K359q466o3268A7876b6339I5655b20412
19219A27391i3328A32392f656j29684f48j33784I8471a7103F9267K9766i8317
19207E6029J37664m7204p1519c03484c3399A9931J27400c16094e653p8075l2596
19196a16324k32873E4579e06102A77995a61366j44886d3878D0392b39154A54156
$$ plain form
19279 -163940 -94094 -179577 68419 -143902 -186517 -35804 211031 62325 -217 -169810 193057
19267 -91859 113654 -256069 -91410 -91729 -28066 -9957 -66802 197980 78397 118444 -244708
19255 -27209 137103 -247464 -275486 -185126 -56281 8007 -204742 -44936 -53449 -63826 171355
19243 -212763 -374233 37597 154828 -132511 56995 -70164 107316 -129832 -35397 23386
19232 -407385 -239857 83835 4261 -162332 -68336 -65977 -74443 -137711 17876 -26339 95655 -220412
19219 127391 -93328 132392 -6656 -136340 -648 -134432 98471 -17103 69267 99033 -98317
19207 56029 193693 146489 74970 -303484 -33399 19931 147331 -316094 -5653 -83728 -116324
19196 -116324 -349197 54579 -506102 177995 -161366 -306252 -43878 40392 -239154 154156
19185A89101g0823D9133P5574E2130a32056o7910b5336l79459M9869G487J54756
19174A62243b0351j66006E7581g1323p7024f862A68374J44032e7124j64203O4815
19163a56512A91393b49923B13819a80916b2456B9223a31060A13181c28796e1634
19152A01202c5033J5647D9854a08796k01957f7026E8952M308Q6561b0198G6408
19140b97597J41370D01783g9319j37218e4359A86666b21240A70372h8731A96942
19129F6844j9534g2379C8336R6020a05333J0685M5969j12762j78628o2646F045
19117F2569f2854k80667a58355K7714A66896a7245C12327a33072B80548g0812
19106b24110j23624A16551a03467A21787c36088J51468G5235f9815j15391j5578
$$ plain form
19185 189101 -70823 49133 124707 52130 -132056 -199966 -25336 -404795 -354926 7487 162243
19174 162243 -20351 -186357 57581 -71323 -148347 -6862 168374 312406 -57124 -221327 -156512
19163 -156512 191393 -249923 213819 -180916 -22456 29223 -131060 113181 -328796 -51634
19152 101202 -35033 -19386 49854 -108796 -310753 -67026 58952 63260 149821 -20198 76408
19140 -297597 -156227 401783 -79319 -216537 -54359 186666 -221240 170372 -88731 196942
19129 66844 47310 -72379 38336 134356 -105333 -94648 -48679 -161441 -340069 -402715 6045
19117 62569 -62854 -343521 -158355 -130641 166896 -17245 312327 -133072 280548 -70812
19106 -224110 -347734 116551 -103467 121787 -336088 -184620 75235 -69815 -185206 -200784
19096b00784j91919a5589o4516r1708a9739E0016K66598j11029b09644B8984J63307
19085A92291J12687e3776j3854J0455A718P5683g7985j28532P4745I1276k4851
19074F6425c50977a32987F8328O3478a35535N8875A08a62810k07540J26370A1356
19062c30588A55812F5878B4840b59684M1496A57950J39760a02171F7016q472O2058
19051A20602j6594a04023K4971C08336a5493N142m40299J85080b1923j02637q6758
19040b11318l36245K44295a7944E9538c00289H1663J11469f5355k31363B29474
19029b930o3092A02597K9256F4098L09828C7823a21492c4372C5487a69290A76931
19017H3695D876e019A40442a61497o3167O4889j56842g8873l2224C43396E8987
$$ plain form
19096 -200784 -392703 -15589 -80105 -171813 -19739 50016 316614 205585 -209644 28984 192291
19085 192291 304978 -53776 -67630 -57175 1718 77401 -77985 -206517 -131772 91276 66425
19074 66425 -350977 -132987 68328 131806 -135535 -76660 108 -162810 -370350 -243980 11356
19062 -330588 155812 65878 24840 -259684 -218188 157950 297710 -102171 67016 58544 120602
19051 120602 104008 -104023 -79052 308336 -15493 -10351 -450650 -265570 -21923 -124560 -211318
19040 -211318 -547563 -303268 -17944 59538 -300289 81663 193132 -65355 -296718 229474
19029 -2930 -66022 102597 131853 64098 373926 37823 -121492 -34372 35487 -169290 176931
19017 83695 4876 -5019 140442 -161497 -224664 -159775 -316617 -78873 -111097 343396 58987
19005a78904B35435c13120A88770J76715h7436A44658b19068I8114m5999A4468
18994F1674Q2838b39315a06082F817i5k5894l48352d2432I785c6473a0953k42455
18982b53408j198D0186j2700a73899A78457e53811b02939j945N3215J3209f0465
18970i5679A44358e9372k78245h1485o8011D0207J97415F8111n251a3277r5550
18959a08827C2341M3863a97081N3284L229C3241a68838f0512E6526a98044f0137
18947a87315n5848H443J86179d043k41199a5495l38A80770m7608a00667H9176
18935a26652j6722B1071M9157a97478b9921k09105J08914A66356m4178h5189J1109
18924g4080A13980J25938E1915A6038J25718b24571N8425M4700k86343J88599
$$ plain form
19005 -178904 235435 -313120 188770 365485 -87436 144658 -219068 98114 52115 14468
18994 61674 144512 -239315 -106082 6817 -95 -25989 -374341 -42432 9785 -36473 -10953 -253408
18982 -253408 -254606 40186 27486 -173899 178457 -553811 -202939 -204884 -151669 -138460 -60465
18970 -95679 144358 -59372 -337617 -81485 -149496 40207 237622 68111 62860 -13277 -108827
18959 -108827 32341 76204 -197081 -143797 -140568 33241 -168838 -60512 56526 -198044 -60137
18947 -187315 -243163 8443 194622 -4043 -245242 -15495 -15833 180770 133162 -100667 89176
18935 -126652 -143374 21071 70228 -197478 -29921 -239026 -130112 166356 122178 -85189 -74080
18924 -74080 113980 239918 51915 16038 141756 -224571 -166146 -121446 -407789 -219190
18914b19190A20050a63707J4060C2857J70928e2579k17631A26330e9175n8478
18904a17653E5384a72290J1873I6271g4270A35905d0155B78202b80257k39711
18894e19968a70925r7453C0586K6294a25578K2768c3423B9640J38173c30498d7242
18882f7846F1387e7338A66900a89489m3167E05814A69853a91990B3754a58076
18871a27222j8368J7504M3756j34313h3427o4491J7850B09198b30851A04479k4062
18860H0417c36174a20294E5306J27967H0550h0959p1603C3429b15964c8781J9322
18849a9459B377a27564m736A73291a47445M0901j8512m7982L3642l0608h3513
18837A33646b51438A38497c8005r9211j9353L7061J0874A25947Q8309j01484h1788
$$ plain form
18914 -219190 120050 -163707 -149647 32857 203785 -52579 -270210 126330 -59175 -117653
18904 -117653 55384 -172290 -160417 96271 -74270 135905 -40155 278202 -280257 -519968
18894 -519968 -170925 -268378 30586 56880 -125578 -102810 -33423 29640 167813 -330498 -47242
18882 -67846 61387 -57338 166900 -189489 -232656 505814 169853 -191990 23754 -158076
18871 -127222 -145590 -128086 -84330 -218643 -83427 -147918 -130068 209198 -230851 104479 80417
18860 80417 -336174 -120294 55306 183273 80550 -80959 -152562 33429 -215964 -38781 -19459
18849 -19459 2377 -127564 -132300 173291 -147445 -106544 -125056 -173038 -139396 -170004 -83513
18837 133646 -251438 138497 -38005 -137216 -156569 -119508 -108634 125947 214256 112772 -81788
18825a23275m29285a66960I8056R334M3904C715L90173A46322c8275A27942a60034
18813F9949a83753f9386B56005c80868D2186G788M01345a18572k29657a34380
18802a2943D2829b53210j06312g4754A17266C0315b90852a00280k38164I8649
18791a84504A25673a47629j57348N5397R5656b7038j02784B45043b13832m1842
18781b55674A54589C1501a59539C1839b54518A01650b52269G7898b36718a282
18770B37939B2996J28571N5326G3100b00641j563b0719A15002a30622A76283g0049
18758E3209b11994a6310C07081h6586J620j4507k25884O1490G5136J08126a1678
18746h1634m03549B49087C4777l187J88239a48668L3292K6518p1029m1402i1444
$$ plain form
18825 -123275 -552560 -166960 98056 107390 151294 3715 393888 146322 -38275 127942 -160034
18813 69949 -183753 -69386 256005 -380868 42186 7788 409133 -118572 -348229 -134380
18802 -12943 42829 -253210 -359522 -74754 117266 30315 -290852 -100280 -338444 98649
18791 -184504 125673 -147629 -304977 -249580 -153924 -27038 -129822 245043 -213832 -255674
18781 -255674 154589 31501 -159539 31839 -254518 101650 -252269 77898 -236718 -1282
18770 237939 22996 151567 206893 73100 -200641 -202204 -20719 115002 -130622 176283 -70049
18758 53209 -211994 -16310 307081 -86586 -84966 -99473 -325357 -263867 75136 183262 -11678
18746 -81634 -485183 249087 34777 31590 219829 -148668 -115376 -88858 -159887 -201289 -91444
18734b4968B15004g495j74124Q9551k78i337j30995d5673J868l9000q0590j1561
18722a74956r3032R3896n7970I4081A835a16551J5589A2565i3557I7548l7502
18711F0046f8173h720j32598A38085k775E9967a4270j05584A11995A0215L8353
18700D8568f9523b0887A78604a76394D0116b66261p1907H5243g6022k3003M5889
18689e3136o8473d3796i100r6891b7951A52590P3256G6898J90674A14973b43950
18677i7733k9840O871j59868a37648R331A83894m4676J23201b9389F5327b15208
18665a75794b0156A1851b81676F1492C214a96170B9345a43620N4395A84688o1841
18654A22847a17554A93964j7600k1021f7311F25b28961I367J45759A0063M5123
$$ plain form
18734 -24968 215004 -7495 -181619 -92068 -92346 -9337 -140332 -45673 -43805 -82805 -163395 -174956
18722 -174956 -267988 -174092 -232062 94081 1835 -116551 -100962 12565 -93557 97548 60046
18711 60046 -68173 -8720 -141318 138085 135310 59967 -14270 -119854 111995 10215 48568
18700 48568 -69523 -20887 178604 -176394 40116 -266261 -338168 85243 -76022 -99025 -53136
18689 -53136 -121609 -43796 -9100 -105991 -27951 152590 225846 76898 267572 114973 -243950
18677 -97733 -127573 -120702 -280570 -137648 -128317 183894 139218 262419 -29389 65327 -215208
18665 -175794 -20156 11851 -281676 61492 3214 -196170 29345 -143620 -89225 184688 122847
18654 122847 -117554 193964 176364 155343 -67311 625 -228961 9367 155126 10063 55186
18643E5186a88277D6395J4387B6068b24274D63724b2991A50961N7415B1516a7139
18631h7775b4976n8048J6900A06662j1499a88757L9411B16208b53650J9606A45599
18619A85792p9347c3902A16901r475c17110i5628L1168i517l10019G6972a58170
18607e1112m40A44791b89492P5837B25797c06607a31199j513j35669A00985h2620
18595G119b7645l3623C84142b95535Q2470f100j96419q1047J13236A04101c78464
18583A88680a825o7176j61200D5520K5871d5463B20002a75370P6726j9658N145
18572a13157k67501J43431d7621m59943e4120j52393d5860B9685J15046b4041
18561a53876H8183g5400A88214a32327l4462A20738a84161c3465E2122b95611
$$ plain form
18643 55186 -188277 46395 60782 26068 -224274 463724 -22991 150961 208376 21516 -17139
18631 -87775 -24976 -83024 -66124 106662 95163 -188757 -149346 216208 -253650 -234044 145599
18619 185792 106445 -33902 116901 107426 -317110 -95628 -64460 -9517 -319536 76972 -158170
18607 -51112 -51552 144791 -289492 -213655 225797 -306607 -131199 -132712 -268381 100985 -82620
18595 7119 -27645 -61268 384142 -295535 -213065 -6100 -202519 -283566 -170330 104101 -378464
18583 188680 -1825 -69001 -230201 45520 71391 -45463 220002 -175370 -98644 -118302 -113157
18572 -113157 -380658 -237227 -47621 -507564 -54120 -206513 -45860 29685 144731 -24041
18561 -153876 88183 -75400 188214 -132327 -166789 120738 -184161 -33465 52122 -295611
18550f0428C463d48663g5751k12773A45791b72063i2853A63684h5309l2651A95992
18538e2215H8391G196N8506a44518D7442L7596K95c42753J41374g3762H776J23992
18526A32768E6383j6630e952G1728J77142a74529B7359a63953B75087d6117B9192
18514A33543m7846P9848B538j216b50792h9320p1169p9384i9338a6053n2583A47366
18501A37855d1517Q983A52623A9990L2340b38377J03309C3796f318k37932B19513
18489a99291k02318B01047a11139A41648b0335I2472g4337p0067B05941h1509
18478A52316a25927D0822c12791B66849d51235C2979a27399r2303I5707l1637
18468F4070e4606k25564H457f5797k82256A17770J55852a70249D5296a9062n0471
$$ plain form
18550 -60428 3463 -448663 -75751 -288524 145791 -272063 -92853 163684 -85309 -117960 195992
18538 -52215 88391 7196 65702 -144518 47442 85038 85333 -342753 -201379 -73762 8776 132768
18526 132768 56383 39753 -5952 71728 248870 -174529 27359 -163953 275087 -46117 29192
18514 133543 85697 165545 2538 1322 -250792 -89320 -160489 -239873 -99338 -16053 -68636 147366
18501 137855 -41517 -32534 152623 19990 52330 -238377 -135068 33796 -6318 -244250 219513
18489 -199291 -401609 201047 -111139 141648 -20335 92472 -74337 -144404 205941 -81509
18478 152316 -125927 40822 -312791 266849 -451235 32979 -127399 -219702 95707 64070
18468 64070 -54606 -280170 8457 -65797 -348053 117770 273622 -170249 45296 -19062 -69533
18457f9533k47595H776e4737o810I706g5693l05331J73297I6032f8600D0073a57539
18444E7476J46028A8855L9186a85184D4921J1111O5363m3588a47014j3699k1443
18433a82156I2070a81416A95541J19041F659d6265B50157e8849A12884b80954
18422c06752d5730I6348J60334A23459E2421Q6798C4737c0726f740j31514J1543
18411a26711A5064K0864O5626J06688M2518I4063B065b91258B902L90916A88009
18399d5466j46259i871A59805c87237a86439N1469C52030F465a75374E5033b31328
18387A07993c10310M8674d2261j1033j40689C07396a08885D8266a39563A04381
18376e9275J7630B5911b0856F7395c3546A82435j5027E999P4105b23453a01181
$$ plain form
18457 -69533 -317128 8776 -54737 -61547 9706 -75693 -381024 -207727 96032 -68600 40073 -157539
18444 57476 203504 18855 58041 -185184 44921 56032 121395 77807 -147014 -160713 -182156
18433 -182156 92070 -181416 195541 314582 6659 -46265 250157 -58849 112884 -280954
18422 -306752 -45730 96348 256682 123459 52421 139219 34737 -30726 -6740 -138254 -126711
18411 -126711 15064 35928 101554 208242 250760 94063 2065 -291258 2902 393818 188009
18399 -45466 -191725 -9871 159805 -387237 -186439 -134970 352030 6465 -175374 55033 -231328
18387 107993 -310310 -261636 -42261 -53294 -193983 307396 -108885 48266 -139563 104381
18376 -59275 -41645 25911 -20856 67395 -33546 182435 167408 5999 80104 -223453 -101181
18364h3039A54829K5002a9639j90038I1425m443P1747a9629l8374e094l8402l7640
18352h1136C05974j13045a57035g0564A12687C4634O579a5554k5922E0498a68243
18340a2957j26447M6695r3355N1561C2489e9126j41807P4153D5317J61163E4378
18328a58944j35531h0273B5613a16819k84898a18621j49201a12721A62028J6163
18318A78191M1807G1906e5839k67595a61114A26261g2625I397b50072L5957e8132
18306B9729J16952o6586K193a39021j02517A55666c35910O7623H754a48802r5072
18295b43874A87381h4757j74113j16136g5765j97369M8549m2532b8962L243j38653
18284a64372B11761I3547a32363B5349b3051F1722M2319b0472A20239C6987d04173
$$ plain form
18364 -83039 154829 179831 -19639 -209677 91425 86982 158729 -19629 -58003 -5094 -43496 -81136
18352 -81136 305974 192929 -157035 -70564 112687 34634 41213 -15554 -41476 50498 -168243
18340 -12957 -139404 -92709 -186064 -134503 32489 -59126 -200933 -126780 45317 206480 54378
18328 -158944 -294475 -80273 25613 -116819 -401717 -118621 -267822 -112721 162028 178191
18318 178191 219998 71906 -55839 -323434 -161114 126261 -72625 9397 -250072 -214115 -58132
18306 29729 146681 80095 82288 -139021 -241538 155666 -335910 -268287 8754 -148802 -243874
18295 -243874 187381 -84757 -258870 -375006 -75765 -273134 -224585 -267117 -28962 -25719 -164372
18284 -164372 211761 93547 -132363 25349 -23051 61722 104041 -20472 120239 36987 -404173
18272A3744b70677C40239a38043o9507P6470j39439D0660d18356a03155j57011
18262b60166C8100g2298n3832B18489B5763a61570D7742c4537G7292A7513b25914
18250b6012k40660A29975N162C4954a43518l627N1918G5402a66064P8134j58501
18239b46431g0283A10608f0045B63225j7301b8844B24879b72594h9480j9993k28221
18228c37694B83503a9361k37669A00596b5686B7134b02821A31156K31188a43360
18217a11922n9730B34357a2737k1982H7064b6911j7513C4005K57678a44258E1149
18205F5405a19430A29568a98453P7991j69276e1862A4968c35435m4984F4815J72791
18194B37606c33441a56263B31288M6257e3485A39226b04306b6214p3611J1774
$$ plain form
18272 13744 -270677 340239 -138043 -207550 -131080 -270519 40660 -418356 -103155 -260166
18262 -260166 38100 -72298 -126130 218489 25763 -161570 47742 -34537 77292 17513 -225914
18250 -26012 -266672 129975 135137 34954 -143518 -147145 -95227 75402 -166064 -87930 -246431
18239 -246431 -70283 110608 -60045 263225 245924 -28844 224879 -272594 -89480 -109473 -337694
18228 -337694 283503 -19361 -257030 100596 -25686 27134 -202821 131156 362344 -143360
18217 -111922 -171652 234357 -12737 -34719 87064 -26911 -44424 34005 291683 -144258 51149
18205 65405 -119430 129568 -198453 -120462 -289738 -51862 14968 -335435 -380419 64815 237606
18194 237606 -333441 -156263 231288 277545 -53485 139226 -204306 -26214 -99825 -88051
18184h8051J0765A9368a60023q5887r549E0923A5420L1725a57204E5306A2603
18172F0289i2776M1910j01593A42537i5127A66052F9171a36580b1221J0504o4359
18161g5076j85979B8462b76167a32073M0763B73288a56719A49621a29509l26224
18151d55733a55814A25003J59282b22204J01281C49506j14573h0774j08478n5559
18141b44811A6509g3464E7586b82940J28632f295j00958C5671c55230p5496F0169
18129a21692p8681C14055A15760k2924L3441d4945F2324a43621j5988a1694A49858
18117I5558L26235a17492A0629J03420a79229R581g3922j34455A8826b10176d0820
18105A98437J27517a32700c5225B66878q4801h8432P962j44648q3078B932b35500
$$ plain form
18184 -88051 -77286 19368 -160023 -245910 -255459 50923 15420 47145 -157204 55306 12603
18172 60289 -92776 -50866 -152459 142537 -95127 166052 69171 -136580 -21221 -10717 -75076
18161 -75076 -261055 28462 -276167 -132073 -91310 273288 -156719 149621 -129509 -455733
18151 -455733 -155814 125003 284285 -222204 -120923 349506 234933 -80774 -189252 -244811
18141 -244811 16509 -73464 57586 -282940 -154308 -6295 -107253 35671 -355230 -430726 60169
18129 -121692 -200373 314055 115760 92836 126277 -44945 62324 -143621 -159609 -11694 149858
18117 95558 421793 -117492 10629 114049 -179229 -169648 -73922 -208377 18826 -210176 -40820
18105 198437 325954 -132700 -35225 266878 182077 -88432 -80470 -225118 -308196 2932 -235500
18093f2502j89336k41176D7543K9849b30190j88440H8578a73106B28180P183j13851
18082A21512e686k7369q8456E4941e63854C48017e4410C22073D7075a0446B67062
18070A62207m6386m2384K5167i2700m3365e4209k40172J08580A36225C8144a52884
18058b19777A40286a1672A46935K0243d9927l9981c6866F6281A7275a74388I6604
18046a89124g9846A67989K22423a15736j77117i3458B69427c6011F2968a45715
18035a90629g8349n3824j46257N4875B05542d5336o6053j3860E5318K35489D1376
18023C5338g1045D8939P7760a61359E6472a80296j7909R7837G6115a15105A59082
18011a74087K5805A6851e6373L805k2917B23408a54432k15485h5492G0610K44602
$$ plain form
18093 -62502 -251838 -493014 47543 77392 -230190 -418630 88578 -173106 228180 235363 121512
18082 121512 -5686 -33055 -121511 54941 -563854 348017 -54410 322073 47075 -10446 267062
18070 162207 115821 73437 98604 -92700 -136065 -54209 -294381 -185801 136225 38144 -152884
18058 -219777 140286 -11672 146935 167178 -49927 -89908 -36866 66281 17275 -174388 96604
18046 -189124 -79846 167989 390412 -115736 -292853 -93458 269427 -36011 62968 -145715
18035 -190629 -78349 -132173 -278430 -223555 205542 -45336 -111389 -125249 55318 290807 41376
18023 35338 -71045 48939 126699 -161359 56472 -180296 -198205 -100368 76115 -115105 159082
18011 -174087 -148282 16851 -56373 -52568 -75485 223408 -154432 -369917 -85492 70610 315212
18000C15212a56722b0937n6886F1410g5474m33117a4891j12246D2698J4989K9055
17989H6742b35638Q5708a1245k04904Q0676c8123k92965B0805e376j81095Q3936
17978a02535k50055A19673E4341K22412r0229a11732A44621b16528r8239G269
17967c4381G0057a06135F5050k6297L2956a3625j35799H0531J62800F6188i460
17955G913J2436a70609O8751A51458a31657B05382H887h4526Q979j41781i5025
17943b08443A24203b34581A79173G4572M6384c56780A12478k9865a46967P0887
17933g6080p128J3813B5566a28548p5932j8194H9287a38838O6261B31932C3655
17921b63115g8525A38618l7621b29293a4388B94146E982a42981A357J7534L0739
$$ plain form
18000 315212 -156722 -20937 -77823 61410 -75474 -508591 -14891 -127137 42698 57687 86742
17989 86742 -235638 -149930 -11245 -216149 -135473 -38123 -331088 20805 -5376 -186471 -102535
17978 -102535 -352590 119673 54341 276753 186524 -111732 144621 -216528 -314767 7269
17967 -34381 70057 -106135 65050 38753 71709 -13625 -149424 80531 243331 66188 -9460
17955 7913 20349 -170609 -101858 151458 -131657 205382 8887 -84526 -75547 -217328 -95025
17943 -208443 124203 -234581 179173 74572 120956 -356780 112478 82613 -146967 -76080
17933 -76080 -83208 -69395 25566 -128548 -204480 -222674 89287 -138838 -72577 231932 33655
17921 -263115 -78525 138618 100997 -229293 -14388 294146 5982 -142981 1357 18891 49630
17910D9630j3636R1197o0942c12171J39878F1962P6245A2627b64486e7354G1444
17898B75268b09213G5826a77418d66C9846d74203A33762a20397B90488b05478
17887a23472A71166O8278h3517N749C8874d5562A31728c8133j22096C17094P8629
17876C95723A65773a37539j4402A49873a02720M9922C319a67111k9682R084n3017
17865b40726b3691q2620B44160a9813k46728a12835E6535D135g5697A650b42455
17853b6184B6499a86590I54a4567j18015A19176h9094j83020h4268D5959J4313
17842F0272a12445j44239a10102F5055N7570K02835a87517Q5505D6559f5899C00800
17830a30299N4168B1416P8920i054o1560B38151I8077K90291e7542C9985K0351
$$ plain form
17910 49630 35994 127191 66249 -312171 -172293 61962 138207 12627 -264486 -57354 71444
17898 275268 -209213 75826 -177418 -466 39846 -474203 133762 -120397 290488 -205478
17887 -123472 171166 239444 -83517 -77768 38874 -45562 131728 -38133 -160229 317094 395723
17876 395723 165773 -137539 -151941 149873 -102720 -52798 3319 -167111 -196793 -187709 -240726
17865 -240726 -23691 -106311 244160 -19813 -266541 -112835 56535 4135 -75697 1650 -242455
17853 -26184 26499 -186590 954 -14567 -132582 119176 -89094 -272114 -84268 45959 60272
17842 60272 -112445 -256684 -110102 65055 122625 325460 -187517 -102012 46559 -65899 300800
17830 -130299 -76131 21416 100336 -9054 -70614 238151 98077 388368 -57542 39985 60336
17819F0336J9394b63661b4711r9390C57204B0311J38109B2699a61576I499f8114
17807a24764B09315a84347B1804f0011A4935K66634j05968m6243a20039E8263
17796A86674e0242o6875C9142L67513A98020B5136a24018l9387H2586b58628c573
17784a41668A24168a80544B40013F0343a47301H4024L34225b10476l1207R3720
17774a47963D0535J48402I830L46926d9052r5982B6273a15902E4859J87791K9989
17763B72639a19316k2831B7936H26d1569H815N4483a62850p9657f4496j08644
17752a73140e3773b0505A50238d67463A92848E4750b35449A75331h9887d0247
17741G394a68761A30109N640D0505a07262B05332g185j03028c1903A94071g8139
$$ plain form
17819 60336 79730 -263661 -24711 -124101 357204 20311 158420 22699 -161576 9499 -68114
17807 -124764 209315 -184347 21804 -60011 14935 281569 175601 129358 -120039 58263
17796 186674 -50242 -117117 39142 406655 198020 25136 -124018 -163405 82586 -258628 -3573
17784 -141668 124168 -180544 240013 60343 -147301 84024 418249 -210476 -241683 -147963
17774 -147963 40535 188937 9830 356756 -49052 -145034 26273 -115902 54859 242650 272639
17763 272639 -119316 -142147 27936 826 -41569 8815 63298 -162850 -242507 -64496 -173140
17752 -173140 -53773 -20505 150238 -467463 192848 54750 -235449 175331 -89887 -40247
17741 7394 -168761 130109 135749 40505 -107262 205332 -7185 -110213 -31903 194071 -78139
17729F7499J82580o548m9127q0274n0199a13649l11486a61573B6070E652J37974
17718A43626g2473A62399b7526F1407b90517G3594a02956M2722H0666i3091A368
17706e067l8692B53878j17103K36198A02298a71566H6964K49060A6047b06841
17695a32857C32938a85772A06684h1725F17b61999g0223L152k908D77346a97723
17683g7472j1005A57385b06319i7096a8022j21276A6241c8992C8003R0713a03214
17671a30248p9139i3568k4323A47891K897b5832A74957C8091K01946a19661j03486
17660b23147p3095F5046K72020q3346C7529a29627C5181b74545G2706R2216a70288
17648b97801c6765n6754l18556J19810C65968c7400A6206J81084H3976k9312K4951
$$ plain form
17729 67499 250079 243531 194404 114130 63931 -113649 -425135 -161573 26070 5652 143626
17718 143626 -72473 162399 -27526 61407 -290517 73594 -102956 -60234 80666 -93091 1368
17706 -5067 -43759 253878 136775 372973 102298 -171566 86964 336024 16047 -206841
17695 -132857 332938 -185772 106684 -81725 617 -261999 -70223 -67071 -69979 477346 -197723
17683 -77472 -88477 157385 -206319 -97096 -18022 -139298 16241 -38992 38003 128716 -103214
17671 -130248 -209387 -93568 -117891 147891 150788 -25832 174957 38091 240037 -119661 -223147
17660 -223147 -296242 65046 337066 253720 37529 -129627 35181 -274545 72706 164922 -170288
17648 -297801 -36765 -93519 -412075 -292265 365968 -37400 16206 197290 83976 54664 79615
17637G9615J4006Q9566c38222J06425D4034e3198E5081J85378c9342o4203B63804
17625c4770j62511m8563B10923b10691Q8972E1845K62331F3737O3590a56423A66278
17613A28640C4137E091c3897m5298B47222p6635i9953f472n513k8453C5903J43738
17601A79641a12502B0680P8694A4095b45731J11160f6330A42049A4071O363J61821
17590A82255R5368G5449K55420A42601a91126A3161O9176J49341j10501b03382
17579A16303n6125J04699K77822C6477c09768K8785a33859H0108N393a57838j18977
17568b76815E0771n689J16940Q29J12931e4526A52291d5321j7250C478J94694
17557A98172A118a8065j03654n2190Q3876H8525L4525N3525b11572G4095g8285
$$ plain form
17637 79615 93621 183187 -338222 -231797 44034 -53198 55081 240459 -39342 -103545 263804
17625 -34770 -197281 -245844 210923 -210691 -121719 51845 314176 63737 127327 -156423 166278
17613 128640 34137 5091 -33897 -79195 247222 170587 -99953 -6472 -11985 -40438 35903 179641
17601 179641 -112502 20680 99374 14095 -245731 -134571 -66330 142049 14071 20434 182255
17590 182255 277623 75449 330869 142601 -191126 13161 82337 231678 121177 -203382
17579 116303 60178 164877 442699 36477 -309768 -280983 -133859 80108 85501 -157838 -276815
17568 -276815 50771 45082 162022 162851 275782 -54526 152291 -45321 -62571 3478 198172
17557 198172 1118 -18065 -121719 -173909 -90033 88525 123050 176575 -211572 74095 -78285
17545A01569K00010c65712D056J45748F6706M9269J7732Q6170a91710I924J26266
17534A36190b78955F18O2862e5843A56462a51625f0867G2757h5127B58401A05589
17522A87559l5474M7828c6738A65460N900N1408C4917J56322J85073m5871c11258
17510A39616n3347b47798M043E1980K29826i2225c0832A96787b23277A38264Q4597
17499B22861a21535M2815j93518A52389i281A8407J19533E5422J68987B3733d02766
17487e7233A24408d8251j34485j40349C95581d5041F765J87609J19376Q8458A20060
17475B13897G2232h9678D46645a2827C28631A11760J43197n6725J08208a93678
17464I2532a00242C787c6741A82242h7621B1333K07163K47058A62234k9988J25563
$$ plain form
17545 101569 301579 -365712 4056 149804 66706 115975 133707 219877 -191710 9924 136190
17534 136190 -278955 618 63480 -55843 156462 -151625 -60867 72757 -85127 258401 105589
17522 187559 152085 199913 -36738 165460 171360 222768 34917 191239 376312 330441 -311258
17510 139616 86269 -247798 -243755 51980 281806 -92225 -30832 196787 -223277 138264 222861
17499 222861 -121535 -78720 -272238 152389 -9281 18407 137940 55422 224409 23733 -402766
17487 -57233 124408 -48251 -182736 -323085 395581 -45041 6765 194374 313750 402208 120060
17475 213897 72232 -89678 446645 -12827 328631 111760 254957 198232 306440 -193678
17464 92532 -100242 3787 -36741 182242 -87621 21333 228496 475554 162234 132246 257809
17453B57809j03498L93759j84547o1014Q0728j80374L9881J82006A03520J88185
17443B91705a3095C6006Q7760J47445n2246J00495K18090A9699K97395A02760
17432B31783A12594N7104J29476F7166K68557J5424j11992J48J08373L3596n7066
17421C24206b1946B31476r3349M9804R5961I1392K69781l1456D7065N9333b5107
17409B45749Q3882C0860g2504E56762A7046e4814A11365g4874A4240L3394J76241
17398B23875K71234I3834J03894f1037J9865I4218L55226C7157J03596M9242D724
17386D17601J6909A58883R154A8193M001K17855j08924n5044j2030A799a1150
17374B59282L3307A10469L62987A17298e6411C57707j51095d1357r2251A77321
$$ plain form
17453 257809 154311 548070 363523 302509 383237 202863 242744 424750 103520 291705
17443 291705 -13095 36006 123766 271211 218965 319460 537550 19699 317094 102760
17432 231783 112594 169698 299174 67166 335723 351147 239155 239303 347676 381272 324206
17421 324206 -21946 231476 138127 187931 283892 91392 361173 329717 47065 106398 -25107
17409 245749 329631 30860 -72504 556762 17046 -54814 111365 -74874 14240 47634 223875
17398 223875 495109 93834 197728 -61037 -41172 94218 449444 37157 140753 189995 4724
17386 417601 434510 158883 168037 18193 22194 240049 131125 76081 64051 1799 -11150
17374 259282 292589 110469 473456 117298 -56411 357707 206612 -41357 -133608 177321
17363f1708B12075H4241N5095K21397A35433f5572B52565q6281J48300j28554
17353A86030J27722G5211J11372J18911b03354A49953K37409n7264q3675J54937
17343D01360m6326J5178A63877J50888n2220A04066D926J5955g2672B16677a17917
17331C44591j32248R3514F8194b37493d101k0745C56677a363B42479A18544h3416
17319A09719a05296B23179J2283m1029p1358K07005j55581G0250O0189J72962
17309C03401A37922l8829M84002F9805M7152M2782a0209B10457A9044J38750F693
17297C00620A141K5537J99676p4279d6776B51891j06856J3223J62773j29103a8994
17285B60251J64528e9459C2346N38651k40569j5911j43457J09937h4147D31946
$$ plain form
17363 -61708 212075 84241 139336 360733 135433 -65572 252565 166284 314584 186030
17353 186030 313752 75211 186583 305494 -203354 149953 387362 330098 246423 401360
17343 401360 355034 370212 163877 314765 262545 104066 4926 20881 -72672 216677 -117917
17331 344591 212343 305857 68194 -237493 -4101 -24846 356677 -1363 242479 118544 -83416
17319 109719 -105296 223179 235462 194433 123075 330080 174499 70250 130439 303401
17309 303401 137922 99093 583095 69805 116957 159739 -10209 210457 19044 157794 6693
17297 300620 1141 26678 226354 152075 -46776 251891 145035 158258 321031 191928 -18994
17285 260251 424779 -59459 32346 570997 330428 314517 171060 280997 -84147 431946
17274A09758N2909k9237b22858B89577f2783B20494n3479B7083K18013j05733
17264A39363C2204P0213J08135J7187L712j9738j8060J44908e3319A86448b88954
17252B85621H1020j0250J53629d8373A15322L35054B2916J6314N2836j0392A9040
17240B62213J5531n6937O7597J3159j22534L31720A41417a60219A58848b7415
17229C82058j58427k0836P0172F8519J09690J43570E7919K96178A67248a32146
17218B25718J55563a76405B36812F8543J46058n3428O7879J48980h7676C44251
17207b15150H2114R5609J94225A38013J88705Q7508h0312A7475J39634o2430L72964
17196D67643j79415J55579g9801C76138J2332p2088j33871N0736D2690L11641
$$ plain form
17274 109758 162667 133430 -222858 289577 -62783 220494 167015 27083 245096 139363
17264 139363 32204 102417 210552 227739 231451 211713 193653 338561 -53319 186448 -288954
17252 285621 81020 70770 224399 -48373 115322 450376 22916 39230 92066 81674 19040
17240 262213 277744 220807 288404 301563 179029 510749 141417 -160219 158848 -27415
17229 382058 223631 202795 272967 68519 178209 321779 57919 354097 167248 -132146
17218 225718 381281 -176405 236812 68543 214601 161173 229052 378032 -87676 344251
17207 -215150 82114 177723 371948 138013 326718 414226 -80312 17475 157109 94679 467643
17196 467643 288228 443807 -79801 376138 388470 316382 182511 233247 42690 354331
17186C54331J34876j69206L2934K430L31749A40868J97249N4334F5107L77189
17176D42296C2130K24485l7081F4354O6515J34154K90273A12621Q1854N1311j09980
17165A35806J03691K3465b6724A07720J87131G3958K93177A7809K44197J12653
17155C74659m425Q1997m8908q0061A01728L49858j0649B09707m5919k550K10692
17144C71930A72850L00334A70644n6281K40877J32851A97601A7133J93308N4578
17134B65019J2960J2566K26159q9997n7158J1895J79805k12404A66010J13086
17124B79096M9469l0992O4820j28624J1878j9371K76385o7511a57851B58385K09040
17113D67425m2617N0507j25338O6123c4396F44170B92931K76621B28767J75485
$$ plain form
17186 354331 489207 320001 352935 355365 687114 140868 338117 392451 65107 442296
17176 442296 32130 256615 219534 64354 130869 265023 555296 112621 194475 245786 135806
17165 135806 239497 262962 -26724 107720 294851 73958 367135 17809 262006 374659
17155 374659 370234 452231 403323 323262 101728 451586 440937 209707 163788 161238 371930
17144 371930 172850 473184 170644 114363 355240 488091 197601 17133 210441 265019
17134 265019 277979 290545 516704 426707 369549 381444 561249 348845 166010 279096
17124 279096 328565 297573 362393 233769 245647 226276 502661 435150 -157851 258385 467425
17113 467425 424808 475315 349977 416100 -34396 644170 292931 569552 228767 404252
17103D04252K9350B05883K16703A40359J89300j34542J28847L07331J66629B41122
17092B74485K77868B48944l2089N01595B15528K68658L0695K409l3345r9088r5335
17081B89522k7787Q8006K1634Q4801j39941M21767C20912r9421M9604L39103k07405
17070D02793O7010C1446L02528K52008K39819k82326j2050k03600K81189q6283
17060E22731j94155J61811k7682K38843C28706M21504l72875m2068M49376C64522
17049E80721J19416l03389j05789L02496r4204r1781n4654K4553K76379p3749
17039E79999k60006L10975l7910K11885j56573P4441j86061j08337K19841Q9324
17029G37578j14470j43011N586p7814K12825J08746j55427o3215M8991j53361
$$ plain form
17103 404252 433602 205883 422586 140359 329659 195117 323964 631295 797924 241122
17092 274485 552353 248944 216855 718450 215528 484186 514881 517290 483945 384857 289522
17081 289522 261735 349741 371375 456176 316235 738002 320912 221491 271095 610198 402793
17070 402793 469803 31446 333974 585982 825801 543475 531425 327825 609014 522731
17060 522731 328576 490387 462705 701548 328706 750210 377335 335267 784643 364522
17049 580721 700137 396748 290959 593455 499251 407470 352816 377369 653748 579999
17039 579999 319993 630968 593058 804943 648370 722811 536750 428413 648254 737578
17029 737578 623108 480097 485683 407869 620694 729440 574013 510798 559789 406428
17019D06428J74361n3063J84597k26275K27410r7730q3185M51385l66223P2056
17009F89761l1960j05209k14901L70222B95266K07801P4879j05919K49481j29370
16999E92138N6827j33096k3438L78594l62485L05320o5530K57437k26736j73162
16989F05869L83319j03519k38252N1585C06619J43643J83024k88624M71434L63671
16979A179767k62472r4286k49562L39716p2352K69047j45120j9951p4788L34836
16969A204835m04655R028m4718o5397P4075J24497R5101J8946J22681n4300j44102
16958I35991K83629k81809J86455L738k43681R3651J12722k76655N28786k71639
16948A071188j58912Q4053K15770m4334r8314k4869j86426j18751K46633K69893
$$ plain form
17019 406428 580789 527726 712323 486048 713458 615728 532543 983928 617705 689761
17009 689761 657801 552592 337691 707913 295266 503067 577946 472027 721508 592138
16999 592138 648965 515869 492431 871025 508540 813860 748330 1005767 779031 605869
16989 605869 989188 885669 647417 699002 306619 450262 633286 344662 816096 1179767
16979 1179767 917295 823009 573447 913163 840811 1109858 964738 944787 869999 1204835
16969 1204835 800180 809208 764490 699093 773168 897665 992766 1011712 1134393 1080093 935991
16958 935991 1219620 937811 1124266 1128004 884323 977974 1090696 814041 1342827 1071188
16948 1071188 912276 996329 1212099 1167765 1069451 1044582 858156 739405 986038 1255931
16938A255931k09627J11650j60257p9669M42182m81050J59786K64225K93701n00458
16928A096414L10035k84344J33380j72482K65826K35501m09015K92637j4170P2831
16918A526613j63936K18523R4969L9223l81996J44629L40763o7136l15247J73859
16908A610264J65099l90520M37596j88364j93780J85809m3768R934L20384l84264
16898A528390J73990k1254R0674M47104m90524K7818L82184l72183k58103K80551
16888A788647O1729r23K42408l01206K92653m32657L32657M55726m08502L24371
16878B354903k46758K41670p3804K37663N1533l26798L37926j90999j3337P9588
16868B451587L18943m77863J83646M58166j49799k88263N10542l19312K23574
$$ plain form
16938 1255931 1046304 1157954 997697 918028 1360210 879160 1038946 1303171 1596872 1096414
16928 1096414 1406449 1122105 1255485 1083003 1348829 1584330 1175315 1467952 1453782 1526613
16918 1526613 1362677 1581200 1676169 1715392 1333396 1478025 1818788 1751652 1436405 1610264
16908 1610264 1775363 1384843 1822439 1634075 1440295 1626104 1582336 1592270 1912654 1528390
16898 1528390 1702380 1681126 1771800 2218904 1728380 1756198 2138382 1766199 1508096 1788647
16888 1788647 1850376 1849453 2091861 1790655 2083308 1650651 1983308 2439034 2030532 2354903
16878 2354903 2108145 2349815 2276011 2513674 2565207 2238409 2576335 2385336 2371999 2451587
16868 2451587 2770530 2292667 2476313 2934479 2784680 2496417 3006959 2687647 2911221
16859B911221j02118K16574R51m22184J44136L73778q5032J9924L8120j5809K14798
16848C294359J86102J9875o0428K82190k18358K49097L10301k80806K64302k57280
16838C789354O7283K06011m3104J68423j51276j26383N10473j4334L48460r2628
16828D662279k4635K93913k65355L04834O8750J09663J38477n7997o0072N51544
16818E721401q5577k1372K48738O4877K69306K69898M0452j47650O40600m94544
16808F506129N91651j25543L37829j05324L90600N7540J19713P8130J64015M01027
16798H415767p1371J29187L14068L65755L68511M91223j51585K24988N93132n8753
16788A0620922M31162N31068q9371N05584M67022J51533O60677O58841J04416
$$ plain form
16859 2911221 2809103 3025677 3026628 2604444 2748580 3122358 3037326 3057250 3095370 3079561 3294359
16848 3294359 3480461 3500336 3439908 3722098 3503740 3752837 4063138 3782332 4046634 3789354
16838 3789354 3856637 4062648 4019544 4187967 4036691 3910308 4420781 4406447 4754907 4662279
16828 4662279 4637644 4931557 4666202 4971036 5039786 5149449 5287926 5229929 5169857 5721401
16818 5721401 5635824 5614452 5863190 5928067 6197373 6467271 6507723 6360073 7000673 6506129
16808 6506129 7097780 6972237 7310066 7204742 7595342 7652882 7772595 7850725 8014740 8415767
16798 8415767 8344396 8473583 8787651 9153406 9521917 10013140 9861555 10086543 10679675 10620922
16788 10620922 11052084 11583152 11493781 11999365 12466387 12617920 13278597 13937438 14041854
16779A4041854P8948L59236O83336N62728M75069N79973J53880Q58081P82266
16770A8575371Q85682M14188Q57310J105998M61411M47360J102696J061525Q06614
16761B5718155J099790R53965J381027J446631J242102J299126J368298J778432
16753C6287526J344959K241844K039465J837540K050959K377788K408131K496458
16745E3084670L140578L033270L427741L708334L661391L910886M471185M410914
16737H2848969M989667N036889N467440N990374N957025O291597O648877O579245
16729A29810083O633384P106409O481254O609560O140185N466691M671401M077001
16721A76995968K966301K612201N36999n9495j169033k582881l303694m653795
$$ plain form
16779 14041854 14120802 14480038 15163374 15726102 16201171 16781144 16935024 17793105 18575371
16770 18575371 19461053 19875241 20732551 21838549 22299960 22747320 23850016 24911541 25718155
16761 25718155 26817945 27771910 29152937 30599568 31841670 33140796 34509094 36287526
16753 36287526 37632485 39874329 41913794 43751334 45802293 48180081 50588212 53084670
16745 53084670 56225248 59258518 62686259 66394593 70055984 73966870 78438055 82848969
16737 82848969 87838636 92875525 98342965 104333339 110290364 116581961 123230838 129810083
16729 129810083 136443467 143549876 150031130 156640690 162780875 168247566 172918967 176995968
16721 176995968 179962269 182574470 183111469 183051974 181882941 179300060 175996366 171342571
16713A71342571m641245o059271o122445o504309o681976o720709o960872o873266
16705A20778478o395829o519498n831356n613407n404167n407307m948041m274616
16697G6384257m466481m075760l500535l516624l465246k639780l124068k383999
16689D9211764k657281k281655k078273j886407j945276j762157j739425j687699
16681C3173591j377793j147923j845330j048946j217547j056716j109924q29032
16673B3540380q23742q90854q42851p56033o32854r19289m57718q28127r63282
16664A6425630j0145n93609o19931m52098j54740p42865n84942l14067o71487
16655A2281746j03834l49957k88955o13546M7492j89743n35843k36737m36343
$$ plain form
16713 171342571 166701326 160642055 154519610 148015301 141333325 134612616 127651744 120778478
16705 120778478 114382649 107863151 102031795 96418388 91014221 85606914 80658873 76384257
16697 76384257 71917776 67842016 64341481 60824857 57359611 54719831 51595763 49211764
16689 49211764 46554483 44272828 42194555 40308148 38362872 36600715 34861290 33173591
16681 33173591 31795798 30647875 28802545 27753599 26536052 25479336 24369412 23540380
16673 23540380 22716638 21825784 20982933 20226900 19594046 18674757 18217039 17388912 16425630
16664 16425630 16415485 15821876 15201945 14749847 14595107 13852242 13267300 12953233 12281746
16655 12281746 12177912 11827955 11539000 10925454 10972946 10783203 10247360 10010623 9574280
16646I574280j8519k97644m52548m1272p4378o43162m5906l13094q8655k3535
16636G575567k09993j06756k83808m2845R2843n82659o8370j75190j29763o4850
16626F004176n7363j25242J4729m58926R7936m68952n4180K3920j14010J8397
16616D880485m92855M60293k96045q0126q1448J35198l68905Q974k40210M4381
16606C969742j42578N5108J11281m97375R4099q2650o6765P5838k23660k03496
16596C089544O7767k8636j47061L17802j77551n38433M46307k56091J0415J5330
16586B799393p9090l3418L02701l57745J6886k7203k17776K94940m41359j64183
16576B093146J29948K25388l89213K8354K89167j81246M0939o2120m7472L8285
$$ plain form
16646 9574280 9555761 9258117 8805569 8764297 8689919 8046757 8000851 7687757 7599102 7575567
16636 7575567 7365574 7258818 6975010 6932165 7025008 6442349 6373979 6198789 6069026 6004176
16626 6004176 5946813 5821571 5836300 5377374 5475310 5006358 4952178 4976098 4862088 4880485
16616 4880485 4387630 4847923 4551878 4471752 4390304 4525502 4156597 4165571 3925361 3969742
16606 3969742 3827164 3882272 3993553 3496178 3590277 3507627 3440862 3516700 3293040 3089544
16596 3089544 3157311 3128675 2981614 3299416 3121865 2583432 3029739 2773648 2784063 2799393
16586 2799393 2720303 2686885 2989586 2631841 2648727 2621524 2403748 2698688 2257329 2093146
16576 2093146 2223094 2448482 2059269 2087623 2376790 2195544 2236483 2174363 2126891 2165176
16566B165176m4202P9303r7299k16525J69759p0937k74398K36888m67453K35702
16556A716014J48837L09731j73257m83074j18402J00519M12811n06574L51359
16547A757964k38945q0976K89388P833l58523J65843k3188r15j93940K39958R827
16536A574326O542j15451k57619L97517k42628K96032n13893M83453o77383K50806
16526A201702l8015K21744j401l50186J57029Q2723n18451O54516l68350k60166
16516G81145J52333N69716m63071N2941P4679N0642j69588K10730j77502L9837
16506A121862k30071N0571L42238n62338j52269J5722O02321j35645R2784Q2941
16496A228116l72628p4054N560K26945o3597J16504q0330D90578L46028K18329
$$ plain form
16566 2165176 2120974 2200277 2102978 1886453 2056212 1985275 1710877 1947765 1480312 1716014
16556 1716014 1864851 2174582 2001325 1518251 1399849 1500368 1913179 1406605 1757964
16547 1757964 1519019 1438043 1727431 1735264 1376741 1542584 1519396 1518481 1324541 1564499 1574326
16536 1574326 1580868 1465417 1207798 1605315 1362687 1658719 1144826 1628279 950896 1201702
16526 1201702 1163687 1385431 1384030 1033844 1190873 1273596 755145 1409661 1041311 781145
16516 781145 933478 1503194 1040123 1093064 1167743 1218385 1048797 1259527 1082025 1121862
16506 1121862 891791 942362 1284600 722262 569993 585715 1188036 1052391 1145175 1228116
16496 1228116 855488 781434 786994 1013939 950342 1066846 986516 490578 836606 1054935
16486A054935j03785J02875j72317O0908J2819l25894K27812C37623M35919q2190
16476F91352m200J90900k02860j07569L81989P70j60717k32865Q9904J23870k08760
16465E61814K23174k30674N6603M20984l34887j27016J40299L6766l68762L62959
16455G41260r0761p610R2520k32294K26962J00910J9390l09524R1228P9089K428
16444G13598j17553k71376R6070P0916K28078j60498J15657k77578K9337L91723
16434H18374C28297L53662j83704K55851j56558p7779n2726j25061j19304K56812
16424D79490k4407r1451O3243J45064k82621J19142J98832j62388m0495J63335
16414E67744L534L1509k27042A60302J42290J98163j93166Q1851j06441J34293
$$ plain form
16486 1054935 951150 1054025 881708 942616 955435 629541 857353 337623 773542 691352
16476 691352 687152 878052 675192 567623 949612 950382 789665 556800 646704 770574 561814
16465 561814 784988 554314 610917 1031901 697014 569998 710297 747063 378301 741260
16455 741260 650499 642889 735409 503115 730077 830987 850377 540853 632081 711170 713598
16444 713598 596045 324669 420739 491655 719733 559235 674892 397314 426651 818374
16434 818374 328297 681959 498255 754106 597548 519769 467043 341982 222678 479490
16424 479490 455083 363632 426875 571939 289318 408460 607292 444904 404409 567744
16414 567744 571278 602787 375745 160302 302592 500755 307589 389440 282999 417292
16404D17292p4862L87887l43975J9823A63832J07993K64803j32301j38136r2354
16394A73837L23233A47603L75599j33345k3350L51504B13066K79973B25337L23629
16384E48966B14402J77217j27294M58917A13297J31763D2384K18766J83754j67869
16374B77035Q3439P626K16884a8659C31344j02534k5789J05961J3574o2372Q0439
16363C40623K65331B66298R7249J16293A97621J39602J06773D6099p931K22674
16353B60842K28345o4758j06492j7062A9661N01247A34620J45979J77095A90559
16342B50843P9500J04777D9134A710L94735j75440K05662k09262J25523K71170
16332F14098B39090I7813Q4442J3474e9027C54317P1856B03050m0124J04396N1534
$$ plain form
16404 417292 342430 730317 386342 406165 163832 271825 536628 404327 266191 173837
16394 173837 497070 147603 523202 389857 366507 718011 213066 493039 225337 548966
16384 548966 214402 391619 264325 723242 113297 245060 42384 261150 444904 277035
16374 277035 360474 368100 584984 -18659 331344 228810 203021 308982 322556 260184 340623
16363 340623 605954 266298 363547 479840 197621 337223 443996 46099 38168 260842
16353 260842 489187 424429 317937 300875 19661 520908 134620 280599 457694 190559
16342 250843 330343 435120 49134 1710 396445 221005 426667 217405 342928 614098
16332 614098 239090 97813 182255 195729 -59027 354317 426173 203050 162926 267322 318856
16321C18856j00749J54423A83953l3742K68176j84323L21036B77138R8537e797
16310C90861b7336m5163A27336P7758F2220L16053G3979p344f432B2673J68416
16299A91089J04264j06898N0932e6066C04349A27011O7601K83969k20555j1122
16289B46904K43661f9425A53236K2354J29261P0781J57497A5969L31725A42962
16278A8230M40393A12653L48444B1772P2493l981N3826N1023K36980b0025A98900
16266D0460K09733d76D543P4053B2239L49825j34227A5414L43112H5030J01193
16255A86223J41787A19507J51685j04712g1199G3818N1441h0956A54954m6173
16245A08781a45542d2906A31217c1052H9570J10602F4364L26494I8209q045J15607
$$ plain form
16321 318856 218107 372530 183953 150211 418387 234064 555100 277138 375675 -5797
16310 390861 -27336 -72499 127336 205094 62220 378273 73979 66635 -6432 22673 191089
16299 191089 295353 188455 239387 -56066 304349 127011 194612 478581 258026 246904
16289 246904 490565 -69425 153236 175590 304851 375632 533129 15969 347694 142962
16278 18230 458623 112653 461097 21772 94265 90284 144110 195133 432113 -20025 198900
16266 40460 250193 -476 4543 78596 22239 372064 237837 15414 358526 85030 186223
16255 186223 328010 119507 271192 166480 -71199 73818 125259 -80956 154954 108781
16245 108781 -145542 -42906 131217 -31052 89570 200172 64364 390858 98209 90164 205771
16234B05771G8054A8629J9359K24525J10400C1078M5145J69613j21092O0248M9017
16223B34009b7235k11906A31429F4711e5748A85306a31496A85261a87601A76506
16212b4937B04274L9622D9849J35809i1140B46156j5481g9433C00606a21711m1224
16201a62935k3908C26547a66811e8512B08717A03803a18538a8569E83K47990a5967
16189A34402B0421e7693H85b54048A82874B3061i9500J1801B57242j21406l4762
16178A01074i4702A42954k6673a32844I2369P7706Q0589c44064A38493a18399
16167H9277K37690k5909o3066E9370B2070M5605B8910b20918d6273A4540n894
16156H646M97936C8744a92240A79901Q5230k7060l346p1159g5911K9513B84301
$$ plain form
16234 205771 78054 18629 37988 262513 372913 31078 76223 245836 124744 184992 234009
16223 234009 -27235 -239141 131429 64711 -55748 185306 -131496 185261 -187601 176506
16212 -24937 204274 243896 49849 185658 -91140 246156 230675 -79433 300606 -121711 -162935
16201 -162935 -186843 326547 -166811 -58512 208717 103803 -118538 -18569 583 248573 -15967
16189 134402 20421 -57693 885 -254048 182874 23061 -99500 -87699 257242 135836 101074
16178 101074 -94702 142954 116281 -132844 92369 170075 250664 -344064 138493 -118399
16167 89277 326967 301058 237992 59370 22070 67675 28910 -220918 -46273 14540 8646
16156 8646 506582 38744 -192240 179901 265131 238071 234725 163566 -75911 -46398 284301
16144b66506I6657h4333B72877j1176J3720p2963h2426A91671e3998B37745e4118
16132I0578b13266A26313a1271C09152A45860n7607c9548H0901L31408a29567
16121F1219o667A2687c97871A45690F5819L8517A3423J10337l9410M7410J51801
16110B83561l1867E1964K07499e73j63434j21203g8404J9466F1511c69176A41386
16098B44139A7101J03341a86657A65009b45819K4285A602J80855A8931a5124r7904
16087a13028j39498A47147D8333R3634c85095a08223L5067j1271C17746a28243
16076A65050a34948D8395N1827Q0938C984e3009B05767I6938c9235A3297a37056
16064b47977a5744D09515d7498A9800a61978G697J84849M6632E6164c904j26398
$$ plain form
16144 -266506 96657 -84333 272877 261701 275421 202458 -82426 191671 -53998 237745 -54118
16132 90578 -213266 126313 -11271 309152 145860 88253 -39548 80901 412309 -129567
16121 61219 54552 12687 -397871 145690 65819 104336 13423 123760 84350 131760 283561
16110 283561 251694 51964 259463 -573 -164007 -285210 -78404 -58938 61511 -369176 141386
16098 244139 17101 120442 -186657 165009 -245819 -221534 1602 182457 18931 -15124 -113028
16087 -113028 -252526 147147 48333 141967 -385095 -108223 -73156 -84427 317746 -128243
16076 165050 -134948 48395 100222 181160 3984 -53009 205767 96938 -39235 13297 -137056
16064 -247977 -15744 409515 -47498 19800 -161978 7697 192546 239178 56164 -3904 -130302
16053a30302C18557g4694B29902D2455b76837O9137A82937l5060J18964r7326
16043A69515D4822b21004I9596N7218a66124h238A41965a16700D05310b86495
16032E757c67124A51646n089B6162J74496D5156j7969M8810P0756K5838q2747
16021H9844a67445R941I4002M60604B16575B6450L12532b91392O7573A32499A6428
16009d27960A03463l7234a9566B69786a9876p1229m2323d6768j02323H6700R154
15998I5854i7584n000j4180d4214m9855I893J44115c9891B77712j00096J27558
15987C05174b27134G0306J65624b03215C1772J77691L2852a26273B61901N7168
15977C19069e7862B2515R9661l6655c35653i3345m5701k54754e1156j86561B71936
$$ plain form
16053 -130302 318557 -74694 229902 42455 -276837 -207700 182937 147877 266841 169515
16043 169515 44822 -221004 99596 156814 -166124 -8238 141965 -116700 405310 -286495
16032 5757 -367124 151646 146557 26162 200658 45156 27187 75997 146753 172591 89844
16021 89844 -167445 -157504 94002 554606 216575 26450 338982 -291392 -223819 132499 16428
16009 -427960 103463 66229 -19566 269786 -19876 -91105 -133428 -46768 -149091 86700 95854
15998 95854 -97584 -102584 -116764 -44214 -94069 9893 154008 -39891 277712 177616 305174
15987 305174 -227134 70306 235930 -203215 31772 209463 242315 -126273 261901 319069
15977 319069 -57862 22515 122176 85521 -335653 -93345 -139046 -393800 -51156 -237717 271936
15965a60616g0518A64443J76920C4631K25613a73322H8742a58786g6935F788J61997
15954A68785l039d4112k34315B34633K9919f8460A01052D3389a63298e8926B3483
15942b34262Q0147O9316k27588j22765D9287k3503A0627J88608o3922M8486d5563
15930B3173J0456o773J86822r4283a36982A44591a96341j22771A71236A0533a93588
15918a5510D31696d26858a11886A1821a96516i1589H6334J54516d55049J6486
15908d38563J47806H3884a45219c1707j25582j44094h0556A58014Q4602j07202
15898A35414l0090b80747A95986a42511N8437a5976D7664b74904A78422m2524
15888A35898C9596b9144j3368k4508B02331a04851B63165d1188l84253a60582
$$ plain form
15965 -160616 -70518 164443 341363 34631 260244 -173322 88742 -158786 -76935 6788 168785
15954 168785 165746 -44112 -278427 234633 264552 -68460 101052 43389 -163298 -58926 23483
15942 -234262 -154115 -84799 -312387 -435152 49287 25784 10627 199235 135313 183799 -45563
15930 23173 33629 26856 213678 119395 -136982 144591 -196341 -319112 171236 10533 -193588
15918 -15510 431696 -426858 -111886 11821 -196516 -91589 86334 240850 -455049 -438563
15908 -438563 -290757 83884 -145219 -31707 -157289 -301383 -80556 158014 242616 135414
15898 135414 105324 -280747 195986 -142511 -84074 -15976 47664 -274904 178422 135898
15888 135898 39596 -29144 -42512 -67020 202331 -104851 263165 -41188 -425441 -160582
15877A18272i3891k79774B3146a08798k66603A81625a32846K8917b2536k27783
15867b50319j1900A33941k3247B6250R5237d06099A52323g5593A0873a44041Q063
15856a35978b0063j54107j77700F5494j5587f9330I6152i2145L6126m5429A47741
15844c17855C04951a7595j7510C732J83379o1264a30765B65913h9264l0837m3349
15833a63450A0224b26365I6430O5970N5996r4795a23290H9690a61770A67433D348
15821a49144c8386C17621H284c5016H5603e9299n7918B19627a03593b5109j93462
15810b18571O3537I8279a46691A52176F1595h7252L5679j18745B15256Q3052f8191
15798A13633j9188a8808o4355q4684d088A48724R1560G0960c17832H2167a11125
$$ plain form
15877 118272 -93891 -373665 23146 -108798 -375401 181625 -132846 -103929 -22536 -250319
15867 -250319 -262219 133941 110694 26250 121487 -406099 152323 -75593 10873 -144041 -135978
15856 -135978 -20063 -174170 -351870 65494 49907 -69330 96152 -92145 -56019 -101448 147741
15844 -317855 304951 -17595 -35105 3732 187111 125847 -130765 265913 -89264 -120101 -163450
15833 -163450 10224 -226365 96430 162400 218396 123601 -123290 89690 -161770 167433 4348
15821 -149144 -38386 317621 8284 -35016 85603 -59299 -117217 219627 -103593 -25109 -218571
15810 -218571 -155034 98279 -146691 152176 61595 -87252 -51573 -170318 215256 298308 -68191
15798 113633 94445 -18808 -83163 -167847 -4088 148724 240284 70960 -317832 82167 -111125
15786b28814F1798J36803a12198A05813j2581b22987M2386g2157k87030a26287
15775C5465g5620A00263B9158d04010A50914p4193e8255a7962C01351h9847B52728
15763a5912A67532F5733h8360b4755k6117H4735a05479A61974G2067Q7039D4833
15751c1869q907D8646b5920q9762m707j01680a09391j7507E7519a16837H0113
15739a1591p9091j41398a7117r9751j97181M0771a13040E1554c49682g0906A5087
15727c2061J3949C4447K731a0130k01054o8371a09806A3249Q1017c12675A76578
15715e6552k44115A40418k7545b34984L1432B830f5183j73147J18243E5400f5253
15703g0088j75610R3595k9012A50802q888D0383a88405F4553b05867D75264E1723
$$ plain form
15786 -228814 61798 198601 -112198 105813 93232 -222987 -180601 -72157 -359187 -126287
15775 35465 -75620 100263 29158 -404010 150914 76721 -58255 -17962 301351 -89847 252728
15763 -15912 167532 65733 -88360 -24755 -50872 84735 -105479 161974 72067 159106 44833
15751 -31869 -40776 48646 -25920 -115682 -120389 -222069 -109391 -126898 57519 -116837 80113
15739 -11591 -90682 -232080 -17117 -116868 -314049 -273278 -113040 51554 -349682 -70906 15087
15727 -32061 -18112 34447 37178 -10130 -211184 -279555 -109806 13249 94266 -312675 176578
15715 -56552 -300667 140418 112873 -234984 -203552 2830 -65183 -238330 -120087 55400 -65253
15703 -70088 -245698 -152103 -181115 150802 141914 40383 -188405 64553 -205867 475264 51723
15691E8304R3935o958i2424B1889K8896a06131A44566d96201b26849r1037E0800
15679A50431o1619K725b81103b2580A17165a06968L6192A18140c4097B1021K3237
15668D4258b78355d9103A50135a17060m6791A03836j3914L87307H9598b9906B34420
15656h3922l4461K0797j17758A10138a12757j23988j4848E3644K49693I6611f0014
15644A22867C8427J31901c00375B1019J77406d0690F8740d69214a85177Q6541
15634i8636A32354i4142A17773i6065k33701P8414c7068A35109g0903b3142a630
15622a40274n0379j10167A35126b7130r7615L2103I5168K9688K5432a37225A78451
15610b28486N8680j1401B58724b45358Q8164L791k851k08715J40362e9180C79543
$$ plain form
15691 58304 152239 145281 -92424 21889 50785 -106131 144566 -496201 -226849 -317886 50800
15679 150431 88812 91537 -281103 -22580 117165 -106968 -70776 118140 -34097 21021 44258
15668 44258 -278355 -49103 150135 -117060 -163851 103836 89922 477229 89598 -29906 234420
15656 -83922 -118383 -97586 -215344 110138 -112757 -236745 -251593 53644 303337 96611 -60014
15644 122867 38427 170328 -300375 21019 198425 -40690 68740 -469214 -185177 -98636
15634 -98636 132354 -94142 117773 -96065 -329766 -251352 -37068 135109 -70903 -23142 -1630
15622 -140274 -190653 -300820 135126 -27130 -124745 -92642 95168 124856 150288 -137225 178451
15610 -228486 -169806 -181207 258724 -245358 -157194 -153403 -156254 -364969 -224607 -59180 379543
15598A96400g7099j41999J4691F1678b7619A84133g305k73768M0452p6757L9547
15587b77831a08385k9889B7758h6089k7177m3343e0023F2421a44466A61792l5440
15576A26352a38422k73673a23057A13651b56976e3061k20519H5606k0813d2847
15565f3233A1853b0720n016A50569N0552d1758B15461A06574d4256j6481k43567
15554c04304D817c7724j48181F5554b85686i8819E1056a18519k6704M4294l2586
15543a33515l7531K9890A52903J91308j30659l2723n9275b9811R0m5745b8426
15531B9558a42472A28298C6370b5940j38800B2359a83711C90278a18745E3286
15520I4620A5120b43616f0091r4526A49415b26874c3291j96417D3916L3771k9697
$$ plain form
15598 196400 -77099 -219098 -204407 61678 -27619 184133 -7305 -281073 -240621 -317378 -277831
15587 -277831 -108385 -138274 27758 -86089 -113266 -156609 -50023 62421 -144466 161792 126352
15576 126352 -138422 -412095 -123057 113651 -256976 -53061 -273580 85606 64793 -42847
15565 -63233 11853 -20720 -25736 150569 201121 -41758 215461 106574 -44256 -60737 -304304
15554 -304304 4817 -37724 -185905 65554 -285686 -98819 51056 -118519 -145223 -100929 -133515
15543 -133515 -171046 -141156 152903 344211 213552 180829 121554 -29811 -29721 -75466 -28426
15531 29558 -142472 128298 36370 -25940 -164740 22359 -183711 390278 -118745 53286
15520 94620 15120 -243616 -60091 -154617 149415 -226874 -33291 -229708 43916 77687 47990
15509D7990J10351e3370H1726J99552q3195p4840M225m3460d38562J63894I1429
15497A22958B977a00226F1333J9685G721a16910m11779A87916a24511B77431B7518
15485A5054c55968a07190B51927j25708R2480q4432E0134a01790m3152I3644Q8510
15474A82154b36600g6652A43342J7491N6959c90214D7889a61685G9178P8703a69005
15462a16950B04815f6529c0109c500C39731A16762b4474C3359i6729k04310f8342
15450h9271b7366J3477A35133R8713a54823A31265a72004P3298n3668O9887j76093
15439b58580A06260j509a03991r4290B83478d51129a50098f3842j02046d4078
15428f6728H7120h3926B70914E7068L72a19648m1402I3167J0883c11089I3939
$$ plain form
15509 47990 158341 -53370 81726 281278 198083 123243 127468 84008 -438562 -274668 91429
15497 122958 2977 -100226 61333 81018 7721 -116910 -528689 187916 -124511 277431 27518
15485 15054 -355968 -107190 251927 126219 218699 134267 50134 -101790 -144942 93644 182154
15474 182154 -236600 -76652 143342 160833 217792 -390214 47889 -161685 79178 157881 -169005
15462 -116950 204815 -66529 -30109 -3500 339731 116762 -24474 33359 -96729 -301039 -68342
15450 -89271 -27366 -13889 135133 233846 -154823 131265 -172004 -98706 -152374 -82487 -258580
15439 -258580 106260 104751 -103991 -198281 283478 -451129 -150098 -63842 -165888 -44078
15428 -66728 87120 -83926 270914 57068 57440 -119648 -161050 93167 104050 -311089 93939
15416G0771M4878j8843E906a54180G7089A6105K01123b87990B89387b0879A93190
15404B88179a80819A42900B8168b4480j22626A81165g0902A35421E3482L6577
15394I0059C3402J80659H0754a1334j82619l21630A86233R459c83328B8758a17873
15382B42035D1549m403h6686B38901r5613K02329e0108B70491A7278d3300J319
15371d1981n795B1246b0867f000j17755E3718O7694a7577j09754p9108B54364
15359g9041D6179K072a24726j1371N329q752c7322G4621J57876G7429f4858B50161
15346f6081F7730d7545K3341A77466f6156j47556f5141j27341I2752a83351O697
15335a76654C8173a49217A6384M4762a67609B57918D2481a51752b6495j14265
$$ plain form
15416 70771 115649 96806 5906 -154180 77089 16105 217228 -287990 289387 -20879 193190
15404 288179 -180819 142900 28168 -24480 -147106 181165 -70902 135421 53482 90059
15394 90059 33402 214061 80754 -11334 -193953 -515583 186233 195692 -383328 28758 -117873
15382 242035 41549 37146 -86686 238901 143288 345617 -50108 270491 17278 -43300 -41981
15371 -41981 -47776 21246 -20867 -6000 -123755 53718 121412 -17577 -127331 -206439 254364
15359 -79041 46179 48251 -124726 -136097 -130768 -139520 -37322 74621 232497 77429 -64858 250161
15346 -66081 67730 -47545 -24204 177466 -66156 -213712 -65141 -192482 92752 -183351 -176654
15335 -176654 38173 -149217 16384 61146 -167609 257918 42481 -151752 -26495 -140760
15325a40760J4780Q500D0529C528i4229j14150Q3605N5269r9059H4143m0402K99421
15313C43162A10054f5573j9182A58498j6725N5599J16272a04336E9788n849a72567
15301H5768b00291A629d9984j06464D8150M6035N4777a00348B83937a85998C14920
15289g8614l7628A92951E6903a32384q6801g2420A31268d1200k6301o4722B49094
15277A88146a4696j82969h8586B55676A15130J378e2383b2205r8696A91070i6020
15265A8881J58089D7701L82453f6050I6295c61839a5318j70070B16586I8370a21171
15253a19421J7987C15415D2318M98332R47641l20786l033j8742E29598q3782b7946
15241E01782D4082K65479L24226B65608a99925f8746A2137J26444F7382c159j52235
$$ plain form
15325 -140760 -125980 -117480 40529 3528 -94229 -208379 -124774 -69505 -168564 84143 43741 343162
15313 343162 110054 -65573 -84755 158498 141773 197372 313644 -104336 59788 53939 -172567
15301 85768 -200291 1629 -49984 -156448 48150 94185 148962 -100348 283937 -185998 314920
15289 -78614 -116242 192951 56903 -132384 -219185 -72420 131268 -41200 -67501 -132223 249094
15277 188146 -14696 -197665 -88586 255676 115130 116508 -52383 -22205 -120901 191070 -96020
15265 18881 176970 47701 430154 -66050 96295 -361839 -15318 -185388 216586 98370 -121171
15253 -119421 -101434 315415 42318 540650 1488291 1167505 1164472 1145730 529598 445816 -27946
15241 501782 44082 309561 633787 265608 -199925 -68746 12137 138581 67382 -3159 -155394
15230a55394B2693M42492e0589A82261K01321A11824Q2734j5101i4281i979F6571
15218B01775n4610b9509j8480p2272r3746k42179f4991D5597b27719B43241q7931
15207A55310M0798B707d9814P636K0387C00184b59687N9520K7930k0050J2738
15196a79549A16328d1161j4741I8343C694L86202B1741R9662J73372G1761e9375
15184a3489j43858G5396B4566b9048j24540E3435J28281C3391J55569i4039D2690
15172I3690b338G0415e353j6714B33786F7638K3328g0879m7658C2605P6316L08656
15160D17577A0500K23172C8467a23755D30804B3404c3783A65671C8576K62172
15150C00748B6551L01082F5043J81441h2449j43101I0885J24771j05471c6842
$$ plain form
15230 -155394 22693 465185 -50589 182261 383582 111824 194558 179457 -94281 -9979 66571
15218 201775 147165 -29509 -47989 -120261 -214007 -456186 -64991 45597 -227719 243241 155310
15207 155310 196108 2707 -49814 -42178 -21791 300184 -259687 -200167 -172237 -192287 -179549
15196 -179549 116328 -41161 -55902 98343 3694 389896 21741 121403 294775 71761 -59375
15184 -13489 -157347 75396 24566 -29048 -153588 53435 181716 33391 188960 -94039 42690
15172 93690 -2338 70415 -5353 -22067 233786 67638 90966 -70879 -118537 32605 108921 417577
15160 417577 10500 233672 38467 -123755 430804 23404 -33783 165671 38576 300748
15150 300748 26551 327633 65043 246484 -82449 -225550 90885 215656 110185 -36842
15139e4776A04368N73706B15876E194K95274J90995d8061A80982a12297B70679
15128c4178E9197i7152F9001g4679A47307P599J30338j26592c7755A49948j8805
15117A31143M2126G3833l3548a52658B6404c68071C44453j37217B7080K91331
15107C18411j08767j241a25146C31335A36877b64118B38110b2987j79156K0274
15097a81869A80933f1944C1728P8125K88080j54427A07558C3791k642Q7131J27171
15086B45451I0715d8491C93634A84228l5814J3911L4815k7266n4864K58766b8129
15074H9441M60529f8232B9043J99757K01095A30052n7826J40932c4102A37066
15063B03989c2835e351A73929N3727r1083E1462J68153r4874K047J37543E8671
$$ plain form
15139 -54776 104368 678074 215876 5194 300468 491463 -48061 180982 -112297 270679
15128 -34178 59197 -97152 69001 -74679 147307 154906 285244 158652 -37755 149948 131143
15117 131143 173269 73833 40285 -152658 26404 -368071 344453 207236 27080 318411
15107 318411 209644 208403 -125146 331335 136877 -264118 238110 -22987 -202143 -181869
15097 -181869 180933 -61944 31728 109853 397933 243506 107558 33791 31149 118280 245451
15086 245451 90715 -48491 393634 184228 148414 162325 197140 169874 115010 373776 -28129
15074 89441 549970 -68232 29043 228800 429895 130052 72226 213158 -34102 137066
15063 203989 -32835 -5351 173929 227656 136573 51462 219615 124741 126788 264331 58671
15051B01489m9131f6720I1912j0621K81526A10216K68282G6900g5415a8539C658
15039f178A09607J42248L4665r828H5916m0J94947o8944j5542B0082J41193R9941
15027B61216g3724D18144G7326J52855B2497N5960g9167l7300e2055l7266l8274
15016a27595D84828j01428r7224l8980a09696A50630k1224l2463K67304A73636
15005B57021j19961C5491M47790b0362H8946K7936n3428J92281N2201f7262C04173
14993D89605b3795B74455L1408j47036G2907Q6606o7336K59913J45732n9015A75236
14981D0645K43557j1861A02644N2249F2170M42878F9414K00007n5028K3070j6962
14970B20501J61164j50606I3234a4933D38368A86047J82728p0113j04894I3580
$$ plain form
15051 201489 152358 -66720 91912 81291 362817 110216 378498 76900 -75415 -18539 3658
15039 -6178 109607 251855 286520 276692 85916 85876 280823 211879 196337 20082 161275 261216
15027 261216 -73724 418144 77326 230181 22497 78457 -79167 -116467 -52055 -89321 -127595
15016 -127595 484828 383400 286176 247196 -109696 150630 129406 96943 364247 173636
15005 257021 137060 35491 483281 -20362 88946 116882 63454 255735 307936 -67262 304173
14993 489605 -23795 274455 305863 158827 72907 159513 92177 352090 497822 438807 175236
14981 40645 284202 272341 102644 154893 62170 505048 69414 269421 214393 237463 220501
14970 220501 381665 231059 93234 -14933 438368 186047 368775 298662 193768 93580
14959C18205R880j26353H006M98084j80158n0845A25811J9979L3963M643R8195
14948B82591I1255J14849J67690I4478K50999j9327G5844M4818K86951c5146D26102
14936B76690J97580B26456N36644C647K80802J89681K02560C30599j02283r3378
14926A34938J11212j04996O2008J54019O393j01648K9083a810C42368J62951K6061
14915E31380E4772k5191J38618K34898r1859j23427A3886L77845A56960K5008
14905A81968a55715C27375K95479k62886J15182j20985j47080L7442M3009B04
14894B96035A16055M11778B26364R1314K14327k11469J00680P8219J11160H5726
14883A11897L18534j39606J99050m34q0540R4708n8362B20975Q0111K324J79310
$$ plain form
14959 318205 328085 201732 8006 506090 325932 275087 125811 145790 179753 184396 282591
14948 282591 91255 206104 373794 94478 345477 326150 75844 120662 407613 -35146 426102
14936 276690 474270 226456 763100 3647 284449 474130 676690 330599 228316 134938
14926 134938 246150 141154 203162 357181 363574 261926 291009 -1810 342368 505319 531380
14915 531380 54772 29581 168199 403097 311238 187811 13886 391731 156960 181968
14905 181968 -155715 327375 622854 359968 475150 354165 207085 244527 287536 204
14894 296035 116055 527833 226364 317678 532005 320536 421216 499435 610595 85726
14883 111897 430431 290825 489875 489441 408901 503609 445247 220975 301086 303410 482720
14872D82720k24834M2381a3955C00500K3580m8294L17315j36063n7074I8297K39845
14861C38142J44785j49826K26506k06983J81255M3002I7505q598N24348j4386
14851E98869K2516j65915M2642j77801K62303p4189B52100K83331m1094K09617
14841G03954k40833j44845P4575K00037B11062L60070j68505Q757J84721B22462
14830G27643k53953L8876J37215q6582q9944j48747A54622K87677j24283J98093
14820E16109j02715j65574n8779L26807O8052k9113n2722j00776J52390j81770
14810C71909R7100M01360m11844R6744j24618J04335j89711K86859k51124A66338
14799C02794j24149J14370J81791J62963L7971j41271p6067K61139j70399B41412
$$ plain form
14872 482720 257886 300267 -13955 300500 324080 275786 593101 457038 399964 98297 338142
14861 338142 482927 333101 559607 352624 533879 576881 97505 88907 613255 598869
14851 598869 621385 455470 498112 320311 582614 508425 252100 535431 494337 703954
14841 703954 463121 318276 392851 592888 211062 571132 402627 411384 596105 222462
14830 727643 473690 512566 649781 563199 473255 324508 154622 442299 318016 516109
14820 516109 413394 247820 189041 515848 583900 554787 502065 401289 553679 371909
14810 371909 469009 870369 458525 555269 430651 534986 345275 632134 381010 166338
14799 302794 178645 293015 474806 637769 675740 534469 458402 719541 549142 241412
14788D86408K02629k76873K52426j16618m9223I4371M42241K18466C63801P18256
14778A082057E25217m7663J4957J99723O4938j68674J12888L33539E09433P8786
14768E88219k46795L17739k39233K28900B83747M61460C68724J93685P0420j15665
14758E17164N4321P9321J00313I5813M39612J71165j26596M3980K8624J22379
14748G74977l47367N4062j4407K40010j2205L0523Q6362R8512k28051j92940N3585
14737E43061J38994K4446p2387K24382p0469j80122J71222k68687m3243L92301
14727H59498P206J45793k44512j03321J91976J01570C92186L79252j12656j9592
14717F39190O0483J85791J38452l36117Q9113M9345j22248M4010J54701j48657
$$ plain form
14788 486408 689037 412164 664590 547972 498749 94371 536612 755078 363801 1082057
14778 1082057 525217 477554 492511 692234 757172 588498 701386 1034925 509433 588219
14768 588219 341424 659163 419930 648830 283747 745207 368724 562409 632829 517164
14758 517164 571485 650806 751119 95813 535425 706590 579994 623974 652598 774977
14748 774977 427610 481672 467265 707275 695070 725593 811955 910467 682416 489476 543061
14737 543061 682055 706501 634114 858496 788027 607905 779127 510440 467197 859498
14727 859498 866704 1012497 767985 664664 856640 958210 392186 771438 658782 639190
14717 639190 699673 885464 1023916 687799 776912 826257 704009 748019 902720 754063
14707G54063J41832j65286B83651O05617j27529q562R3067j43223K16981J50334
14697A070336n21894K90981Q0504J36646m48722J36385J7489O7301L593J19337
14687I51956K16092j38944L7141j6211m846j67877j65195L08696j15225J51426
14677A057013J67567D64420O83069Q3527K6932n21803R3706M26347j66764k33851
14667H55583k9835M3564Q4874o2518j56050M1567J78625J03560J18638l74949
14657H03059J92829r6551J27233o651K62902j97904J26210K5573L0472j19036
14647A148136n9760K1363R0470N3008l83106J91067J40295J47388j06862q360
14637A233639K223j68231K26068Q6557l26498K18235l75096M15592L1666j01564
$$ plain form
14707 754063 895895 730609 283651 889268 761739 753177 846244 703021 920002 1070336
14697 1070336 548442 839423 919927 1056573 607851 744236 761725 829026 832619 951956
14687 951956 1168048 1029104 1066245 1050034 1045188 877311 712116 1020812 905587 1057013
14677 1057013 1224580 464420 1147489 1231016 1257948 736145 829851 1256198 1089434 855583
14667 855583 825748 869312 954186 891668 735618 777185 955810 1059370 1178008 803059
14657 803059 995888 899337 1026570 1019919 1282821 1084917 1211127 1236700 1267172 1148136
14647 1148136 1088376 1109739 1200209 1253217 870111 1061178 1201473 1348861 1241999 1233639
14637 1233639 1235862 1067631 1293699 1380256 1053758 1271993 896897 1312489 1344155 1242591
14627A242591L07120L2035j53908j52394r575q8159K17574j82232J25677K02361
14617A541090L5843q4081m23600L52351j01302L09004J6524l83886J46517K3727
14607A432187l01197L82946O8110j83323K25467k16697K34899J24122k823j59379
14597A604312L86674l31464L5428J46580m3713q8693O7795J54607k33551k03426
14587A494549K11349r5340L8051M70495l11864j44954n8410M6490J02676K10454
14577A963496J22101j56690J60660j81239K38187n10611Q07200m28767K11287
14568B225624j6250k75961N22774R0525M5265j37929K13317k55529K49848Q9509
14558B751193p9132J93967k1603M97496q3819M21771K98752O62453P02838J671888
$$ plain form
14627 1242591 1549711 1581746 1427838 1275444 1265869 1177710 1395284 1213052 1338729 1541090
14617 1541090 1576933 1492852 1069252 1421603 1320301 1629305 1645829 1261943 1408460 1432187
14607 1432187 1130990 1513936 1582046 1398723 1624190 1407493 1642392 1766514 1763691 1604312
14597 1604312 1990986 1659522 1694950 1841530 1797817 1709124 1776919 1931526 1697975 1494549
14587 1494549 1705898 1610558 1648609 2119104 1807240 1662286 1603876 1650366 1753042 1963496
14577 1963496 2085597 1928907 2089567 1908328 2146515 1635904 2443104 2014337 2225624
14568 2225624 2209374 1933413 2456187 2546712 2591977 2454048 2667365 2411836 2661684 2751193
14558 2751193 2672061 2866028 2844425 3341921 3258102 3679873 3978625 4641078 5343916 7015804
14548G015804M210451J0792770K1243706n967441j6538938j0129678n260262k115760
14540C250652l97915n04771m76951K19928k57148L05718k38342o3088O5453j38606
14530A764930J59802M25088k82131N66959l82476k07810k8854K93777J84145l38857
14520B154573K34643l35495K52839P9757L72984L48695o78789K8273n5332K23544
14510B625692j37720J10896j07142K75320k19452N15071k72755L8387Q6507j1973
14500B902831M4557K6746J29594q7104K92687m58116O42789n8008l58836J80111
14490C257251K19026k96787J07921J67334K5396J26490j02795K77963J1068p7363
14480C715504Q2139j52285M08990k94420N6735J94486j08896L20266r9489N8239
$$ plain form
14548 7015804 11226255 22019025 43262731 37295290 20756352 10626674 5366412 3250652
14540 3250652 2852737 2347966 1871015 2090943 1833795 2139513 1901171 1838083 1903536 1764930
14530 1764930 1924732 2349820 2067689 2634648 2252172 2044362 2015508 2309285 2493430 2154573
14520 2154573 2389216 2053721 2306560 2386317 2759301 3107996 2429207 2457480 2402148 2625692
14510 2625692 2487972 2598868 2491726 2767046 2547594 3062665 2789910 2828297 2914804 2902831
14500 2902831 2947388 2974134 3103728 3016624 3309311 2851195 3493984 3435976 3077140 3257251
14490 3257251 3476277 3179490 3287411 3454745 3480141 3606631 3503836 3781799 3792867 3715504
14480 3715504 3797643 3645358 4054348 3759928 3816663 4011149 3902253 4222519 4123030 4181269
14470D181269p7719j39930Q5302J31346L13185J43251N2091k8406j4894p7690
14460D567805K82343n0935J91116j80994k1458K35658J19891Q2043O1325L333
14450E290127J49501l33077K80495n4476J64299P0235K22512J49267j2431J3524
14440E939976J06783J36180n9762j96508M26242l8192R305N00675M8160k58486
14430F614373j79400L23242K30505m8575L56039j40989K61875M46234m18894J67124
14420G611534J20949L22812R8094K12228K01328l17401j29540N25101K83086L22522
14410I250713m17400L36814K56519k48606N38368K8465j84506L97730m6242O08674
14400A0520529o6266L97030o9246L22777K5302M46554J95813J49453m38827M66213
$$ plain form
14470 4181269 4103550 3963620 4048922 4180268 4493453 4636704 4688795 4660389 4645495 4567805
14460 4567805 4850148 4799213 4990329 4809335 4787877 5023535 5143426 5225469 5286794 5290127
14450 5290127 5439628 5106551 5387046 5332570 5496869 5567104 5789616 5938883 5926452 5939976
14440 5939976 6046759 6182939 6123177 5926669 6352911 6314719 6324024 6824699 6872859 6614373
14430 6614373 6434973 6758215 6988720 6940145 7296184 7155195 7417070 7863304 7444410 7611534
14420 7611534 7732483 8055295 8153389 8365617 8566945 8249544 8120004 8645105 8928191 9250713
14410 9250713 8833313 9170127 9426646 9178040 9716408 9744873 9560367 9958097 9911855 10520529
14400 10520529 10454263 10851293 10782047 11104824 11130126 11576680 11772493 11921946 11483119 11949332
14390A1949332N72308k49350K47113L32699K32769o8952N17086M41956N40546
14381A4515507j14593Q7202M98114M60243J12452k8905M12232M66894J55145P4055
14371A6638346N61727O31415j08729P24066M17275N54870M91868K87890K75994
14362B0474722K58617N76924M93837M45656N07728J033762K45166Q3135Q02780
14353B4922327M61291R78080L23025Q90532M62452P31627O32648Q07238P86001
14344C0995221Q29289Q20599P62647R01372R97634P28907J419884J186186J010039
14335C9651778R75989J213510J399892J186572J552697J254370J550729J708751
14327E0494288J477431K172804J351851J916522K200370J888934K217903K188739
$$ plain form
14390 11949332 12521640 12272290 12519403 12852102 13084871 13015919 13533005 13974961 14515507
14381 14515507 14400914 14488116 14986230 15446473 15558925 15530020 15942252 16409146 16564291 16638346
14371 16638346 17200073 17831488 17722759 18446825 18864100 19418970 19910838 20198728 20474722
14362 20474722 20733339 21310263 21804100 22249756 22757484 23791246 24036412 24119547 24922327
14353 24922327 25383618 26361698 26684723 27575255 28037707 28769334 29401982 30209220 30995221
14344 30995221 31824510 32645109 33407756 34309128 35306762 36035669 37455553 38641739 39651778
14335 39651778 40627767 41841277 43241169 44427741 45980438 47234808 48785537 50494288
14327 50494288 51971719 54144523 55496374 57412896 59613266 61502200 63720103 65908842
14319F5908842K625702K322247K666651K917957K782088K961710M000898L001273
14311H9187368M045026L922844L688608M963511M270397N080789M961185N350318
14303A25470046O253693O096327O613844P123430P547781P995651Q302647R023901
14295A84427320R365238R848910J0716404J0929751J2112204J2135094J2862777
14288B62397698J3381014J4251038J4244697J4839760J4720471J5146128J4791567
14281C63772373J4753859J4290628J3523438J2701005J1298683J0041561Q336318
14274D48717865O091674L204730l34916l385142m326265o700740r126362m868258
14266D29272586n107556r654327j1944570j2952014j4059563j4456114j5526880
$$ plain form
14319 65908842 68534544 70856791 73523442 76441399 79223487 82185197 86186095 89187368
14311 89187368 93232394 97155238 100843846 105807357 110077754 115158543 120119728 125470046
14303 125470046 131723739 137820066 144433910 151557340 159105121 167100772 175403419 184427320
14295 184427320 193792558 203641468 214357872 225287623 237399827 249534921 262397698
14288 262397698 275778712 290029750 304274447 319114207 333834678 348980806 363772373
14281 363772373 378526232 392816860 406340298 419041303 430339986 440381547 448717865
14274 448717865 454809539 458014269 457679353 454294211 449967946 443267206 434140844 429272586
14266 429272586 424165030 414510703 402566133 389614119 375554556 361098442 345571562
14259C45571562j5183767j5551755j5344770j4112340j3781363j3182934j3290624
14252B45124009j2288985j1673251j0833033j0523677j0052984r135275q995039
14245A71621765p720371p730629p419693p017091o707146n829890n887664n286346
14237A18022935m879444n037585m480600m612462l600277l951095l259838l313544
14229H4888090l706063l267455k844885k681660k644278k607319k269934k306466
14221F2560030j874876k164834j999535j972708j586220j819479j686700j311347
14213D8144331j336784j502194j511878j086747j361765j179795n39656j290170
14205C8335342j320105j075324r61918j277290j84867r48260j126270q72106p49236
$$ plain form
14259 345571562 330387795 314836040 299491270 285378930 271597567 258414633 245124009
14252 245124009 232835024 221161773 210328740 199805063 189752079 180616804 171621765
14245 171621765 163901394 156170765 148751072 141733981 135026835 129196945 123309281 118022935
14237 118022935 113143491 108105906 103625306 99012844 95412567 91461472 88201634 84888090
14229 84888090 81182027 77914572 75069687 72388027 69743749 67136430 64866496 62560030
14221 62560030 60685154 58520320 56520785 54548077 52961857 51142378 49455678 48144331
14213 48144331 46807547 45305353 43793475 42706728 41344963 40165168 39625512 38335342
14205 38335342 37015237 35939913 34977995 33700705 33515838 32567578 31441308 30569202 29819966
14196B9819966j046190m57295k48597q95055q08037o84962m84915n63948m76480
14187B4154487j106405k80531l53385o79629j92772p71589k21982m37227l94178
14178A9716789l34161n09629o94924k11295k92724o01767N3375l52561o09978
14169A6163125j71593m68060m1586l33238k3459j44427p22210j11476l62130l09673
14159A3475273j5351l44519j09838l99088L7094k42983n09326R3030k88652l05032
14149A1390608j19547j09809l95710k16353m940L5208m56002J67039n27062j13507
14139I649925J14363l23761j44183j88223K56239l1509p59415j66615P5891K5653
14129H508365l43285J28637o8907j36916m91257L09218l08594J14280j39973m8116
$$ plain form
14196 29819966 28773776 28316481 28067884 27172829 26364792 25679830 25194915 24630967 24154487
14187 24154487 23048082 22767551 22414166 21734537 21541765 20770176 20548194 20110967 19716789
14178 19716789 19382628 18872999 18178075 17966780 17674056 17072289 17125664 16773103 16163125
14169 16163125 15991532 15523472 15481886 15148648 15125189 14980762 14258552 14147076 13784946 13475273
14159 13475273 13459922 13115403 13005565 12606477 12643571 12400588 11891262 11984292 11695640 11390608
14149 11390608 11271061 11161252 10765542 10549189 10544249 10579457 10123455 10290494 9763432 9649925
14139 9649925 9764288 9440527 9296344 9108121 9364360 9332851 8573436 8406821 8482712 8508365
14129 8508365 8165080 8293717 8224810 8087894 7596637 7905855 7597261 7711541 7571568 7523452
14119G523452p9200l14100J09333l10322J05075N3160m53379q6539j02434K99533
14109F744579k40716k18956K6601M8614J50915k70535k33385J35745j72867j24563
14099E845432j00577n1821P2026n78774L95351k57639k42004m0908N14755n55753
14089E000088M66179j35536o35314M18828m85666J93459Q2168j27674j01575J38233
14079D813190m68532N6567Q0438J56469l54240j5081J30259L2352k71027Q7717
14069D248112p1963L03573n10004R4600j61742J12321p4316j8575r524P6498n16243
14058C472737K38381n0779N8621J94939r9583k0366j72655j17552k3826l25502
14048C154415k15475O02772p7700k07913j7484R8169K2570k30959k03764O75117
$$ plain form
14119 7523452 7444252 7130152 7239485 6929163 7034238 7087398 6634019 6547480 6445046 6744579
14109 6744579 6503863 6284907 6311508 6360122 6511037 6240502 6007117 6142862 5969995 5845432
14099 5845432 5744855 5693034 5765060 5186286 5581637 5323998 5081994 5041086 5555841 5000088
14089 5000088 5466267 5330731 4695417 5114245 4628579 4822038 4904206 4776532 4674957 4813190
14079 4813190 4344658 4401225 4481663 4638132 4283892 4268811 4399070 4431422 4160395 4248112
14069 4248112 4176149 4479722 3969718 4064318 3902576 4014897 3940581 3922006 3912482 3988980 3472737
14058 3472737 3711118 3660339 3718960 3913899 3814316 3793950 3621295 3503743 3479917 3154415
14048 3154415 2938940 3541712 3464012 3256099 3238615 3336784 3359354 3128395 2924631 3599748
14038C599748m08988l25313J58690r7710L09035q7089j51936J41245l8363j55696
14028B943623R4671j08482k41922M5474J35151j5666l27485L00225k41477J82186
14018B766298j71286o2186l1977J80590k64879J21871k25811j83287K18846n5401
14008B292778k24463K06386K09501k71133O1175j78933O3217l04079J38752K81590
13998B274791L0464j8893k57483K38317p3065o3498K20990j07891O34127M36921
13988C314780K602466P917100K1634974K432470j3416652r775665n631888l286531
13980E791054p72426q66843p10347q2794l94537j90011j35317R4043l11993n8748
13970B362081M4414r7973Q9566j51234R5035K89948l28621k19887J55236q2769
$$ plain form
14038 3599748 3190760 2865447 3024137 2926427 3235462 3148373 2996437 3137682 3099319 2943623
14028 2943623 3038294 2929812 2687890 2733364 2868515 2852849 2525364 2825589 2584112 2766298
14018 2766298 2595012 2532826 2500849 2681439 2416560 2538431 2312620 2129333 2348179 2292778
14008 2292778 2068315 2274701 2484202 2213069 2274244 2095311 2158528 1854449 1993201 2274791
13998 2274791 2305255 2286362 2028879 2267196 2194131 2130633 2351623 2243732 2877859 3314780
13988 3314780 5917246 13834346 35469320 37901790 24485138 14709473 9077585 5791054
13980 5791054 5018628 4151785 3441438 3358644 2964107 2774096 2638779 2732822 2420829 2362081
13970 2362081 2406495 2308522 2398088 2246854 2341889 2631837 2303216 2083329 2238565 2155796
13960B155796J09200o39116N58490k23699R9088j79251L1275q6062j50919J04342
13950A779144k27712J52970K90737j92197Q9351q3253r4464j80479L6388J51198
13940A721683L19108j27778l89905k58227J40327J07741K55153j45843R3390j8462
13930A697187o7023K70548l32652L9231L19124k09954k25976j7380K44067j38336
13920A578836k08469J91763J35142l62115l47869L14014j33771L91029m186R670
13910A564044j77246q1046K86985Q0943j72111k14993K35392l00801J38810O4595
13900A424572k13230j65090N82189l31808k66228L62825K8114p4036m15875L13475
13890A244908L6542O7459k65147O4786J09589j76858J47578j0314K7574l25853
$$ plain form
13960 2155796 2264996 1625880 2184370 1960671 2059759 1880508 1911783 1825721 1674802 1779144
13950 1779144 1551432 1704402 1995139 1802942 1892293 1809040 1714576 1534097 1570485 1721683
13940 1721683 2040791 1913013 1523108 1264881 1405208 1512949 1768102 1622259 1715649 1697187
13930 1697187 1630164 1900712 1568060 1607291 1926415 1716461 1490485 1473105 1717172 1578836
13920 1578836 1370367 1562130 1697272 1335157 987288 1301302 1167531 1558560 1554374 1564044
13910 1564044 1386798 1305752 1592737 1673680 1501569 1286576 1521968 1221167 1359977 1424572
13900 1424572 1211342 1046252 1628441 1296633 1030405 1393230 1421344 1347308 931433 1244908
13890 1244908 1281450 1348909 1083762 1148548 1258137 1081279 1228857 1218543 1246117 920264
13880I20264M87341n18980M64583n9659k97701L08746k29931N2798k21186J21152
13870A027427K21640P7298n51033L06038K77992m39033J58259j29008L80580l30988
13860I99172K79232l38033J97333k46410J23962O5937j29457J04197Q2057q8007
13850A049983k63757M32834l46506K24784O0699k72528N33829m44579k38679o0113
13840F75967J09919J08411o3354K40082k2233J02902k49258J31066L5684m84985
13830E84201L52206p7411P8929J018R3316r0303k12293J41126J503K2489J70432
13819A065213l32709Q2842K55444j38780P4595j67323M0175l95717K34498L91926
13809A110164k91919K63006k94320J70196j10989n9680L31433E30614o902L25744
$$ plain form
13880 920264 1407605 888625 1353208 1293549 995848 1304594 1074663 1127461 906275 1027427
13870 1027427 1249067 1326365 775332 1081370 1359362 920329 1078588 949580 1330160 999172
13860 999172 1278404 940371 1137704 891294 1015256 1081193 951736 1055933 1137990 1049983
13850 1049983 786226 1219060 872554 1097338 1158037 885509 1419338 974759 736080 675967
13840 675967 785886 894297 830943 1071025 1048792 1151694 902436 1033502 1069186 584201
13830 584201 936407 858996 937925 938943 1032259 941956 729663 870789 872292 894781 1065213
13819 1065213 732504 815346 1070790 932010 1006605 839282 879457 483740 718238 1110164
13809 1110164 818245 1081251 786931 957127 846138 786458 1117891 530614 523712 849456
13799H49456R4621L2504j43041N134q3865K549M8770j65132k688L7663M2932J727
13787G20630l1968Q0564j95058K08364j11791J54411j89585j23944L20083j98197
13777F33509M9361K68267j44320J5447l88909L26267j01958m0857K77478l92185
13767E02100K07580J06487q8848J66275m16373M27357J63712k43359m4209j77523
13757F03199J37346o515k42468L06251j61306P918j78363J42883L63838k64700
13747G08083r7402o7092N9572J00800m6027P1587n6579n5202L28149k68866j46376
13736E30647K3943K02539j40316l724N4528O809C19358M56696J9550B81106J89631
13725D70737j48077J92973k0962K2955O7807k14961j2826j74827O0207J70747
$$ plain form
13799 849456 944077 976581 833540 838674 754809 757358 806128 640996 638308 675971 718903 720630
13787 720630 688662 769226 574168 782532 670741 825152 635567 511623 831706 633509
13777 633509 682870 951137 806817 822264 433355 759622 657664 616807 894285 502100
13767 502100 709680 816167 727319 893594 477221 904578 1068290 824931 780722 603199
13757 603199 740545 734030 491562 797813 636507 644425 466062 608945 972783 708083
13747 708083 610681 543589 603161 703961 657934 729521 672942 617740 945889 677023 530647
13736 530647 554590 757129 616813 613089 667617 674426 319358 776054 795604 281106 470737
13725 470737 322660 515633 494671 517626 585433 370472 357646 182819 243026 413773
13715D13773J58944j54337J98635k91734K56234J3797k64078Q2969K19564j67284
13705D66483J22644L8554j23115K88813j60969J39988l9510l9761q1127k10838
13695D01162m5295J67447A01336L75825J41538k8114B54995L10388j32691j12147
13685C20545L66086j34254l1527p0347n891N18910D27275J06834N2087k35544
13675C50652Q5345A55276K03147K08952m1262p0253j38248K38461K21508l76398
13665D01183j43003j19407M02056J45430l02133J37518M322j38907j17041J2118
13655B82136L27402A97884J80243r6780L00343E7141L98272k26975K18595j27793
13645C19240J38850A79525K49471J13707a6452F00897a1022C38707J10613J1977
$$ plain form
13715 413773 572717 418380 617015 325281 581515 595312 331234 414203 633767 466483
13705 466483 589127 627681 504566 793379 632410 772398 732888 693127 612000 401162
13695 401162 355867 523314 101336 477161 618699 590585 254995 565383 432692 320545
13685 320545 686631 552377 520850 450503 444612 963522 427275 534109 586196 350652
13675 350652 435997 155276 358423 567375 526113 455860 317612 556073 777581 401183
13665 401183 258180 138773 540829 686259 384126 521644 525966 387059 270018 282136
13655 282136 609538 197884 378127 281347 581690 57141 455413 228438 447033 319240
13645 319240 458090 179525 428996 542703 -16452 600897 -11022 338707 449320 461297
13635D61297j62847Q1253e3672F32794l01725j18635K0338L89553H3651J92279
13625B75930p5071N75422l04441K5876A01502L90958P0948j34061j20595o6357
13615B42395L64387k25688J70050j48599J38071k25530R0235q8573o0031K12352
13605D69069r8421J92937k65557K15408M9094k70811K12672j78330q6619a4751
13594B02541L38380j23382j63694J04790N20j0139I0450b3518F50041B24647j10997
13583A13650J06579L31565P4664j87238D4864K22355j6141O1622p6552p1833K45273
13572D09588j55325E8440K34261Q1791F4397J04835P0668N2494j34951o2055M52236
13561E47624B02610K63951A29755J84504J11183j40090J07779J66570B76757O7343
$$ plain form
13635 461297 298450 379703 -53672 632794 331069 212434 232772 622325 83651 275930
13625 275930 200859 776281 471840 497716 101502 492460 563408 429347 308752 242395
13615 242395 606782 381094 551144 402545 540616 315086 405321 316748 256717 469069
13605 469069 370648 563585 298028 513436 562530 291719 504391 326061 239442 -14751
13594 202541 540921 417539 253845 358635 359155 349016 90450 -23518 650041 224647 113650
13583 113650 220229 551794 626458 439220 44864 267219 251078 312700 236148 164315 409588
13572 409588 254263 58440 292701 374492 64397 169232 239900 292394 157443 95388 547624
13561 547624 202610 466561 129755 314259 425442 285352 393131 559701 276757 344100
13551C44100A59090J42847J4566p7502F3813J62608J62607p4375M2138j6682j38864
13540B01245j2281K25961M8515P45j37828f6472C01554E3518J55897n0951M70461
13529F28925j25388j38432K09142B84832c4081D37458j09132E9279L64846q6153
13519C37972G7905k169J93521M52299j25711B40356H5236L15508A08055L53062
13509D61117E2733L21517k0383K2197j06982P635j21212K27388K20154B8132L45639
13498C73771p955l3594J21907P2680j84289K6782O4156j85428R990a72496I5999
13486B84416R8395A62831a27334I8484K31728J55951f678B22691j04021a19370
13475B91249M1930K1453p8588j08489K6568l6291N6784p2210K05398A49987J90698
$$ plain form
13551 344100 159090 301937 316503 239001 63813 226421 389028 314653 356791 340109 201245
13540 201245 188964 414925 463440 464185 326357 -66472 301554 53518 209415 158464 628925
13529 628925 503537 365105 574247 284832 -34081 437458 328326 59279 424125 337972
13519 337972 77905 75736 269257 721556 595845 240356 85236 400744 108055 461117
13509 461117 52733 374250 353867 376064 269082 276717 155505 382893 603047 28132 373771
13498 373771 365816 332222 454129 526809 342520 369302 433458 248030 258020 -172496 95999
13486 284416 382811 162831 -127334 98484 330212 486163 -6678 222691 118670 -119370
13475 291249 333179 354632 276044 167555 194123 157832 214616 142406 347804 149987 340685
13464C40685O8670J27718I7246P5088J5869J43148D9947L63039f607j37806L0992
13453a13421G1399b2395E54794A56461a1807A70799K72594A50547K12517M15082
13443G78146A18089J08824K15571a68331A13390L9096B6765J69792d2585A39560
13432D33661d4827A05675K1462J29620j8150K36551m1790j84309K39631j72646
13422C16044q3613J03168L2674p9379P5149F126J66210M07c0294B59966a13161
13410F0163R5789J71245f7799B93499l6646H0945j7151n542K82679j43801K45208
13399D42338j70615A08531K01990c8354l1006B62819j03844k4143K19680C4475
13388B18436F5428K21860J21037g7833B24837k1301P1372A04552J5530J48008
$$ plain form
13464 340685 409355 537073 97246 172334 188203 331351 49947 412986 -6607 -144413 -113421
13453 -113421 71399 -22395 554794 156461 -11807 170799 443393 150547 363064 778146
13443 778146 118089 226913 442484 -168331 113390 152486 26765 196557 -42585 139560
13432 433661 -44827 105675 127137 256757 238607 475158 433368 249059 488690 316044
13422 316044 232431 335599 368273 288894 364043 6126 172336 172743 -30294 259966 -113161
13410 60163 155952 327197 -67799 293499 256853 80945 63794 58252 340931 197130 442338
13399 442338 271723 108531 310521 -38354 -69360 262819 158975 134832 354512 34475
13388 218436 65428 287288 408325 -77833 224837 203536 274908 104552 120082 268090
13378B68090O0139A61224b6365B69287a0550E956L54186H1850K37211A22282J05025
13367B27307J92467I707L54503k8323n8207n3052J82848A69681K08129A2190K14922
13356B27112R9449J03655B01586k1028J485E6209J96672A6843P97753B70498Q9321
13345C59819K4373q0334L2540J80497H4262J42776b1579B77590f1435E33158A16999
13333D41482A14352K1349J66315j06911o5013a98275i013j712k0E38303C0033
13321C99907K2418j27234j00030J67317j21538L08096B31367b49747B87990O9626
13311C57616j74992p8381c9191A19667K29488O9297j56011C2687K72454A11547
13300D43235b8031E2266J7036Q2151Q6163c2204A37864O5197D815a84210G5563
$$ plain form
13378 268090 328229 161224 -26365 269287 -10550 5956 360142 81850 319061 122282 227307
13367 227307 419774 9707 364210 335887 277680 224628 407476 169681 377810 12190 227112
13356 227112 326561 430216 201586 180558 182043 56209 252881 16843 814596 270498 359819
13345 359819 384192 303858 336398 516895 84262 227038 -21579 277590 -61435 533158 116999
13333 441482 114352 135701 302016 195105 130092 -198275 -9013 -10725 -10745 538303 30033
13321 399907 422325 295091 195061 362378 240840 548936 231367 -249747 287990 357616
13311 357616 182624 104243 -39191 119667 349155 418452 262441 32687 305141 111547
13300 443235 -28031 52266 69302 151453 237616 -32204 137864 203061 4815 -184210 75563
13288B0737k403M8876k9804b0864k28917c7514A93563R7314A30414l2636J39419
13277B37197G2719J2486e5976H4062L994P3742a17613C76735j18199K36960A40143
13265C07896A12101g1467E5771f9415A60553J3963A6843K12631n1992J9367b4914
13253H5677a26380d3384l6754C195L07169A39596K23333k8313E024h712B00873
13241A59097N2054b30010C60684A30047n1810K45425D8760J37669B8405b68135
13230A78798L022C6746K43893K5480j42430G964K17404R0581a29078A1901J64323
13219A76224m4912g1635A89421b70322A06399J63735C4502K28976g6018B07058
13208f5830C20520A14094a80042f2089B66259g0624m724A03978D6719p791a79811
$$ plain form
13288 20737 18334 67210 37406 -20864 -249781 -37514 193563 290877 130414 97778 237197
13277 237197 72719 85205 -55976 84062 88056 161798 -117613 376735 258536 495496 140143
13265 307896 112101 -71467 55771 -69415 160553 174516 16843 229474 177482 196849 -24914
13253 85677 -126380 -43384 -80138 3195 310364 139596 362929 334616 5024 -8712 200873
13241 159097 211151 -230010 360684 130047 78237 323662 48760 186429 28405 -268135
13230 178798 181820 36746 280639 306119 163689 7964 225368 315949 -129078 11901 176224
13219 176224 131312 -71635 189421 -270322 106399 270134 34502 263478 -76018 207058
13208 -65830 320520 114094 -180042 -62089 266259 -70624 -75348 103978 46719 38928 -179811
13196E7011i7700C2653L07740B4891P0659b08637A67224A6970N1849N595J66401
13185B40815G7796l1992g32H7905e3700C65725a81923A63728J50707a30954D94957
13173C78718f0809C41539j38492l7529a14653j56784c9257H1163J9731J05753
13163B06647H0083J55565A7953O8562J70031A10682b53189E2904K56165a17426
13152A40159F9681h4422G7894a0102C60030c4696A3915a30970B57707H3105B0020
13140E9583j6817L05972d1594A72269l1277l9002J03712J22542k7250a29663I3547
13128b42874a11893A92130J27335h6269j46451A59415n7834K33326b07636B03332
13117B65447a7208B9762a4817j8359n2187k6734A43135n0892M6340D6324f4424
$$ plain form
13196 57011 -97700 32653 340393 24891 95550 -208637 167224 16970 68819 74414 240815
13185 240815 77796 45804 -732 87905 -53700 365725 -181923 163728 314435 -130954 494957
13173 378718 -60809 341539 203047 165518 -114653 -271437 -39257 81163 100894 206647
13163 206647 80083 235648 17953 86515 256546 110682 -253189 52904 309069 -117426
13152 140159 69681 -84422 77894 -10102 360030 -34696 13915 -130970 257707 83105 20020
13140 59583 42766 348738 -41594 172269 140992 101990 205702 328244 300994 -129663 93547
13128 -242874 -111893 192130 319465 -86269 -232720 159415 101581 334907 -207636 203332
13117 265447 -17208 29762 -14817 -33176 -85363 -112097 143135 92243 138583 46324 -64424
13105A29004b11870a2592C65153a2922l7926j87267f5430J3877k01048B75709
13094a84642c2481m5653j34252d5057A70850b2362B64613G3152a35576m7691B3805
13082C7345L2517b23369G7721d1482j83766A50629Q7558H5688b7333C17603a56270
13070b4091D01870j58785k709F2477L5581N452c0821B04292H8543K02010d4155
13058a36966I3063I263L34352B5671c1259D6704f1289B777K9748L13348A09499
13046G522c4156B49604e7891F5193J58409j6131g9517A38639a75653C90129a94227
13034C32729P3686q3018j22212r6811m0645B7157d6240D05559b9439B06643J39244
13023C45887b7940J1200F7927R2954M7255J31101k7233e2126A00897K39711f836
$$ plain form
13105 129004 -211870 -12592 365153 -12922 -50848 -238115 -65430 -51553 -252601 275709
13094 -184642 -32481 -78134 -212386 -45057 170850 -22362 264613 73152 -135576 -183267 23805
13082 37345 69862 -223369 77721 -41482 -225248 150629 238187 85688 -27333 317603 -156270
13070 -24091 401870 243085 240376 62477 98058 103510 -30821 204292 88543 290553 -44155
13058 -136966 93063 9263 343615 25671 -31259 46704 -61289 2777 32525 345873 109499
13046 7522 -34156 249604 -57891 65193 223602 207471 -79517 138639 -175653 390129 -194227
13034 332729 406415 323397 201185 104374 63729 27157 -46240 405559 -29439 206643 345887
13023 345887 -27940 -16740 67927 160881 208136 339237 312004 -52126 100897 340608 -6836
13011A54011F3953B37a5563A83186M1009a55873A85367G6454B0616O9986b54351
12999D136K49765i2625A32034e3765C38561m0089o0347m2680J01546E8642b38498
12987f8632b5232A94201J07371a67398c2410a3041B3818d7098m8693j29055A03583
12975A54588D6813b23724A58373r120n8961l6767M4737a6798H7459J05236o8821
12964A23874f9831A05608J07755r1678J25354A6679f087B1392Q0927h1541B28645
12952A88223A4624K38513A12022J71371d46280a35546A95756b5197l2923j37835
12942a95955D4295K07627b42686C11959A16347k2636J90532r8501n1638N2463
12932A86567A9464H402J30170l9703b8733D55258b14884B82051H9856b65520J22185
$$ plain form
13011 154011 63953 237 -15563 183186 224195 -155873 185367 76454 20616 90602 -254351
12999 4136 253901 -92625 132034 -53765 338561 298472 238125 195445 296991 58642 -238498
12987 -68632 -25232 194201 301572 -167398 -32410 -13041 23818 -47098 -95791 -224846 103583
12975 154588 46813 -223724 158373 149253 90292 53525 98262 -16798 87459 192695 123874
12964 123874 -69831 105608 213363 121685 247039 16679 -6087 21392 102319 -81541 228645
12952 188223 14624 253137 112022 283393 -446280 -135546 195756 -25197 -58120 -195955
12942 -195955 44295 251922 -242686 311959 116347 93711 284243 185742 134104 186567
12932 186567 19464 8402 138572 98869 -28733 455258 -214884 282051 89856 -265520 -143335
12921a43335l9988F3509g5077B82417a25314D6616b09459P6445f0093E9748L9269
12910I9017K26701b1004I1618c1053C92113D3779J45781L7507f6239F123a14754
12898b21708f817F853b58445I140K71457A08370l2276K68694j38277b18434Q7694
12887a30740A40474K50608b70016C09301B5553g3059G1889L693J43807G9837P4372
12876A54209K15606A76746J0470E9860b12j82135A41682e4757C63547j72575H2850
12864f8439j43726g0374j88185B88009H8720a3825k5717A96707A5451O3446b6080
12852C596O0135K36454F1970j9167M3309J19827K09987A31525B8478g4364D1562
12840A98426e4693k44090A85493F7844J97725a24553j79681A83833a07737F9376
$$ plain form
12921 -143335 -183323 63509 -75077 282417 -125314 46616 -209459 -133014 -60093 59748 99017
12910 99017 325718 -21004 91618 -31053 392113 43779 189560 227067 -66239 6123 -114754
12898 -221708 -6817 6853 -258445 9140 280597 108370 76094 344788 206511 -218434 -130740
12887 -130740 140474 391082 -270016 309301 25553 -73059 71889 75582 219389 79837 154209
12876 154209 369815 176746 187216 59860 -212 -182347 141682 -54757 363547 190972 82850
12864 -68439 -212165 -70374 -258559 288009 88720 -13825 -39542 196707 15451 78897 -26080
12852 3596 63731 300185 61970 42803 86112 205939 415926 131525 28478 -74364 41562
12840 198426 -54693 -298783 185493 67844 265569 -124553 -304234 183833 -107737 69376
12829B83628b32538k5381p4991I4654L08024a68722e3354j55029a8211l1345j83530
12818b33086E3416K5030b30866B90083j27129d2469E52692i0807r245A62333m616
12807A57717M9460c13307A9830a23572j00976d7698r3725c0196H3076B0064m443
12796A5621J03431K5472C1159a20121B87778c4546F0627N3005a12485B24354a11072
12784c25225C06802A34273F1948p525j2900L74379j47384O5451F0203M9029b07498
12772a12819A08457a18303A5671h7757r0081P4084e0102B2M713a60611A88129
12760A91151G1282j5787J18701K8293b77968A02685L18774a43445G5212a61096
12749a04936O328o2436B15948m4753f16A13052K65049c88971i3189B44630e6220
$$ plain form
12829 283628 -232538 -257919 -332910 94654 402678 -168722 -53354 -208383 -18211 -49556 -233086
12818 -233086 53416 78446 -230866 290083 162954 -42469 552692 -90807 -100052 162333 157717
12807 157717 207177 -313307 19830 -123572 -224548 -47698 -141423 -30196 83076 20064 15621
12796 15621 119052 144524 31159 -120121 287778 -34546 60627 113632 -112485 224354 -111072
12784 -325225 306802 134273 61948 54423 41523 415902 268518 333969 60203 109232 -207498
12772 -112819 108457 -118303 15671 -87757 -177838 -103754 -50102 22 4735 -160611 188129
12760 191151 71282 55495 174196 202489 -277968 102685 421459 -143445 75212 -161096
12749 -104936 -98608 -161044 215948 171195 -616 113052 378101 -388971 -93189 244630 -56220
12737B14680A03963i6495E6976A0515J50765b12241h1508A4410a7904B87292b03692
12725f5333I9765K06105H047M7543a39160A78688d1469H9955d7125E1400a0651
12713b3892J0126B3827P543R8278R9357j10139J34614A4466a9636A51770J37939
12702B89709g7218P400A72111R2241G0884e8724I7093B854a63022F0321g8397
12690B75682d6358A35455a14200A63722e7886l6791C2876N4513C4780K47691a58558
12678A82185k9806f8695B00482E7449L43181A67829b10471R2856D6057A1644J44077
12667A55721c80155B53918f6698I1461Q5551L60919I3653O2154O2056q2792C6015
12655D6939P7643c10274I1932J64956G0572e2687A62701g9969B39276F7337M23038
$$ plain form
12737 214680 103963 -96495 56976 10515 161280 -212241 -81508 14410 -17904 287292 -203692
12725 -65333 99765 305870 8047 55590 -139160 178688 -41469 89955 -47125 51400 -10651
12713 -23892 -13766 23827 31370 129648 229005 118866 253480 14466 -19636 151770 289709
12702 289709 -77218 -69818 172111 264352 70884 -58724 97093 2854 -163022 60321 -78397
12690 275682 -46358 135455 -114200 163722 -57886 -94677 32876 87389 34780 282471 -158558
12678 182185 152379 -68695 200482 57449 400630 167829 -210471 -117615 46057 11644 155721
12667 155721 -380155 253918 -66698 91461 177012 537931 93653 155807 217863 135071 36015
12655 46939 124582 -310274 91932 256888 70572 -52687 162701 -79969 239276 67337 490375
12644D90375G7590e7335j22041A45673g6798A30355J11793k7695A0483J0273J89695
12633B10451N1841K6119A09979M4329D3095M9951J29232C7871a05800B56314j24038
12622A32276J5752Q8697K09177h1825B34501a61562B13601I2221I026J2291L78018
12611C99335D0525j756i9619o1962B41097R7255A15023K53548A14530e250C45765
12599C40006e1656A35072j2326d0078m0710L2296J326A2330J13834m9295P2827
12588A49696a03682a2871C2580L02027J2399B9543O2020a02049k14521a23075
12577a15147j6314A99150O3192E5522c5699A80616c9702B85246i8897A35517B5662
12565C5592K3984b30488C80963c7605q4679b1193F056K55062B0536c0721k52033
$$ plain form
12644 490375 77590 -57335 -179376 145673 -76798 130355 242148 214453 10483 20756 210451
12633 210451 262292 288411 109979 154308 43095 93046 222278 37871 -105800 256314 132276
12622 132276 148028 236725 445902 -81825 234501 -161562 213601 92221 9026 21317 399335
12611 399335 40525 38769 -99619 -161581 241097 338352 115023 368571 114530 -5250 345765
12599 340006 -51656 135072 122746 -40078 -80788 -48492 -47166 12330 126164 76869 149696
12588 149696 -103682 -12871 32580 334607 347006 29543 91563 -102049 -316570 -123075
12577 -115147 -131461 199150 262342 55522 -35699 180616 -39702 285246 -98897 135517 25662
12565 35592 59576 -230488 380963 -37605 -122284 -21193 6056 261118 20536 -30721 -282754
12554b82754B70858Q6421i6633D5785K24309d0809j6066B03697h5942A79653n7584
12543A22069N2256G813L3610j1393M2278g625k84707A4129L4939l344e5860B80983
12530c2681A74106A0781J69145N3811G597K57143J3215j28583B2366f4147f922
12518E10328d6520A06460O5922A5858O1308c5499B31308j608b89644J39753A31089
12506C6809P9541a68848H849b9902j90148o4371C1127L8336J78379d2396A39667
12494a22917l0731A73782a08310A37475P5514a90280b2508A07493i1923G6894
12483a0299A86425O8594j08569Q0806h2252P390m0413B15172b54996E4758c88744
12471a56284A15932E1770M9055b41211O5860f7108A8487L68440a58125e5531A6543
$$ plain form
12554 -282754 270858 357279 -96633 45785 270094 -40809 -56875 203697 -85942 179653 122069
12543 122069 174325 7813 41423 30030 72308 -7625 -292332 14129 49068 45724 -55860 280983
12530 -32681 174106 10781 179926 233737 7597 264740 277955 149372 22366 -64147 -6922
12518 510328 -46520 106460 172382 15858 77166 -35499 231308 229700 -289644 -149891 131089
12506 36809 116350 -168848 8849 -29902 -220050 -284421 31127 69463 247842 -42396 139667
12494 -122917 -153648 173782 -108310 137475 212989 -190280 -22508 107493 -91923 76894
12483 -10299 186425 255019 146450 227256 -82252 -74862 -115275 215172 -254996 54758 -388744
12471 -156284 115932 51770 100825 -241211 -175351 -67108 18487 386927 -158125 -55531 16543
12459A8066i251m1834H996a5425k85648D0935h4995l6858a1717n0469B4074P9033
12447A03107j1766O1128l8376J04684H1679a27457j15369F111c85731B6107L6656
12436F2763d1776I7845K7687b85770J16673A55252b27795R2232A26024a19604
12425c2550r8386j24696E3047a92760K6747I8407K55426a33088A26555r161n8255
12414E9139c3936k13541A27246i6182A09554b30558n72c3409j48006A1045b60774
12402c79687G470b37909A90745q1850g4521H0453q212g1833A16575a68240B69212
12390d31228h3777k82918A60391a89883m2118N2699c4865D01380i8673C67041
12379F9819b44230M4547j14104B27064a78792g7130b9893A50320a23209B26737
$$ plain form
12459 18066 -9251 -51085 8996 -15425 -301073 40935 -84995 -121853 -11717 -62186 24074 103107
12447 103107 91341 152469 114093 218777 81679 -127457 -242826 6111 -385731 26107 62763
12436 62763 -41776 97845 125532 -285770 -169097 155252 -227795 -135563 126024 -119604
12425 -32550 -130936 -255632 53047 -192760 -166013 98407 353833 -133088 126555 117394 59139
12414 59139 -33936 -247477 127246 -96182 109554 -230558 -231130 -33409 -181415 11045 -260774
12402 -379687 7470 -237909 190745 108895 -74521 80453 72241 -71833 116575 -168240 269212
12390 -431228 -83777 -366695 160391 -189883 -232001 -179302 -34865 401380 -98673 367041
12379 69819 -244230 -199683 -313787 227064 -178792 -77130 -29893 150320 -123209 226737
12368B3071a09936i535l25897a5651k95657A42960c0798m7289B45817a67695f619
12356H9735N1374h6931r2253H7004c69966B48568A2442K22986b68441C9698K07827
12345B47525q781j11548D5639E929c53819G4375c0515r7093M5396C00871G9211
12333B24850a92582L0600N3945D7715L1537j8962g924o7974A03550a47128D7344
12321B40118b955C78029l7866j33097f0556K1318l8274I6116G999e9008a1238
12309a56688M8460j65941a8654k78457C6388n121K42838B839J52037m1726j1214
12298A01936a92395A30879a45117A04338l0209a33599A37732K16382G3002J82915
12288B55917C8369P5429k4718m4185b02309d3311J1353I648D753a2305H5864a23278
$$ plain form
12368 23071 -109936 -9535 -335432 -15651 -311308 142960 -30798 -78087 245817 -167695 -6619
12356 89735 141109 -86931 -179184 87004 -369966 248568 12442 235428 -268441 39698 247525
12345 247525 238744 127196 45639 5929 -353819 74375 -30515 -127608 -82212 300871 79211
12333 224850 -192582 -161982 -108037 47715 79252 60290 -7924 -75898 103550 -147128 47344
12321 240118 -2955 378029 340163 207066 -60556 -39238 -77512 96116 7999 -59008 -11238
12309 -156688 -108228 -274169 -18654 -297111 36388 31267 274105 2839 154876 113150 101936
12298 101936 -192395 130879 -145117 104338 74129 -133599 137732 354114 73002 255917
12288 255917 38369 113798 89080 44895 -202309 -43311 -31958 9648 4753 -12305 85864 -123278
12275E4612G744N2034Q1561L24287g8254C09843A16217J48036A31285R879g9977
12263A18263b09815C1580a26485l4971A92376i4910C14168r2119j0700g3551B63550
12251d0870A18198N1697d4404A20761E9119L725c36118h6405B17632A7726a30747
12239C18556I0634K92566j67401p9448O7973R9757C4438N4329a01612A10317L3714
12228A44031J15934j2604J21364A59223J58676H4681C7291K9769J06802Q9047
12218B62909Q7847A69908J10445j29763n7131J74734A17991C7564a36549B26369
12207A12977D7673a62405B37390M8314Q2752H1731K40835L9150q2333b4281F4824
12195C79260k7826J19084j68398m1762E5751M17982F7487M94109a7888C87148
$$ plain form
12275 54612 7744 59778 141339 465626 -78254 309843 116217 264253 131285 141164 -79977
12263 118263 -209815 31580 -126485 -161456 192376 -94910 314168 222049 211349 -73551 263550
12251 -40870 118198 169895 -44404 120761 59119 62844 -336118 -86405 217632 17726 -130747
12239 318556 90634 383200 215799 136351 204324 304081 34438 88767 -101612 110317 144031
12228 144031 259965 247361 368725 159223 317899 84681 37291 67060 173862 262909
12218 262909 350756 169908 280353 150590 93459 268193 117991 37564 -136549 226369
12207 112977 47673 -162405 237390 285704 368456 81731 322566 361716 279383 -24281 64824
12195 379260 351434 470518 302120 260358 55751 473733 67487 561596 -17888 387148
12184a09376E0559k4977N6496k1334J97630B8801P3190J38295B16J08358M47825
12173E56399A73249M0449L2039o6440K08496d5654D35566H8430a58726I7582h119
12161a3532B42964B5441L535O5358C8133J22934J6182e8354j6118H1783a71305
12149a57031A65498b6249j64472B63079A2214b00757A42185a23853G1923N6970
12139A28893J28004k87b14466A57442g927q7407d7221j34409i182B26318a38902
12127a83084f9767J1779j69248D8925a52251L6378K2420A16226a55186C5932a51816
12115a55013I9307b1802A40134A4335K52701a27798A1766L66977n8583h9772G3797
12103C3705D714A596b7162C85787a17856C69868B7886b76744E2397J31750J3201
$$ plain form
12184 -109376 50559 25582 82078 60744 258374 28801 101991 240286 216 108574 556399
12173 556399 173249 213698 245737 179297 387793 -45654 435566 88430 -158726 97582 -8119
12161 -13532 242964 25441 28976 94334 38133 161067 177249 -58354 -74472 81783 -171305
12149 -157031 165498 -26249 -190721 263079 12214 -200757 142185 -123853 71923 128893
12139 128893 256897 256610 -214466 157442 -7927 -95334 -47221 -181630 -9182 226318 -138902
12127 -183084 -69767 -57988 -227236 48925 -152251 -115873 -93453 116226 -155186 35932 -151816
12115 -155013 99307 -21802 140134 14335 267036 -127798 11766 378743 320160 -89772 73797
12103 33705 4714 1596 -27162 385787 -117856 369868 27886 -276744 52397 184147 197348
12092A97348c6773k35667A30329a52429N7356I3199a72482a6126A6503J60059
12082A76562B0910a08563G5713a23079O0787a5804j14791D91381J669340I53177
12071C93899Q9751D8181N5717N0684O7042F1751J79552I7238a20304L5455A36628
12059h2897C94722c26394B56834A21511c07972b7943a601B57973b65686B94370
12048a71703d6853j55822J5083n8905E1213N7324a13902c5435r6296p3389o9101
12037b74221J7245i8339B79962b1968I3251d3555A20637e2901m800r5038j47221
12026b99960B12048o9102b69896a19805A95140E3650K0636K7042l5496a21096
12015B7271b00562b7951E5423i1547M73A63395e7479j28617f962k44242O4412
$$ plain form
12092 197348 -36773 -272440 130329 -152429 -95073 93199 -172482 -16126 16503 176562
12082 176562 20910 -108563 75713 -123079 -62292 -15804 -130595 491381 2160721 953177
12071 393899 483650 48181 103898 154582 221624 61751 241303 97238 -120304 -84849 136628
12059 -82897 394722 -326394 256834 121511 -307972 -27943 -1601 257973 -265686 294370
12048 -171703 -46853 -202675 -187592 -246497 51213 108537 -113902 -35435 -131731 -205120 -274221
12037 -274221 -256976 -98339 279962 -21968 93251 -43555 120637 -52901 -57701 -152739 -299960
12026 -299960 212048 142946 -269896 -119805 195140 53650 74286 101328 65832 -121096
12015 27271 -200562 -27951 55423 -91547 -91074 163395 -57479 -186096 -6962 -251204 -186792
12004a86792B83J81580K0718b05669A47852a84200F1655a42747j77075d6024j46396
11993a92420G7563a11762G3285M5022a44597A20048C2945b53093A94811b9939
11982F6022a27531e9483m6272q344a495o5551j93749C4693M6040g5026r0676A62181
11969e4957J6381p8093K7079A48748M3412c23195f0891A14214J90882E2131E946
11957C9570P849K93141B2354e1523a0392j74464b6896r7399e598A6194b13664
11945F8644K23756B2526J31686L9336a15996d9346j00129d1087k62779e499o7912
11934g3411l5128n2274j8090b1360k57423A28014P624h8755k2710B72332J8135
11923B90467A03068g7206j91603J09081g6044A73215C4372J82156a55730B14622
$$ plain form
12004 -186792 283 181863 202581 -205669 147852 -184200 61655 -142747 -319822 -46024 -192420
11993 -192420 77563 -111762 73285 118307 -144597 120048 32945 -253093 194811 -29939
11982 66022 -127531 -59483 -105755 -114099 -1495 -67046 -260795 34693 80733 -75026 -165702 162181
11969 -54957 -38576 -116669 -89590 148748 192160 -323195 -60891 114214 305096 52131 5946
11957 39570 47419 340560 22354 -51523 -10392 -184856 -26896 -124295 -5598 16194 -213664
11945 68644 292400 22526 154212 193548 -115996 -49346 -149475 -41087 -303866 -5499 -73411
11934 -73411 -108539 -160813 -178903 -21360 -278783 128014 135638 -88755 -111465 272332 290467
11923 290467 103068 -77206 -268809 -159728 -76044 173215 34372 216528 -155730 214622
11912a51926A15724P4189M392a88260j90889I4921a62627d8779C75950A53746
11901c3944k8840F2419d3040B54381D9919J99929c65967m9934A58848A0370b74914
11889g173A3850a34693G6644f3380k16703A87929i9030B74640j20349D0563O3789
11878A04352g4627A84429L7283d07886J55262A46398a13833o7052l3386K2989
11868a91282G0017b46280M3912c6308A86593a93149j54131B33412a72283h1492
11857B94812b20373A92232b52290a16506G8019f2046B72951e352j90119K1228
11847a74243K5414P1631k21820M5886i3191A29361L1986b66154B8835d7029p2547
11836a19576d7481b0442j58495A85932l7331b8821p101n5308M2070B44377j00476
$$ plain form
11912 -151926 115724 189913 194305 -188260 -379149 94921 -162627 -48779 375950 153746
11901 -33944 -62784 62419 -43040 254381 49919 249848 -365967 -415901 158848 10370 -274914
11889 -7173 13850 -134693 76644 -63380 -280083 187929 -99030 274640 154291 40563 104352
11878 104352 -74627 184429 221712 -407886 -252624 146398 -113833 -180885 -214271 -191282
11868 -191282 70017 -246280 -202368 -36308 186593 -193149 -347280 233412 -172283 -81492
11857 294812 -220373 192232 -252290 -116506 78019 -62046 272951 -5352 -195471 -174243
11847 -174243 -148829 -77198 -299018 -253132 -93191 129361 161347 -266154 28835 -47029 -119576
11836 -119576 -47481 -20442 -178937 185932 148601 -28821 -35922 -91230 -49160 244377 143901
11825A43901a53896B7178c43734G5626J03585f9011a9903j23891F2678c2325A92287
11813b31320h7708a3330k29455A07656D5431m15b24499N3039r8704B11788L3989
11802B45777I84i3927B8443K8231c543k5354r0318I3980b07200b9185A87164a83420
11789f8141H2118b58254J05067K3933Q832M096m8762m7845C0611i4002c3800C8949
11776C6464N8032C9454J2087j1119J5934a77682A29793L1560L8212b80733B09962
11764G3213J46269n3428a18228A09010k9352J16893C9251J24664E759b43234A57019
11752b0065k38108B7881d08287d1684E7507J08543c47269B79489L6317I8232j938
11741I6294L8262a39935A17833c42824A12937h8239A93044H0083b35074c2758
$$ plain form
11825 143901 -153896 27178 -343734 75626 179211 -69011 -19903 -143794 62678 -32325 192287
11813 -231320 -87708 -13330 -242785 107656 45431 45016 -224499 -171460 -270164 211788 245777
11802 245777 984 -93927 28443 56674 -3543 -28897 -119215 93980 -207200 -29185 187164 -183420
11789 -68141 82118 -258254 -153187 -129254 -120422 -116326 -165088 -212933 30611 -94002 -33800 38949
11776 36464 94496 39454 51541 40422 56356 -177682 129793 161353 199565 -280733 209962
11764 73213 219482 166054 -118228 109010 79658 196551 39251 163915 5759 -243234 157019
11752 -20065 -258173 27881 -408287 -41684 57507 166050 -347269 279489 315806 98232 96294
11741 96294 134556 -139935 117833 -342824 112937 -88239 193044 80083 -235074 -32758
11730A50210C379b34552A5493e5311n0079j35003d8108A97441E7118e4151A26681
11718c5608o3089M0997A56414a51179q5623D8175J02853n2587g4798k2102B4805
11706B51325A01839J44901j2919A13393e5225K6074A20983d7289C7352b81964
11695H2427b36388D0832h7636G5656M06504k29115B9656a03973j9365L2918l2343
11684a22763p3789j15276a21656C3793R2534b8755A3395b29211A35192b71143
11673e359D51616A33358J48455p9428Q5099c7277D08489A42000a16455L9762A22139
11661g1992b8267H9859m1680N8713A0171L6066a35446B90558o2154q3769E5612
11649e8632A15969c41813A25143i7234A05210a19876c8990B5702a96097A76837
$$ plain form
11730 150210 3379 -234552 15493 -55311 -105390 -240393 -48108 197441 57118 -54151 126681
11718 -35608 -98697 -57700 156414 -151179 -236802 48175 151028 98441 -74798 -96900 24805
11706 251325 101839 246740 233821 113393 -55225 -29151 120983 -47289 37352 -281964
11695 82427 -236388 40832 -87636 75656 482160 253045 29656 -103973 -123338 -90420 -122763
11684 -122763 -196552 -311828 -121656 33793 126327 -28755 13395 -229211 135192 -271143
11673 -5359 451616 133358 281813 202385 287484 -37277 408489 142000 -116455 -76693 122139
11661 -71992 -28267 89859 48179 106892 10171 46237 -135446 290558 228404 144635 55612
11649 -58632 115969 -341813 125143 -97234 105210 -119876 -38990 25702 -196097 176837
11638A47109r351b92983Q9187A92526c1401A50739c4773A7623b39138O3132A51392
11626G0004k9999J66589i2026D9244a29707b7427D3342a45088M4672A79218r325
11615A69893a09714C4090a38776o4827b8283j53579D5737a60801A35468a32432
11604B1601N1876b10768M3372h1744g096p49G3334C2195a05501J7403B25339a90480
11591b9025C46150a826A16053J16776E7742b03737A36694a33502D6290A7874b6581
11579C8273a38594L45A31997L537a36601B08415D6299J30889G2859J48303f5757
11567B35227L51053h3072G0609a02329M1494H5657d9244j34010c2334m2632p6431
11556a51397L0524A48884a57076G4326j4858J56740a10884A04990c5606B20393
$$ plain form
11638 147109 137758 -292983 -203796 192526 -31401 150739 -34773 17623 -239138 -176006 151392
11626 70004 40005 206594 -92026 49244 -129707 -27427 43342 -145088 -100416 179218 169893
11615 169893 -109714 34090 -138776 -203603 -28283 -181862 45737 -160801 135468 -132432
11604 21601 73477 -210768 -167396 -81744 -7096 -7845 73334 32195 -105501 -88098 225339 -190480
11591 -29025 346150 -1826 116053 232829 57742 -203737 136694 -133502 46290 17874 -26581
11579 38273 -138594 -138249 131997 135534 -136601 208415 46299 177188 72859 221162 -65757
11567 235227 586280 -83072 70609 -102329 -60835 85657 -49244 -183254 -32334 -74966 -151397
11556 -151397 -120873 148884 -157076 74326 59468 216208 -110884 104990 -35606 220393
11545B9447L58659f0716A71872O0940D8253L58924a4133A72556J45889A07932
11534A16129b05438R5210B28735j09022M9399E152R2225b13635J00503B06129
11523A37074d7955B42784a08815D2058J30940L7922a5251A88270A4663L89192
11513D03855b33802a9846C67181A10795M1579R9763B9607K24836B159J1697b5001
11501C638a23014B09708L33268a37324j18030B78455c31992A72456n8259a18128
11490B80084o2084I4468J48489j9392l7870J90050J51911i5173D83629q5211H7234
11478A97948C1984K73536m4094b8640j32068n4119A44349o347L19495a2938B432
11466a76440l3752B72741a99463A74824n5038B1926J37989C6516e08196i5128
$$ plain form
11545 29447 388106 -60716 171872 232812 48253 407177 -14133 172556 318445 107932
11534 116129 -205438 -110228 228735 119713 169112 5152 97377 -213635 -113132 206129
11523 137074 -47955 242784 -108815 42058 172998 210920 -15251 188270 14663 403855
11513 403855 -233802 -19846 367181 110795 152374 252137 29607 254443 2159 13856 -25001
11501 3638 -123014 209708 542976 -137324 -255354 278455 -331992 172456 114197 -118128
11490 280084 218000 94468 242957 223565 185695 375745 527656 -95173 483629 398418 87234
11478 197948 31984 305520 261426 -28640 -160708 -214827 144349 138002 457497 -12938 2432
11466 -176440 -210192 272741 -199463 174824 119786 21926 159915 36516 -508196 -95128
11455A40606j5972A6277a63537E1499L7452c3699m5754I1501b3671n6852L8936
11444d1587r8868f8030n9947I9266K82101G5858e4280B21304D5263a68376B41189
11432A94965m838K76075c67899A8875M5804J47624F4753O5510E681e198I4875
11420B99793a53002G9530i0105A24223a43356C15594C2347b21450c5156l81527
11410d16683A62366o0830k0207a37846A81587a7731D34124A64136n4580K81053
11400C90609I0902d28658J06708a49821A66962p1448J00465a6236C1529a0665
11389G6123O3992b38769O7840o7190O298G6828J64679c65684B89225e0572B41724
11377a74296I1574L49930E1171b1529D13114b61997d0926A83867b62063f6897
$$ plain form
11455 140606 124634 16277 -163537 51499 88951 -33699 -79453 91501 -23671 -80523 -41587
11444 -41587 -140455 -68030 -127977 99266 381367 75858 -54280 221304 45263 -168376 241189
11432 194965 190127 466202 -367899 18875 64679 212303 64753 130263 5681 -5198 94875
11420 299793 -153002 79530 -90105 124223 -143356 315594 32347 -221450 -35156 -416683
11410 -416683 162366 101536 81329 -137846 181587 -17731 434124 164136 109556 390609
11400 390609 90902 -428658 -321950 -149821 166962 95514 195979 -16236 31529 -10665
11389 76123 140115 -238769 -170929 -238119 -231821 76828 241507 -365684 289225 -50572 241724
11377 -174296 91574 441504 51171 -21529 413114 -261997 -40926 183867 -262063 -66897
11366b0150B23630a04184j39825H5538b24333A01755a05338B08817o0630h7859
11355D1062a2934j53065J2278H941J54343a63951i108q6886L6060E2227a88688
11343C43147b36492h470r0575A01626a32610b3429r7486c0831m0782j71008B9551
11331B339b60825A19681b2877j20604L0151J580A7647K8501J53013D8582O4564
11320A13146f0826F5159f9716I7343c582B55307g6056K4280C01289I0762o510
11309H4252N5350h638I0438m1041B0377e0386k8019A40426M4053n5703d4157o6434
11297a10591J9593q9786e5002k06316e5499j38199C0853L6361c02914A6944L15539
11286C32483e2313A90158o6836d4375j47477C13895E3169K4120b13587B63233
$$ plain form
11366 -20150 223630 -104184 -244009 85538 -224333 101755 -105338 208817 148187 -87859
11355 41062 -12934 -165999 -153721 8941 163284 -163951 -9108 -95994 -59934 52227 -188688
11343 343147 -236492 -8470 -99045 101626 -132610 -23429 -120915 -30831 -71613 -242621 29551
11331 2339 -260825 119681 -22877 -143481 -113330 -111750 17647 46148 199161 48582 113146
11320 113146 -60826 65159 -69716 97343 -3582 255307 -76056 -51776 301289 90762 84252
11309 84252 139602 -8638 90438 49397 20377 -50386 -78405 140426 184479 128776 -44157 -110591
11297 -110591 -90998 -180784 -55002 -261318 -55499 -193698 30853 67214 -302914 16944 332483
11286 332483 -52313 190158 123322 -44375 -191852 313895 53169 77289 -213587 263233
11275A52797J9157c34353G6362b00403K6993A1373J32856M35705H6162f233j4042
11264b0275l19025B22484a14560H5327K49J2142f2281j3505a8713j44874j10594
11253b74181i3758q6155h2041A16431a86844m7955A12375a79852j59320L2249
11243c06923i1541B77670a47632L6952j1718A13065K48316b55651A00298b68706
11232a82086m9197A49918a62780f2151j85101A03584J77977A3463P6970K39289
11222C29722b7609j71702f5332D41155a02967I4340Q6048a4322A02951K30663
11212C33614b42861C3011F003b18628A1410a50382A0502J18818O2267G3745g3483
11200B53996a75455j05563h7712H9852a43145I6557b4736j39965B22493a95555
$$ plain form
11275 152797 171954 -334353 76362 -200403 -173410 11373 144229 579934 86162 -6233 -20275
11264 -20275 -339300 222484 -114560 85327 85576 97718 -62281 -75786 -18713 -163587 -274181
11253 -274181 -93758 -179913 -82041 116431 -186844 -234799 112375 -179852 -339172 -306923
11243 -306923 -91541 277670 -147632 -110680 -122398 113065 361381 -255651 100298 -268706
11232 -182086 -231283 149918 -162780 -62151 -247252 103584 281561 13463 90433 329722
11222 329722 -27609 -199311 -65332 441155 -102967 94340 180388 -14322 102951 333614
11212 333614 -242861 33011 6003 -218628 11410 -150382 10502 129320 191587 73745 -73483
11200 253996 -175455 -281018 -87712 89852 -143145 96557 -24736 -164701 222493 -195555
11189d4635l22138A632f2249j96205B75749h62p5842j7915C3210J13587n7975
11178H8822J41272F6033n506J35634m7424a00543C8011L7157B5150Q8111b92993
11166c31229J02896I3944K4013a5034k9556H5497a07483K3381J7901J9963C19969
11154A89949B5412b07049A08844E3552r578A1579a09283K7159A27094b24753A56222
11142a0374B58542C3546K63132B776N0787b10198e8535B29962b09472A44955d788
11130A50074a8354j13457A58801d88253E9330b01197C75448i609j78852M9799
11120a38662A39829n0461l4493a21248A01964P4931a1508D00377a68547E022K39225
11109B44247j03037b55816A86228c9123j8090E9316J80390J12162j13659C4640
$$ plain form
11189 -44635 -366773 1632 -62249 -258454 275749 -862 -76704 -94619 33210 146797 88822
11178 88822 230094 66033 60527 196161 148737 -100543 38011 75168 25150 113261 -292993
11166 -331229 -228333 93944 117957 -15034 -44590 85497 -107483 -84102 -66201 -46238 319969
11154 189949 25412 -207049 108844 53552 43974 11579 -109283 -82124 127094 -224753 156222
11142 -10374 258542 33546 296678 2776 53563 -210198 -58535 229962 -209472 144955 -4788
11130 150074 -18354 -131811 158801 -488253 59330 -201197 375448 -9609 -188461 -138662
11120 -138662 139829 89368 54875 -121248 101964 176895 -11508 400377 -168547 5022 244247
11109 244247 141210 -255816 186228 -39123 -57213 59316 239706 351868 238209 34640
11098B11997K54878B05163a89245A81948E0808c21203B38003F2311l45K49131
11088C11097M4190j46361L53472k29117K06996D3695M21282j63489H2203J91677
11078B73880N1099j32311K66138r2812J3136j18165p3698f731C52299A53732L29285
11067D83017j0241A67885J82425K4408A82998K25037K9341J05351H3076N87181
11057F70257J41778k52884P1364l7603K20059N0833R8984j3699k57171M1729J60941
11046H94588J55462m85473K33552j31288L86772k97934k01357L83702l55536K74851
11036H57339M8135n8968C30900O26584n5434Q2826j51366k37098J36274K6652
11026G59338j80822M22592j34550K23166E12056K65350l61892K21349l9195J14527
$$ plain form
11098 211997 466875 205163 -189245 181948 50808 -321203 238003 62311 61966 311097
11088 311097 355287 208926 562398 333281 540277 43695 464977 301488 82203 273880
11078 273880 324979 192668 458806 365994 379130 260965 187267 -6731 352299 153732 483017
11067 483017 472776 167885 350310 374718 182998 408035 437376 542727 83076 670257
11057 670257 812035 559151 630515 592912 812971 863804 962788 949089 691918 733647 894588
11046 894588 1050050 564577 798129 666841 1053613 755679 554322 938024 582488 857339
11036 857339 905474 846506 330900 957484 902050 984876 833510 596412 732686 759338
11026 759338 578516 1001108 866558 1089724 512056 777406 415514 636863 597668 712195
11016G12195N5335k67711N4456j372J5075M44178k65810M1136R892k27927J28867
11005F98314q1637J07428M4271O672Q4391k55813L02647n4860j58039L17630m15896
10994E95108K23694K03426n9023l18893M2675q3436J1762J96836K01092l7414
10984I75827k71658L64097J16927J0361J56728J75403R1637K85212R351M34464
10974B348349K75923K89078K10597L84457j54556j21631l33428m41597R986o35930
10964A831248l36691K9870j55362K14472j0586O7185j26953n6949m4558j03156
10954A308520J84585n94037J63387o2881j99183C90253j32212L14792k08374m8117
10944C16342g9190B55668F4081P2265k0697J93665L6583a27698A8319h6781C45154
$$ plain form
11016 712195 767530 499819 554275 552903 567978 1012156 746346 787482 797374 569447 698314
11005 698314 616677 724105 768376 775048 859439 603626 906273 851413 693374 1011004 595108
10994 595108 818802 1022228 963205 644312 686987 603551 615313 812149 1013241 975827
10984 975827 704169 1068266 1185193 1195554 1352282 1527685 1619322 1904534 1913885 2348349
10974 2348349 2624272 2913350 3123947 3508404 3353848 3232217 2898789 2457192 2467178 1831248
10964 1831248 1494557 1524427 1369065 1583537 1572951 1640136 1513183 1456234 1411676 1308520
10954 1308520 1493105 899068 1062455 999574 800391 390253 258041 572833 364459 316342
10944 316342 -79190 255668 64081 136346 115649 309314 345897 -127698 18319 -86781 345154
10932a799B33790m4367m0712n0469a59837K8262A6995J36956p0728K6510a92253
10920d8311b958k75557a27454D44L10100A01650Q0151i0739F8514e0223j30039
10909a80262G123J07528R3836b24706M2440O687A09387P8333F647a6759j28659
10898a45418f4944B16381H7210C8341g1605p4210e4697j2934p2635F4963a77990
10886c61315A96549b87660J01498Q2389A1308D109a3699A80867b25512J04591
10876a20921F3247g1630D5985c30655c0661B18942c53696D2116b84974a41853
10865D2043f7741A13759a61236M9721F9328a01616l09167i6514G8778c62565A53838
10853b49141b8349a0769A15118J71048A12920R6023o4050a33196b5663j1315o5798
$$ plain form
10932 -1799 233790 189423 148711 98242 -159837 -131575 16995 153951 83223 109733 -192253
10920 -48311 -2958 -278515 -127454 444 310544 101650 181801 -90739 68514 -50223 -180262
10909 -180262 7123 114651 208487 -224706 -182266 -175579 109387 187720 6647 -16759 -145418
10898 -145418 -64944 216381 87210 38341 -71605 -145815 -54697 -67631 -140266 64963 -177990
10886 -361315 196549 -287660 -186162 -103773 11308 4109 -13699 180867 -225512 -120921
10876 -120921 63247 -71630 45985 -330655 -30661 218942 -353696 42116 -284974 -141853
10865 42043 -67741 113759 -161236 -111515 69328 -101616 -410783 -96514 78778 -362565 153838
10853 -249141 -28349 -10769 115118 286166 112920 208943 144893 -133196 -25663 -36978 -102776
10842a02776R556A34305a22276q188j91206D8298j4887J80052c094k65398e1521
10830a36790A13014a32072F751K08499a82033Q7238P635j2005A25571D0348J71688
10819B12036c5022j1762D1921f5152B52023H5635J04925C7594d4436C4946J50690
10808A85636a99716h794A78116c5674A4865b2977k38581l8620P3987C02544A41617
10796b12495d613j53554P8390A64485B7944n430a98701A76747q0852C3111i5340
10784E21711f4976A89523a66202g3204a3016C15407e9259A09158D9888c76499
10773a24831A33101l8512L97525A55848c25288i9472o4245r858q9861h6219j71867
10762b58086l3270F3396b60143A74684O9254i2901j36251J06541k61489A82653
$$ plain form
10842 -102776 -93220 134305 -122276 -130464 -321670 48298 33411 213463 -3094 -268492 -51521
10830 -136790 113014 -132072 6751 215250 -182033 -94795 -87160 -99165 125571 40348 212036
10819 212036 -35022 -46784 41921 -65152 252023 85635 190560 37594 -44436 34946 185636
10808 185636 -199716 -8794 178116 -35674 14865 -22977 -261558 -300178 -226191 302544 141617
10796 -212495 -4613 -158167 -79777 164485 27944 22514 -198701 176747 95895 33111 -95340
10784 521711 -64976 189523 -166202 -73204 -13016 315407 -59259 109158 49888 -376499
10773 -124831 133101 94589 492114 155848 -325288 -99472 -163717 -173575 -263436 -86219 -258086
10762 -258086 -291356 63396 -260143 174684 243938 -92901 -229152 -122611 -384100 182653
10751C22448b13433A03610J07592n8286E6826a86432j77949b9079l943o542B11208
10739A0224a28127q9306a0814B6997J62158a10258J6165A40891a04725j25598
10729b30323e780I7416a86098k02099B3052J90654G0366e6736A11380b04942c9117
10717b40740k7004E5107j7408J4739e1367o4390J2575C765f38j51889A58768g8070
10704a28886A35286o6014I103a13459c6498j4180g075j81508N1682m6636o9206
10693b52743C2486b17342k00862G1070C2383b8897j5035j99159M8838B00860f826
10681A93797D0992c13216B01159p1502F4614a75279K9400d9502A23242k7513A7608
10669a35913M8087l1875j35065L2166A04816c5369K142q4902i06j27789K4568
$$ plain form
10751 322448 -213433 103610 211202 152916 56826 -186432 -364381 -29079 -33022 -39564 211208
10739 10224 -128127 -217433 -10814 26997 189155 -110258 -94093 140891 -104725 -230323
10729 -230323 -5780 97416 -186098 -388197 23052 213706 70366 -56736 111380 -204942 -39117
10717 -240740 -267744 55107 37699 52438 -51367 -115757 -103182 3765 -638 -152527 158768 -78070
10704 -128886 135286 69272 9103 -113459 -36498 -50678 -7075 -188583 -136901 -183537 -252743
10693 -252743 32486 -217342 -418204 71070 32383 -28897 -43932 -243091 -194253 200860 -6826
10681 193797 40992 -313216 201159 129657 64614 -175279 -145879 -49502 123242 95729 17608
10669 -135913 -87826 -119701 -254766 -222600 104816 -35369 -33227 -118129 -906 -128695 -104127
10658a04127A13122b16o7992L3018k07177o0222M9196e3123m379a8113D1021J21533
10646A62554L4427q0623a05288D7770g7101j88352b6206K860B49060c08339D0551
10634a58122k75407J87778J10161l9114Q4643k31393I976c08382A00337a34197
10623i1503r1926L5403c1280l2271r9215A47405b22854B24994a40747A19013M1372
10612A60385a30453d1233B5832J28293a72290A39764P4388f7965A66909c9008
10601c52695D12b64767C134J49190l3639a19597D39251B01417E7544b1814b359
10589b68386M5244O7737O5269J3726l13328a15884G5834a76453F2535c38312h3117
10577C52792b3262j46709k09575B44772f421B02895r8364c16602A25699o0371
$$ plain form
10658 -104127 113122 -216 -68208 -35190 -242367 -302589 -253393 -53123 -57502 -18113 41021 162554
10646 162554 196981 116358 -105288 47770 -77101 -265453 -26206 -23346 249060 -308339 40551
10634 -158122 -433529 -245751 -135590 -174704 -90061 -321454 9976 -308382 100337 -134197
10623 -91503 -183429 -148026 -31280 -63551 -162766 147405 -222854 224994 -140747 119013 160385
10612 160385 -130453 -41233 25832 154125 -172290 139764 214152 -67965 166909 -39008
10601 -352695 412 -264767 3134 152324 118685 -119597 439251 201417 57544 -21814 -2359
10589 -268386 -223142 -155405 -90136 -76410 -389738 -115884 75834 -176453 62535 -338312 -83117
10577 352792 -23262 -169971 -379546 244772 -6421 202895 104531 -316602 125699 65328
10567F5328J66549a12826o3739c5246j04965A26967K31445b24600p0109h0203
10556e4080j7736C0403n170a06693A1544c32434c2519j25499A62424K9831a33755
10544a47948E0095b0399k51817K9984h8189I8842a51585C07643e5844o3511C32160
10532a86932k05585d5891m2670B6433A708J3917L8756K0863N9596a48840e6362
10520a37544m9193q5192B1714e28292B7901N6902h1941B12548a34941b6210d21
10508b48141Q0722K3498B32822D8817h2437J881b3975j57321A75241d46140J45971
10497c00169h7909p5170p390M7882L0114A40362b73912g193q1296j17742g4204
10485A09445M0080E5672m328L07638M75514B208J09372K32916i9779C19191a88103
$$ plain form
10567 65328 231877 -112826 -176565 -35246 -140211 126967 358412 -224600 -294709 -80203
10556 -54080 -71816 30403 25233 -106693 11544 -332434 -32519 -158018 162424 192255 -133755
10544 -147948 50095 -20399 -272216 -242232 -88189 98842 -151585 307643 -55844 -119355 332160
10532 -186932 -392517 -45891 -88561 26433 1708 15625 54381 75244 134840 -148840 -56362
10520 -137544 -186737 -271929 21714 -528292 27901 84803 -81941 212548 -134941 -26210 -421
10508 -248141 -167419 -143921 232822 48817 -82437 -80556 -23975 -181296 175241 -446140 -300169
10497 -300169 -87909 -163079 -170469 -122587 -92473 140362 -273912 -7193 -88489 -206231 -74204
10485 109445 149525 55672 51344 358982 834496 2208 111580 344496 -99779 319191 -188103
10473h4358j10498A94742L541b16599j9524c8245B8467J80679E2732k612K576
10462E2696J59874p7098b22217B22558A09586l8298f8977j67542B8018h5716B19781
10450I9078L3968K6789B5862N0246c15966a1761C3289J67088b91688a3849G0051
10438b11544A95071b07734C19256H8138c0248n5584a6506B20645l0071p2304k3088
10427I5182L22295c05129A52185i7711q8075c6575B00981a20038O630b6480A18948
10415I3798J3703d8045I7691a35063B9620R5536F1412b6808H1369i8437a7779
10403A89830d1955q738d911J609I0668C7528i1082F9907a42577A71318E231O7477
10391G2708e3531F9296a9150C35381r4976G5946J60260Q7232f270A24849J80567
$$ plain form
10473 -84358 -194856 194742 198283 -216599 -236123 -38245 28467 209146 52732 50120 52696
10462 52696 212570 135472 -222217 222558 109586 71288 -68977 -236519 28018 -85716 219781
10450 99078 133046 159835 25862 76108 -315966 -11761 33289 200377 -291688 -13849 70051
10438 -211544 195071 -207734 319256 88138 -30248 -85832 -16506 220645 190574 118270 95182
10427 95182 417477 -305129 152185 -97711 -185786 -36575 200981 -120038 -113408 -26480 118948
10415 93798 107501 -48045 97691 -135063 29620 125156 61412 -26808 81369 -98437 -17779
10403 189830 -41955 -50693 -4911 -3302 90668 37528 -91082 69907 -142577 171318 5231 72708
10391 72708 -53531 69296 -19150 335381 240405 75946 236206 323438 -6270 124849 305416
10380C05416A01428M6130J66557J15007p6184A28822J49214N5893j53280J56045
10370C36694K24836B13392K3106K32392K00178j99776L1040k08881N2508J41378
10360D85337k27130q2574K52063a19057A06762K11772A01247J09452L28405j12960
10350D26144L81484B46168K27078j02554A83157n7977L32344F4417J16225K85903
10340D66545C2730K8365L27132r8816A37451Q5887O2127N4088j10162r1427J0810
10329A48774A957K7749f5143A18781J19922d7195D09737m7371j41300J98323a3759
10317E28949B5839J01636b72803B78983C0331J37320J68109H4091Q7768a39646
10306I2318g6386I3281g6626A96366O9925c7008h244j73085A33334a86749B13699
$$ plain form
10380 305416 101428 147558 314115 429122 352938 128822 278036 333929 180649 336694
10370 336694 561530 213392 236498 468890 669068 469292 500332 291451 343959 485337
10360 485337 258207 175633 427696 -119057 106762 318534 101247 210699 539104 426144
10350 426144 807628 246168 473246 370692 183157 125180 457524 64417 180642 466545
10340 466545 32730 61095 388227 289411 137451 223338 285465 339553 229391 137964 148774
10329 148774 1957 29706 -65143 118781 238703 -47195 409737 362366 221066 419389 -13759
10317 528949 25839 127475 -272803 278983 30331 167651 335760 84091 171859 -139646
10306 92318 -76386 93281 -76626 196366 266291 -37008 -8244 -181329 133334 -186749 213699
10294B58391F7209c67856A484f2185j5977k62433j57682a61245N7223M2997m65402
10283e26427E1266h652F3082b36313f9115F5466c03446R4374l76772a24621A46293
10271g1621A85438k6280K391f0752f961q0591A67463a09467I2139M7664n3330
10260H6473J71321B5187K55913r074p5628r933b8443A20593a0528r0831L8824
10249f2535B28892b06198Q4199j20863e8351A13262a37955n7493F8568J28696
10239A97264E150a92302g4853E2553K5686C3987h9323j5481A614e6548i061l1376
10227d0437A4672a37455j6667A01355B7107J8908c50079B22332A3824g2760h433
10215c06520R715A11642a18437k36183B6027d92412b06589A81157a19330A41893
$$ plain form
10294 258391 67209 -367856 1484 -62185 -78162 -340595 -498277 -161245 -104022 -61025 -526427
10283 -526427 51266 -8652 63082 -236313 -69115 65466 -303446 -209072 -585844 -124621 146293
10271 -71621 185438 159158 161549 -60752 -6961 -87552 167463 -109467 92139 139803 86473
10260 86473 257794 25187 281100 272026 196398 186465 -28443 120593 -10528 -101359 -62535
10249 -62535 228892 -206198 -121999 -242862 -58351 113262 -137955 -195448 68568 197264
10239 197264 5150 -192302 -74853 52553 78239 33987 -89323 -104804 1614 -56548 -9061 -40437
10227 -40437 14672 -137455 -154122 101355 27107 46015 -350079 222332 13824 -72760 -8433
10215 -306520 -296805 111642 -118437 -354620 26027 -492412 -206589 181157 -119330 141893
10204A72992d9356F5610J46297j1742C8389a40253A969a65377G6352b42828A3156
10192A3801J65212g2497K5987j43473N6728j05884J00615e5832j21304L6170N1561
10181h9405j08212g3446F4701b76455K4231L1894p9700a19579I4137d540k61541
10170b66081D2350b99191A53475b41267A25069c0170j1966E8195b2162A53549
10159F6999c82726a38676B41478c18501g854B99562b07825q8892a9695G5042b15650
10147a45451I9844d5510C6478K36404a26864k70941a42430o8512M782h2589I4967
10135a13456K9932D8465a03808o9435j60772f5049l34422d4104k24584J15114
10125a53574d1574g915m7557H8692B1322a07337B7198A054a91760b6855j2413
$$ plain form
10204 172992 -49356 65610 211907 200165 38389 -140253 1969 -165377 76352 -242828 13156
10192 13801 179013 -72497 -46510 -189983 -133255 -239139 -138524 -55832 -177136 -140966 -89405
10181 -89405 -197617 -73446 64701 -276455 -252224 -220330 -300030 -119579 94137 -4540 -266081
10170 -266081 42350 -299191 153475 -241267 125069 -30170 -42136 58195 -22162 153549
10159 66999 -382726 -138676 241478 -318501 -7854 299562 -207825 -296717 -19695 75042 -215650
10147 -145451 99844 -45510 36478 272882 -126864 -397805 -142430 -210942 -206160 -82589 94967
10135 -113456 -83524 48465 -103808 -173243 -334015 -65049 -399471 -44104 -268688 -153574
10125 -153574 -41574 -7915 -55472 88692 21322 -107337 27198 1054 -191760 -26855 -39268
10114c9268B54500F4488a73014a8476A57044o3976a27986c8152j7846n2921m18825
10103e27744b02214A51205a18048r5753e2204A55357a58115D7177J87184h9233
10092E1033K2049f9052q6277A17052a81733l5554b4041D32537A81429c3196k76088
10081c09284J45533A865b43053b9814j45922C87492A65932a37214A69633a70876
10070a10717k4379j5304G9639h3030p2108J0550C0780L16298a24040k3501q520
10059a56061l6287A4730K84307a98658D4770J34730a11094A37346E7999L0892
10049H8891j7344g721k57760A11266P978a17602n3554o0200B4977R3843J0090
10038A28910i0331k98766J85558R0441d8482B3620c6762B6776c9388B12359D2917
$$ plain form
10114 -39268 254500 64488 -173014 -18476 157044 93068 -127986 -38152 -55998 -108919 -527744
10103 -527744 -202214 151205 -118048 -213801 -52204 155357 -158115 47177 234361 -89233
10092 51033 73082 -69052 -155329 117052 -181733 -217287 -24041 432537 181429 -33196 -309284
10081 -309284 -163751 1865 -243053 -29814 -175736 387492 165932 -137214 169633 -170876
10070 -110717 -135096 -150400 79639 -83030 -155138 -144588 30780 347078 -124040 -147541 -156061
10059 -156061 -192348 14730 299037 -198658 44770 179500 -111094 137346 57999 88891
10049 88891 71547 -7721 -265481 111266 119244 -117602 -171156 -231356 24977 118820 128910
10038 128910 -90331 -389097 -203539 -113098 -48482 23620 -36762 26776 -39388 212359 42917
10026a02509A19139b33173P0589I3596I013J38611p1088b02757i9431l63868B5787
10014i5463r7121R0844j6762L9847A986b16252g2858F7333d7170k453j11851a5279
10001d2684D4783P8706c21226p315F3653h8239B4020O568E538L53317A10614m2814
9989F7800a27499k1365c2208j7650j18758K8737k05984A57673k185h9176B30205
9977C33664b23125C8168b09566B3865K03339c17016i4474a9416k9045b2584l77912
9966d00496a6099E8056L01595A45025o7275b6111k54477a18861e5005l5009l02687
9955c92701a23376D8124O7380f0665A06622b00536j63624f290j75833A7569R6973
9944A14542J00921a37339j79802i0992L2261F9N1663f2840E9252a02163n1516
$$ plain form
10026 -102509 119139 -233173 -162584 93596 9013 147624 76536 -202757 -99431 -463299 25787
10014 -95463 -192584 -101740 -118502 -78655 1986 -216252 -72858 67333 -47170 -49623 -161474 -15279
10001 -42684 44783 123489 -321226 -328541 63653 -88239 24020 30588 5538 358855 110614 67800
9989 67800 -127499 -148864 -32208 -49858 -168616 -139879 -345863 157673 155488 -89176 230205
9977 333664 -223125 38168 -209566 23865 227204 -317016 -94474 -19416 -48461 -22584 -400496
9966 -400496 -16099 58056 359651 145025 77750 -26111 -280588 -118861 -55005 -90014 -392701
9955 -392701 -123376 48124 115504 -60665 106622 -200536 -364160 -6290 -182123 17569 114542
9944 114542 215463 -137339 -317141 -90992 -58731 69 51732 -62840 59252 -102163 -153679
9933a53679o417O6722A88781i9996b8711j72153g5648j6248o2197I7856a52741
9921a76125R446j30219C6870d0497B59546D0440c92819F2468A0394E109a93726
9909A77196a7373l59144h7200P589j62533C14481I5881L264J39629B8826a82045
9897h563m03780J44722F3057b4432k89825Q540a00822e0393r5232A49254a12342
9885F5273M1545O3089c9815q0938j9776c652p2261K2914G667b67506A08962b10903
9872A70810l6740a26407j30997D0379b08165B7814K5216c49570a57340C4831a81807
9860i5826A22644f0358j90856B11077a72548C32883G0761a45670M652A84319n3419
9849A30900R1942e0084p5429M7526h247A07547l4613m333h1161A62072b04161
$$ plain form
9933 -153679 -160096 -93374 188781 -99996 -28711 -200864 -75648 -91896 -154093 97856 -152741
9921 -176125 -166679 -296898 36870 -40497 259546 40440 -392819 62468 10394 5109 -193726
9909 177196 -17373 -376517 -87200 -79611 -242144 314481 95881 99145 238774 28826 -182045
9897 -8563 -412343 -267621 63057 -24432 -314257 -305717 -100822 -50393 -145625 149254 -112342
9885 65273 106818 169907 -39815 -120753 -140529 -3652 -75913 -52999 7667 -267506 108962 -210903
9872 170810 134070 -126407 -257404 40379 -208165 27814 53030 -349570 -157340 34831 -181807
9860 -95826 122644 -60358 -251214 211077 -172548 332883 70761 -145670 -141018 184319 130900
9849 130900 222842 -50084 -125513 -77987 -8247 107547 72934 68601 -81161 162072 -204161
9837c9394E2930N0563a22004j35054A3315J17989l4843a08700B92338b302j59262
9826a61564c0276B3282d13705d1840l95739J95935e3753K5163o5813A00016g0262
9814d7657F6413A1684a79541b4430j38505J151a255C8730K17931b71989B46060
9802G7718b22359j32303M515A59198k3703C0735c18503a50625E6985b78670c3072
9790g280l26807b6479A61375c2428B6354e3210A34879c81917a50190B46720a45739
9778a16685d3633k34848B76986a26380C1138a70671D9813b12964m7069a05176
9767f9003k09500a24575J3094m07284A751h2352c0092F8726b3227k05954P4674
9756a54507k4000A76511e5886B45501e096l0416A21024f3346q9787B74978k6766
$$ plain form
9837 -39394 52930 103493 -122004 -257058 13315 131304 96461 -108700 292338 -2302 -161564
9826 -161564 -30276 23282 -413705 -41840 -437579 -241644 -53753 -28590 -94403 100016 -70262
9814 -47657 66413 11684 -179541 -24430 -162935 -161784 -1255 38730 256661 -271989 246060
9802 77718 -222359 -354662 -350147 159198 135495 30735 -318503 -150625 56985 -278670 -33072
9790 -7280 -334087 -26479 161375 -32428 26354 -53210 134879 -381917 -150190 246720 -145739
9778 -116685 -43633 -278481 276986 -126380 31138 -170671 49813 -212964 -260033 -105176
9767 -69003 -278503 -124575 -111481 -518765 1751 -82352 -30092 68726 -23227 -229181 -154507
9756 -154507 -178507 176511 -55886 245501 -5096 -35512 121024 -63346 -153133 274978 248212
9745B48212C0149J33971A7506a97738A97939b30811I3824J84817A17717b06401
9734e2761j26229N3568f1276p9377r5289J03998G9231g5408p4486O8343c8853
9722d4451l55295A05095a61096M9826j179C87027b14460N4141L5406c9759j09158
9711a48917p6511a00182j4272J1865A5140c34883B75883b18210j7765B987i7210
9699d1098J6041j55487j06383G4259A1787a15161k1463C2346c72852a22275A8033
9687A38170o0958l5330a28955K5832k5249j20616n4010k52041a33741B4287a02366
9675C8149J14038C5015O9336b46754h748B75331D0988i1130O861K1625A74532
9663c0359B33233F7617F999a2203A36315h7008C14351g115l97085F5033a88283
$$ plain form
9745 248212 30149 164120 17506 -197738 197939 -230811 93824 278641 117717 -206401
9734 -52761 -178990 -125422 -61276 -140653 -235942 -131944 79231 -75408 -149894 -81551 -38853
9722 -44451 -399746 105095 -161096 -111270 -112449 387027 -214460 -160319 -124913 -39759 -148917
9711 -148917 -225428 -100182 -114454 -102589 15140 -334883 275883 -218210 -235975 2987 -97210
9699 -41098 -25057 -180544 -286927 74259 11787 -115161 -136624 32346 -372852 -122275 18033
9687 138170 77212 41882 -128955 -103123 -128372 -248988 -302998 -555039 -133741 24287 -102366
9675 38149 152187 35015 104351 -246754 -8748 275331 40988 -91130 -84269 -62644 174532
9663 -30359 233233 67617 6999 -12203 136315 -87008 314351 -7115 -404200 65033 -188283
9651A23692h2433I1357b33308C43061b13152A34795b38935j14351e521j32889
9641a38410A9664a99699f5997k19592A6647K39463B6368J42490a86348O9934k6821
9630a43235p0533A10428a74288c7270A04981j4575r067l0156J20153f5384E0064
9618c213A91503b05488j332b7465j32331O3953b6816A16342h5499p2485B4459
9606I872f7968B1208a58999P4415n7961B64739L4728g5072B06390b9781E8363
9594a07579I6491R7468a6106l5680j80561d8070j86886F2623b62649B28455B643
9582h4031L4160H355K82806a80916q4433H9066f5393k28453e3886j73324D7611
9570b97888d1415E5697a59388j6637K0881o4358B7383K22896b91571D1J58174
$$ plain form
9651 123692 -82433 91357 -233308 343061 -213152 134795 -238935 -353286 -5521 -138410
9641 -138410 19664 -199699 -65997 -285589 16647 256110 26368 168858 -186348 -116414 -143235
9630 -143235 -213768 110428 -174288 -37270 104981 90406 81339 51183 171336 -65384 50064
9618 -3213 191503 -205488 -206820 -27465 -159796 -95843 -26816 116342 -85499 -157984 24459
9606 9872 -67968 21208 -158999 -84584 -142545 264739 299467 -75072 206390 -29781 58363
9594 -107579 96491 193959 -16106 -51786 -232347 -48070 -234956 62623 -262649 228455 2643
9582 -84031 -49871 8355 291161 -180916 -265349 89066 -65393 -293846 -53886 -227210 47611
9570 -297888 -41415 55697 -159388 -176025 -155144 -219502 27383 250279 -291571 41 158215
9559A58215b34340A15752a8784B14037b08567k4123d8322r9225k37268e0264m456
9548e4720l6568B37210d63595B12871j02765h8629f62l0874n9779b8376k6954
9537e5330k27900j00255a05064k3571A33513b2956j39185P0328G0709a91219A5936
9525A47990b01415j088G8013K5210K69599A25541l6966L09017f1130q2654o3002
9514b06786I1639a46273D12012j46502a54728A10689e28951B32948e3398k00729
9504b54127A2269b45238r3635C4477c029m5989C94097c75901a37366K5232I9094
9492g7011l4571j81872R0943C32729b06375g1180k12268m360A18313C3180a16107
9480a65610d9512j19219B14528p5352C7341c83668A35535a562m50628B6372a01206
$$ plain form
9559 158215 -234340 115752 -18784 214037 -208567 -232690 -48322 -147547 -384815 -50264 -54720
9548 -54720 -91288 237210 -463595 212871 110106 -88629 -662 -31536 -91315 -28376 -55330
9537 -55330 -283230 -383485 -105064 -128635 133513 -22956 -162141 -91813 70709 -191219 15936
9525 147990 -201415 -202503 78013 103223 372822 125541 88575 397592 -61130 -143784 -206786
9514 -206786 91639 -146273 412012 265510 -154728 110689 -528951 232948 -53398 -254127
9504 -254127 12269 -245238 -338873 34477 -3029 -49018 394097 -375901 -137366 -112134 99094
9492 -77011 -111582 -293454 -202511 332729 -206375 -71180 -283448 -287808 118313 33180 -116107
9480 -165610 -49512 -168731 214528 139176 37341 -383668 135535 -1562 -452190 26372 -101206
9468A37914c07410l9576Q0551a27463K5697m247B36240a9969m5017J8588A39627
9456c82677O6315a20340B25309r3550a91849j24584A14619a26311C241e2491A8542
9444c00546E3916i7376C0152c97027a20961n9178B34825d43790h8933j68346A01751
9432a75997K8380G7095d5640p6724l0624d9319j62m9588q8523g756B5062g2814
9419A72795q3273C9132J96183l087a32036e4763H7387f4108j27473n4257e7047
9407B03461b25330B6606Q9234c23326B19692e0758i980j69755E1656e6838n1075
9396a07913A10576K35078a56444j31739o543a12102M6373n95934A48746i2028
9385D8504a13627C2783J1691e9344K9382j24090n8878O6229H0553P4137f9659
$$ plain form
9468 137914 -307410 -346986 -266435 -127463 -101766 -106013 236240 -19969 -64986 -46398 139627
9456 -382677 -316362 -120340 225309 131759 -191849 -316433 114619 -126311 3241 -52491 18542
9444 -300546 53916 -97376 30152 -397027 -120961 -180139 234825 -443790 -88933 -257279 101751
9432 -175997 -147617 77095 -45640 -122364 -152988 -49319 -49481 -99069 -187592 -7756 25062 -72814
9419 172795 89522 39132 235315 232228 -132036 -54763 87387 -64108 -191581 -245838 -57047
9407 203461 -225330 26606 115840 -323326 219692 -50758 -9980 -179735 51656 -56838 -107913
9396 -107913 110576 345654 -156444 -288183 -294726 -112102 -65729 -661663 148746 -92028
9385 48504 -113627 32783 44474 -59344 -29962 -154052 -212930 -146701 80553 154690 -69659
9373I8320a15999A65525B3985J4852f6122j20929N2945k6348a2106o281B86391
9361b32753f6865l59815b272o2013N352B24539E458c64549J17640A34958o886
9350A28072a2908F3554g8262B8015c01667a01082K0154I5172b00522A6177a01117
9338b94245B21127a50590e6580o2739D9611P1682M1523o394d00434A23095k3705
9327I9390g966j38644D7969d39902a01717n178A62291c19340J27556E3665K73956
9316C27621B0056J40229C349a47016B54161f0703G1963i2013E8481N4768a74883
9304h6066k107k99014a29128N5145G3996J10747c7398G8986J2280b02611L4409
9293a68202n3577E0946a68347c9328l04794C90286b51046J3919l5484K7290a07641
$$ plain form
9373 98320 -115999 165525 23985 38837 -66122 -187051 -134106 -160454 -12106 -18387 286391
9361 -232753 -66865 -426680 -2272 -64285 -58933 224539 5458 -364549 -246909 134958 128072
9350 128072 -12908 63554 -78262 28015 -301667 -101082 -80928 95172 -200522 16177 -101117
9338 -294245 221127 -150590 -56580 -119319 49611 121293 162816 156422 -400434 123095 99390
9327 99390 -7966 -146610 47969 -439902 -101717 -106895 162291 -319340 -191784 53665 327621
9316 327621 20056 160285 3349 -147016 254161 -60703 71963 -92013 58481 113249 -174883
9304 -86066 -88173 -387187 -129128 -73983 73996 184743 -37398 78986 91266 -202611 -168202
9293 -168202 -221779 50946 -168347 -39328 -344122 390286 -251046 -237127 -272611 -245321 -107641
9281b71294J1815f563C42724f8798H1914P3658f8496k26176g0271B1155b60384
9269A26157H798d1883l1761K3351B00306B462a05118A97134N9390B1341e610G4742
9256C3628a41900N0041D0970a67938i728j79785b1737G29P2793a09121e847j15429
9244a21276A75554p0197B9949a01351D1769A5391c65123A29222a87011F0321a33646
9232h0147k197F2245A9586b48902A66496b35969e4458j4896J4041C2005b85855
9220E2716b41476d1407A26755b74244A52386a70302l8692L8834B4319i8289j26417
9209b24706c223q1075k00895f804l85181a57756f0833K4341n5448P665B9457a13836
9196a90694B43266B9414J36692c33045c288A9626a98217Q9909I26b00548m8074
$$ plain form
9281 -271294 -259479 -6563 342724 -68798 81914 155572 -68496 -294672 -70271 21155 -260384
9269 126157 8798 -41883 -73644 -50293 200306 2462 -105118 197134 256524 21341 -5610 74742
9256 33628 -141900 -91859 40970 -167938 -9728 -189513 -21737 729 73522 -109121 -5847 -121276
9244 -121276 175554 105357 29949 -101351 41769 15391 -365123 129222 -187011 60321 -133646
9232 -80147 -82344 62245 19586 -248902 166496 -235969 -54458 -69354 -55313 32005 -285855
9220 52716 -241476 -41407 126755 -274244 152386 -170302 -208994 -170160 24319 -98289 -224706
9209 -224706 -3223 -84298 -285193 -6804 -391985 -157756 -60833 -36492 -91940 -84275 29457 -113836
9196 -190694 243266 29414 166106 -333045 -3288 19626 -198217 -108308 926 -200548 -248622
9185b48622j20896a0261q0645q0475c2840l45023a31078k0848A11390c36231f4684
9173d9390l91016j00293B97517c37606b6070K37A99265D2617e7026A3464M25884
9162D39348e2458H4578A2348J303d54143B94026c34380I658L36c7499q375A25419
9149a73123j7790d7289B4099a09079A4407a799j79764A96137K33627b00291h7901
9137a51081A14077a90965h4283j18274a4905j26073F0265A0590J01903e2668c733
9125A138b43016A42707C8986a38001A69363c124l315k050j74545f2861A66287
9113b93638B11535A6669a80930I9953d20827G3104b74970J32026B40706j11152
9103A29554c12652J03820Q7657m8402I3832a25869p5462d9664l4374j4710B81190
$$ plain form
9185 -248622 -369518 -10261 -90906 -171381 -32840 -377863 -131078 -151926 111390 -336231 -64684
9173 -49390 -440406 -540699 297517 -337606 -26070 -25833 199265 42617 -57026 13464 439348
9162 439348 -52458 84578 12348 13651 -454143 294026 -334380 9658 9994 -37499 -45874 125419
9149 -173123 -190913 -47289 24099 -109079 14407 -1799 -181563 196137 429764 -200291 -87901
9137 -151081 114077 -190965 -84283 -202557 -14905 -140978 60265 10590 112493 -52668 -3733
9125 1138 -243016 142707 38986 -138001 169363 -3124 -6439 -8489 -183034 -62861 166287
9113 -293638 211535 16669 -180930 99953 -420827 73104 -274970 -142944 240706 129554
9103 129554 -312652 -208832 -121175 -169577 93832 -125869 -201331 -49664 -84038 -98748 281190
9091c63125E7072a32508n5520Q4149A18426i5846p4067A35091C0799a84571C38057
9079F7740a41223A77811E3486Q978e7132a3101k5852k0045R369A74884d8516B03869
9066D3959a008G991O4912J64731H5555b46391O3412j60007a22984m19165a64787
9054a236k0188D6783a45250j46128B28267b42193E4869a91241R611h0247B27099
9042a29296B1506b24200C9288J47789q4006a67993j21761D1222J71821d165A50824
9030b36128j6857E995K06441e3425A12588b10770J02817b7602j63105b2807j24755
9019a47562I7314b11236A3923K92900b0381j72833e9748o5454M6063b8724j79267
9008b07991A2936K3305j1232Q2012k4044g1529K2897C5582i142B5123a54196I4941
$$ plain form
9091 -363125 57072 -132508 -188028 -103879 118426 -95846 -169913 135091 30799 -184571 338057
9079 67740 -141223 177811 53486 62464 -57132 -13101 -38953 -58998 -49629 174884 -48516 203869
9066 43959 -1008 7991 72903 237634 85555 -246391 -182979 -342986 -122984 -542149 -164787
9054 -1236 -21424 46783 -145250 -291378 228267 -242193 54869 -191241 -181630 -80247 227099
9042 -129296 21506 -224200 39288 187077 103071 -167993 -289754 41222 213043 -4165 150824
9030 -236128 -252985 5995 212436 -53425 112588 -210770 -107953 -27602 -190707 -22807 -147562
9019 -147562 97314 -211236 13923 306823 -20381 -193214 -59748 -125202 -79139 -28724 -207991
9008 -207991 12936 36241 25009 107021 82977 -71529 -48632 35582 -9142 25123 -154196 94941
8995A9968a25868e8104A30148E2971j4482a61116A95577F2640K6997M046q426
8984H5257h4420j39740D6198b74824D7863J12649a42879G6341b47898B7332f8067
8972b08549D5055c40468J27784D6252c30j71330A57534C9718c13233I1617d36893
8960a82317O8793B99394j25464f2123A81932p0412D0584a03633p340G2018a73726
8948a27012j17576J10805a3206b189A23783n842i6538A55366p7214j1090A6434
8936c7981l527C32856A9091m650c688q0534F144a81528K444k6948J5466o0778
8924b51344A7011J2050M54652N7461a59818g4198I0071b83939A74464i3709j886
8913i5595j51724J11654k11869c1524p072B68498B3585b2327j20385A24596e2109
$$ plain form
8995 19968 -125868 -58104 130148 52971 38489 -161116 195577 62640 89637 93683 85257
8984 85257 -84420 -224160 46198 -274824 47863 160512 -142879 76341 -247898 27332 -68067
8972 -208549 45055 -340468 -212684 46252 -330 -171660 157534 39718 -313233 91617 -436893
8960 -182317 -113524 299394 173930 -62123 181932 111520 40584 -103633 -110973 72018 -173726
8948 -127012 -244588 -133783 -13206 -2189 123783 117941 -96538 155366 78152 67062 16434
8936 -37981 -41508 332856 19091 14441 -3688 -84222 6144 -181528 -179084 -206032 -190566 -251344
8924 -251344 17011 29061 483713 541174 -159818 -74198 90071 -283939 174464 -93709 -95595
8913 -95595 -247319 -135665 -347534 -31524 -38596 268498 23585 -22327 -142712 124596 -52109
8901a13737c1831q6032C660J2335J04754a87671A64296c8582k24298a16516B28324
8889c22132G9220F961c62358J28805q63a14677r9332k2852J8529g2398m18257
8878d90655A00946d3441A35543Q3063q6577j8610b1515J0208r8202j51750E047
8866b08844N3912j2637m8688M5584M2857j934e517r2243k6784B6415f7587K4086
8854d3501a7480j08610F9662b07814R2189l00130A13159R17c6496A74427q1646
$$ plain form
8901 -113737 -31831 -117863 3660 15995 120749 -187671 164296 -38582 -262880 -116516 228324
8889 -322132 79220 6961 -362358 -233553 -234416 -114677 -214009 -236861 -218332 -72398 -490655
8878 -490655 100946 -43441 135543 218606 132029 113419 -21515 -11307 -109509 -261259 5047
8866 -208844 -154932 -167569 -216257 -170673 -127816 -129750 -5517 -97760 -124544 26415 -67587 -43501
8854 -43501 -17480 -126090 69662 -207814 -115625 -415755 113159 114076 -36496 174427 92781
$$ [...]
##END NTUPLES=NMR SPECTRUM
##END=
