##TITLE=AC1733_SEN00006_9276007_kklLlyEvKr
##JCAMPDX= 6.0         $$ Bruker NMR JCAMP-DX V2.0
##DATA TYPE= NMR SPECTRUM
##DATA CLASS= NTUPLES
##ORIGIN= BRUKER
##OWNER= Administrator
$$ 1.72 TOPSPIN		Version 2.1
$$ 2015-07-17 21:42:29.838 -0700  Administrator@X
$$ Compression mode = diff/dup
##.OBSERVE FREQUENCY= 400.02188249412
##.OBSERVE NUCLEUS= ^1H
##.ACQUISITION MODE= SIMULTANEOUS (DQD)
##.ACQUISITION SCHEME= undefined
##.AVERAGES= 64
##.DIGITISER RES= 22
##SPECTROMETER/DATA SYSTEM= spect
##.PULSE SEQUENCE= noesygpps1d.comp
##.SOLVENT NAME= COFFEE_meoh
##.SHIFT REFERENCE= INTERNAL, COFFEE_meoh, 1, 14.96069
##AUDIT TRAIL= $$ (NUMBER, WHEN, WHO, WHERE, PROCESS, VERSION, WHAT)
$$ ##TITLE= Audit trail, TOPSPIN		Version 2.1
$$ ##JCAMPDX= 5.01
$$ ##ORIGIN= Bruker BioSpin GmbH
$$ ##OWNER= Administrator
$$ $$ E:\/data/COFFEE/nmr/AC1733_SEN00006_9276007_kklLlyEvKr/12/pdata/1/auditp.txt
$$ ##AUDIT TRAIL=  $$ (NUMBER, WHEN, WHO, WHERE, PROCESS, VERSION, WHAT)
(   1,<2015-07-17 21:42:24.791 -0700>,<Administrator>,<X>,<go>,<TOPSPIN 2.1>,
      <created by zg
	started at 2015-07-17 21:30:55.072 -0700,
	POWCHK enabled, PULCHK disabled,
       configuration hash MD5:
       21 0F 79 D6 B3 7B B4 F6 88 20 88 DB 03 48 BD 9F
       data hash MD5: 64K
       CB 09 FA 71 B2 D8 0F 38 A9 7B 96 1C D1 E5 8B E4>)
(   2,<2015-07-17 21:42:27.963 -0700>,<Administrator>,<X>,<proc1d>,<TOPSPIN 2.1>,
      <Start of raw data processing
       efp LB = 0.3 FT_mod = 6 PKNL = 1 PHC0 = 0 PHC1 = 0 SI = 128K 
       data hash MD5: 128K
       19 E1 8F 30 98 9E 01 57 6A DE 09 DB 69 97 FA FD>)
(   3,<2015-07-17 21:42:28.932 -0700>,<Administrator>,<X>,<proc1d>,<TOPSPIN 2.1>,
      <pk PHC0 = 268.1049 PHC1 = 0 
       data hash MD5: 128K
       0C 08 94 A0 BE 70 27 90 DD 08 46 62 D4 4D EC 89>)
(   4,<2015-07-17 21:42:29.338 -0700>,<Administrator>,<X>,<proc1d>,<TOPSPIN 2.1>,
      <abs ABSG = 1 
       data hash MD5: 128K
       BA 3C 72 66 83 FA A6 47 3E 4A 65 3F 64 DD 7E F4>)
(   5,<2015-07-17 21:42:29.432 -0700>,<Administrator>,<X>,<proc1d>,<TOPSPIN 2.1>,
      <abs ABSG = 2 
       data hash MD5: 128K
       47 53 95 18 0A 17 13 61 3E 42 D2 20 9E 3D 08 78>)
(   6,<2015-07-17 21:42:29.510 -0700>,<Administrator>,<X>,<proc1d>,<TOPSPIN 2.1>,
      <abs ABSG = 3 
       data hash MD5: 128K
       8A 61 67 8A 7F A0 B6 8A 1C C9 42 CC 7E 28 FC 74>)
(   7,<2015-07-17 21:42:29.572 -0700>,<Administrator>,<X>,<proc1d>,<TOPSPIN 2.1>,
      <abs ABSG = 4 
       data hash MD5: 128K
       FC 4A 67 D8 5C 18 A1 BE 3F 71 6B 65 44 CB F6 02>)
(   8,<2015-07-17 21:42:29.650 -0700>,<Administrator>,<X>,<proc1d>,<TOPSPIN 2.1>,
      <abs ABSG = 5 
       data hash MD5: 128K
       3D 0A 9A 41 4B 1D 01 B0 D2 49 28 1B 1F 4C 96 3D>)
$$ ##END=
$$ 
$$ $$ hash MD5
$$ $$ A1 11 16 99 DE 99 23 2B 7D A7 DC D0 44 97 CE 60
##$RELAX= 
##$RELAX= 
##$RELAX= 
##$RELAX= 
##$RELAX= 
##$RELAX= 
##$RELAX= 
##$RELAX= 
$$ Bruker specific parameters
$$ --------------------------
##$DU= <E:\>
##$EXPNO= 12
$$ [...]
##$TP07= 0
##$TPNAME0= <>
##$TPNAME1= <>
##$TPNAME2= <>
##$TPNAME3= <>
##$TPNAME4= <>
##$TPNAME5= <>
##$TPNAME6= <>
##$TPNAME7= <>
##$TPOAL= (0..7)
0.5 0.5 0.5 0.5 0.5 0.5 0.5 0.5
##$TPOFFS= (0..7)
0 0 0 0 0 0 0 0
##$TUNHIN= 0
##$TUNHOUT= 0
##$TUNXOUT= 0
##$USERA1= <user>
##$USERA2= <user>
##$USERA3= <user>
##$USERA4= <user>
##$USERA5= <user>
##$V9= 5
##$VALIST= <valist>
##$VCLIST= <CCCCCCCCCCCCCCC>
##$VD= 0
##$VDLIST= <DDDDDDDDDDDDDDD>
##$VPLIST= <PPPPPPPPPPPPPPP>
##$VTLIST= <TTTTTTTTTTTTTTT>
##$WBST= 2048
##$WBSW= 25
##$XGAIN= (0..3)
0 0 0 0
##$XL= 0
##$YL= 0
##$YMAX_a= 6200653
##$YMIN_a= -10777349
##$ZGOPTNS= <>
##$ZL1= 120
##$ZL2= 120
##$ZL3= 120
##$ZL4= 120
##$ABSF1= 14.96069
##$ABSF2= -5.597492
##$ABSG= 5
##$ABSL= 3
##$ALPHA= 0
##$AQORDER= 0
##$ASSFAC= 0
##$ASSFACI= 0
##$ASSFACX= 0
##$ASSWID= 0
##$AUNMP= <proc_prof1d_extract.lims>
##$AXLEFT= 0
##$AXNAME= <>
##$AXNUC= <1H>
##$AXRIGHT= 0
##$AXTYPE= 0
##$AXUNIT= <>
##$AZFE= 0.1
##$AZFW= 0.1
##$BCFW= 0
##$BC_mod= 0
##$BYTORDP= 0
##$COROFFS= 0
##$CY= 15
##$DATMOD= 1
##$DC= 0
##$DFILT= <>
##$DTYPP= 0
##$F1P= 0
##$F2P= 0
##$FCOR= 0.5
##$FTSIZE= 131072
##$FT_mod= 6
##$GAMMA= 0
##$GB= 0
##$INTBC= 1
##$INTSCL= 1
##$ISEN= 128
##$LB= 0.3
##$LEV0= 0
##$LPBIN= 0
##$MAXI= 10000
##$MC2= 0
##$MEAN= 0
##$ME_mod= 0
##$MI= 0
##$NCOEF= 0
##$NC_proc= -2
##$NLEV= 6
##$NOISF1= 0
##$NOISF2= 0
##$NSP= 0
##$NTH_PI= 0
##$NZP= 0
##$OFFSET= 14.96069
##$PC= 1
##$PHC0= 268.1049
##$PHC1= 0
##$PH_mod= 1
##$PKNL= yes
##$PPARMOD= 0
##$PPDIAG= 0
##$PPIPTYP= 0
##$PPMPNUM= 2147483647
##$PPRESOL= 1
##$PSCAL= 4
##$PSIGN= 0
##$PYNMP= <proc.py>
##$REVERSE= no
##$SF= 400.020009762217
##$SI= 131072
##$SIGF1= 0
##$SIGF2= 0
##$SINO= 400
##$SIOLD= 131072
##$SPECTYP= <>
##$SREGLST= <1H.CDCl3>
##$SSB= 0
##$STSI= 131072
##$STSR= 0
##$SW_p= 8223.68421052631
##$SYMM= 0
##$S_DEV= 0
##$TDeff= 65536
##$TDoff= 0
##$TI= <>
##$TILT= no
##$TM1= 0
##$TM2= 0
##$TOPLEV= 0
##$USERP1= <user>
##$USERP2= <user>
##$USERP3= <user>
##$USERP4= <user>
##$USERP5= <user>
##$WDW= 1
##$XDIM= 131072
##$YMAX_p= 397552703
##$YMIN_p= -12764
##$CURPLOT= <Network HP LaserJet P1505>
##$CURPRIN= <$Network HP LaserJet P1505>
##$DFORMAT= <normdp>
##$LAYOUT= <+/1D_H.xwp>
##$LFORMAT= <normlp>
##$PFORMAT= <normpl>
##$SURQMSG= 1
$$ End of Bruker specific parameters
$$ ---------------------------------
##NTUPLES= NMR SPECTRUM
##VAR_NAME=  FREQUENCY,     SPECTRUM/REAL,   SPECTRUM/IMAG
##SYMBOL=    X,             R,               I
##VAR_TYPE=  INDEPENDENT,   DEPENDENT,       DEPENDENT
##VAR_FORM=  AFFN,          ASDF,            ASDF
##VAR_DIM=   131072,        131072,          131072
##UNITS=     HZ,            ARBITRARY UNITS, ARBITRARY UNITS
##FACTOR=    0.0627417313425164, 1,          1
##FIRST=     8223.62146879497, -685,         -58973
##LAST=      0,             2272,            -59195
##MIN=       0,             -12764,          0
##MAX=       8223.62146879497, 397552703,    0
$$ Real data points
##PAGE= N=1
##DATA TABLE= (X++(R..R)), XYDATA
$$ [...]
$$ plain form
63945 1215217 1338077 1475931 1628021 1793394 1971154 2160039 2358340 2564335 2776163
63936 2776163 2990766 3203123 3406966 3596322 3766489 3913992 4036222 4131289 4197861 4234687
63926 4234687 4240235 4213068 4152841 4061017 3940609 3795498 3630183 3449751 3259253 3062758
63916 3062758 2863318 2663962 2468151 2278955 2098305 1927582 1768536 1622917 1491362
63907 1491362 1373180 1267175 1172267 1087506 1012185 945950 888244 837630 792269 751268 715008
63896 715008 683884 657169 633345 611151 590022 569867 550883 533488 518105 504907 493763
63885 493763 484283 475954 468445 461848 456480 452526 450095 449464 450833 453879 458003 463103 469682 478039
63871 478039 487847 498721 510761 524168 538589 553206 567313 580568 592885 604350 615125 625206
$$ packed form
63945A215217J22860J37854J52090J65373J77760J88885J98301K05995K11828
63936B776163K14603K12357K03843J89356J70167J47503J22230R5067O6572L6826
63926D234687N548k7167o0227r1824j20408j45111j65315j80432j90498j96495
63916C062758j99440j99356j95811j89196j80650j70723j59046j45619j31555
63907A491362j18182j06005r4908q4761p5321o6235n7706n0614m5361m1001l6260
63896G15008l1124k6715k3824k2194k1129k0155j8984j7395j5383j3198j1144
63885D93763r480q329p509o597n368l954k431o31J369L046M124N100O579Q357
63871D78039R808J0874J2040J3407J4421J4617J4107J3255J2317J1465J0775J0081
$$ plain form
63859 625206 634358 642369 649180 654583 657983 658721 656613 652090 645885 638550 630089 620012 607899 593902
63845 593902 578587 562379 545539 528505 511791 495380 478715 461505 444213 427520 411633
63834 411633 396334 381465 367126 353619 341306 330275 320073 310097 300319 291196 282876 275112
63822 275112 268133 262795 259339 256629 253246 248959 244524 240546 237247 234937 233733 232909 231386 228992
63808 228992 226551 224657 223060 221395 219792 218492 217412 216485 215939 215789 215399 214075 211963 209975 208776
63793 208776 208089 207107 205506 203889 203095 203087 202856 201574 199589 197919 197053 196694 196479 196283 195815 194613 192762
63776 192762 191126 190469 190672 191026 190999 190461 189546 188615 188153 188325 188876 189658 190922 192758 194597 195770 196308
63759 196308 196686 196937 196725 196250 196320 197213 198027 197647 196056 194298 193372 193510 194369 195471 196508 197590 199214
$$ packed form
63859F25206R152Q011O811N403L400P38k108m523o205p335q461j0077j2113j3997
63845E93902j5315j6208j6840j7034j6714j6411j6665j7210j7292j6693j5887
63834D11633j5299j4869j4339j3507j2313j1031j0202r976r778r123q320p764
63822B75112o979n338l456k710l383m287m435l978l299k310j204q24j523k394
63808B28992k441j894j597j665j603j300j080r27n46j50l90j324k112j988j199
63793B08776o87r82j601j617p94qk31j282j985j670q66l59k15j96m68j202j851
63776A92762j636o57K03L54k7n38r15r31m62J72N51P82J264J836J839J173N38
63759A96308L78K51k12m75P0Q93Q14l80j591j758r26J38Q59J102J037J082J624
$$ plain form
63742 199214 201642 204322 206310 207402 208441 210287 212862 215526 218137 221198 225047 229347 233536 237391
63728 237391 241000 244430 247721 251096 254970 259759 265742 272963 281126 289597 297679 304936 311237 316498
63714 316498 320419 322600 322924 321795 319794 317044 313157 307982 302175 296714 291954 287570 283342 279477
63700 279477 276047 272703 269250 266153 264033 262969 262700 263191 264537 266423 268309 270181 272607 275918 279726
63685 279726 283462 287010 290468 293551 295604 296239 295753 294908 294461 294845 296054 297721 299450 301332 304096
63670 304096 308451 314113 319693 323856 326560 328870 331617 334628 337349 339653 341602 342739 342233 339728
63656 339728 335653 330596 324751 318096 310810 303262 295774 288668 282455 277645 274241 271580 268947 266330
63642 266330 264350 263365 262957 262594 262536 263534 265673 268132 270353 272883 276605 281498 286699 291587 296239 300896
$$ packed form
63742A99214K428K680J988J092J039J846K575K664K611L061L849M300M189L855
63728B37391L609L430L291L375L874M789N983P221Q163Q471Q082P257O301N261
63714C16498L921K181L24j129k001k750l887n175n807n461m760m384m228l865
63700B79477l430l344l453l097k120j064k69M91J346J886J886J872K426L311L808
63685B79726L736L548L458L083K053O35m86q45m47L84J209J667J729J882K764
63670C04096M355N662N580M163K704K310K747L011K721K304J949J137n06k505
63656C39728m075n057n845o655p286p548p488p106o213m810l404k661k633k617
63642B66330j980r85m08l63n8R98K139K459K221K530L722M893N201M888M652M657
$$ plain form
63626 300896 305604 310451 315685 321470 327852 335096 343681 353788 365075 377199 390352 405070 421707
63613 421707 440289 460811 483417 508254 535205 563893 594041 625789 659340 693955 727404
63602 727404 756766 779948 796447 806921 812400 813933 812562 809357 805403 801602 798244 794777 790222
63589 790222 783747 774661 762198 745968 726631 705524 683452 660382 636530 613056 591125 570727
63577 570727 551114 532259 515216 501066 490022 481665 475547 471316 468605 467156 466930 467948 470178
63564 470178 473728 478929 485950 494387 503531 513076 523256 534207 545516 556743 568250 581063 595894
63551 595894 612713 631550 653354 679649 711365 748175 788650 830507 870726 906106 934341
63540 934341 954734 967902 974941 976916 974902 970268 964757 960098 957312 956326 956313 956263 955111 951577 944375
$$ packed form
63626C00896M708M847N234N785O382P244Q585J0107J1287J2124J3153J4718J6637
63613D21707J8582K0522K2606K4837K6951K8688L0148L1748L3551L4615L3449
63602G27404K9362K3182J6499J0474N479J533j371l205l954l801l358l467m555
63589G90222o475r086j2463j6230j9337k1107k2072k3070k3852k3474k1931k0398
63577E70727j9613j8855j7043j4150j1044q357o118m231k711j449k26J018K230
63564D70178L550N201P021Q437R144R545J0180J0951J1309J1227J1507J2813J4831
63551E95894J6819J8837K1804K6295L1716L6810M0475M1857M0219L5380K8235
63540I34341K0393J3168P039J975k014m634n511m659k786r86j3n0j152l534p202
$$ plain form
63525 944375 932706 916268 894885 868553 838029 804937 770951 736956 703151 669746 637309
63514 637309 606561 578040 551959 528294 507022 488220 471811 457387 444555 433410 424250 416785
63502 416785 410069 403431 397079 391549 386901 382770 378929 375448 372467 370053 368176 366651 365339 364477
63488 364477 364423 364892 364952 364147 363197 363132 364198 366217 369530 374656 381172 387920 394453 401430 409248 417054
63472 417054 423556 428245 431270 432594 431900 429134 424561 418409 410901 402630 394490 387116 380572 374560
63458 374560 368697 362737 356811 351483 347322 344364 342236 340749 340117 340476 341527 342903 344736 347532 351488
63443 351488 356259 361586 367980 376407 387246 399887 413645 428889 446878 468370 492618 517777
63431 517777 541973 563747 581916 595812 605949 614093 622171 631074 640723 651227 663630 679368
$$ packed form
63525I44375j1669j6438k1383k6332l0524l3092l3986l3995l3805l3405l2437
63514F37309l0748k8521k6081k3665k1272j8802j6409j4424j2832j1145r160p465
63502D16785o716o638o352n530m648m131l841l481k981k414j877j525j312q62
63488C64477n4M69O0q05r50o5J066K019L313N126O516O748O533O977P818P806
63472D17054O502M689L025J324o94k766m573o152p508q271q140p374o544o012
63458C74560n863n960n926n328m161k958k128j487o32L59J051J376J833K796L956
63443C51488M771N327O394Q427J0839J2641J3758J5244J7989K1492K4248K5159
63431E17777K4196K1774J8169J3896J0137Q144Q078Q903R649J0504J2403J5738
$$ plain form
63419 679368 699296 723544 752173 785369 822724 862599 902605 940701 975514 1005666 1029358
63408 1029358 1045132 1053060 1054911 1053032 1049115 1043964 1038033 1031753 1025222 1017815 1008363 995739 979202
63395 979202 958293 932806 903101 870341 836120 801785 768186 735940 705594 677417 651309
63384 651309 627161 605196 585746 568820 554167 541766 531956 524929 520345 517671 516778 517913 521072
63371 521072 525717 531260 537697 545513 555045 566181 578734 592897 609134 627729 648664 671867
63359 671867 697302 724732 753749 784424 817689 854484 894149 933969 970596 1001875 1027124
63348 1027124 1046087 1058351 1063916 1063769 1059530 1052745 1044712 1036523 1028730 1021010 1012461 1002170 989277
63335 989277 972810 952092 927420 899931 870705 840313 809227 778125 747613 718094 690223
$$ packed form
63419F79368J9928K4248K8629L3196L7355L9875M0006L8096L4813L0152K3692
63408A029358J5774P928J851j879l917n151n931o280o531p407r452j2624j6537
63395I79202k0909k5487k9705l2760l4221l4335l3599l2246l0346k8177k6108
63384F51309k4148k1965j9450j6926j4653j2401r810p027m584k674q93J135L159
63371E21072M645N543O437P816R532J1136J2553J4163J6237J8595K0935K3203
63359F71867K5435K7430K9017L0675L3265L6795L9665L9820L6627L1279K5249
63348A027124J8963J2264N565j47m239o785q033q189p793p720q549j0291j2893
63335I89277j6467k0718k4672k7489k9226l0392l1086l1102l0512k9519k7871
$$ plain form
63324 690223 665089 643606 626026 612285 602338 595496 589681 582253 571910 559386 546161 532859
63312 532859 519124 504571 489394 474181 459579 446144 434210 423734 414456 406280 399334 393560
63300 393560 388434 383353 378242 373489 369211 364893 360006 354783 350023 346174 342945 339831 336589 333147
63286 333147 329453 325743 322523 319938 317430 314518 311676 309887 309320 309032 308060 306316 304237 302138 300280
63271 300280 299104 298787 298713 297945 296275 294435 293154 292407 291737 291026 290587 290635 291041 291730 293062 295553 299187
63254 299187 303187 306577 308950 310658 312428 314920 318540 323356 329106 335484 342524 350474 359188 367974
63240 367974 376345 384743 394096 404756 416342 428642 442083 457016 472997 489287 505806 523016
63228 523016 540930 558787 575866 592198 608279 624419 640631 656835 672872 688535 703906
$$ packed form
63324F90223k5134k1483j7580j3741r947o842n815p428j0343j2524j3225j3302
63312E32859j3735j4553j5177j5213j4602j3435j1934j0476r278q176o946n774
63300C93560n126n081n111m753m278m318m887n223m760l849l229l114l242l442
63286C33147l694l710l220k585k508k912k842j789n67k88r72j744k079k099j858
63271C00280j176l17p4p68j670j840j281p47o70p11m39M8M06O89J332K491L634
63254B99187M000L390K373J708J770K492L620M816N750O378P040P950Q714Q786
63240C67974Q371Q398R353J0660J1586J2300J3441J4933J5981J6290J6519J7210
63228E23016J7914J7857J7079J6332J6081J6140J6212J6204J6037J5663J5371
$$ plain form
63217 703906 719508 735789 752455 768526 782958 794996 804073 809773 811973 810754 806094 797830 785974
63204 785974 770873 753072 733236 712195 690755 669355 648227 628014 609906 594882 582945
63193 582945 573362 565575 559665 556008 554750 555659 558351 562598 568519 576537 587045 599965 614544 629680
63179 629680 644660 659607 675067 691071 706864 721711 735734 749594 763536 777164 790043
63168 790043 801920 812300 820312 825303 827153 825762 820684 811656 799164 783993 766392 746107 723178
63155 723178 698354 672700 647054 621784 596944 572782 550196 530355 513597 498984 485334
63144 485334 472478 461062 451378 443020 435617 429220 423810 418969 414393 410301 407039 404514 402365 400516
63130 400516 399308 399130 400114 402092 404694 407518 410370 413355 416647 420109 423215 425497 427158 429110 432172
$$ packed form
63217G03906J5602J6281J6666J6071J4432J2038R077N700K200j219m660q264j1856
63204G85974j5101j7801j9836k1041k1440k1400k1128k0213j8108j5024j1937
63193E82945r583p787n910l657j258R09K692M247N921Q018J0508J2920J4579J5136
63179F29680J4980J4947J5460J6004J5793J4847J4023J3860J3942J3628J2879
63168G90043J1877J0380Q012M991J850j391n078r028j2492j5171j7601k0285k2929
63155G23178k4824k5654k5646k5270k4840k4162k2586j9841j6758j4613j3650
63144D85334j2856j1416r684q358p403o397n410m841m576m092l262k525k149j849
63130D00516j208j78R84J978K602K824K852K985L292L462L106K282J661J952L062
$$ plain form
63115 432172 436203 440285 443771 446734 449286 451048 451816 452330 453673 455955 458237 459749 460662 461533 462569
63100 462569 463666 464704 465530 465938 465897 465568 465017 464226 463478 463298 463803 464382 464329 463579 462698 462333 462732 463510 463841
63081 463841 463241 462241 461933 462786 464374 466320 468801 471860 474973 477887 481373 486371 492731 499537 506491
63066 506491 514270 523497 534037 545464 557718 571160 586329 603733 623541 645372 668681 693447
63054 693447 720203 749444 781303 815774 852810 892090 933022 975110 1018089 1061623 1105237
63043 1105237 1148654 1191883 1234819 1277052 1318294 1358771 1398971 1439159 1479342 1519484 1559380
63032 1559380 1598253 1634666 1666985 1693967 1714912 1729205 1735779 1733252 1720824 1698949 1668985 1632208
63020 1632208 1589451 1541597 1490055 1436553 1382699 1329913 1279578 1233010 1191185 1154510 1122850
$$ packed form
63115D32172M031M082L486K963K552J762P68N14J343K282K282J512R13Q71J036
63100D62569J097J038Q26M08m1l29n51p91p48j80N05N79n3p50q81l65L99P78L31
63081D63841o00j000l08Q53J588J946K481L059L113K914L486M998O360O806O954
63066E06491P779R227J0540J1427J2254J3442J5169J7404J9808K1831K3309K4766
63054F93447K6756K9241L1859L4471L7036L9280M0932M2088M2979M3534M3614
63043A105237M3417M3229M2936M2233M1242M0477M0200M0188M0183M0142L9896
63032A559380L8873L6413L2319K6982K0945J4293O574k527j2428k1875k9964l6777
63020A632208m2757m7854n1542n3502n3854n2786n0335m6568m1825l6675l1660
$$ plain form
63009 1122850 1095905 1073733 1056873 1045789 1040312 1039899 1044299 1053476 1066815 1082993 1101002 1120906
62997 1120906 1143193 1167658 1193412 1219778 1246605 1273704 1300615 1327121 1353458 1379631 1404808
62986 1404808 1427871 1448343 1466313 1481405 1492309 1497482 1496018 1487674 1472462 1450575 1422486 1388707
62974 1388707 1349595 1305832 1258981 1210975 1162931 1114945 1067213 1020733 976567 934989 895913
62963 895913 859686 826723 796665 768732 742858 719660 699145 680225 661803 643710 626261
62952 626261 609554 593631 578767 564940 551407 537446 523326 510037 498144 487354 477092
62941 477092 467032 457148 447656 438916 431055 423801 416940 410755 405543 400893 396005 390731 385748 381610
62927 381610 378173 375078 372281 369808 367418 364825 362039 359292 356849 355042 354106 353754 353206 351936 350188
$$ packed form
63009A122850k6945k2172j6860j1084n477m13M400R177J3339J6178J8009J9904
62997A120906K2287K4465K5754K6366K6827K7099K6911K6506K6337K6173K5177
62986A404808K3063K0472J7970J5092J0904N173j464q344j5212k1887k8089l3779
62974A388707l9112m3763m6851m8006m8044m7986m7732m6480m4166m1578l9076
62963H95913l6227l2963l0058k7933k5874k3198k0515j8920j8422j8093j7449
62952F26261j6707j5923j4864j3827j3533j3961j4120j3289j1893j0790j0262
62941D77092j0060r884r492q740p861p254o861o185n212m650m888n274m983m138
62927C81610l437l095k797k473k390k593k786k747k443j807r36l52n48j270j748
$$ plain form
62912 350188 348530 347162 345929 344773 343763 342799 341617 340094 338326 336434 334506 332675 331091 329860
62898 329860 329125 329051 329557 330181 330424 330166 329615 329012 328572 328535 328981 329669 330270 330686 330928 330840 330331 329766 329746 330387
62878 330387 331137 331465 331469 331677 332377 333280 333772 333430 332397 331292 330700 330750 331181 331716 332267 332906 333759 334792 335527
62859 335527 335245 333835 332323 332107 333584 335875 337882 339250 340223 341095 342080 343372 344961 346543 347871
62844 347871 349020 350096 350903 351233 351332 351703 352427 353012 353045 352740 352639 352861 352920 352401 351601 351274 351777 352741 353661
62825 353661 354442 355156 355669 355970 356647 358437 361278 364342 367045 369511 371919 373990 375505 376846 378618
62810 378618 381001 383798 386864 390186 393790 397906 402924 408888 415337 421981 429192 437361 446079 454553
62796 454553 462666 471028 480038 489522 499404 510253 523004 538421 556872 578238 602049 628121
$$ packed form
62912C50188j658j368j233j156j010r64j182j523j768j892j928j831j584j231
62898C29860p35p4N06O24K43k58n51o03m40l7M46O88O01M16K42q8n09n65k0O41
62878C30387P50L28MK08P00R03M92l42j033j105n92N0M31N35N51O39Q53J033P35
62859C35527k82j410j512k16J477K291K007J368R73Q72R85J292J589J582J328
62844C47871J149J076Q07L30R9L71P24N85L3l05j01K22N9n19q00l27N03R64R20
62825C53661P81P14N13L01O77J790K841L064K703K466K408K071J515J341J772
62810C78618K383K797L066L322L604M116N018N964O449O644P211Q169Q718Q474
62796D54553Q113Q362R010R484R882J0849J2751J5417J8451K1366K3811K6072
$$ plain form
62784 628121 657194 690536 728831 771802 819005 870515 926575 986952 1050953 1117841 1186880
62773 1186880 1257003 1326614 1393648 1455843 1511216 1558478 1596881 1625557 1643254 1648949 1642645 1625335
62761 1625335 1598180 1561892 1517045 1464886 1407641 1347734 1286718 1225137 1163411 1102488 1043438
62750 1043438 986810 932804 881843 834451 790695 750190 712653 678034 646152 616731 589850
62739 589850 565924 545088 527014 511379 498003 486422 475898 466162 457703 451018 445934 441935
62727 441935 438664 435823 433040 430366 428495 427999 428600 429748 431585 434673 438946 443706 448741 454756 462465
62712 462465 471822 482514 494729 508927 525117 542931 562430 584370 609478 637793 669021 703367
62700 703367 741587 784180 830847 880966 934300 990858 1050111 1110727 1171201 1230527 1288044
$$ packed form
62784F28121K9073L3342L8295M2971M7203N1510N6060O0377O4001O6888O9039
62773A186880P0123O9611O7034O2195N5373M7262L8403K8676J7697N695o304j7310
62761A625335k7155l6288m4847n2159n7245n9907o1016o1581o1726o0923n9050
62750A043438n6628n4006n0961m7392m3756m0505l7537l4619l1882k9421k6881
62739E89850k3926k0836j8074j5635j3376j1581j0524r736q459o685n084l999
62727D41935l271k841k783k674j871m96O01J148J837L088M273M760N035O015P709
62712D62465R357J0692J2215J4198J6190J7814J9499K1940K5108K8315L1228L4346
62700G03367L8220M2593M6667N0119N3334N6558N9253O0616O0474N9326N7517
$$ plain form
62689 1288044 1342698 1392530 1435029 1468183 1491304 1504683 1508374 1501673 1484099 1456455 1420360 1377067
62677 1377067 1327529 1273434 1217095 1160046 1102630 1045344 989640 936731 886460 838288 792819
62666 792819 751293 713889 679606 647814 618896 593177 570110 548918 529401 511701 495793
62655 495793 481595 469163 458427 449027 440647 433181 426293 419230 411499 403580 396599 391402 388126
62642 388126 386361 385334 384059 381938 379385 377567 377274 378171 379262 379914 380182 380246 379873 378642 376497 373869
62626 373869 371263 368939 367014 365621 364865 364722 365129 366099 367671 369801 372346 375120 378048 381377 385581
62611 385581 390762 396249 401224 405799 410973 417299 424159 430769 437511 445682 456143 468805 483351
62598 483351 499848 518514 539340 562195 587137 614432 644301 676485 709881 742803 773974
$$ packed form
62689A288044N4654M9832M2499L3154K3121J3379L691o701j7574k7644l6095m3293
62677A377067m9538n4095n6339n7049n7416n7286n5704n2909n0271m8172m5469
62666G92819m1526l7404l4283l1792k8918k5719k3067k1192j9517j7700j5908
62655D95793j4198j2432j0736r400q380p466o888p063p731p919o981n197l276
62642C88126j765j027j275k121k553j818k93Q97J091O52K68O4l73j231k145k628
62626C73869k606k324j925j393p56j43M07R70J572K130K545K774K928L329M204
62611C85581N181N487M975M575N174O326O860O610O742Q171J0461J2662J4546
62598D83351J6497J8666K0826K2855K4942K7295K9869L2184L3396L2922L1171
$$ plain form
62587 773974 803186 830671 855930 877552 894092 904715 909064 907121 899421 886973 870614 850602
62575 850602 827013 800340 771555 741772 711948 682671 654067 626058 598866 573195 549803
62564 549803 528910 510032 492394 475632 460155 446690 435384 425623 416898 409417 403438 398362
62552 398362 393186 387727 382680 378454 374700 371180 368350 366596 365511 364512 363812 364120 365519 367228 368535
62537 368535 369491 370511 371619 372423 372803 373305 374599 376610 378612 380348 382657 386649 392545 399816 408212
62522 408212 417959 429094 441372 455044 471023 490004 511941 536576 563831 593424 624768 657700
62510 657700 692629 729396 766542 802301 835840 866877 894647 918158 937181 952066 962680
62499 962680 968397 969151 965657 958491 947752 933963 918609 903393 889481 877735 869143 864519 864110
$$ packed form
62587G73974K9212K7485K5259K1622J6540J0623M349j943p700j2448j6359k0012
62575H50602k3589k6673k8785k9783k9824k9277k8604k8009k7192k5671k3392
62564E49803k0893j8878j7638j6762j5477j3465j1306r761q725p481n979n076
62552C98362n176n459n047m226l754l520k830j754j085r99p00L08J399J709J307
62537C68535R56J020J108Q04L80N02J294K011K002J736K309L992N896P271Q396
62522D08212R747J1135J2278J3672J5979J8981K1937K4635K7255K9593L1344L2932
62510F57700L4929L6767L7146L5759L3539L1037K7770K3511J9023J4885J0614
62499I62680N717P54l494p166j0739j3789j5354j5216j3912j1746q592m624m09
$$ plain form
62486 864110 867918 876138 888968 906284 927963 954348 985964 1022685 1063279 1105605 1147138 1185644
62474 1185644 1219806 1249209 1273520 1291836 1303095 1306901 1303370 1292169 1272315 1243274 1205970 1162369
62462 1162369 1114289 1062934 1009309 954529 899640 845609 793676 745260 701192 661323 625227
62451 625227 593046 565189 541395 520705 502452 486745 473745 462903 453314 444579 436987 430929
62439 430929 426389 422940 420070 417520 415393 413872 412871 412133 411608 411341 410905 409479 406804 403681 401071
62424 401071 399009 396856 394320 391608 388729 385370 381589 378005 375041 372431 369711 366836 364037 361397
62410 361397 358879 356535 354410 352377 350301 348254 346373 344639 342903 341038 338988 336967 335688 336010
62396 336010 338053 340902 343524 345712 347776 349553 350407 350214 349812 350250 351940 354727 358334 362433 366568
$$ packed form
62486H64110L808Q220J2830J7316K1679K6385L1616L6721M0594M2326M1533L8506
62474A185644L4162K9403K4311J8316J1259L806l531j1201j9854k9041l7304m3601
62462A162369m8080n1355n3625n4780n4889n4031n1933m8416m4068l9869l6096
62451F25227l2181k7857k3794k0690j8253j5707j3000j0842r589q735p592o058
62439D30929m540l449k870k550k127j521j001p38n25k67m36j426k675l123k610
62424D01071k062k153k536k712k879l359l781l584k964k610k720k875k799k640
62410C61397k518k344k125k033k076k047j881j734j736j865k050k021j279L22
62396C36010K043K849K622K188K064J777Q54j93m02M38J690K787L607M099M135
$$ plain form
62381 366568 370444 374243 378417 383251 388814 395193 402463 410478 418977 427970 437843 449043 461750 475738
62367 475738 490506 505766 522054 540620 562324 586816 613315 642137 674827 712618 755430
62356 755430 802677 854382 910792 971199 1033767 1096380 1157075 1213759 1264196 1306583 1339957
62345 1339957 1364077 1379226 1386058 1385204 1376910 1361298 1338840 1310194 1275742 1235886 1191806 1145260
62333 1145260 1097507 1049090 1000938 954911 912661 874413 839472 807521 778721 752801 728885
62322 728885 706364 685304 665753 647191 629032 611393 594914 579825 565507 551146 536665
62311 536665 522819 510279 498901 488099 477790 468518 460616 453761 447593 442348 438403 435452 432676
62298 432676 429653 426690 424236 422408 421157 420477 420219 420003 419594 419160 418996 419165 419689 420890 423148 426292
$$ packed form
62381C66568L876L799M174M834N563O379P270Q015Q499Q993R873J1200J2707J3988
62367D75738J4768J5260J6288J8566K1704K4492K6499K8822L2690L7791M2812
62356G55430M7247N1705N6410O0407O2568O2613O0695N6684N0437M2387L3374
62345A339957K4120J5149O832q54q294j5612k2458k8646l4452l9856m4080m6546
62333A145260m7753m8417m8152m6027m2250l8248l4941l1951k8800k5920k3916
62322G28885k2521k1060j9551j8562j8159j7639j6479j5089j4318j4361j4481
62311E36665j3846j2540j1378j0802j0309r272p902o855o168n245l945k951k776
62298D32676l023k963k454j828j251o80k58k16m09m34j64J69N24J201K258L144
$$ plain form
62282 426292 429577 432480 435268 438535 442384 446419 450490 454981 460224 466000 471946 478109 484767 491936
62268 491936 499532 507988 518274 531294 547543 567234 590289 616256 644808 676500 712603 754036
62256 754036 800867 852930 910293 972660 1038702 1106308 1173225 1237145 1295677 1346778 1389161
62245 1389161 1422150 1445494 1459661 1465791 1464711 1456117 1439218 1413984 1381307 1342172 1297392 1248197
62233 1248197 1196445 1143826 1091139 1038563 986521 936108 888677 845032 805086 768403 734988
62222 734988 705255 679200 656029 634820 615186 597044 580130 564123 549004 534941 522073
62211 522073 510641 500997 493122 486528 480972 476789 474020 471742 468984 465958 463634 462419 462089 462735
62197 462735 464821 468307 472699 478102 485357 494856 506013 518123 531031 544619 558298 571520 584351
$$ packed form
62282D26292L285K903K788L267L849M035M071M491N243N776N946O163O658P169
62268D91936P596Q456J0286J3020J6249J9691K3055K5967K8552L1692L6103M1433
62256G54036M6831N2063N7363O2367O6042O7606O6917O3920N8532N1101M2383
62245A389161L2989K3344J4167O130j080q594j6899k5234l2677l9135m4780m9195
62233A248197n1752n2619n2687n2576n2042n0413m7431m3645l9946l6683l3415
62222G34988k9733k6055k3171k1209j9634j8142j6914j6007j5119j4063j2868
62211E22073j1432r644p875o594n556m183k769k278k758l026k324j215l30O46
62197D62735K086L486M392N403P255R499J1157J2110J2908J3588J3679J3222J2831
$$ plain form
62184 584351 597271 610716 624940 639771 654275 667173 677839 686524 693543 698842 702544 705310
62172 705310 707927 711129 716067 724226 736536 753126 774224 800562 832399 868890 908960 952069
62160 952069 997389 1042894 1086124 1125398 1159507 1186794 1205821 1216886 1221807 1221936 1217028 1206123
62148 1206123 1188784 1165287 1136360 1103178 1067203 1029670 991404 953238 916205 881144 848425
62137 848425 818225 790838 766554 745479 727616 712924 701176 691930 684782 679523 676070 674424
62125 674424 674796 677489 682539 689547 698001 707605 718179 729249 739841 748733 755039 758704 760530 761721
62111 761721 763313 765712 768403 769995 768917 764455 757161 748147 738137 727365 716240 705701 696728
62098 696728 689639 684011 679340 675677 673515 673077 673996 675848 678703 682796 687882 693522 699955 708033 718069
$$ packed form
62184E84351J2920J3445J4224J4831J4504J2898J0666Q685P019N299L702K766
62172G05310K617L202M938Q159J2310J6590K1098K6338L1837L6491M0070M3109
62160I52069M5320M5505M3230L9274L4109K7287J9027J1065M921J29m908j0905
62148A206123j7339k3497k8927l3182l5975l7533l8266l8166l7033l5061l2719
62137H48425l0200k7387k4284k1075j7863j4692j1748r246p148n259l453j646
62125F74424L72K693N050P008Q454R604J0574J1070J0592Q892O306L665J826J191
62111G61721J592K399K691J592j078m462p294r014j0010j0772j1125j0539q973
62098F96728p089n628m671l663k162m38R19J852K855M093N086N640O433Q078J0036
$$ plain form
62083 718069 729385 741359 754339 768981 785151 802158 819798 838482 858409 879248 900694
62072 900694 922768 945384 968084 990441 1012443 1034328 1056248 1078382 1101245 1125714 1152570
62061 1152570 1181813 1212312 1242206 1269823 1294132 1314406 1329897 1340214 1345778 1347416 1345447 1339320
62049 1339320 1328078 1310991 1287988 1259780 1227497 1191990 1153663 1113177 1071949 1031471 992352
62038 992352 954480 917987 883497 851513 822093 795139 770524 747928 727130 708515 692788
62027 692788 680049 669629 660941 653914 648288 643055 637047 629831 621688 612922 603506 593237 582067
62014 582067 570401 559162 549292 541067 534146 528304 523720 520439 518069 516343 515615 516424 518944 523173
62000 523173 529248 537003 545416 553070 559194 563918 567658 570641 572843 573884 573007 569696 564387 558114
$$ packed form
62083G18069J1316J1974J2980J4642J6170J7007J7640J8684J9927K0839K1446
62072I00694K2074K2616K2700K2357K2002K1885K1920K2134K2863K4469K6856
62061A152570K9243L0499K9894K7617K4309K0274J5491J0317N564J638j969o127
62049A339320j1242j7087k3003k8208l2283l5507l8327m0486m1228m0478l9119
62038I92352l7872l6493l4490l1984k9420k6954k4615k2596k0798j8615j5727
62027F92788j2739j0420q688p027n626n233o008p216q143q766r416j0269j1170
62014E82067j1666j1239r870q225o921n842m584l281k370j726p28Q09K520M229
62000E23173O075P755Q413P654O124M724L740K983K202J041q77l311n309o273
$$ plain form
61986 558114 551346 543631 534549 524484 514123 503574 492505 480977 469730 459618 451037 443869
61974 443869 437674 431909 426259 420844 415969 411611 407345 402829 398173 393739 389806 386650 384734 384405
61960 384405 385376 386746 387765 388495 389648 391847 395104 398927 402838 406810 411354 417174 424745 434128 445186
61945 445186 457925 472689 490067 510508 533939 559799 587565 617226 649041 682828 717668
61934 717668 752389 786231 819065 851174 882870 914090 944231 972437 998024 1020413 1038743
61923 1038743 1052036 1059955 1062997 1061665 1055879 1045646 1032037 1016930 1001918 987980 976122 967689
61911 967689 963803 964969 971392 983274 1000474 1022148 1047039 1073946 1101694 1128823 1153616 1174483
61899 1174483 1190200 1199933 1203232 1200008 1190496 1175290 1155428 1132154 1106331 1078159 1047639 1015373
$$ packed form
61986E58114o768p715r082j0065j0361j0549j1069j1528j1247j0112q581p168
61974D43869o195n765n650n415m875m358m266m516m656m434l933l156j916l29
61960C84405R71J370J019P30J153K199L257L823L911L972M544N820P571R383J1058
61945D45186J2739J4764J7378K0441K3431K5860K7766K9661L1815L3787L4840
61934G17668L4721L3842L2834L2109L1696L1220L0141K8206K5587K2389J8330
61923A038743J3293P919L042j332n786j0233j3609j5107j5012j3938j1858q433
61911I67689l886J166O423J1882J7200K1674K4891K6907K7748K7129K4793K0867
61899A174483J5717R733L299l224r512j5206j9862k3274k5823k8172l0520l2266
$$ plain form
61887 1015373 982780 951497 922558 895989 871031 846699 822340 797884 773683 750090 727166
61876 727166 704797 683123 662712 644166 627621 612826 599705 588555 579613 572776 567936 565271
61864 565271 564919 566585 569951 575324 583436 594585 608367 624386 642914 664775 690778 721352 756517
61851 756517 796151 840357 889344 942616 998525 1055162 1111634 1167835 1222912 1274697 1320957
61840 1320957 1360508 1392594 1415827 1428649 1430760 1423484 1408791 1388496 1364464 1338990 1314657 1293890
61828 1293890 1278600 1269892 1268011 1272677 1283481 1299827 1320693 1344722 1370262 1394872 1415057 1427374
61816 1427374 1430076 1423235 1407167 1381561 1346617 1304261 1257239 1207191 1154402 1099378 1043727 989223
61804 989223 936795 886920 840419 798055 759562 723809 690059 658637 630290 605275 583220
$$ packed form
61887A015373l2593l1283k8939k6569k4958k4332k4359k4456k4201k3593k2924
61876G27166k2369k1674k0411j8546j6545j4795j3121j1150q942o837m840k665
61864E65271l52J666L366N373Q112J1149J3782J6019J8528K1861K6003L0574L5165
61851G56517L9634M4206M8987N3272N5909N6637N6472N6201N5077N1785M6260
61840A320957L9551L2086K3233J2822K111p276j4693k0295k4032k5474k4333k0767
61828A293890j5290q708j881M666J0804J6346K0866K4029K5540K4610K0185J2317
61816A427374K702o841j6068k5606l4944m2356m7022n0048n2789n5024n5651n4504
61804I89223n2428m9875m6501m2364l8493l5753l3750l1422k8347k5015k2055
$$ plain form
61793 583220 563516 545601 529138 514135 500756 488914 478218 468457 459878 452733 446749 441302
61781 441302 435959 430651 425470 420658 416639 413659 411342 408973 406326 403872 402010 400415 398515 396416
61767 396416 394968 394853 395922 397555 399415 401595 404132 406746 409227 411802 414865 418449 422229 425939
61753 425939 429496 432705 435283 437265 439058 440784 441858 441502 439546 436515 433162 430155 427944 426454
61739 426454 424978 422790 419901 417000 414740 413364 412855 412988 413269 413321 413407 414149 415656 417389 419008 420881
61723 420881 423493 426771 430331 434035 437935 441890 445622 449008 451973 454275 455761 456753 457750 458727 459065
61708 459065 458257 456348 453525 449629 444443 438374 432412 427253 422634 417748 412240 406573 401394 396854
61694 396854 392691 388817 385524 383064 381239 379440 377119 374265 371463 369405 368251 367549 366812 365963 365117
$$ packed form
61793E83220j9704j7915j6463j5003j3379j1842j0696r761q579p145n984n447
61781D41302n343n308n181m812m019k980k317k369k647k454j862j595j900k099
61767C96416j448j15J069J633J860K180K537K614K481K575L063L584L780L710
61753D25939L557L209K578J982J793J726J074l56j956l031l353l007k211j490
61739D26454j476k188k889k901k260j376n09J33K81N2Q6P42J507J733J619J873
61723D20881K612L278L560L704L900L955L732L386K965K302J486R92R97R77L38
61708D59065q08j909k823l896n186o069n962n159m619m886n508n667n179m540
61694C96854m163l874l293k460j825j799k321k854k802k058j154p02p37q49q46
$$ plain form
61679 365117 364206 363150 362193 361708 361667 361616 361181 360393 359560 358990 358749 358458 357524 355869 354236 353382 353174 352985
61661 352985 352784 353181 354387 355877 357261 358857 361082 363868 366984 370388 373839 376682 378585 380204 382637
61646 382637 386365 391119 396505 402336 408542 415194 422533 430598 438816 446229 452015 455671 456972 456170
61632 456170 454093 451630 449113 446350 443066 439049 434105 428311 422246 416588 411488 406645 402009 398121
61618 398121 395673 394907 395404 396332 396999 397323 397654 397977 397511 395356 391417 386407 381070 375697 370261 364645
61602 364645 358708 352421 346045 339985 334468 329431 324621 319677 314310 308677 303457 299284 296176 293679
61588 293679 291351 288818 285639 281674 277565 274297 272142 270424 268498 266610 265463 265202 265155 264572 263391
61573 263391 262194 261517 261322 261152 260704 260117 259692 259496 259318 258960 258505 258395 259190 261059 263477 265601 266970
$$ packed form
61679C65117r11j056r57m85m1n1m35p88q33n70k41k91r34j655j633q54k08j89
61661C52985k01L97J206J490J384J596K225K786L116L404L451K843J903J619K433
61646C82637L728M754N386N831O206O652P339Q065Q218P413N786L656J301q02
61632D56170k077k463k517k763l284m017m944n794o065n658n100m843m636l888
61618C98121k448p66M97R28O67L24L31L23m66k155l939n010n337n373n436n616
61602C64645n937o287o376o060n517n037m810m944n367n633n220m173l108k497
61588B93679k328k533l179l965m109l268k155j718j926j888j147k61m7n83j181
61573B63391j197o77j95j70m48n87m25j96j78l58m55j10P95J869K418K124J369
$$ plain form
61556 266970 267706 268151 268593 269268 270179 270902 271072 271067 271647 272815 273760 274140 274626 275707 276882 277742 279090 281932
61538 281932 285817 289199 291172 291910 291812 291410 291942 294521 298467 301619 302765 302731 302691 302609 302078 301542 301554 301463
61520 301463 300108 297523 294931 293028 291235 288849 286172 284100 283035 282601 282242 281784 281423 281331 281471 281804
61504 281804 282456 283427 284264 284438 284081 283934 284465 285387 286200 286729 286913 286609 286002 285672 285721 285251 283549 281504
61486 281504 280966 282563 284949 286517 287155 287830 288957 290007 290601 291258 292735 294962 296997 297982 297938 297625
61470 297625 297782 298521 299406 300014 300339 300606 300818 300747 300390 300106 300076 299929 299310 298602 298541 299160 299776 300140 300944 302819
61450 302819 305377 307707 309380 310454 310948 310955 311011 311679 312950 314602 316914 320331 324562 328763 332595 336420
61434 336420 340468 344498 348305 351889 355075 357682 360115 363004 366135 368567 370007 371243 372955 375002
$$ packed form
61556B66970P36M45M42O75R11P23J70nN80J168R45L80M86J081J175Q60J348K842
61538B81932L885L382J973P38r8m02N32K579L946L152J146l4m0q2n31n36J2r1
61520C01463j355k585k592j903j793k386k677k072j065m34l59m58l61r2J40L33
61504B81804O52R71Q37J74l57j47N31R22Q13N29J84l04o07l30M9m70j702k045
61486B81504n38J597K386J568O38O75J127J050N94O57J477K227K035R85m4l13
61470B97625J57P39Q85O08L25K67K12p1l57k84l0j47o19p08o1O19O16L64Q04J875
61450C02819K558K330J673J074M94PN6O68J271J652K312L417M231M201L832L825
61434C36420M048M030L807L584L186K607K433K889L131K432J440J236J712K047
$$ plain form
61420 375002 377245 380081 383498 386468 388098 388827 389668 390789 391557 391556 390767 389097 386561 383721 381202 378951
61404 378951 376527 373913 371380 368772 365625 361886 357954 354121 350544 347551 345318 343441 341439 339548
61390 339548 338271 337293 335659 333131 330649 329294 329325 330319 331648 332706 333227 333555 334226 335302 336567 338239
61374 338239 340774 343948 346943 349502 352243 355526 358752 361252 363250 365413 367848 370059 371655 372703
61360 372703 373608 374973 377375 380995 385635 391218 397972 406005 415060 424960 435893 447921 460410 472278
61346 472278 482684 491459 499146 506726 514810 522858 529650 534859 539712 545624 552552 559222 564683 569013
61332 569013 572561 575098 575919 574444 570537 564471 556719 547823 538490 529652 522029 515474 509148 502636
61318 502636 496573 491830 488473 485985 484167 483169 482811 482652 482831 484203 487435 492446 498860 506366 514328
$$ packed form
61420C75002K243K836L417K970J630P29Q41J121P68jp89j670k536k840k519k251
61404C78951k424k614k533k608l147l739l932l833l577k993k233j877k002j891
61390C39548j277r78j634k528k482j355L1R94J329J058N21L28O71J076J265J672
61374C38239K535L174K995K559K741L283L226K500J998K163K435K211J596J048
61360C72703R05J365K402L620M640N583O754Q033R055R900J0933J2028J2489J1868
61346D72278J0406Q775P687P580Q084Q048O792N209M853N912O928O670N461M330
61332E69013L548K537Q21j475l907o066p752q896r333q838p623o555o326o512
61318E02636o063m743l357k488j818r98l58j59J79J372L232N011O414P506P962
$$ plain form
61303 514328 521644 527541 532125 535525 536830 534689 529020 521434 513678 506176 498486 490692 483634 477827
61289 477827 472780 467672 462353 457396 453361 450337 448168 446829 446490 447244 448799 450486 451867 453477 456715
61274 456715 462611 470766 479794 488729 497529 506228 514240 520926 526494 531910 538056 545338 553915 563853
61260 563853 575001 587055 599821 613120 626399 638744 649504 658720 666846 674218 680936 687012
61248 687012 692338 696542 699107 699711 698366 695284 690810 685476 679847 674037 667367 658801 647905 635407
61234 635407 622740 611022 600505 590951 582350 575059 569249 564433 559803 555020 550441 546455 542777
61221 542777 538717 534042 529257 524911 520974 517226 514052 512290 512129 512440 511618 509132 505990 503575 502186
61206 502186 501003 499386 497800 497191 497808 499102 500786 503509 508283 515645 525637 538302 553687 571321
$$ packed form
61303E14328P316N897M584L400J305k141n669p586p756p502p690p794p058n807
61289D77827n047n108n319m957m035l024k169j339l39P54J555J687J381J610L238
61274D56715N896Q155R028Q935Q800Q699Q012O686N568N416O146P282Q577R938
61260E63853J1148J2054J2766J3299J3279J2345J0760R216Q126P372O718O076
61248F87012N326M204K565O04j345l082m474n334n629n810o670q566j0896j2498
61234F35407j2667j1718j0517r554q601p291n810m816m630m783m579l986l678
61221E42777m060m675m785m346l937l748l174j762j61L11q22k486l142k415j389
61206E02186j183j617j586o09O17J294J684K723M774P362R992J2665J5385J7634
$$ plain form
61192 571321 589956 607917 623742 636695 646970 655386 662745 669446 675657 681531 687023 691749 695302
61179 695302 697662 699110 699907 700277 700485 700657 700713 700709 700949 701366 701123 699395 696375 692908 689284 685057 679963
61162 679963 674193 667638 659714 650372 640585 631364 622798 614555 606781 599914 594047 589139 585639 584183
61148 584183 584598 585646 585751 583652 578559 570285 559472 547328 534859 522384 509846 497505 486268
61135 486268 477293 471098 467019 463687 460201 456755 454194 453221 454036 456382 459760 463888 469079 475814 483851
61120 483851 492252 500606 509755 520907 534407 549762 566399 583854 601620 619520 637999 657388
61108 657388 677049 695969 714076 732145 750287 767318 781870 793532 802566 809060 812767 813430
61096 813430 810893 805147 796630 786272 774979 763093 750518 737206 723341 709128 694611 679780
$$ packed form
61192E71321J8635J7961J5825J2953J0275Q416P359O701O211N874N492M726L553
61179F95302K360J448P97L70K08J72N6mK40M17k43j728l020l467l624m227n094
61162F79963n770o555p924r342r787r221q566q243p774o867n867m908l500j456
61148E84183M15J048J05k099n093q274j0813j2144j2469j2475j2538j2341j1237
61135D86268q975o195m079l332l486l446k561r73Q15K346L378M128N191O735Q037
61120D83851Q401Q354R149J1152J3500J5355J6637J7455J7766J7900J8479J9389
61108F57388J9661J8920J8107J8069J8142J7031J4552J1662R034O494L707O63
61096H13430k537n746q517j0358j1293j1886j2575j3312j3865j4213j4517j4831
$$ plain form
61084 679780 664830 650257 636575 623862 611750 599967 588658 578024 567909 558094 548807 540563
61072 540563 533541 527434 521873 516766 512311 508908 506908 506206 506229 506570 507341 508729 510615 513032 516524
61057 516524 521513 527716 534851 543365 553577 564497 574638 584003 594221 606609 621017 636681
61045 636681 653291 670975 690057 711021 733930 757859 781854 806515 833533 863563 895749
61034 895749 929601 965880 1005068 1046198 1087891 1129403 1170134 1209560 1248601 1289652 1334208
61023 1334208 1381698 1431818 1486555 1548371 1617546 1692852 1773864 1861210 1956034 2061451 2183734
61012 2183734 2330329 2507917 2724453 2991593 3322644 3730408 4231162 4849437 5615145
61003 5615145 6560089 7724784 9158972 10881752 12809965 14728682 16366743 17537001
$$ packed form
61084F79780j4950j4573j3682j2713j2112j1783j1309j0634j0115r815r287q244
61072E40563p022o107n561n107m455l403k000p02K3L41P71J388J886K417L492
61057E16524M989O203P135Q514J0212J0920J0141R365J0218J2388J4408J5664
61045F36681J6610J7684J9082K0964K2909K3929K3995K4661K7018L0030L2186
61034H95749L3852L6279L9188M1130M1693M1512M0731L9426L9041M1051M4556
61023A334208M7490N0120N4737O1816O9175P5306Q1012Q7346R4824J05417J22283
61012B183734J46595J77588K16536K67140L31051M07764N00754O18275P65708
61003E615145R44944J164695J434188J722780J928213J918717J638061J170258
$$ plain form
60995 17537001 18222248 18540226 18647419 18685247 18785550 19060842 19535573 20082400 20457958
60986 20457958 20434848 19920788 18971739 17716559 16280783 14762047 13238601 11773968 10411895
60977 10411895 9175940 8076479 7115723 6288182 5582490 4985796 4485643 4068394 3718926
60968 3718926 3423206 3170066 2950516 2757146 2584739 2429937 2289549 2160181 2039856
60959 2039856 1928751 1827682 1736553 1654595 1581015 1514719 1454049 1397409 1343857 1292895 1244236
60948 1244236 1197997 1154569 1114022 1076051 1040548 1007619 976993 948098 920858 895669 872381
60937 872381 850034 827881 805979 784473 763039 741459 720087 699251 678797 658692 639522
60926 639522 621841 605464 589952 575420 562318 550684 540160 530552 521922 514284 507600 501957
$$ packed form
60995A7537001O85247L17978J07193L7828J00303K75292M74731N46827L75558
60986B0457958k3110n14060r49049j255180j435776j518736j523446j464633j362073
60977A0411895j235955j099461r60756q27541p05692n96694n00153m17249l49468
60968C718926k95720k53140k19550j93370j72407j54802j40388j29368j20325
60959B039856j11105j01069r1129q1958p3580o6296o0670n6640n3552n0962m8659
60948A244236m6239m3428m0547l7971l5503l2929l0626k8895k7240k5189k3288
60937H72381k2347k2153k1902k1506k1434k1580k1372k0836k0454k0105j9170
60926F39522j7681j6377j5512j4532j3102j1634j0524r608q630p638o684n643
$$ plain form
60914 501957 497422 493806 490820 488300 486187 484555 483813 484461 486338 488508 490248 491820 493876 496441 498963
60899 498963 501124 503055 504899 506650 508319 509802 510622 510271 508827 506852 504611 501764 497976 493542 489205
60884 489205 485455 482048 478194 473242 467300 461050 454877 448376 440925 432621 424293 416663 409878 403866
60870 403866 398722 394514 390969 387692 384628 382071 380257 379189 378845 379280 380340 381514 382322 382775 383185
60855 383185 383685 384271 385248 387010 389212 390765 391068 390707 390478 390229 389410 388315 387830 388062 388203 387822 387367
60838 387367 387122 386558 385188 383297 381326 379160 376635 374215 372575 371882 371966 372693 373643 373950 373207 372249 372272
60821 372272 373356 374522 375052 375057 374808 374293 373572 372984 372711 372503 371978 370924 369294 367192 364884 362515 359855
60804 359855 356627 352997 349405 345976 342478 338864 335414 332321 329528 327022 324952 323283 321651 319706
$$ packed form
60914E01957m535l616k986k520k113j632p42O48J877K170J740J572K056K565K522
60899D98963K161J931J844J751J669J483Q20l51j444j975k241k847l788m434m337
60884D89205l750l407l854m952n942o250o173o501p451q304q328p630o785o012
60870D03866n144m208l545l277l064k557j814j068l44M35J060J174Q08M53M10
60855C83185N00N86R77J762K202J553L03l61k29k49q19j095m85K32J41l81m55
60838C87367k45n64j370j891j971k166k525k420j640o93Q4P27R50L07p43r58K3
60821C72272J084J166N30Nk49n15p21n88k73k08n25j054j630k102k308k369k660
60804C59855l228l630l592l429l498l614l450l093k793k506k070j669j632j945
$$ plain form
60790 319706 317444 315108 312917 310887 308791 306321 303466 300698 298652 297681 297750 298493 299182 298986 297750 296399
60774 296399 296129 297235 299063 301008 303117 305721 308906 312476 316206 320046 324173 328769 333605 338058
60760 338058 341717 344715 347206 348913 349590 349606 349534 349513 349536 349986 351091 352140 352150 351247 350465 350221 350017 349700
60742 349700 349821 350276 349647 346674 341713 336091 330613 325352 320361 315814 311758 308292 305679 303810 301988
60727 301988 299763 297547 295802 294139 292020 289971 289116 289554 290125 289871 288955 287979 287140 286441 286149 286540 287369
60710 287369 287966 287858 287222 286784 287169 288252 289325 290035 290855 292294 294024 295349 296264 297336 298660 299771
60694 299771 300720 302351 305152 308489 311416 313720 315730 317623 319474 321537 323870 326039 327837 329995
60680 329995 333407 337724 341438 343451 343970 343827 343670 344046 345495 347936 350337 351485 350960 349072 346226
$$ packed form
60790C19706k262k336k191k030k096k470k855k768k046r71O9P43O89j96j236j351
60774B96399k70J106J828J945K109K604L185L570L730L840M127M596M836M453
60760C38058L659K998K491J707O77J6p2k1K3M50J105J049J0r03p82k44k04l17
60742C49700J21M55o29k973m961n622n478n261m991m547m056l466k613j869j822
60727C01988k225k216j745j663k119k049q55M38N71k54r16r76q39o99k92L91Q29
60710B87369N97j08o36m38L85J083J073P10Q20J439J730J325R15J072J324J111
60694B99771R49J631K801L337K927K304K010J893J851K063K333K169J798K158
60680C29995L412M317L714K013N19j43j57L76J449K441K401J148n25j888k846
$$ plain form
60665 346226 342819 339459 336673 334350 331909 329080 326173 323612 321560 320047 319090 318544 318159 317938 318257
60650 318257 319452 321448 323782 325859 327227 327915 328479 329429 330556 331135 330754 329541 327615 324892 321636
60635 321636 318584 316123 313847 311350 309027 307526 306728 305879 304569 303066 301826 301178 301336 302156 302961 303128
60619 303128 302894 303073 304031 305350 306484 307235 307659 308058 309049 310985 313206 314529 314631 314394 314629 315136 315354
60602 315354 315306 315367 315632 316064 316980 318778 321301 323920 326133 327765 328797 329392 329964 330752 331397 331274 330276
60585 330276 328952 327888 327163 326441 325356 323848 322361 321689 322401 324315 326650 328715 330406 332166 334640
60570 334640 338427 343918 351175 359830 369170 378451 387312 395767 403679 410375 415028 417322 417475 415745
60556 415745 412360 407947 403515 399776 396855 394743 393554 393081 392673 392125 392352 394611 399049 404543 410002
$$ packed form
60665C46226l407l360k786k323k441k829k907k561k052j513r57n46l85k21L19
60650C18257J195J996K334K077J368O88N64R50J127N79l81j213j926k723l256
60635C21636l052k461k276k497k323j501p98q49j310j503j240o48J58Q20Q05J67
60619C03128k34J79R58J319J134P51M24L99R91J936K221J323J02k37K35N07K18
60602C15354m8O1K65M32R16J798K523K619K213J632J032N95N72P88O45j23r98
60585C30276j324j064p25p22j085j508j487o72P12J914K335K065J691J760K474
60570C34640L787N491P257Q655R340R281Q861Q455P912O696M653K294J53j730
60556D15745l385m413m432l739k921k112j189m73m08n48K27K259M438N494N459
$$ plain form
60541 410002 415569 422453 431771 443507 456411 468878 479975 489604 497780 504139 508325 510421 510622
60528 510622 508778 504782 499365 493988 489753 486633 483872 480913 477800 474817 472004 469213 466561 464585
60514 464585 463690 463578 463576 463531 463997 465461 467780 470597 473933 478115 483447 490358 499688 512481 529422 550506
60498 550506 575072 602120 630951 661696 694944 730651 767727 804719 840358 873075 900597
60487 900597 920735 932376 935289 929376 914823 892836 865459 834507 801079 766013 730253 694684
60475 694684 660130 627593 598064 571878 548549 527327 507724 489564 472932 458134 445385
60464 445385 434451 424843 416300 408801 402152 396043 390543 386166 383234 381446 380123 378631 376550 373789
60450 373789 370682 367741 365194 362922 360841 359051 357615 356417 355310 354165 352838 351362 350173 349766
$$ packed form
60541D10002N567O884R318J1736J2904J2467J1097R629Q176O359M186K096K01
60528E10622j844l996n417n377m235l120k761k959l113k983k813k791k652j976
60514D64585q95j12km5M66J464K319K817L336M182N332O911R330J2793J6941K1084
60498E50506K4566K7048K8831L0745L3248L5707L7076L6992L5639L2717K7522
60487I00597K0138J1641K913n913j4553k1987k7377l0952l3428l5066l5760l5569
60475F94684l4554l2537k9529k6186k3329k1222j9603j8160j6632j4798j2749
60464D45385j0934r608q543p499o649o109n500m377k932j788j323j492k081k761
60450C73789l107k941k547k272k081j790j436j198j107j145j327j476j189m07
$$ plain form
60436 349766 350024 350216 349770 348835 347947 347397 347054 346656 346104 345557 345272 345283 345325 345193 345053 345197 345574 345837 345824 345777
60416 345777 346117 347137 348782 350524 351656 351995 352144 352730 353664 354520 355383 356668 358231 359352 359722 359891
60400 359891 360556 361911 363828 366208 368936 371889 375165 378905 382736 385886 388066 389831 391859 394215
60386 394215 396482 398198 399000 398903 398776 400005 403195 407476 411492 414770 417769 420916 424196 427536 431086
60371 431086 434983 439090 442982 446058 447852 448514 448859 449708 451249 453190 455404 458115 461505 465427 469621
60356 469621 474170 479740 487321 497484 509748 522845 535694 547977 559680 570319 578814 584008
60344 584008 585245 582693 577337 570459 562854 554584 545586 536353 527807 520604 514754 509798 505222 500752
60330 500752 496368 492033 487456 482300 476585 470650 464699 458697 452790 447497 443253 440061 437766 436407
$$ packed form
60436C49766K58J92m46r35q88n50l43l98n52n47k85J1M2j32j40J44L77K63j3m7
60416C45777L40J020J645J742J132L39J49N86R34Q56Q63J285J563J121L70J69
60400C59891O65J355J917K380K728K953L276L740L831L150K180J765K028K356
60386C94215K267J716Q02r7j27J229L190M281M016L278K999L147L280L340L550
60371D31086L897M107L892L076J794O62L45Q49J541J941K214K711L390L922M194
60356D69621M549N570P581J0163J2264J3097J2849J2283J1703J0639Q495N194
60344E84008J237k552n356o878p605q270q998r233q546p203n850m956m576m470
60330E00752m384m335m577n156n715n935n951o002n907n293m244l192k295j359
$$ plain form
60316 436407 436085 436772 438554 441880 447280 454980 465002 477342 491679 507127 522772 538474 554731
60303 554731 571528 587544 600674 609348 613359 613497 610444 604130 594221 581091 566010 550396 535168
60290 535168 520896 508139 497266 488154 480406 473779 468184 463383 459000 454857 451140 448190 446150
60277 446150 444674 442951 440300 436961 434055 432428 431582 430084 427031 422900 418892 415637 412696 409290
60263 409290 405390 401928 399864 399168 398906 398239 397092 395897 395041 394703 394858 395258 395598 395894 396454 397406 398475
60246 398475 399412 400355 401554 402981 404418 405688 406550 406631 405788 404405 403095 402209 401789 401782 402089 402607 403504 405236
60228 405236 407995 411293 414355 416777 418591 419950 421127 422608 424714 427163 429368 431206 433250 436226
60214 436226 440429 445565 450960 456030 460876 466340 473200 481283 489588 497218 504003 510328 516627 523030
$$ packed form
60316D36407l22O87J782L326N400P700J0022J2340J4337J5448J5645J5702J6257
60303E54731J6797J6016J3130Q674M011J38l053o314r909j3130j5081j5614j5228
60290E35168j4272j2757j0873r112p748o627n595m801m383m143l717k950k040
60277D46150j476j723k651l339k906j627q46j498l053m131m008l255k941l406
60263D09290l900l462k064o96k62o67j147j195q56l38J55M00L40K96N60R52J069
60246C98475R37R43J199J427J437J270Q62Q1q43j383j310q86m20pL07N18Q97J732
60228D05236K759L298L062K422J814J359J177J481K106K449K205J838K044K976
60214D36226M203N136N395N070M846N464O860Q083Q305P630O785O325O299O403
$$ plain form
60200 523030 529270 534936 539969 544817 549897 555001 559457 562812 565101 566575 567434 567802 567708 567034 565594
60185 565594 563263 559966 555731 550843 545696 540353 534577 528502 522874 518223 514160 510045 506073 502981
60171 502981 500801 498677 496037 493289 491048 489226 487287 485015 482565 480007 477237 474354 471836 470266
60157 470266 469898 470455 471313 471971 472338 472523 472500 472214 471926 472121 472978 474203 475427 476577 477831 479464 481813
60140 481813 485134 489351 494152 499435 505443 512276 519451 526146 531848 536642 540884 544682 547752 549801
60126 549801 551009 551975 553164 554558 555982 557527 559345 561196 562629 563647 564812 566524 568423 569763
60112 569763 570289 570607 571631 573639 575901 577289 577295 576286 574783 572775 570026 566731 563450 560437 557416
60097 557416 554020 550181 546120 542270 539189 537199 536024 535057 534035 533205 532802 532677 532459 531858 530756 529364
$$ packed form
60200E23030O240N666N033M848N080N104M456L355K289J474Q59L68r4o74j440
60185E65594k331l297m235m888n147n343n776o075n628m651m063m115l972l092
60171E02981k180k124k640k748k241j822j939k272k450k558k770k883k518j570
60157D70266l68N57Q58O58L67J85k3k86k88J95Q57J225J224J150J254J633K349
60140D81813L321M217M801N283O008O833P175O695N702M794M242L798L070K049
60126E49801J208R66J189J394J424J545J818J851J433J018J165J712J899J340
60112E69763N26L18J024K008K262J388Oj009j503k008k749l295l281l013l021
60097E57416l396l839m061l850l081j990j175r67j022q30m03j25k18o01j102j392
$$ plain form
60081 529364 528301 528190 529010 530100 530840 531029 530565 529238 527101 524687 522458 520207 517276 513332 508737
60066 508737 504212 500259 496842 493521 489919 486073 482249 478524 474799 471195 468075 465565 463400 461427
60052 461427 459983 459461 459718 460221 460734 461611 463419 466405 470286 474462 478517 482556 486966 491851 496919
60037 496919 501959 507047 512032 516075 518224 518450 517766 517193 516787 515832 513727 510464 506307 501341 495614
60022 495614 489610 484239 480073 476704 473101 468593 463281 457515 451337 444708 438032 432061 427217 423212
60008 423212 419386 415287 410905 406546 402662 399680 397750 396545 395497 394390 393653 393872 394975 396107 396374
59993 396374 395667 394728 394572 395790 398206 401073 403785 406445 409524 412993 416171 418624 420751 423099 425477
59978 425477 427269 428376 429186 429687 429268 427618 425301 423231 421911 421382 421429 421510 420858 419128 416917 415280
$$ packed form
60081E29364j063j11Q20J090P40J89m64j327k137k414k229k251k931l944m595
60066E08737m525l953l417l321l602l846l824l725l725l604l120k510k165j973
60052D61427j444n22K57N03N13Q77J808K986L881M176M055M039M410M885N068
60037D96919N040N088M985M043K149K26o84n73m06r55k105l263m157m966n727
60022D95614o004n371m166l369l603m508n312n766o178o629o676n971m844m005
60008D23212l826m099m382m359l884k982j930j205j048j107p37K19J103J132K67
59993C96374p07r39j56J218K416K867K712K660L079L469L178K453K127K348K378
59978D25477J792J107Q10N01m19j650k317k070j320n29M7Q1o52j730k211j637
$$ plain form
59962 415280 414694 414656 414312 413350 412241 411682 411849 412244 412268 411769 410954 410001 409039 408331 408114 408299 408699 409524 411163
59943 411163 413369 415078 415301 413933 411563 408833 406187 403871 401807 399667 397374 395399 394298 394145 394702
59928 394702 395922 397910 400445 403028 405522 408496 412722 418372 424750 430737 435582 439354 442671 445959
59914 445959 449007 451323 452756 453645 454434 455355 456460 457694 458829 459447 459196 458116 456713 455733 455833 457264
59898 457264 459660 462094 463559 463668 462986 462618 463431 465605 468800 472559 476568 480757 485267 490188 495293
59883 495293 500151 504516 508399 511726 514288 516196 518105 520654 523796 526895 529285 530511 530318 528847
59869 528847 526672 524266 521500 518067 514260 510824 508044 505550 503166 501425 500909 501416 502159 502668 503266
59854 503266 504762 507823 512632 519044 526937 536133 545807 554296 560054 562901 564016 564703 565539 566689 568387
$$ packed form
59962D15280n86l8l44r62j109n59J67L95K4m99q15r53r62p08k17J85M00Q25J639
59943D11163K206J709K23j368k370k730k646k316k064k140k293j975j101j53N57
59928C94702J220J988K535K583K494K974M226N650O378N987M845L772L317L288
59914D45959L048K316J433Q89P89R21J105J234J135O18k51j080j403r80J00J431
59898D57264K396K434J465J09o82l68Q13K174L195L759M009M189M510M921N105
59883D95293M858M365L883L327K562J908J909K549L142L099K390J226j93j471
59869E28847k175k406k766l433l807l436k780k494k384j741n16N07P43N09N98
59854E03266J496L061M809O412P893R196R674Q489N758K847J115O87Q36J150J698
$$ plain form
59839 568387 570649 572838 573946 573268 570630 566162 560160 553152 545837 538875 532673 527288 522439 517768
59825 517768 513214 509122 505922 503703 502103 500590 498924 497429 496655 496629 496502 495175 492226 488128 483671
59810 483671 479443 475783 472884 470738 469030 467169 464591 461311 458174 456165 455314 454699 453758 453057 453269
59795 453269 454016 454423 454440 454682 455147 455088 454280 453509 453514 454136 454854 455541 456350 457295 458243 458972 459144 458617 457849 457478
59775 457478 457445 457138 456446 455993 456134 456464 456613 456859 457598 458805 460319 462107 463957 465572 467243 469651 472638
59758 472638 475042 476328 477606 480294 484398 488885 493194 497523 502075 506878 512063 517591 522931 527666
59744 527666 532141 536865 541674 546158 550535 555140 559330 561911 562669 562649 562835 563327 563883 564396 564574 563877
59728 563877 562237 560359 558938 557852 556429 554248 551501 548749 546538 545164 544621 544681 544887 544573 543247
$$ packed form
59839E68387K262K189J108o78k638m468o002p008p315o962o202n385m849m671
59825E17768m554m092l200k219j600j513j666j495p74k6j27j327k949m098m457
59810D83671m228l660k899k146j708j861k578l280l137k009q51o15r41p01K12
59795D53269P47M07J7K42M65n9q08p71NO22P18O87Q09R45R48P29J72n27p68l71
59775D57478l3l07o92m53J41L30J49K46P39J207J514J788J850J615J671K408K987
59758D72638K404J286J278K688M104M487M309M329M552M803N185N528N340M735
59744E27666M475M724M809M484M377M605M190K581P58k0J86M92N56N13J78o97
59728E63877j640j878j421j086j423k181k747k752k211j374n43O0K06l14j326
$$ plain form
59713 543247 541190 539338 538349 538053 538016 538207 538707 539237 539598 540292 542087 545072 548654 552364 556096 559706
59697 559706 562930 565775 568538 571424 574420 577357 579730 580715 579934 578078 576284 575028 574051 573096 572087
59682 572087 570725 568664 566092 563517 560986 558083 554694 551096 547306 543030 538396 534072 530380 526864
59668 526864 523007 518942 515258 512428 510583 509505 508736 508037 507669 507872 508219 508136 508011 509000 511573 515019
59652 515019 518676 522833 527903 533316 537925 541181 543344 544762 545455 545280 544040 541479 537521 532530 527091
59637 527091 521576 516113 510927 506409 502798 499891 497135 494033 490500 486874 483566 480721 478204 475775
59623 475775 473154 470092 466610 463043 459604 455991 451724 446829 441888 437463 433747 430767 428591 427208
59609 427208 426447 426129 426228 426872 428199 430108 432051 433274 433439 432954 432568 432828 434000 436154 439015 441947
$$ packed form
59713E43247k057j852r89k96l7J91N00N30L61O94J795K985L582L710L732L610
59697E59706L224K845K763K886K996K937K373R85p81j856j794j256r77r55j009
59682E72087j362k061k572k575k531k903l389l598l790m276m634m324l692l516
59668E26864l857m065l684k830j845j078p69o99l68K03L47q3j25R89K573L446
59652E15019L657M157N070N413M609L256K163J418O93j75j240k561l958m991n439
59637E27091n515n463n186m518l611k907k756l102l533l626l308k845k517k429
59623D75775k621l062l482l567l439l613m267m895m941m425l716k980k176j383
59609D27208p61l18R9O44J327J909J943J223J65m85l86K60J172K154K861K932
$$ plain form
59593 441947 444367 446032 446852 446862 446580 446857 447955 449250 450273 451405 452902 453835 452961 450330 447130 444175
59577 444175 441473 439072 437207 435565 433432 430748 428128 425697 422893 419702 417118 415854 415361 414636 413386
59562 413386 411969 410786 410129 410097 410276 410037 409485 409514 410498 411576 411746 411144 410669 410812 411482 412701 414773 417876
59544 417876 422014 427343 434118 442334 451806 462764 476233 493450 514398 536672 556163 569502
59532 569502 575996 577126 574701 570184 565212 561400 559217 557945 557069 556942 557803 559105 560354 561830 563828
59517 563828 565756 566625 565942 563606 559482 553703 546915 539571 531306 521619 510858 500028 489965 481245
59503 481245 474408 469523 465702 461792 457530 453484 450017 446902 443972 441525 439902 439024 438537 438206 438079
59488 438079 438318 438891 439467 439771 440004 440689 442056 443937 446229 449026 452201 455362 458454 461896 465880 469965
$$ packed form
59593D41947K420J665Q20J0k82K77J098J295J023J132J497R33q74k631l200k955
59577D44175k702k401j865j642k133k684k620k431k804l191k584j264m93p25j250
59562D13386j417j183o57l2J79k39n52K9R84J078J70o02m75J43O70J219K072L103
59544D17876M138N329O775Q216R472J0958J3469J7217K0948K2274J9491J3339
59532E69502O494J130k425m517m972l812k183j272q76j27Q61J302J249J476J998
59517E63828J928Q69o83k336m124n779o788p344q265r687j0761j0830j0063q720
59503D81245o837m885l821l910m262m046l467l115k930k447j623q78m87l31j27
59488D38079K39N73N76L04K33O85J367J881K292K797L175L161L092L442L984M085
$$ plain form
59472 469965 473647 476854 479591 481622 482930 484092 485717 487775 489766 491272 492103 492336 492498 493301 494880
59457 494880 496734 498706 501445 505494 510518 515937 521769 528264 535175 542015 548634 554845 559912 563112
59443 563112 564570 564843 563869 561032 556137 549672 542209 534192 526306 519432 514048 509961 506592 503338 499890
59428 499890 496562 494125 492958 492625 492678 493586 496355 501424 508427 516970 527122 539136 553052 568692
59414 568692 586081 605942 629426 656426 683816 706220 719377 722660 718258 708838 696627 683766
59402 683766 672116 662898 657373 657361 663663 673745 682171 684061 677965 665621 649779 632524 614869
59389 614869 597243 580197 564570 550915 539129 528988 520722 514596 510293 507353 505941 506506 508826
59376 508826 512068 515652 519428 523203 526846 530800 535783 541892 548527 555118 561370 566991 571906 576648
$$ packed form
59472D69965L682L207K737K031J308J162J625K058J991J506Q31K33J62Q03J579
59457D94880J854J972K739M049N024N419N832O495O911O840O619O211N067L200
59443E63112J458K73r74k837m895o465p463q017p886o874n384m087l369l254l448
59428D99890l328k437j167l33N3R08K769N069P003Q543J0152J2014J3916J5640
59414E68692J7389J9861K3484K7000K7390K2404J3157L283m402r420j2211j2861
59402F83766j1650r218n525j2O302J0082Q426J890o096j2344j5842j7255j7655
59389F14869j7626j7046j5627j3655j1786j0141q266o126m303k940j412N65K320
59376E08826L242L584L776L775L643L954M983O109O635O591O252N621M915M742
$$ plain form
59362 576648 581853 587412 592819 598239 604378 611361 618617 625978 633941 642591 651150 658992 666478 674382
59348 674382 683025 692272 701861 711432 720640 729522 738398 747290 755783 763482 770157 775497 779293 781832
59334 781832 783445 783584 781088 775567 767881 759106 749717 739940 730104 720241 710022 699528 689556 680771
59320 680771 673091 666259 660388 655542 651342 647528 644430 642362 640974 639762 638903 639057 640549 643244 647075
59305 647075 652324 659500 669113 681156 694278 705651 712258 712592 707119 697375 684841 670481 654877
59292 654877 638597 622463 607465 594366 583424 574424 566875 560267 554363 549214 544831 541050 537915
59279 537915 535917 535396 535967 537025 538669 541544 545886 551388 557929 565683 574424 583506 592736 602444 612368
59264 612368 621224 627949 632811 636740 640033 642280 643134 642461 639917 635025 627804 619033 609880 601379 594047
$$ packed form
59362E76648N205N559N407N420O139O983P256P361P963Q650Q559P842P486P904
59348F74382Q643R247R589R571R208Q882Q876Q892Q493P699O675N340L796K539
59334G81832J613J39k496n521p686q775r389r777r836r863j0219j0494r972q785
59320F80771p680o832n871m846m200l814l098k068j388j212q59J54J492K695L831
59305F47075N249P176R613J2043J3122J1373O607L34n473r744j2534j4360j5604
59292F54877j6280j6134j4998j3099j0942r000p549o608n904n149m383l781l135
59279E37915j998n21N71J058J644K875M342N502O541P754Q741R082R230R708R924
59264F12368Q856O725M862L929L293K247Q54o73k544m892p221q771r153q501p332
$$ plain form
59249 594047 587795 582281 577434 573503 570585 568418 566775 565728 565430 565886 567122 569256 572246 575794 579635
59234 579635 583667 587777 591842 595928 600091 603983 607078 609401 611479 613440 614592 614107 611703 607553
59220 607553 602090 596112 590533 585709 581410 577633 574843 573171 572040 571006 570351 570310 570353 569873 569183 569038
59204 569038 569424 569529 568855 567795 567087 567150 567902 568848 569290 568780 567453 565844 564496 563753 563603 563564 563104 562428
59186 562428 562521 564115 566854 569778 572268 574298 576128 578169 580736 583544 585786 587178 588536 590790 593755
59171 593755 596598 599288 602828 608013 614664 622239 630517 639358 648213 656366 663560 670134 676560 682933
59157 682933 688837 693594 696611 697530 696217 692861 688117 682849 677492 671755 665075 657261 648613 639638
59143 639638 630791 622268 613837 605059 595871 586857 578708 571569 565086 558958 553246 548244 544204 541139
$$ packed form
59249E94047o252n514m847l931k918k167j643j047k98M56J236K134K990L548L841
59234E79635M032M110M065M086M163L892L095K323K078J961J152m85k404m150
59220F07553n463n978n579m824m299l777k790j672j131j034o55m1M3m80o90j45
59204E69038L86J05o74j060p08O3P52R46M42n10j327j609j348p43j50l9m60o76
59186E62428R3J594K739K924K490K030J830K041K567K808K242J392J358K254K965
59171E93755K843K690L540N185O651P575Q278Q841Q855Q153P194O574O426O373
59157F82933N904M757L017R19j313l356m744n268n357n737o680p814q648q975
59143F39638q847q523q431q778r188r014q149p139o483o128n712n002m040l065
$$ plain form
59129 541139 538783 536834 535270 534277 533877 533930 534615 536576 540322 545669 552025 559056 566909 575861 585929
59114 585929 596735 607699 618520 629502 641228 653853 666970 680208 693649 707507 721704
59103 721704 735991 750221 764246 777678 789897 800251 808223 813649 816831 818277 818331 817289 815831
59090 815831 814899 814982 815754 816482 816538 815610 813802 811531 808907 805201 799413 791380 781875 771586 760666 749308
59074 749308 737975 726708 714913 702311 689529 677339 665800 654614 643827 633681 624172 615209
59062 615209 606903 599277 592078 585239 579140 574019 569532 565335 561641 558753 556463 554388 552494 550828
59048 550828 549207 547736 547129 547812 549070 549846 550190 551158 553385 556410 559343 561620 563193 564529 566438
59033 566438 569379 572903 576182 579031 582087 586194 592039 600149 610608 622784 635847 649589 664334
$$ packed form
59129E41139k356j949j564r93m00N3O85J961L746N347O356P031P853Q952J0068
59114E85929J0806J0964J0821J0982J1726J2625J3117J3238J3441J3858J4197
59103G21704J4287J4230J4025J3432J2219J0354P972N426L182J446N4j042j458
59090H15831r32Q3P72P28N6r28j808k271k624l706n788q033r505j0289j0920j1358
59074G49308j1333j1267j1795j2602j2782j2190j1539j1186j0787j0146r509q963
59062F15209q306p626p199o839o099n121m487m197l694k888k290k075j894j666
59048E50828j621j471o07O83J258P76L44R68K227L025K933K277J573J336J909
59033E66438K941L524L279K849L056M107N845Q110J0459J2176J3063J3742J4745
$$ plain form
59020 664334 680148 696622 713352 730076 746311 761327 774595 785864 794741 800598 803141 802865
59008 802865 800818 798027 795141 792438 790088 788434 787932 788822 791037 794415 798667 803053 806530 808471 808943
58993 808943 808111 805709 801397 795200 787282 777669 766518 754259 741133 727034 712234 697847 685018
58980 685018 674010 664591 656921 651426 647948 645695 643940 642432 641307 641060 642376 645505 649899 654785
58966 654785 659816 664897 669812 674539 679545 685168 690975 696227 700652 704228 706574 707228 706199 703618
58952 703618 699150 692541 684491 676223 668289 660525 652993 646168 640251 635070 630716 627570 625602 624232
58938 624232 622911 621366 619300 616470 613068 609442 605561 601254 596886 593118 590113 587664 585968 585466
58924 585466 585810 585765 584434 582050 579427 577149 575449 574331 573606 573118 573040 573707 575323 578158 582717 589134
$$ packed form
59020F64334J5814J6474J6730J6724J6235J5016J3268J1269Q877N857K543k76
59008H02865k047k791k886k703k350j654n02Q90K215L378M252M386L477J941M72
58993H08943q32k402m312o197p918r613j1151j2259j3126j4099j4800j4387j2829
58980F85018j1008r419p670n495l478k253j755j508j125k47J316L129M394M886
58966F54785N031N081M915M727N006N623N807N252M425L576K346O54j029k581
58952G03618m468o609q050q268p934p764p532o825n917n181m354l146j968j370
58938F24232j321j545k066k830l402l626l881m307m368l768l005k449j696n02
58924E85466L44m5j331k384k623k278j700j118p25m88p8O67J616K835M559O417
$$ plain form
58908 589134 596600 604038 611193 618460 625906 633335 641120 650023 660020 670189 679874 689104 697662 704646
58894 704646 709466 712640 715245 718044 721418 725632 730846 737261 745404 755740 767754 779899 790751
58881 790751 799874 807479 813772 818827 822655 825124 826092 825669 824027 821020 816539 811198 806019 801270 796229
58866 796229 790284 783776 777483 771733 766263 760604 754377 747394 739536 730438 719631 707385 694970
58853 694970 683363 672019 659773 646812 634726 624612 616141 608622 601921 595965 590342 584867 579761
58840 579761 574807 569159 562535 555833 549997 544898 539945 535174 531046 527693 524968 522834 521081 519081
58826 519081 516484 513914 512346 512012 512439 513328 514743 516487 517903 518532 518733 519516 521725 525226 528784 530936
58810 530936 531163 530142 528928 528178 528101 528619 529302 529521 529071 528483 528510 529360 530561 531399 531398 530514 529018 527227
$$ packed form
58908E89134P466P438P155P267P446P429P785Q903R997J0169R685R230Q558O984
58894G04646M820L174K605K799L374M214N214O415Q143J0336J2014J2145J0852
58881G90751R123P605O293N055L828K469R68m23j642l007m481n341n179m749n041
58866G96229n945o508o293n750n470n659o227o983p858r098j0807j2246j2415
58853F94970j1607j1344j2246j2961j2086j0114q471p519o701n956n623n475n106
58840E79761m954n648o624o702n836n099m953m771m128l353k725k134j753k000
58826E19081k597k570j568l34M27Q89J415J744J416O29K01P83K209L501L558K152
58810E30936K27j021j214p50p7N18O83K19m50n88K7Q50J201Q38jq84j496j791
$$ plain form
58792 527227 525428 524021 523360 523214 522797 521772 520953 521469 523525 526491 529949 533972 538633 544041 550689
58777 550689 558831 567513 575170 581302 586650 591487 594742 595258 593140 589339 584599 579334 573949 568657
58763 568657 563243 557441 551319 545096 538996 533450 528988 525658 522971 520636 518911 517992 517597 517455 517806
58748 517806 519052 521173 523758 526347 528689 530957 533819 537900 543040 548392 553252 557544 561653 566222
58734 566222 571909 578739 585797 592207 598289 605172 613361 622408 631738 640792 648479 653621 656231 657469
58720 657469 658195 658517 658880 660433 663820 668517 673800 679566 685759 691886 697600 702982 707796 711162 712439
58705 712439 711715 709124 704411 697520 688814 678411 666139 652494 638610 624819 610231 594365 578268
58692 578268 563395 550227 538669 528886 520873 513889 507170 500662 494469 488241 481872 476139 471819
$$ packed form
58792E27227j799j407o61j46m17j025q19N16K056K966L458M023M661N408O648
58777E50689Q142Q682P657O132N348M837L255N16k118l801m740n265n385n292
58763E68657n414n802o122o223o100n546m462l330k687k335j725r19l95j42L51
58748E17806J246K121K585K589K342K268K862M081N140N352M860M292M109M569
58734E66222N687O830P058O410O082O883Q189R047R330R054P687N142K610J238
58720F57469P26L22L63J553L387M697N283N766O193O127N714N382M814L366J277
58705G12439p24k591m713o891q706j0403j2272j3645j3884j3791j4588j5866j6097
58692E78268j4873j3168j1558r783q013o984o719o508o193o228o369n733m320
$$ plain form
58679 471819 468628 465688 462666 459900 457866 456961 457313 458410 459525 460889 463657 468321 474024 480061 487164
58664 487164 496526 508200 521063 533599 544075 550876 553699 553932 553109 551510 548771 545009 540535 535197
58650 535197 528950 522495 516535 510942 505417 500321 496036 492160 488174 484321 480976 477848 474758 472570
58636 472570 472240 473320 474464 475118 475822 477143 479111 481439 483534 484596 484433 483894 483887 484349 484710 484837 484906
58619 484906 484994 485512 487365 490826 494791 497992 500463 503050 506123 509626 513721 518343 522582 525530 527462
58604 527462 529312 531373 533333 535121 536866 538304 539010 538922 538099 536512 534599 533257 532590 531554 529709
58589 529709 528403 529221 532094 536071 541075 547560 555116 562863 570731 579043 587302 594741 601571 608354
58575 608354 614660 619897 625112 632261 641686 651845 661714 672070 684139 698208 713985 731357 750392
$$ packed form
58679D71819l191k940l022k766k034r05L52J097J115J364K768M664N703O037P103
58664D87164R362J1674J2863J2536J0476O801K823K33q23j599k739l762m474n338
58650E35197o247o455n960n593n525n096m285l876l986l853l345l128l090k188
58636D72570l30J080J144O54P04J321J968K328K095J062j63n39pM62L61J27O9
58619D84906Q8N18J853L461L965L201K471K587L073L503M095M622M239K948J932
58604E27462J850K061J960J788J745J438P06q8q23j587j913j342o67j036j845
58589E29709j306Q18K873L977N004O485P556P747P868Q312Q259P439O830O783
58575F08354O306N237N215P149R425J0159R869J0356J2069J4069J5777J7372J9035
$$ plain form
58562 750392 771272 794480 820454 848961 879104 909739 939452 966570 989854 1008927 1023633
58551 1023633 1033595 1038932 1040613 1039429 1035428 1029062 1021757 1014287 1005637 994739 982222 968968 953989
58538 953989 935582 913994 891129 868107 844874 821792 799760 778999 759389 741758 727089
58527 727089 714646 702784 691544 682556 676292 671303 666491 662338 659330 656765 653800 650462 647094
58514 647094 643841 641039 639100 637741 636228 634487 633008 631807 630580 629716 629888 630713 631095 630797 630368 629719
58498 629719 628331 626867 626855 628525 630464 631779 633183 635543 638735 642414 646705 651681 657190 663560 671478
58483 671478 680935 691328 702776 716261 732233 750048 768882 788221 807363 825465 842099 856836
58471 856836 868434 875513 877959 876606 871772 863339 852051 839430 826480 813712 802240 793471 787757
$$ packed form
58562G50392K0880K3208K5974K8507L0143L0635K9713K7118K3284J9073J4706
58551A023633R962N337J681j184m001o366p305p470q650j0898j2517j3254j4979
58538I53989j8407k1588k2865k3022k3233k3082k2032k0761j9610j7631j4669
58527G27089j2443j1862j1240q988o264m989m812m153l008k565k965l338l368
58514F47094l253k802j939j359j513j741j479j201j227q64J72Q25L82k98m29o49
58498F29719j388j464j2J670J939J315J404K360L192L679M291M976N509O370P918
58483F71478R457J0393J1448J3485J5972J7815J8834J9339J9142J8102J6634J4737
58471H56836J1598P079K446j353m834q433j1288j2621j2950j2768j1472q769n714
$$ plain form
58458 787757 784513 783458 784578 787391 791708 798657 809218 821981 834017 843686 850986 855639 856884
58445 856884 854967 850788 844119 834183 821951 809771 798667 788063 778147 770232 764532 759878 756054
58432 756054 754247 754755 756398 758730 762777 769054 776932 786455 798614 813044 827548 840678 852886
58419 852886 864382 873853 880218 883827 885142 883893 880294 875374 869440 861856 852859 843872 835561 827418
58405 827418 819645 813433 808860 804624 800490 797904 797551 798397 799809 802515 806765 811717 817299 824490 833039
58390 833039 841212 848518 856319 864925 872670 878879 885225 892891 900832 908051 915110 921918 926445 927273
58376 927273 925394 922156 917633 912427 908758 907963 908851 910042 912027 915552 919993 924862 930969 938667 946841
58361 946841 954962 964167 975004 986207 996949 1008067 1019665 1029881 1037605 1044127 1050511 1055620 1058474
$$ packed form
58458G87757l244j055J120K813M317O949J0561J2763J2036R669P300M653J245
58445H56884j917m179o669r936j2232j2180j1104j0604r916p915n700m654l824
58432G56054j807N08J643K332M047O277P878R523J2159J4430J4504J3130J2208
58419H52886J1496R471O365L609J315j249l599m920n934p584q997q987q311q143
58405H27418p773o212m573m236m134k586l53Q46J412K706M250M952N582P191Q549
58390H33039Q173P306P801Q606P745O209O346P666P941P219P059O808M527Q28
58376I27273j879l238m523n206l669p95Q88J191J985L525M441M869O107P698Q174
58361I46841Q121R205J0837J1203J0742J1118J1598J0216P724O522O384N109K854
$$ plain form
58348 1058474 1060346 1062735 1065369 1067933 1071688 1077639 1085042 1093236 1102847 1113814 1124577 1134801 1146494
58335 1146494 1160873 1176519 1192170 1208673 1226492 1244037 1260365 1276819 1293967 1309617 1321893
58324 1321893 1331689 1340146 1346592 1350996 1355475 1361004 1365632 1368286 1371299 1376654 1382902 1388546 1395276 1404837
58310 1404837 1415693 1426031 1437145 1450593 1464822 1477992 1491497 1507276 1524269 1540889 1558380
58299 1558380 1578199 1598659 1617676 1636326 1656136 1675557 1692828 1709792 1728974 1749288 1768503
58288 1768503 1787602 1808851 1831835 1855295 1880516 1908906 1938481 1966768 1995086 2026037 2059000
58277 2059000 2091916 2125159 2159715 2193975 2226418 2259096 2294515 2331719 2369516 2410737 2458743
58266 2458743 2512274 2568164 2626512 2688774 2753664 2819566 2888169 2960991 3035237 3107772 3180032
$$ packed form
58348A058474J872K389K634K564L755N951P403Q194R611J0967J0763J0224J1693
58335A146494J4379J5646J5651J6503J7819J7545J6328J6454J7148J5650J2276
58324A321893R796Q457O446M404M479N529M628K654L013N355O248N644O730R561
58310A404837J0856J0338J1114J3448J4229J3170J3505J5779J6993J6620J7491
58299A558380J9819K0460J9017J8650J9810J9421J7271J6964J9182K0314J9215
58288A768503J9099K1249K2984K3460K5221K8390K9575K8287K8318L0951L2963
58277B059000L2916L3243L4556L4260L2443L2678L5419L7204L7797M1221M8006
58266B458743N3531N5890N8348O2262O4890O5902O8603P2822P4246P2535P2260
$$ plain form
58255 3180032 3254167 3327900 3398565 3468685 3541874 3616758 3690972 3767617 3851385 3941565 4035269
58244 4035269 4134236 4241830 4356587 4475563 4600839 4735933 4879239 5027987 5184997 5354251
58234 5354251 5533645 5719773 5915899 6127286 6352821 6589614 6841523 7114355 7407134
58225 7407134 7717244 8049469 8410313 8798574 9211874 9657271 10144512 10674451 11245816
58216 11245816 11867508 12551861 13302242 14121085 15023751 16030143 17149789 18390857 19776146
58207 19776146 21333362 23079005 25032560 27239966 29765020 32670688 36035521 39981522
58199 39981522 44665396 50262318 56995360 65171419 75158223 87350035 102202079 120275867
58191 120275867 142197628 168589734 200016809 236663114 277459783 319146954 356429591
$$ packed form
58255C180032P4135P3733P0665P0120P3189P4884P4214P6645Q3768R0180R3704
58244D035269R8967J07594J14757J18976J25276J35094J43306J48748J57010J69254
58234E354251J79394J86128J96126K11387K25535K36793K51909K72832K92779
58225G407134L10110L32225L60844L88261M13300M45397M87241N29939N71365
58216A1245816O21692O84353P50381Q18843R02666J006392J119646J241068J385289
58207A9776146J557216J745643J953555K207406K525054K905668L364833L946001
58199C9981522M683874N596922O733042Q176059R986804J2191812J4852044J8073788
58191A20275867K1921761K6392106L1427075L6646305M0796669M1687171L7282637
$$ plain form
58184 356429591 383741865 397552703 397478389 385598416 364949451 338454383 308603625
58177 308603625 277451668 246595693 217167506 189902234 165218958 143275735 124040933
58170 124040933 107378787 93092904 80931164 70610663 61864941 54461651 48187284
58163 48187284 42845534 38275367 34351467 30964949 28018971 25440421 23176650 21178345
58155 21178345 19398545 17805930 16382826 15109126 13960679 12922003 11986608 11144442
58147 11144442 10381010 9688435 9065285 8504918 7994561 7525811 7095928 6699259 6327619
58138 6327619 5979138 5657071 5359739 5080598 4817882 4575091 4351943 4143506 3948310
58129 3948310 3768860 3604000 3448849 3302440 3167576 3043091 2924030 2809719 2703969
$$ packed form
58184C56429591K7312274J3810838p4314j1879973k0648965k6495068k9850758
58177C08603625l1151957l0855975k9428187k7265272k4683276k1943223j9234802
58170A24040933j6662146j4285883j2161740j0320501q745722p403290o274367
58163D8187284n341750m570167l923900l386518k945978k578550k263771j998305
58155B1178345j779800j592615j423104j273700j148447j038676r35395q42166
58147A1144442p63432o92575o23150n60367n10357m68750m29883l96669l71640
58138F327619l48481l22067k97332k79141k62716k42791k23148k08437j95196
58129C948310j79450j64860j55151j46409j34864j24485j19061j14311j05750
$$ plain form
58120 2703969 2606873 2513842 2423352 2338465 2259875 2184376 2111110 2042797 1979792 1919118 1860206
58109 1860206 1805616 1755348 1706305 1658165 1613979 1574103 1535106 1495506 1457110 1419865 1380927
58098 1380927 1339964 1300252 1263406 1227766 1192783 1160122 1129648 1099189 1069180 1042863 1020948
58087 1020948 1000679 980995 963903 949786 935957 921108 906833 893577 879260 863083 846671
58076 846671 830333 812200 792191 772927 755557 738389 720735 704347 689994 676220 662567
58065 662567 650447 639860 628834 617129 606942 598868 590737 581514 572761 565030 556356 545786 535131
58052 535131 525789 516958 508248 500976 495436 489833 483285 477124 472071 466958 461425 456933 453761 449815
58038 449815 443859 437387 431919 426918 421670 416788 412538 407868 402248 396377 390199 382541 373565 365233
$$ packed form
58120B703969r7096r3031r0490q4887p8590p5499p3266o8313o3005o0674n8912
58109A860206n4590n0268m9043m8140m4186l9876l8997l9600l8396l7245l8938
58098A380927m0963l9712l6846l5640l4983l2661l0474l0459l0009k6317k1915
58087A020948k0269j9684j7092j4117j3829j4849j4275j3256j4317j6177j6412
58076H46671j6338j8133k0009j9264j7370j7168j7654j6388j4353j3774j3653
58065F62567j2120j0587j1026j1705j0187q074q131r223q753p731q674j0570j0655
58052E35131r342q831q710p272n540n603o548o161n053n113n533m492l172l946
58038D49815n956o472n468n001n248m882m250m670n620n871o178p658q976q332
$$ plain form
58024 365233 358433 351975 345221 339252 334544 329982 325139 321091 318055 314697 310738 307775 306381 304898
58010 304898 302219 299398 297278 294922 291713 288768 286954 285513 283856 282705 282269 281284 279015 276372 274053
57995 274053 271480 268427 265688 263265 259971 255792 252552 251308 251161 251518 253204 256280 259060 260557 261772
57980 261772 263365 264255 263785 263099 262912 261948 259134 255506 252487 249969 247482 245562 244561 243702 242567 242012
57964 242012 242455 242843 242429 241976 242149 242431 242656 243829 246237 248453 249360 249527 249539 248799 247121 245686 245165
57947 245165 244614 243456 242775 243416 244611 245793 247955 251834 256514 261265 267020 274586 283064 291555 300727
57932 300727 311031 320930 328666 334523 339801 344743 348776 351521 352265 349817 344212 337219 330040 322001
57918 322001 312623 303154 294597 286039 276586 267323 259635 253203 247336 242691 239706 236873 232623 227774
$$ packed form
58024C65233o800o458o754n969m708m562m843m048l036l358l959k963j394j483
58010C04898k679k821k120k356l209k945j814j441j657j151m36r85k269k643k319
57995B74053k573l053k739k423l294m179l240j244j47L57J686L076K780J497J215
57980B61772J593Q90m70o86j87r64k814l628l019k518k487j920j001q59j135n55
57964B42012M43L88m14m53J73K82K25J173K408K216R07J67J2p40j678j435n21
57947B45165n51j158o81O41J195J182K162L879M680M751N755P566Q478Q491R172
57932C00727J0304R899P736N857N278M942M033K745P44k448n605o993p179q039
57918C22001r378r469q557q558r453r263p688o432n867m645k985k833m250m849
$$ plain form
57904 227774 224092 221634 219443 217783 217591 218532 219537 220590 222334 224636 227179 230607 235468 240822 245425
57889 245425 249465 253613 257339 259825 261649 263841 266056 267288 267648 267812 267448 265765 262966 259718 255926
57874 255926 251462 247217 243956 240984 237469 234124 231989 230558 228871 227496 227517 228362 228665 228684 229958 232967
57858 232967 237000 241919 248269 255885 264061 272788 282357 292117 301113 309471 317637 324802 329710 332509
57844 332509 334179 334568 332734 328883 324302 319646 314763 309818 305030 299729 293277 286562 280983 276452
57830 276452 271956 267598 264322 262108 260286 259199 259622 260907 261737 262429 264452 267773 270833 273079 275254
57815 275254 276981 276370 272615 266981 260536 252826 243632 234304 226302 219674 213780 208399 203451 198720
57801 198720 194556 191898 191040 191148 191401 191766 192366 192925 193092 192560 190938 188383 186233 185866 186960 188131
$$ packed form
57904B27774l682k458k191j660j92R41J005J053J744K302K543L428M861N354M603
57889B45425M040M148L726K486J824K192K215J232L60J64l64j683k799l248l792
57874B55926m464m245l261k972l515l345k135j431j687j375K1Q45L03J9J274L009
57858B32967M033M919O350P616Q176Q727R569R760Q996Q358Q166P165M908K799
57844C32509J670L89j834l851m581m656m883m945m788n301o452o715n579m531
57830B76452m496m358l276k214j822j087M23J285Q30O92K023L321L060K246K175
57815B75254J727o11l755n634o445p710r194r328q002o628n894n381m948m731
57801A98720m164k658q58J08K53L65O00N59J67n32j622k555k150l67J094J171
$$ plain form
57785 188131 189237 191675 196206 201970 208026 214556 221962 229878 237670 245120 252260 259264 266581 274294
57771 274294 281320 286277 289179 291237 292961 293667 292882 290898 287716 282852 276558 269977 263616 256828 249266
57756 249266 241713 234984 229120 224157 220589 218428 216776 214937 213164 211873 211007 210646 211292 212940 214666
57741 214666 215740 216401 217135 217887 218487 219097 219767 220227 220564 221424 223078 224914 226271 227231 228242 229456 230805
57724 230805 232217 233602 234984 236649 238623 240221 240859 241112 241966 243171 243478 242563 241373 240349 238707
57709 238707 235989 233008 230508 227988 224700 220938 217474 214424 211524 208930 206996 205695 204843 204513 204736
57694 204736 205225 205724 206114 205931 204447 201600 198167 194649 190775 186555 182925 180607 179057 177407 175943
57679 175943 175764 177325 180190 184184 190013 198615 210390 225284 243434 265641 293328 328011 370534
$$ packed form
57785A88131J106K438M531N764O056O530P406P916P792P450P140P004P317P713
57771B74294P026M957K902K058J724P06p85j984l182m864o294o581o361o788p562
57756B49266p553o729n864m963l568k161j652j839j773j291q66l61O46J648J726
57741B14666J074O61P34P52O00O10O70M60L37Q60J654J836J357R60J011J214J349
57724B30805J412J385J382J665J974J598O38K53Q54J205L07r15j190j024j642
57709B38707k718k981k500k520l288l762l464l050k900k594j934j301q52l30K23
57694B04736M89M99L90j83j484k847l433l518l874m220l630k318j550j650j464
57679A75943j79J561K865L994N829Q602J1775J4894J8150K2207K7687L4683M2523
$$ plain form
57666 370534 420182 473616 524302 563927 585923 588497 574409 548327 514741 477523 439716 403029
57654 403029 368108 335526 306040 279961 257166 237868 222549 210924 201755 194077 187896 183402
57642 183402 180161 177511 175219 173405 172192 171607 171467 171334 171066 171313 172791 175110 177029 177862 177888 177419
57626 177419 176382 174941 173589 172443 171253 170220 169881 169991 169523 168047 166205 164590 163154 161971 161456
57611 161456 161355 160642 159050 157687 157437 157685 157401 156653 156143 155927 155504 154641 153330 151319 148457 145245 142408
57594 142408 140193 138515 137364 136552 135396 133307 130538 127892 125806 124015 121961 119325 116280 113361
57580 113361 110943 108949 107291 106301 106200 106383 105937 104726 103244 101645 99824 98278 97707 97691 96950 95169
57564 95169 93457 92710 92630 92692 92905 93118 92698 91524 90344 89650 89129 88706 89057 90506 92490 94688 97513
$$ packed form
57666C70534M9648N3434N0686L9625K1996K574j4088k6082l3586l7218l7807l6687
57654D03029l4921l2582k9486k6079k2795j9298j5319j1625r169p678o181m494
57642A83402l241k650k292j814j213n85j40j33k68K47J478K319J919Q33K6m69
57626A77419j037j441j352j146j190j033l39J10m68j476j842j615j436j183n15
57611A61456j01p13j592j363k50K48k84p48n10k16m23q63j311k011k862l212k837
57594A42408k215j678j151q12j156k089k769k646k086j791k054k636l045k919
57580A13361k418j994j658r90j01J83m46j211j482j599j821j546n71j6p41j781
57564I5169j712p47q0O2K13K13m20j174j180o94n21m23L51J449J984K198K825
$$ plain form
57547 97513 100773 103060 103432 102670 101913 101081 99746 98558 98423 98887 98606 97111 95090 93304 92127 91741
57531 91741 91835 91465 90116 88615 88212 89051 90227 91006 91300 91268 91181 91440 92174 93073 93988 95216 96864 98582
57513 98582 100350 102752 105912 108948 111135 112795 114353 115380 115434 115020 114744 114214 112742 110591 108555 106902
57497 106902 105528 104493 103536 101846 99275 96974 95824 95048 93588 91876 90845 90007 88258 86042 84914
57482 84914 85142 85503 85369 85327 85576 85342 84222 82793 81515 80257 79226 79112 79846 80313 79793 78804 78096 77688
57464 77688 77265 76704 75838 74402 72653 71429 71271 71938 72898 73699 73890 73269 72309 71649 71157 70211 68883 67913
57446 67913 67469 66893 65915 65146 65014 65079 64898 64813 65324 66254 67085 67662 68139 68573 69000 69589 70436 71376 72203 72869
57426 72869 73366 73653 73756 73677 73269 72488 71702 71384 71565 71934 72341 72782 73088 73096 73020 73121 73211 73060 73106 74036 75679
$$ packed form
57547I7513L260K287L72p62p57q32j335j188j35M64k81j495k021j786j177l86
57531I1741R4l70j349j501m03Q39J176P79K94l2q7K59P34Q99R15J228J648J718
57513I8582J768K402L160L036K187J660J558J027N4m14k76n30j472k151k036j653
57497A06902j374j035r57j690k571k301j150p76j460j712j031q38j749k216j128
57482H4914K28L61j34m2K49k34j120j429j278j258j031j14P34M67n20r89p08m08
57464G7688m23n61q66j436j749j224j58O67R60Q01J91o21r60o60m92r46j328r70
57446F7913m44n76r78p69j32O5j81q5N11R30Q31N77M77M34M27N89Q47R40Q27O66
57426G2869M97K87J03p9m08p81p86l18J81L69M07M41L06Qp6J01R0j51M6R30J643
$$ plain form
57405 75679 77024 77458 77364 77379 77616 77776 77545 76759 75547 74429 73963 74317 75372 76989 78831 80253 80914
57388 80914 81308 82185 83750 85985 89228 93546 97859 100730 101999 102757 103760 104820 105711 106650 107623 108170
57372 108170 108114 107647 106483 103809 99445 94284 89178 84140 79042 74285 70141 66097 61563 56908 53079
57357 53079 50382 48184 45829 43390 41423 40255 39721 39570 39930 41112 43044 45212 47244 49149 50864
57342 50864 52113 53029 54319 56351 58601 60516 62329 64350 66048 66725 66634 66519 66423 65896 65028 64251 63465
57325 63465 62460 61929 62787 64554 65759 66007 66390 67620 69060 69976 70562 71143 71401 71026 70377 69967 69970 70588
57307 70588 72139 74307 76025 76589 76324 75858 75405 75098 75296 76094 77048 77782 78412 79200 80264 81781 83842
57290 83842 85979 87485 88321 89030 89758 90184 90515 91606 93884 97018 100732 104884 108599 110640 111142 111822
$$ packed form
57405G5679J345M34r4J5K37J60k31p86j212j118m66L54J055J617J842J422O61
57388H0914L94Q77J565K235L243M318M313K871J269P58J003J060Q91R39R73N47
57372A08170n6m67j164k674m364n161n106n038n098m757m144m044m534m655l829
57357E3079k697k198k355k439j967j168n34j51L60J182J932K168K032J905J715
57342E0864J249R16J290K032K250J915J813K021J698O77r1j15r6n27q68p77p86
57325F3465j005n31Q58J767J205K48L83J230J440R16N86N81K58l75o49m10LO18
57307G0588J551K168J718N64k65m66m53l07J98P98R54P34O30P88J064J517K061
57290H3842K137J506Q36P09P28M26L31J091K278L134L714M152L715K041N02O80
$$ plain form
57274 111822 113805 116335 118286 119799 121483 123035 123829 124169 124762 125412 125296 124328 123358 123125 123680 124695
57258 124695 125710 126206 125910 124998 123791 122530 121572 121317 121652 122008 122230 122814 124016 125379 126505 127589
57242 127589 128790 129798 130580 131813 133912 136270 138156 139778 141754 144026 146076 147802 149532 151459
57228 151459 153689 156496 159965 163694 167337 171072 175120 179283 183437 187915 192817 197455 201151 204175
57214 204175 207265 210636 214115 217901 222452 227826 233651 239569 245317 250721 256021 261821 268340 275171
57200 275171 282069 289400 297464 306036 315055 324932 335543 345824 355230 364798 375794 387951 400108
57187 400108 411984 424150 436719 449390 462555 477076 492928 509179 525376 541940 559145
57176 559145 576730 594763 613955 634776 656938 680065 704341 730285 758325 788652 821008
$$ packed form
57274A11822J983K530J951J513J684J552P94L40N93O50j16r68r70k33N55J015
57258A24695J015M96k96r12j207j261r58k55L35L56K22N84J202J363J126J084
57242A27589J201J008P82J233K099K358J886J622J976K272K050J726J730J927
57228A51459K230K807L469L729L643L735M048M163M154M478M902M638L696L024
57214B04175L090L371L479L786M551N374N825N918N748N404N300N800O519O831
57200B75171O898P331Q064Q572R019R877J0611J0281R406R568J0996J2157J2157
57187D00108J1876J2166J2569J2671J3165J4521J5852J6251J6197J6564J7205
57176E59145J7585J8033J9192K0821K2162K3127K4276K5944K8040L0327L2356
$$ plain form
57165 821008 854610 888760 923490 959120 995303 1031127 1066161 1100762 1135244 1169284 1202334
57154 1202334 1234269 1265630 1297519 1331073 1366601 1403292 1440103 1476735 1513419 1550203 1587082
57143 1587082 1624503 1663006 1702592 1743165 1785290 1829527 1874962 1919315 1960752 1998989 2034596
57132 2034596 2068087 2099986 2131070 2161968 2192719 2222904 2251983 2279560 2305769 2331381 2357128
57121 2357128 2382840 2407604 2430693 2451960 2471624 2490402 2509895 2532154 2558653 2590099 2627200
57110 2627200 2670980 2722194 2781007 2847572 2922717 3008297 3107526 3225165 3366902 3538520 3746186
57099 3746186 3997637 4302525 4671775 5117597 5654528 6299450 7069535 7979734 9041477
57090 9041477 10261654 11640453 13168805 14826845 16582901 18392402 20199652 21947256
$$ packed form
57165H21008L3602L4150L4730L5630L6183L5824L5034L4601L4482L4040L3050
57154A202334L1935L1361L1889L3554L5528L6691L6811L6632L6684L6784L6879
57143A587082L7421L8503L9586M0573M2125M4237M5435M4353M1437L8237L5607
57132B034596L3491L1899L1084L0898L0751L0185K9079K7577K6209K5612K5747
57121B357128K5712K4764K3089K1267J9664J8778J9493K2259K6499L1446L7101
57110B627200M3780N1214N8813O6565P5145Q5580R9229J17639J41737J71618K07666
57099C746186K51451L04888L69250M45822N36931O44922P70085R10199J061743
57090I041477J220177J378799J528352J658040J756056J809501J807250J747604
$$ plain form
57082 21947256 23592519 25121087 26545760 27887734 29151091 30306964 31296587 32049609
57074 32049609 32506019 32630874 32417387 31880565 31047587 29950721 28624946 27108630 25444721
57065 25444721 23681011 21868640 20058430 18296075 16618393 15051813 13612320 12306141
57057 12306141 11131675 10082548 9150094 8324209 7593725 6947453 6375077 5866973 5413939
57048 5413939 5007865 4642312 4311774 4010703 3733954 3477924 3240621 3020819 2817748
57039 2817748 2631223 2461223 2307362 2169337 2047652 1943159 1856182 1787023 1737061 1707670
57029 1707670 1696871 1697216 1697547 1687236 1659632 1613077 1549859 1474313 1391249 1305244 1220397 1139819
57017 1139819 1065144 996787 934798 879381 830714 788456 751493 718319 688004 660844 637629
$$ packed form
57082B1947256J645263J528568J424673J341974J263357J155873R89623P53022
57074C2049609M56410J24855k13487n36822q32978j096866j325775j516316j663909
57065B5444721j763710j812371j810210j762355j677682j566580j439493j306179
57057A2306141j174466j049127r32454q25885p30484o46272n72376n08104m53034
57048E413939m06074l65553l30538l01071k76749k56030k37303k19802k03071
57039B817748j86525j70000j53861j38025j21685j04493q6977o9159m9962k9391
57029A707670j0799L45L31j0311k7604m6555o3218p5546q3064q6005q4847q0578
57017A139819p4675o8357o1989n5417m8667m2258l6963l3174l0315k7160k3215
$$ plain form
57006 637629 618184 601146 585264 570177 555667 541088 526232 511995 499332 488087 477741
56995 477741 468730 461927 457166 453347 449914 447305 446072 446481 448895 453613 460294 468223 476909 485499
56981 485499 491880 493707 490612 484350 476491 466945 455123 441543 427595 414334 402104 390965 381035
56968 381035 372586 366049 361726 359497 359173 361106 366062 374530 386616 402454 421989 444101 466333
56955 466333 485605 499078 504876 502856 494666 482400 467144 449318 430056 411272 394327 379495
56943 379495 366839 356712 349254 344216 341649 342038 345545 351833 360986 373969 391737 414214 440081
56930 440081 466822 490810 508289 517113 517494 511011 499291 483668 465372 445496 424886 404171
56918 404171 383713 363638 344217 326044 309414 293862 279034 265688 254955 246648 239293 231949
$$ packed form
57006F37629j9445j7038j5882j5087j4510j4579j4856j4237j2663j1245j0346
56995D77741r011o803m761l819l433k609j233M09K414M718O681P929Q686Q590
56981D85499O381J827l095o262p859r546j1822j3580j3948j3261j2230j1139r930
56968C81035q449o537m323k229l24J933M956Q468J2086J5838J9535K2112K2232
56955D66333J9272J3473N798k020q190j2266j5256j7826j9262j8784j6945j4832
56943C79495j2656j0127p458n038k567L89L507O288R153J2983J7768K2477K5867
56930D40081K6741K3988J7479Q824L81o483j1720j5623j8296j9876k0610k0715
56918D04171k0458k0075j9421j8173j6630j5552j4828j3346j0733q307p355p344
$$ plain form
56906 231949 225138 219773 216015 213573 212337 212214 212744 213295 213456 213216 213074 213884 216226 220128 225775 233979
56890 233979 245167 258380 272330 287139 303778 321789 338768 352250 361099 365058 364343 360100
56878 360100 354056 347145 339294 330770 322656 315634 309466 304181 300740 300009 302145 307557 317450 332667
56864 332667 352855 377436 406590 440566 478619 518912 558460 592746 616769 627744 626448 615560
56852 615560 597629 575108 550858 527096 504396 482842 463691 448839 439077 433999 433466 438321
56840 438321 449759 468734 495975 532081 577556 632651 696368 764903 831391 887867 927805
56829 927805 947495 946460 927373 894849 853411 806522 757278 708763 663064 620864 582768 550246
56817 550246 524564 505628 492869 486670 487995 497180 514095 539156 573145 615791 664600 714466
$$ packed form
56906B31949o811n365l758k442j236j23N30N51J61k40j42Q10K342L902N647Q204
56890B33979J1188J3213J3950J4809J6639J8011J6979J3482Q849L959p15m243
56878C60100o044o911p851q524q114p022o168n285l441p31K136N412R893J5217
56864C32667K0188K4581K9154L3976L8053M0293L9548L4286K4023J0975j296j0888
56852F15560j7931k2521k4250k3762k2700k1554j9151j4852r762n078n33M855
56840D38321J1438J8975K7241L6106M5475N5095O3717O8535O6488N6476L9938
56829I27805J9690j035j9087l2524m1438m6889m9244m8515m5699m2200l8096l2522
56817E50246k5682j8936j2759o199J325R185J6915K5061L3989M2646M8809M9866
$$ plain form
56805 714466 758177 788459 801019 795910 775915 744287 704284 659513 613281 567712 524213 484324
56793 484324 449377 419773 395329 375934 361366 351143 345308 344756 350047 360603 375877 396342
56781 396342 421932 449905 475552 494970 506369 509194 503396 489693 469604 444992 417954 390733
56769 390733 364834 340343 316814 294629 274794 257729 243088 230568 220010 210893 202525 194731
56757 194731 187670 181187 175025 169548 165491 163024 161575 160457 159197 157566 155760 154244 152977 151265
56743 151265 148943 147016 146413 146662 146735 146579 146828 147407 147628 147367 147057 146718 146108 145722 146460 148215 149791 150380
56725 150380 150300 150137 150081 150293 151155 152792 154825 156786 158445 159743 160756 161636 162281 162327 161804 161344 161239 160872
56707 160872 159766 158685 158808 160139 161686 162876 163894 164768 165149 165043 164960 165247 165865 166815 168164 169725
$$ packed form
56805G14466M3711L0282J2560n109j9995l1628m0003m4771m6232m5569m3499l9889
56793D84324l4947k9604k4444j9395j4568j0223n835n52N291J0556J5274K0465
56781C96342K5590K7973K5647J9418J1399K825n798j3703k0089k4612k7038k7221
56769C90733k5899k4491k3529k2185j9835j7065j4641j2520j0558r117q368p794
56757A94731p061o483o162n477m057k467j449j118j260j631j806j516j267j712
56743A51265k322j927o03K49P3j56K49N79K21k61l10l39o10l86P38J755J576N89
56725A50380q0j63n6K12Q62J637K033J961J659J298J013Q80O45M6n23m60j05l67
56707A60872j106j081J23J331J547J190J018Q74L81j06q3K87O18R50J349J561
$$ plain form
56691 169725 171154 172219 172617 171925 170308 168834 168458 169049 169947 170927 171999 172897 173559 174513 176021 177405
56675 177405 178074 178481 179107 179332 178467 177223 176789 177076 177189 177109 177411 177853 177846 177936 179150 181069 182218 182275 182217
56656 182217 182356 182004 181175 180821 181052 180835 179908 179390 179898 180598 180781 181005 181907 183077 183854 184238 184373 184118
56638 184118 183643 183520 183731 183529 182616 181502 180454 179295 178559 179453 181976 184363 185171 184820 184333 183690 182360
56621 182360 180547 178853 177358 175879 174610 173792 173237 172771 172590 172679 172523 171894 171329 171301 171496 171406 171030 170578
56603 170578 170122 169961 170645 172129 173514 174073 173955 173525 172783 171906 171596 172189 172956 172946 172172 171491 171602 172533
56585 172533 173778 174666 174899 174836 174936 175033 174760 174494 175032 176347 177613 178571 179849 181693 183417 184544 185605
56568 185605 187371 190064 193617 197911 202447 206712 211248 217517 226380 237491 250233 263964 276928
$$ packed form
56691A69725J429J065L98o92j617j474l76N91Q98R80J072Q98O62R54J508J384
56675A77405O69M07O26K25q65j244m34K87J13q0L02M42pR0J214J919J149N7n8
56656A82217J39l52q29l54K31k17r27n18N08P00J83K24R02J170P77L84J35k55
56638A84118m75j23K11k02r13j114j048j159p36Q94K523K387Q08l51m87o43j330
56621A82360j813j694j495j479j269q18n55m66j81Q9j56o29n65k8J95r0l76m52
56603A70578m56j61O84J484J385N59j18m30p42q77l10N93P67j0p74o81J11R31
56585A72533J245Q88K33o3J00R7k73k66N38J315J266R58J278J844J724J127J061
56568A85605J766K693L553M294M536M265M536O269Q863J1111J2742J3731J2964
$$ plain form
56555 276928 286353 290691 291024 289516 287290 284454 281293 278393 275992 273945 272049 270041 267705 265237
56541 265237 262937 260408 256888 252616 248880 246334 244228 241781 239309 237381 235818 234230 232725 231385
56527 231385 229855 228093 226790 226352 226198 225737 225328 225594 226422 227278 227886 228051 227466 226204 224758 223148 220819
56510 220819 217888 215517 214442 214011 213369 212658 212295 212030 211654 211769 212777 213769 213586 212468 211674 211724 211997
56493 211997 211846 211278 210520 209535 208093 206134 204116 202864 202617 202461 201482 200269 200136 200905 200938 199661 198528
56476 198528 198810 199951 201011 202285 204213 205906 206276 205903 206394 208341 211003 213509 215383 216316 216412 216319
56460 216319 216388 216111 215096 213990 213709 214267 215018 215575 215861 215871 215920 216512 217526 218288 218854 220121 222134 223518
56442 223518 223433 222870 223012 223449 223208 222504 222198 222305 222350 222434 222731 222665 221814 221011 221283 222270 222833 222703 222416 222245
$$ packed form
56555B76928R425M338L33j508k226k836l161k900k401k047j896k008k336k468
56541B65237k300k529l520m272l736k546k106k447k472j928j563j588j505j340
56527B31385j530j762j303m38j54m61m09K66Q28Q56O08J65n85j262j446j610k329
56510B20819k931k371j075m31o42p11l63k65l76J15J008R92j83j118p94N0K73
56493B11997j51n68p58r85j442j959k018j252k47j56r79j213j33P69L3j277j133
56476A98528K82J141J060J274J928J693L70l73M91J947K662K506J874R33R6r3
56460B16319O9k77j015j106k81N58P51N57K86J0M9N92J014P62N66J267K013J384
56442B23518q5n63J42M37k41p04l06J07M5Q4K97o6q51q03K72R87N63j30k87j71
$$ plain form
56422 222245 222290 223000 224445 225592 225444 224423 223650 223487 223762 224682 226371 228118 229199 229809 230248 230084 229251
56405 229251 228928 229876 230851 230313 228917 228546 229451 230225 230246 230324 231059 232253 233941 236436 239234 241247 242267
56388 242267 243046 244020 245118 246621 248875 251293 252953 254060 255521 257160 257753 256917 255655 254927 254798 255099
56372 255099 255750 256292 256144 255486 255004 254753 254216 253419 253043 253415 254267 255440 256975 258618 260021 261309 262737
56355 262737 264055 264968 265878 267324 269104 270734 272296 273928 275076 275249 275015 275213 275737 276023 276084 275967 275032
56338 275032 273052 271330 271301 272720 274640 277374 281707 286792 290755 293131 294943 296610 297667 298500 300478
56323 300478 303997 307881 310945 312981 314186 314847 315541 316462 316784 315839 314493 313968 313878 313037 311714 311164 311290
56306 311290 310845 309940 310259 312539 315710 318878 322346 326294 330114 333611 337310 341139 344113 345812 346878
$$ packed form
56422B22245M5P10J445J147j48j021p73j63K75R20J689J747J081O10M39j64q33
56405B29251l23R48R75n38j396l71R05P74K1P8P35J194J688K495K798K013J020
56388B42267P79R74J098J503K254K418J660J107J461J639N93q36j262p28j29L01
56372B55099O51N42j48o58m82k51n37p97l76L72Q52J173J535J643J403J288J428
56355B62737J318R13R10J446J780J630J562J632J148J73k34J98N24K86O1j17r35
56338B75032j980j722k9J419J920K734M333N085L963K376J812J667J057Q33J978
56323C00478L519L884L064K036J205O61O94R21L22r45j346n25r0q41j323n50J26
56306C11290m45r05L19K280L171L168L468L948L820L497L699L829K974J699J066
$$ plain form
56291 346878 347816 348533 349233 350438 351997 353363 354915 357591 361165 364419 367133 370335 374351 378203 381276
56276 381276 384118 387201 390280 393341 396938 401284 406052 411195 416831 422499 427790 433480 440533 448267
56262 448267 455220 461653 469344 478948 489499 500609 513137 527394 542710 559282 578551 601213
56250 601213 626568 654248 684828 718250 753500 790511 830676 874777 921831 970458 1019794
56239 1019794 1068551 1114837 1157565 1196599 1231062 1259078 1279665 1293346 1300414 1300249 1292917 1279895
56227 1279895 1262569 1241339 1216600 1189098 1158957 1125880 1090656 1055025 1019782 984636 950023
56216 950023 917236 886515 856949 828522 802233 777861 753845 729938 707839 688464 670728
56205 670728 653830 638627 625709 614065 602748 592134 582616 573701 565335 558429 553226 548749 544528
$$ packed form
56291C46878R38P17P00J205J559J366J552K676L574L254K714L202M016L852L073
56276C81276K842L083L079L061L597M346M768N143N636N668N291N690P053P734
56262D48267O953O433P691R604J0551J1110J2528J4257J5316J6572J9269K2662
56250F01213K5355K7680L0580L3422L5250L7011M0165M4101M7054M8627M9336
56239A019794M8757M6286M2728L9034L4463K8016K0587J3681P068j65p332j3022
56227A279895j7326k1230k4739k7502l0141l3077l5224l5631l5243l5146l4613
56216I50023l2787l0721k9566k8427k6289k4372k4016k3907k2099j9375j7736
56205F70728j6898j5203j2918j1644j1317j0614r518q915q366o906n203m477m221
$$ plain form
56192 544528 541231 538943 536721 534539 533753 534808 536357 537476 538787 540562 541771 542050 542699 544595 546877
56177 546877 548754 550932 554197 558233 562713 567892 573274 577496 580422 583708 588539 594511 601291 609376
56163 609376 618507 627407 635857 645078 655414 665788 676117 687873 701529 715957 731244 749540
56151 749540 771996 797484 825584 858308 897562 943490 996894 1060807 1137987 1228837 1333046
56140 1333046 1450743 1580340 1717284 1856282 1992713 2121126 2235602 2333750 2418265 2493190
56130 2493190 2560924 2623707 2684264 2742395 2793500 2832903 2859729 2875143 2879822 2875335 2865046 2850594
56118 2850594 2829079 2795598 2746523 2678941 2590230 2481204 2357702 2226724 2092855 1959970
56108 1959970 1833296 1716871 1611138 1515506 1431142 1358970 1297345 1244257 1199775 1164022 1135008
$$ packed form
56192E44528l297k288k222k182p86J055J549J119J311J775J209K79O49J896K282
56177E46877J877K178L265M036M480N179N382M222K926L286M831N972O780Q085
56163F09376R131Q900Q450R221J0336J0374J0329J1756J3656J4428J5287J8296
56151G49540K2456K5488K8100L2724L9254M5928N3404O3913P7180R0850J04209
56140A333046J17697J29597J36944J38998J36431J28413J14476R8148Q4515P4925
56130B493190O7734O2783O0557N8131N1105L9403K6826J5414M679m487j0289j4452
56118B850594k1515l3481m9075o7582q8711j09026j23502j30978j33869j32885
56108A959970j26674j16425j05733r5632q4364p2172o1625n3088m4482l5753k9014
$$ plain form
56097 1135008 1110738 1091239 1076352 1064055 1053156 1045013 1040275 1036744 1032891 1030545 1031349 1033507 1034971
56084 1034971 1036908 1040910 1045686 1049863 1055244 1063706 1073361 1081416 1088542 1096979 1106549 1115989 1126052 1137863
56070 1137863 1150277 1162058 1174471 1188674 1202983 1215894 1229201 1244810 1261187 1276426 1292047
56059 1292047 1310095 1329218 1347422 1366001 1386827 1408425 1428685 1448796 1470448 1491923 1511130
56048 1511130 1529842 1550637 1572334 1592800 1613525 1636894 1661627 1685505 1709988 1737467 1766547
56037 1766547 1794761 1823334 1854468 1886501 1916585 1945628 1975961 2006984 2037886 2071584 2110821
56026 2110821 2153348 2196039 2240582 2289842 2342050 2394193 2447665 2504780 2563335 2620750 2679884
56015 2679884 2744302 2811555 2878001 2946510 3022107 3103510 3186415 3271708 3362806 3458335 3555395
$$ packed form
56097A135008k4270j9499j4887j2297j0899q143m738l531l853k346Q04K158J464
56084A034971J937M002M776M177N381Q462R655Q055P126Q437R570R440J0063J1811
56070A137863J2414J1781J2413J4203J4309J2911J3307J5609J6377J5239J5621
56059A292047J8048J9123J8204J8579K0826K1598K0260K0111K1652K1475J9207
56048A511130J8712K0795K1697K0466K0725K3369K4733K3878K4483K7479K9080
56037A766547K8214K8573L1134L2033L0084K9043L0333L1023L0902L3698L9237
56026B110821M2527M2691M4543M9260N2208N2143N3472N7115N8555N7415N9134
56015B679884O4418O7253O6446O8509P5597Q1403Q2905Q5293R1098R5529R7060
$$ plain form
56004 3555395 3656719 3766578 3882853 4001191 4123548 4254390 4392292 4533941 4682541
55995 4682541 4843119 5013506 5189353 5373915 5573114 5785355 6006659 6241272 6496207
55986 6496207 6770039 7058703 7367460 7704724 8069078 8455563 8869868 9322551 9814550
55977 9814550 10343138 10916779 11548478 12240168 12990528 13812673 14726652 15741084 16861588
55968 16861588 18110794 19519689 21107362 22893156 24922101 27255115 29945627 33057129
55960 33057129 36697773 41011533 46154035 52320809 59791469 68908116 80032067 93578082
55952 93578082 110071728 130108967 154282201 183167520 217106439 255405832 295318303
55945 295318303 331973835 359940531 375493936 377854629 368675948 350661741 326544367
$$ packed form
56004C555395J01324J09859J16275J18338J22357J30842J37902J41649J48600
55995D682541J60578J70387J75847J84562J99199K12241K21304K34613K54935
55986F496207K73832K88664L08757L37264L64354L86485M14305M52683M91999
55977I814550N28588N73641O31699O91690P50360Q22145R13979J014432J120504
55968A6861588J249206J408895J587673J785794K028945K333014K690512L111502
55960C3057129L640644M313760N142502O166774P470660R116647J1123951J3546015
55952I3578082J6493646K0037239K4173234K8885319L3938919L8299393L9912471
55945B95318303L6655532K7966696J5553405K360693r178681j8014207k4117374
$$ plain form
55938 326544367 298750801 269346078 239959864 211755752 185499864 161640958 140360515
55931 140360515 121646003 105383813 91402980 79473101 69326966 60711751 53407569
55924 53407569 47208916 41923862 37397080 33510451 30158818 27244875 24696221 22464485
55916 22464485 20504056 18767798 17222370 15848736 14625385 13526106 12534161 11642937
55908 11642937 10841467 10112997 9447948 8844546 8296160 7790840 7323592 6896631 6507054
55899 6507054 6146031 5810364 5503065 5222043 4959535 4713411 4488108 4283429 4092823
55890 4092823 3913791 3750001 3601856 3464357 3335396 3216995 3107128 2999125 2890679
55881 2890679 2785444 2684721 2585561 2488042 2396453 2311867 2230819 2152275 2078769 2009857 1941720
$$ packed form
55938C26544367k7793566k9404723k9386214k8204112k6255888k3858906k1280443
55931A40360515j8714512j6262190j3980833j1929879j0146135q615215p304182
55924E3407569o198653n285054m526782l886629l351633k913943k548654k231736
55916B2464485j960429j736258j545428j373634j223351j099279r91945q91224
55908A1642937q01470p28470o65049o03402n48386n05320m67248m26961l89577
55899F507054l61023l35667l07299k81022k62508k46124k25303k04679j90606
55890D092823j79032j63790j48145j37499j28961j18401j09867j08003j08446
55881B890679j05235j00723r9160r7519r1589q4586q1048p8544p3506o8912o8137
$$ plain form
55870 1941720 1874175 1811104 1753111 1696770 1641915 1592511 1549126 1507402 1465327 1425360 1388095
55859 1388095 1350473 1311873 1275625 1242730 1209998 1176107 1143803 1114513 1086272 1058448 1032996
55848 1032996 1009513 984507 957306 931541 909111 887677 865696 844930 826219 807567 788258
55837 788258 770414 754810 739404 723517 709198 697038 684841 671901 660421 651325 642743 633933
55825 633933 626533 620556 613299 603696 593812 584659 574531 562857 551748 542214 532664 522539 513610
55812 513610 506288 498549 489962 482929 478395 474211 469369 466002 465337 465437 464967 465687 469154 474153 479337
55797 479337 485260 491884 497199 500279 502840 505957 508096 508131 507440 507224 506567 504879 503414 502391 499266
55782 499266 491809 480623 467072 451266 433806 416945 402120 388428 374995 362592 351589 340899
$$ packed form
55870A941720o7545o3071n7993n6341n4855m9404m3385m1724m2075l9967l7265
55859A388095l7622l8600l6248l2895l2732l3891l2304k9290k8241k7824k5452
55848A032996k3483k5006k7201k5765k2430k1434k1981k0766j8711j8652j9309
55837G88258j7844j5604j5406j5887j4319j2160j2197j2940j1480r096q582q810
55825F33933p400n977p257r603r884r153j0128j1674j1109r534r550j0125q929
55812E13610p322p739q587p033m534m184m842l367o65J00m70P20L467M999N184
55797D79337N923O624N315L080K561L117K139L5o91k16o57j688j465j023l125
55782D99266p457j1186j3551j5806j7460j6861j4825j3692j3433j2403j1003j0690
$$ plain form
55770 340899 330487 322365 317359 313367 308566 303995 301163 299391 297388 295354 293597 290999 286693 281641
55756 281641 276946 272212 266874 261394 255811 248968 240475 231741 223983 217063 211226 207767 206741 206189
55742 206189 204904 203852 203662 203046 201224 199604 199336 199289 198148 196632 195929 195713 195319 195074 194910 193431 189994
55725 189994 186094 183208 180918 178467 176320 174775 172868 170187 167949 166811 165547 163453 162061 162604
55711 162604 163751 163835 163621 164739 166883 168680 170107 171963 173970 175322 176192 177038 177246 175995 173633 170912
55695 170912 167836 164437 161520 159389 157053 153896 150912 149051 147787 146637 146582 148414 151025 152940 154386
55680 154386 156358 158778 161094 163473 165932 167418 167342 166968 167860 169825 171648 172699 172552 170346 166067
55665 166067 161396 157932 155610 153975 153544 154459 155258 154716 153665 153385 153472 153007 152594 153318 154729 155731 156578
$$ packed form
55770C40899j0412q122n006l992m801m571k832j772k003k034j757k598m306n052
55756B81641m695m734n338n480n583o843q493q734p758o920n837l459j026n52
55742B06189j285j052j90o16j822j620k68m7j141j516p03k16l94k45j64j479l437
55725A89994l900k886k290k451k147j545j907k681k238j138j264k094j392N43
55711A62604J147Q4k14J118K144J797J427J856K007J352Q70Q46K08j251k362k721
55695A70912l076l399k917k131k336l157k984j861j264j150n5J832K611J915J446
55680A54386J972K420K316K379K459J486p6l74Q92J965J823J051j47k206m279
55665A66067m671l464k322j635m31R15P99n42j051k80Q7m65m13P24J411J002Q47
$$ plain form
55648 156578 158215 160526 162915 165683 169034 171612 171911 170428 168680 166831 164034 160408 156820 153313
55634 153313 149462 145737 142804 140033 136459 132640 129856 127918 125594 122825 120735 119675 118918 118176 117855
55619 117855 117922 117902 117916 118424 119065 118977 118062 116812 115160 112667 109529 106362 103367 100741 99277 99342 99742 98882
55601 98882 96716 94476 93010 92504 93120 94573 95649 95466 94713 94415 94204 93191 91839 91302 91447 91229 90641
55584 90641 90606 91183 91579 91797 92706 94494 96567 98862 101819 105088 107858 110625 115120 122145 130595 138879
55568 138879 146237 152466 157399 161009 163286 163918 162646 159781 155796 150807 145159 139930 135918 132637
55554 132637 129231 125774 122619 119201 114792 109949 105877 102803 100200 98078 96666 95362 93515 91783
55540 91783 91228 91504 91566 91660 92775 94485 95357 95401 96000 97246 97501 96101 94491 93896 93629 92632 91211 90223
$$ packed form
55648A56578J637K311K389K768L351K578K99j483j748j849k797l626l588l507
55634A53313l851l725k933k771l574l819k784j938k324k769k090j060p57p42l21
55619A17855O7k0J4N08O41q8r15j250j652k493l138l167k995k626j464O5M00q60
55601I8882k166k240j466n06O16J453J076j83p53k98k11j013j352n37J45k18n88
55584I0641l5N77L96K18R09J788K073K295K957L269K770K767M495P025Q450Q284
55568A38879P358O229M933L610K277O32j272k865l985m989n648n229m012l281
55554A32637l406l457l155l418m409m843m072l074k603k122j412j304j847j732
55540I1783n55K76O2R4J115J710Q72M4N99J246K55j400j610n95k67r97j421r88
$$ plain form
55522 90223 89699 89236 88794 88280 87155 85171 82816 80588 78554 76967 76419 76839 77199 76704 75588 74355
55506 74355 73051 71718 70812 70660 71029 71651 72550 73547 74066 73788 73035 72247 71579 71169 71216 71562 71712 71432 70936
55487 70936 70452 70078 70036 70494 71127 71356 71028 70391 69607 68806 68316 68221 68026 67555 67656 69001 70564 70626 69156
55468 69156 67860 67781 68173 68033 67430 66842 66327 65980 66237 67093 67812 68008 68300 69266 70404 70750 70048 68801
55450 68801 67633 67081 67576 69026 70547 71040 70089 68243 66595 65988 66279 66390 65428 63775 62690 62891 63884
55433 63884 64683 64805 64553 64666 65589 66913 67702 67628 67372 67622 68234 68880 69851 71375 72699 72874 72184 71789
55415 71789 72058 72202 71556 70322 69001 67820 66808 65876 64847 63892 63649 64331 65167 65424 65550 66436 68005
55398 68005 69468 70549 71318 71313 70098 68439 67544 67274 66512 65244 64775 65641 66748 67025 66717 66570 66781 67234
$$ packed form
55522I0223n24m63m42n14j125j984k355k228k034j587n48M20L60m95j116j233
55506G4355j304j333r06j52L69O22Q99R97N19k78p53p88o68m10M7L46J50k80m96
55487G0936m84l74m2M58O33K29l28o37p84q01m90r5j95m71J01J345J563O2j470
55468F9156j296p9L92j40o03n88n15l47K57Q56P19J96K92R66J138L46p02j247
55450F8801j168n52M95J450J521M93r51j846j648o07K91J11r62j653j085K01R93
55433F3884P99J22k52J13R23J324P89p4k56K50O12O46R71J524J324J75o90l95
55415G1789K69J44o46j234j321j181j012r32j029r55k43O82Q36K57J26Q86J569
55398F8005J463J081P69nj215j659q95k70p62j268m69Q66J107K77l08j47K11M53
$$ plain form
55380 67234 67860 68364 68400 68262 68592 69293 69632 69508 69521 69739 69534 68848 68357 68110 67330 66049 65602 66770 68535
55361 68535 69467 69407 69022 68572 67945 67223 66399 65070 63060 60935 59376 58449 57883 57576 57477 57497 57814 58753 60122
55342 60122 61234 61785 62133 62573 63015 63472 64115 64715 64834 64692 64949 65492 65461 64727 64271 64706 65504 66177 67149
55323 67149 68747 70276 70902 70713 70159 69117 67340 65289 63808 63253 63454 64172 65187 66241 67200 67985
55307 67985 68320 68027 67567 67606 68055 68300 68385 68990 70153 71076 71401 71560 71593 70813 69111 67400 66204 65032
55289 65032 63764 63373 64372 65633 65836 65216 64874 65135 65597 66107 66655 66836 66383 65801 65743 66176 66868 68036
55271 68036 69772 71410 72326 72819 73394 73698 73070 71730 70587 70138 70303 70996 72130 73331 74257 74940 75388
55254 75388 75315 74761 74401 74665 75066 74960 74394 73628 72526 71126 70106 69820 69484 68223 66439 65196 64788
$$ packed form
55380F7234O26N04L6j38L30P01L39j24J3K18k05o86m91k47p80j281m47J168J765
55361F8535R32o0l85m50o27p22q24j329k010k125j559r27n66l07r9K0L17R39J369
55342F0122J112N51L48M40M42M57O43O00J19j42K57N43l1p34m56M35P98O73R72
55323F7149J598J529O26j89n54j042j777k051j481n55K01P18J015J054R59P85
55307F7985L35k93m60L9M49K45Q5O05J163R23L25J59L3p80j702j711j196j172
55289F5032j268l91R99J261K03o20l42K61M62N10N48J81m53n82n8M33O92J168
55271F8036J736J638R16M93N75L04o28j340j143m49J65O93J134J201R26O83M48
55254G5388p3n54l60K64M01j06n66p66j102j400j020k86l36j261j784j243m08
$$ plain form
55237 64788 64834 65327 66485 67868 68732 69148 69806 70739 71148 70577 69547 68870 68847 69182 69271 68682 67647 67003 67320
55218 67320 68367 69593 70690 71441 71594 71310 71147 71148 70676 69650 69141 69942 71275 71809 71349 70619 69944 69204
55200 69204 68661 68754 69335 69997 70872 72205 73485 74009 74049 74433 75144 75378 74845 74027 73190 72147 71037 70400
55182 70400 70389 70694 71304 72476 73911 74798 74849 74575 74404 74253 74066 74050 74215 74323 74451 75030 76174 77499 78715
55163 78715 79856 80862 81477 81693 81815 81959 81915 81589 81157 80803 80643 80897 81630 82371 82469 81812 80855 80009 79415
55144 79415 79163 79221 79178 78571 77469 76366 75570 75070 74857 74953 75239 75632 76302 77297 78232 78783 79175 79677 79932
55125 79932 79437 78438 77612 77011 76099 74793 73734 73456 73890 74780 76003 77344 78478 79250 79699 79836 79789 80008
55107 80008 80827 81901 82576 82743 82880 83336 84025 84747 85317 85469 85052 84260 83370 82447 81582 81112 81176 81438 81700
$$ packed form
55237F4788M6M93J158J383Q64M16O58R33M09n71j030o77k3L35Q9n89j035o44L17
55218F7320J047J226J097P51J53k84j63Jm72j026n09Q01J333N34m60p30o75p40
55200F9204n43R3N81O62Q75J333J280N24M0L84P11K34n33q18q37j043j110o37
55182G0400j1L05O10J172J435Q87N1k74j71j51j87j6J65J08J28N79J144J325J216
55163G8715J141J006O15K16J22J44m4l26m32l54j60K54P33P41R8o57r57q46n94
55144G9415k52N8m3o07j102j103p96n00k13R6K86L93O70R95R35N51L92N02K55
55125G9932m95r99q26o01r12j306j059k78M34Q90J223J341J134P72M49J37m7K19
55107H0008Q19J074O75J67J37M56O89P22N70J52m17p92q90r23q65m70O4K62K62
$$ plain form
55088 81700 82311 83376 84087 83637 82370 81255 80575 80072 80011 80956 82593 83867 84379 84687 85113 85217 84614 83455
55070 83455 81886 79880 77860 76714 76827 77669 78560 79253 79717 79962 80285 81011 81818 81960 81302 80571 80399 80742
55052 80742 81341 82049 82556 82478 82022 81909 82355 82682 82296 81482 80930 80904 81190 81478 81551 81366 81135 81115 81307 81635
55032 81635 82256 83297 84447 85276 85829 86345 86637 86418 86036 86099 86477 86521 86214 86213 86712 87205 87483 87920 88549 88765
55012 88765 88285 87558 86950 86321 85722 85608 86004 86282 86177 86202 86638 86991 87001 87368 88781 90879 92819 94272
54994 94272 95203 95313 94443 93150 92208 91829 91859 92277 92903 93107 92476 91531 91169 91662 92688 94048 95764 97595
54976 97595 99052 99876 100197 100298 100464 100861 101350 101634 101706 101864 102207 102608 103239 104453 105823 106080 104607 102404
54958 102404 100924 100447 100311 100257 100616 101326 101734 101504 101094 101151 101841 102866 103730 103941 103275 102000 100620 99447
$$ packed form
55088H1700O11J065P11m50j267j115o80n03o1R45J637J274N12L08M26J04o03j159
55070H3455j569k006k020j146J13Q42Q91O93M64K45L23P26Q07J42o58p31j72L43
55052H0742N99P08N07p8m56j13M46L27l86q14n52k6K86K88P3j85k31k0J92L28
55032H1635O21J041J150Q29N53N16K92k19l82O3L78M4l07jM99M93K78M37O29K16
55012H8765m80p27o08o29n99j14L96K78j05K5M36L53J0L67J413K098J940J453
54994I4272R31J10q70j293r42l79L0M18O26K04o31r45l62M93J026J360J716J831
54976I7595J457Q24L21J01J66L97M89K84P2J58L43M01O31J214J370K57j473k203
54958A02404j480m77j36n4L59P10M08k30m10N7O90J025Q64K11o66j275j380j173
$$ plain form
54940 99447 98607 98279 98554 99088 99237 98665 97646 96754 96461 96972 98186 99705 100976 101558 101352 100728 100444 101260
54922 101260 103457 106733 110586 114708 119071 123798 128933 134164 138852 142550 145415 147847 149827 150977
54908 150977 151119 150282 148230 144616 139800 134847 130463 126427 122444 119013 116876 115887 114993 113327 110938
54893 110938 108490 106622 105687 105812 106915 108570 110038 110700 110598 110341 110371 110572 110782 111257 112248 113558 115085
54876 115085 117489 121487 126671 131855 136561 141261 146078 150245 153127 154927 155893 155669 153993 151367 148404
54861 148404 145006 140830 136164 131754 128005 124805 121919 119156 116392 113713 111301 109009 106469 103819
54847 103819 101797 100815 100418 99964 99290 98359 96911 95032 93466 92757 92536 92327 92486 93533 94921 95499 95089
54830 95089 94666 94828 94928 94119 92666 91717 91985 93103 94255 95136 96071 97234 98144 98199 97478 96590 95847 95204
$$ packed form
54940I9447q40l28K75N34J49n72j019q92k93N11J214J519J271N82k06o24k84Q16
54922A01260K197L276L853M122M363M727N135N231M688L698K865K432J980J150
54908A50977J42q37k052l614m816m953m384m036l983l431k137r89q94j666k389
54893A10938k448j868r35J25J103J655J468O62j02k57L0K01K10M75R91J310J527
54876A15085K404L998N184N184M706M700M817M167K882J800R66k24j676k626k963
54861A48404l398m176m666m410l749l200k886k763k764k679k412k292k540k650
54847A03819k022r82l97m54o74r31j448j879j566p09k21k09J59J047J388N78m10
54830I5089m23J62J00q09j453r49K68J118J152Q81R35J163R10N5p21q88p43o43
$$ plain form
54812 95204 94917 95507 96801 97769 97773 97392 97493 98052 98503 98811 99463 100624 101931 103008 103677 103778 103298 102620
54794 102620 102217 102157 102196 102226 102259 102164 101808 101379 101221 101447 101946 102645 103497 104388 105267 106172 106907 107030 106505 106058
54774 106058 106486 107774 109284 110585 111755 113036 114639 116815 119763 123396 127383 131347 135042 138526
54760 138526 142225 146498 151023 154937 157670 159224 159629 158707 156629 153996 151006 147171 142338 137391 133322
54745 133322 130117 127241 124759 123172 122395 121672 120521 119188 118204 117864 118025 118112 117540 116440 115652 115666 115981
54728 115981 115931 115649 115696 116169 116853 117921 119796 122552 126021 130230 135134 140184 144726 148563 151547 153090
54712 153090 152819 151426 150003 148750 147097 144829 142243 139320 135674 131367 126959 122700 118459 114506
54698 114506 111607 110168 109849 110048 110190 109613 108008 106072 104971 105032 105597 106178 106930 107861 108457 108447 108211 108043
$$ packed form
54812I5204k87N90J294R68Ml81J01N59M51L08O52J161J307J077O69J01m80o78
54794A02620m03o0L9L0L3r5l56m29j58K26M99O99Q52Q91Q79R05P35J23n25m47
54774A06058M28J288J510J301J170J281J603K176K948L633L987L964L695L484
54760A38526L699M273M525L914K733J554M05r22k078k633k990l835m833m947m069
54745A33322l205k876k482j587p77p23j151j333r84l40J61Q7n72j100p88J4L15
54728A15981n0k82M7M73O84J068J875K756L469M209M904N050M542L837K984J543
54712A53090k71j393j423j253j653k268k586k923l646m307m408m259m241l953
54698A14506k899j439l19J99J42n77j605j936j101O1N65N81P52R31N96j0k36j68
$$ plain form
54680 108043 107725 107183 106930 107324 107910 108086 108001 108247 108916 109518 109691 109539 109242 108689 107667 106267 104991 104367
54662 104367 104447 104801 104992 104896 104541 103993 103609 103934 104926 105666 105359 104406 103901 104250 104851 105009 104657 104209 104305 105567
54642 105567 108059 110902 112886 113444 112742 111125 109087 107503 107070 107513 107982 108145 108218 108119 107514 106782 106943
54625 106943 108305 109911 110636 110292 109444 108752 108691 109308 110044 110262 110061 109980 109945 109283 107921 106719 106369 106713
54607 106713 107407 108425 109527 110065 109809 109305 108923 108295 107221 106413 106682 107924 109502 111058 112295 112551
54591 112551 111448 109660 108335 107891 107952 108208 108738 109624 110810 112239 113710 114732 114997 114853 114893 115152 115114
54574 115114 114503 113765 113729 114863 116736 118174 118299 117485 116939 117236 117837 118239 118805 119924 120964 120942 119930
54557 119930 119053 119189 120297 121886 123487 124596 124807 124249 123561 123320 123672 124479 125511 126482 127226 127902 128864
$$ packed form
54680A08043l18n42k53L94N86J76q5K46O69O02J73j52k97n53j022j400j276o24
54662A04367Q0L54J91r6l55n48l84L25R92P40l07r53n05L49O01J58l52m48R6J262
54642A05567K492K843J984N58p02j617k038j584m33M43M69J63P3r9o05p32J61
54625A06943J362J606P25l44q48o92o1O17P36K18k01q1l5o62j362j202l50L44
54607A06713O94J018J102N38k56n04l82o28j074q08K69J242J578J556J237K56
54591A12551j103j788j325m44O1K56N30Q86J186J429J471J022K65j44M0K59l8
54574A15114o11p38l6J134J873J438J25q14n46K97O01M02N66J119J040k2j012
54557A19930q77J36J108J589J601J109K11n58o88k41L52Q07J032R71P44O76R62
$$ plain form
54540 128864 130321 132232 134393 136426 137887 138647 139035 139388 139647 139622 139443 139361 139300 138989 138460 137986 137566 136919
54522 136919 136017 135276 135054 135266 135652 136179 136950 137838 138437 138384 137642 136440 135054 133744 132831 132545 132709 132758
54504 132758 132317 131589 130936 130286 129364 128338 127734 127664 127748 127892 128575 130050 131742 132853 133288 133645 134540 136209
54486 136209 138478 140808 142577 143588 144169 144616 144894 145042 145454 146391 147568 148601 149631 151041 152804 154455
54470 154455 155557 155857 155279 154159 153296 153306 154082 155215 156724 158891 161606 164413 167090 169584 171434 171892
54454 171892 170830 169086 167702 167079 166876 166386 164948 162453 159630 157486 156271 155225 153548 151372 149601
54439 149601 148990 149593 150933 152400 153519 154046 153981 153505 152884 152320 151799 151112 150158 149187 148618 148612 149017 149645 150385
54420 150385 150953 150820 149687 147989 146666 146300 146594 146811 146639 146450 146680 147167 147287 146696 145724 145019 144940 145397
$$ packed form
54540A28864J457J911K161K033J461P60L88L53K59k5j79q2o1l11n29m74m20o47
54522A36919r02p41k22K12L86N27P71Q88N99n3p42j202j386j310r13k86J64M9
54504A32758m41p28o53o50r22j026o04p0Q4J44O83J475J692J111M35L57Q95J669
54486A36209K269K330J769J011N81M47K78J48M12R37J177J033J030J410J763J651
54470A54455J102L00n78j120q63J0P76J133J509K167K715K807K677K494J850M58
54454A71892j062j744j384o23k03m90j438k495k823k144j215j046j677k176j771
54439A49601o11O03J340J467J119N27o5m76o21n64n21o87r54r71n69oM05O28P40
54420A50385N68j33j133j698j323l66K94K17j72j89K30M87J20n91r72p05p9M57
$$ plain form
54402 145397 146123 146965 147912 148967 150105 151369 152886 154639 156287 157413 158030 158604 159436 160212 160375 159789
54386 159789 158819 157905 157290 157043 157039 156946 156495 155782 155147 154813 154839 155236 155870 156386 156545 156555 156814 157442 158374 159701
54366 159701 161477 163311 164615 165234 165463 165518 165422 165303 165334 165450 165557 165917 166773 167739 168157 167976 167596 166966 165616
54347 165616 163634 161743 160272 158868 157381 156158 155195 153940 152278 150818 149778 148548 146945 145919
54333 145919 146208 147088 147390 147074 146862 146870 146627 146142 145893 145942 145887 145612 145304 144855 144023 143100 142674 142707 142521 141716
54313 141716 140575 139558 138878 138534 138349 138059 137808 138304 140000 142293 144077 144890 145000 144647 143870 142888 141932
54296 141932 140797 139266 137899 137634 138548 139697 140248 140117 139457 138323 137103 136584 137166 138367 139361 139696
54280 139696 139347 138498 137476 136657 136257 136341 136911 137757 138391 138596 138851 139713 140887 141507 141303 140836 140563 140353
$$ packed form
54402A45397P26Q42R47J055J138J264J517J753J648J126O17N74Q32P76J63n86
54386A59789r70r14o15k47mr3m51p13o35l34K6L97O34N16J59J0K59O28R32J327
54366A59701J776J834J304O19K29N5r6j19L1J16J07L60Q56R66M18j81l80o30j350
54347A65616j982j891j471j404j487j223r63j255j662j460j040j230j603j026
54333A45919K89Q80L02l16k12Qk43m85k49M9n5k75l08m49q32r23m26L3j86q05
54313A41716j141j017o80l44j85k90k51M96J696K293J784Q13J10l53p77r82r56
54296A41932j135j531j367k65R14J149N51j31o60j134j220n19N82J201R94L35
54280A39696l49q49j022q19m00Q4N70Q46O34K05K55Q62J174O20k04m67k73k10
$$ plain form
54262 140353 140100 140123 140589 141084 141143 140912 140940 141528 142514 143512 144198 144495 144533 144392 143970 143314 142819 142780 142976 143081
54242 143081 143232 143657 143956 143457 142228 141066 140474 140318 140470 141027 141750 142050 141820 141642 141908 142358 142686 142913
54224 142913 142848 142013 140600 139754 140183 141026 140878 139629 138474 138298 138738 138871 138195 136795 135068 133567 132819
54207 132819 132974 133568 133767 133014 131610 130556 130637 131641 132696 133312 133726 134229 134651 134782 134862 135275 135930 136298
54189 136298 136023 135318 134770 134825 135421 136091 136532 136936 137554 138122 138147 137705 137483 137941 138867 139812 140484 140634 140147
54170 140147 139501 139517 140286 140825 140278 139038 138209 138296 138939 139603 139902 139480 138211 136612 135511 135218 135360 135523
54152 135523 135652 135763 135675 135304 134978 135199 136091 137172 137704 137269 136082 134776 133861 133464 133489 133836 134371 134881
54134 134881 135256 135630 136232 137186 138446 139790 140825 141235 141210 141372 142057 142846 143043 142593 142197 142558 143672 144931
$$ packed form
54262A40353k53K3M66M95N9k31K8N88R86R98O86K97L8j41m22o56m95l9J96J05
54242A43081J51M25K99m99j229j162n92j56J52N57P23L00k30j78K66M50L28K27
54224A42913o5q35j413q46M29Q43j48j249j155j76M40J33o76j400j727j501p48
54207A32819J55N94J99p53j404j054Q1J004J055O16M14N03M22J31Q0M13O55L68
54189A36298k75p05n48N5N96O70M41M04O18N68K5m42k22M58R26R45O72J50m87
54170A40147o46J6P69N39n47j240q29Q7O43O64K99m22j269j599j101k93J42J63
54152A35523J29J11q8l71l26K21Q92J081N32m35j187j306r15l97K5L47N35N10
54134A34881L75L74O02R54J260J344J035M10k5J62O85P89J97m50l96L61J114J259
$$ plain form
54116 144931 145748 146033 146175 146622 147425 148157 148342 148021 147850 148482 149806 150943 151175 150736 150418 150440 150172 149155
54098 149155 147950 147510 148001 148728 149151 149510 150348 151778 153330 154347 154586 154607 155459 157742 161131 165064 169568
54081 169568 174849 180280 184482 186511 186462 184903 182336 179302 176418 174022 172136 170887 170441 170428 170046 168985
54065 168985 167724 166709 165818 164928 164354 164287 164420 164642 165546 167553 170006 171866 173033 174269 176036 178136
54049 178136 180413 182982 185718 188188 190364 192816 195927 199401 202852 206507 210953 216447 222878 230204
54035 230204 238517 247635 256955 265814 273723 280229 284936 288016 290458 293280 296433 298938 300251 300949
54021 300949 301758 302403 301956 300016 296935 293140 288957 284957 281703 279005 276060 272442 268286 263536 257870
54006 257870 251653 246043 241650 237825 233853 230122 227288 224894 221812 217848 213984 211052 208873 206855
$$ packed form
54116A44931Q17K85J42M47Q03P32J85l21j71O32J324J137K32m39l18K2k68j017
54098A49155j205m40M91P27M23L59Q38J430J552J017K39K1Q52K283L389L933M504
54081A69568N281N431M202K029m9j559k567l034k884k396j886j249m46j3l82j061
54065A68985j261j015q91q90n74o7J33K22R04K007K453J860J167J236J767K100
54049A78136K277K569K736K470K176K452L111L474L451L655M446N494O431P326
54035B30204Q313R118R320Q859P909O506M707L080K442K822L153K505J313O98
54021C00949Q09O45m47j940l081l795m183m000l254k698k945l618m156m750n666
54006B57870o217n610m393l825l972l731k834k394l082l964l864k932k179k018
$$ plain form
53992 206855 204788 202860 201315 200296 199714 199188 198315 197036 195530 193867 192041 190276 188967 188268 187957
53977 187957 187729 187430 187022 186486 185752 184657 183117 181491 180587 181069 182840 185092 186907 187836 188156 188652 189898
53960 189898 191639 193182 194365 195722 197574 199558 201353 203356 206159 209836 214216 219433 225664 232748
53946 232748 240707 250270 261962 274750 286351 295026 300532 303399 304087 303094 301223 299231 297403 295709
53932 295709 294144 292830 292030 292130 293328 295249 297180 298780 300399 302622 305805 310075 315464 321817 328744
53917 328744 335906 343306 351169 359519 367914 375722 382682 389110 395341 401062 405472 408088 409056 408725 407430
53902 407430 405806 404630 403968 402976 400960 398154 394982 391114 385925 379454 372143 363962 354691 344914 335841
53887 335841 328052 321121 314495 308044 301724 295485 289736 285158 281769 278726 275290 271499 267709 264038
$$ packed form
53992B06855k067j928j545j019n82n26q73j279j506j663j826j765j309o99l11
53977A87957k28k99m08n36p34j095j540j626r04M82J771K252J815R29L20M96J246
53960A89898J741J543J183J357J852J984J795K003K803L677M380N217O231P084
53946B32748P959R563J1692J2788J1601Q675N506K867O88r93j871j992j828j694
53932B95709j565j314q00J00J198J921J931J600J619K223L183M270N389O353O927
53917C28744P162P400P863Q350Q395P808O960O428O231N721M410K616R68l31j295
53902D07430j624j176o62r92k016k806l172l868n189o471p311q181r271r777r073
53887C35841p789o931o626o451o320o239n749m578l389l043l436l791l790l671
$$ plain form
53873 264038 260492 257133 253818 250293 246748 243749 241339 238746 235358 231515 227915 224673 221363 217652
53859 217652 213471 208913 204494 201241 199937 200270 201056 201276 200702 199645 198483 197376 196255 194960 193528
53844 193528 192246 191420 191217 191724 192859 194153 194913 194840 194305 193852 193627 193439 193099 192553 191917 191557 191900 192896
53826 192896 193887 194263 194036 193629 193363 193455 194221 195791 197707 199237 200135 200847 201913 203434 205193 207082 209305
53809 209305 212233 216124 220898 226232 231833 237520 243003 247882 252124 256389 261464 267406 273511 279171
53795 279171 284456 289671 294667 298870 301917 303976 305556 307155 309060 311137 312719 313009 311789 309603
53781 309603 307106 304439 301402 297892 293776 288620 282184 275218 269106 264494 260748 257034 253316 249906
53767 249906 246592 242940 239170 235993 233617 231500 229103 226398 223561 220633 217652 214768 212107 209749
$$ packed form
53873B64038l546l359l315l525l545k999k410k593l388l843l600l242l310l711
53859B17652m181m558m419l253j304L33P86K20n74j057j162j107j121j295j432
53844A93528j282q26k03N07J135J294P60p3n35m53k25j88l40n46o36l60L43R96
53826A92896R91L76k27m07k66R2P66J570J916J530Q98P12J066J521J759J889K223
53809B09305K928L891M774N334N601N687N483M879M242M265N075N942O105N660
53795B79171N285N215M996M203L047K059J580J599J905K077J582K90j220k186
53781C09603k497k667l037l510m116n156o436o966o112m612l746l714l718l410
53767B49906l314l652l770l177k376k117k397k705k837k928k981k884k661k358
$$ plain form
53753 209749 207860 206588 205862 205547 205691 206285 206896 206986 206557 206041 205580 204918 204080 203648 204126 205337 206594 207214
53735 207214 206931 206192 206018 207038 208596 209335 208797 207936 207894 208836 210243 211755 213304 214881 216568 218537
53719 218537 220661 222425 223527 224202 224788 225386 226220 227759 230039 232340 234089 235700 237931 240755 243534
53704 243534 246053 248648 251387 253849 255841 257737 259999 262822 266353 270755 275832 280988 285742 290001
53690 290001 293667 296336 297671 297854 297437 296863 296236 295474 294567 293777 293518 293861 294138 293398 291431 289158 287805
53673 287805 287808 288604 289309 289358 288658 287495 286381 285742 285521 285161 284135 282501 280825 279587 278827 278389 278228 278202
53655 278202 277790 276465 274496 272973 272788 273757 275022 276124 277293 278731 280056 280719 280788 281013 282078 283913
53639 283913 285743 286754 286694 285984 285360 285430 286411 288175 290457 293001 295578 298006 300250 302460 304817 307435
$$ packed form
53753B09749j889j272p26l15J44N94O11R0m29n16m61o62q38m32M78J211J257O20
53735B07214k83p39j74J020J558P39n38q61m2R42J407J512J549J577J687J969
53719B18537K124J764J102O75N86N98Q34J539K280K301J749J611K231K824K779
53704B43534K519K595K739K462J992J896K262K823L531M402N077N156M754M259
53690B90001L666K669J335J83m17n74o27p62r07p90k59L43K77p40j967k273j353
53673B87805LP96P05M9p00j163j114o39k21l60j026j634j676j238p60m38j61k6
53655B78202m12j325j969j523j85R69J265J102J169J438J325O63O9K25J065J835
53639B83913J830J011o0p10o24P0R81J764K282K544K577K428K244K210K357K618
$$ plain form
53623 307435 310470 314159 318528 323214 327914 332988 339074 345968 352377 357150 360438 363272 366345 369639
53609 369639 372919 375920 378246 379764 381182 383588 387284 391526 395553 399325 403038 406454 409088 410772
53595 410772 411747 412441 413356 414810 416494 417586 417607 416942 416288 415810 415205 414336 413415 412576 411634 410294 408444
53578 408444 406200 403830 401668 399982 398813 397882 396662 394743 392258 389825 387916 386407 385003 383846
53564 383846 383281 383183 383044 382742 382602 382598 382073 380580 378567 376922 376161 376281 377019 377940 378597 378903 379186 379752 380696
53545 380696 382176 384406 387189 390000 392788 396144 400350 404845 409163 413799 419519 426218 433227 440508
53531 440508 448783 458529 469462 480988 492675 504358 516260 528951 542743 557262 572108 587754
53519 587754 605107 624212 644099 664129 684873 707366 731954 758192 785553 813808 842816
$$ packed form
53623C07435L035L689M369M686M700N074O086O894O409M773L288K834L073L294
53609C69639L280L001K326J518J418K406L696M242M027L772L713L416K634J684
53595D10772R75O94R15J454J684J092K1o65o54m78o05q69r21q39r42j340j850
53578D08444k244k370k162j686j169r31j220j919k485k433j909j509j404j157
53564C83846n65r8j39l02j40mn25j493k013j645p61J20P38R21O57L06K83N66R44
53545C80696J480K230K783K811K788L356M206M495M318M636N720O699P009P281
53531D40508Q275R746J0933J1526J1687J1683J1902J2691J3792J4519J4846J5646
53519E87754J7353J9105J9887K0030K0744K2493K4588K6238K7361K8255K9008
$$ plain form
53508 842816 872291 901877 931423 961121 991274 1021908 1052777 1083752 1114920 1146095 1176642
53497 1176642 1206122 1234852 1263402 1291786 1319616 1346792 1373432 1399226 1423594 1446563 1468855
53486 1468855 1490912 1512391 1532965 1553198 1574200 1596577 1619943 1643254 1665467 1686012 1704847
53475 1704847 1722057 1737428 1750500 1760907 1768395 1772656 1773434 1770786 1764876 1755613 1742952 1727570 1710729
53462 1710729 1693257 1675033 1655610 1634871 1612797 1589053 1563254 1535514 1506436 1476724 1447023
53451 1447023 1417879 1389457 1361360 1333032 1304279 1275237 1245990 1216727 1188330 1162346 1139978
53440 1139978 1121108 1104523 1089112 1074713 1061834 1050855 1041713 1034239 1028469 1024589 1022839 1023551 1027038
53427 1027038 1033190 1041358 1050809 1061279 1072972 1086227 1101413 1118995 1139360 1162436 1187569 1213881
$$ packed form
53508H42816K9475K9586K9546K9698L0153L0634L0869L0975L1168L1175L0547
53497A176642K9480K8730K8550K8384K7830K7176K6640K5794K4368K2969K2292
53486A468855K2057K1479K0574K0233K1002K2377K3366K3311K2213K0545J8835
53475A704847J7210J5371J3072J0407P488M261P78k648n910r263j2661j5382j6841
53462A710729j7472j8224j9423k0739k2074k3744k5799k7740k9078k9712k9701
53451A447023k9144k8422k8097k8328k8753k9042k9247k9263k8397k5984k2368
53440A139978j8870j6585j5411j4399j2879j0979r142p474n770l880j750P12L487
53427A027038O152Q168R451J0470J1693J3255J5186J7582K0365K3076K5133K6312
$$ plain form
53415 1213881 1240829 1268600 1297960 1329555 1363343 1398875 1436046 1475171 1516322 1559208 1603988
53404 1603988 1651540 1702392 1755851 1810895 1867607 1927034 1989762 2055397 2123342 2193304 2264942
53393 2264942 2337751 2411505 2486197 2561308 2635735 2708700 2780179 2850114 2917874 2983001 3045987
53382 3045987 3107590 3167599 3224845 3278369 3328078 3374206 3416689 3455229 3489656 3519816 3545080
53371 3545080 3564124 3575293 3577178 3568895 3550013 3520521 3480963 3432415 3376127 3313351 3245499 3174019
53359 3174019 3099739 3022626 2942782 2861541 2781074 2702938 2627429 2554232 2483001 2413212 2344202
53348 2344202 2275724 2207974 2140795 2073489 2005956 1939605 1876463 1817456 1761982 1709064 1658463
53337 1658463 1610653 1566171 1525210 1487782 1454089 1424559 1399353 1377835 1358817 1341363 1325139
$$ packed form
53415A213881K6948K7771K9360L1595L3788L5532L7171L9125M1151M2886M4780
53404A603988M7552N0852N3459N5044N6712N9427O2728O5635O7945O9962P1638
53393B264942P2809P3754P4692P5111P4427P2965P1479O9935O7760O5127O2986
53382C045987O1603O0009N7246N3524M9709M6128M2483L8540L4427L0160K5264
53371C545080J9044J1169J885q283j8882k9492l9558m8548n6288o2776o7852p1480
53359C174019p4280p7113p9844q1241q0467p8136p5509p3197p1231o9789o9010
53348B344202o8478o7750o7179o7306o7533o6351o3142n9007n5474n2918n0601
53337A658463m7810m4482m0961l7428l3693k9530k5206k1518j9018j7454j6224
$$ plain form
53326 1325139 1309879 1294964 1279862 1264768 1250473 1237617 1226285 1216244 1207381 1199921 1194254 1190495
53314 1190495 1188204 1186746 1185996 1186511 1188929 1193407 1199660 1207212 1215499 1224177 1233693 1245248 1259796 1277190
53300 1277190 1296607 1317602 1340362 1365100 1391706 1420074 1450340 1482585 1516573 1551917 1588354
53289 1588354 1625589 1662974 1699613 1734851 1768609 1801116 1832374 1862013 1889670 1915233 1938552
53278 1938552 1959008 1975631 1987694 1995116 1998406 1998394 1995851 1990931 1982875 1970516 1953206 1931103 1904646
53265 1904646 1874139 1840006 1803060 1764212 1723971 1682363 1639226 1594601 1549056 1503691 1459549
53254 1459549 1416922 1375416 1334755 1295229 1257284 1220962 1185834 1151160 1115989 1079565 1041973
53243 1041973 1004163 967068 930918 895578 861189 828188 797013 768130 742061 718896 697933
$$ packed form
53326A325139j5260j4915j5102j5094j4295j2856j1332j0041q863p460n667l759
53314A190495k291j458p50N15K418M478O253P552Q287Q678R516J1555J4548J7394
53300A277190J9417K0995K2760K4738K6606K8368L0266L2245L3988L5344L6437
53289A588354L7235L7385L6639L5238L3758L2507L1258K9639K7657K5563K3319
53278A938552K0456J6623J2063P422L290j2k543m920q056j2359j7310k2103k6457
53265A904646l0507l4133l6946l8848m0241m1608m3137m4625m5545m5365m4142
53254A459549m2627m1506m0661l9526l7945l6322l5128l4674l5171l6424l7592
53243A041973l7810l7095l6150l5340l4389l3001l1175k8883k6069k3165k0963
$$ plain form
53232 697933 678259 659657 642562 627227 613358 600636 589124 578969 569910 561301 552531 543338
53220 543338 533740 523772 513321 502287 490853 479427 468227 457103 445860 434672 424058 414555
53208 414555 406404 399397 392973 386632 380346 374390 368753 363007 356827 350312 343669 336949 330298 324118
53194 324118 318640 313619 308743 304061 299669 295299 290703 286261 282694 280177 278111 275759 272829 269510
53180 269510 266281 263650 261765 260248 258598 256649 254463 252027 249421 247087 245445 244336 243278 242208
53166 242208 241457 241014 240392 239353 238248 237382 236552 235519 234550 234087 234110 234226 234222 234157 233998 233530 232712 231835 231207
53147 231207 230864 230712 230785 231176 231717 231936 231488 230587 229885 229878 230479 231165 231468 231340 231188 231592 232874 234866 237162
53128 237162 239520 241818 243692 244624 244551 244099 243968 244297 244898 245813 247258 249109 250817 251852 252018 251407 250296
$$ packed form
53232F97933j9674j8602j7095j5335j3869j2722j1512j0155r059q609q770r193
53220E43338r598r968j0451j1034j1434j1426j1200j1124j1243j1188j0614r503
53208D14555q151p007o424o341o286n956n637n746o180o515o643o720o651o180
53194C24118n478n021m876m682m392m370m596m442l567k517k066k352k930l319
53180B69510l229k631j885j517j650j949k186k436k606k334j642j109j058j070
53166B42208p51m43o22j039j105q66q30j033r69m63K3J16mo5j59m68q18q77o28
53147B31207l43j52P3L91N41K19m48r01p02pO01O86L03j28j52M04J282J992K296
53128B37162K358K298J874R32p3m52j31L29O01R15J445J851J708J035J66o11j111
$$ plain form
53111 250296 249046 247825 246460 244747 242845 241101 239539 237832 235748 233371 230908 228557 226541 224947
53097 224947 223473 221644 219451 217573 216836 217549 219318 221308 222664 222990 222597 222195 222244 222681 223177 223503 223622
53080 223622 223652 223800 224169 224531 224524 224088 223563 223266 223117 222780 222066 221100 220182 219512 219002 218353 217392 216280 215248
53061 215248 214229 212946 211368 209880 208961 208822 209344 210165 210865 211272 211713 212735 214487 216465 217926 218472
53045 218472 218193 217461 216672 216077 215679 215285 214724 214086 213764 214183 215270 216197 215970 214517 212952 212443 212952 213472
53027 213472 213373 212957 212637 212198 211260 210112 209527 209813 210477 210858 210828 210695 210629 210428 209904 209316 209228 209891 210921
53008 210921 211751 212292 212902 213729 214395 214532 214384 214580 215338 216179 216534 216408 216228 216187 215993 215336 214387 213700 213774
52989 213774 214828 216768 219108 221081 222184 222673 223183 223854 224145 223600 222456 221339 220716 220835 221857 223676
$$ packed form
53111B50296j250j221j365j713j902j744j562j707k084k377k463k351k016j594
53097B24947j474j829k193j878p37P13J769J990J356L26l93m02M9M37M96L26J19
53080B23622L0J48L69L62pm36n25k97j49l37p14r66r18o70n10o49r61j112j032
53061B15248j019j283j578j488r19j39N22Q21P00M07M41J022J752J978J461N46
53045B18472k79p32p89n95l98l94n61o38l22M19J087R27k27j453j565n09N09N20
53027B13472r9m16l20m39r38j148n85K86O64L81l0j33o6k01n24n88q8O63J030
53008B10921Q30N41O10Q27O66J37j48J96P58Q41L55j26j80m1j94o57r49o87P4
52989B13774J054J940K340J973J103M89N10O71K91n45j144j117o23J19J022J819
$$ plain form
52973 223676 225793 227757 229623 231742 234222 236823 239307 241645 243977 246435 248863 250619 251003 250108 248865
52958 248865 247904 246786 244829 242354 240407 239365 238505 237045 235014 232925 231070 229407 227851 226443 225370
52943 225370 224812 224601 224133 222922 221152 219388 217872 216545 215637 215582 216282 216970 217039 216586 216022 215603 215492 215799
52925 215799 216287 216442 216130 215802 215832 215965 215758 215197 214607 214222 214165 214611 215593 216814 217923 218834 219577 219980 219741
52906 219741 218685 216839 214494 212296 210950 210542 210377 209787 208866 208169 207959 208137 208634 209358 209796 209254 207758
52889 207758 206425 206599 208607 211485 213893 215228 215815 216138 216164 215597 214582 213802 213857 214785 216255 217918 219447
52872 219447 220585 221433 222520 224302 226618 228792 230217 230747 230634 230262 229892 229522 228954 228068 227066 226488
52856 226488 226884 228244 229679 229969 228716 226765 225209 224217 223213 221935 220682 219568 218255 216581 214899
$$ packed form
52973B23676K117J964J866K119K480K601K484K338K332K458K428J756L84q95j243
52958B48865r61j118j957k475j947j042q60j460k031k089j855j663j556j408j073
52943B25370n58k11m68j211j770j764j516j327r08n5P00O88O9m53n64m19j11L07
52925B15799M88J55l12l28L0J33k07n61n90l85n7M46R82J221J109R11P43M03k39
52906B19741j056j846k345k198j346m08j65n90r21o97k10J78M97P24M38n42j496
52889B07758j333J74K008K878K408J335N87L23K6n67j015p80N5R28J470J663J529
52872B19447J138Q48J087J782K316K174J425N30j13l72l70l70n68q86j002n78
52856B26488L96J360J435K90j253j951j556r92j004j278j253j114j313j674j682
$$ plain form
52841 214899 213489 212102 210327 208034 205305 202402 200012 198938 199143 199530 199114 198069 197246 197023 197121 197249
52825 197249 197410 197679 198045 198430 198604 198267 197405 196367 195419 194550 193946 194174 195475 197197 198439 199039 199528
52808 199528 200401 201849 203901 206218 207922 208220 207184 205513 203641 201556 199362 197487 196207 195374 194672
52793 194672 193913 193109 192517 192474 192986 193606 194050 194624 195691 196923 197550 197189 196054 194604 193451 193321 194404
52776 194404 195853 196502 196062 195155 194393 194064 194502 195868 197469 198140 197509 196235 194868 193284 191615 190831
52760 190831 191756 193932 196065 197282 197584 197438 197442 198123 199492 200833 201301 200764 199911 199625 200409 202155 204219
52743 204219 205827 206629 206915 207316 208406 210445 213141 215646 217241 218108 219087 220537 221935 222784 223379 224291
52727 224291 225465 226288 226352 225730 224654 223289 221802 220367 219079 217919 216709 215109 212996 210861 209465
$$ packed form
52841B14899j410j387j775k293k729k903k390j074K05L87m16j045q23k23R8J28
52825A97249J61K69L66L85J74l37q62j038r48q69o04K28J301J722J242O00M89
52808A99528Q73J448K052K317J704K98j036j671j872k085k194j875j280q33p02
52793A94672p59q04n92m3N12O20M44N74J067J232O27l61j135j450j153j30J083
52776A94404J449O49m40r07p62l29M38J366J601O71o31j274j367j584j669p84
52760A90831R25K176K133J217L02j46MO81J369J341M68n37q53k86P84J746K064
52743B04219J608Q02K86M01J090K039K696K505J595Q67R79J450J398Q49N95R12
52727B24291J174Q23O4o22j076j365j487j435j288j160j210j600k113k135j396
$$ plain form
52712 209465 208881 208378 207513 206863 207188 208280 209238 209665 209988 210656 211612 212616 213556 214291 214576 214363 213908 213461
52694 213461 213037 212569 212062 211526 210979 210617 210783 211635 212973 214421 215674 216471 216583 216023 215260 214952 215316 215801
52676 215801 215571 214379 212809 211561 210663 209681 208492 207484 206949 206757 206756 207063 207716 208380 208706 208762 208874 209337
52658 209337 210457 212547 215486 218637 221577 224573 227880 230918 232792 233429 233480 233207 232266 230637 228959
52643 228959 227607 226119 223988 221572 219744 218988 219171 219847 220419 220408 220078 220537 222726 226513 231172 236418
52627 236418 242216 247777 251673 253238 253207 252639 251760 250256 248123 245620 242696 239226 235724 233134 231706
52612 231706 230608 228921 226661 224615 223463 223289 223591 223499 222336 220382 218901 218923 220080 221045 221068 220610 220439
52595 220439 220658 220880 220939 221024 221262 221515 221605 221597 221855 222761 224285 225838 226738 226782 226215 225253 224079 223245 223453 224738
$$ packed form
52712B09465n84n03q65o50L25J092R58M27L23O68R56J004R40P35K85k13m55m47
52694B13461m24m68n07n36n47l62J66Q52J338J448J253P97J12n60p63l08L64M85
52676B15801k30j192j570j248q98r82j189j008n35j92jL07O53O64L26N6J12M63
52658B09337J120K090K939L151K940K996L307L038J874O37N1k73r41j629j678
52643B28959j352j488k131k416j828p56J83O76N72j1l30M59K189L787M659N246
52627B36418N798N561L896J565l1n68q79j504k133k503k924l470l502k590j428
52612B31706j098j687k260k046j152j74L02r2j163j954j481K2J157R65K3m58j71
52595B20439K19K22N9Q5K38K53R0qK58R06J524J553R00M4n67r62j174q34K08J285
$$ plain form
52575 224738 226295 227396 228035 228470 228726 228924 229479 230365 230709 229938 228887 228824 229645 230101 229740 229459 229845 230130
52557 230130 229354 227668 225792 223947 222145 220939 220846 221325 221277 220527 219983 220229 220702 220524 219590 218512 217883
52540 217883 217884 218396 219221 220261 221607 223345 225304 227095 228386 228995 228866 228234 227684 227720 228264 228861 229287 229602
52522 229602 229656 229086 227981 227132 227264 228187 228970 228916 228227 227807 228434 230070 231987 233672 235461 238024 241385
52505 241385 244812 247619 249601 250675 250711 249934 248980 248184 247185 245577 243544 241481 239340 236855 234173 231765
52489 231765 229849 228352 227308 226842 226841 227113 227772 228963 230218 230722 230363 230056 230698 232149 233528 234288 234707
52472 234707 235455 236876 238701 240340 241481 242364 243390 244579 245642 246537 247698 249669 252688 256577 260755
52457 260755 264358 266696 267714 267773 266999 265206 262510 259554 256840 254122 250795 246711 242363 238389 235142
$$ packed form
52575B24738J557J101O39M35K56J98N55Q86L44p71j051o3Q21M56l61k81L86K85
52557B30130p76j686j876j845j802j206r3M79m8p50n44K46M73j78r34j078o29
52540B17883JN12Q25J040J346J738J959J791J291O09j29o32n50L6N44N97M26L15
52522B29602N4n70j105q49J32R23P83n4o89m20O27J636J917J685J789K563L361
52505B41385L427K807J982J074L6p77r54p96r99j608k033k063k141k485k682k408
52489B31765j916j497j044m66jK72O59J191J255N04l59l07O42J451J379P60M19
52472B34707P48J421J825J639J141Q83J026J189J063Q95J161J971L019L889M178
52457B60755L603K338J018N9p74j793k696k956k714k718l327m084m348l974l247
$$ plain form
52442 235142 232769 231450 231418 232609 234289 235255 234782 233334 232050 231535 231483 231458 231477 231615 231554 230986 230201 229864
52424 229864 230337 231494 233064 234794 236395 237601 238340 238739 239035 239542 240535 242103 244288 247402 251880 257678
52408 257678 264286 271528 279907 289702 300025 309175 315726 318958 318687 315356 310211 304734 299702 295013
52394 295013 290326 285581 280989 276908 273609 270952 268447 265951 263976 262866 262062 260836 259490 259009 259624
52379 259624 260606 261574 263087 265635 268789 271854 274779 277960 281566 285529 289837 294446 299096 303497 307363
52364 307363 310184 311494 311706 312055 313209 314409 314556 313744 312992 312793 312780 312748 313134 314225 315537 316373 316614
52347 316614 316682 317027 317924 319530 321770 324265 326635 328907 331483 334733 338706 343274 348412 354254 360849
52332 360849 367994 375418 383132 391507 401011 411933 424348 438162 453113 468848 485114 501871
$$ packed form
52442B35142k373j319l2J191J680R66m73j448j284n15n2k5J9J38o1n68p85l37
52424B29864M73J157J570J730J601J206P39L99K96N07R93J568K185L114M478N798
52408B57678O608P242Q379R795J0323R150O551L232k71l331n145n477n032m689
52394B95013m687m745m592m081l299k657k505k496j975j110q04j226j346m81O15
52379B59624R82R68J513K548L154L065K925L181L606L963M308M609M650M401L866
52364C07363K821J310K12L49J154J200J47q12p52j99j3l2L86J091J312Q36K41
52347C16614O8L45Q97J606K240K495K370K272K576L250L973M568N138N842O595
52332C60849P145P424P714Q375R504J0922J2415J3814J4951J5735J6266J6757
$$ plain form
52320 501871 519207 537150 555493 573649 590732 606034 619585 632196 644886 658164 671678
52309 671678 684403 695361 704472 712709 721209 730336 739774 749213 758420 766882 774106 780358 786364 792084
52295 792084 796476 798764 799210 798154 795117 789671 782681 775706 769328 762890 755895 748835 742511 737240
52281 737240 732982 729807 727942 727646 729155 732440 737015 742276 748119 754940 763071 772512 783122 794581
52267 794581 806167 817150 827528 837934 848628 859031 868501 877185 885793 894791 904036 912970 920982
52254 920982 927849 934014 940219 946682 952840 957977 961796 964244 965181 964424 961810 957013 949709 940223 929565
52239 929565 918458 906759 894312 881929 870711 860667 850849 840880 831485 823277 815895 808856 802544
52226 802544 797607 793792 790229 786788 784313 783468 784044 785716 788757 793427 799009 804122 807954 810772 813342
$$ packed form
52320E01871J7336J7943J8343J8156J7083J5302J3551J2611J2690J3278J3514
52309F71678J2725J0958R111Q237Q500R127R438R439R207Q462P224O252O006N720
52295G92084M392K288M46j056l037n446o990o975o378o438o995p060o324n271
52281G37240m258l175j865k96J509L285M575N261N843O821Q131R441J0610J1459
52267G94581J1586J0983J0378J0406J0694J0403R470Q684Q608Q998R245Q934Q012
52254I20982O867O165O205O463O158N137L819K448R37p57k614m797p304r486j0658
52239I29565j1107j1699j2447j2383j1218j0044r818r969r395q208p382p039o312
52226H02544m937l815l563l441k475q45N76J672L041M670N582N113L832K818K570
$$ plain form
52211 813342 816331 820231 825241 830906 836302 840884 844973 849161 853546 857831 861852 865609 868958 871812
52197 871812 874629 878243 883034 888537 893960 898800 902888 906188 908848 911243 913680 916024 917769 918467
52183 918467 918042 916665 914383 910892 905753 898848 890601 881707 872812 864483 857164 850908 845308 840074
52169 840074 835568 832422 830715 829943 829738 830090 830849 831636 832524 834234 837223 840969 844583 847801 850906 853914
52153 853914 856399 858038 858884 859130 859019 858954 859269 859902 860615 861505 862849 864464 865716 866313 866653 867188 867880
52136 867880 868541 869372 870794 873045 876285 880903 887302 895500 905306 916854 930577 946654 964795 984663
52122 984663 1006206 1029423 1054026 1079509 1105429 1131417 1157019 1181667 1204786 1225941 1244960
52111 1244960 1262022 1277414 1291071 1302377 1310624 1315701 1318247 1319139 1318921 1317697 1315403 1312058 1307826
$$ packed form
52211H13342K989L900N010N665N396M582M089M188M385M285M021L757L349K854
52197H71812K817L614M791N503N423M840M088L300K660K395K437K344J745O98
52183I18467m25j377k282l491n139o905q247q894q895q329p319o256n600n234
52169H40074m506l146j707p72k05L52P59P87Q88J710K989L746L614L218L105L008
52153H53914K485J639Q46K46j11o5L15O33P13Q90J344J615J252N97L40N35O92
52136H67880O61Q31J422K251L240M618O399Q198R806J1548J3723J6077J8141J9868
52122I84663K1543K3217K4603K5483K5920K5988K5602K4648K3119K1155J9019
52111A244960J7062J5392J3657J1306Q247N077K546Q92k18j224k294l345m232
$$ plain form
52098 1307826 1302965 1297746 1292352 1286739 1280628 1273653 1265564 1256251 1245563 1233217 1219060 1203482 1187468
52085 1187468 1172177 1158477 1146809 1137244 1129545 1123308 1118349 1114913 1113397 1113852 1115927 1119315 1124026
52072 1124026 1130210 1137927 1147232 1158251 1170907 1184522 1197967 1210400 1221910 1233314 1245142 1256817
52060 1256817 1266988 1274836 1280915 1286533 1292377 1298008 1302570 1305613 1307069 1306819 1304649 1300549 1294810 1287743
52046 1287743 1279324 1269051 1256239 1240685 1223084 1204541 1185650 1166335 1146680 1127429 1109409
52035 1109409 1092812 1077479 1063586 1051498 1041080 1031648 1022610 1013791 1005210 997009 989498 982784 976275
52022 976275 969078 961053 953028 945776 939290 933256 927744 922911 918444 913747 908572 902983 896832 889677
52008 889677 881232 871544 860697 848641 835412 821288 806628 791660 776482 761243 746313 732270
$$ packed form
52098A307826m861n219n394n613o111o975q089r313j0688j2346j4157j5578j6014
52085A187468j5291j3700j1668r565p699o237m959l436j516M55K075L388M711
52072A124026O184P717R305J1019J2656J3615J3445J2433J1510J1404J1828J1675
52060A256817J0171P848O079N618N844N631M562L043J456k50k170m100n739p067
52046A287743q419j0273j2812j5554j7601j8543j8891j9315j9655j9251j8020
52035A109409j6597j5333j3893j2088j0418r432r038q819q581q201p511o714o509
52022I76275p197q025q025p252o486o034n512m833m467m697n175n589o151p155
52008H89677q445r688j0847j2056j3229j4124j4660j4968j5178j5239j4930j4043
$$ plain form
51996 732270 719588 708308 698164 689072 681210 674411 667799 660447 652312 644174 636603 629322 621626
51983 621626 613115 603893 594267 584430 574294 563513 551774 539175 526268 513723 502076 491769
$$ packed form
51996G32270j2682j1280j0144r092p862o799o612p352q135q138p571p281p696
51983F21626q511r222r626r837j0136j0781j1739j2599j2907j2545j1647j0307
$$ [...]
##END NTUPLES=NMR SPECTRUM
##END=
