##TITLE=AC1734_SEN00007_9275963_ZU9xwk6SZo
##JCAMPDX= 6.0         $$ Bruker NMR JCAMP-DX V2.0
##DATA TYPE= NMR SPECTRUM
##DATA CLASS= NTUPLES
##ORIGIN= BRUKER
##OWNER= Administrator
$$ 1.72 TOPSPIN		Version 2.1
$$ 2015-07-18 01:08:05.197 -0700  Administrator@X
$$ Compression mode = diff/dup
##.OBSERVE FREQUENCY= 400.02188249412
##.OBSERVE NUCLEUS= ^1H
##.ACQUISITION MODE= SIMULTANEOUS (DQD)
##.ACQUISITION SCHEME= undefined
##.AVERAGES= 8
##.DIGITISER RES= 22
##SPECTROMETER/DATA SYSTEM= spect
##.PULSE SEQUENCE= zg30
##.SOLVENT NAME= COFFEE_meoh
##.SHIFT REFERENCE= INTERNAL, COFFEE_meoh, 1, 14.98509
##AUDIT TRAIL= $$ (NUMBER, WHEN, WHO, WHERE, PROCESS, VERSION, WHAT)
$$ ##TITLE= Audit trail, TOPSPIN		Version 2.1
$$ ##JCAMPDX= 5.01
$$ ##ORIGIN= Bruker BioSpin GmbH
$$ ##OWNER= Administrator
$$ $$ E:\/data/COFFEE/nmr/AC1734_SEN00007_9275963_ZU9xwk6SZo/10/pdata/1/auditp.txt
$$ ##AUDIT TRAIL=  $$ (NUMBER, WHEN, WHO, WHERE, PROCESS, VERSION, WHAT)
(   1,<2015-07-18 01:07:57.885 -0700>,<Administrator>,<X>,<go>,<TOPSPIN 2.1>,
      <created by zg
	started at 2015-07-18 01:06:52.010 -0700,
	POWCHK enabled, PULCHK disabled,
       configuration hash MD5:
       21 0F 79 D6 B3 7B B4 F6 88 20 88 DB 03 48 BD 9F
       data hash MD5: 64K
       62 39 C8 87 1F 6D CE 3F FD D7 56 03 EE 69 AA DF>)
(   2,<2015-07-18 01:08:00.994 -0700>,<Administrator>,<X>,<proc1d>,<TOPSPIN 2.1>,
      <Start of raw data processing
       efp LB = 0 FT_mod = 6 PKNL = 1 PHC0 = 0 PHC1 = 0 SI = 32K 
       data hash MD5: 32K
       72 F5 26 B0 91 28 07 51 F3 EF 4B 79 E5 6F 99 64>)
(   3,<2015-07-18 01:08:01.291 -0700>,<Administrator>,<X>,<proc1d>,<TOPSPIN 2.1>,
      <pk PHC0 = 86.77002 PHC1 = 0 
       data hash MD5: 32K
       E7 AA 34 FE B7 68 BB 19 4F 70 08 E0 DC 5A 2D FC>)
(   4,<2015-07-18 01:08:01.400 -0700>,<Administrator>,<X>,<proc1d>,<TOPSPIN 2.1>,
      <abs ABSG = 1 
       data hash MD5: 32K
       AE FB 0C 58 89 82 BF 38 B5 66 39 A2 F2 53 90 5D>)
(   5,<2015-07-18 01:08:01.463 -0700>,<Administrator>,<X>,<proc1d>,<TOPSPIN 2.1>,
      <abs ABSG = 2 
       data hash MD5: 32K
       E2 D6 AD 45 8B 1D 42 40 CE 42 A6 CE 66 B4 E2 D7>)
(   6,<2015-07-18 01:08:01.525 -0700>,<Administrator>,<X>,<proc1d>,<TOPSPIN 2.1>,
      <abs ABSG = 3 
       data hash MD5: 32K
       9E 19 AF 8B DB 37 6B 4F DD 2A 5F D8 D2 52 10 6C>)
(   7,<2015-07-18 01:08:01.588 -0700>,<Administrator>,<X>,<proc1d>,<TOPSPIN 2.1>,
      <abs ABSG = 4 
       data hash MD5: 32K
       D4 89 08 32 31 C0 0C 5B 81 D4 54 9F 79 F4 52 66>)
(   8,<2015-07-18 01:08:01.650 -0700>,<Administrator>,<X>,<proc1d>,<TOPSPIN 2.1>,
      <abs ABSG = 5 
       data hash MD5: 32K
       8F 36 C1 0F 2A 4F 6A 49 62 E8 2F CD E1 C9 E1 8C>)
$$ ##END=
$$ 
$$ $$ hash MD5
$$ $$ 14 9E 31 1A 21 7F F0 6D 18 DC E9 DA 45 04 4C 6A
##$RELAX= 
##$RELAX= 
##$RELAX= 
##$RELAX= 
##$RELAX= 
##$RELAX= 
##$RELAX= 
$$ Bruker specific parameters
$$ --------------------------
##$DU= <E:\>
##$EXPNO= 10
##$NAME= <AC1734_SEN00007_9275963_ZU9xwk6SZo>
$$ [...]
150 150 150 150 150 150 150 150
##$TP07= 0
##$TPNAME0= <>
##$TPNAME1= <>
##$TPNAME2= <>
##$TPNAME3= <>
##$TPNAME4= <>
##$TPNAME5= <>
##$TPNAME6= <>
##$TPNAME7= <>
##$TPOAL= (0..7)
0.5 0.5 0.5 0.5 0.5 0.5 0.5 0.5
##$TPOFFS= (0..7)
0 0 0 0 0 0 0 0
##$TUNHIN= 0
##$TUNHOUT= 0
##$TUNXOUT= 0
##$USERA1= <user>
##$USERA2= <user>
##$USERA3= <user>
##$USERA4= <user>
##$USERA5= <user>
##$V9= 5
##$VALIST= <valist>
##$VCLIST= <CCCCCCCCCCCCCCC>
##$VD= 0
##$VDLIST= <DDDDDDDDDDDDDDD>
##$VPLIST= <PPPPPPPPPPPPPPP>
##$VTLIST= <TTTTTTTTTTTTTTT>
##$WBST= 2048
##$WBSW= 25
##$XGAIN= (0..3)
0 0 0 0
##$XL= 0
##$YL= 0
##$YMAX_a= 584760
##$YMIN_a= -515587
##$ZGOPTNS= <>
##$ZL1= 120
##$ZL2= 120
##$ZL3= 120
##$ZL4= 120
##$ABSF1= 14.98509
##$ABSF2= -5.573092
##$ABSG= 5
##$ABSL= 3
##$ALPHA= 0
##$AQORDER= 0
##$ASSFAC= 0
##$ASSFACI= 0
##$ASSFACX= 0
##$ASSWID= 0
##$AUNMP= <proc_prof1d_extract_pilot.lims>
##$AXLEFT= 0
##$AXNAME= <>
##$AXNUC= <1H>
##$AXRIGHT= 0
##$AXTYPE= 0
##$AXUNIT= <>
##$AZFE= 0.1
##$AZFW= 0.1
##$BCFW= 0
##$BC_mod= 0
##$BYTORDP= 0
##$COROFFS= 0
##$CY= 15
##$DATMOD= 1
##$DC= 0
##$DFILT= <>
##$DTYPP= 0
##$F1P= 0
##$F2P= 0
##$FCOR= 0.5
##$FTSIZE= 32768
##$FT_mod= 6
##$GAMMA= 0
##$GB= 0
##$INTBC= 1
##$INTSCL= 1
##$ISEN= 128
##$LB= 0
##$LEV0= 0
##$LPBIN= 0
##$MAXI= 10000
##$MC2= 0
##$MEAN= 0
##$ME_mod= 0
##$MI= 0
##$NCOEF= 0
##$NC_proc= -8
##$NLEV= 6
##$NOISF1= 0
##$NOISF2= 0
##$NSP= 0
##$NTH_PI= 0
##$NZP= 0
##$OFFSET= 14.98509
##$PC= 1
##$PHC0= 86.77002
##$PHC1= 0
##$PH_mod= 1
##$PKNL= yes
##$PPARMOD= 0
##$PPDIAG= 0
##$PPIPTYP= 0
##$PPMPNUM= 2147483647
##$PPRESOL= 1
##$PSCAL= 4
##$PSIGN= 0
##$PYNMP= <proc.py>
##$REVERSE= no
##$SF= 400.02
##$SI= 32768
##$SIGF1= 0
##$SIGF2= 0
##$SINO= 400
##$SIOLD= 32768
##$SPECTYP= <>
##$SREGLST= <1H.CDCl3>
##$SSB= 0
##$STSI= 32768
##$STSR= 0
##$SW_p= 8223.68421052631
##$SYMM= 0
##$S_DEV= 0
##$TDeff= 65536
##$TDoff= 0
##$TI= <>
##$TILT= no
##$TM1= 0
##$TM2= 0
##$TOPLEV= 0
##$USERP1= <user>
##$USERP2= <user>
##$USERP3= <user>
##$USERP4= <user>
##$USERP5= <user>
##$WDW= 1
##$XDIM= 32768
##$YMAX_p= 445532907
##$YMIN_p= -688118
##$CURPLOT= <Network HP LaserJet P1505>
##$CURPRIN= <$Network HP LaserJet P1505>
##$DFORMAT= <normdp>
##$LAYOUT= <+/1D_H.xwp>
##$LFORMAT= <normlp>
##$PFORMAT= <normpl>
##$SURQMSG= 1
$$ End of Bruker specific parameters
$$ ---------------------------------
##NTUPLES= NMR SPECTRUM
##VAR_NAME=  FREQUENCY,     SPECTRUM/REAL,   SPECTRUM/IMAG
##SYMBOL=    X,             R,               I
##VAR_TYPE=  INDEPENDENT,   DEPENDENT,       DEPENDENT
##VAR_FORM=  AFFN,          ASDF,            ASDF
##VAR_DIM=   32768,         32768,           32768
##UNITS=     HZ,            ARBITRARY UNITS, ARBITRARY UNITS
##FACTOR=    0.250966925370066, 1,           1
##FIRST=     8223.43324360094, -33424,       -139996
##LAST=      0,             65041,           -53080
##MIN=       0,             -688118,         0
##MAX=       8223.43324360094, 445532907,    0
$$ Real data points
##PAGE= N=1
##DATA TABLE= (X++(R..R)), XYDATA
$$ [...]
19579i3518j51920R5348A14243c9082j79289Q3475l7308L5067C4082b72254a28742
$$ -93518 -245438 -150090 114243 -39082 -218371 -134896 -172204 -137137 34082 -272254 -128742
19567G4596g6024A35665b50941M1201A72389c67810I1268K8983A4484a3106j91593
$$ 74596 -76024 135665 -250941 -209740 172389 -367810 91268 120251 14484 -13106 -204699
19556b04699e0228k25683f0673B79651a51262f4843A05351c6541G5431b40515
$$ -204699 -50228 -275911 -60673 279651 -151262 -64843 105351 -36541 75431 -240515
19545b9522j07990A13125g1983r197k81359a45976j15925g39F3243f4925j5192
$$ -29522 -137512 113125 -71983 -81180 -362539 -145976 -261901 -739 63243 -64925 -80117
19534h0117g131k00876A88802K5087G4801k1085c11064p7448A30429b94368d6838
$$ -80117 -7131 -208007 188802 213889 74801 53716 -311064 -388512 130429 -294368 -46838
19522F7224I65a86171H7534h6605m44114a55482C68752a12159R815m3624j86526
$$ 67224 965 -186171 87534 -86605 -530719 -155482 368752 -112159 -102344 -145968 -332494
19511c32494b528A49731c2396k55939F7541j7162L57774A23664b18363l7748J03114
$$ -332494 -2528 149731 -32396 -288335 67541 50379 408153 123664 -218363 -256111 -152997
19500a52997m0294A35247b677n01j90111d1459j45040i659p2010N134J5037j8571
$$ -152997 -193291 135247 -2677 -3178 -193289 -41459 -186499 -9659 -81669 -76535 -61498 -80069
19488h0069G0773J4129Q3269B4362e8272k49014B03977b88775B67641a56540E9107
$$ -80069 70773 84902 168171 24362 -58272 -307286 203977 -288775 267641 -156540 59107
19476e3342a347m2005m2932b0599A45464a14890q9345o3665a30511j4018p9351
$$ -53342 -1347 -43352 -86284 -20599 145464 -114890 -204235 -267900 -130511 -144529 -223880
19465b23880R8010M4231j43595r8508J30005H6814g3844B36274h0552H3920b25522
$$ -223880 -125870 -81639 -225234 -323742 -193737 86814 -73844 236274 -80552 83920 -225522
19453b05408A05883a4150D78265j25885c18624J49378M6192E9685c28864B10469
$$ -205408 105883 -14150 478265 352380 -318624 -169246 -123054 59685 -328864 210469
19442b09026d9665o0977B8803J36739D9645j4032J82882j5384b10468R7007l93578
$$ -209026 -49665 -110642 28803 165542 49645 35613 218495 203111 -210468 -113461 -507039
19431e07039f198k27903o9139a39989d1340a6974k62192H262a09822q7320A26811
$$ -507039 -6198 -234101 -303240 -139989 -41340 -16974 -279166 8262 -109822 -197142 126811
19419A34369b77522B71245a06150E9857N7968e4756r126l555A86754D6262b7301
$$ 134369 -277522 271245 -106150 59857 117825 -54756 -63882 -67437 186754 46262 -27301
19407C556c25040a208F547J3244a7306B08128J39465o8348b32019A26676a69091
$$ 3556 -325040 -1208 6547 19791 -17306 208128 347593 279245 -232019 126676 -169091
19395G9264B3692h253A24790b3300A40149a34631A1384f2538A54352p4759C6677
$$ 79264 23692 -8253 124790 -23300 140149 -134631 11384 -62538 154352 79593 36677
19383b44299a14069p4117K0064G8590c47076k4522B41760M6991d4004D1875a70782
$$ -244299 -114069 -188186 -168122 78590 -347076 -371598 241760 288751 -44004 41875 -170782
19371c31168i3434k18477a9955o6857l11529d9215k15035J7325A6933a20200b4124
$$ -331168 -93434 -311911 -19955 -86812 -398341 -49215 -264250 -246925 16933 -120200 -24124
19359a97852r6335j4861H3325b1116o3632k18597a9992n0801p375j31981B40386
$$ -197852 -294187 -309048 83325 -21116 -84748 -303345 -19992 -70793 -78168 -210149 240386
19347a90713e106k03631Q222i6847c0961j64758l0573a0192j47384g4360c2589
$$ -190713 -5106 -208737 -200515 -96847 -30961 -195719 -226292 -10192 -157576 -74360 -32589
19335A08066a05182j2807C230gj07017P560A22722a57028M284K3852k3905j14107
$$ 108066 -105182 -117989 3230 -7 -107024 -99464 122722 -157028 -152744 -128892 -152797 -266904
19323b66904A44275A8775J24479c85528F9875d1540q4846e3684n7194D467f3645
$$ -266904 144275 18775 143254 -385528 69875 -41540 -126386 -53684 -110878 4467 -63645
19311F3606P6114d0641j56579D1903j0537a11955i525k206j59507k3673H4037
$$ 63606 139720 -40641 -197220 41903 31366 -111955 -9525 -11731 -171238 -194911 84037
19299B87832c01170N4128D735d63048d4054j39459f8492b7360j23102A90065h7208
$$ 287832 -301170 -247042 4735 -463048 -44054 -183513 -68492 -27360 -150462 190065 -87208
19287A65928b50589a08790j12771j24315e7710j00670j15487C4291b52359I1499
$$ 165928 -250589 -108790 -221561 -345876 -57710 -158380 -273867 34291 -252359 91499
19276b29566j39809Q6205E7282a35380H4225f4411j52417R7544c6427A50817K4678
$$ -229566 -369375 -283170 57282 -135380 84225 -64411 -216828 -119284 -36427 150817 175495
19265A75495a25438M7059C6124K46503b21357O3241J9196B1025K3202b08117A53555
$$ 175495 -125438 -78379 36124 282627 -221357 -158116 -138920 21025 44227 -208117 153555
19253D8056J00278l3995l8123a69634L9061B4922a2877j48715B68984a9147B20971
$$ 48056 148334 114339 76216 -169634 -130573 24922 -12877 -161592 268984 -19147 220971
19241i2051c2323j02972A52025a97127C07678h2389B47908D536N8343A8892M3557
$$ -92051 -32323 -135295 152025 -197127 307678 -82389 247908 4536 62879 18892 62449
19230F2449K06744j21412F7136R3283n8359K03770c79626a62827C41910f7086
$$ 62449 269193 147781 67136 160419 102060 305830 -379626 -162827 341910 -67086
19219A23393J9609c10218a35065k56644g0502k01695M2638C03871b23042B45560
$$ 123393 143002 -310218 -135065 -391709 -70502 -272197 -229559 303871 -223042 245560
19208e4253n044F301a46939m7243J5550G4421c41433J43202J7455A69244c30526
$$ -54253 -59297 6301 -146939 -194182 -178632 74421 -341433 -198231 -180776 169244 -330526
19196A93783r6806b36815Q3828A25716a65238Q2352j52711b524A74192p8646b1480
$$ 193783 96977 -236815 -152987 125716 -165238 -82886 -235597 -2524 174192 95546 -21480
19184b4937j03077c8139D445a9023j87624b8914j33660C0600a51171L7893j36382
$$ -24937 -128014 -38139 4445 -19023 -206647 -28914 -162574 30600 -151171 -113278 -249660
19173b49660P2823C22379b81050o0048J55495q7889J02709p1608n6374m3036D69732
$$ -249660 -176837 322379 -281050 -341098 -185603 -273492 -170783 -242391 -298765 -341801 469732
19161A11072A323N5885j2868K8185b89961A02847C5318b34109I2144d05089d0306
$$ 111072 1323 57208 44340 72525 -289961 102847 35318 -234109 92144 -405089 -40306
19149B0434a34118j03263R8765o0327G4824e100o639l45082B08790c47013k1691
$$ 20434 -134118 -237381 -138616 -198943 74824 -5100 -11739 -356821 208790 -347013 -368704
19138c68704k22664A85462b09320d6349j66831e9031j03921n6603h9663A28092
$$ -368704 -591368 185462 -209320 -46349 -213180 -59031 -162952 -219555 -89663 128092
19127a8144B9267J34850L4528a54494H0979A8262L6258a70264O1350F4693g3379
$$ -18144 29267 164117 198645 -154494 80979 18262 54520 -170264 -108914 64693 -73379
19115A16487b60936H7639e6469A43730d2053n0334n0195H7776a60194O2236j95420
$$ 116487 -260936 87639 -56469 143730 -42053 -92387 -142582 87776 -160194 -97958 -293378
19104b93378a6880A3075a94755I4730b46569E0902d2653D9209a67621q5593A47369
$$ -293378 -16880 13075 -194755 94730 -246569 50902 -42653 49209 -167621 -253214 147369
19092H0883b56428d2974j95652E8000b20876h7568k35074b9128o8719o8776E6227
$$ 80883 -256428 -42974 -238626 58000 -220876 -87568 -322642 -29128 -97847 -166623 56227
19080A27030b29282A90570r3787b84424J12083I6601a95016K3270I8822b78918
$$ 127030 -229282 190570 96783 -284424 -172341 96601 -195016 -171746 98822 -278918
19069a25765A32830l1980I378O441J51569i4255p9740L2807d4704a1941j19971
$$ -125765 132830 100850 9378 15819 167388 -94255 -173995 -141188 -44704 -11941 -131912
19058a31912c7549F3707d12612i2866L0140o5537L6837k41444F410J06736a94466
$$ -131912 -37549 63707 -412612 -92866 -62726 -128263 -91426 -332870 6410 113146 -194466
19046f3110j8406j6654k06939A09108f6804j50941k25105b07738G7187e8101j33299
$$ -63110 -81516 -98170 -305109 109108 -66804 -217745 -442850 -207738 77187 -58101 -191400
19035a91400N5369E6134j795K4168c257C35456E7924L3045h7914o893C1265R6241
$$ -191400 -136031 56134 54339 78507 -3257 335456 57924 90969 -87914 -94807 31265 127506
19023A27506f9554c1890B12466f0106D11149a27863c7133l09937A20168e9249
$$ 127506 -69554 -31890 212466 -60106 411149 -127863 -37133 -347070 120168 -59249
19012a49199B18924a32512j21531H7247a57458N3948L3256J5830j93636L6336
$$ -149199 218924 -132512 -254043 87247 -157458 -103510 -70254 -54424 -248060 -211724
19002b11724G4956J39676a86809E7118J41991c05150A04663f4751B5137a34025
$$ -211724 74956 214632 -186809 57118 199109 -305150 104663 -64751 25137 -134025
18991e1773A98311A0455a1142k43958A13253a35494A54241a22259B88974d4521
$$ -51773 198311 10455 -11142 -255100 113253 -135494 154241 -122259 288974 -44521
18980c48923D0616c38987M2818A30998c40864J25210A77851a98805f6082B36447
$$ -348923 40616 -338987 -296169 130998 -340864 -215654 177851 -198805 -66082 236447
18969H8937b66133C36688b1324j36157o1223l7241d9904C6908b45647a12713q8866
$$ 88937 -266133 336688 -21324 -157481 -218704 -255945 -49904 36908 -245647 -112713 -201579
18958b01579l3239b8944j69601d0702B82763o1455n2378d87634J8324A76117a23156
$$ -201579 -234818 -28944 -198545 -40702 282763 221308 168930 -487634 -469310 176117 -123156
18946b8131C42121a5439G3590M76199b12690o9293C6560b15379b0436j65042B14417
$$ -28131 342121 -15439 73590 549789 -212690 -281983 36560 -215379 -20436 -185478 214417
18934f8551A97336l3967L043F1803o865f8182I6940A6155L01101G7178d6056E7568
$$ -68551 197336 163369 166412 61803 54938 -68182 96940 16155 317256 77178 -46056 57568
18921b4624B6746J60204q2254a8282j14865M6489j9501A21787i7751p1558j1700
$$ -24624 26746 186950 104696 -18282 -133147 -86658 -106159 121787 -97751 -169309 -181009
18910a81009L9335c2455k40729A82023n2494a55895B14843b05381A62987a09262
$$ -181009 -141674 -32455 -273184 182023 129529 -155895 214843 -205381 162987 -109262
18899a94958G7386a34956B72560f356j44884N5634A89785J9399a38888l08390
$$ -194958 77386 -134956 272560 -6356 -151240 -95606 189785 209184 -138888 -447278
18889d47278B38462a97453m6805j29843a24880b1570A65702f1440q5803n5983
$$ -447278 238462 -197453 -244258 -374101 -124880 -21570 165702 -61440 -147243 -203226
18879b03226g8107C05121a74767m46668a88683A00171a08879E0828b62437A12881
$$ -203226 -78107 305121 -174767 -621435 -188683 100171 -108879 50828 -262437 112881
18868A22911a41869A73658G8318k0146L8670a29049B7466B659c31869J43138j73524
$$ 122911 -141869 173658 78318 58172 96842 -129049 27466 2659 -331869 -188731 -362255
18857c62255J67111a2895k34561f5421j68364A02419d0655J826B74363c36890
$$ -362255 -195144 -12895 -247456 -65421 -233785 102419 -40655 -38829 274363 -336890
18846a02848j70884e1093E9804a83597E4639a02999j5290J9458m8788p6696c9320
$$ -102848 -273732 -51093 59804 -183597 54639 -102999 -118289 -98831 -147619 -224315 -39320
18834b05644a0031j72648L3877B80214A00133a14767k52900g8128R35C8477e4682
$$ -205644 -10031 -182679 -148802 280214 100133 -114767 -367667 -78128 -77193 38477 -54682
18822a48915j00781e2847p6217n4096h5738k2184F8793B6393e2721A36794c0265
$$ -148915 -249696 -52847 -129064 -183160 -85738 -107922 68793 26393 -52721 136794 -30265
18810I2619B3176h256l83673A83174A6192J09033b0190H3431d32304a32k5319
$$ 92619 23176 -8256 -391929 183174 16192 125225 -20190 83431 -432304 -132 -25451
18799b5451B6908a25397j55204A35469J21869o2386e5392A31044D3075b16829
$$ -25451 26908 -125397 -280601 135469 257338 194952 -55392 131044 43075 -216829
18788b2871A17896a7064J387j35478O3715J2340j58431g2941D17793j68202i790
$$ -22871 117896 -17064 -15677 -151155 -87440 -75100 -233531 -72941 417793 249591 -9790
18776E7871a11667j33911a09480D1067j1817J21496b21860R7607M9219E8530b85883
$$ 57871 -111667 -245578 -109480 41067 29250 150746 -221860 -124253 -75034 58530 -285883
18764c60046e6237A43953a78753N3055C28071E1915A3358c2550a2498j95208A02756
$$ -360046 -56237 143953 -178753 -125698 328071 51915 13358 -32550 -12498 -207706 102756
18752c2094m4808B75421a56398B49678A07789b15264j0876r0407J8686G5159a69661
$$ -32094 -76902 275421 -156398 249678 107789 -215264 -226140 -316547 -297861 75159 -169661
18740D7484a25260d0881m5574A40647O4038F3246e0871A78645l6007a4591H4563
$$ 47484 -125260 -40881 -86455 140647 204685 63246 -50871 178645 142638 -14591 84563
18728h3580G8616c77258a05881I0847m4761a98782j65725a4070p4396j67166D7454
$$ -83580 78616 -377258 -105881 90847 46086 -198782 -364507 -14070 -88466 -255632 47454
18716i5561k07881C3148J08718K942K14808I5880q542g4992p1186I2452P658a28868
$$ -95561 -303442 33148 141866 144808 359616 95880 87338 -74992 -146178 92452 100110 -128868
18703C1754a87812j02385E1451f1282A20971b64587E3380O9508a3882q7796A97759
$$ 31754 -187812 -290197 51451 -61282 120971 -264587 53380 122888 -13882 -101678 197759
18691c1989k4128I938b30242B8971D714J1767J68251a63793a0548m5997m6161
$$ -31989 -56117 9938 -230242 28971 4714 16481 184732 -163793 -10548 -56545 -102706
18680a02706A06385C4936i4597j6577q419A67234A7785J86947H9206b13710B66195
$$ -102706 106385 34936 -94597 -111174 -119593 167234 17785 204732 89206 -213710 266195
18668d1084A54241b45987A47822E0720a8691j44831I9891C0249E584d8890m6410
$$ -41084 154241 -245987 147822 50720 -18691 -163522 99891 30249 5584 -48890 -95300
18657i5300Q545J7799m0880A895a07401m27031e3389o8406R550C8164b64336k0339
$$ -95300 -86755 -68956 -109836 1895 -107401 -534432 -53389 -121795 -112245 38164 -264336 -284675
18645b84675g9698k3397B80436g1495B5382b62972a2368j90103C0065a26753c4469
$$ -284675 -79698 -103095 280436 -71495 25382 -262972 -12368 -202471 30065 -126753 -34469
18633b59885a14110A46171A6564d04973a2176B02497a05406q2632f8095B2533
$$ -259885 -114110 146171 16564 -404973 -12176 202497 -105406 -188038 -68095 22533
18622b34103j15919J17074F7490d5944j50895M9084D839b93672a27451j4503A45129
$$ -234103 -350022 -232948 67490 -45944 -196839 -147755 4839 -293672 -127451 -141954 145129
18610b5023B9679b85453c3344o3549D1226c9078j67372R7424q9899a1493k4751
$$ -25023 29679 -285453 -33344 -96893 41226 -39078 -206450 -109026 -198925 -11493 -36244
18599c6244A18118f0137A15606a759j83382B45973H2031a3406H2710f3095A27205
$$ -36244 118118 -60137 115606 -1759 -185141 245973 82031 -13406 82710 -63095 127205
18587A803J05259E2834a95603C21472A24357a21013A9212O212O9766b04818d9792
$$ 1803 107062 52834 -195603 321472 124357 -121013 19212 25424 95190 -204818 -49792
18575A96830j8445g3284A12118a91730j7736G330a96108i6260C9741b23890c9359
$$ 196830 178385 -73284 112118 -191730 -209466 7330 -196108 -96260 39741 -223890 -39359
18563c7411B5720L8116a52581N6231l2419j33111D6992b75297g8848C3081d6060
$$ -37411 25720 63836 -152581 -96350 -128769 -261880 46992 -275297 -78848 33081 -46060
18551c9468A24038a6399j67981E5683J37757f2518C4481a91777B5483R0537c6533
$$ -39468 124038 -16399 -184380 55683 193440 -62518 34481 -191777 25483 116020 -36533
18539A96493b69964A6962b21896c4680q248q5754j62202A57759l372N0043a29517
$$ 196493 -269964 16962 -221896 -34680 -42928 -128682 -290884 157759 154387 204430 -129517
18527b04512o3532a15889n619A69268C563O2692c40937B0698K8712b6602k44945
$$ -204512 -268044 -115889 -121508 169268 3563 66255 -340937 20698 49410 -26602 -271547
18516b71547g3981j3200H2413C6398L21825A18908n498C1371K25111j09323d4576
$$ -271547 -73981 -87181 82413 36398 358223 118908 113410 31371 256482 147159 -44576
18504H4369a12870j43715A7631b21693B03741b77859a0845j02252E9892b049l97740
$$ 84369 -112870 -256585 17631 -221693 203741 -277859 -10845 -113097 59892 -2049 -399789
18493c99789f409n3612K2539m5675F0031g1159j71197A2002c8945A17794i4508
$$ -399789 -6409 -60021 -37482 -83157 60031 -71159 -242356 12002 -38945 117794 -94508
18481h0563n1099A60368a28639l1470H9722A7004L50789d21631C06433f2095l02294
$$ -80563 -131662 160368 -128639 -160109 89722 17004 367793 -421631 306433 -62095 -364389
18470c64389J70449I4253b0665m4831m0228A5198a49402H9332M706b80444a9986
$$ -364389 -193940 94253 -20665 -65496 -105724 15198 -149402 89332 94038 -280444 -19986
18458B3466B612b58791a07196A3094j110a50096q1979L0148n9312A97800C80b95546
$$ 23466 2612 -258791 -107196 13094 11984 -150096 -232075 -201927 -261239 197800 380 -295546
18445A76008j0402b26039b1093q1680M6024l66078F952f7778B71787a08380a9636
$$ 176008 165606 -226039 -21093 -102773 -56749 -422827 6952 -67778 271787 -108380 -19636
18433F6592d7849A7425d06028h0251D9451K12213a2593k66985A38087i3509B1209
$$ 66592 -47849 17425 -406028 -80251 49451 261664 -12593 -279578 138087 -93509 21209
18421A44636f7950j28395g0718G9745b03140C3868O0324a89788c7627A180a40926
$$ 144636 -67950 -196345 -70718 79745 -203140 33868 94192 -189788 -37627 1180 -140926
18409I4193J19748I1308b60838g3157l9021G2296K8837a85310h9223M0881I4806
$$ 94193 213941 91308 -260838 -73157 -112178 72296 101133 -185310 -89223 -48342 94806
18397b64324B05493a48326B29358a11592K5145o4765j21098B5205K76609A50751
$$ -264324 205493 -148326 229358 -111592 -86447 -151212 -272310 25205 301814 150751
18386A27701a4867A84297J2346F9093A3371M4351a03512B9777J71329i2211j0009
$$ 127701 -14867 184297 196643 69093 13371 57722 -103512 29777 201106 -92211 -102220
18375a02220B73548a87984f6109A50403p346b86508C1846h5553C1855M2379o205
$$ -102220 273548 -187984 -66109 150403 143057 -286508 31846 -85553 31855 74234 68029
18364F8029a02490K9582A18000C9467M5604N2204b35267Q9354l6125L9842c2359
$$ 68029 -102490 -72908 118000 39467 85071 137275 -235267 -145913 -182038 -142196 -32359
18352D2090K2872a56060F4222f795C8577L085b3567A66084a28627I6612c24650
$$ 42090 64962 -156060 64222 -6795 38577 41662 -23567 166084 -128627 96612 -324650
18340I2305a03282n279k92362g1510j42716A29739B4875a9844o8067o01j91746
$$ 92305 -103282 -108561 -400923 -71510 -214226 129739 24875 -19844 -87911 -88512 -280258
18329b80258Q131g3257j1766k20739H7617Q69c00645j90100b28208f6676B6996
$$ -280258 -272127 -73257 -85023 -305762 87617 88486 -300645 -490745 -228208 -66676 26996
18317B9263N1936i5691m6458n9526d0620H470b66650J17869j0095f3069C0085
$$ 29263 81199 -95691 -142149 -201675 -40620 8470 -266650 -148781 -158876 -63069 30085
18305a20157B75234d47022C48622D9926c8063C383O5168K08125A17431l3220c51450
$$ -120157 275234 -447022 348622 49926 -38063 3383 68551 276676 117431 84211 -351450
18293c2712E2260e1397j47742G5429b64855K4145D4896K71538c43295A17599L15580
$$ -32712 52260 -51397 -199139 75429 -264855 -240710 44896 316434 -343295 117599 433179
18282D33179a29740d2053r104F9992a09368a342j00024A11564D0690b62924i1310
$$ 433179 -129740 -42053 -51157 69992 -109368 -1342 -101366 111564 40690 -262924 -91310
18270a93669d5935j0888F2664a14136A66004h1654l10864B3549L2710G208b09502
$$ -193669 -45935 -56823 62664 -114136 166004 -81654 -392518 23549 56259 7208 -209502
18258b05719n0732f8842L1118A76681f4967L928A08517B6527b61415A78412k849
$$ -205719 -256451 -68842 -37724 176681 -64967 -61039 108517 26527 -261415 178412 175563
18247A75563c45377a39704B9823b18356L6281e9520F8546c43961E6657R6319J09444
$$ 175563 -345377 -139704 29823 -218356 -182075 -59520 68546 -343961 56657 152976 262420
18236B62420C6829J12684d4831B29108m2136g6879j63599c2654H5153i9313k54193
$$ 262420 36829 149513 -44831 229108 186972 -76879 -240478 -32654 85153 -99313 -353506
18225c53506a2848E7213E816f4022K2647j52772g7317a5237B5491R1771g6189
$$ -353506 -12848 57213 5816 -64022 -41375 -194147 -77317 -15237 25491 117262 -76189
18213H2064A6101L5703J4853h1993b6955q464m2754c6981a111C7068b03433Q6967
$$ 82064 16101 51804 66657 -81993 -26955 -35419 -78173 -36981 -1111 37068 -203433 -116466
18201a16466n3312A36414i6165j27195A33973j5315a92492A6135Q9010J16302
$$ -116466 -169778 136414 -96165 -223360 133973 118658 -192492 16135 105145 221447
18191B21447a26450k68546a87301B2448a24147A01960c04809C8319M3900P3213
$$ 221447 -126450 -394996 -187301 22448 -124147 101960 -304809 38319 82219 155432
18181A55432R0701a22744J5444A78769a80619J8469g7981B7188J66144c1686k43104
$$ 155432 246133 -122744 -107300 178769 -180619 -162150 -77981 27188 193332 -31686 -274790
18170b74790R4355g6315o8291A25518a07035E7098e0869Q267B12619b08071f8410
$$ -274790 -180435 -76315 -144606 125518 -107035 57098 -50869 -42602 212619 -208071 -68410
18158d54023D3458a0534F8590k8185f5406B51839m3941A02555c25764c072j06630
$$ -454023 43458 -10534 68590 40405 -65406 251839 207898 102555 -325764 -3072 -109702
18147a09702L2797A72922m8504J23221b159j96236q3636B12945a10148j1147j56991
$$ -109702 -76905 172922 124418 247639 -2159 -198395 -282031 212945 -110148 -121295 -278286
18136b78286N7725D7465b14378A22980C6703q041j2935J2641a05903j26189a11221
$$ -278286 -220561 47465 -214378 122980 36703 28662 15727 28368 -105903 -232092 -111221
18124a16725j18859k27405i5578r5048B59064q7464E1101d5917B19008r8075b0329
$$ -116725 -235584 -462989 -95578 -190626 259064 171600 51101 -45917 219008 120933 -20329
18112A60209a03715l7868k33928H9465e6904K7066C90467c95428a34830j75656
$$ 160209 -103715 -141583 -375511 89465 -56904 -29838 390467 -395428 -134830 -310486
18102c10486O3289d1279k54253D0049K69614f8183e894A08883d606j54547J3007
$$ -310486 -247197 -41279 -295532 40049 309663 -68183 -5894 108883 -4606 -159153 -146146
18091a46146O7083H6676B3709a92631k6030L2218L9141j14133A03051c01885B06027
$$ -146146 -79063 86676 23709 -192631 -218661 -186443 -147302 -261435 103051 -301885 206027
18079B03249g3735A33510k4200g8573I0174D0792R9471a09655k26394F4616B6178
$$ 203249 -73735 133510 109310 -78573 90174 40792 140263 -109655 -336049 64616 26178
18067a41169K2323j98884F6111i974E7996C986L5845d92439B11390b28096O7221
$$ -141169 -118846 -317730 66111 -9974 57996 3986 39831 -492439 211390 -228096 -160875
18056a60875E1758d1949k49717g3252B46135r9163a4178j7876C186J78412a3631
$$ -160875 51758 -41949 -291666 -73252 246135 146972 -14178 -32054 3186 181598 -13631
18044A52360P1636e5174k03664e984j13316A47894a01088C3269O7372O9268J1725
$$ 152360 223996 -55174 -258838 -5984 -119300 147894 -101088 33269 100641 169909 181634
18033A81634E2931g8961B4889J59148a79728f4884E1374c860k13459a0828k5610
$$ 181634 52931 -78961 24889 184037 -179728 -64884 51374 -3860 -217319 -10828 -36438
18022c6438A15779a21999j12648B4550J18281d5279A91523Q0180c23674J34432
$$ -36438 115779 -121999 -234647 24550 142831 -45279 191523 271703 -323674 -189242
18012a89242A09461L3937h2299l9243C8408N7700J29458A04727b37410o9285Q7881
$$ -189242 109461 143398 -82299 -121542 38408 96108 225566 104727 -237410 -306695 -218814
18001b18814M753B01548b07518A31462a38161A14411b66580H3268K23687A49279
$$ -218814 -214061 201548 -207518 131462 -138161 114411 -266580 83268 306955 149279
17990d1410D8228d2869j13540d9813j3883n756B00790D1206O6028b52290A10523
$$ -41410 48228 -42869 -156409 -49813 -63696 -69452 200790 41206 107234 -252290 110523
17978e6802G1038f4623n28143A79037F0497J04908N0012I2089e3453l7678J5737
$$ -56802 71038 -64623 -592766 179037 60497 165405 215417 92089 -53453 -91131 -75394
17967g5394A37006l2720R7863g5074A61736g3016K9448F3194a30083l2770B20768
$$ -75394 137006 104286 202149 -75074 161736 -73016 -43568 63194 -130083 -162853 220768
17955B6494J58650g5407j52347o319C4676K63145b31068B13374i34D8567P1120
$$ 26494 185144 -75407 -227754 -234073 34676 297821 -231068 213374 -934 48567 119687
17944A19687a76658A22248b87027B28757d622j03403C32844a86796G7892a80827
$$ 119687 -176658 122248 -287027 228757 -4622 -108025 332844 -186796 77892 -180827
17933a6735C246a51949H2510K9008l3549l4142a37179o8941h3449A26939n9345
$$ -16735 3246 -151949 82510 111518 77969 43827 -137179 -206120 -83449 126939 67594
17922F7594a92508N2371A6034K60945b5541c988B8105b74639d7035j39774Q0777
$$ 67594 -192508 -140137 16034 276979 -25541 -3988 28105 -274639 -47035 -186809 -106032
17911a06032j14894C67839a57366e3704B66161g2318j62747b3435j57634B2275
$$ -106032 -220926 367839 -157366 -53704 266161 -72318 -235065 -23435 -181069 22275
17900a21433k84154J32719d2394C22280a48222m4496A38453J13041a64288j63005
$$ -121433 -405587 -272868 -42394 322280 -148222 -192718 138453 251494 -164288 -327293
17890c27293A01616Q143f7713a0403A59275E4850J1764j2451a49067A36828b35161
$$ -327293 101616 109759 -67713 -10403 159275 54850 66614 54163 -149067 136828 -235161
17878c10248P6675A42162a76903Qj2607b5763j50882g3660k24450B94112p5644
$$ -310248 -233573 142162 -176903 -176895 -189502 -25763 -176645 -73660 -298110 294112 218468
17867B18468a82880M0892J0708p0717E2156m985g9679r7187h6804A401J96804
$$ 218468 -182880 -141988 -131280 -201997 52156 47171 -79679 -176866 -86804 1401 198205
17856A98205D3056b16194a6578B95037D0132K40143j36320a90730K4814A94084
$$ 198205 43056 -216194 -16578 295037 40132 280275 143955 -190730 -165916 194084
17845a84474B35204j1753a14128O835j84896E8307J69180a53974P3544p9037F6011
$$ -184474 235204 223451 -114128 -107293 -292189 58307 227487 -153974 -80430 -159467 66011
17833h3258m5274G0870J08932a39218j94968e1054k49539J0993H9263N0847J09103
$$ -83258 -128532 70870 179802 -139218 -334186 -51054 -300593 -289600 89263 140110 249213
17822B49213m7422B7263a20264F5281R7993J3258b22111D128M345L1823k413b1889
$$ 249213 201791 27263 -120264 65281 163274 176532 -222111 4128 8473 40296 37883 -21889
17809D5265b83486j94921B79762h7071B08545a43863n5918L4469A58931i4257
$$ 45265 -283486 -478407 279762 -87071 208545 -143863 -199781 -165312 158931 -94257
17798b14445B0511c7071j1604B0350a15592c2220B7984a48723A49893B0630c18345
$$ -214445 20511 -37071 -48675 20350 -115592 -32220 27984 -148723 149893 20630 -318345
17786I5729b01878Q1400e5313r4595j80706E5370b50691d7073F1974J22387j5342
$$ 95729 -201878 -120478 -55313 -149908 -330614 55370 -250691 -47073 61974 184361 169019
17775A69019b33888i9410B8358i9459M8657j24056c2133k01427A72350E9907a05787
$$ 169019 -233888 -99410 28358 -99459 -50802 -174858 -32133 -233560 172350 59907 -105787
17763I4491a0730j04294e2309C1241O0180l2353e8004B09996E8764J09613e2542
$$ 94491 -10730 -115024 -52309 31241 91421 59068 -58004 209996 58764 168377 -52542
17751E921L98758a60175P5493B22916D2724b1195A15730E2217K75606A17006a4540
$$ 5921 404679 -160175 -84682 222916 42724 -21195 115730 52217 327823 117006 -14540
17739b09918A30228A5443a61747j61558B7811j3139g5039l45281A26357b19591
$$ -209918 130228 15443 -161747 -323305 27811 14672 -75039 -420320 126357 -219591
17728a06133H5138k5297a29863b5082B25666e7267B00043g9292b2533k8626I2332
$$ -106133 85138 59841 -129863 -25082 225666 -57267 200043 -79292 -22533 -51159 92332
17716A55755n2323O1732O3456r2457K7489G1361f1293A19893a96355A22091e4629
$$ 155755 103432 165164 228620 136163 163652 71361 -61293 119893 -196355 122091 -54629
17704F6993a14465d2299j98051D20379e8803j8433F9059L25542A72455p3555c7557
$$ 66993 -114465 -42299 -240350 420379 -58803 -77236 69059 394601 172455 98900 -37557
17692A22953F499J64795a2680A92886I779K34313G8570P2118a69552o4667A84166
$$ 122953 6499 171294 -12680 192886 9779 244092 78570 150688 -169552 -234219 184166
17680h497A81734g8418r3801k18512a05808A8930L1690b6403k57783b4997D7658
$$ -8497 181734 -78418 -172219 -390731 -105808 18930 50620 -26403 -284186 -24997 47658
17668a15293j1731P915r4341A13381c50491J71513r9053c1238A45006a40025a9027
$$ -115293 -127024 -119109 -213450 113381 -350491 -178978 -278031 -31238 145006 -140025 -19027
17656B78194E7425J54359a01680k9176C8793b23320h1623k08309e2865l7624B46522
$$ 278194 57425 211784 -101680 -130856 38793 -223320 -81623 -289932 -52865 -90489 246522
17644b59610A12819J11154F0567M6730C3796P9010c432A28633Q3890G5051a66496
$$ -259610 112819 223973 60567 107297 33796 112806 -3432 128633 212523 75051 -166496
17632A92882G6994k8410K75294e7941J394m2875B41602o2370b08414k9249B0566
$$ 192882 76994 48584 323878 -57941 -56547 -99422 241602 179232 -208414 -237663 20566
17620F3446R1994G2922a24k06884c5730A81493J26247A27020e2310q7062J8892
$$ 63446 155440 72922 -124 -207008 -35730 181493 307740 127020 -52310 -139372 -120480
17609a20480C30293a02417J0003k5181a1550o4775j7182O005k07871c9757j39689
$$ -120480 330293 -102417 -92414 -117595 -11550 -76325 -93507 -87502 -295373 -39757 -179446
17598a79446G8761a07690D4885e4165k2803b6629B93701A26161B5252i1965B68192
$$ -179446 78761 -107690 44885 -54165 -76968 -26629 293701 126161 25252 -91965 268192
17586a67439n4550o4220Q0043j28930A53204N463i2758A88354f5816O324H427
$$ -167439 -221989 -286209 -206166 -335096 153204 158667 -92758 188354 -65816 -59492 8427
17574a36582j52833a8837G1135C5445M8749J53338o8109a20312d9173l0235H5655
$$ -136582 -289415 -18837 71135 35445 84194 237532 169423 -120312 -49173 -79408 85655
17562D3333i4277j64968A59668B69a27175A48116h5946H30K346a71876A37110
$$ 43333 -94277 -259245 159668 269 -127175 148116 -85946 830 3176 -171876 137110
17550d0313A07368i7264A8631K37154b29266C62536j12379a43920C13827j2997
$$ -40313 107368 -97264 18631 255785 -229266 362536 250157 -143920 313827 300830
17540C00830C6228Q5896b7019j40084B8318a3028A16448J13089E7676i322A55220
$$ 300830 36228 122124 -27019 -167103 28318 -13028 116448 229537 57676 -9322 155220
17528B97431m5574k5066r732m0962b62503A42715J19714I5797k6939d9746A83379
$$ 297431 251857 226791 217059 176097 -262503 142715 262429 95797 68858 -49746 183379
17516b90823B28164b11728H4870J13747c38831B98815Q0093f4083F5204b7223
$$ -290823 228164 -211728 84870 198617 -338831 298815 378908 -64083 65204 -27223
17505G0697g8273Q579h240B81333b07669R5494A63269o9531K6358b26785A92957
$$ 70697 -78273 -69694 -8240 281333 -207669 -112175 163269 93738 120096 -226785 192957
17493e0689B16767F375M5714K15826G8462c88010a61316B3281M40224p2723a28622
$$ -50689 216767 6375 52089 267915 78462 -388010 -161316 23281 463505 390782 -128622
17481I1763N9557O1151k0701m7987c13856a27408A03434a57828A15848E2084i5764
$$ 91763 151320 212471 191770 143783 -313856 -127408 103434 -157828 115848 52084 -95764
17469A65698o7062c4623A96991a08413C263J66221F4517J35953B0153M5885a68877
$$ 165698 98636 -34623 196991 -108413 3263 169484 64517 200470 20153 66038 -168877
17457B19091M7622J3211I1937Q9717b600B53413d1874B15067N4365a055j762A77712
$$ 219091 266713 279924 91937 181654 -2600 253413 -41874 215067 269432 -1055 -2817 177712
17444A45917O4882G2637a1225E3199N3503K37099A56583K12811p7191J6820M30
$$ 145917 210799 72637 -11225 53199 106702 343801 156583 369394 292203 309023 309453
17433C09453j05132O0420p691j7169B0091J16992M7365M6777I588K53806C2987
$$ 309453 204321 264741 257050 239881 20091 137083 184448 231225 9588 263394 32987
17421A27847J1685K32615c9858D63320O9572a79269C81162J17603j23021Q6218
$$ 127847 139532 372147 -39858 463320 532892 -179269 381162 498765 375744 461962
17411D61962j32194A15448Q9735r7248b95j10077B03826m2045a18557A36508l1479
$$ 461962 329768 115448 205183 107935 -295 -110372 203826 161781 -118557 136508 105029
17400A05029M9506E1143K86779D9790F316a02446d929l5795C58383A16267C8282
$$ 105029 154535 51143 337922 49790 6316 -102446 -4929 -40724 358383 116267 38282
17388A50006J4583L10579k14516r5733J24904O6228F5143Q8192f7867A06758L79121
$$ 150006 164589 475168 260652 164919 289823 356051 65143 153335 -67867 106758 485879
17377D85879n1797A12400M9604L37336k1263A12601E4091L5353J42182b4908A85230
$$ 485879 434082 112400 162004 499340 478077 112601 54091 89444 231626 -24908 185230
17365H4242J97479j12786h9723h609q3157D8375J01105c7480j16607B04384F874
$$ 84242 281721 168935 -89723 -8609 -91766 48375 149480 -37480 -154087 204384 6874
17353A20350b8398A69341J386M1060a47902A50731D1436J11513J29683g923j20393
$$ 120350 -28398 169341 170727 211787 -147902 150731 41436 152949 282632 -7923 -128316
17342a28316A36989J11603d3270A64543b6474E14858d31534a17594j34614H7460
$$ -128316 136989 248592 -43270 164543 -26474 514858 -431534 -117594 -252208 87460
17331A02883I481a55805g0384A99845G0208K50230a10934b3727P703A32227j4956
$$ 102883 9481 -155805 -70384 199845 70208 320438 -110934 -23727 -16024 132227 117271
17320A17271P2406a37522B00163o8802h8559C24843a28577b7252B33263J96420
$$ 117271 189677 -137522 200163 131361 -88559 324843 -128577 -27252 233263 429683
17310D29683j47844j24745K64761G0909N0897L1060L1321a57884c8513A79657
$$ 429683 281839 157094 421855 70909 121806 152866 184187 -157884 -38513 179657
17299e070q7116A83681k1453M3998a24975A12115M86272a67412A61084R57b0571
$$ -5070 -92186 183681 162228 206226 -124975 112115 598387 -167412 161084 162041 -20571
17287F7855j300J33271E3743f0329I2004P7642a89991m9833B6396K52741A38735
$$ 67855 66555 199826 53743 -60329 92004 169646 -189991 -239824 26396 279137 138735
17275D14209a74686F8209J31998P4986c2520r3956A46353J25589A35328J7588
$$ 414209 -174686 68209 200207 275193 -32520 -126476 146353 271942 135328 152916
17265A52916M52898A37312P3870o8848A2088d576E74596A60266K69005I6172k517
$$ 152916 605814 137312 211182 142334 12088 -4576 574596 160266 429271 96172 93655
17254I3655N76356C13656J43769j16328r215n4478e251F6771f1221B66181c5376
$$ 93655 670011 313656 457425 341097 331882 277404 -5251 66771 -61221 266181 -35376
17242A36072K00513j54013e2966B40063J00142C2279J19549C3535J46195g1631
$$ 136072 336585 182572 -52966 240063 340205 32279 151828 33535 179730 -71631
17231A02137K46797h4767I1165J34670H6316K8491D9457a8340A37379K21277j04913
$$ 102137 348934 -84767 91165 225835 86316 114807 49457 -18340 137379 358656 253743
17220B53743l0883q1968J36932J70468D7405b4350C52548K18027A19147a0422
$$ 253743 222860 140892 277824 448292 47405 -24350 352548 570575 119147 -10422
17209B4562K9579J06997Q3842K12898k23281a4199D71341A18619J09791R029f4139
$$ 24562 54141 161138 244980 457878 234597 -14199 471341 118619 228410 237439 -64139
17197B8659Q0663L25464I4667e3732A86473B0480d8610D51633A88767J96047r1498
$$ 28659 109322 434786 94667 -53732 186473 20480 -48610 451633 188767 384814 293316
17186B93316J00056j87748a31084A28296O8271l9355C0747K87765K14094B18096
$$ 293316 393372 205624 -131084 128296 196567 157212 30747 318512 532606 218096
17175B5974M00478A19261N143L69980B44180J49151k3760K6237A62006j7082J02227
$$ 25974 426452 119261 124404 494384 244180 393331 369571 395808 162006 144924 247151
17164B47151J52009A31445a80781E86625j73781C6619L49367P0055J0474B06001
$$ 247151 399160 131445 -180781 586625 412844 36619 385986 456041 466515 206001
17153A34224o6263N48966j47971A73815J8942K94929f6877E23806j71319G0723
$$ 134224 67961 616927 468956 173815 192757 487686 -66877 523806 352487 70723
17142B04192P5714M2294R2437j46263b1652C46662j23224k4520J69975j940o2703
$$ 204192 279906 322200 414637 268374 -21652 346662 223438 198918 368893 366953 304250
17131C04250p5508B5530K31501j22134M19611O304j08309j69479P5082J01000
$$ 304250 228742 25530 257031 134897 554508 560812 452503 283024 358106 459106
17121D59106N0376j95194K2807Q0789K19580C08127A53229M45021B81677D2898
$$ 459106 509482 314288 337095 417884 637464 308127 153229 598250 281677 42898
17110A32043L28726C9097L38131j4853B7327M64002A58810P8795q6447J51182
$$ 132043 460769 39097 377228 362375 27327 491329 158810 237605 151158 302340
17100C02340j30352L33277k22447J18268J0924p6274Q0856J31100k31575K52892
$$ 302340 171988 505265 282818 401086 412010 335736 416592 547692 316117 569009
17090E69009j37821o7380P5164J32838j5196k76308J12265K9883n4726K14696
$$ 569009 431188 363808 438972 571810 556614 280306 392571 422454 367728 582424
17080E82424B46903L6784J80159j51805l4031M08661k79156j13008A42806L10585
$$ 582424 246903 283687 463846 312041 278010 686671 407515 294507 142806 453391
17070D53391K83467j97098Q3398k08926J363j09656J14780M11063l36265n9888
$$ 453391 736858 539760 623158 414232 415595 305939 420719 831782 495517 435629
17060D35629J32279r4573K2392K23146k16336j01190j52274m1831L20597j90380
$$ 435629 567908 473335 495727 718873 502537 401347 249073 207242 527839 337459
17050C37459J13503j81637M46399r1545r6381l3929K86283R8789j41927k65198
$$ 337459 450962 269325 715724 624179 527798 493869 780152 878941 737014 471816
17040D71816K57672j02368L61420l76307N5808j76668J37481Q0987Q0597J13332
$$ 471816 729488 627120 988540 612233 668041 491373 628854 709841 790438 903770
17030I03770m38762L27914j34123j96415J99192K24514m28707J59127j73004Q3754
$$ 903770 465008 792922 658799 462384 661576 886090 457383 616510 443506 527260
17020E27260J74772k20061L63827l00705K34624J06909C83572K33241J44784k64658
$$ 527260 702032 481971 845798 545093 779717 886626 383572 616813 761597 496939
17010D96939K05507k86950L18493A28687P50822p5324k25345K19221J59363l92760
$$ 496939 702446 415496 733989 128687 879509 804185 578840 798061 957424 564664
17000E64664Q6406J94696k68291M46943m81324K41903k9602n4374l740K87400
$$ 564664 651070 845766 577475 1024418 543094 784997 755395 701021 697281 984681
16990I84681K2456J14705m14950J39832k02091R6118K75942l15859K65522q085
$$ 984681 1007137 1121842 706892 846724 644633 740751 1016693 700834 966356 958271
16980I58271k89511K91233q8307R3317k02918J46715l04518M34677P4070j8629
$$ 958271 668760 959993 871686 965003 762085 908800 604282 1038959 1113029 1094400
16970A094400k86683N9279K43685k32958K45718l96689K27998j63941L38117j4325
$$ 1094400 807717 866996 1110681 877723 1123441 726752 954750 790809 1128926 1114601
16960A114601j29371L5395j94877r0481L63464l51293N09284k23805K04477k68483
$$ 1114601 985230 1020625 825748 735267 1098731 747438 1256722 1032917 1237394 968911
16950I68911K6628K646Q1127J02776m3566j6049J74967k28716K87772j34487L8265
$$ 968911 995539 998185 1079312 1182088 1138522 1122473 1297440 1068724 1356496 1222009 1260274
16939A260274l73982K0040N29760j42230k14109K54344p9444J11130J9231p0105
$$ 1260274 886292 906332 1436092 1293862 1079753 1334097 1254653 1365783 1385014 1314909
16929A314909n5717j79122J22996J1181J08217r1643N314n7622O48886m15152
$$ 1314909 1259192 1080070 1203066 1214247 1322464 1230821 1236135 1178513 1827399 1412247
16919A412247j05632J89105j09656k9501J70816M48832n92848Q8818J79160q8506
$$ 1412247 1306615 1495720 1386064 1356563 1527379 1976211 1383363 1472181 1651341 1562835
16909A562835J11688Q5097k15203Q1673m0471N2368J16747K62396j85684p3985
$$ 1562835 1674523 1759620 1544417 1626090 1585619 1637987 1754734 2017130 1831446 1757461
16899A757461L47554j58381k35534J9505M77427l10906j89768L37645l3653r3969
$$ 1757461 2105015 1946634 1711100 1730605 2208032 1897126 1707358 2045003 2011350 1917381
16889A917381M3167K17981k4445j13514j3531k6277j81158L27383R5888L42300
$$ 1917381 1960548 2178529 2154084 2040570 2027039 2000762 1819604 2146987 2242875 2585175
16879B585175j78098q0612q5188J68990J30390j10526K09190r3214n0285p5947
$$ 2585175 2407077 2326465 2241277 2410267 2540657 2430131 2639321 2546107 2495822 2419875
16869B419875J12082n3004n9901K42829r079K41288J04416m9902j28921j40995
$$ 2419875 2531957 2478953 2419052 2661881 2652802 2894090 2998506 2948604 2819683 2678688
16859B678688j31930N28562j58336J52712J80654l13743L77079k02967Q2460j86411
$$ 2678688 2546758 3075320 2916984 3069696 3250350 2936607 3313686 3110719 3193179 3006768
16849C006768M29070q0529R6770j47067M2157O30629n27389K23083N78924k49841
$$ 3006768 3435838 3355309 3452079 3305012 3347169 3977798 3450409 3673492 4252416 4002575
16839D002575j51283L76446k68673J29785L51096l84767L81094j54457K04022
$$ 4002575 3851292 4227738 3959065 4088850 4439946 4055179 4436273 4281816 4485838
16830D485838l3804M57085o1243j64153L52069k09632L89672J4110q4184L53107
$$ 4485838 4452034 4909119 4847876 4683723 5035792 4826160 5215832 5229942 5145758 5498865
16820E498865j73092J119O16725m27042P09522l82505L30212j95347K65385M38454
$$ 5498865 5325773 5326892 5943617 5516575 6226097 5843592 6173804 5978457 6243842 6682296
16810F682296q9454L33128l72554L59614Q3489L91961J20159M87953l58010N28786
$$ 6682296 6592842 6925970 6553416 6913030 6996519 7388480 7508639 7996592 7638582 8167368
16800H167368K34005r1889L83862J33567J71655K38046Q7258N37889K40528j18564
$$ 8167368 8401373 8309484 8693346 8826913 8998568 9236614 9323872 9861761 10102289 9983725
16790I983725N85452J5110M19407J18752L78577K72897L01689K80456P07471j19780
$$ 9983725 10569177 10584287 11003694 11122446 11501023 11773920 12075609 12356065 13063536 12943756
16780A2943756J66679Q88737M88530M7156M02064N41657P75519J60178M55667
$$ 12943756 13110435 13999172 14487702 14534858 14936922 15478579 16254098 16414276 16869943
16771A6869943P58636K09831P73236Q71150K99766N89385Q66987Q73285N70534
$$ 16869943 17628579 17838410 18611646 19482796 19782562 20371947 21238934 22112219 22682753
16762B2682753P12379P39156J089956J360228Q88832P44724J507868J012848J110771
$$ 22682753 23395132 24134288 25224244 26584472 27473304 28218028 29725896 30738744 31849515
16753C1849515K210944Q42546J820902J552284J779716J932733J752880K356062
$$ 31849515 34060459 34903005 36723907 38276191 40055907 41988640 43741520 46097582
16745D6097582K070142K636433K106528L047689K772155K896688L160131L334720
$$ 46097582 48167724 50804157 52910685 55958374 58730529 61627217 64787348 68122068
16737F8122068L926940M013524M246322M549698M743490N067255N180019N179379
$$ 68122068 72049008 76062532 80308854 84858552 89602042 94669297 99849316 105028695
16729A05028695N806861N746224O332300N931785O421854O050304O235465N767716
$$ 105028695 110835556 116581780 122914080 128845865 135267719 141318023 147553488 153321204
16721A53321204N123855M747434L834139L289249K387967J224409p0699o99443
$$ 153321204 158445059 163192493 167026632 170315881 172703848 173928257 173857558 173158115
16713A73158115k034931k907536l526140m998578n547335n692406o298679o305663
$$ 173158115 171123184 168215648 164689508 159690930 154143595 148451189 142152510 135846847
16705A35846847o600980o633752o306501o230156o108217n649052n645857n223718
$$ 135846847 129245867 122612115 116305614 110075458 103967241 98318189 92672332 87448614
16697H7448614m919194m641064m718740m125495l791471l225522l664283k824723
$$ 87448614 82529420 77888356 73169616 69044121 65252650 62027128 58362845 55538122
16689E5538122l167018k767238k117248k626488k130255k333407j939795j841143
$$ 55538122 52371104 49603866 47486618 44860130 42729875 40396468 38456673 36615530
16681C6615530j893568j182664j779207j295581j512752q75023j215971j275307
$$ 36615530 34721962 33539298 31760091 30464510 28951758 28076735 26860764 25585457
16673B5585457o67112j398862j127699m25932q07548o31055j353512j88589r05978
$$ 25585457 24918345 23519483 22391784 21965852 21158304 20527249 19173737 18985148 18079170
16664A8079170p03144n97740n03344r94491J40677r79325k37979m49460j66669
$$ 18079170 17376026 16778286 16274942 15280451 15421128 14441803 14203824 13754364 13587695
16655A3587695r23694l31219k64956l43393m79114l09796j54236l46748l13610
$$ 13587695 12664001 12332782 12067826 11724433 11245319 10935523 10781287 10434539 10120929
16646A0120929m97764q8146k35367k30196n42818j61405j03048j58254n64283
$$ 10120929 9623165 9535019 9299652 9069456 8526638 8365233 8262185 8103931 7539648
16637G539648k1513J31935l19618P8592l31257m27771n6794l02904m5077k23374
$$ 7539648 7518135 7650070 7330452 7409044 7077787 6650016 6593222 6290318 6245241 6021867
16627F021867L26591l64723K03460o48370N039j45547m09288K95138n04215K26175
$$ 6021867 6348458 5983735 6187195 5538825 5543864 5398317 4989029 5284167 4779952 5006127
16617E006127j76548P3398m46421K08861j0975j82722j54666o3899l5458M0124
$$ 5006127 4829579 4902977 4456556 4665417 4654442 4471720 4317054 4253155 4217697 4257821
16607D257821l31824n9145j36896R1325J33854l00867p7132j82384J04880r2360
$$ 4257821 3925997 3866852 3729956 3821281 3955135 3654268 3577136 3394752 3499632 3407272
16597C407272O6864l8576k93580j16266m2112K5614K2121j69767n272m3601Q8472
$$ 3407272 3474136 3435560 3141980 3025714 2983602 3009216 3031337 2861570 2856298 2812697 2901169
16586B901169k94087K06036k82043J29488o3110k82927N29036l96414M6928J4380
$$ 2901169 2607082 2813118 2531075 2660563 2597453 2314526 2843562 2447148 2494076 2508456
16576B508456k43103j8882k31652J35147P8751R983j30351K50375j54154J4321
$$ 2508456 2265353 2246471 2014819 2149966 2228717 2238700 2108349 2358724 2204570 2218891
16566B218891l02212Q5537k18556J54971o4784K0701n5974k27203M04999m581
$$ 2218891 1916679 2002216 1783660 1938631 1873847 1894548 1838574 1611371 2016370 2011789
16556B011789m06639K09632k33583L11966k66622o2527K929k24285K20298r545
$$ 2011789 1605150 1814782 1581199 1893165 1626543 1564016 1566945 1342660 1562958 1553413
16546A553413J80643m0775o2418j91812K05599L3841k72018O4961k32227l8686
$$ 1553413 1734056 1693281 1630863 1439051 1644650 1678491 1406473 1471434 1239207 1200521
16536A200521O2027J01457m2746R3098M1949m31685J05958o4265K64020q6838
$$ 1200521 1262548 1364005 1321259 1414357 1456306 1024621 1130579 1066314 1330334 1243496
16526A243496K25562j10831l11616J61601k83290L08246j1731k3213m3868O1115
$$ 1243496 1469058 1358227 1046611 1208212 924922 1233168 1221437 1198224 1154356 1215471
16516A215471j37792J40907m69847K50565k08693Q063K24308l78909L73951n237
$$ 1215471 1077679 1218586 748739 999304 790611 798674 1022982 644073 1018024 1012787
16506A012787k39747M30594j94311j14112l7376J75032J929j71179l9253j22657
$$ 1012787 773040 1203634 1009323 895211 857835 1032867 1034796 863617 824364 701707
16496G01707J64405j41826J27512K59481k97741L04491m53627N0954M1464J21444
$$ 701707 866112 724286 851798 1111279 813538 1118029 664402 715356 756820 878264
16486H78264k68231l5998M3600J8729J09374L57918l44892j75801K874M3682K25208
$$ 878264 610033 574035 617635 636364 745738 1103656 758764 582963 585837 629519 854727
16475H54727l19167Q0529N11802m82089L5358l11344M40229m3574j2352J29235
$$ 854727 535560 616089 1127891 645802 681160 369816 810045 766471 754119 883354
16465H83354j18783j09732K11083k12576m572O8136j43469N6149K2858l10591
$$ 883354 764571 654839 865922 653346 648774 716910 573441 629590 652448 341857
16455C41857K87210k31649J53826K40457l09144j06466K76113l07728J8008K42695
$$ 341857 629067 397418 551244 791701 482557 376091 652204 344476 362484 605179
16445F05179m5286l9380J61275m220j14508j87835J99793J42148K6832k91164
$$ 605179 559893 520513 681788 677568 563060 375225 575018 717166 743998 452834
16435D52834j17235L76323A78322L04666P8456k39121K22857k65612L46284k2803
$$ 452834 335599 711922 178322 482988 561444 322323 545180 279568 625852 603049
16425F03049B29840J97962k05972L34180k18215n2155J5924K41237j37888J96616
$$ 603049 229840 427802 221830 556010 337795 285640 301564 542801 404913 601529
16415F01529k90444J4417O1399J01067B40421J14662j19657J43152j55938q667
$$ 601529 311085 325502 386901 487968 240421 355083 235426 378578 222640 213973
16405B13973K54885k02549M47473k64033j13689p178A63147J81947j46472J8061
$$ 213973 468858 266309 713782 449749 336060 328882 163147 345094 198622 216683
16395B16683q1019M09668k64868M21093A77545P1921o270p2069N5189O8865K21944
$$ 216683 135664 545332 280464 701557 177545 249466 243196 171127 226316 295181 517125
16384E17125N838k05138r364K4380G0370K18133L127e591I1954N9733K19269A66305
$$ 517125 522963 317825 308461 332841 70370 288503 291630 -5591 91954 151687 370956 166305
16371A54585K4581k2112g1289B51110N8254A48108K61441N5300D3423J75045k7384
$$ 154585 179166 157054 -71289 251110 309364 148108 409549 464849 43423 218468 191084
16360A91084J66393A35856Q6425N1162J2269R4894H2965J34019L30609n9861A51391
$$ 191084 357477 135856 222281 273443 285712 380606 82965 216984 547593 487732 151391
16348B43613P5736q3105K18035A55562Q7875K39589r1634j43741b05318C09186
$$ 243613 319349 236244 454279 155562 243437 483026 391392 247651 -205318 309186
16337D21495F4409R1947J97443j69202H344L64865A39739D7310J82760A04404
$$ 421495 64409 156356 353799 184597 8344 373209 139739 47310 230070 104404
16326B57625A28281J38165P0537j60080p2827e1468p4896B87320k3370H9124L43216
$$ 257625 128281 266446 336983 176903 104076 -51468 -126364 287320 263950 89124 432340
16315D32340H8147J57701C5945L10619B3793K39554O7829d8736n0001c084j67761
$$ 432340 88147 245848 35945 346564 23793 263347 331176 -48736 -98737 -3084 -170845
16304a70845A22743R9104b7076A41165K23524K40039h2029A40807a55367l1275
$$ -170845 122743 221847 -27076 141165 364689 604728 -82029 140807 -155367 -186642
16294a86642a9256A58619J19273J50499J77144k75390j47344g682A08968J7160
$$ -186642 -19256 158619 277892 428391 605535 330145 182801 -7682 108968 126128
16284A26128Q7952q3187J92775B3136L2717a2267F507O9591B7557J13450a32460
$$ 126128 214080 130893 323668 23136 55853 -12267 6507 76098 27557 141007 -132460
16272B05705r649G3142J25113g4222c1403a2712C11862Q0L2330j58803l7249K78507
$$ 205705 196056 73142 198255 -74222 -31403 -12712 311862 311942 344272 185469 148220 426727
16260D26727G1899A1956M731J22736o2385K9762J456A3445a445I9324l0506a93228
$$ 426727 71899 11956 16687 139423 77038 106800 108256 13445 -1445 99324 68818 -193228
16247e0414A40444e4358B05279a93849A41393L043p054b09504I2278e311A18413
$$ -50414 140444 -54358 205279 -193849 141393 144436 137382 -209504 92278 -5311 118413
16235D08730j06948a56942k7658a3256C74661i3507c6050C08117J0920d2493A24211
$$ 408730 301782 -156942 -184600 -13256 374661 -93507 -36050 308117 319037 -42493 124211
16223a17599C46904A34658a14278A11541K0898k8154L0065l6915e112A07932a63306
$$ -117599 346904 134658 -114278 111541 132439 104285 134350 97435 -5112 107932 -163306
16211i5900G4861C5291J55268B6028K99917e643F1236k455a49639B02056J43511
$$ -95900 74861 35291 190559 26028 325945 -5643 61236 58781 -149639 202056 345567
16200C45567K25603B3942K28740A21378a18536Q740A32693d09706J25377A86252
$$ 345567 571170 23942 252682 121378 -118536 -109796 132693 -409706 -284329 186252
16189E4228e88I1751n555e6199B55831C6831e8899O261D8544b36878C2916C932
$$ 54228 -588 91751 86196 -56199 255831 36831 -58899 -52638 48544 -236878 32916 3932
16176A54580c71854G8954e2045j12027h0937c3495J2787C76819g4002j02948f5192
$$ 154580 -371854 78954 -52045 -164072 -80937 -33495 -20708 376819 -74002 -176950 -65192
16164F0927j8429J19969a01445C18359a59980E0637c3092n7951B28739j9712q4959
$$ 60927 42498 162467 -101445 318359 -159980 50637 -33092 -91043 228739 209027 124068
16153A24068R4673L0532b56807C421L00443D4091J00963a24064B88796a86776
$$ 124068 218741 249273 -256807 3421 303864 44091 145054 -124064 288796 -186776
16142B27808i2887F5643J04383h7058B23254j05865b91922a6745k3819A29182
$$ 227808 -92887 65643 170026 -87058 223254 117389 -291922 -16745 -40564 129182
16131a32207k5108A90996b74145A33943A0095K07433H8716j4166j5892b44421
$$ -132207 -157315 190996 -274145 133943 10095 217528 88716 74550 58658 -244421
16120G0082k2464Q8745a77550e5431A4472c8388C5691O2788O188a94932M2802
$$ 70082 47618 136363 -177550 -55431 14472 -38388 35691 98479 104667 -194932 -152130
16109a52130A66974C9714K84605F3821b1921H0529P8033L9609a7825B71270n0537
$$ -152130 166974 39714 324319 63821 -21921 80529 158562 198171 -17825 271270 220733
16098B20733c41959C00133C8369b4771j20723F1247a03930L7171b4437p2468d2738
$$ 220733 -341959 300133 38369 -24771 -145494 61247 -103930 -66759 -24437 -96905 -42738
16086a60283B48436A1401i2772R503g938j85882B46365a92301D20132F6629B3538
$$ -160283 248436 11401 -92772 -83269 -7938 -193820 246365 -192301 420132 66629 23538
16074b29121A28850l4442J10538b15746A48562k5575b68850h7423A60161b8390
$$ -229121 128850 94408 204946 -215746 148562 122987 -268850 -87423 160161 -28390
16063C06944b38849K184A80882C404a00810j42893B0309b8590j05308A41331b84349
$$ 306944 -238849 -236665 180882 3404 -100810 -243703 20309 -28590 -133898 141331 -284349
16051A16524f3842I5677J09123M2019l2594b16k87782B0125G387M12934b47880
$$ 116524 -63842 95677 204800 246819 214225 -216 -287998 20125 7387 420321 -247880
16039f1431J2555J3498l1573b0254k16300C1307Q7085a75965c46A59374a41936
$$ -61431 -48876 -35378 -66951 -20254 -236554 31307 118392 -175965 -346 159374 -141936
16027c86801e2446D7977K11886b63490C17622a03718B32930C7005I852J51810
$$ -386801 -52446 47977 259863 -263490 317622 -103718 232930 37005 9852 161662
16017A61662a686n6281j82229c9388F705i7031k5941j57197J34898H1065f6033
$$ 161662 -1686 -57967 -240196 -39388 6705 -97031 -122972 -280169 -145271 81065 -66033
16005H6736J13356b3605j93096e6176k66142J12273L1782B20677i1398A43319
$$ 86736 200092 -23605 -216701 -56176 -322318 -210045 -178263 220677 -91398 143319
15994b68837P6522A18441J3560a3729H6196j7657a93626b0342B63691j26467K78107
$$ -268837 -192315 118441 132001 -13729 86196 68539 -193626 -20342 263691 137224 415331
15983D15331A13852a68567D44924i3929A95638K17939B5700e65797g2469I6181
$$ 415331 113852 -168567 444924 -93929 195638 413577 25700 -565797 -72469 96181
15972h333j07907A30181a10432e2191A11712l673b6973g772A53281Q5723I3525
$$ -8333 -116240 130181 -110432 -52191 111712 108039 -26973 -7772 153281 239004 93525
15960e4771L048j34891O571h2096B17400c0255A57329b22047A45134J01744a53082
$$ -54771 -51723 -186614 -180043 -82096 217400 -30255 157329 -222047 145134 246878 -153082
15948F5735B08J63075n3437B5809h7106A80074b9467J381A17780g0356j878K2453
$$ 65735 208 163283 109846 25809 -87106 180074 -29467 -28086 117780 -70356 -72234 -49781
15936d9781B0779a30351c0077A51058a9593A40J37196d9021B5496a29867N1279
$$ -49781 20779 -130351 -30077 151058 -19593 140 137336 -49021 25496 -129867 -78588
15925g8588F3989c2161j10500B6711c01515h8477E4321B727b50706c7353H072
$$ -78588 63989 -32161 -142661 26711 -301515 -88477 54321 2727 -250706 -37353 8072
15913c5412j04j17084A93683a70887P2606A96822c401A0084g766q7530H6610l3246
$$ -35412 -35516 -152600 193683 -170887 -98281 196822 -3401 10084 -7766 -95296 86610 53364
15901E3364J35716o1120N7668e215A18540a40483b1262j01991M5489j4160c9664
$$ 53364 189080 127960 185628 -5215 118540 -140483 -21262 -123253 -77764 -91924 -39664
15889b98557g5847j29132A00725f1979l7944p1088d5779j33198f6168I5119c25167
$$ -298557 -75847 -204979 100725 -61979 -99923 -171011 -45779 -178977 -66168 95119 -325167
15877E1261d32209A7073J8193A3983c3896k03864L691M7704g0058N883A12233
$$ 51261 -432209 17073 35266 13983 -33896 -237760 -234069 -186365 -70058 -64175 112233
15865a28322l7001D5088b34527J09298N6045H9484k4850K35682c73521d2476A43581
$$ -128322 -165323 45088 -234527 -125229 -69184 89484 64634 300316 -373521 -42476 143581
15853A10764m6993J67191b6247M493A56787e4348D2262i7178k27880H8347J2889
$$ 110764 63771 230962 -26247 -21754 156787 -54348 42262 -97178 -325058 88347 101236
15842A01236a7128j83625J2666j10143e5378k14447B51221a54706k25123J63828
$$ 101236 -17128 -200753 -188087 -298230 -55378 -269825 251221 -154706 -379829 -216001
15832b16001Q8468k8959o4667R0013D7609c15309A32678J41109b2147A14120a75196
$$ -216001 -127533 -156492 -221159 -131146 47609 -315309 132678 273787 -22147 114120 -175196
15820a28383k43272m4289f0243k7808d1077D0333a69270A39953E8891g5128B02892
$$ -128383 -371655 -415944 -60243 -88051 -41077 40333 -169270 139953 58891 -75128 202892
15808d3576k05927h0704A68598O046j2993b5740F6680b12298g0468n4631D2082
$$ -43576 -249503 -80704 168598 174644 161651 -25740 66680 -212298 -70468 -125099 42082
15796D5770j7365K4121b51884E0922h0412J5706G3545b69649c5990l5084k68767
$$ 45770 28405 52526 -251884 50922 -80412 -64706 73545 -269649 -35990 -71074 -339841
15785c39841g3157p8334M205e7110j89506f427E6958e0756l9266F8317a3520B24313
$$ -339841 -73157 -151491 -147286 -57110 -246616 -6427 56958 -50756 -90022 68317 -13520 224313
15772C864J8030f6587k10288a36422B3081A1339b41743a9736I7033L69799a73048
$$ 3864 21894 -66587 -276875 -136422 23081 11339 -241743 -19736 97033 466832 -173048
15760a37393j14932C58513A66524J15469a10900B3861a94515G3255i9893H806
$$ -137393 -252325 358513 166524 281993 -110900 23861 -194515 73255 -99893 8806
15749a15520P673K8091A18487b56528J02222G8694f5714J1441A74300a68967B47685
$$ -115520 -107847 -79756 118487 -256528 -154306 78694 -65714 -54273 174300 -168967 247685
15737B12576m889a01917J0001k52331J69587e0952j39547e8727l7466j07048E5601
$$ 212576 207687 -101917 -91916 -344247 -174660 -50952 -190499 -58727 -96193 -203241 55601
15725A19354C865a68423C44863I2618B2841c2258A69259L11682A04397m2886i2053
$$ 119354 3865 -168423 344863 92618 22841 -32258 169259 480941 104397 61511 -92053
15713A31687d4044p0856j00157b3279r704n5571l7027k54818A72420f0547q9641
$$ 131687 -44044 -114900 -215057 -23279 -32983 -88554 -125581 -380399 172420 -60547 -150188
15702a50188n3444a532o5158l38728J03323R1042H6720a27183m7013A2925D202
$$ -150188 -203632 -1532 -66690 -405418 -302095 -211053 86720 -127183 -174196 12925 4202
15690B30360a90769G045J34603a39854B09971k873b07501A44893b03287d6307
$$ 230360 -190769 7045 141648 -139854 209971 207098 -207501 144893 -203287 -46307
15679i2250H7971L1552a00828k28667F236J25928n6133l6097J67241a9217G0244
$$ -92250 87971 119523 -100828 -329495 6236 132164 76031 39934 207175 -19217 70244
15667I4226a54161p8346D7003J9669a0388j22378B09183L232E137Q6538b1585
$$ 94226 -154161 -232507 47003 66672 -10388 -132766 209183 212415 5137 91675 -21585
15655b76189B13376b83583A34824a08839A54435p3672A2854b35529B72053h706
$$ -276189 213376 -283583 134824 -108839 154435 80763 12854 -235529 272053 -8706
15644b04782N0340A4752L33991f4086k94197A76496m8918a93029b4188A92602
$$ -204782 -154442 14752 348743 -64086 -358283 176496 127578 -193029 -24188 192602
15633B1972k429b44924A63306g4601A35380c30441P4187A43355C7352R9123L7062
$$ 21972 19543 -244924 163306 -74601 135380 -330441 -256254 143355 37352 136475 173537
15622A73537C1313N4880C2766J15335B7355J32773c9958k47637f3249D0380a51228
$$ 173537 31313 86193 32766 148101 27355 160128 -39958 -287595 -63249 40380 -151228
15610b59E7121c26662B1371K42065b25422g6186A97992F9787h264B1726K35624
$$ -259 57121 -326662 21371 263436 -225422 -76186 197992 69787 -8264 21726 257350
15599B57350G3875K42452d5500n1260L5733j77991I6385M5803b33737P0832F1578
$$ 257350 73875 316327 -45500 -96760 -61027 -239018 96385 142188 -233737 -162905 61578
15587a36227A56664C6740J0182Q3041n9157C2762J63581e1231A68921b6149j31818
$$ -136227 156664 36740 46922 129963 70806 32762 196343 -51231 168921 -26149 -157967
15576a57967A36115J0265C3863b92847J43017L2654p8603i2877o2516d7516q2972
$$ -157967 136115 146380 33863 -292847 -149830 -117176 -195779 -92877 -155393 -47516 -130488
15565a30488p5432e9710E955b2098j4919I60J98707B7839f4954r5674d8447n0194
$$ -130488 -205920 -59710 5955 -22098 -37017 960 199667 27839 -64954 -160628 -48447 -98641
15553i8641C62292E7584b81064B66696r7953b09499A76938m7158a62547E8653
$$ -98641 362292 57584 -281064 266696 168743 -209499 176938 129780 -162547 58653
15542A43836b07376D5326h1097F1394b78601a29536A75562c11599c4668G6481
$$ 143836 -207376 45326 -81097 61394 -278601 -129536 175562 -311599 -34668 76481
15531a56242c9561A14803a85679M6069l4452A3733d7509a1793j37184A30850c65483
$$ -156242 -39561 114803 -185679 -139610 -174062 13733 -47509 -11793 -148977 130850 -365483
15519A02430N0441D2783J04300D228J89889G2439K9513g8793B69472C623b07429
$$ 102430 152871 42783 147083 4228 194117 72439 101952 -78793 269472 3623 -207429
15507B21502b77434J37644K7078r4190A40496c46848k0989A56309a71911H1971
$$ 221502 -277434 -139790 -112712 -206902 140496 -346848 -367837 156309 -171911 81971
15496c12122a53290G67f9864q950b316A59630e9747b4450j76012A49209o7808
$$ -312122 -153290 767 -69864 -78814 -2316 159630 -59747 -24450 -200462 149209 81401
15485H1401Q7536b02348c0607k09969a09447B82013b13973H5519B8237a01630
$$ 81401 168937 -202348 -30607 -240576 -109447 282013 -213973 85519 28237 -101630
15474b9040k08271g2742m7451d8913H9723g6175g066C70196a01858B9010a71555
$$ -29040 -237311 -72742 -120193 -48913 89723 -76175 -7066 370196 -101858 29010 -171555
15462I7804K37763I3661J00903c1414A72601r977F2822R4342P6045a24335B60470
$$ 97804 335567 93661 194564 -31414 172601 162624 62822 157164 233209 -124335 260470
15450a02867G549a18512j37819C9486c2624l1093a1217r8812F9029K32570D2103
$$ -102867 7549 -118512 -256331 39486 -32624 -63717 -11217 -110029 69029 301599 42103
15438A13651b52464j9639I7501B4086J18529J64442a46976g443A06551E0981N8322
$$ 113651 -252464 -272103 97501 24086 142615 307057 -146976 -7443 106551 50981 109303
15427A09303m7944Q6998A7469a22989M3711D6698b4542j60570P7882A77163c2277
$$ 109303 61359 148357 17469 -122989 -79278 46698 -24542 -185112 -107230 177163 -32277
15415A23111c3264k80142h6250p2296j48380e8148d331C18791k2354A02301c79626
$$ 123111 -33264 -313406 -86250 -158546 -306926 -58148 -4331 318791 296437 102301 -379626
15403B43950q5234J18409a38487C10115C7955P683a57759N8164o5140A58731a04415
$$ 243950 158716 277125 -138487 310115 37955 45638 -157759 -99595 -164735 158731 -104415
15391g0590A04286q782b79892J16360A87456B8092a74922K788F7382K06457P1735
$$ -70590 104286 95504 -279892 -163532 187456 28092 -174922 -172134 67382 273839 345574
15380C45574a54954A92017e4359J8146k09476a05199C6986K52288b28505A38272
$$ 345574 -154954 192017 -54359 -36213 -245689 -105199 36986 289274 -228505 138272
15369A95190l4930a8108A9046b72078a32510A45720b52192K9576g9813B05541
$$ 195190 160260 -18108 19046 -272078 -132510 145720 -252192 -222616 -79813 205541
15358A10980m7925a04347c9995J6854A05364D5035b02219i0346k15937c0926B05804
$$ 110980 63055 -104347 -39995 -23141 105364 45035 -202219 -90346 -306283 -30926 205804
15346c3363B61345a34219F6943b1310F3961N6887l0385D3870b2740m2759A01334
$$ -33363 261345 -134219 66943 -21310 63961 120848 90463 43870 -22740 -65499 101334
15334C15780a65004A13240J71310b2196k97806f6952E6266c56553D75978B13775
$$ 315780 -165004 113240 284550 -22196 -320002 -66952 56266 -356553 475978 213775
15323a95722P9730A43182c7580j66102i4402I6484f5410q7883a4797D02565c9267
$$ -195722 -115992 143182 -37580 -203682 -94402 96484 -65410 -153293 -14797 402565 -39267
15311a21100j21745e5040B87690I2476g7712C21285A60158F7583i5980j3614G612
$$ -121100 -242845 -55040 287690 92476 -77712 321285 160158 67583 -95980 -109594 7612
15299a48351N2959A49991i0045o8690B36988j14234M01825B7508c38853J30006
$$ -148351 -95392 149991 -90045 -158735 236988 122754 524579 27508 -338853 -208847
15289b08847F076J1616b28512C274a38626E58200a86874A28547f5805C24627j57451
$$ -208847 6076 17692 -228512 3274 -138626 558200 -186874 128547 -65805 324627 167176
15278A67176c1210F8536j6648K44455k2983n3034j0139n8797O003i912G9550j5331
$$ 167176 -31210 68536 51888 296343 273360 220326 210187 151390 157393 -9912 79550 64219
15266F4219R963O9294K09637f5977A30969K71334K8505E3422j7246N8435D2034
$$ 64219 74182 143476 353113 -65977 130969 402303 430808 53422 36176 94611 42034
15254B05561O8266A18370I860K20578J35096j3420J087123o22612L2164L12051
$$ 205561 273827 118370 9860 230438 365534 352114 1439237 816625 848789 1160840
15244A160840n13798B30852r039j9327a13783e18I4770J13434J77855D2333b43784
$$ 1160840 647042 230852 221813 202486 -113783 -518 94770 208204 386059 42333 -243784
15232C95217q7573J42806B12270a04910A094b21396H1424K6613D692f1095a5248
$$ 395217 307644 450450 212270 -104910 1094 -221396 81424 108037 4692 -61095 -15248
15220a39932n2012a7466B77904r0004n0528J5148i0065R005j40170E9133K33882
$$ -139932 -191944 -17466 277904 187900 137372 152520 -90065 -81060 -221230 59133 293015
15209B93015a27101H2434K6180M3949J34013G850L01464a02424K641F25J03203
$$ 293015 -127101 82434 108614 152563 286576 7850 309314 -102424 -99783 625 103828
15198A03828O117a80303C6365J7897h4647j7521j33237a3573A20494O7528K595
$$ 103828 109945 -180303 36365 54262 -84647 -102168 -235405 -13573 120494 188022 190617
15187A90617n2384b3863n0593l6737B83665B2253J16687D5056K6772M6392a2203
$$ 190617 138233 -23863 -74456 -111193 283665 22253 138940 45056 71828 118220 -12203
15175a50117a3498B98063i1208j2157B48726a09815A15645b63301e9255A7691
$$ -150117 -13498 298063 -91208 -103365 248726 -109815 115645 -263301 -59255 17691
15164a01966G7807A9595J14845J82529A5376J68828d7990A53153c08679B00652
$$ -101966 77807 19595 134440 316969 15376 184204 -47990 153153 -308679 200652
15153C60538C4942a11266j25035B7488J41247o2592A4731F634J73863J04101K35935
$$ 360538 34942 -111266 -236301 27488 168735 106143 14731 6634 180497 284598 520533
15142E20533A16191J70090r1206r0363a42889I6161a86667B85126f1250A14432
$$ 520533 116191 286281 195075 104712 -142889 96161 -186667 285126 -61250 114432
15131B56128r1002G1714k9715a21572C16125H7728e079A9781P6214K43927b32328
$$ 256128 165126 71714 41999 -121572 316125 87728 -5079 19781 95995 339922 -232328
15119B52738a8093m9330A74425a36942c1670C40328A59253C8849j6505d53736
$$ 252738 -18093 -67423 174425 -136942 -31670 340328 159253 38849 22344 -453736
15108a8200H8071c7321B14261a44276A52025n6712P5197D7677k1381g5989A22670
$$ -18200 88071 -37321 214261 -144276 152025 95313 170510 47677 26296 -75989 122670
15096C14428b1535B63733C6805L25157a07720M1681B97810D1477O8229J48549
$$ 314428 -21535 263733 36805 361962 -107720 -66039 297810 41477 109706 258255
15086B58255L9647K9373f4091J2918A65966J7499j7761J23747B6303J91650F9494
$$ 258255 297902 327275 -64091 -51173 165966 183465 165704 289451 26303 217953 69494
15074a78780B7371L00320m1784D1082K45980r9915k1256k2067K32085a0114A47820
$$ -178780 27371 327691 285907 41082 287062 187147 165891 143824 375909 -10114 147820
15062A0451J82058i2759A43678A160K45461h4163a9083B94867j38018l1517O4237
$$ 10451 192509 -92759 143678 1160 246621 -84163 -19083 294867 156849 125332 189569
15051A89569e8802B22325m0121J50938r4687n5308a00696B18071K53527k28324
$$ 189569 -58802 222325 182204 333142 238455 183147 -100696 218071 471598 243274
15041B43274K15756k05964A19044k9560L92143c5582j09033C6490f2860C84386
$$ 243274 459030 253066 119044 89484 481627 -35582 -144615 36490 -62860 384386
15030A30056a38255D78643j41574K6616D6424K3124K09023j38393g6883B48883
$$ 130056 -138255 478643 337069 363685 46424 69548 278571 140178 -76883 248883
15019C79251A38515d1846A81218N9024g0625g545j87905B26522j02565E3376K65691
$$ 379251 138515 -41846 181218 240242 -70625 -7545 -195450 226522 123957 53376 319067
15008C19067j37707E4516K2990J01942M8916p0781J33838j03852p0534K37071
$$ 319067 181360 54516 77506 179448 228364 157583 291421 187569 117035 354106
14998C54106c6834Q907E83750k17128o5958Q6045A63454j0956n2051J22786J44393
$$ 354106 -36834 -27927 583750 366622 300664 386709 163454 152498 100447 223233 367626
14987C67626n2558b80408B23374n4711R4475c2505J2192A39675K6017M18591k66433
$$ 367626 315068 -280408 223374 168663 263138 -32505 -20313 139675 165692 584283 317850
14976C17850G6495j7590k060J82040j15830a4246D61689k09374J05873j59995
$$ 317850 76495 58905 56845 238885 123055 -14246 461689 252315 358188 198193
14966A98193M0139g660D35235q752J9224K5139B09375m0287l6177K02477R5345
$$ 198193 238332 -7660 435235 426483 445707 470846 209375 169088 132911 335388 430733
14955D30733B13250p3354L14740f0381A99494O9496a11747I2409K43571A55117
$$ 430733 213250 139896 454636 -60381 199494 268990 -111747 92409 335980 155117
14944g0307C51488H4891L7292J68839o4608E6182K7136J13719p0653J34518L5474
$$ -70307 351488 84891 122183 291022 226414 56182 83318 197037 126384 260902 296376
14933B96376b1115F67144B54654O55L0302K54690A37000R7561H4585L94179J59058
$$ 296376 -21115 667144 254654 255309 285611 540301 137000 234561 84585 478764 637822
14922F37822f7416C68647c9423C29612J9631j20094E5762K34146J8489n6789M9397
$$ 637822 -67416 368647 -39423 329612 349243 229149 55762 289908 308397 251608 301005
14911C01005K88028j25486A85400K376q4817J37184Q9108A02868K0627M9931L28768
$$ 301005 589033 463547 185400 187776 102959 240143 329251 102868 123495 173426 502194
14900E02194B37057a16837D69993A84049O2968c1444C90375q2987b5344D87809
$$ 502194 237057 -116837 469993 184049 247017 -31444 390375 307388 -25344 487809
14889B96262A09854N55685B72484K01626d4603E86422j89429K55351q2695l9351
$$ 296262 109854 665539 272484 474110 -44603 586422 396993 652344 569649 530298
14879E30298C3685J89278G4443c3581C60934I3558M15079o7385J65838A94967
$$ 530298 33685 222963 74443 -33581 360934 93558 508637 441252 607090 194967
14868E61732B18291m8819L60446r3242o1558K98246C5420K01213N0104L46876
$$ 561732 218291 169472 529918 436676 375118 673364 35420 236633 286737 633613
14858F33613B90308n6981J86334L26530l22058N9380B20553J45460J24042J03926
$$ 633613 290308 233327 419661 746191 424133 483513 220553 366013 490055 593981
14848E93981j75547R1143B28988J45019q2528K1736K45378j6349j52114n3184
$$ 593981 418434 509577 228988 374007 291479 313215 558593 542244 390130 336946
14838C36946K16868k66504L16438k16558D1872L30642j33122J31372j16455K19027
$$ 336946 553814 287310 603748 387190 41872 372514 239392 370764 254309 473336
14828D73336A22799K03265Q0799J00178j55350p2386O171N8953L6649j65694r1250
$$ 473336 122799 326064 406863 507041 351691 279305 285476 344429 381078 215384 124134
14817A24134K27146m5465p4377J06693K80546k79253o8245L84505j44649k03023
$$ 124134 351280 305815 231438 338131 618677 339424 271179 655684 511035 308012
14807C08012A34792N63127C09538E7163O21755I5755O30719o1863k49907J81207
$$ 308012 134792 697919 309538 57163 678918 95755 726474 664611 414704 595911
14797E95911r2833K61523Q8203k06049P4279n730k72629Q2025A04983Q4896K78750
$$ 595911 503078 764601 852804 646755 721034 715304 442675 524700 104983 189879 468629
14786D68629K14270j89184R6333m4372k8954J09765j54114Q7828p7672L0848k13416
$$ 468629 682899 493715 590048 545676 516722 626487 472373 560201 482529 513377 299961
14775B99961K59741L4042K2083B56880L59138j00021K45813q2116j51031K94905
$$ 299961 559702 593744 615827 256880 616018 515997 761810 679694 528663 823568
14765H23568j62232j83866K40934l33851M71231q4141k56868K71712j30299M8513
$$ 823568 661336 477470 718404 384553 855784 771643 514775 786487 656188 704701
14755G04701k66009K51046l0101j34716L35862j54960k06639k2746N10720l91862
$$ 704701 438692 689738 659637 524921 860783 705823 499184 476438 987158 595296
14745E95296J02064R3491k26465q6960L20188p2545j01979N6670L5073j28459
$$ 595296 697360 790851 564386 477426 797614 725069 623090 679760 714833 586374
14735E86374Q0525M1351C26180N11221j21341m4114J21849j17905J09629k78427
$$ 586374 666899 708250 326180 837401 716060 671946 793795 675890 785519 507092
14725E07092J75978k03978N0951K68093o0047M17075m01369K37208D50192K21133
$$ 507092 683070 479092 530043 798136 738089 1155164 753795 991003 450192 671325
14715F71325K39640l26386R1538k65735N71929k07703p9145J43178Q6463K91458
$$ 671325 910965 584579 676117 410382 982311 774608 695463 838641 925104 1216562
14705A216562l70878l40684M67558k57869r5225L51460j54420p937J4150R4897
$$ 1216562 845684 505000 972558 714689 619464 970924 816504 808567 822717 917614
14695I17614K27363n00861j20980J47613M29669j07295k65730m9923K70613J33317
$$ 917614 1144977 644116 523136 670749 1100418 993123 727393 677470 948083 1081400
14685A081400j56855K09481l55452j29862M02336j28518k83466L40916k59397
$$ 1081400 924545 1134026 778574 648712 1051048 922530 639064 979980 720583
14676G20583J89292K70758R046n402N9077l81725m5429k0488M52352k90588p1260
$$ 720583 909875 1180633 1189679 1184277 1243354 861629 816200 795712 1248064 957476 886216
14665H86216M91287m30155J89754l90940J07903L35620L332m30416J79436P5999
$$ 886216 1377503 947348 1137102 746162 854065 1189685 1193017 762601 942037 1018036
14655A018036K597N8695l60503J85872K71007m52394N44063k62610J77866Q5404
$$ 1018036 1020633 1079328 718825 904697 1175704 723310 1267373 1004763 1182629 1268033
14645A268033n0711j3747n7118M04796l5867n92319M72088k57630M4704M6546
$$ 1268033 1217322 1203575 1146457 1551253 1515386 923067 1395155 1137525 1182229 1228775
14635A228775O9488k57820J15257K17628j22546J4387j60095J68219J90913j9262
$$ 1228775 1298263 1040443 1155700 1373328 1250782 1265169 1105074 1273293 1464206 1444944
14625A444944l05481l7663k94178M80378P8564p7416K37019j24299K19864l04837
$$ 1444944 1139463 1101800 807622 1288000 1366564 1289148 1526167 1401868 1621732 1316895
14615A316895K17754l02215K49702j72247J19766q7065p1847J49774K20322l4984
$$ 1316895 1534649 1232434 1482136 1309889 1429655 1342590 1270743 1420517 1640839 1605855
14605A605855j70683J1347M05793l13620j50210L54348K5703j58755K87266J36909
$$ 1605855 1435172 1446519 1852312 1538692 1388482 1742830 1768533 1609778 1897044 2033953
14595B033953l76159J82295r4746J44555k85284q5683J11720L69924l98594R3973
$$ 2033953 1657794 1840089 1745343 1889898 1604614 1518931 1630651 2000575 1601981 1695954
14585A695954M25020j79647j99128K84937J38921k16153L19734m06006m03757
$$ 1695954 2120974 1941327 1742199 2027136 2166057 1949904 2269638 1863632 1459875
14576A459875N84395j27028L68693N9022r3702m242N6954J18445p9176r0522K86989
$$ 1459875 2044270 1917242 2285935 2344957 2251255 2247013 2303967 2422412 2343236 2252714 2539703
14565B539703m41549J36711Q9434L40320k05926L21782p9326K08692J64786L18223
$$ 2539703 2098154 2234865 2324299 2664619 2458693 2780475 2701149 2909841 3074627 3392850
14555C392850m8175N6571Q27985J7594O88665J056697K100380L174170O770289
$$ 3392850 3344675 3401246 4229231 4246825 4935490 5992187 8092567 11266737 18037026
14546A8037026J7985845O067854A9225153H759594m299565j067218r19164j9822
$$ 18037026 36022871 42090725 19225153 8759594 4460029 3392811 2473647 2453825
14538B453825m05322M0071l04680M14117K8106m3201K118L21387k84537k27275
$$ 2453825 2048503 2088574 1783894 2198011 2226117 2182916 2185034 2506421 2221884 1994609
14528A994609J9364K69879j5110J8172J2249l3147O6162o9376K71475j65294L91924
$$ 1994609 2013973 2283852 2268742 2286914 2299163 2266016 2332178 2262802 2534277 2368983 2760907
14517B760907r9413o0060J44828l31830M44275m9370J23903l94892R2486N1778
$$ 2760907 2661494 2601434 2746262 2414432 2858707 2809337 2933240 2538348 2630834 2682612
14507B682612j815K52893J79658p9385o3398K03783o2539m36524L29748J65091
$$ 2682612 2680797 2933690 3113348 3033963 2970565 3174348 3111809 2675285 3005033 3170124
14497C170124K67299l67539j6089P6212L50767m474P832J5564M0632r8794Q7883
$$ 3170124 3437423 3069884 3053795 3130007 3480774 3476300 3484132 3499696 3540328 3441534 3529417
14486C529417k66762L02056l7025J92922K1619K10370r0185j24776J58041L169
$$ 3529417 3262655 3564711 3527686 3720608 3742227 3952597 3862412 3737636 3895677 3898846
14476C898846j38274R6161K66752j3652K67450j38589k57140K43705J59354M8840
$$ 3898846 3760572 3856733 4123485 4109833 4377283 4238694 3981554 4225259 4384613 4433453
14466D433453O0902k45876P974K97244q8523N03653l77829L75744J78358k66213
$$ 4433453 4494355 4248479 4256453 4553697 4465174 4968827 4590998 4966742 5145100 4878887
14456D878887J5156J23748j3222M0025J48570M10042k09483j5684o1353N0280
$$ 4878887 4894043 5017791 5004569 5044594 5193164 5603206 5393723 5378039 5316686 5366966
14446E366966J85986K6931J10673L17311p7216L3497J49826J98928Q5472K06470
$$ 5366966 5552952 5579883 5690556 6007867 5930651 5964148 6113974 6312902 6398374 6604844
14436F604844k88687o2017O95859m66732l1387J56704L47612M4464q1632Q6346
$$ 6604844 6316157 6254140 6949999 6483267 6451880 6608584 6956196 7000660 6919028 7005374
14426G005374K81718r8083K17873L94133j51132M85133r5655n7367L72212j57940
$$ 7005374 7287092 7189009 7406882 7801015 7649883 8135016 8039361 7981994 8354206 8196266
14416H196266J65971J27351K53456l90745Q54395j40138M4966M0453L33056J73946
$$ 8196266 8362237 8489588 8743044 8352299 9206694 9066556 9111522 9151975 9485031 9658977
14406I658977J60306o8715K41577J50790J58775L183L43597k1252N16535r911
$$ 9658977 9819283 9750568 9992145 10142935 10301710 10304893 10648490 10627238 11143773 11133862
14396A1133862K70975J13361K45867m1142N14674L43016j04155M38664M45031
$$ 11133862 11404837 11518198 11764065 11722923 12237597 12580613 12476458 12915122 13360153
14387A3360153l77618M92290n8940L41476K24480L84498N84597j37366L46437
$$ 13360153 12982535 13474825 13415885 13757361 13981841 14366339 14950936 14813570 15160007
14378A5160007M75851l1608N58029N80021k65048N06470O04361L80487j16195
$$ 15160007 15635858 15604250 16162279 16742300 16477252 16983722 17588083 17968570 17852375
14369A7852375R03187J61361L70347M22933L04987L60166P14655j0383O00076
$$ 17852375 18755562 18916923 19287270 19710203 20015190 20375356 21090011 21079628 21679704
14360B1679704Q17878M1928J147080N9094O91424Q61825K71304M49857N96394
$$ 21679704 22497582 22539510 23686590 23745684 24437108 25298933 25570237 26020094 26616488
14351B6616488J090582K78700O70169N51818Q09328R33519O29534R05330P33616
$$ 26616488 27707070 27985770 28655939 29207757 30017085 30950604 31580138 32485468 33219084
14342C3219084J124247P49766R22588Q75109Q09453J529876R04277J246694J138584
$$ 33219084 34343331 35093097 36015685 36890794 37700247 39230123 40134400 41381094 42519678
14333D2519678R35890J555065J259179J466784J590371J007902K064795J559720
$$ 42519678 43455568 45010633 46269812 47736596 49326967 50334869 52399664 53959384
14325E3959384J678678J919344J963558J769251K305404K083854K368470K543943
$$ 53959384 55638062 57557406 59520964 61290215 63595619 65679473 68047943 70591886
14317G0591886K552519K584248K962156K751238L397593L298166L832624L456595
$$ 70591886 73144405 75728653 78690809 81442047 84839640 88137806 91970430 95427025
14309I5427025M342204M043455M642012M572940M982909N158657N705041N577963
$$ 95427025 99769229 103812684 108454696 113027636 118010545 123169202 128874243 134452206
14301A34452206O219548O951649O909158P723815P813299Q147618Q558389R209926
$$ 134452206 140671754 147623403 154532561 162256376 170069675 178217293 186775682 195985608
14293A95985608R590436J0005823J1060514J1236463J1920414J2569672J2698394
$$ 195985608 205576044 215581867 226642381 237878844 249799258 262368930 275067324
14286B75067324J3600534J3547818J4325493J4387423J4282565J4542621J4444311
$$ 275067324 288667858 302215676 316541169 330928592 345211157 359753778 374198089
14279C74198089J4015905J3233562J2141147J0473589R187280P091138K707399
$$ 374198089 388213994 401447556 413588703 424062292 433249572 440340710 443048109
14272D43048109J761293P23505j06881k703734o907920o852674p869430j1051604
$$ 443048109 444809402 445532907 445426026 442722292 435814372 428961698 421092268 410040664
14264D10040664j3394853j4381111j5377697j5798760j5871944j5962292j5608160
$$ 410040664 396645811 382264700 366887003 351088243 335216299 319254007 303645847
14257C03645847j5556394j4653731j3283520j3303888j2760260j2055574j1632182
$$ 303645847 288089453 273435722 260152202 246848314 234088054 222032480 210400298
14250B10400298j0649248j0260637r725834r016361q402801q005824o969829p181947
$$ 210400298 199751050 189490413 179764579 170748218 162345417 154339593 147369764 140187817
14242A40187817o664182o271715n776878n498374n001281m849240m580427m032743
$$ 140187817 133523635 127251920 121475042 115976668 110975387 106126147 101545720 97512977
14234I7512977m331225m036127l556735k607764l460105l218561l018662k491106
$$ 97512977 93181752 89145625 85588890 82981126 79521021 76302460 73283798 70792692
14226G0792692l156384k209516k377594k334099k239107k003308j853217j838277
$$ 70792692 67636308 65426792 63049198 60715099 58475992 56472684 54619467 52781190
14218E2781190j863369j495584j809845j268196j436439j200266j415299j455414
$$ 52781190 50917821 49422237 47612392 46344196 44907757 43707491 42292192 40836778
14210D0836778j163694j246672q70281m38994j278995j077051j236099j057364
$$ 40836778 39673084 38426412 37556131 37117137 35838142 34761091 33524992 32467628
14202C2467628n19626p00161q91998j005719n32966q71684q05167q30872j27008
$$ 32467628 31948002 31247841 30355843 29350124 28817158 27945474 27140307 26309435 26182427
14193B6182427o57310m96249q64086p54239m59509k54015q01218m82467n56094
$$ 26182427 25525117 25028868 24164782 23410543 22951034 22697019 21895801 21413334 20857240
14184B0857240j91184m14816n49791l74335n77957l83347l19784l26096l08973
$$ 20857240 20666056 20251240 19701449 19327114 18749157 18365810 18046026 17719930 17410957
14175A7410957l49572l40123m78529m90943j04135j24180k65885n04053j92892
$$ 17410957 17061385 16721262 16242733 15751790 15647655 15523475 15257590 14753537 14560645
14166A4560645k89795k89143k43728j98649m39198k52347R9765m59653k48965
$$ 14560645 14270850 13981707 13737979 13539330 13100132 12847785 12947550 12487897 12238932
14157A2238932k00595r7566k11101P9544n84724R9847l24270m53524j99598l3128
$$ 12238932 12038337 11940771 11729670 11809214 11224490 11324337 11000067 10546543 10346945 10313817
14147A0313817m0828K04030m65313j49556M5727k68457m1549j51719k60176k77292
$$ 10313817 10272989 10477019 10011706 9862150 9907877 9639420 9597871 9446152 9185976 8908684
14137H908684O7819m06355Q0239j95213P5767l18250Q6330j15856j46310k65699
$$ 8908684 8976503 8570148 8650387 8455174 8530941 8212691 8299021 8183165 8036855 7771156
14127G771156m67219K79615r0158J06437k86633k15366J78354L229k52524p8624
$$ 7771156 7303937 7583552 7493394 7599831 7313198 7097832 7276186 7279415 7026891 6948267
14117F948267l99370M7569p1821J52150j1683l99493j23957K35323M7575l29111
$$ 6948267 6548897 6596466 6524645 6676795 6665112 6265619 6141662 6376985 6424560 6095449
14107F095449J35046j72840j72246m3610j35133j25586J45822O6608m68167M29357
$$ 6095449 6230495 6057655 5885409 5841799 5706666 5581080 5726902 5793510 5325343 5754700
14097E754700m58290j727j82505j25755O1924J91722k71542K08229k37065m7265
$$ 5754700 5296410 5294683 5112178 4986423 5048347 5240069 4968527 5176756 4939691 4892426
14087D892426j8232M3527m44673J44197K1699J28584j19520j18327j22391j55553
$$ 4892426 4874194 4917721 4473048 4617245 4638944 4767528 4648008 4529681 4407290 4251737
14077D251737J48515j07960J1485k90518Q978L322j88144K46030l51072j2769
$$ 4251737 4400252 4292292 4303777 4013259 4022237 4025559 3837415 4083445 3732373 3719604
14067C719604Q0206J36227n2623p3733J95509k42692j81386l9049L23726J3508
$$ 3719604 3799810 3936037 3883414 3809681 4005190 3762498 3581112 3542063 3865789 3879297
14057C879297m49797M25629l29442j29943j01332m5565J89782l1612j9620j20776
$$ 3879297 3429500 3855129 3525687 3395744 3294412 3248847 3438629 3407017 3387397 3266621
14047C266621J33927l84847L70624j24337k09864K32465m75517L24592m38751
$$ 3266621 3400548 3015701 3386325 3261988 3052124 3284589 2809072 3133664 2694913
14038B694913K38633m6783K8541J50489k32662J01966k17780p3916j36438J37444
$$ 2694913 2933546 2886763 2915304 3065793 2833131 2935097 2717317 2643401 2506963 2644407
14028B644407j13281p4032K10540p3927j76268L79844k37916j30661m9934K45190
$$ 2644407 2531126 2457094 2667634 2593707 2417439 2797283 2559367 2428706 2378772 2623962
14018B623962j65436j71215J17834j16226j8755J7270m3Q2952m2266j7615M8769
$$ 2623962 2458526 2287311 2405145 2288919 2270164 2287434 2287391 2370343 2328077 2310462 2359231
14007B359231j17204Q7758j79639K78155k86061R5712J24516k16080J79912j66993
$$ 2359231 2242027 2329785 2150146 2428301 2142240 2237952 2362468 2146388 2326300 2159307
13997B159307j34528m74907P52408O2882k27176L27452J41389R04536O90620K475504
$$ 2159307 2024779 1549872 2302280 2365162 2137986 2465438 2606827 3511363 4201983 6677487
13987F677487M881548J6128165J5037069k0098517j0186939m574282k328722j332232
$$ 6677487 11559035 27687200 42724269 22625752 12438813 7864531 5535809 4203577
13979D203577m97832n77537j67834r6450r8961O2128m16912m0662k63056K07249
$$ 4203577 3705745 3128208 2960374 2863924 2764963 2827091 2410179 2369517 2106461 2313710
13969B313710J23316k10017j00199J76384j67946J77955m31557J86815M6207l65303
$$ 2313710 2437026 2227009 2126810 2303194 2135248 2313203 1881646 2068461 2114668 1749365
13959A749365L89619j38432K5440l8825j51699j05831K59850k20052n570J64813
$$ 1749365 2138984 2000552 2025992 1987167 1835468 1729637 1989487 1769435 1763865 1928678
13949A928678k1258J46435l48487L57227j48311k56473J25559l47K01096m87044
$$ 1928678 1907420 2053855 1705368 2062595 1914284 1657811 1783370 1783023 1984119 1497075
13939A497075J90142M2806R3381o0469j62707J76711k95240k9122J31578l15976
$$ 1497075 1687217 1730023 1823404 1762935 1600228 1776939 1481699 1452577 1584155 1268179
13929A268179J16029Q5133Q5344m4286k56243J79646j37062J50379P9972k6353
$$ 1268179 1384208 1469341 1554685 1510399 1254156 1433802 1296740 1447119 1527091 1500738
13919A500738l29343M44737m29727K17747P9787O2610l06952J33135p9006J24215
$$ 1500738 1171395 1616132 1186405 1404152 1483939 1546549 1239597 1372732 1293726 1417941
13909A417941j28429Q4010m4704K22287k26837j56789J39036P3568n0731j65518
$$ 1417941 1289512 1373522 1328818 1551105 1324268 1167479 1306515 1380083 1329352 1163834
13899A163834M9656J60397J58703l46485m0042L04258l77705o6500K76423l86343
$$ 1163834 1213490 1373887 1532590 1186105 1146063 1450321 1072616 1006116 1282539 896196
13889H96196L02947p6106R8059m71949K18924K79043j88221M97625n52801j03188
$$ 896196 1199143 1123037 1221096 749147 968071 1247114 1058893 1556518 1003717 900529
13879I00529j73648L99126k01989q3805K31574J14469k60109k58699M70914J00153
$$ 900529 726881 1126007 924018 840213 1071787 1186256 926147 667448 1138362 1238515
13869A238515l54775p4233J81862K27541J5064L2645k30190j9516k03422J74640
$$ 1238515 883740 809507 991369 1218910 1233974 1266619 1036429 1016913 813491 988131
13859I88131j56294N8881n0497q4791J78842j68721L50033j39512l51877K03785
$$ 988131 831837 890718 840221 755430 934272 765551 1115584 976072 624195 827980
13849H27980L50619j27072k40938K33641j80395K33897n7482m96065K14864J37630
$$ 827980 1178599 1051527 810589 1044230 863835 1097732 1040250 544185 759049 896679
13839H96679j08912K43752k58300K60733j01845l62527N82559l11654l032J12813
$$ 896679 787767 1031519 773219 1033952 932107 569580 1152139 840485 837453 950266
13829I50266J0275j80791j1613L1113J20700O4985J5278r1498j44137J88827O564
$$ 950266 960541 779750 768137 799250 919950 984935 1000213 908715 764578 953405 959969
13818I59969j30935K07723K83960E53908k9434M48485k64334O0863K62601l97293
$$ 959969 829034 1036757 1320717 553908 524474 972959 708625 769488 1032089 634796
13808F34796K48934L54433n94586L97292l94185L17044j56027j43275l667J09141
$$ 634796 883730 1238163 643577 1040869 646684 963728 807701 664426 660759 769900
13798G69900q4214K75050n2533J559j85625R4977R1335l50063M34450l80825L2404
$$ 769900 685686 960736 908203 909762 724137 819114 910449 560386 994836 614011 646415
13787F46415N2256R2087k33239K80530j72663K38614r2466j33317L02328j65891
$$ 646415 698671 790758 557519 838049 665386 904000 811534 678217 980545 814654
13777H14654j85892J36192j33233m276o2182j18735L40630l18104o0889K93520
$$ 814654 628762 764954 631721 627445 565263 446528 787158 469054 408165 701685
13767G01685K22319C40688J98644J08558k47077P5129O0793J91059j28481M6635
$$ 701685 924004 340688 539332 647890 400813 475942 536735 727794 599313 645948
13757F45948L87515l28864l21454J49705o5598J39097L0528k13038J39014J74089
$$ 645948 1033463 704599 383145 532850 467252 606349 636877 423839 562853 736942
13747G36942C56814L23048p3637J83322j6921j17919k29522J95680K33415C99537
$$ 736942 356814 679862 606225 789547 772626 654707 425185 620865 854280 399537
13736F48842J14873j75226M3193O9403C8619M13111k3930L57339k78731j8719
$$ 648842 763715 588489 631682 701085 38619 451730 427800 785139 506408 487689
13726D87689J83020j58126O6593o1262J30828j53005B32148J88059p8570L21763
$$ 487689 670709 512583 579176 517914 648742 495737 232148 420207 341637 663400
13716F63400p4171P0938j57233J48133k82805K37953A97776J91243J19975k08645
$$ 663400 589229 660167 502934 651067 368262 606215 197776 389019 508994 300349
13706C00349K71294L4893B03187L54311M4557N8602J23636k41866B47554O8376
$$ 300349 571643 606536 203187 557498 602055 660657 784293 542427 247554 315930
13696C15930L62637j14221o1802l8615K5001r4170j91225L84792N04161l93827
$$ 315930 678567 564346 502544 463929 488930 394760 203535 588327 1092488 698661
13686F98661k76306O05082m47345j5432p5856O8971J16097j97484I4941M86463
$$ 698661 422355 1027437 580092 564660 488804 557775 673872 476388 94941 581404
13676E81404k0530l9980j21470J16137j74589K57701B95279j02084J48330Q83
$$ 581404 560874 520894 399424 515561 340972 598673 295279 193195 341525 342408
13666C42408j32199N1586K10247r0328O2166Q2943j97820j12937L72704B89143
$$ 342408 210209 261795 472042 381714 443880 526823 329003 216066 588770 289143
13655E73113J17821k97809K6677K18019k85695P8374J73756J0824J1486A94125
$$ 573113 690934 393125 419802 637821 352126 430500 604256 615080 626566 194125
13644B67619K55626J13995A79704L12594j12598J94272B50288R8863r1119J38080
$$ 267619 523245 637240 179704 492298 379700 573972 250288 349151 258032 396112
13634C96112Q6449j02167j23979N9389K65441j73644J9610o4785N3121J49804
$$ 396112 482561 380394 256415 315804 581245 407601 427211 362426 415547 565351
13624E65351A76754J15246m4060A15401K31420G4861N99809k52907Q8899B39649
$$ 565351 176754 292000 247940 115401 346821 74861 674670 421763 510662 239649
13613F32573o3235m9213k14151m6120J49185j8355q3566Q2720f6379B50292K57634
$$ 632573 569338 520125 305974 259854 409039 390684 307118 389838 -66379 250292 507926
13602E07926k2283B28132L37391l0154B07325L78446p5836J86894o2496B23158
$$ 507926 485643 228132 565523 535369 207325 585771 509935 696829 634333 223158
13591A69371L07512j18682r4906K70217J09057B14529J91028o8194j46136L50158
$$ 169371 476883 358201 263295 533512 642569 214529 405557 337363 191227 541385
13581E41385B57886J50777J3344F5932L86978A50543O17759l00333j64867n8206
$$ 541385 257886 408663 422007 65932 452910 150543 768302 467969 303102 244896
13571B44896j19378M7596l4843K55021C4839J97554J05786A30047g0746B42616
$$ 244896 125518 173114 138271 393292 34839 232393 338179 130047 -70746 242616
13560C30630j28809Q5215J31846j75146q0931l7138Q1976q0752L88962k41956
$$ 330630 201821 287036 418882 243736 162805 125667 207643 126891 515853 273897
13550B73897a22234H4049K10076j9917K14300B06830Q8631j25670K0728L79640
$$ 273897 -122234 84049 294125 274208 488508 206830 295461 169791 190519 570159
13540E70159A88407Q6585N32005A73457N7987P3555J95859A653L60729L4410p4480
$$ 570159 188407 274992 806997 173457 231444 304999 500858 1653 362382 396792 322312
13529C22312C3340L25340m9550p6978n8182N4571K16763B16248J13735m014n8368
$$ 322312 33340 358680 309130 232152 173970 228541 445304 216248 329983 325969 267601
13518B67601O9542B3468J48720M5225J71156j44093A05358L21704k08562J61389
$$ 267601 337143 23468 172188 217413 388569 244476 105358 427062 218500 379889
13508C79889j37197K39796j13605J35818A74881K45986h413A38403E9257L54050
$$ 379889 242692 482488 368883 504701 174881 420867 -8413 138403 59257 413307
13498D13307j49500c394A87454R5882A02108J29629o2372o162K65275B04662o1951
$$ 413307 263807 -3394 187454 283336 102108 231737 169365 163203 428478 204662 142711
13487A42711L35294j318J02257k87396b22812C60457F5389i3835A92000l1244
$$ 142711 478005 476687 578944 291548 -222812 360457 65389 -93835 192000 160756
13477A60756k4332K66908k103K32145i3431B96881A09283K12422j53973K12146
$$ 160756 136424 403332 401229 633374 -93431 296881 109283 321705 167732 379878
13467C79878p9615m1845J55941h5053D04115O4925o004A61899K55911Q0565A97746
$$ 379878 300263 258418 414359 -85053 404115 469040 463036 161899 417810 498375 197746
13455A19761K21287j19211k5158D5201J18908J91317A41782J84287G8900K42331
$$ 119761 341048 221837 196679 45201 164109 355426 141782 326069 78900 321231
13445C21231L0540j51223J21918p1297c5768B28477N4470a07234C61637A18212
$$ 321231 351771 200548 322466 251169 -35768 228477 282947 -107234 361637 118212
13434B04019k3405F5274K39655L8607q0694N8948M2504A66178C1488K77130j6807
$$ 204019 180614 65274 304929 343536 262842 321790 364294 166178 31488 308618 291811
13423B91811M30908B6481J76783B7641L15252j1861A32627j936M0418K0615l0954
$$ 291811 722719 26481 203264 27641 342893 331032 132627 130691 171109 191724 160770
13412A60770p2714J77329j1888J6396A20175M9541J84252D1567O0928i035D23178
$$ 160770 88056 265385 253497 269893 120175 169716 353968 41567 102495 -9035 423178
13400A25704O8838K17400i9128A15801K86962L9285e5288A87080J04187J29864
$$ 125704 194542 411942 -99128 115801 402763 442048 -55288 187080 291267 421131
13390D21131e4793M352D49418A32226N0648b73322A52933K40456b20031C17140
$$ 421131 -54793 -50441 449418 132226 182874 -273322 152933 393389 -220031 317140
13379B26993o348j03068E507J88794O3040o7372E9984r705J54296K05837J11975
$$ 226993 220645 117577 5507 194301 257341 189969 59984 50279 204575 410412 522387
13368E22387k59953A27831R6625q8191K15793I9072J00249J76140b62405F68733
$$ 522387 262434 127831 224456 136265 352058 99072 199321 375461 -262405 668733
13357E52751j74963J4436A21564P1603L63616B52625J8066K05431A36410J15345
$$ 552751 377788 392224 121564 193167 556783 252625 270691 476122 136410 251755
13347B51755B7372F81J53726J7254G4000K89154A32544K84632e401A78160Q9566
$$ 251755 27372 681 154407 171661 74000 363154 132544 417176 -5401 178160 267726
13336B67726J62604k7682j28589o4784J67610A9616g0935A99328M6877J7444B1941
$$ 267726 430330 402648 274059 209275 376885 19616 -70935 199328 246205 263649 21941
13324B28308N5036j9747b857A66049g8339B90811O2199b34A69010J47988b36690
$$ 228308 283344 263597 -2857 166049 -78339 290811 353010 -234 169010 316998 -236690
13312B99065J31185F7075J04933q3803J40706a60657B57146H5752a1551B29428
$$ 299065 430250 67075 172008 88205 228911 -160657 257146 85752 -11551 229428
13301A68350C088c2435B46570G1651O1723a27825B20582j05883A582L59072c3197
$$ 168350 3088 -32435 246570 71651 133374 -127825 220582 114699 1582 360654 -33197
13289a85219p3200A76852d7315B46042d1955a4325G3107L32020I4682a27422A16004
$$ -185219 -258419 176852 -47315 246042 -41955 -14325 73107 405127 94682 -127422 116004
13277C25420a26819d003C45984a39098B61748D0633K47462J17952j48867H8195
$$ 325420 -126819 -4003 345984 -139098 261748 40633 288095 406047 257180 88195
13266B32731a08219B12205B1180c93506A22549n3087L08332B9052L34984a14920
$$ 232731 -108219 212205 21180 -393506 122549 69462 377794 29052 364036 -114920
13255i406D8101R9988J31957H8182C9183K2882Q7697D2866c9376C78431A50404
$$ -9406 48101 148089 280046 88182 39183 62065 149762 42866 -39376 378431 150404
13243a83938r5001a11724B88664q7000B4632d9715A31319m1731P1251e4873A37870
$$ -183938 -278939 -111724 288664 201664 24632 -49715 131319 89588 160839 -54873 137870
13231e8358j0433C72K83621j31161c1319A2208f0283D73124D5349J66169I3437
$$ -58358 -68791 372 283993 152832 -31319 12208 -60283 473124 45349 211518 93437
13219B62972e971D4287J12591M08198H8540a4656E9315a95921B0948I252N6390
$$ 262972 -5971 44287 156878 565076 88540 -14656 59315 -195921 20948 9252 65642
13208F5642F642L54080a46128B71049B6244I602K43000J23326A32945m4115L02465
$$ 65642 6642 360722 -146128 271049 26244 9602 252602 375928 132945 88830 391295
13197C91295G4810A6775P2033h0640j43701M4835A41726d0921A88610e9679B72030
$$ 391295 74810 16775 88808 -80640 -224341 -179506 141726 -40921 188610 -59679 272030
13185A61376c07910c4049k66331B96393a47907M8412r6571B50167J45406A82627
$$ 161376 -307910 -34049 -300380 296393 -147907 -99495 -196066 250167 395573 182627
13174a48070A9229K41945A22217K29087e0161A24106J61620K36033k18054A5980
$$ -148070 19229 261174 122217 351304 -50161 124106 285726 521759 303705 15980
13163B6799J01285a04127M5183C85046f3177A82405H5282J36863k1548Q5242G1587
$$ 26799 128084 -104127 -58944 385046 -63177 182405 85282 222145 200597 285839 71587
13151I503J66942F5635J46184P8684r4087a09148o1296B60047e9586B44705a53613
$$ 9503 176445 65635 211819 290503 196416 -109148 -170444 260047 -59586 244705 -153613
13139G0132i8979A00538g8860l8122A66746o1941a65431C05620i1043A720i3522
$$ 70132 -98979 100538 -78860 -116982 166746 104805 -165431 305620 -91043 1720 -93522
13127a55649k7961B56371c110G2181K04324d0787k56541F9516M8387a58592C37126
$$ -155649 -183610 256371 -3110 72181 276505 -40787 -297328 69516 117903 -158592 337126
13115B06249G5231K72243F8012k9069f0962D20714a09188c4074C6277b12853b1187
$$ 206249 75231 347474 68012 38943 -60962 420714 -109188 -34074 36277 -212853 -21187
13103E2997J53955N6111B6015J41201b10724B36890I3346e04095A56664a10764
$$ 52997 206952 263063 26015 167216 -210724 236890 93346 -504095 156664 -110764
13092a19538A63250B98a6538A67542k4927e9674K9A17435L3486a25858b1095m2441
$$ -119538 163250 298 -16538 167542 142615 -59674 -59645 117435 150921 -125858 -21095 -63536
13080f3536H626K27682b17239B22703i9996C94242p9449a0859A70759d105E0488
$$ -63536 8626 236308 -217239 222703 -99996 394242 314793 -10859 170759 -4105 50488
13068I7973l2208J81808A17388K59015i5215c6508A81809q8843J3608j1928L6851
$$ 97973 65765 247573 117388 376403 -95215 -36508 181809 92966 106574 94646 131497
13057A31497E5325b52086B85308J09351g2239D57580H7581a26043B03063I2717
$$ 131497 55325 -252086 285308 394659 -72239 457580 87581 -126043 203063 92717
13046B29727q8569k3591O5117K3051L13868I6773b55108B42044d4247A01351K9559
$$ 229727 141158 117567 182684 205735 519603 96773 -255108 242044 -44247 101351 130910
13035A30910f8411B47901F9618Q9385J79010H6184L3471k546B0121E50i8130p5471
$$ 130910 -68411 247901 69618 159003 338013 86184 119655 117109 20121 550 -98130 -173601
13023a73601D45222A56046J41174j05039B8785J92890C3278K71406A46421M3449
$$ -173601 445222 156046 297220 192181 28785 221675 33278 304684 146421 189870
13013A89870Q163N7797G6505B470L37188a31255F1849a2041l3690A27177l5964
$$ 189870 198033 255830 76505 2470 339658 -131255 61849 -12041 -45731 127177 91213
13002I1213l4395M08751B0382a04485E39J07050l7922J9991d5384A14045a38194
$$ 91213 56818 465569 20382 -104485 539 107589 69667 89658 -45384 114045 -138194
12990c02851B15660a84763B13115J68728F6507B3817N426K03808A13745J16341
$$ -302851 215660 -184763 213115 381843 66507 23817 29243 233051 113745 230086
12980B30086J49900b1489j5661a3954A14182K10578b586k38811B45750i2662k28701
$$ 230086 379986 -21489 -37150 -13954 114182 324760 -2586 -241397 245750 -92662 -321363
12969c21363a14527D19657a84126K2220O2687A2201K12824I8669K26342m411A28814
$$ -321363 -114527 419657 -184126 -161906 -99219 12201 225025 98669 325011 320600 128814
12957A22129b25590A28800K99273D3914J48801J11487b88301J16313C21822A13525
$$ 122129 -225590 128800 428073 43914 192715 304202 -288301 -171988 321822 113525
12946c11782A22402N3338e3745B09935l2194a39333n2048A25366A4525c72929
$$ -311782 122402 175740 -53745 209935 177741 -139333 -191381 125366 14525 -372929
12935b77966J30071A54279M9797a99447B3758K01154a14055A74774J84255D2690
$$ -277966 -147895 154279 204076 -199447 23758 224912 -114055 174774 359029 42690
12924I8156a54431B04384a08495B30655a80620C48757A26763R5398H6970L0977
$$ 98156 -154431 204384 -108495 230655 -180620 348757 126763 222161 86970 117947
12914A17947J81751C2476b02392E0610J05816Q419a3100B26221d60687B29131
$$ 117947 299698 32476 -202392 50610 156426 164845 -13100 226221 -460687 229131
12903b44284J10503d0567j05234C4329f2448B41396l9828B2812b23254J581L6013
$$ -244284 -133781 -40567 -145801 34329 -62448 241396 201568 22812 -223254 -221673 -185660
12892a85660e9449m2695M826B19848a60912A48574f2841C9154J07092J52580a27161
$$ -185660 -59449 -102144 -97318 219848 -160912 148574 -62841 39154 146246 298826 -127161
12880a87711g7489H0995Q7174a4195A25541B9824N12033b2963k93600B450M6629
$$ -187711 -77489 80995 168169 -14195 125541 29824 541857 -22963 -316563 2450 49079
12869D9079h4238m7243M5520j09506A43033K4224J2733m6143n4008Q8399q3741
$$ 49079 -84238 -131481 -85961 -195467 143033 167257 179990 133847 79839 168238 84497
12858H4497g9472B71056j13430O674b07554A46005C7497Q1734l067C6721q622
$$ 84497 -79472 271056 157626 164300 -207554 146005 37497 119231 116164 36721 28099
12847B8099a96579Q0140A53233O2713m6482J73674a54322B9723J31803o9491G164
$$ 28099 -196579 -116439 153233 215946 169464 343138 -154322 29723 161526 92035 7164
12835G9438g897A45223d5053m2311A32173b35275A41595M3202o6713b6008B53255
$$ 79438 -7897 145223 -45053 -87364 132173 -235275 141595 184797 118084 -26008 253255
12823A73569D5365A5623a37413K6395B7877a8823G4555c9781A40689i1500c1723
$$ 173569 45365 15623 -137413 -111018 27877 -18823 74555 -39781 140689 -91500 -31723
12811C4267L18670D0347d6149B10266a74782f4645j79957h6121A01516A0075a20552
$$ 34267 352937 40347 -46149 210266 -174782 -64645 -244602 -86121 101516 10075 -120552
12799D3146g6351E6921A5545K52326E0734c2506j58389P9121m22212b801j74009
$$ 43146 -76351 56921 15545 267871 50734 -32506 -190895 -111774 -533986 -2801 -176810
12788a76810D9235O3438K3156j7614P059R7971j8745C336O7462p83J41624b04098
$$ -176810 49235 112673 135829 118215 125274 223245 204500 3336 70798 70015 211639 -204098
12775b09418b1170E7462b1421I7677K27498a76615l8864g0403m7223N1490j7874
$$ -209418 -21170 57462 -21421 97677 325175 -176615 -215479 -70403 -117626 -66136 -84010
12764h4010H0989d5474C05207R8504c3052B7162d395B23074b55684q2112K1128
$$ -84010 80989 -45474 305207 403711 -33052 27162 -4395 223074 -255684 -337796 -316668
12753c16668b8392p3029L1792A64771i7264d6737A80204H0108O0229F0a41328
$$ -316668 -28392 -101421 -69629 164771 -97264 -46737 180204 80108 140337 60 -141328
12741E1845g7346k7939k38734A36498a47435g3041c1098I5772L1145P9028b06822
$$ 51845 -77346 -105285 -344019 136498 -147435 -73041 -31098 95772 126917 205945 -206822
12729B56026K9548m1484C9853b63111A30023K17735a03697B23272q4369F7102
$$ 256026 285574 244090 39853 -263111 130023 347758 -103697 223272 138903 67102
12718i3589I6119c614j83789H6700L61005a38405I6662J58045j04496L7437K73354
$$ -93589 96119 -3614 -187403 86700 447705 -138405 96662 254707 150211 187648 461002
12707D61002j52131j06172M3818J13430J67132j94915a29348D62756a58659i535
$$ 461002 308871 202699 246517 359947 527079 332164 -129348 462756 -158659 -9535
12696a4005A93982e7001j75158A88720l4197d0589m5738G6820L8576C0252K64521
$$ -14005 193982 -57001 -232159 188720 154523 -40589 -86327 76820 115396 30252 294773
12685B94773b5929j08983c3890C55898j04940n3680o0894c879r1314j41970D0737
$$ 294773 -25929 -134912 -33890 355898 250958 197278 136384 -3879 -95193 -237163 40737
12673B66939H3689B3939J11984b46506B86727A890c1788k27234C7487c4325j81679
$$ 266939 83689 23939 135923 -246506 286727 1890 -31788 -259022 37487 -34325 -216004
12662b16004A33907D8412N6182a06986A20268f4693D81693B05575k3667J32236
$$ -216004 133907 48412 104594 -106986 120268 -64693 481693 205575 181908 314144
12652C14144J86213d1571a7038A68144d4067D28451a98580c3576I8940J67367
$$ 314144 500357 -41571 -17038 168144 -44067 428451 -198580 -33576 98940 266307
12642B66307i4536D19450C6731e0913J0966D1319L33355a29909B87110M6654B652
$$ 266307 -94536 419450 36731 -50913 -39947 41319 374674 -129909 287110 333764 2652
12630B1447P9252J57366h6944A63386c10559f2796l1437B36268K7620R078a15294
$$ 21447 100699 258065 -86944 163386 -310559 -62796 -94233 236268 263888 272966 -115294
12618A29453D9123L25768j31768a82057h7659r8254n5925A6105d611A7646J59354
$$ 129453 49123 374891 243123 -182057 -87659 -185913 -241838 16105 -4611 17646 177000
12607A77000e2339p0283M8207A2894b4013H2103B6987L8519Q4340A7644L51315
$$ 177000 -52339 -122622 -74415 12894 -24013 82103 26987 65506 149846 17644 368959
12596C68959j13813J57331A46220J06840a85143A92473f8511p7737C25411A9717
$$ 368959 255146 412477 146220 253060 -185143 192473 -68511 -146248 325411 19717
12585A09183J52355j15889J21300B7325c5259b395C43340o0417j24976l3642b7685
$$ 109183 261538 145649 266949 27325 -35259 -2395 343340 282923 157947 124305 -27685
12573g1122m3278B04584a57675A14615J40820d9680B00264N6538j20873m8293
$$ -71122 -114400 204584 -157675 114615 255435 -49680 200264 256802 135929 87636
12563H7636N8260a46334B49276n2964a06090A25140i8345A54269a25658B36377
$$ 87636 145896 -146334 249276 196312 -106090 125140 -98345 154269 -125658 236377
12552A44689a91906M2237K1111A83472o8946R3136A8536h3617a1386B51354h8795
$$ 144689 -191906 -149669 -128558 183472 114526 207662 18536 -83617 -11386 251354 -88795
12540A98833b11761L9754A43854a24155G7124b4572F2407A9330J92810F8971J24535
$$ 198833 -211761 -172007 143854 -124155 77124 -24572 62407 19330 212140 68971 193506
12529A93506j5378M5217I5727a13961A22446O0836q3951a25840N2057I7535c51264
$$ 193506 178128 223345 95727 -113961 122446 183282 99331 -125840 -73783 97535 -351264
12517C2309b05245A37511a88259F8785b04438e784k24778A124J73383f7750B0671
$$ 32309 -205245 137511 -188259 68785 -204438 -5784 -230562 1124 174507 -67750 20671
12505A76573g550B05409r0901i4683b4489A30355A44O5649O2347j6961p562Q7799
$$ 176573 -7550 205409 114508 -94683 -24489 130355 144 65793 128140 111179 103617 191416
12493A91416G2886a95637H8428C3928a78527A26876g1582p9603A69613n1289N5693
$$ 191416 72886 -195637 88428 33928 -178527 126876 -71582 -151185 169613 118324 174017
12482A74017b10058B60675a58433q8155A60441E1060R8628A9860a4763A09948
$$ 174017 -210058 260675 -158433 -246588 160441 51060 149688 19860 -14763 109948
12471A4877J43662B4803Q1340J89538o8815I6887c3163A27545a69181c5862J4999
$$ 14877 158539 24803 106143 295681 226866 96887 -33163 127545 -169181 -35862 -20863
12460b0863l40898F7070K24551d87859F1737J07161c13300E6282a08908n5333
$$ -20863 -361761 67070 291621 -487859 61737 168898 -313300 56282 -108908 -164241
12450a64241O0859d5920H4854M6411B2521a25514A08805b27428i0154C6393c4152
$$ -164241 -103382 -45920 84854 131265 22521 -125514 108805 -227428 -90154 36393 -34152
12438b41575i5851d867A71020a6675I8127P0742h3970A49277J41308g370k072
$$ -241575 -95851 -4867 171020 -16675 98127 168869 -83970 149277 290585 -7370 -9442
12427i442l13475B66914a6679l2052F2323k5489a41937c015B28856l7338H3667
$$ -9442 -322917 266914 -16679 -48731 62323 36834 -141937 -3015 228856 191518 83667
12415a16227i6j86614C8012b36667a1317D1211K33575A6622L7073L27539j20338
$$ -116227 -96 -186710 38012 -236667 -11317 41211 274786 16622 53695 381234 260896
12404B60896a19360o7390q2234C6438K43677f5521A75466K2522a26595a5976k2719
$$ 260896 -119360 -186750 -268984 36438 280115 -65521 175466 197988 -126595 -15976 -38695
12393c8695j25319r1983A57881b77416q9640A57876i3386C17639A28387b04180
$$ -38695 -164014 -255997 157881 -277416 -367056 157876 -93386 317639 128387 -204180
12382D3292O7436a99511I6103C9670L1043l3261J30698b2154D1602M4298M8723
$$ 43292 110728 -199511 96103 39670 70713 37452 168150 -22154 41602 85900 134623
12371A34623a40082A29400A6351L5448J77099e6991H7559A3340N7737a57015K9486
$$ 134623 -140082 129400 16351 51799 228898 -56991 87559 13340 71077 -157015 -127529
12360a27529A5359c35387C92372b72500m7143a3288n925j67850L4556B40650e5385
$$ -127529 15359 -335387 392372 -272500 -319643 -13288 -19213 -187063 -152507 240650 -55385
12348B10825G9632J22342a04225k66153E3135J9962B6133K53762j08509n9445
$$ 210825 79632 201974 -104225 -370378 53135 73097 26133 279895 171386 111941
12338A11941l6260K76394b2344D9833J56249D8382b08449G8616B4972a23113A34637
$$ 111941 75681 352075 -22344 49833 206082 48382 -208449 78616 24972 -123113 134637
12326b15712B97811p0578J00404H2769L2404J21476j4653b27895D8104b16299
$$ -215712 297811 227233 327637 82769 115173 236649 221996 -227895 48104 -216299
12315g150H208L8348J46459K88541h4402A54687a20820D2219d54154E0264i8119
$$ -7150 8208 46556 193015 481556 -84402 154687 -120820 42219 -454154 50264 -98119
12303d7605B92450d9642I9981b05765j5001A10116a37851j02732B89321F7486
$$ -47605 292450 -49642 99981 -205765 -220766 110116 -137851 -240583 289321 67486
12292a20810G0498B0703J8154J97194c05413b4544B1544J15772b3852A68417A7246
$$ -120810 70498 20703 38857 236051 -305413 -24544 21544 137316 -23852 168417 17246
12280h6630A9149K2789i0078B61623k6102k6992E4820J22024o2867Q02J63622
$$ -86630 19149 41938 -90078 261623 235521 208529 54820 176844 113977 114779 278401
12269B78401M4656n9274l6600F806O7908R4357J10139J4416a72816A53908K89874
$$ 278401 323057 263783 227183 6806 74714 169071 279210 293626 -172816 153908 443782
12258D43782b99662A7577i8981A00831b76750B61941C7679J72696A8504J70112
$$ 443782 -299662 17577 -98981 100831 -276750 261941 37679 210375 18504 188616
12248A88616q7690N2252N0548k324b5347j41113m396A26198a14815b1689C49750
$$ 188616 100926 153178 203726 201402 -25347 -166460 -170856 126198 -114815 -21689 349750
12236a4082A86011J52128K72805a24439L9530l5788C05306n0623p1609F1782L18070
$$ -14082 186011 338139 610944 -124439 -84909 -120697 305306 254683 183074 61782 379852
12225C79852c6683C70482g0346A9221R8638D1696P6467j9054O2276D3234J13321
$$ 379852 -36683 370482 -70346 19221 117859 41696 118163 99109 161385 43234 156555
12214A56555l2310m2901M8952g3476A9172b3225B01509k817b5601n7764C52321
$$ 156555 124245 81344 130296 -73476 19172 -23225 201509 198692 -25601 -83365 352321
12202D969a96030I689K09155L24274B65006b270F2947J27557E1295d0577A69361
$$ 4969 -196030 9689 218844 543118 265006 -2270 62947 190504 51295 -40577 169361
12190B94029b3127A09182B3144N1331B9192J29486m5628i1449o3489e8846C45728
$$ 294029 -23127 109182 23144 74475 29192 158678 113050 -91449 -154938 -58846 345728
12178a9909p3408d1348C11731j04709c01496A13551g2781j07245B54162a86714
$$ -19909 -93317 -41348 311731 207022 -301496 113551 -72781 -180026 254162 -186714
12167g8217D8665K05322P5980b1499k555F4469J5109d5165B58414j28967e17280
$$ -78217 48665 253987 329967 -21499 -24054 64469 79578 -45165 258414 129447 -517280
12155a61110c3521G2324b37034A3246O7819a94059C357N7548b4254q0732j61954
$$ -161110 -33521 72324 -237034 13246 81065 -194059 3357 60905 -24254 -104986 -266940
12144b66940B03432n7568K3382a90884C22887j43742d4475J1548F3197a53637
$$ -266940 203432 145864 169246 -190884 322887 179145 -44475 -32927 63197 -153637
12133a81655c6838A24834b04034A53458c17646b8390j4629A5892J56652R8477
$$ -181655 -36838 124834 -204034 153458 -317646 -28390 -43019 15892 172544 271021
12123B71021a06294n028c7964B80506j5790g2870B27550A6664R5296a49287B03388
$$ 271021 -106294 -111322 -37964 280506 264716 -72870 227550 16664 111960 -149287 203388
12111e2697n7659c8081I3152e5140k4755o0866C04871F1960j0337c171k64365
$$ -52697 -110356 -38081 93152 -55140 -79895 -140761 304871 61960 51623 -3171 -267536
12100b67536c5635j7893B0473K98913F1063b0529q8688A02435K06104o2871j09215
$$ -267536 -35635 -53528 20473 319386 61063 -20529 -109217 102435 308539 245668 136453
12089A36453e6520j27032g9035A48280F9930M4731d1673r7921B88008j03393J29537
$$ 136453 -56520 -183552 -79035 148280 69930 114661 -41673 -139594 288008 184615 314152
12078C14152O96250Q31323H88922C42953a62513M2749B29854j10606o07R0742
$$ 314152 1010402 1841725 888922 342953 -162513 -119764 229854 119248 118641 209383
12068B09383a57923A35222J19603F5578b02078e3128B02503d0705f972A48900
$$ 209383 -157923 135222 254825 65578 -202078 -53128 202503 -40705 -6972 148900
12057a15385r735A87096a86662H0117a17921H1352d21408B9478Q5827a32556c7085
$$ -115385 -125120 187096 -186662 80117 -117921 81352 -421408 29478 115305 -132556 -37085
12045B09405F4226A584N7878a44015H4737j2474C3251L0456a91115B05390N3887
$$ 209405 64226 1584 59462 -144015 84737 72263 33251 63707 -191115 205390 259277
12034B59277b87848I1150b09655D54978d8696j76202A4401e6693A78768b66183
$$ 259277 -287848 91150 -209655 454978 -48696 -224898 14401 -56693 178768 -266183
12023E3830J46533L2298a92153B61951k5278f2761B36350b18683j4664A03106
$$ 53830 200363 232661 -192153 261951 236673 -62761 236350 -218683 -233347 103106
12012B1531J23267a65080A9897b8220j63194O2630b322A98910h4867A82630G4737
$$ 21531 144798 -165080 19897 -28220 -191414 -128784 -2322 198910 -84867 182630 74737
12000A9551b34248a16363L9927j65192a14513E1914c06240A61152k201J97334
$$ 19551 -234248 -116363 -76436 -241628 -114513 51914 -306240 161152 158951 356285
11990C56285J01425a7554j1194A26732b79191R5662e1831l1674a2551o0372A34598
$$ 356285 457710 -17554 -28748 126732 -279191 -183529 -51831 -83505 -12551 -72923 134598
11978a42414k52694g1915C0645b62328c8504B00255n176b6522k46299F5609N6509
$$ -142414 -395108 -71915 30645 -262328 -38504 200255 195079 -26522 -272821 65609 122118
11967A22118a64962m4004N0116a3385j29342r820k5423P2342A66530G7630q681
$$ 122118 -164962 -208966 -158850 -13385 -142727 -152547 -177970 -105628 166530 77630 68949
11956F8949Q9641d00850J98019d9542C38277a20714H096J96557c1308j4787j60618
$$ 68949 158590 -400850 -202831 -49542 338277 -120714 8096 204653 -31308 -46095 -206713
11945b06713J1892A89981c362I200f1649j56770B71584a60523C1367a26598B15655
$$ -206713 -194821 189981 -3362 9200 -61649 -218419 271584 -160523 31367 -126598 215655
11933H4875j4185J38369Q3707g2626a2816k42385B03127a1476k95676B48402a22838
$$ 84875 70690 209059 292766 -72626 -12816 -255201 203127 -11476 -307152 248402 -122838
11921a62907A18457d58045F3171R448A1867K01306a36064B33874p7125b3171A57232
$$ -162907 118457 -458045 63171 72619 11867 213173 -136064 233874 156749 -23171 157232
11909D1395b44948k8737O4885e4594n3556D5563K83669a65111B34547e2634K3278
$$ 41395 -244948 -273685 -208800 -54594 -108150 45563 329232 -165111 234547 -52634 -29356
11898b9356A09079b21704M4113h2289j98188B02427A1376b23421G3296a02660
$$ -29356 109079 -221704 -177591 -82289 -280477 202427 11376 -223421 73296 -102660
11887B61260d7097A32089a29904c3937k2138j12178d5189m3169j98698i8018a3210
$$ 261260 -47097 132089 -129904 -33937 -56075 -168253 -45189 -88358 -287056 -98018 -13210
11875a50131a9036j39239M3669c9925j68129A42739c9120m3308c6436j29284B42926
$$ -150131 -19036 -158275 -114606 -39925 -208054 142739 -39120 -82428 -36436 -165720 242926
11863f9736k54534J60048H2039c37292J02936A80313l243a51027A07504a50993
$$ -69736 -324270 -164222 82039 -337292 -234356 180313 177070 -151027 107504 -150993
11852b15853C7690b04423A33602a77835M789h2212C19416a7427E8113a36150b5027
$$ -215853 37690 -204423 133602 -177835 -173046 -82212 319416 -17427 58113 -136150 -25027
11840D26801c6584E5883c7449j10119N829E3741d55151i3495l7169A1316J92566
$$ 426801 -36584 55883 -37449 -147568 -141739 53741 -455151 -93495 -130664 11316 203882
11829B03882a34648A2518J15530e0004j48509B9951Q3600a84454J2996B67272
$$ 203882 -134648 12518 128048 -50004 -198513 29951 113551 -184454 -171458 267272
11818c05422c4698E9473P2925B0064g1202C08650j35066f1381B4540f4283C3860
$$ -305422 -34698 59473 132398 20064 -71202 308650 173584 -61381 24540 -64283 33860
11806e3908B30073c11532B4092b06861k6077b6507j68737F0868a23540B52919
$$ -53908 230073 -311532 24092 -206861 -232938 -26507 -195244 60868 -123540 252919
11795a60832C55631A05450a07943B577K1020J81549r2261i9036A38712b5283F6788
$$ -160832 355631 105450 -107943 2577 23597 205146 112885 -99036 138712 -25283 66788
11783B26566b342p4099l1486o3955A62071c01386a27495c846H257L60831C9549
$$ 226566 -2342 -76441 -107927 -171882 162071 -301386 -127495 -3846 8257 369088 39549
11771c76854D655i4257j02732B79235b9516k10225A2314J44418C384J75749l2970
$$ -376854 4655 -94257 -196989 279235 -29516 -239741 12314 156732 3384 179133 146163
11760A46163J33701a63777A98633F4444f5612a8443C71788r2534c39944B99354
$$ 146163 279864 -163777 198633 64444 -65612 -18443 371788 279254 -339944 299354
11749a44140f3775A59352E9984A8370J72565b30488G2820k8501e5873j67757A46468
$$ -144140 -63775 159352 59984 18370 190935 -230488 72820 44319 -55873 -223630 146468
11737f2080A9711K6771J01709b17973f6956A07882m4084D595a56866B9489K90838
$$ -62080 19711 46482 148191 -217973 -66956 107882 63798 4595 -156866 29489 320327
11726C20327A3077K1935O6970K9367a05940G7064a15131A07928A8587b4905o3202
$$ 320327 13077 35012 101982 131349 -105940 77064 -115131 107928 18587 -24905 -88107
11715h8107k40456h8687B75313a7347B3208a05716B38340B4843J3354b6777E8270
$$ -88107 -328563 -88687 275313 -17347 23208 -105716 238340 24843 38197 -26777 58270
11703c8085j8840o1686A89792J23909L8817A4049a86621e2042e789q8783g961
$$ -38085 -56925 -118611 189792 313701 352518 14049 -186621 -52042 -5789 -94572 -7961
11691e5978N271l0485F5736L83460A11093a92754L9875C21747A56585a62949A1765
$$ -55978 -50707 -81192 65736 449196 111093 -192754 -152879 321747 156585 -162949 11765
11679h1112G8467M4932C0331a20547I4017c15198I1932a95885q3005k3842B87906
$$ -81112 78467 123399 30331 -120547 94017 -315198 91932 -195885 -278890 -302732 287906
11667a7639A52579a32024P623A06810K1499M3543e71D8920g2449D9190a87837
$$ -17639 152579 -132024 -124401 106810 128309 171852 -571 48920 -72449 49190 -187837
11655a20168E9031J94191o1999E4561k907J00033b8770C3950g7566F4561J08969
$$ -120168 59031 253222 191223 54561 51654 151687 -28770 33950 -77566 64561 173530
11644A73530H1622a04311k58646J63526e6273l37061C3952P561c33439C65626
$$ 173530 81622 -104311 -362957 -199431 -56273 -393334 33952 41513 -333439 365626
11633h3155M347A65584K86752k18876a07210k9291A85429c93998D33948H2751
$$ -83155 -78808 165584 452336 233460 -107210 -136501 185429 -393998 433948 82751
11622b7164D7782a92350A42446E6212f7826c1091M328k30459E0835d26121i5567
$$ -27164 47782 -192350 142446 56212 -67826 -31091 -26763 -257222 50835 -426121 -95567
11610B22969a85256N0850N3871K9883E272J89040g645q0106A80279b98569F0056
$$ 222969 -185256 -134406 -80535 -50652 5272 194312 -7645 -87751 180279 -298569 60056
11598C8115J20015J85626H2787A6083J73690J30060c9534o3029j70194E9550L42486
$$ 38115 158130 343756 82787 16083 189773 319833 -39534 -102563 -272757 59550 402036
11587D02036A61355J50112I1400I378K96234H0574O3548a63046H3513j5303a5910
$$ 402036 161355 311467 91400 9378 305612 80574 144122 -163046 83513 68210 -15910
11575B30769J40565F8056K71574j52119F6222Q7959C9347P5571N2785P1525F5376
$$ 230769 371334 68056 339630 187511 66222 154181 39347 114918 167703 239228 65376
11563a0412A66791K8508C5699M0516k6337g0720K3706C3413b71879c2211A16861
$$ -10412 166791 195299 35699 76215 49878 -70720 -47014 33413 -271879 -32211 116861
11551B14979H6612N8587n134k9992a74098L399A97276a0968H3199K90141D1830
$$ 214979 86612 145199 140065 110073 -174098 -170699 197276 -10968 83199 373340 41830
11539D7097a73864B56046n0814H4486D808J60641F1037j2628a2933A27014a3140
$$ 47097 -173864 256046 205232 84486 4808 165449 61037 48409 -12933 127014 -13140
11527B77791J36099A72969N8972e0811a2375m4048A25988M6465d23018a15983
$$ 277791 413890 172969 231941 -50811 -12375 -56423 125988 172453 -423018 -115983
11516I6059R3196l0221Q3731j05399J18340a11347A05615k8398M5818J17244M1010
$$ 96059 189255 159034 242765 137366 255706 -111347 105615 77217 123035 240279 281289
11505B81289g2543j09745B889J27518J04194P570K99522B04736b04596B02352
$$ 281289 -72543 -182288 2889 130407 234601 242171 541693 204736 -204596 202352
11494B10994k6660Q6830g2437q2053A18084g4707D6847N2345k5972J0068K4464
$$ 210994 184334 271164 -72437 -154490 118084 -74707 46847 99192 73220 83288 107752
11483A07752A1152K28902B7293d0595A26883N1990O1677J32538D0685N0058J18015
$$ 107752 11152 240054 27293 -40595 126883 178873 240550 373088 40685 90743 208758
11472B08758E8153J48144l383a22146I4804K09559e4519C7464b8902C3213Q7437
$$ 208758 58153 206297 202914 -122146 94804 304363 -54519 37464 -28902 33213 120650
11461A20650R4889r2592h1564G471N0987Q6266d04245C16685A05917a16694N6449
$$ 120650 215539 122947 -81564 7471 58458 144724 -404245 316685 105917 -116694 -60245
11450f0245A58578M24612h8018I4809j7515C297J4424k577J77732D798K48636
$$ -60245 158578 583190 -88018 94809 77294 3297 17721 15144 192876 4798 253434
11439B53434D1561E09K48454f3841B62961G6070K4038j558N546A1332E647J42931
$$ 253434 41561 509 248963 -63841 262961 76070 100108 98550 104096 11332 5647 148578
11427A48578o531m7923b92727O6525J1453O2057M7116a1785H3256e0636A13815
$$ 148578 142047 94124 -292727 -226202 -214749 -152692 -105576 -11785 83256 -50636 113815
11415E6998Q1918b76571P5508A65823R0361a46268j41304e4668A59774h5723q6414
$$ 56998 138916 -276571 -201063 165823 256184 -146268 -287572 -54668 159774 -85723 -172137
11404a72137F969a73828N2161B43118A3209J42399a8571A77295a96191A76570
$$ -172137 6969 -173828 -121667 243118 13209 155608 -18571 177295 -196191 176570
11393a78252B79291i4023j62863d6393k48537a31109m8206A06921A5436a59379
$$ -178252 279291 -94023 -256886 -46393 -294930 -131109 -179315 106921 15436 -159379
11382a97161q8781g1988A84415C6213K57121A23353C6213b64791A96226h2449
$$ -197161 -285942 -71988 184415 36213 293334 123353 36213 -264791 196226 -82449
11371b09738a1742A49965A4779a42099B32127o3577L2749e662r5798A16001E4715
$$ -209738 -11742 149965 14779 -142099 232127 168550 201299 -5662 -101460 116001 54715
11359D06142D7474d1161j70927j18442A59246D9628d9406B26397i5628G0339b5329
$$ 406142 47474 -41161 -212088 -330530 159246 49628 -49406 226397 -95628 70339 -25329
11347b3106A82205a3937q8240l1677j92049J28660F5898J58271D903M8030R8791
$$ -23106 182205 -13937 -102177 -133854 -325903 -197243 65898 224169 4903 52933 151724
11336A51724B1283f4972p2131G8118B1675O1263d1234M810n1422I6026f8221L3128
$$ 151724 21283 -64972 -137103 78118 21675 82938 -41234 -36424 -87846 96026 -68221 -35093
11324c5093j65826F3907L2724M9231a34817B26185a43247l89300E7407R2249P2312
$$ -35093 -200919 63907 96631 145862 -134817 226185 -143247 -532547 57407 149656 221968
11313B21968i0776A06850P8941e3156j24177B14555h9482A02034D279L05222C5516
$$ 221968 -90776 106850 185791 -53156 -177333 214555 -89482 102034 4279 309501 35516
11301b04366q7553h1715A21734g5641c0005l6633A17058k4373a9675k1824j95257
$$ -204366 -291919 -81715 121734 -75641 -30005 -66638 117058 92685 -19675 -41499 -236756
11290b36756j44009J45506i6175A9423i4930j49324h6565B30270c2777o2081K4186
$$ -236756 -380765 -235259 -96175 19423 -94930 -244254 -86565 230270 -32777 -94858 -70672
11279g0672H2113a56194a0506H0828N7256b2074l7100n4829A55813b59543C6953
$$ -70672 82113 -156194 -10506 80828 138084 -22074 -59174 -114003 155813 -259543 36953
11267A16104O2453C1094J45251q0560B3617b00238H8046L6596m24a21091A62296
$$ 116104 178557 31094 176345 95785 23617 -200238 88046 124642 124218 -121091 162296
11255a26767c096p5227j99158M1393j93463D0548c4698m6011F1507Q7596k2953
$$ -126767 -3096 -78323 -277481 -236088 -429551 40548 -34698 -80709 61507 149103 126150
11244A26150c43490B53862H3700b47999b3750k97845i1364j32534h060D04468
$$ 126150 -343490 253862 83700 -247999 -23750 -321595 -91364 -223898 -8060 404468
11233B5632Q8516C607i1841I7764C3143J15951k4950L37646A72989h0168A3667
$$ 25632 114148 3607 -91841 97764 33143 149094 124144 461790 172989 -80168 13667
11221g7736L0676C5658g5430j97278A56165b40890F4581a10387A37614b1705l73606
$$ -77736 -47060 35658 -75430 -272708 156165 -240890 64581 -110387 137614 -21705 -395311
11210c95311a68685b8963j18520G6751J25368a52230C88654b81225D8226d6961
$$ -395311 -168685 -28963 -147483 76751 202119 -152230 388654 -281225 48226 -46961
11199b11698D7066K46221a6883j50503f2935A17876E5816a1253l6019J2284l51605
$$ -211698 47066 293287 -16883 -167386 -62935 117876 55816 -11253 -47272 -34988 -386593
11188c86593g4506E379a4819b500A2763J15762b26073c7167D0930b18238p4289
$$ -386593 -74506 5379 -14819 -2500 12763 128525 -226073 -37167 40930 -218238 -292527
11177b92527a43115A75085J41433a14215M9654A94802a03418B84414g6019j15812
$$ -292527 -143115 175085 316518 -114215 -64561 194802 -103418 284414 -76019 -191831
11167a91831j82268b241C00739b5060m4704a0125A81109R5186c1324A69339b72860
$$ -191831 -374099 -2241 300739 -25060 -69764 -10125 181109 276295 -31324 169339 -272860
11155H7223L3588b16985F3308a74590B11385a24566L2597E2986h2983a3529A09072
$$ 87223 120811 -216985 63308 -174590 211385 -124566 -91969 52986 -82983 -13529 109072
11143c8796L958I5190K9732b64350A63602e0881B04911C5535g3730A64418K5800
$$ -38796 -34838 95190 124922 -264350 163602 -50881 204911 35535 -73730 164418 190218
11132A90218a17961A12853j633b17280A96351E8689c4927n0579E2301J24441E7740
$$ 190218 -117961 112853 111220 -217280 196351 58689 -34927 -85506 52301 176742 57740
11120a32053B26406m0769d9775A33140J0399b87743a36268I4110J75145j13079
$$ -132053 226406 185637 -49775 133140 143539 -287743 -136268 94110 269255 156176
11110A56176i987B76911J14386C2545J42704M1255a18669A78378a43682G7512
$$ 156176 -9987 276911 391297 32545 175249 216504 -118669 178378 -143682 77512
11099B4817M8967i311G3940a30940B82979o448r5440L1045J6042k1980J09143
$$ 24817 73784 -9311 73940 -130940 282979 276531 181091 212136 228178 206198 315341
11088C15341a4962H6030j8055J91504j14513J40696D0426J61676K30658A97955
$$ 315341 -14962 86030 67975 259479 144966 285662 40426 202102 432760 197955
11077G2073J16825J54493D0785P3370K92666J08495B07707A03415K45211g8553
$$ 72073 188898 343391 40785 114155 406821 515316 207707 103415 348626 -78553
11066C03900J37649j02611O7412J64471j91972A09018J80958K72733J89927B55371
$$ 303900 441549 338938 406350 570821 378849 109018 289976 562709 752636 255371
11055F42517C14764Q7190K53737l0812n0496L4059o075J83950l02140K40891k33556
$$ 642517 314764 401954 655691 624879 574383 608442 602367 786317 484177 725068 491512
11044D91512k8655m8425J39687O199L9792K23944K5279C77870K58288l5586r9519
$$ 491512 462857 414432 554119 560318 600110 824054 849333 377870 636158 600572 501053
11033E01053J23254j54576K19095m5691j09339P4060m2028k05857K51392K51145
$$ 501053 624307 469731 688826 643135 533796 607856 565828 359971 611363 862508
11023H62508D05782J17612j35669j49222M67546j49295j62974L06542l37092J79936
$$ 862508 405782 523394 387725 238503 706049 556754 393780 700322 363230 543166
11013E43166l05j83892K84035j46839K4785O985j1839L45040k69248Q8434k26837
$$ 543166 542861 358969 643004 496165 520950 527935 516096 861136 591888 680322 453485
11002D53485J8481J06224r3176L05177k15158J58065n4029j82641r0236O3817
$$ 453485 471966 578190 485014 790191 575033 733098 679069 496428 406192 470009
10992D70009l8008J76475K32102k85634Q4121J57171R4739k63204O5756L97201
$$ 470009 432001 608476 840578 554944 639065 796236 890975 627771 693527 1090728
10982A090728k5479j34692K48505J05384j30880K5717R3752N08517J78636K98379
$$ 1090728 1065249 930557 1179062 1284446 1153566 1179283 1273035 1781552 1960188 2258567
10972B258567k02682L22874j38731J02173j84739k39619j10436m15902M6981o9678
$$ 2258567 2055885 2378759 2240028 2342201 2157462 1917843 1807407 1391505 1438486 1368808
10962A368808K5634J50098j07471M37727m70687K39987k99231N46432o30682q9651
$$ 1368808 1394442 1544540 1437069 1874796 1404109 1644096 1344865 1891297 1260615 1170964
10952A170964m42164j84703K84945C03304L11328A67203R5498p958A09945L60703
$$ 1170964 728800 544097 829042 303304 614632 167203 262701 254743 109945 470648
10942D70648E7280L30928j18081a884j89396B76710I4573J25567B264Q3162j4382
$$ 470648 57280 388208 270127 -1884 -191280 276710 94573 220140 2264 85426 71044
10931G1044i5532A85917I0980K4834b5303B90038h3867A95312K7474q7300J05709
$$ 71044 -95532 185917 90980 115814 -25303 290038 -83867 195312 222786 135486 241195
10920B41195A05626a10915e1320j74556a09828A61483J28699j14623l0821a95031
$$ 241195 105626 -110915 -51320 -225876 -109828 161483 290182 175559 144738 -195031
10909f9088A85652P8050f8183A54640J72485j49462Q9330e6941r1433B02420a67779
$$ -69088 185652 263702 -68183 154640 327125 177663 266993 -56941 -148374 202420 -167779
10897a60410P2922k44318A09521e948l1419H879a13187N0277E1016N458b9908
$$ -160410 -87488 -331806 109521 -5948 -37367 8879 -113187 -62910 51016 56474 -29908
10885C7173c64611C9371J5871a09700l7607N4252b4565j070p3319f916D9106J04348
$$ 37173 -364611 39371 55242 -109700 -147307 -93055 -24565 -25635 -98954 -6916 49106 153454
10873A53454c60353B86849j13830k8322a4272j20309E7757a31276a906r1208l1300
$$ 153454 -360353 286849 173019 144697 -14272 -134581 57757 -131276 -1906 -93114 -124414
10862a24414m15106B07977g4630E004b2783o5299c0854B88073a18638B78106b59137
$$ -124414 -539520 207977 -74630 5004 -22783 -88082 -30854 288073 -118638 278106 -259137
10850C34964b17300j40904A98364a47481H8486l3055g9406G545b62076A00870
$$ 334964 -217300 -358204 198364 -147481 88486 55431 -79406 7545 -262076 100870
10839b619H7308E636b22935D9707b44341A55315c10631A02607l1155a25580B35371
$$ -2619 87308 5636 -222935 49707 -244341 155315 -310631 102607 71452 -125580 235371
10827a44479J6672d6615C8095K3523J1569l6153R705a6526k61918A07729L1452
$$ -144479 -127807 -46615 38095 61618 73187 37034 46739 -16526 -278444 107729 139181
10816A39181c60359a67187a1870A32026h5583A34609b24138c1237B32301q4849
$$ 139181 -360359 -167187 -11870 132026 -85583 134609 -224138 -31237 232301 147452
10806A47452d0906j42914a6296C3963a95847f1401C39711a09147a3515k2630H1417
$$ 147452 -40906 -183820 -16296 33963 -195847 -61401 339711 -109147 -13515 -36145 81417
10794B08942a07223D0410K22976a3430k28233B68896a53109N6863A6999M3096
$$ 208942 -107223 40410 263386 -13430 -241663 268896 -153109 -96246 16999 60095
10784F0095a54854J7130j21249Q8486q418A69630B4047a84956k880B73701r326
$$ 60095 -154854 -137724 -258973 -170487 -178905 169630 24047 -184956 -187836 273701 264375
10773B64375E0913j4214m892J78945i4715A39621J27937c1506j66751d3096A94678
$$ 264375 50913 36699 31807 210752 -94715 139621 267558 -31506 -198257 -43096 194678
10761b6393j56742L0861C4327L7684N0355L3729i5360n692F5006a55762p1883
$$ -26393 -183135 -152274 34327 72011 122366 156095 -95360 -101052 65006 -155762 -227645
10750b27645M4244H3175f631k25943G1921J73233a37280O2116A70909f2140A8539
$$ -227645 -183401 83175 -6631 -232574 71921 245154 -137280 -75164 170909 -62140 18539
10738c30858f1758l28466a2528H2199k1893M7289e7002o8754b2998r0528B33616
$$ -330858 -61758 -390224 -12528 82199 60306 107595 -57002 -125756 -22998 -113526 233616
10726b377j728B3053a5138j1127p8700C20922b14611B267h6860D6164b98845e3840
$$ -2377 -4105 23053 -15138 -26265 -104965 320922 -214611 2267 -86860 46164 -298845 -53840
10713c87551a71873A53744G0065f4523J6369C65276b66148J09005c1181k39273
$$ -387551 -171873 153744 70065 -64523 -48154 365276 -266148 -157143 -31181 -270454
10703b70454A19885d959m38117A06502a99084l9446C46810a37765k34068a1018
$$ -270454 119885 -4959 -443076 106502 -199084 -238530 346810 -137765 -371833 -11018
10692a37276A97104a75536P3292q0883B2845a2541B83008j30843a49626l25729
$$ -137276 197104 -175536 -102244 -183127 22845 -12541 283008 152165 -149626 -475355
10682d75355i7592j9193k43117a73141l1564H357b40169A24327c66568A45853
$$ -475355 -97592 -116785 -359902 -173141 -204705 8357 -240169 124327 -366568 145853
10671A81633a6369n45218A5623h1596c0109j66253j89281a67228k5071A49851
$$ 181633 -16369 -561587 15623 -81596 -30109 -196362 -385643 -167228 -192299 149851
10660A3628K0382f7989j55691h3638k7638C2161h9616G0653c543r6833G7799b6307
$$ 13628 34010 -67989 -223680 -83638 -111276 32161 -89616 70653 -3543 -100376 77799 -26307
10647c57853f1162a3209k98014A92942a90278E4469h3347B86564H4078g9455c5879
$$ -357853 -61162 -13209 -311223 192942 -190278 54469 -83347 286564 84078 -79455 -35879
10635c1539i276j17651A67801B4219L98976f8109j72284A87497D09Q7741b39495
$$ -31539 -9276 -126927 167801 24219 423195 -68109 -240393 187497 409 88150 -239495
10623b41949O9311N2675l2134e8342A30635k6725e9953A16038b21431j51924J63030
$$ -241949 -172638 -119963 -152097 -58342 130635 103910 -59953 116038 -221431 -373355 -210325
10612b10325A54064D7066b53411k0398A37441J40259b19706J03820c7473J3069
$$ -210325 154064 47066 -253411 -273809 137441 277700 -219706 -115886 -37473 -24404
10602b4404j00382o1521b4801j34026A5489K9409c8318B3781a13814h650B90512
$$ -24404 -124786 -186307 -24801 -158827 15489 44898 -38318 23781 -113814 -8650 290512
10590D5721J71653m478H7472b7263o5818j22979l6358R0654A17352b23147n0335
$$ 45721 217374 212896 87472 -27263 -93081 -216060 -252418 -161764 117352 -223147 -273482
10579b73482K8575O0308f2315I562e7856A6365K76255j33114a35051j00946a5698
$$ -273482 -244907 -184599 -62315 9562 -57856 16365 292620 159506 -135051 -235997 -15698
10567A22509b67533L4801a13918e0927A79189a94431A12560b11743c8149D7231
$$ 122509 -267533 -232732 -113918 -50927 179189 -194431 112560 -211743 -38149 47231
10556a94900A34676P7381a61925A12108N4989p9625b60591A19546n1434b04354
$$ -194900 134676 212057 -161925 112108 167097 87472 -260591 119546 68112 -204354
10545e4954J882A11174n0190f7763l6909A06684j0175N5163b1520A8294N6539
$$ -54954 -53072 111174 60984 -67763 -104672 106684 96509 151672 -21520 18294 74833
10534G4833a46104A03401a16195k44236F8548C0147g1078G2115Q1542g7449p2662
$$ 74833 -146104 103401 -116195 -360431 68548 30147 -71078 72115 153657 -77449 -150111
10523a50111j3840M6338k2154r1582A00761N431Q1798G3011d4949C7707J53049
$$ -150111 -163951 -117613 -139767 -231349 100761 106192 187990 73011 -44949 37707 190756
10512A90756a73044m0316A41203i8498C8568a08931A42067P6818a72413G2373
$$ 190756 -173044 -213360 141203 -98498 38568 -108931 142067 218885 -172413 72373
10501A81571b43488R9519F5180c20993J11507L4009A45914h4575F0405R0757J85722
$$ 181571 -243488 -143969 65180 -320993 -209486 -175477 145914 -84575 60405 151162 336884
10490C36884C138a5973C6134A3895b65079J16527A53139B2851J17241L88631l6709
$$ 336884 3138 -15973 36134 13895 -265079 -148552 153139 22851 140092 528723 492014
10479D92014J05057E22K96811b22152E4671c59522A48481b74263R2299F8887a23193
$$ 492014 597071 522 297333 -222152 54671 -359522 148481 -274263 -181964 68887 -123193
10467F5408P4339c3719l11390C15897b9968k87785d407j43719B45332J09114b86544
$$ 65408 139747 -33719 -345109 315897 -29968 -317753 -4407 -148126 245332 354446 -286544
10455B36231m0004d56936e1595A14401a87967n8239j8468J28296m37154D4554
$$ 236231 196227 -456936 -51595 114401 -187967 -246206 -264674 -136378 -573532 44554
10444A22966a23686C2106d2294A24907O1616c9510F2527J79880c0803j5617a2881
$$ 122966 -123686 32106 -42294 124907 186523 -39510 62527 242407 -30803 -46420 -12881
10432D2702a90914A93935E041a44128i582A46635K536J22434E8570A6646b1647
$$ 42702 -190914 193935 5041 -144128 -9582 146635 149171 271605 58570 16646 -21647
10420a29339l7779G6604h1111C8600K25587F2482a23897q2273C4789M1044K02004
$$ -129339 -167118 76604 -81111 38600 264187 62482 -123897 -206170 34789 75833 277837
10409B77837b89059a18075E9040O8917j3405M458L5313b2785q1667I3850a11887
$$ 277837 -289059 -118075 59040 127957 114552 119010 154323 -22785 -104452 93850 -111887
10397a3840j03558j61979A53971K3946f4378C56415b109k33184D7445q613g870
$$ -13840 -117398 -279377 153971 177917 -64378 356415 -2109 -235293 47445 38832 -7870
10385d0094j34919H386J93867e0827D1603K39848a3464A21838n8720K53137K23637
$$ -40094 -175013 8386 202253 -50827 41603 281451 -13464 121838 63118 316255 539892
10374E39892b33608C07318D116K39038p5233J20910K45703n0605A52977K42114
$$ 539892 -233608 307318 4116 243154 167921 288831 534534 483929 152977 395091
10364C95091j0689j82626a37510I7886K09056b32920B86346A7753K98786k9326
$$ 395091 384402 201776 -137510 97886 306942 -232920 286346 17753 316539 287213
10354B87213K88997A35951E5925M44708k8725j27808j7400F6394M50000B09292
$$ 287213 576210 135951 55925 500633 471908 344100 326700 66394 516394 209292
10343D50311Q7847j92906K968A53965K0766l2455n6832B3615d4586F0382J78009
$$ 450311 538158 345252 348220 153965 174731 142276 85444 23615 -44586 60382 238391
10332B38391o1653R4430j16001G1318M9458R7501n4550p7841J1215c5510F8262
$$ 238391 176738 271168 155167 71318 120776 218277 163727 85886 97101 -35510 68262
10320B08590H1869K26352A22922L4566L6177E0218K686f1166l9979A47635b04129
$$ 208590 81869 308221 122922 157488 193665 50218 52904 -61166 -101145 147635 -204129
10308c6560I1433h1104B24616q8234d1472k4107D8438J04360a35444c336j26471
$$ -36560 91433 -81104 224616 136382 -41472 -65579 48438 152798 -135444 -3336 -129807
10297a29807A34914n8042a00654A93130e4141H4112a81009b7578j75157i8407
$$ -129807 134914 76872 -100654 193130 -54141 84112 -181009 -27578 -202735 -98407
10286a24528A83280m0816b66396B64319a48690F9486h6586B32469a75194H4115
$$ -124528 183280 142464 -266396 264319 -148690 69486 -86586 232469 -175194 84115
10275i3512J4031A5887J88797h8490j20115c9690D9718J41054a03032d2618B65054
$$ -93512 -79481 15887 204684 -88490 -208605 -39690 49718 190772 -103032 -42618 265054
10263E1864j4571A6886J7372b5749D6070K27396J93926o5463A15597b32376E8307
$$ 51864 37293 16886 34258 -25749 46070 273466 467392 401929 115597 -232376 58307
10251d2468q7266j64418D3312c05268L4903J18416O2796E2657i6938B5497c17998
$$ -42468 -129734 -294152 43312 -305268 -270365 -151949 -89153 52657 -96938 25497 -317998
10239c6079A67184n9880J9182J37808D3895L72447g6896b5523k03306R7760K0683
$$ -36079 167184 107304 126486 264294 43895 416342 -76896 -25523 -228829 -131069 -110386
10228a10386A90660e1712m9947C8677b69087a22866A67113b84068J9005C7717
$$ -110386 190660 -51712 -101659 38677 -269087 -122866 167113 -284068 -265063 37717
10217h6225F0322c9039A39323a00167D50358a57948A6079H95b40157c7557A93954
$$ -86225 60322 -39039 139323 -100167 450358 -157948 16079 895 -240157 -37557 193954
10205A07984a19277e8647J0711o1086N4212a9936k31790A4545c5510j17185i32
$$ 107984 -119277 -58647 -47936 -109022 -54810 -19936 -251726 14545 -35510 -152695 -932
10193A35887d71060b2109k32894c6868I1992i1668j26698F8719J93127a64358
$$ 135887 -471060 -22109 -255003 -36868 91992 -91668 -218366 68719 261846 -164358
10182A58144h0130K8726E8636b5298j65144j91246A45524a3363C7103g2915m2654
$$ 158144 -80130 -51404 58636 -25298 -190442 -381688 145524 -13363 37103 -72915 -115569
10171a15569l6318F3672f4196j16294j8310A36126d25658K05000R8737F2626K01660
$$ -115569 -151887 63672 -64196 -180490 -198800 136126 -425658 -220658 -121921 62626 264286
10160B64286A5720b6920j59100c3265o6834B33401c5828A20179k8009a40270j15986
$$ 264286 15720 -26920 -186020 -33265 -100099 233401 -35828 120179 92170 -140270 -256256
10149b56256J11678G7132l6148a71753D9324a62358E8199i8263q3325C71412H9355
$$ -256256 -144578 77132 40984 -171753 49324 -162358 58199 -98263 -181588 371412 89355
10137a46804A61353a70729E442J35564b09688l3940B61526d37535K02635i331
$$ -146804 161353 -170729 5442 141006 -209688 -243628 261526 -437535 -234900 -9331
10126A51056c9704D34133a85482o6175A21238c35533O3386I4467C6506a83534
$$ 151056 -39704 434133 -185482 -251657 121238 -335533 -272147 94467 36506 -183534
10115i637l07394J43420E0438J93194L3410A22736a490l91151C96172A31831L6807
$$ -9637 -317031 -173611 50438 243632 277042 122736 -1490 -392641 396172 131831 168638
10104A68638c822o8429C4089E53K39934d8051j86494j80214D745J53208f6826
$$ 168638 -3822 -72251 34089 553 240487 -48051 -234545 -414759 4745 157953 -66826
10092g879C79190f7367q663G7976i9126k2069n3307K9207L6647b6319A08975l7323
$$ -7879 379190 -67367 -76030 77976 -99126 -121195 -174502 -145295 -108648 -26319 108975 71652
10080G1652d8829A41208b1380r2575l7128o2941e3850C1887j2985M6248c11174
$$ 71652 -48829 141208 -21380 -113955 -151083 -214024 -53850 31887 18902 65150 -311174
10068a45797O1190B08151a17040N2457A27511L8729a25076M4557j5937H3819e2876
$$ -145797 -84607 208151 -117040 -64583 127511 166240 -125076 -80519 -96456 83819 -52876
10056H7548c16077G0781a4087j47939d1764C0485P3161b51277a14624k7543m7684
$$ 87548 -316077 70781 -14087 -162026 -41764 30485 103646 -251277 -114624 -142167 -189851
10045a89851m6071M7096b4669r8003E0231j7531b14239i5601B25598A12257f2886
$$ -189851 -235922 -188826 -24669 -122672 50231 32700 -214239 -95601 225598 112257 -62886
10033a62275N4171k12300f0705H4077b2950l59738e9653r147l4508p151A64162
$$ -162275 -108104 -320404 -60705 84077 -22950 -382688 -59653 -68800 -103308 -110459 164162
10021C24776G7541c6502G8675e6847j53599Q0766j35538B38961F8656b32772Q536
$$ 324776 77541 -36502 78675 -56847 -210446 -129680 -265218 238961 68656 -232772 -224236
10010b24236p7349a13755J4543I2485g912j81734H0032b27799A12210a94055b5905
$$ -224236 -301585 -113755 -99212 92485 -7912 -189646 80032 -227799 112210 -194055 -25905
9998B03953a59545L8264c5876n5924H269h3994G6192d0284j07906A49192n5495
$$ 203953 -159545 -121281 -35876 -91800 8269 -83994 76192 -40284 -148190 149192 93697
9987I3697c20806J54121L5370c0412k8827j60804j3773H1623a61384M0953d5228
$$ 93697 -320806 -166685 -131315 -30412 -59239 -220043 -233816 81623 -161384 -120431 -45228
9975b1677l3242k32754a9408m2212A53343J03152a37976M2961K6898F3512J04274
$$ -21677 -54919 -287673 -19408 -61620 153343 256495 -137976 -95015 -68117 63512 167786
9964A67786a17381L172A06b92652P3359j34989a44199A86807B5844a81950A01870
$$ 167786 -117381 -114209 106 -292652 -219293 -354282 -144199 186807 25844 -181950 101870
9952A90197n6326a73776M4910l31289a27128B03698A2226c48049H8003M399a32565
$$ 190197 133871 -173776 -128866 -460155 -127128 203698 12226 -348049 88003 92402 -132565
9940b01627A82207P7941d34500g31k89965N3645C3507P9909i9520o1804B5927
$$ -201627 182207 260148 -434500 -731 -290696 -237051 33507 113416 -99520 -161324 25927
9928b25369b8928B6893f180A31229d927B6093a87176J7465b051j01195H4864a85557
$$ -225369 -28928 26893 -6180 131229 -4927 26093 -187176 -169711 -2051 -103246 84864 -185557
9915E8781a44476r2945F7918c99581J40113r916m6521A79676b6101j19821P1389
$$ 58781 -144476 -237421 67918 -399581 -259468 -269384 -315905 179676 -26101 -145922 -74533
9904g4533A68229g7058C6814a80800f5754C10776b18116B1444M2086b5665J975
$$ -74533 168229 -77058 36814 -180800 -65754 310776 -218116 21444 63530 -25665 -23690
9893b3690B6587M1301k3238M423b24436A92906J02525C2813b00966C27637D6492
$$ -23690 26587 67888 44650 49073 -224436 192906 295431 32813 -200966 327637 46492
9881I1583e5181j28309A28868J6934c09251a36345A68256D7061d02022a68925
$$ 91583 -55181 -183490 128868 145802 -309251 -136345 168256 47061 -402022 -168925
9870a18819K0605g309j89462j35100E2092R0053l1953c4177C7126b06724p5784
$$ -118819 -98214 -7309 -196771 -331871 52092 142145 110192 -34177 37126 -206724 -282508
9859b82508h1291a9442A1256J60923e6720k26231h726A21190J37037a50557K5947
$$ -282508 -81291 -19442 11256 172179 -56720 -282951 -8726 121190 258227 -150557 -124610
9848a24610k18053Q3237A808N1670J61895a0649A17948a31583l19836A2197J10870
$$ -124610 -342663 -259426 1808 53478 215373 -10649 117948 -131583 -451419 12197 123067
9837A23067k3916b48707B04753n1824J0532R1850H7039a49q039k94874C34432
$$ 123067 99151 -248707 204753 152929 163461 255311 87039 -149 -8188 -303062 334432
9825b84202p7309A38130b48181A0435c76545A82252L1007B9377a9849d962B93282
$$ -284202 -361511 138130 -248181 10435 -376545 182252 213259 29377 -19849 -4962 293282
9813I1919A9197L0333L9508c66157b204D4737J6103b22606M8141j5569A62250
$$ 91919 19197 49530 89038 -366157 -2204 44737 60840 -222606 -174465 -190034 162250
9801a46156j2576j05781a2748H3174b00860P7905A2004c00163L0880A43569h3186
$$ -146156 -158732 -264513 -12748 83174 -200860 -122955 12004 -300163 -269283 143569 -83186
9789A8992L08140a16507C7533J56230a61248P0634K1926B9309Q168i2866c5307
$$ 18992 327132 -116507 37533 193763 -161248 -90614 -68688 29309 37477 -92866 -35307
9777f1053J5464o1712a4026k88868a50260e9626R680l40654A29842O1625p6303
$$ -61053 -45589 -107301 -14026 -302894 -150260 -59626 -49946 -390600 129842 191467 115164
9766A15164K00165b69351a21433A05957O3206c0096k670o1750E058a58914j72477
$$ 115164 315329 -269351 -121433 105957 169163 -30096 -32766 -94516 5058 -158914 -331391
9755c31391A77065A6329J74075D1187a02225d9135K3659E2052a81296f8191I3600
$$ -331391 177065 16329 190404 41187 -102225 -49135 -25476 52052 -181296 -68191 93600
9743h8959p4130d76j4744o7111A13555N6351M2321b5706j07716q0812a7400A2220
$$ -88959 -163089 -476 -15220 -82331 113555 169906 212227 -25706 -133422 -214234 -17400 12220
9730F3707b50731J14303r7812m3252C21487j44498J26071a78530p2357l7813A74659
$$ 63707 -250731 -136428 -234240 -277492 321487 176989 303060 -178530 -250887 -288700 174659
9718A518d4845G7219C7915b16556a6908k5181j6403k89391G2332a09400m5998
$$ 1518 -44845 77219 37915 -216556 -16908 -42089 -58492 -347883 72332 -109400 -155398
9707a55398j91767A55694b77139P3018B6057K73555D049b36009d2462l64781a78496
$$ -155398 -347165 155694 -277139 -204121 26057 299612 4049 -236009 -42462 -407243 -178496
9695a93409a5294l22836h1086k08436J19657g745D3153j6568a67856M1293A42901
$$ -193409 -15294 -338130 -81086 -289522 -169865 -7745 43153 26585 -167856 -126563 142901
9683c0108C23377c15100J22584i1549L8490j60396L2588P9341c0178j28456B78652
$$ -30108 323377 -315100 -192516 -91549 -53059 -213455 -180867 -101526 -30178 -158634 278652
9671d54733a14756n5638D9116a19280K0127h817G3253C3178b06727C21710A9396
$$ -454733 -114756 -170394 49116 -119280 -99153 -8817 73253 33178 -206727 321710 19396
9659c2898m9312k5166j90853B70916f2428K479k62527a11471j34852A71298h4619
$$ -32898 -82210 -107376 -298229 270916 -62428 -59949 -322476 -111471 -246323 171298 -84619
9647b32256a03576D0578a24301O811M5284B7333b36178B1851J78581a41110m1032
$$ -232256 -103576 40578 -124301 -117490 -72206 27333 -236178 21851 200432 -141110 -182142
9636a82142O3150A30587a91603D06255A46217f8055j18968A9418b0085B0580b4667
$$ -182142 -118992 130587 -191603 406255 146217 -68055 -187023 19418 -20085 20580 -24667
9624B4774D175a90382O0877B89936A31698c86514a56784k79097a71537M8736l12947
$$ 24774 4175 -190382 -129505 289936 131698 -386514 -156784 -435881 -171537 -122801 -435748
9613d35748a64110j58797i8633k0616M9455A47712c97639c6781k62106B44125
$$ -435748 -164110 -322907 -98633 -119249 -69794 147712 -397639 -36781 -298887 244125
9602I0940b89159A64536a19784A34402b87815E6674c483A0094J48239J9915a03866
$$ 90940 -289159 164536 -119784 134402 -287815 56674 -3483 10094 158333 178248 -103866
9590a43484J3976a1640l5447G0629K98312C1275a27885b5775j24823E1468d20393
$$ -143484 -129508 -11640 -47087 70629 368941 31275 -127885 -25775 -150598 51468 -420393
9578E2714f4403G08e0174a8137o0274C36122e0835J2350j57139n8830j7065a34305
$$ 52714 -64403 708 -50174 -18137 -78411 336122 -50835 -38485 -195624 -254454 -271519 -134305
9565C6849a61773A86340e9063J7524D3819P051a48408n4851A7170a5270A096e302
$$ 36849 -161773 186340 -59063 -41539 43819 50870 -148408 -203259 17170 -15270 1096 -5302
9552B9552b06077C25767g1337q2745j80829I790g9223K9547j91201C3679L4315
$$ 29552 -206077 325767 -71337 -154082 -334911 9790 -79223 -49676 -240877 33679 67994
9541F7994N891h8646b2918A26474a01367k76775b6768j28384j10599A66335n0183
$$ 67994 73885 -88646 -22918 126474 -101367 -378142 -26768 -155152 -265751 166335 116152
9530A16152J44806p9109o4302k2333D339P558L4371K51109C4860g2023j78160
$$ 116152 260958 181849 117547 95214 4339 11897 46268 297377 34860 -72023 -250183
9519b50183a03510B3697J28290b99463m2411A52629a86880n0435d3995j1701F2902
$$ -250183 -103510 23697 151987 -299463 -341874 152629 -186880 -237315 -43995 -55696 62902
9507a85691c3003j86090A97882c41471A7296c836A20527b5742j7095B0876c26472
$$ -185691 -33003 -219093 197882 -341471 17296 -3836 120527 -25742 -42837 20876 -326472
9495B42865r7593B0595i2404A78055c6104j29294A04498b03366M6996B0962L3040
$$ 242865 145272 20595 -92404 178055 -36104 -165398 104498 -203366 -156370 20962 54002
9484E4002L7986c12678C18214a32672A22905j3007L02586c04534M9822G6464a15936
$$ 54002 91988 -312678 318214 -132672 122905 109898 412484 -304534 -254712 76464 -115936
9472e2419A25582b29940b0266j3198A39749J06842L6076A29530B5041a26382o4117
$$ -52419 125582 -229940 -20266 -33464 139749 246591 282667 129530 25041 -126382 -190499
9461a90499I5850d82343b27477j55269J83192Q4041a4836j71338D8646a02640
$$ -190499 95850 -482343 -227477 -382746 -199554 -115513 -14836 -186174 48646 -102640
9450e6530j65240B71920J6177b59603A94280k5889p4030c50039A632b91658C3851
$$ -56530 -221770 271920 288097 -259603 194280 168391 94361 -350039 1632 -291658 33851
9438A5122J37230g3055C3383g594k4261j00872K4060j52786B61284J13978a77221
$$ 15122 152352 -73055 33383 -7594 -31855 -132727 -108667 -261453 261284 375262 -177221
9426d4779p1147A03984f2787A6406j61b73402g0035l72215A47731b48318A40479
$$ -44779 -115926 103984 -62787 16406 16245 -273402 -70035 -442250 147731 -248318 140479
9414a40154A98082b11267r1866a49128A2215a44290f631A50048f6456j13477B39223
$$ -140154 198082 -211267 -303133 -149128 12215 -144290 -6631 150048 -66456 -179933 239223
9402B78841p6646r9615c4584p0384H9405J96450b08547A84220N7362a71119B2998
$$ 278841 202195 102580 -34584 -104968 89405 285855 -208547 184220 241582 -171119 22998
9390E7060c71558a80767f1187j49893F9493a80946C009f1952A25088L3604C0237
$$ 57060 -371558 -180767 -61187 -211080 69493 -180946 3009 -61952 125088 158692 30237
9378B8402a39351C23327a41377C033b2465E0353a86111F576J33948g8952O0j39866
$$ 28402 -139351 323327 -141377 3033 -22465 50353 -186111 6576 140524 -78952 -78892 -218758
9366b18758A65475b67300N7244A38J26721D9435a73747A00533a20458o5052A4003
$$ -218758 165475 -267300 -210056 138 126859 49435 -173747 100533 -120458 -185510 14003
9354B3320c03413g6961m6850e5145k12550a33503B7135a22731q9078Q3288p3940
$$ 23320 -303413 -76961 -123811 -55145 -267695 -133503 27135 -122731 -211809 -128521 -202461
9343b02461o9876N6587P4739B5189h5692B71230c38333E0796a50656j31048H2019
$$ -202461 -272337 -215750 -141011 25189 -85692 271230 -338333 50796 -150656 -281704 82019
9331a03701D6810b84746Q9545f1089A31081a36945k04568d4225m4544j59917n4870
$$ -103701 46810 -284746 -195201 -61089 131081 -136945 -341513 -44225 -88769 -248686 -303556
9320c03556G7201a54983n4390b9250D8968K8444O9772N6833a29399J9499n9741
$$ -303556 77201 -154983 -209373 -29250 48968 77412 147184 204017 -129399 -109900 -169641
9309a69641c171j84263B1954J1090g3978B23952c38948f6342B828L4041J0871
$$ -169641 -3171 -187434 21954 33044 -73978 223952 -338948 -66342 2828 36869 47740
9298D7740L6402j3161g8030k50598A98664R8777b98485J06598A45539m1718a77596
$$ 47740 84142 70981 -78030 -328628 198664 297441 -298485 -191887 145539 103821 -177596
9286c39459A25403J28290i391j03507j70314E0385P6725E2427b6986B75204A36993
$$ -339459 125403 253693 -9391 -112898 -283212 50385 127110 52427 -26986 275204 136993
9274B771a78877A3526J459J84092B5114a73366g3143n0742A11168a92892B29289
$$ 2771 -178877 13526 14985 199077 25114 -173366 -73143 -123885 111168 -192892 229289
9262c82502c3786E6597R497j9071a09922j15559C6204Q1656B2373b56391J06618
$$ -382502 -33786 56597 66094 47023 -109922 -225481 36204 117860 22373 -256391 -149773
9251a49773G2156b49453h9374L6446j04498C37041e9531J2875A68527a72321A14010
$$ -149773 72156 -249453 -89374 -52928 -157426 337041 -59531 -46656 168527 -172321 114010
9239f9461b8395A67480a48905C5953O2046j8328Q9517b8409l8430A82858b94382
$$ -69461 -28395 167480 -148905 35953 97999 79671 169188 -28409 -66839 182858 -294382
9227a5372j21713g598p2474j30998i7281A43309i2737j29658D2970l892a47195
$$ -15372 -137085 -7598 -80072 -211070 -97281 143309 -92737 -222395 42970 39078 -147195
9215a3734H939b7353k02924H1559k4848a01080c187j63043d8961q6754A95930
$$ -13734 8939 -27353 -230277 81559 56711 -101080 -3187 -166230 -48961 -135715 195930
9203b77686C1234b87288f9149b6364j62024j1416j49841A43350c38389L8519H9848
$$ -277686 31234 -287288 -69149 -26364 -188388 -199804 -349645 143350 -338389 -299870 89848
9191a38508n0196B992f4695o2262N2368H3294j7135m354a95746Q1936j46198I8793
$$ -138508 -188704 2992 -64695 -126957 -74589 83294 66159 61805 -195746 -113810 -260008 98793
9178d5330b2512A35580C0493a04976L2109G7057d81519i597l44240C66898p689
$$ -45330 -22512 135580 30493 -104976 -72867 77057 -481519 -9597 -353837 366898 359209
9167C59209a79235K3809f0192C034a7201r4037o311D9191K3500a24599j16834
$$ 359209 -179235 -155426 -60192 3034 -17201 -111238 -117549 49191 72691 -124599 -241433
9156b41433O3123M0604j00228J05555r0788a07395b0279H5699M4038b58667N7221
$$ -241433 -178310 -137706 -237934 -132379 -223167 -107395 -20279 85699 129737 -258667 -201446
9145b01446l9688d8979I0112c32891i0698a5941r3166a8762j77950P8130A04315
$$ -201446 -241134 -48979 90112 -332891 -90698 -15941 -109107 -18762 -196712 -118582 104315
9133C3370a73777o6157J3078Q7536A00666b0471E7439M5100b32533Q2151c7757
$$ 33370 -173777 -239934 -226856 -139320 100666 -20471 57439 102539 -232533 -150382 -37757
9121c79463Q9696P1127A7167a20093M8759A72720C2662b81531a6076j71555P6994
$$ -379463 -289767 -218640 17167 -120093 -71334 172720 32662 -281531 -16076 -187631 -110637
9110a10637C8660J13472e15387g1220j42836r639N0552G3831J4637i2245B71778
$$ -110637 38660 152132 -515387 -71220 -214056 -223695 -173143 73831 88468 -92245 271778
9098a34503f275A73572a87549A7771K5219K24882j4050p6596e7317b3189A00540
$$ -134503 -6275 173572 -187549 17771 42990 267872 253822 177226 -57317 -23189 100540
9086a58720n0425j34578a33073k5165Q195f9138E1381a11014c0746k6472r3987
$$ -158720 -209145 -343723 -133073 -158238 -150043 -69138 51381 -111014 -30746 -57218 -151205
9075a51205a3139r659H6215l6218N1126f4609j27311A5346R7533j4771i7370A74482
$$ -151205 -13139 -22798 86215 49997 101123 -64609 -191920 15346 112879 98108 -97370 174482
9062f3560r1755C9946K18223h6973l0856B02073a39266J9202e8034l21384C7331
$$ -63560 -155315 39946 258169 -86973 -117829 202073 -139266 -120064 -58034 -379418 37331
9050C6938J13153C7137J17197E3376J02681R3018L6212e3337G0401b97474E6018
$$ 36938 150091 37137 154334 53376 156057 249075 285287 -53337 70401 -297474 56018
9038d4898A4890a08457j65393B0465a83785f3477j81673j17057a365B8351J9716
$$ -44898 14890 -108457 -273850 20465 -183785 -63477 -245150 -362207 -1365 28351 48067
9027D8067J72583p3994c4641F4988a98246e8202m1937C13998j23727c3602o6156
$$ 48067 220650 146656 -34641 64988 -198246 -58202 -100139 313998 190271 -33602 -99758
9016i9758G892g8946A53379a69670A15727h7765C09472b68433J09041G9109L2429
$$ -99758 7892 -78946 153379 -169670 115727 -87765 309472 -268433 -159392 79109 111538
9005A11538J23925b27975K3626A06009E970g4965c6852A89048m5275D8281a10576
$$ 111538 235463 -227975 -204349 106009 5970 -74965 -36852 189048 143773 48281 -110576
8993a4376B65374d15431f3992o9782h866j4054H0699a72719H7077c53216A17099
$$ -14376 265374 -415431 -63992 -133774 -8866 -22920 80699 -172719 87077 -353216 117099
8981c20707a6817C0962a05279e1386G7502K94546c25520K4773A80836i7970j02092
$$ -320707 -16817 30962 -105279 -51386 77502 372048 -325520 -300747 180836 -97970 -200062
8970b00062g9159j41831R7468B34967I106b39453f7741r4849A01075a26799j18459
$$ -200062 -79159 -220990 -123522 234967 9106 -239453 -67741 -162590 101075 -126799 -245258
8959b45258l760l7169M5878E4973b79399A20478R0937c12692H5343e6657j67840
$$ -245258 -249018 -286187 -240309 54973 -279399 120478 211415 -312692 85343 -56657 -224497
8948b24497O6012n9513n4413G0162O454G371a35450n0625j8929C96d0268l16517
$$ -224497 -158485 -217998 -272411 70162 76616 7371 -135450 -186075 -205004 396 -40268 -356785
8936c56785D374K15665b8996o3383k50758d4168k18697A74647b09138j03581h8429
$$ -356785 4374 220039 -28996 -92379 -343137 -44168 -262865 174647 -209138 -312719 -88429
8924h2059A55380A1307M41928j12821H3994a98573c888j60003G1579O895B4154
$$ -82059 155380 11307 453235 340414 83994 -198573 -3888 -163891 71579 78474 24154
8912b98103J19576A09147a73685D9450M8640a00082j52242a24019j50055e4841
$$ -298103 -178527 109147 -173685 49450 98090 -100082 -252324 -124019 -274074 -54841
8901b58583E7058a44971A25077e5867A93661F2665K23602i0969M4018l0792l36896
$$ -258583 57058 -144971 125077 -55867 193661 62665 286267 -90969 -46951 -77743 -414639
8890d14639H483J09976e8056j14F3607a34884k11124a58730d6936r1901A97334
$$ -414639 8483 118459 -58056 -58170 63607 -134884 -346008 -158730 -46936 -138837 197334
8878b0884E11064A54918o1001c0814K088k871B67232b01603p1420P6065N8519
$$ -20884 511064 154918 93917 -30814 -28726 -31597 267232 -201603 -273023 -196958 -138439
8867a38439d368B24831a00031A77938b32982A43922a50301K3492b9574k21122
$$ -138439 -4368 224831 -100031 177938 -232982 143922 -150301 -126809 -29574 -250696
$$ [...]
##END NTUPLES=NMR SPECTRUM
##END=
