##TITLE=AC1734_SEN00007_9275963_ZU9xwk6SZo
##JCAMPDX= 6.0         $$ Bruker NMR JCAMP-DX V2.0
##DATA TYPE= NMR SPECTRUM
##DATA CLASS= NTUPLES
##ORIGIN= BRUKER
##OWNER= Administrator
$$ 1.72 TOPSPIN		Version 2.1
$$ 2015-07-18 01:21:09.838 -0700  Administrator@X
$$ Compression mode = diff/dup
##.OBSERVE FREQUENCY= 400.02188249412
##.OBSERVE NUCLEUS= ^1H
##.ACQUISITION MODE= SIMULTANEOUS (DQD)
##.ACQUISITION SCHEME= undefined
##.AVERAGES= 64
##.DIGITISER RES= 22
##SPECTROMETER/DATA SYSTEM= spect
##.PULSE SEQUENCE= noesygpps1d.comp
##.SOLVENT NAME= COFFEE_meoh
##.SHIFT REFERENCE= INTERNAL, COFFEE_meoh, 1, 14.96087
##AUDIT TRAIL= $$ (NUMBER, WHEN, WHO, WHERE, PROCESS, VERSION, WHAT)
$$ ##TITLE= Audit trail, TOPSPIN		Version 2.1
$$ ##JCAMPDX= 5.01
$$ ##ORIGIN= Bruker BioSpin GmbH
$$ ##OWNER= Administrator
$$ $$ E:\/data/COFFEE/nmr/AC1734_SEN00007_9275963_ZU9xwk6SZo/12/pdata/1/auditp.txt
$$ ##AUDIT TRAIL=  $$ (NUMBER, WHEN, WHO, WHERE, PROCESS, VERSION, WHAT)
(   1,<2015-07-18 01:21:04.525 -0700>,<Administrator>,<X>,<go>,<TOPSPIN 2.1>,
      <created by zg
	started at 2015-07-18 01:09:34.807 -0700,
	POWCHK enabled, PULCHK disabled,
       configuration hash MD5:
       21 0F 79 D6 B3 7B B4 F6 88 20 88 DB 03 48 BD 9F
       data hash MD5: 64K
       F9 03 40 9D 83 E7 DB F7 F8 A9 16 9F EC ED 68 A8>)
(   2,<2015-07-18 01:21:07.713 -0700>,<Administrator>,<X>,<proc1d>,<TOPSPIN 2.1>,
      <Start of raw data processing
       efp LB = 0.3 FT_mod = 6 PKNL = 1 PHC0 = 0 PHC1 = 0 SI = 128K 
       data hash MD5: 128K
       78 82 9A 62 EE 54 14 68 CE 2E 29 45 28 F6 3F 5B>)
(   3,<2015-07-18 01:21:08.619 -0700>,<Administrator>,<X>,<proc1d>,<TOPSPIN 2.1>,
      <pk PHC0 = 269.0002 PHC1 = 0 
       data hash MD5: 128K
       00 CF DF 79 94 DA A7 68 9E DA D7 22 C9 D0 0F 90>)
(   4,<2015-07-18 01:21:09.010 -0700>,<Administrator>,<X>,<proc1d>,<TOPSPIN 2.1>,
      <abs ABSG = 1 
       data hash MD5: 128K
       D0 9E 74 AC 78 51 BD EB 9B 6A E8 CE F1 1C 75 04>)
(   5,<2015-07-18 01:21:09.104 -0700>,<Administrator>,<X>,<proc1d>,<TOPSPIN 2.1>,
      <abs ABSG = 2 
       data hash MD5: 128K
       2F 36 A9 ED B6 B8 AE A0 06 B0 F0 32 A9 66 6C 71>)
(   6,<2015-07-18 01:21:09.197 -0700>,<Administrator>,<X>,<proc1d>,<TOPSPIN 2.1>,
      <abs ABSG = 3 
       data hash MD5: 128K
       29 BE D7 F6 D4 DC 34 80 DD 7A 25 2E B9 B0 2E AC>)
(   7,<2015-07-18 01:21:09.291 -0700>,<Administrator>,<X>,<proc1d>,<TOPSPIN 2.1>,
      <abs ABSG = 4 
       data hash MD5: 128K
       18 15 EA 6D 82 8C B2 04 3A 94 A7 88 92 A3 E0 2A>)
(   8,<2015-07-18 01:21:09.416 -0700>,<Administrator>,<X>,<proc1d>,<TOPSPIN 2.1>,
      <abs ABSG = 5 
       data hash MD5: 128K
       CA 5A 74 05 66 77 72 D0 AB 48 0F 0A 7A 09 93 5B>)
$$ ##END=
$$ 
$$ $$ hash MD5
$$ $$ 85 2F A5 CF D5 A4 42 A6 79 03 EC A1 00 C0 C1 14
##$RELAX= 
##$RELAX= 
##$RELAX= 
##$RELAX= 
##$RELAX= 
##$RELAX= 
##$RELAX= 
##$RELAX= 
$$ Bruker specific parameters
$$ --------------------------
##$DU= <E:\>
##$EXPNO= 12
$$ [...]
##$TP07= 0
##$TPNAME0= <>
##$TPNAME1= <>
##$TPNAME2= <>
##$TPNAME3= <>
##$TPNAME4= <>
##$TPNAME5= <>
##$TPNAME6= <>
##$TPNAME7= <>
##$TPOAL= (0..7)
0.5 0.5 0.5 0.5 0.5 0.5 0.5 0.5
##$TPOFFS= (0..7)
0 0 0 0 0 0 0 0
##$TUNHIN= 0
##$TUNHOUT= 0
##$TUNXOUT= 0
##$USERA1= <user>
##$USERA2= <user>
##$USERA3= <user>
##$USERA4= <user>
##$USERA5= <user>
##$V9= 5
##$VALIST= <valist>
##$VCLIST= <CCCCCCCCCCCCCCC>
##$VD= 0
##$VDLIST= <DDDDDDDDDDDDDDD>
##$VPLIST= <PPPPPPPPPPPPPPP>
##$VTLIST= <TTTTTTTTTTTTTTT>
##$WBST= 2048
##$WBSW= 25
##$XGAIN= (0..3)
0 0 0 0
##$XL= 0
##$YL= 0
##$YMAX_a= 6387165
##$YMIN_a= -11571405
##$ZGOPTNS= <>
##$ZL1= 120
##$ZL2= 120
##$ZL3= 120
##$ZL4= 120
##$ABSF1= 14.96087
##$ABSF2= -5.597312
##$ABSG= 5
##$ABSL= 3
##$ALPHA= 0
##$AQORDER= 0
##$ASSFAC= 0
##$ASSFACI= 0
##$ASSFACX= 0
##$ASSWID= 0
##$AUNMP= <proc_prof1d_extract.lims>
##$AXLEFT= 0
##$AXNAME= <>
##$AXNUC= <1H>
##$AXRIGHT= 0
##$AXTYPE= 0
##$AXUNIT= <>
##$AZFE= 0.1
##$AZFW= 0.1
##$BCFW= 0
##$BC_mod= 0
##$BYTORDP= 0
##$COROFFS= 0
##$CY= 15
##$DATMOD= 1
##$DC= 0
##$DFILT= <>
##$DTYPP= 0
##$F1P= 0
##$F2P= 0
##$FCOR= 0.5
##$FTSIZE= 131072
##$FT_mod= 6
##$GAMMA= 0
##$GB= 0
##$INTBC= 1
##$INTSCL= 1
##$ISEN= 128
##$LB= 0.3
##$LEV0= 0
##$LPBIN= 0
##$MAXI= 10000
##$MC2= 0
##$MEAN= 0
##$ME_mod= 0
##$MI= 0
##$NCOEF= 0
##$NC_proc= -2
##$NLEV= 6
##$NOISF1= 0
##$NOISF2= 0
##$NSP= 0
##$NTH_PI= 0
##$NZP= 0
##$OFFSET= 14.96087
##$PC= 1
##$PHC0= 269.0002
##$PHC1= 0
##$PH_mod= 1
##$PKNL= yes
##$PPARMOD= 0
##$PPDIAG= 0
##$PPIPTYP= 0
##$PPMPNUM= 2147483647
##$PPRESOL= 1
##$PSCAL= 4
##$PSIGN= 0
##$PYNMP= <proc.py>
##$REVERSE= no
##$SF= 400.020009688202
##$SI= 131072
##$SIGF1= 0
##$SIGF2= 0
##$SINO= 400
##$SIOLD= 131072
##$SPECTYP= <>
##$SREGLST= <1H.CDCl3>
##$SSB= 0
##$STSI= 131072
##$STSR= 0
##$SW_p= 8223.68421052631
##$SYMM= 0
##$S_DEV= 0
##$TDeff= 65536
##$TDoff= 0
##$TI= <>
##$TILT= no
##$TM1= 0
##$TM2= 0
##$TOPLEV= 0
##$USERP1= <user>
##$USERP2= <user>
##$USERP3= <user>
##$USERP4= <user>
##$USERP5= <user>
##$WDW= 1
##$XDIM= 131072
##$YMAX_p= 372034391
##$YMIN_p= -11161
##$CURPLOT= <Network HP LaserJet P1505>
##$CURPRIN= <$Network HP LaserJet P1505>
##$DFORMAT= <normdp>
##$LAYOUT= <+/1D_H.xwp>
##$LFORMAT= <normlp>
##$PFORMAT= <normpl>
##$SURQMSG= 1
$$ End of Bruker specific parameters
$$ ---------------------------------
##NTUPLES= NMR SPECTRUM
##VAR_NAME=  FREQUENCY,     SPECTRUM/REAL,   SPECTRUM/IMAG
##SYMBOL=    X,             R,               I
##VAR_TYPE=  INDEPENDENT,   DEPENDENT,       DEPENDENT
##VAR_FORM=  AFFN,          ASDF,            ASDF
##VAR_DIM=   131072,        131072,          131072
##UNITS=     HZ,            ARBITRARY UNITS, ARBITRARY UNITS
##FACTOR=    0.0627417313425164, 1,          1
##FIRST=     8223.62146879497, -233,         -53460
##LAST=      0,             1864,            -53932
##MIN=       0,             -11161,          0
##MAX=       8223.62146879497, 372034391,    0
$$ Real data points
##PAGE= N=1
##DATA TABLE= (X++(R..R)), XYDATA
$$ [...]
63938C211888K22640K22088K17793K08676J93973J73719J48870J20911R1033N9608
$$ 3211888 3434528 3656616 3874409 4083085 4277058 4450777 4599647 4720558 4811591 4871199
63928D871199K6578p748m2454p6457j08791j38482j64517j86135k02972k14893
$$ 4871199 4897777 4890029 4847575 4771118 4662327 4523845 4359328 4173193 3970221 3755328
63918C755328k21982k24721k23787k19558k12129k01945j89928j76754j62483
$$ 3755328 3533346 3308625 3084838 2865280 2653151 2451206 2261278 2084524 1922041
63909A922041j47262j31897j17311j03841r1587q0934p1983o3894n5652m7445
$$ 1922041 1774779 1642882 1525571 1421730 1330143 1249209 1177226 1113332 1057680 1010235
63899A010235m0407l5054l0864k7431k4987k3506k2339k1206k0687k1047k1427
$$ 1010235 969828 934774 903910 876479 851492 827986 805647 784441 763754 742707 721280
63888G21280k0900j9695j8553j7438j5860j4034j2634j1598j0141p992n738l851
$$ 721280 700380 680685 662132 644694 628834 614800 602166 590568 580427 572435 566697 562846
63876E62846k134k72J722L755N719P217P907Q237R141J0793J2311J2952J2987
$$ 562846 560712 560440 562162 565917 571636 578853 586760 594997 604138 614931 627242 640194 653181
63863F53181J2977J2872J2360J1642J1184J0881J0075Q365O098L948K236P34r94
$$ 653181 666158 679030 691390 703032 714216 725097 735172 743537 749635 753583 755819 756553 755559
63850G55559k983m818o173p307q692j0425j2325j4368j6410j7708j7623j6840
$$ 755559 752576 747758 741585 734278 725586 715161 702836 688468 672058 654350 636727 619887
63838F19887j6949j8468k0142k0699k0409k0188j9966j9018j7379j5819j4557
$$ 619887 602938 584470 564328 543629 523220 503032 483066 464048 446669 430850 416293
63827D16293j3168j1745j1089j1328j1338j0119q157o788o551o796o712o104n170
$$ 416293 403125 391380 380291 368963 357625 347506 339349 332561 326010 319214 312502 306398 301228
63814C01228m108l093k379k063j933j707j420j385j784k397k774k599j955j314
$$ 301228 297120 294027 291648 289585 287652 285945 284525 283140 281356 278959 276185 273586 271631 270317
63800B70317j188j652k250k553k636k775k821k379j639j348j700j952j586j216
$$ 270317 269129 267477 265227 262674 260038 257263 254442 252063 250424 249076 247376 245424 243838 242622
63786B42622j533k036j731q08m20q79j275j039p37q30p81j01O08N57M1q9K60M94
$$ 242622 241089 239053 237322 236514 236094 235215 233940 232901 232164 231334 230553 230452 231060 231617 231658 231569 231829 232323
63768B32323M32M40O11N87K23j86m59p70j243j677j766j401p49j89OO1N34J485
$$ 232323 232755 233195 233806 234393 234616 234430 233971 233201 231958 230281 228515 227114 226365 226176 226182 226243 226777 228262
63750B28262K186K015J356J102J501J994K131K058K026J911J468Q57O71J376K690
$$ 228262 230448 232463 233819 234921 236422 238416 240547 242605 244631 246542 248010 248867 249538 250914 253604
63735B53604L693L706L033K441K117J586P41K53O50J610K495L063L314L184K939
$$ 253604 257297 261003 264036 266477 268594 270180 270921 271174 271824 273434 275929 278992 282306 285490 288429
63720B88429L279M409N418N239L978K657J848J183R9j427k825l375k883k101k046
$$ 288429 291708 296117 301535 306774 310752 313409 315257 316440 316539 315112 312287 308912 306029 303928 301882
63705C01882k726l108k624j885j462q68M20J699J919J307J044J676K764L752M267
$$ 301882 299156 296048 293424 291539 290077 289209 289629 291328 293247 294554 295598 297274 300038 303790 308057
63690C08057L937K903K140K262K455J666L04n09q75j624k261j371P72K016J349
$$ 308057 311994 314897 317037 319299 321754 323420 323724 323215 322340 320716 318455 317084 317856 319872 321221
63675C21221L13N64J596K008J683J436J423J202P61L96ko25j139j222j267j842
$$ 321221 321534 322098 323694 325702 327385 328821 330244 331446 332207 332603 332601 331976 330837 329615 328348 326506
63659C26506k757l385l548l518l419l267l168l021k333r94J77K43o64j528j615
$$ 326506 323749 320364 316816 313298 309879 306612 303444 300423 298090 297096 297273 297516 296852 295324 293709
63644B93709j011k07M42R57J644K609L354L305K833K990M027M910M808M288M440
$$ 293709 292698 292491 292933 293890 295534 298143 301497 304802 307635 310625 314652 319562 324370 328658 333098
63629C33098N386O398P013P338P630Q173R284J0826J2075J2549J2701J3246J4256
$$ 333098 338484 344882 351895 359233 366863 375036 384320 395146 407221 419770 432471 445717 459973
63616D59973J5389J6634J8162J9793K1260K2725K4419K6053K7103K7430K7034
$$ 459973 475362 491996 510158 529951 551211 573936 598355 624408 651511 678941 705975
63605G05975K5498K2354J7823J2655P489K731j208m199o574q450r297q775p721
$$ 705975 731473 753827 771650 784305 791794 794525 793317 789118 782544 774094 764797 756022 748301
63592G48301p474q487j0202j2133j4221j6270j7889j9071k0148k1029k1132k0190
$$ 748301 740827 732340 722138 710005 695784 679514 661625 642554 622406 601377 580245 560055
63580E60055j8576j6748j4724j2332r644p077n213m256l556j989P38L544N148
$$ 560055 541479 524731 510007 497675 488031 480954 475741 471485 467929 465940 466678 470222 475370
63567D75370N489N422N476N609N913O673P776Q760R508J0323J1349J2469J3776
$$ 475370 480859 486281 491757 497366 503279 509952 517728 526488 535996 546319 557668 570137 583913
63554E83913J5512J7604J9657K1491K3249K5153K7483L0416L3242L4119L1478
$$ 583913 599425 617029 636686 658177 681426 706579 734062 764478 797720 831839 863317
63543H63317K5569J8055J0339L040l253p902j0870j2563j2927j1629r253p251
$$ 863317 888886 906941 917280 920320 917067 909165 898295 885732 872805 861176 851923 844672
63531H44672o539o993q459j1212j5051j8961k2168k4752k6806k7870k7760k7126
$$ 844672 838133 831140 822681 811469 796418 777457 755289 730537 703731 675861 648101 620975
63519F20975k6596k5992k4934k3509k1747j9207j5828j2628j0680r840r181q308
$$ 620975 594379 568387 543453 519944 498197 478990 463162 450534 439854 430014 420833 412525
63507D12525p458o744o092n707n749n697m844l347k119j648j616j635j708j743
$$ 412525 405067 398323 392231 386524 380775 375078 370234 366887 364768 363120 361504 359869 358161 356418
63493C56418j360n08J91J39m49p84l40O87J664K043J741J176R39J269J864K226
$$ 356418 355058 354550 354741 354880 354431 353647 353307 353994 355658 357701 359442 360618 361557 362826 364690 366916
63477C66916K217K172K402K692K451J444J00j029j902k762l527l822l596l250
$$ 366916 369133 371305 373707 376399 378850 380294 380394 379365 377463 374701 371174 367352 363756 360506
63463C60506l077k965k710k251j486l34Q93J687K034K486L280L975M267M569N243
$$ 360506 357429 354464 351754 349503 348017 347683 348576 350263 352297 354783 358063 362038 366305 370874 376117
63448C76117N854N878N806O658Q517J0333J1278J1601J2005J2868J4309J6402
$$ 376117 381971 387849 393655 400313 408830 419163 430441 442042 454047 466915 481224 497626
63436D97626J8880K1078K2571K3559K4171K3753K1444J7466J3312J0440R163Q899
$$ 497626 516506 537584 560155 583714 607885 631638 653082 670548 683860 694300 703463 712362
63424G12362R222J0270J2308J5238J8676K2230K5559K8226K9700K9618K7976K5012
$$ 712362 721584 731854 744162 759400 778076 800306 825865 854091 883791 913409 941385 966397
63412I66397K0956J5915J0037L763k089o643r421j0586j0802j0882j1418j2550
$$ 966397 987353 1003268 1013305 1017068 1014979 1008336 998915 988329 977527 966645 955227 942677
63400I42677j4031j5648j7564k0119k3248k6298k8608l0004l0640l0517k9478
$$ 942677 928646 912998 895434 875315 852067 825769 797161 767157 736517 706000 676522
63389F76522k7542k4986k2122j9257j6802j5034j3675j1966r406o280l339j065
$$ 676522 648980 623994 601872 582615 565813 550779 537104 525138 515732 509452 506113 505048
63377E05048O37K113L524M825O025P335Q898J0526J1889J3001J4215J5650J6914
$$ 505048 505685 507798 511322 516147 522172 529507 538405 548931 560820 573821 588036 603686 620600
63364F20600J7640J8132J9146K1102K3660K6093K7869K8959K9699L0207K9910
$$ 620600 638240 656372 675518 696620 720280 746373 774242 803201 832900 863107 893017
63353H93017K7901K3924J8714J3121P344J461l786p500r754j1370j2622j2965
$$ 893017 920918 944842 963556 976677 984021 985482 981696 974196 964442 953072 940450 927485
63341I27485j2297j1641j2049j3481j5316j7500k0446k3948k6908k8344k8278
$$ 927485 915188 903547 891498 878017 862701 845201 824755 800807 773899 745555 717277
63330G17277k7437k6314k4756k2410j9348j6069j2968r981o950m079j868p87j260
$$ 717277 689840 663526 638770 616360 597012 580943 567975 557994 551044 546965 545097 544310 543050
63317E43050l703p972j2772j6210j7249j6398j4889j3546j2548j1752j0848r469
$$ 543050 539347 531375 518603 502393 485144 468746 453857 440311 427763 416011 405163 395694
63305C95694p606n791m611m110l849l508l127k896k817k675k298j879j925k634
$$ 395694 388088 382297 377686 373576 369727 366219 363092 360196 357379 354704 352406 350527 348602 345968
63291C45968l445l586l031k508k413k290j701j086j158j743j906j246m39k53n44
$$ 345968 342523 338937 335906 333398 330985 328695 326994 325908 324750 323007 321101 319855 319416 319163 318619
63276C18619n62n4M42M05N6L3N17R77Q96M31K15O01J316J815J781J348J031J370
$$ 318619 318057 318003 318445 318850 318906 318939 319456 320433 321329 321760 321975 322576 323892 325707 327488 328836 329867 331237
63258C31237K446L705M391M266L750L456L667M175M547M556M506M949N987P109
$$ 331237 333683 337388 341779 346045 349795 353251 356918 361093 365640 370196 374702 379651 385638 392747
63244C92747P897Q602R638J0817J1610J1971J2370J3056J3897J4885J6191J7608
$$ 392747 400644 409246 418884 429701 441311 453282 465652 478708 492605 507490 523681 541289
63232E41289J8559J8856J8949J9165J9268J9057J8888J9146J9629J9864J9800
$$ 541289 559848 578704 597653 616818 636086 655143 674031 693177 712806 732670 752470
63221G52470J9758J9865J9881J9577J8959J8246J7680J7294J6681J5223J2586
$$ 752470 772228 792093 811974 831551 850510 868756 886436 903730 920411 935634 948220
63210I48220Q957M714J78m345q555j2407j6099j9695k2857k5063k5937k5429k3889
$$ 948220 957177 961891 962069 957724 949169 936762 920663 900968 878111 853048 827111 801682 777793
63197G77793k1913j9863j7662j5259j2981j0975q687n644k562o64J73J524M309
$$ 777793 755880 736017 718355 703096 690115 679140 670453 664809 662247 661583 661756 663280 667589
63184F67589P555R808J0941J1823J2853J3673J4060J4218J4325J4328J4181J3920
$$ 667589 675144 684952 695893 707716 720569 734242 748302 762520 776845 791173 805354 819274
63172H19274J3609J3395J3410J3329J2434J0402P703M935K093j095m616q241j1805
$$ 819274 832883 846278 859688 873017 885451 895853 903556 908491 910584 909489 904873 896632 884827
63159H84827j5083j7801k0075k2296k4260k5097k4540k3547k2984k2388k0873
$$ 884827 869744 851943 831868 809572 785312 760215 735675 712128 689144 666756 645883
63148F45883j8725j7004j5896j4568j2604j0553q955p687o478n391m497l654k810
$$ 645883 627158 610154 594258 579690 567086 556533 547578 539891 533413 528022 523525 519871 517061
63135E17061k130j683j259o08L29J335J955J893J593J981L302M719N493N901O328
$$ 517061 514931 513248 511989 511381 511710 513045 515000 516893 518486 520467 523769 528488 533981 539882 546210
63120E46210O245N148L904L833M633M661L288J759J347J846K371K571K468J972
$$ 546210 552455 557603 561507 565340 569973 574634 577922 579681 581028 582874 585245 587816 590284 592256
63106E92256J243Q97J207J598J459R26M68J42j98m41m82n66q77j079p53m1N07
$$ 592256 593499 594396 595603 597201 598660 599586 600054 600196 599998 599557 599075 598509 597632 596553 595800 595759 596266
63089E96266N64K20k22l42K08J286K235K501K201J920K169L100M401N368N550
$$ 596266 596830 597050 596828 596486 596694 597980 600215 602716 604917 606837 609006 612106 616507 621875 627425
63074F27425N423O012P517Q864R040Q479Q531R800J1569J2867J3598J4399J5707
$$ 627425 632848 638860 646377 655241 664281 672760 681291 691091 702660 715527 729125 743524 759231
63061G59231J7301J8780K0295K2424K5314K8255L0542L2400L4580L7206L9700
$$ 759231 776532 795312 815607 838031 863345 891600 922142 954542 989122 1026328 1066028
63050A066028M1768M3699M5490M6524M6576M6439M6903M7613M7627M6780M5791
$$ 1066028 1107796 1151495 1196985 1243509 1290085 1336524 1383427 1431040 1478667 1525447 1571238
63039A571238M5150M4617M3916M3289M3050M2879M1909L9440L5509L0738K5627
$$ 1571238 1616388 1661005 1704921 1748210 1791260 1834139 1876048 1915488 1950997 1981735 2007362
63028B007362J9979J3129M667n142j5595k5941l5482m3629n0136n5138n8865o1318
$$ 2007362 2027341 2040470 2045137 2039995 2024400 1998459 1962977 1919348 1869212 1814074 1755209 1693891
63016A693891o2260o1328n8287n3415m7672m2094l6897l1461k5268j8581j2086
$$ 1693891 1631631 1570303 1512016 1458601 1410929 1368835 1331938 1300477 1275209 1256628 1244542
63005A244542o284j359K709O180R480J2798J5888J8415K0288K1579K2312K2566
$$ 1244542 1238258 1236899 1239608 1245788 1255268 1268066 1283954 1302369 1322657 1344236 1366548 1389114
62993A389114K2550K2484K2514K2755K3129K3184K2435K0919J8964J6376J2432
$$ 1389114 1411664 1434148 1456662 1479417 1502546 1525730 1548165 1569084 1588048 1604424 1616856
62982A616856O966Q85m820j0166j5861k2118k8313l3667l7959m1560m4891m7756
$$ 1616856 1623822 1624707 1619887 1609721 1593860 1571742 1543429 1509762 1471803 1430243 1385352 1337596
62970A337596m9250m8676m6564m4223m2225l9935l6845l3556l0936k8917k6928
$$ 1337596 1288346 1239670 1193106 1148883 1106658 1066723 1029878 996322 965386 936469 909541
62959I09541k5032k3721k2850k1695k0094j8707j7987j7545j6843j5956j5359
$$ 909541 884509 860788 837938 816243 796149 777442 759455 741910 725067 709111 693752
62948F93752j5244j5335j5160j4401j3118j1717j0559r654q827q059p364o600
$$ 693752 678508 663173 648013 633612 620494 608777 598218 588564 579737 571678 564314 557714
62936E57714n709n052n026n420n581n218m555l728k534r92L61R71Q08J82o32j406
$$ 557714 552005 546953 541927 536507 530926 525708 521153 517425 514891 513899 514260 515231 516039 516221 515589 514183
62920E14183j848j820j506j203j042j041j258j665k030k173k217k417k745k932
$$ 514183 512335 510515 509009 507806 506764 505723 504465 502800 500770 498597 496380 493963 491218 488286
62906D88286k873k824l081l590l946l767k995j882p85j1K79J35j94m26m42k81
$$ 488286 485413 482589 479508 475918 471972 468205 465210 463328 462543 462532 462811 462946 462752 462326 461884 461603
62890D61603%L08M49K52j69m36l35rL03N19N96M18P8K2N17J132J103L28m79p19
$$ 461603 461603 461911 462360 462612 462443 462007 461672 461663 461966 462485 463081 463499 463577 463599 464116 465248 466351 466679 466200 465481
62870D65481o13p06j025j153r61p57o79m66m3J35k41p39p46m57n35q89n95O95
$$ 465481 464868 464162 463137 461984 461023 460266 459587 459121 459078 459213 458972 458233 457487 457030 456495 455606 455011 455706
62852D55706K007K251J589R48O71M50K35K98M83K82k49n41n65r45j728j966j074
$$ 455706 457713 459964 461553 462501 463172 463622 463857 464155 464638 464920 464671 464130 463565 462620 460892 458926 457852
62835D57852J95P56N98M91O93P93N60K43Q0J02L66Q93J461J874K355L225M195
$$ 457852 458047 458803 459401 459892 460585 461378 461938 462181 462261 462363 462729 463622 465083 466957 469312 472537 476732
62818D76732M516L906K961K513K833L505L955M017M074M536N235N592N475N448
$$ 476732 481248 485154 488115 490628 493461 496966 500921 504938 509012 513548 518783 524375 529850 535298
62804E35298N934O576O882P131Q007R494J0753J1122J0751J0280J0296J1163J2955
$$ 535298 541232 547808 554690 561821 569828 579322 590075 601197 611948 622228 632524 643687 656642
62791F56642J5430J8272K1378K4711K8094L1398L4847L8739M2978M7238N1433
$$ 656642 672072 690344 711722 736433 764527 795925 830772 869511 912489 959727 1011160
62780A011160N5666N9810O3557O6775O9404P1142P1640P0960O9307O6356O1329
$$ 1011160 1066826 1126636 1190193 1256968 1326372 1397514 1469154 1540114 1609421 1675777 1737106
62769A737106N3833M4225L3189K1346R246k767j4733k6662l7955m7728n5688o2174
$$ 1737106 1790939 1835164 1868353 1889699 1898945 1896178 1881445 1854783 1816828 1769100 1713412 1651238
62757A651238o7259p0517p1796p1628p0536o8464o5319o1588n7995n4739n1455
$$ 1651238 1583979 1513462 1441666 1370038 1299502 1231038 1165719 1104131 1046136 991397 939942
62746I39942m7779m3724l9577l5631l1935k8385k5127k2676k1190j9838j7594
$$ 939942 892163 848439 808862 773231 741296 712911 687784 665108 643918 624080 606486
62735F06486j4633j2232j1068j0355r034p147n474m310l298k199j189m74K4O06
$$ 606486 591853 579621 568553 558198 549164 542017 536543 532233 528935 526736 525547 525073 525097 525703
62721E25703J648L234M811N516N205M802N282O635Q262R960J1945J4196J6436
$$ 525703 527351 530585 535396 540912 546117 550919 556201 562836 571098 581058 593003 607199 623635
62708F23635J8641K0962K3227K5145K6993K9523L2949L6600L9679M2037M4045
$$ 623635 642276 663238 686465 711610 738603 768126 801075 837675 877354 919391 963436
62697I63436M6054M8165N0226N1867N2717N2617N1445M8855M4604L9050L2783
$$ 963436 1009490 1057655 1107881 1159748 1212465 1265082 1316527 1365382 1409986 1449036 1481819
62686A481819K5685J6980O538m444j4568k3637l2344m0724m7697n2307n4812n6261
$$ 1481819 1507504 1524484 1531022 1526578 1512010 1488373 1456029 1415305 1367608 1315301 1260489 1204228
62674A204228n7255n7552n6643n4356n0892m6714m2536l9049l6358l3859l0954
$$ 1204228 1146973 1089421 1032778 978422 927530 880816 838280 799231 762873 729014 698060
62663F98060k7755k4823k2342k0076j8064j6741j6064j5099j3101j0648r105q961
$$ 698060 670305 645482 623140 603064 585000 568259 552195 537096 523995 513347 504242 495281
62651D95281r330r111q116o928o082n697n531n071l928k395j362j339j741j532
$$ 495281 485951 476840 468724 461796 455714 450017 444486 439415 435487 433092 431730 430391 428650 427118
62637D27118m73O94J230J215J164J178Q07k34j464k030j705j216j301j634j220
$$ 427118 426645 427339 428569 429784 430948 432126 432933 432699 431235 429205 427500 426284 424983 423349 422129
62622D22129J61J487J823J601K004L343M744N322N106M672M496M773N409N971
$$ 422129 422290 423777 425600 427201 429205 432548 437292 442614 447720 452392 456888 461661 467070 473041
62608D73041O106O201P091Q868J0511J1211J1566J2788J5084J7567J9688K1921
$$ 473041 479147 485348 492439 501307 511818 523029 534595 547383 562467 580034 599722 621643
62596F21643K4823K8056L0775L2644L4007L5169L5827L5306L3244K9994K6283
$$ 621643 646466 674522 705297 737941 771948 807117 842944 878250 911494 941488 967771
62585I67771K2409J7979J2565O420K48n613j1324j6922k1977k5965k8733l0482
$$ 967771 990180 1008159 1020724 1027144 1027392 1021779 1010455 993533 971556 945591 916858 886376
62573H86376l1600l2460l3065l2857l1345k8945k6738k5247k3931k2057j9559
$$ 886376 854776 822316 789251 756394 725049 696104 669366 644119 620188 598131 578572
62562E78572j6838j4263j2223j1079j0538r606p797o008n456n986o246n409l973
$$ 578572 561734 547471 535248 524169 513631 504025 496228 490220 484764 478778 472532 467123 463150
62549D63150k795k139j853j787j667j081k1R00J131P95M16K64L42O81J313K045
$$ 463150 460355 458216 456363 454576 452909 451828 451807 452707 453838 454633 455049 455313 455655 456336 457649 459694
62533D59694K577K816K910L052L394M094N176O455P688Q796R902J1190J2785J4672
$$ 459694 462271 465087 467997 471049 474443 478537 483713 490168 497856 506652 516554 527744 540529 555201
62519E55201J6721J8837K1096K3518K5778K7416K8477K9621L1369L3458L5133
$$ 555201 571922 590759 611855 635373 661151 688567 717044 746665 778034 811492 846625
62508H46625L5870L5535L4120L1699K8627K5324K1813J7789J3215Q571M332N47
$$ 846625 882495 918030 952150 983849 1012476 1037800 1059613 1077402 1090617 1099188 1103520 1104067
62496A104067k788n177n896m731k178J094M719Q522J2369J6355K0818K5879L1010
$$ 1104067 1101279 1096102 1090206 1085475 1083297 1084391 1089110 1097632 1110001 1126356 1147174 1173053 1204063
62483A204063L5422L8762M1215M2940M3638M2714L9536L3642K5133J5068N072
$$ 1204063 1239485 1278247 1319462 1362402 1406040 1448754 1488290 1521932 1547065 1562133 1567205
62472A567205l865j2135k0850l0481m0336m9234n6362o1488o4620o5778o5073
$$ 1567205 1563340 1551205 1530355 1499874 1459538 1410304 1353942 1292454 1227834 1162056 1096983
62461A096983o2942o0020n6700n2857m8221m2907l7394l2055k7056k2650j9133
$$ 1096983 1034041 974021 917321 864464 816243 773336 735942 703887 676831 654181 635048
62450F35048j6278j3357j0052p004m984l793k509p06J087K195K574K690K992L663
$$ 635048 618770 605413 595361 588357 583373 579580 577071 576365 577452 579647 582221 584911 587903 591566
62436E91566M539N057M556K836M29j862l566m705n523o287p209q359r540j0310
$$ 591566 596105 601162 605718 608554 608983 607121 603555 598850 593327 587040 579831 571472 561932 551622
62422E51622j0310r628q847q505q523q256p213n618m214l625l893m506m795m502
$$ 551622 541312 531684 522837 514332 505809 497553 490340 484722 480508 476883 472990 468484 463689 459187
62408D59187l981l657l379k653j506o41m35l75J46Q89J227J138J160J467J710
$$ 459187 455206 451549 448170 445517 444011 443370 442935 442560 442706 443595 444822 445960 447120 448587 450297
62393D50297J789K082K707L100K718J835J299J619K515L345L743L907M326N282
$$ 450297 452086 454168 456875 459975 462693 464528 465827 467446 469961 473306 477049 480956 485282 490564
62379D90564O649P988Q783Q746Q246Q334R828J2159J3696J3568J2713J2744J4154
$$ 490564 497213 505201 513984 522730 530976 539310 549138 561297 574993 588561 601274 614018 628172
62366F28172J6244J8384K0667K3413K6639L0073L3299L6015L8507M1469M4936
$$ 628172 644416 662800 683467 706880 733519 763592 796891 832906 871413 912882 957818
62355I57818M7764M8790M8165M6681M4182L9672L2995K5238J7398R584J921m895
$$ 957818 1005582 1054372 1102537 1149218 1193400 1233072 1266067 1291305 1308703 1318287 1320208 1315313
62343A315313j0424j5153j9753k4282k8529l2495l5930l8057l8415l7557l6288
$$ 1315313 1304889 1289736 1269983 1245701 1217172 1184677 1148747 1110690 1072275 1034718 998430
62332I98430l4628l2094k8724k5176k1985j9280j7060j5353j4119j3353j3185
$$ 998430 963802 931708 902984 877808 855823 836543 819483 804130 790011 776658 763473
62321G63473j3597j4194j4577j4790j5094j5428j5446j4949j4006j2671j0857
$$ 763473 749876 735682 721105 706315 691221 675793 660347 645398 631392 618721 607864
62310F07864q583o224m372l303k629j710n53P5k27p16m59K94N06n8n58m35r5m2
$$ 607864 599281 593057 588685 585382 582753 581043 580490 580565 580338 579622 579163 579457 579963 579905 579347 578912 578817 578775
62292E78775k58p05j496k191j878n70M01N2r03j137l88O78J671K562L122L196
$$ 578775 578517 577812 576316 574125 572247 571677 572078 572130 571227 570090 569702 570380 572051 574613 577735 580931
62276E80931L286M033N316O565P626Q676R586J0202J0949J2400J4355J6111J7509
$$ 580931 584217 588250 593566 600131 607757 616433 626019 636221 647170 659570 673925 690036 707545
62263G07545J9088K1311K4230K7758L1650L5488L9113M2816M6534M9413N0791
$$ 707545 726633 747944 772174 799932 831582 867070 906183 948999 995533 1044946 1095737
62252A095737N0995N0286M7639M1922L3868K5511J7802J0176K454m452j0165j5709
$$ 1095737 1146732 1197018 1244657 1286579 1320447 1345958 1363760 1373936 1376390 1371938 1361773 1346064
62240A346064k1997k8617l4741m0195m4851m7957m9080m8938m8325m6845m3700
$$ 1346064 1324067 1295450 1260709 1220514 1175663 1127706 1078626 1029688 981363 934518 890818
62229H90818l9288l4966l1466k8416k5346k2329j9544j6955j4572j2536j0800
$$ 890818 851530 816564 785098 756682 731336 709007 689463 672508 657936 645400 634600
62218F34600r124p485o173n376m953m651m329l992l725l584l366k653j308J25
$$ 634600 625476 617991 611818 606442 601489 596838 592509 588517 584792 581208 577842 575189 573881 574006
62204E74006R14J010J142J924L104L957M268M615N592O940P799P802P553P841
$$ 574006 574920 575930 577072 578996 582100 586057 590325 594940 600532 607472 615271 623073 630626 638467
62190F38467Q626R209R199Q936Q996R652J0858J2299J3332J3305J2182J0644R423
$$ 638467 647093 656302 665501 674437 683433 693085 703943 716242 729574 742879 755061 765705 775128
62177G75128Q716Q369Q311Q546R001R702J0972J3222J6440K0098K3485K6208K8375
$$ 775128 783844 792213 800524 809070 818071 827773 838745 851967 868407 888505 911990 938198 966573
62164I66573L0393L2445L4107L4589L3301L0202K5663K0206J4309Q308K427l029
$$ 966573 996966 1029411 1063518 1098107 1131408 1161610 1187273 1207479 1221788 1230096 1232523 1229494
62152A229494p629j1216j4203j7210k0459k3768k6993l0004l2286l3085l2186
$$ 1229494 1221865 1210649 1196446 1179236 1158777 1135009 1108016 1078012 1045726 1012641 980455
62141I80455l0181k7754k5057k1915j8441j5072j2232j0080q460p047n659m561
$$ 980455 950274 922520 897463 875548 857107 842035 829803 819723 811263 804216 798557 793996
62129G93996m204m587n158n414n313m982m306l065j305O77K560M134N323O209
$$ 793996 789792 785205 780047 774633 769320 764338 760032 756967 755662 756339 758899 763033 768356 774565
62115G74565O790O686N380K943K40j851l165l951m142l417k027j071j622l615
$$ 774565 781355 788041 793421 796364 796604 794753 791588 787637 783495 780078 778051 776980 775358 771743
62101G71743n778o794o510n895n761n756m913l042j083L0M10Q08J541K278K776
$$ 771743 765965 759171 752661 746766 741005 735249 730336 727294 726211 726241 726651 727459 729000 731278 734054
62086G34054L264M030M948N697O257O917P806Q720R494J0293J1358J2554J3533
$$ 734054 737318 741348 746296 751993 758250 765167 772973 781693 791187 801480 812838 825392 838925
62073H38925J4292J5165J6206J6976J7248J7537J8494J9978K1251K1960K2418
$$ 838925 853217 868382 884588 901564 918812 936349 954843 974821 996072 1018032 1040450
62062A040450K2920K3207K2713K0944J7615J2887P555K592j688n692r692j3382
$$ 1040450 1063370 1086577 1109290 1130234 1147849 1160736 1168291 1170883 1169195 1163503 1153811 1140429
62050A140429j6477j9292k2286k5368k8023k9954l1255l2120l2695l3052l3016
$$ 1140429 1123952 1104660 1082374 1057006 1028983 999029 967774 935654 902959 869907 836891
62039H36891l2155l0269k7830k5616k3878k2170k0081j7877j6222j5358j4753
$$ 836891 804736 774467 746637 721021 697143 674973 654892 637015 620793 605435 590682
62028E90682j3669j1971j0234r008q199p398o587o167o242o377o241o078o132
$$ 590682 577013 565042 554808 545800 537601 530203 523616 517449 511207 504830 498589 492511 486379
62015D86379n932m783k951j707j820k461k161o82P58J176J060J446K398L116L282
$$ 486379 480447 475664 472713 471006 469186 466725 464564 463882 464640 465816 466876 468322 470720 473836 477118
62000D77118L415L843M195M180M109M231M181L564K602J622M60j102k789m343
$$ 477118 480533 484376 488571 492751 496860 501091 505272 508836 511438 513060 513520 512418 509629 505286
61986E05286o066q058r442r331q280p677p784p564o504n424n036m789l851k503
$$ 505286 499220 491162 481720 472389 464109 456432 448648 441084 434580 429156 424120 419331 415480 412977
61972D12977j710j757j981j773j275j067j398j805j554n41N12J010J292J960K737
$$ 412977 411267 409510 407529 405756 404481 403414 402016 400211 398657 398116 398628 399638 400930 402890 405627
61957D05627K798K129J573J534J528J289J313J974K975M074N493P088P998P846
$$ 405627 408425 410554 412127 413661 415189 416478 417791 419765 422740 426814 432307 439395 447393 455239
61943D55239P543Q174R649J1113J2076J2458J2159J1361J0825J1053J1523J1441
$$ 455239 462782 470956 480605 491718 503794 516252 528411 539772 550597 561650 573173 584614
61931E84614J0825J0155R373Q125O624N401M402L143J575L8j442l011m334m968
$$ 584614 595439 605594 614967 623092 629716 635117 639519 642662 644237 644275 642833 639822 635488 630520
61917F30520n199n591n842m994k901n12J475L295N251P016Q243R098R779J0036
$$ 630520 625321 619730 613888 608894 605993 605481 606956 610251 615502 622518 630761 639859 649638 659674
61903F59674R669Q862P672N640K535r16l591n122o053p052q270r424j0136j0203
$$ 659674 669343 678205 685877 691517 694052 693136 689545 684423 678370 671318 663048 653624 643488 633285
61889F33285r705q897p980p069o392o194o410o633o658o782p374q266q847q753
$$ 633285 623580 614683 606703 599634 593242 587048 580638 574005 567347 560565 553191 544925 536078 527325
61875E27325q247p832p610p171o088m468k858j702r32j59R26K300L653M656N362
$$ 527325 519078 511246 503636 496465 490377 485909 483051 481349 480417 480258 481184 483484 487137 491793 497155
61860D97155O284P809R622J1065J2093J3367J5237J7191J8593J9489K0227K0794
$$ 497155 503439 511248 520870 531935 544028 557395 572632 589823 608416 627905 648132 668926
61848F68926K1100K1471K2170K2630K1919J9893J7200J4201J0619O437K401p21
$$ 668926 690026 711497 733667 756297 778216 798109 815309 829510 840129 846566 848967 848246
61836H48246k946m820o658q280r259r220q104o205l806q50K707O206Q502R100
$$ 848246 845300 840480 833822 825542 816283 807063 798959 792754 788948 788098 790805 797011 805513 814613
61822H14613Q653Q018P109N155J896j975n646r041j2453j5641j7786j8569j8747
$$ 814613 823266 831284 838393 843548 845444 843469 837823 828782 816329 800688 782902 764333 745586
61809G45586j9197j9659j9163j7647j6261j5789j5516j4344j2428j0886j0154
$$ 745586 726389 706730 687567 669920 653659 637870 622354 608010 595582 584696 574542
61798E74542r548q409o936n712n017m844n049n291n122m413l461k623k053j794
$$ 574542 564994 556585 549649 543937 538920 534076 529027 523736 518614 514201 510740 508117 506064 504270
61784E04270j810j878j696j206o04j20J8m17j346k196k417k093j706j383r04l27
$$ 504270 502460 500582 498886 497680 497076 496956 496974 496557 495211 493015 490598 488505 486799 485416 484512 484185
61768D84185j4K5K56R17J666K140K467K919L420L607L288K646K142K123K377K215
$$ 484185 484171 484196 484452 485369 487035 489175 491642 494561 497981 501588 504876 507522 509664 511787 514164 516379
61752E16379J296J95l34m17q14j708k478k768k995l505l904l736l267l110l384
$$ 516379 517675 517870 517536 517119 516305 514597 512119 509351 506356 502851 498947 495211 491944 488834 485450
61737D85450l644l403k440r14N25J144R50P49J099J605J666J476J661K211K437
$$ 485450 481806 478403 475963 475049 475574 476718 477668 478417 479516 481121 482787 484263 485924 488135 490572
61722D90572K008J348R85R57J098J416J934K354K257J561N83k79q60j214j499
$$ 490572 492580 493928 494913 495870 496968 498384 500318 502672 504929 506490 507073 506794 505934 504720 503221
61707E03221j878k451l110l549l539l252l116l300l509l477l378l536l835l846
$$ 503221 501343 498892 495782 492233 488694 485442 482326 479026 475517 472040 468662 465126 461291 457445
61693D57445l450l055l040l332l612l686l558l322l102k957k771k358j758j252
$$ 457445 453995 450940 447900 444568 440956 437270 433712 430390 427288 424331 421560 419202 417444 416192
61679D16192j111j409k023k591k542j551j21O73K17r41j683j475p50k14n0M5K56
$$ 416192 415081 413672 411649 409058 406516 404965 404844 405517 405734 404793 403110 401635 400885 400671 400621 400666 400922
61662D00922M19N00R08J968L242L848L546L019K886K962K740K152J457P84K69
$$ 400922 401341 401841 402749 404717 407959 411807 415353 418372 421258 424220 426960 429112 430569 431353 431622
61647D31622K37P78J405J664J790K199K651K597K109J714J456Q95M3n51o79p58
$$ 431622 431859 432637 434042 435706 437496 439695 442346 444943 447052 448766 450222 451117 451160 450609 449930 449172
61631D49172j057j339j512j933k802l744m322m521m505m262l747l015k113j168
$$ 449172 448115 446776 445264 443331 440529 436785 432463 427942 423437 419175 415428 412413 410300 409132
61617D09132n56n40q54j114j539k574l833m310l741k923k451k051j503j316j878
$$ 409132 408576 408036 407182 406068 404529 401955 398122 393812 390071 387148 384697 382646 381143 379827 377949
61602C77949k678l044l114l389l798l883l601l365l422l630l722l518l078k763
$$ 377949 375271 372227 369113 365724 361926 358043 354442 351077 347655 344025 340303 336785 333707 330944
61588C30944k815k844k270j317q21q99o84K43J090J138P95O35K48q35j874j773
$$ 330944 328129 325285 323015 321698 320877 319978 319294 319537 320627 321765 322560 323195 323443 322608 320734 318961
61572C18961q42m14q16j007l21O30J061J090J177J282J158R80J076J340J367J092
$$ 318961 318119 317705 316889 315882 315561 316191 317252 318342 319519 320801 321959 322939 324015 325355 326722 327814
61556C27814R03J044J243J080O69O39J285J999J956J221O23N55N50K48J2K25O00
$$ 327814 328717 329761 331004 332084 332753 333392 334677 336676 338632 339853 340476 341031 341581 341829 341841 342066 342666
61539C42666P71R50J430J825J575Q64L50K54K75K09O7j79m67n00k75l99j216k041
$$ 342666 343437 344387 345817 347642 349217 350081 350431 350685 350960 351169 351236 351057 350590 350090 349815 349416 348200 346159
61521C46159k016j409j232j696k047j806j235n58L36J171J276O13P9L40R78J179
$$ 346159 344143 342734 341502 339806 337759 335953 334718 334160 334496 335667 336943 337556 337635 337975 338953 340132
61505C40132P78K05j67k24n9K7k67p19o25M18J943L051L216K657K079K092K552
$$ 340132 340910 341115 340948 340724 340665 340692 340425 339706 339081 339499 341442 344493 347709 350366 352445 354537 357089
61488C57089K625J851R48R45J737K216J934J669K022K403J996J082N48M97K14
$$ 357089 359714 361565 362513 363458 365195 367411 369345 371014 373036 375439 377435 378517 379065 379562 379776
61473C79776o37j532j924j937j971k019j734j076n72p71j568k220k202j796j625
$$ 379776 379139 377607 375683 373746 371775 369756 368022 366946 366374 365603 364035 361815 359613 357817 356192
61458C56192j742j521n94N88J262J206Q79Q50J214J528J249L33o25r80o48K6Q45
$$ 356192 354450 352929 352335 352923 354185 355391 356270 357120 358334 359862 361111 361444 360819 359839 359191 359217 360062
61441C60062J796K587K674J967J121Q07J042J395J625J721J591J114M87K07N33
$$ 360062 361858 364445 367119 369086 370207 371014 372056 373451 375076 376797 378388 379502 379989 380196 380729
61426C80729J195J662J698J556J679K234K936L310L076K369J634J346J596J944
$$ 380729 381924 383586 385284 386840 388519 390753 393689 396999 400075 402444 404078 405424 407020 408964
61412D08964J805J090L11p0j79m32r20j342j437j251j019r75j164j339j151o05
$$ 408964 410769 411859 412170 412100 411921 411489 410569 409227 407790 406539 405520 404545 403381 402042 400891 400286
61396D00286o0K73N18O60L28m75j001o00K93P74P65R35J539K164K646L276L921
$$ 400286 400226 400499 401017 401677 402005 401530 400529 399929 400222 400996 401761 402696 404235 406399 409045 412321 416242
61379D16242L846K871J919J858K387K675K594K602K652K103P56o39j164p43j67
$$ 416242 420088 422959 424878 426736 429123 431798 434392 436994 439646 441749 442505 441866 440702 439959 439792
61364D39792k36j028j926k259j889j169m67J41P60J471K281L107L803M295M660
$$ 439792 439556 438528 436602 434343 432454 431285 430818 430959 431719 433190 435471 438578 442381 446676 451336
61349D51336M968N160N210N261N338N116M326L308K702K614K551K173J688J382
$$ 451336 456304 461464 466674 471935 477273 482389 486715 490023 492725 495339 497890 500063 501751 503133
61335E03133J237J117R89P64K95k87n93n48n88j081j811k227k020j264k28P77
$$ 503133 504370 505487 506476 507240 507535 507248 506655 506107 505519 504438 502627 500400 498380 497116 496888 497665
61319D97665J640K563L729M846N402N468N716O485P328P800Q177Q969J0100J1076
$$ 497665 499305 501868 505597 510443 515845 521313 527029 533514 540842 548642 556819 565788 575888 586964
61305E86964J1733J2291J2766J2794J2075J0646Q718O523M304K205J11k196m638
$$ 586964 598697 610988 623754 636548 648623 659269 667987 674510 678814 681019 681130 678934 674296
61292F74296o760q056q456q447q657r177r432q919p957p336p250p122o540n788
$$ 674296 667536 659480 651024 642577 633920 624743 615311 606392 598435 591099 583849 576727 570187 564399
61278E64399n101m065k307m31N23M34K76Q73J992K847K999K527J689Q16L59O59
$$ 564399 559298 555233 552926 552495 553018 553452 553728 554601 556593 559440 562439 564966 566655 567471 567830 568489
61262E68489J651K919M123N187O060O545O470O010N529N103M371L036J311k89
$$ 568489 570140 573059 577182 582369 588429 594974 601444 607454 612983 618086 622457 625493 626804 626515
61248F26515j494k316k697k545k132j999k245k322j844j286j375k008k307j794
$$ 626515 625021 622705 620008 617463 615331 613332 611087 608765 606921 605635 604260 602252 599945 598151
61234E98151r87n45k65N41J915L058L433L505M065N118O009O464O922P736Q573
$$ 598151 597164 596619 596354 596895 598810 601868 605301 608806 612871 617989 623998 630462 637384 645120 653693
61219F53693Q861Q527Q001P739P916Q351Q543Q056P021O002N245M476L602L086
$$ 653693 662554 671081 679082 686821 694737 703088 711631 719687 726708 732710 737955 742431 746033 749119
61205G49119L195L516L666M019N032O332P201P694Q427R519J0519J1304J2142
$$ 749119 752314 755830 759496 763515 768547 774879 782080 789774 798201 807720 818239 829543 841685
61192H41685J2933J3091J2307J0659Q198N151K455J055N60m01k331m360n756o804
$$ 841685 854618 867709 880016 890675 898873 904024 906479 907534 908094 907693 905362 901002 895246 888442
61178H88442p787q285q108q006q537r142r142q933r271j0046j0623j0939j1294
$$ 888442 880655 872370 864262 856256 847719 838577 829435 820502 811231 801185 790562 779623 768329
61165G68329j1519j1285j0934j1083j1548j1526j0744r610q405p090n836m970
$$ 768329 756810 745525 734591 723508 711960 700434 689690 680080 671675 664585 658749 653779
61153F53779m370l547k361j038L40J706K457J913L26j255k281l038l640l614k821
$$ 653779 649409 645862 643501 642463 642803 644509 646966 648879 649205 647950 645669 642631 638991 635377 632556
61138F32556j946j527j106k3J520K815L719M609N549O259O932Q263J0400J2465
$$ 632556 630610 629083 627977 627954 629474 632289 636008 640617 646166 652425 659357 667620 678020 690485
61124F90485J3629J4199J5128J6646J8129J9320K0860K3171K5392K6230K5645
$$ 690485 704114 718313 733441 750087 768216 787536 808396 831567 856959 883189 908834
61113I08834K4955K5181K5929K6176K5547K4369K2870K0941J8611J6263J4270
$$ 908834 933789 958970 984899 1011075 1036622 1060991 1083861 1104802 1123413 1139676 1153946
61102A153946J2609J0922Q879O378L472K05l244o339q480r751j1049j2946j4720
$$ 1153946 1166555 1177477 1186356 1192734 1196206 1196411 1193167 1186828 1178348 1168597 1157548 1144602 1129882
61089A129882j5082j3766j1778j0027q463o668m648k650p94R06K508M401P021
$$ 1129882 1114800 1101034 1089256 1079229 1070766 1064098 1059450 1056800 1056006 1056912 1059420 1063821 1070842
61076A070842J0163J3056J5364J7498J9784K2023K4195K6722K9556L1836L3100
$$ 1070842 1081005 1094061 1109425 1126923 1146707 1168730 1192925 1219647 1249203 1281039 1314139
61065A314139L4127L5757L7422L7779L6417L4156L1889K9858K7861K5511K2406
$$ 1314139 1348266 1384023 1421445 1459224 1495641 1529797 1561686 1591544 1619405 1644916 1667322
61054A667322J8563J4560J0808P038K988q58l790n794p316q465r057r097q696
$$ 1667322 1685885 1700445 1711253 1718291 1721279 1720421 1716631 1710837 1703521 1695056 1685999 1676902 1668206
61041A668206p783o458n152l912k066O94L583N895Q205J1351J4885J7745K0018
$$ 1668206 1660423 1653965 1648813 1644901 1642835 1643529 1647112 1653007 1661212 1672563 1687448 1705193 1725211
61028A725211K2653K5776K8720L1511L4857L8646M2051M5322N0071N7355O6789
$$ 1725211 1747864 1773640 1802360 1833871 1868728 1907374 1949425 1994747 2044818 2102173 2168962
61017B168962P7814R0585J05079J20741J37612J56744J78940K04321K33733K69292
$$ 2168962 2246776 2337361 2442440 2563181 2700793 2857537 3036477 3240798 3474531 3743823
61007C743823L12751L64496M25035M96457N81723O83795Q05989R50802J115856
$$ 3743823 4056574 4421070 4846105 5342562 5924285 6608080 7414069 8364871 9480727
60998I480727J290608J455955J582309J625594J534069J277454Q83233M43379
$$ 9480727 10771335 12227290 13809599 15435193 16969262 18246716 19129949 19573328
60990A9573328P3691j45762k01565j33998q532R8585J06805m5615l63971p80514
$$ 19573328 19647019 19501257 19299692 19165694 19157162 19255747 19362552 19316937 18952966 18172452
60980A8172452j184593j480073j625097j631409j538585j389820j219957j051802
$$ 18172452 16987859 15507786 13882689 12251280 10712695 9322875 8102918 7051116
60972G051116q96692p58415o37790n34576m47372l74199l13656k64631k25278
$$ 7051116 6154424 5396009 4758219 4223643 3776271 3402072 3088416 2823785 2598507
60963B598507j93334j67374j46804j30667j17304j05242r3807q2938p3017o4609
$$ 2598507 2405173 2237799 2090995 1960328 1843024 1737782 1643975 1561037 1488020 1423411
60953A423411n7750n1668m5727m0348l6303l3525l1428k9966k9348k8921k7558
$$ 1423411 1365661 1313993 1268266 1227918 1191615 1158090 1126662 1096696 1067348 1038427 1010869
60942A010869k5268k3345k2589k2342k1689k0709j9981j9544j9036j8334j7522
$$ 1010869 985601 962256 939667 917325 895636 874927 854946 835402 816366 798032 780510
60931G80510j6450j4899j3020j1264r969r224q935q822q538p991p356o691n808
$$ 780510 764060 749161 736141 724877 714908 705684 696749 687927 679389 671398 664042 657351 651543
60918F51543m679l681l195l179l354l574l781l776l399k796k278j924j614j381
$$ 651543 646864 643183 639988 636809 633455 629881 626100 622324 618925 616129 613851 611927 610313 608932
60904F08932j470j912k324k314k010k013k726l851m750n194n613o444p460p997
$$ 608932 607462 605550 603226 600912 598902 596889 594163 590312 585562 580368 574755 568311 560851 552854
60890E52854p777p258p048p166p052o305n258m624m697n039n108m924m886n044
$$ 552854 545077 537819 530771 523605 516553 510248 504990 500366 495669 490630 485522 480598 475712 470668
60876D70668m981m456l741l112k415j445m45J96N47R96J628K175K563L026L631
$$ 470668 465687 461231 457490 454378 451963 450518 450073 450269 450816 451812 453440 455615 458178 461204 464835
60861D64835M090M271M429M754M942M623L929L332L046K930K933L148L342K930
$$ 464835 468925 473196 477625 482379 487321 491944 495873 499205 502251 505181 508114 511262 514604 517534
60847E17534J733M65L8M25O85J48q79j826k755m049n420n968n368m464m305m884
$$ 517534 519267 519732 519770 520195 520880 521028 520149 518323 515568 511519 506099 500131 494763 490299 485994 481110
60831D81110n242m687l570k809k948l762m606m966m758m290l971m042m410m760
$$ 481110 475868 471181 467611 464802 461854 458092 453486 448520 443762 439472 435501 431459 427049 422289
60817D22289m846m676m410m121l811l611l679l841l660k966k126j546j198r34
$$ 422289 417443 412767 408357 404236 400425 396814 393135 389294 385634 382668 380542 378996 377798 376864
60803C76864r12j247j512j137k82L47N07O57J117J573J693J612J539J383J164
$$ 376864 375952 374705 373193 372056 371774 372121 372628 373285 374402 375975 377668 379280 380819 382202 383366
60788C83366J261J794K205J982J496J570K375L287L679L341K294P72n61r77n56
$$ 383366 384627 386421 388626 390608 392104 393674 396049 399336 403015 406356 408650 409422 408861 407884 407328
60773D07328k22o21j377j734j661j770k203k269j515p08j021k335l140k422r81
$$ 407328 407106 406485 405108 403374 401713 399943 397740 395471 393956 393248 392227 389892 386752 384330 383349
60758C83349k47l58m09j97m89j422j949j459q57j121j682j288K7J067J276J193
$$ 383349 383102 382744 382335 382138 381649 380227 378278 376819 375962 374841 373159 371871 371898 372965 374241 375434
60742C75434J117N15q19j995k127j530j245j701k408k819k900k908k930k712j938
$$ 375434 376551 377066 376247 374252 372125 370595 369350 367649 365241 362422 359522 356614 353684 350972 349034
60727C49034o68M92R02O16L77P30J420J830J774J601J671K003K380K648K826L051
$$ 349034 348366 348858 349760 350376 350753 351483 352903 354733 356507 358108 359779 361782 364162 366810 369636 372687
60711C72687L427L858M048L716K874J901J220R07N90o6q82j378j487j733k410
$$ 372687 376114 379972 384020 387736 390610 392511 393731 394638 395228 395162 394280 392902 391415 389682 387272
60696C87272k990k724j703q03n89p68q16p03p24r41j159j239j196j045p84m18
$$ 387272 384282 381558 379855 379052 378463 377695 376879 376176 375452 374511 373352 372113 370917 369872 369088 368670
60680C68670M4N92J057J226J195J351J733J764R89o8m11J11N52J10q82j594j856
$$ 368670 368714 369306 370363 371589 372784 374135 375868 377632 378621 378553 378142 378253 378805 378915 378033 376439 374583
60663C74583k113k415k173j049L71J142R79M26K13O26J392J996K135J960J832
$$ 374583 372470 370055 367882 366833 367204 368346 369325 369751 369964 370590 371982 373978 376113 378073 379905
60648C79905J890K021K141K232K058J315K28n08o97j096k329l741m076l186k259
$$ 379905 381795 383816 385957 388189 390247 391562 391790 391282 390585 389489 387160 383419 379343 376157 373898
60633C73898k222k613k382j320k17J59j52n09m02J8J78j55n14l70J33M33M23N24
$$ 373898 371676 369063 366681 365361 365144 365303 365151 364642 364240 364258 364436 364281 363767 363397 363530 363963 364386 364910
60615C64910R07J166R58M55J0j96p3M07R37J061Q08O75Q35R17P40O09O04K95l78
$$ 364910 365817 366983 367941 368396 368406 368210 368137 368544 369481 370542 371350 372025 372860 373777 374517 375126 375730 376025 375647
60596C75647o57lJ016J574J743K044K342K148J655J500J651J506J034Q06R09P80
$$ 375647 374990 374987 376003 377577 379320 381364 383706 385854 387509 389009 390660 392166 393200 394006 394915 395695
60580C95695L17J23L65M04M7K40J724L740M917N016M996N575O610P738Q848R800
$$ 395695 396012 396135 396500 396904 396951 397191 398915 402655 407572 412588 417584 423159 429769 437507 446355 456155
60564D56155J0239R968R116P807O005L768J318j143l384m841m931l900k862k562
$$ 456155 466394 476362 485478 493285 499290 503058 504376 503233 499849 495008 490077 486177 483315 480753
60550D80753k487j697j89J267K444L829N418O394O491O807Q338J0408J1634J2059
$$ 480753 478266 476569 476380 477647 480091 483920 489338 495732 502223 509030 517368 527776 539410 551469
60536E51469J2997J4743J5823J5036J3066J1204R426O838L482M42j711l492n328
$$ 551469 564466 579209 595032 610068 623134 634338 643764 650602 654084 654526 652815 649323 643995
60523F43995o780p347p308p244p144o593n556m481l598k651j488n10j15J00J067
$$ 643995 637215 629868 622560 615316 608172 601579 596023 591542 587944 585293 583805 583295 583180 583280 584347
60508E84347L019N076O416P411Q989J1193J3276J5160J7772K1566K5592K8713
$$ 584347 587366 592442 598858 606269 615258 626451 639727 654887 672659 694225 719817 748530
60496G48530L1062L3456L5844L7236L7019L5546L3303L0192K5760J9850J2814
$$ 748530 779592 813048 848892 886128 923147 958693 991996 1022188 1047948 1067798 1080612
60485A080612N331k057r415j7230k5451l3001l8588m1829m3200m3160m1886l9625
$$ 1080612 1085943 1083886 1074471 1057241 1031790 998789 960201 918372 875172 832012 790126 750501
60473G50501l6751l3518l0199k7294k5047k2921k0186j6985j4207j2340j1045
$$ 750501 713750 680232 650033 622739 597692 574771 554585 537600 523393 511053 500008
60462E00008r864q715p608o548n838n857o307o283n367m122l329l151l269l318
$$ 500008 490144 481429 473821 467273 461435 455578 449271 442988 437621 433499 430170 427019 423750 420432
60448D20432k982k231j722k270l556m013k680o12L37j62p26l73K15j58j459k521
$$ 420432 417450 415219 413497 411227 407671 403658 400978 400366 400703 400541 399815 399442 399657 399499 398040 395519
60432C95519k545j799r35j88N01J041J212R79N15Rk84r5M57P09K63k97j14O34
$$ 395519 392974 391175 390240 390052 390553 391594 392806 393785 394300 394309 394025 393930 394387 395096 395359 395062 394948 395582
60414C95582R26M71J24M50Q29O32L61P46J411J449R19O63R88J457J901K540L161
$$ 395582 396508 396979 397103 397553 398382 399014 399375 400121 401532 402981 403900 404563 405551 407008 408909 411449 414610
60397D14610L185K639K242K360K654K772K675K266J537J105J606K545K684J810
$$ 414610 417795 420434 422676 425036 427690 430462 433137 435403 436940 438045 439651 442196 444880 446690
60383D46690J076J268J777J791J475J344J352J287J346J570J451P85L39Q59J936
$$ 446690 447766 449034 450811 452602 454077 455421 456773 458060 459406 460976 462427 463212 463551 464410 466346
60368D66346K555K369J743J071P75J404K828L743K981J185J86P73J999K728K938
$$ 466346 468901 471270 473013 474084 474859 476263 479091 482834 485815 487000 487186 487959 489958 492686 495624
60353D95624L227L857M640N318N589N157L999K463R54k51r10r69r04j483k880
$$ 495624 498851 502708 507348 512666 518255 523412 527411 529874 530828 530577 529667 528698 527794 526311 523431
60338E23431m300m765m127l047k196j681j274q84o46o81r07j142j324j562j972
$$ 523431 519131 514366 510239 507192 504996 503315 502041 501157 500511 499830 498923 497781 496457 494895 492923
60323D92923k449k614k102r79J88Q61J149J631K584L695M677N692O887P878Q219
$$ 492923 490474 487860 485758 484779 484967 485828 486977 488608 491192 494887 499564 505256 512143 520021 528240
60308E28240Q103Q059Q181Q167Q049Q219Q714R028Q679P488N371K375r76l951
$$ 528240 536343 544402 552583 560750 568799 577018 585732 594760 603439 610927 616298 618673 617697 613746
60294F13746o329q367j0076j1043j1047j0264q839o886m921l593k869k208j643
$$ 613746 607417 599050 588974 577931 566884 556620 547781 540895 535974 532381 529512 527304 525661
60281E25661j852k920l931m212m150m252m234l725l137l059l253l050k379j784
$$ 525661 523809 520889 516958 512746 508596 504344 500110 496385 493248 490189 486936 483886 481507 479723
60267D79723j663j998k544k879k631k030j831k248k467j706k91Q25J190J036P81
$$ 479723 478060 476062 473518 470639 468008 465978 464147 461899 459432 457726 457435 458260 459450 460486 461267
60252D61267Q11J346J992J963J211O52P73P91L0p37m16N82Q95K08n67r18j194
$$ 461267 462078 463424 465416 467379 468590 469242 470015 470806 470836 470099 469683 470265 471160 471368 470801 469883 468689
60235D68689j490j307n94m0J01M97J680L218M307M630M293L572K981L041L653
$$ 468689 467199 465892 465298 465258 465359 465856 467536 470754 475061 479691 483984 487556 490537 493578 497231
60220D97231M200M493N047O171P323P797P658P600Q103Q949R524R370Q588P696
$$ 497231 501431 505924 510971 517142 524465 532262 539920 547520 555623 564572 574096 583466 592054 599750
60206E99750P103O813O754O971P212O819N551M156L492L366K988K262J775J584
$$ 599750 606853 613666 620420 627391 634603 641422 646973 651129 654621 657987 660975 663237 665012 666596
60192F66596R96l99k217l942n290n944n784n494o015p200p854p464o872o831o892
$$ 666596 667592 667193 664976 661034 655744 649800 644016 638522 632507 625307 617453 609989 603117 596286 589394
60177E89394o307n265m403l801l177k617k311k053j660j566k152k856k706j700
$$ 589394 583087 577822 573419 569618 566441 563824 561513 559460 557800 556234 554082 551226 548520 546820
60163E46820p78m84l23L35J286J799J560J025Q44J077J151O56P8K87J343K306
$$ 546820 546042 545558 545235 545570 546856 548655 550215 551240 552084 553161 554312 554968 555046 555333 556676 558982
60147E58982K445K070J833J789J705J807K501L579M417M896N389N923O110N999
$$ 558982 561427 563497 565330 567119 568824 570631 573132 576711 581128 586024 591413 597336 603446 609445
60133F09445O236P080P817P634O650N675N202N014M627L799K676J702J309J491
$$ 609445 615681 622761 630578 638212 644862 650537 655739 660753 665380 669179 671855 673557 674866 676357
60119F76357J820K030K360L016L587L373K284R50o2p25j221j561j776k059k456
$$ 676357 678177 680207 682567 685583 689170 692543 694827 695777 695715 694990 693769 692208 690432 688373 685917
60104F85917k728k823l154l961m737m799m311m112m478m616l669j794m5O38J53
$$ 685917 683189 680366 677212 673251 668514 663715 659404 655292 650814 646198 642529 640735 640690 641328 641481
60089F41481p31j015m40J90o9j059j764j712j427j302q96J8N10n61k911n026n846
$$ 641481 640750 639735 639295 639485 639416 638357 636593 634881 633454 632152 631256 631274 631784 631223 628312 623286 617440
60072F17440n633n233n236n823o833p758q103p875p385o707n713m613l835l384
$$ 617440 611807 606574 601338 595515 588682 580924 572821 564946 557561 550854 545141 540528 536693 533309
60058E33309k842k124j668j642j469n32R15J962K080J784K137L610N390O101N348
$$ 533309 530467 528343 526675 525033 523564 523032 523947 525909 527989 529773 531910 535520 540910 547011 552359
60043E52359M293M302N307O071N881N268N001N047M876M212L110J690J20j268
$$ 552359 556652 560954 566261 572332 578213 583481 588482 593529 598405 602617 605727 607417 607537 606269
60029F06269k255k918l431l894m550n795p637r355j0074r683q911q517q575q549
$$ 606269 604014 601096 597665 593771 589221 583426 575789 566434 556360 546677 537766 529249 520674 512125
60015E12125p937o772n537m695m258l909l417k886k582k546k461j922r17N1N69
$$ 512125 504188 497416 491879 487184 482926 479017 475600 472714 470132 467586 465125 463203 462286 462337 462906
60000D62906Q84J520K296K298J171r8j95R73K325K995L073L021L060L246L640
$$ 462906 463790 465310 467606 469904 471075 470977 470782 471755 474080 477075 480148 483169 486229 489475 493115
59985D93115M132M382M122L312J994L22j256k243k625k852l167l320l052k558
$$ 493115 497247 501629 505751 509063 511057 511379 510123 507880 505255 502403 499236 495916 492864 490306
59971D90306k259k296k401k246j807j435j451j634j308j57J294K270K611K694
$$ 490306 488047 485751 483350 481104 479297 477862 476411 474777 473469 473312 474606 476876 479487 482181
59957D82181K709K477J917J295R11Q37R09Q53N26K64O45J630K338K087J257N55
$$ 482181 484890 487367 489284 490579 491490 492327 493236 494089 494615 494879 495524 497154 499492 501579 502836 503391
59941E03391n3r22j653j563r80r12j406j394m47N13Q08J185K618M704O212O666
$$ 503391 503338 502416 500763 499200 498220 497308 495902 494508 494061 494574 495382 496567 499185 503889 510101 516767
59925E16767O513O077N216L913K523J290J21j148k521l780m431l905k204k33R53
$$ 516767 523280 529357 534573 538486 541009 542299 542420 541272 538751 534971 530540 526635 524431 524198 525151
59910E25151J183J184J598K269K621K442K062J802J475P10l49r81p06J29Q52J223
$$ 525151 526334 527518 529116 531385 534006 536448 538510 540312 541787 542497 542148 541167 540461 540590 541442 542665
59894E42665J386J373J159J001J211J717K334L237M569N739N903N150M466M404
$$ 542665 544051 545424 546583 547584 548795 550512 552846 556083 560652 566391 572294 577444 581910 586314
59880E86314M539M465M513N052N699N707M806L328J781N87r7n12r81j467j667
$$ 586314 590853 595318 599831 604883 610582 616289 621095 624423 626204 626791 626694 626182 625201 623734 622067
59865F22067j526j150m51O17J506J512Q20L22L89N91P30J188J981K483K500K726
$$ 622067 620541 619391 618940 619557 621063 622575 623395 623717 624106 624697 625427 626615 628596 631079 633579 636305
59849F36305L644M768N499N898O047N430L701J376q33k711l936l715j919P8P41
$$ 636305 639949 644717 650216 656114 662161 667591 671292 672668 671835 669124 665188 661473 659554 659632 660373
59834F60373P4q87j727k747l748l970l261k356j880j790j873k100k388k589k776
$$ 660373 660447 659560 657833 655086 651338 647368 644107 641751 639871 638081 636208 634108 631720 629131 626355
59819F26355l123l511l675l648l623l466k931k208j801j835j965j918j718j395
$$ 626355 623232 619721 616046 612398 608775 605309 602378 600170 598369 596534 594569 592651 590933 589538
59805E89538r10l79pJ57J85N0l08q21j405k081k804l419l879m267m421m034l316
$$ 589538 588628 588249 588242 588399 588584 588634 588326 587505 586100 584019 581215 577796 573917 569650 565229 561195 557879
59788E57879k983l254l430k969k399k522l205l639l441k819j962r63j83J11K92
$$ 557879 554896 551642 548212 545243 542844 540322 537117 533478 530037 527218 525256 524293 524110 524221 524513
59773E24513R59K023K789K872K520K159K101K558L443M258M581M575M667N053
$$ 524513 525472 527495 530284 533156 535676 537835 539936 542494 545937 550195 554776 559351 564018 569071
59759E69071N751O756P704P909P279O705O862P233P041O608O715P124O884O012
$$ 569071 574822 581578 589282 597191 604470 611175 618037 625270 632311 638919 645634 652758 659642 665654
59745F65654N569N973O344N799M427K760J119j45o34n59p37j532k343k523k239
$$ 665654 671223 677196 683540 689339 693766 696526 697645 697500 696866 696307 695570 694038 691695 689172 686933
59730F86933k053k068j956j509q25j52K67L31K02P8j21o16j373k130k745l173
$$ 686933 684880 682812 680856 679347 678522 678370 678637 678968 679170 679248 679127 678511 677138 675008 672263 669090
59714F69090l196k586j487l13O74J366J654J645J830K487L190L393L284L405L636
$$ 669090 665894 663308 661821 661508 662182 663548 665202 666847 668677 671164 674354 677747 681031 684436 688072
59699F88072L426K874K739L265L835L993L957L853L180J553n82k413l572m104
$$ 688072 691498 694372 697111 700376 704211 708204 712161 716014 719194 720747 720165 717752 714180 710076
59685G10076m015l255k042r42n83j223k497l677m439n106n915o407o038n139m560
$$ 710076 706061 702806 700764 699822 699239 698016 695519 691842 687403 682297 676382 669975 663937 658798 654238
59670F54238m568m687m565m313l997l502k881k269j465k54R53J512J535J656J900
$$ 654238 649670 644983 640418 636105 632108 628606 625725 623456 621991 621737 622690 624202 625737 627393 629293
59655F29293J705J159J166K062K958K980K287J470O62j22n32n19q04k053l874
$$ 629293 630998 632157 633323 635385 638343 641323 643610 645080 645742 645620 645088 644569 643765 641712 637838
59640F37838n337o136o606o877o671n910m968m146l308k184q95oJ0o83j443j991
$$ 637838 632501 626365 619759 612882 606211 600301 595333 591187 587879 585695 584800 584794 584804 584121 582678 580687
59624E80687k745m041n305n566m730l708l296l431l656l702l418k661j569n33
$$ 580687 577942 573901 568596 563030 558300 554592 551296 547865 544209 540507 537089 534428 532859 532326
59610E32326K12P12R43Q10N41N98J038J400J345J006O63M58N19Q35J016O57K4
$$ 532326 532538 533250 534193 535003 535544 536142 537180 538580 539925 540931 541594 542052 542571 543406 544422 545079 545103
59593E45103j84K43Q92J503K153K599K222R23n39j439j723j658j483j579k256
$$ 545103 544919 545162 546054 547557 549710 552309 554531 555454 554915 553476 551753 550095 548612 547033 544777
59578E44777l075l089k077r09l70l64n64j078j839k188j661p06mL90O92P27K90
$$ 544777 541702 538613 536536 535627 535257 534893 534329 533251 531412 529224 527563 526857 526853 527243 527935 528662 528952
59561E28952k86n67o72r12j168j123q20m36J44J032J909K419K685K969L139K953
$$ 528952 528666 528099 527427 526515 525347 524224 523404 522968 523112 524144 526053 528472 531157 534126 537265 540218
59545E40218K673K835L615M805O208P760R473J1545J4095J6385J6764J4021Q656
$$ 540218 542891 545726 549341 554146 560354 568114 577587 589132 603227 619612 636376 650397 659053
59532F59053K494k727o085p429p249o310m949k917k37K240L652M081M091L717
$$ 659053 661547 658820 652735 645306 638057 631747 626798 623881 623644 625884 629536 633617 637708 641425
59518F41425K598Q72q33k171l260m164m856n596o679p755p991p105n768m853m613
$$ 641425 644023 644895 644062 641891 638631 634467 629611 624015 617336 609581 601590 594485 588717 583864 579251
59503E79251m703m694m440m060l656l036j936o03J99Q6l59k88L22P84P39O16R74
$$ 579251 574548 569854 565414 561354 557698 554662 552726 552123 552322 552408 552049 551761 552083 552867 553606 554222 555196
59486E55196J834K754L317L407L200K983L002L435M383N649O612O703N999N065
$$ 555196 557030 559784 563101 566508 569708 572691 575693 579128 583511 589160 595772 602475 608474 613539
59472F13539M127K982J725R26P87P71N01L92Q51J385J246N85K46O26J480K671
$$ 613539 617666 620648 622373 623299 624086 624857 625358 625750 626601 627986 629232 629817 630063 630689 632169 634840
59456F34840M311O188P679Q419Q551Q277P574O511N382M419L601K805J863N21
$$ 634840 639151 645339 653018 661437 669988 678265 685839 692350 697732 702151 705752 708557 710420 710941
59442G10941j347l476n424o987q127q592q019o483m687l424k991l065k964k178
$$ 710941 709594 706118 700694 693707 685580 676988 668969 662486 657799 654375 651384 648319 645355 643177
59428F43177q34M62J397K397M013O101Q023R534J1001J2702J4452J6032J7577
$$ 643177 642343 642805 644202 646599 650612 656713 664736 674270 685271 697973 712425 728457 746034
59415G46034J9229K0750K1826K2530K2888K1997J8201J0762J259p160j2061j3100
$$ 746034 765263 786013 807839 830369 853257 875254 893455 904217 905476 898316 886255 873155
59403H73155j1375q065l961L51M452P931R751Q295K878m833j1733j5762j7026
$$ 873155 861780 853715 849754 850105 854557 862488 872239 880534 883412 878579 866846 851084 834058
59390H34058j6627j5250j3145j0715q536o992o123n568m717l326j991j510j830
$$ 834058 817431 802181 789036 778321 769785 762793 756670 751102 746385 743059 741068 739558 737728
59377G37728k107j825j281r52j045j627k531l070k595j443o02m31m44k80L6P87
$$ 737728 735621 733796 732515 731563 730518 728891 726360 723290 720695 719252 718650 718219 717775 717495 717531 718318
59361G18318K330M021M633M176M046M994O250P203Q456J0366J1990J2559J2808
$$ 718318 720648 724669 729302 733478 737524 742518 748768 755971 764427 774793 786783 799342 812150
59348H12150J3602J4426J4531J4556J5352J6107J5327J3220J1382J0420R375P394
$$ 812150 825752 840178 854709 869265 884617 900724 916051 929271 940653 951073 960448 967842
59336I67842M582J199k576o034q326r678j1187j3251j5179j6379j7017j7354j7366
$$ 967842 972424 973623 971047 965013 956687 947009 935822 922571 907392 891013 873996 856642 839276
59323H39276j7069j6509j5390j3511j1469j0113r443q843q195p834p633p194o826
$$ 839276 822207 805698 790308 776797 765328 755215 745772 736929 728734 720900 713267 706073 699247
59310F99247p098p489o777m900l117k026p65J363L713N490O954Q589R833R580
$$ 699247 692149 684660 677883 672983 669866 667840 667075 668438 672151 677641 684595 693184 703017 712597
59296G12597P497M079j79m878r264j2402j3815j3685j2435j0372p716m830k408
$$ 712597 720094 724173 723994 719116 709852 697450 683635 669950 657515 647143 639427 634597 632189
59283F32189j182j157j320n56J202L115M582N781P160Q885J0792J2378J2969J2382
$$ 632189 631007 629850 628530 627974 629176 632291 636873 642654 649814 658699 669491 681869 694838 707220
59269G07220J1370J0826J0737J0426R721R007Q216O673M172J522m04j586k501
$$ 707220 718590 729416 740153 750579 760300 769307 777523 784196 788368 789890 789486 787900 785399
59256G85399l349l970m251m336m443m576m312l149j243N23J598K423L538M527
$$ 785399 782050 778080 773829 769493 765050 760474 756162 753013 751770 752293 753891 756314 759852 764379
59242G64379M674M262M220M603M498L496K273J486R37J60q69j898k798l469l894
$$ 764379 769053 773315 777535 782138 786636 790132 792405 793891 794828 794988 794119 792221 789423 785954 782060
59227G82060m408n489p152q940j0432j1379j1542j0986j0355j0205j0157r446
$$ 782060 777652 772163 765011 756071 745639 734260 722718 711732 701377 691172 681015 671569
59215F71569q074o642n231l512j857j284j948k731k594j623n09K66N02L04L32
$$ 671569 663495 656853 651622 648110 646253 644969 643021 640290 637696 636073 635564 635830 636332 636636 636968
59200F36968J252K752L758L836L615L734M096M380M532M502M211L943M043M199
$$ 636968 638220 640972 644730 648566 652181 655915 660011 664391 668923 673425 677636 681579 685622 689821
59186F89821L789K955K498K623K781K816L097L362K676R92m36p79o18o41n03J84
$$ 689821 693610 696565 699063 701686 704467 707283 710380 713742 716418 717410 716974 716195 715577 714936 714433 714617
59170G14617P79N07k74o88n99m69m68m40m18n05o40r64j839l161m248m876n712
$$ 714617 715396 715903 715629 714941 714342 713873 713405 712965 712547 712042 711402 710438 708599 705438 701190 696314 690602
59153F90602p197q706r449r464r111q396p479p076p409p486o381m675l658l586
$$ 690602 683405 674699 665250 655786 646675 638279 630800 623724 616315 608829 602448 597773 594115 590529
59139E90529l735l768l930m103l802l069k498k261j987j586j407j438j088NJ465
$$ 590529 586794 583026 579096 574993 571191 568122 565624 563363 561376 559790 558383 556945 555857 555862 557327
59124E57327K742L699M436M929N136N349O084P570R375J0630J0844J0388R968
$$ 557327 560069 563768 568204 573133 578269 583618 589702 597272 606647 617277 628121 638509 648477
59111F48477R757R410Q863Q478Q320P920P105O426O334O389N839M645L371K388
$$ 648477 658234 667644 676507 684985 693305 701225 708330 714756 721090 727479 733318 737963 741334 743722
59097G43722J601Q76K22l73r94j641k174k410k289k066k210k811l303l198k896
$$ 743722 745323 746199 746421 746048 745054 743413 741239 738829 736540 734474 732264 729453 726150 722952 720056
59082G20056l168l948m483m659n281o703q026q210p297o092n171m676m591m698
$$ 720056 716888 712940 708457 703798 698517 691814 683788 675578 668281 662189 657018 652342 647751 643053
59068F43053m634m258l742l122k317j661j768k561l112k820k069j460j017n95
$$ 643053 638419 634161 630419 627297 624980 623319 621551 618990 615878 613058 610989 609529 608512 607917
59054F07917l74m74o74q81j272j657j416n11K05K10P0L90Q00P41N44Q35J358J279
$$ 607917 607543 607069 606395 605514 604242 602585 601169 600658 600863 601073 601143 601533 602333 603074 603618 604453 605811 607090
59036F07090L92o15r56k69J296L083M309M905N541O564P521Q107Q835J0109J1310
$$ 607090 607482 606867 605911 605642 606938 610021 614330 619235 624776 631340 638861 646968 655803 665912 677222
59021F77222J1626J1332J1358J1911J2272J1736J0103P457M167R85j363k787l680
$$ 677222 688848 700180 711538 723449 735721 747457 757560 765017 769184 770169 768806 766019 762339
59008G62339m340m695m420l228j332L17Q30N05N98J765L376M529M968M792M073
$$ 762339 757999 753304 748884 745656 744324 744641 745471 745976 746574 748339 751715 756244 761212 766004 770077
58993G70077L090K255J499M71n19o76j20O4n36j098j049q94r75p74j20K98M29
$$ 770077 773167 775422 776921 777392 776873 776197 776077 776141 775605 774507 773458 772564 771589 770815 770695 770993 771422
58976G71422J448L808O107P173P886R435J1088J1412J0673J0161R975R345Q559
$$ 771422 772870 776678 782785 789958 797844 807279 818367 829779 840452 850613 860588 869933 878492
58963H78492Q604R141Q752P111N284L888K400L45k147m916p699r670j0360j0794
$$ 878492 887096 896237 904989 912100 917384 921272 923672 924017 921870 916954 909255 899585 889225 878431
58949H78431j2291j4352j5187j4252j2753j1615j0578r470q781q498p748o197
$$ 878431 866140 851788 836601 822349 809596 797981 787403 777933 769152 760654 752906 746709
58937G46709m673l886l467k753j672m96N28J035P94K66K24P00R97P30J19o06j288
$$ 746709 742036 738150 734683 731930 730258 729762 730290 731325 732119 732385 732609 733309 734306 735036 735155 734549 733261
58920G33261j465q42n6Q0j19K75J118J350Q29O97J605K859L678M211M883N706
$$ 733261 731796 730954 730898 730978 730859 731134 732252 733602 734431 735128 736733 739592 743270 747481 752364 758070
58904G58070O691Q061R679J1014J1887J2587J3068J2939J2259J1526J0781R801
$$ 758070 764761 772822 782501 793515 805402 817989 831057 843996 856255 867781 878562 888363
58892H88363R158R820J1528J2872J3336J3946J5379J6716J6879J6114J5128J3693
$$ 888363 897521 907341 918869 931741 945077 959023 974402 991118 1007997 1024111 1039239 1052932
58880A052932J1194P834M345R64k363n179o845p584q408r910j1569j2280j1426
$$ 1052932 1064126 1071960 1076305 1077269 1074906 1069727 1062882 1055298 1046890 1036980 1025411 1013131 1001705
58867A001705r425p399o187n737n490n178m944m947n305o230p683r088r990j0706
$$ 1001705 992280 984881 978694 972957 967467 962289 957345 952398 947093 940863 933180 924092 914102 903396
58853I03396j1660j2346j1874j0407r100q566q339p941p524p229o845o471o632
$$ 903396 891736 879390 867516 857109 848009 839443 831104 823163 815639 808410 801565 795094 788462
58840G88462p410q117q217p949p718p524p241o930o518n762m749l898l305k565
$$ 788462 781052 772935 764718 756769 749051 741527 734286 727356 720838 715076 710327 706429 703124 700559
58826G00559j475l05P49J807K834L517L765L888M073M266M567N195N882N904M911
$$ 700559 699084 698779 699528 701335 704169 707686 711451 715339 719412 723678 728245 733440 739322 745226 750137
58811G50137L303J688M21k77l22j2Q5m32j591l111m340m634m210m170n013n825
$$ 750137 753440 755128 755549 755272 754950 754938 755023 754591 753000 749889 745549 740915 736705 732535 727522 721697
58795G21697n673n136n282n799n509m430l713l620l140j807m09M72J226K070K473
$$ 721697 716024 710888 705606 699807 694298 689868 686155 682535 679395 677588 677179 677651 678877 680947 683420
58780F83420K393K800M170N485N631M955M524M396L531J248j925m790o550p334
$$ 683420 685813 688613 692783 698268 703899 708854 713378 717774 721305 722553 720628 715838 709288 701954
58766G01954p756q003p689o719n741n226m739l809k909k585k269j100N14J477
$$ 701954 694198 686195 678506 671787 666046 660820 656081 652272 649363 646778 644509 643409 643923 645400
58752F45400J762K187K719K575J890J673K033K097J821K253L558M499M362L927
$$ 645400 647162 649349 652068 654643 656533 658206 660239 662336 664157 666410 669968 674467 678829 682756
58738F82756L919L902L522L419M065M871N260N565O174O704O730O497O241N799
$$ 682756 686675 690577 694099 697518 701583 706454 711714 717279 723453 730157 736887 743384 749625 755424
58724G55424N323N409O017O278N898N742O421P330P724P801Q074Q514Q812Q697
$$ 755424 760747 766156 772173 778451 784349 790091 796512 803842 811566 819367 827441 835955 844767 853464
58710H53464P658N297K294o3j593l342n707p767r003j0222j2090j4026j5364j6353
$$ 853464 861122 866419 868713 868650 867057 863715 858008 850241 841238 831016 818926 804900 789536 773183
58696G73183j7196j7304j6382j5175j4233j2994j1018r043p838o969n765m622
$$ 773183 755987 738683 722301 707126 692893 679899 668881 659838 652000 645031 639266 634644
58684F34644m309m595m594l957k982k024j369j153j019m80K18M31M59J337L017
$$ 634644 630335 625740 621146 617189 614207 612183 610814 609661 608642 608162 608380 608811 609270 610607 613624
58669F13624M176M293M548N919P726Q939R605J0127J0175R326P756N588K625o36
$$ 613624 617800 622093 626641 632560 640286 649225 658830 668957 679132 688458 696214 701802 704427 703791
58655G03791k927l884m559n619o347o253o135o551o686n829m646l807k835j506
$$ 703791 700864 696980 692421 686802 680455 674202 668067 661516 654830 649001 644355 640548 637713 636207
58641F36207r14j678k460j780j80J018J837K892L600L009J645P85M79o3p49q95
$$ 636207 635293 633615 631155 629375 629195 630213 632050 634942 638542 641551 643196 643981 644460 644397 643648 642753
58625F42753o42n97n37O5P71Q43P23J329K371K845K840L334M431N204N252N085
$$ 642753 642111 641514 640977 641042 641813 642656 643379 644708 647079 649924 652764 656098 660529 665733 670985 676070
58609F76070N000M751M314L965L637L100K638K672K888K583J697P46q4j006j961
$$ 676070 681070 685821 690135 694100 697737 700837 703475 706147 709035 711618 713315 714061 713977 712971 711010
58594G11010k538k482j858q80J30R39J835L309N248P011Q350R452J0119R975R507
$$ 711010 708472 705990 704132 703252 703382 704321 706156 709465 714713 721724 730074 739526 749645 759620 769127
58579G69127R560R792R161Q097Q296R893J0931J0402R821J0712J2499J4193J6232
$$ 769127 778687 788479 797640 805737 814033 823926 834857 845259 855080 865792 878291 892484 908716
58566I08716J9047K1638K3215K4720K7058K9273L0151L0107K9805K8379K4906
$$ 908716 927763 949401 972616 997336 1024394 1053667 1083818 1113925 1143730 1172109 1197015
58555A197015K0278J5689J0679M647j061m723o764q616j0028r764q137o753o389
$$ 1197015 1217293 1232982 1243661 1248308 1247247 1242524 1235760 1227144 1217116 1207352 1199215 1192462 1186073
58542A186073p008r037j2658j6498j9024k0615k2538k4580k5466k4804k2958j9916
$$ 1186073 1179065 1170028 1157370 1140872 1121848 1101233 1078695 1054115 1028649 1003845 980887 960971
58530I60971j6082j3105j1967j1271r354p049o133o165n399l913l303l725l763
$$ 960971 944889 931784 919817 908546 899192 892143 886010 879845 874446 870533 867230 863505 859742
58517H59742k915j943j109j99J49p18j707j296j14l1j095j606r69j65L67J092
$$ 859742 856827 854884 853775 853576 853725 853007 851300 850004 849890 849859 848764 847158 846189 846024 846391 847483
58501H47483J784J660R86P21P95N84N40J439K520K518K026K697M541O191P337
$$ 847483 849267 850927 851913 852634 853429 854013 854553 855992 858512 861030 863056 865753 870294 876485 883822
58486H83822Q666R917J0315J0514J1728J3422J4193J4509J5971J8209J9181J8339
$$ 883822 892488 902405 912720 923234 934962 948384 962577 977086 993057 1011266 1030447 1048786
58474A048786J6883J4980J1491O570J975j499m598p458r208r840j0222j0186q712
$$ 1048786 1065669 1080649 1092140 1098710 1100685 1099186 1094588 1087130 1077922 1068082 1057860 1047674 1038962
58461A038962o006l316p72K452O019Q739J0719J2912J4838J5102J3912J2607J0991
$$ 1038962 1032956 1029640 1028868 1031320 1037339 1046078 1056797 1069709 1084547 1099649 1113561 1126168 1137159
58448A137159P706K950j687n719r499j1973j1735r978r291r638q658n872l344
$$ 1137159 1144865 1147815 1146128 1140409 1130910 1118937 1107202 1097224 1087933 1078295 1069637 1063765 1060421
58435A060421k057r65J27J11n31L22K932N179O149P241R087J0449J0851J1382
$$ 1060421 1058364 1057399 1057526 1057637 1057106 1057428 1060360 1065539 1071688 1078929 1088016 1098465 1109316 1120698
58421A120698J2041J1180Q366N125K204j114m500o313o477o769p631p563o214
$$ 1120698 1132739 1143919 1152285 1157410 1159614 1158500 1154000 1147687 1141210 1134441 1126810 1119247 1113033
58408A113033n107m729l933k742k572l123k360k26R81P15J161L177M771M811M862
$$ 1113033 1107926 1103197 1099264 1096522 1093950 1090827 1088467 1088241 1089222 1089937 1091098 1094275 1099046 1103857 1108719
58393A108719N922O633O123N613N765N345L881K766K492J596m56k169k785l235
$$ 1108719 1114641 1121274 1127397 1133010 1138775 1144120 1148001 1150767 1153259 1154855 1154399 1152230 1149445 1146210
58379A146210l513k145Q29L435N190P671J0888J2698J2753J3402J5440J6715J6217
$$ 1146210 1142697 1140552 1141381 1144816 1150006 1157677 1168565 1181263 1194016 1207418 1222858 1239573 1255790
58366A255790J5775J6392J6600J5895J5983J7116J7097J5485J4826J5975J6272
$$ 1255790 1271565 1287957 1304557 1320452 1336435 1353551 1370648 1386133 1400959 1416934 1433206
58355A433206J4183J1747J0394Q519N417L500M142N167M929N055O656P801P360
$$ 1433206 1447389 1459136 1469530 1478049 1483466 1486966 1491108 1496275 1501204 1506259 1512915 1520716 1528076
58342A528076P491R553J1319J1122J1106J3326J6227J7847J9048K0674K1067J9485
$$ 1528076 1535567 1545120 1556439 1567561 1578667 1591993 1608220 1626067 1645115 1665789 1686856 1706341
58330A706341J8468J9707K0833J9442J6970J5558J4330J1935R649Q851Q390P322
$$ 1706341 1724809 1744516 1765349 1784791 1801761 1817319 1831649 1843584 1853233 1862084 1870474 1877796
58318A877796P185Q837J0221J0023J0295J2679J5387J6564J7278J8559J9069J8331
$$ 1877796 1884981 1893818 1904039 1914062 1924357 1937036 1952423 1968987 1986265 2004824 2023893 2042224
58306B042224J8544K0564K1929K1452K1628K3774K5242K4394K3829K5431K6817
$$ 2042224 2060768 2081332 2103261 2124713 2146341 2170115 2195357 2219751 2243580 2269011 2295828
58295B295828K6145K5720K7277K8401K7398K7000K9312L1813L2300L3011L5675
$$ 2295828 2321973 2347693 2374970 2403371 2430769 2457769 2487081 2518894 2551194 2584205 2619880
58284B619880L7484L6380L5387L7203L9397L9623M0474M4265M8060M8980M9492
$$ 2619880 2657364 2693744 2729131 2766334 2805731 2845354 2885828 2930093 2978153 3027133 3076625
58273C076625N2225N4656N4285N3979N6639N9680O0414O1722O6513P1746P3990
$$ 3076625 3128850 3183506 3237791 3291770 3348409 3408089 3468503 3530225 3596738 3668484 3742474
58262C742474P5705P9904Q3919Q4732Q5108Q7995R0378Q9283Q8137R0380R2692
$$ 3742474 3818179 3898083 3982002 4066734 4151842 4239837 4330215 4419498 4507635 4598015 4690707
58251D690707R1776R1759R7167J04558J09013J12951J20367J28474J33577J39098
$$ 4690707 4782483 4874242 4971409 5075967 5184980 5297931 5418298 5546772 5680349 5819447
58241E819447J49054J59742J66803J74123J86407J99641K08619K17208K30922
$$ 5819447 5968501 6128243 6295046 6469169 6655576 6855217 7063836 7281044 7511966
58232G511966K46251K58015K70243K88612L09243L26624L45383L71969M02085
$$ 7511966 7758217 8016232 8286475 8575087 8884330 9210954 9556337 9928306 10330391
58223A0330391M29142M57542M94351N35655N75149O18224O72892P35106P98417
$$ 10330391 10759533 11217075 11711426 12247081 12822230 13440454 14113346 14848452 15646869
58214A5646869Q69368R57158J057416J163559J284501J432826J605936J798869
$$ 15646869 16516237 17473395 18530811 19694370 20978871 22411697 24017633 25816502
58206B5816502K024849K301948K631043L009569L453513L979954M582097N250863
$$ 25816502 27841351 30143299 32774342 35783911 39237424 43217378 47799475 53050338
58198E3050338O008224O890969P921021R127798J0580065J2355073J4498465J7055964
$$ 53050338 59058562 65949531 73870552 82998350 93578415 105933488 120431953 137487917
58190A37487917K0096501K3606329K7341731L0803584L3257243L3648599L0653298
$$ 137487917 157584418 181190747 208532478 239336062 272593305 306241904 336895202
58183C36895202K3284811J1854378j671443j4511548k4467176l0685853l3416815
$$ 336895202 360180013 372034391 370362948 355851400 331384224 300698371 267281556
58176B67281556l3390757l1451313k8423283k4977595k1526619j8279494j5364792
$$ 267281556 233890799 202439486 174016203 149038608 127511989 109232495 93867703
58169I3867703j2858279j0752485q988776p523453o329325n358465m552555l881101
$$ 93867703 81009424 70256939 61268163 53744710 47415385 42056920 37504365 33623264
58161C3623264l333878k886712k507183k184021j920138j704054j514775j347300
$$ 33623264 30289386 27402674 24895491 22711470 20791332 19087278 17572503 16225203
58153A6225203j208145j091900r84945q86304q03472p32889o64246n98857n44973
$$ 16225203 15017058 13925158 12940213 12053909 11250437 10517548 9853302 9254445 8709472
58144H709472m99617m52868m05827l67479l37772l09626k83870k66599k55077
$$ 8709472 8209855 7756987 7351160 6983681 6645909 6336283 6052413 5785814 5530737
58135E530737k41001k24732k12536k02875j89027j72451j60318j52173j41734
$$ 5530737 5289736 5065004 4852468 4649593 4460566 4288115 4127797 3975624 3833890
58126C833890j29586j21751j17576j10935j01881r5779r2390q6726p9385p5481
$$ 3833890 3704304 3582553 3464977 3354042 3252161 3156382 3063992 2977266 2897881 2822400
58116B822400p4482p1168o5579o2293o1021n7407n2067m9523m9182m6482m2117
$$ 2822400 2747918 2676750 2611171 2548878 2487857 2430450 2378383 2328860 2279678 2233196 2191079
58105B191079m1024m2875m2458l9131l7365l8087l7683l5592l5008l5937l4985
$$ 2191079 2150055 2107180 2064722 2025591 1988226 1950139 1912456 1876864 1841856 1805919 1770934
58094A770934l2088l0421k9731k6687k1740j8827j8456j7557j5880j5976j7182
$$ 1770934 1738846 1708425 1678694 1652007 1630267 1611440 1592984 1575427 1559547 1543571 1526389
58083A526389j6297j3989j4040j6387j7234j5979j5699j6781j6413j4509j4040
$$ 1526389 1510092 1496103 1482063 1465676 1448442 1432463 1416764 1399983 1383570 1369061 1355021
58072A355021j5218j5216j3844j3742j4801j4079j1496j0049j0090q969o535n520
$$ 1355021 1339803 1324587 1310743 1297001 1282200 1268121 1256625 1246576 1236486 1227517 1220982 1215462
58060A215462o137n732m152m119n805o416n608o086q170q877p254n742n448m762
$$ 1215462 1209325 1203593 1199441 1195322 1189517 1183101 1177493 1171407 1163237 1154360 1147106 1141364 1135916 1131154
58046A131154l363l085m032m151l295l434m496m361l196l355m711m655l128l007
$$ 1131154 1127791 1124706 1120674 1116523 1113228 1109794 1105298 1100937 1097741 1094386 1089675 1085020 1081892 1078885
58032A078885m909o231n988o075p020o967n752n576o732o882n554n012n786n593
$$ 1078885 1073976 1067745 1061757 1055682 1048662 1041695 1035943 1030367 1023635 1016753 1011199 1006187 1000401 994808
58018I94808l774k603k979k875j388l78p39p28N54J508J187Q71J317J500J107
$$ 994808 991034 988431 985452 982577 981189 980811 980072 979344 979898 981406 982593 983464 984781 986281 987388
58003I87388J211J799J681J324K491M669N390M439M096M735M172K006N56N57r2
$$ 987388 988599 990398 992079 993403 995894 1000563 1005953 1010392 1014488 1019223 1023395 1025401 1025957 1026514 1026422
57988A026422k206l826l981m085m489l572j564j205l114m389l392k072j882j303
$$ 1026422 1024216 1020390 1016409 1012324 1007835 1004263 1002699 1001494 998380 993991 990599 988527 986645 985342
57974I85342N64J821J417J398L114M511L679K053J530J376M17k80N02J707J965
$$ 985342 985906 987727 989144 990542 993656 998167 1001846 1003899 1005429 1006805 1007222 1006942 1007444 1009151 1011116
57959A011116J871K253K371J762J592K352K497J261M01J159J996J447Q37J755
$$ 1011116 1012987 1015240 1017611 1019373 1020965 1023317 1025814 1027075 1027476 1028635 1030631 1032078 1032915 1034670
57945A034670L086L095K506L031M359N083N260N847O659O990P203P946Q708Q718
$$ 1034670 1037756 1040851 1043357 1046388 1050747 1055830 1061090 1066937 1073596 1080586 1087789 1095735 1104443 1113161
57931A113161Q296P990P437O262M946L716J951l15j795j955k051l050m105m289
$$ 1113161 1121457 1129447 1136884 1143146 1148092 1151808 1153759 1153444 1151649 1149694 1147643 1144593 1140488 1136199
57917A136199m204m592m884m382l430k352o82J423K632K481K312L038L592K861
$$ 1136199 1131995 1127403 1122519 1118137 1114707 1112355 1111673 1113096 1115728 1118209 1120521 1123559 1127151 1130012
57903A130012J553Q54O97N49N83R19J082J147J916L256L889L647L963N258O008
$$ 1130012 1131565 1132419 1133116 1133665 1134248 1135167 1136249 1137396 1139312 1142568 1146457 1150104 1154067 1159325 1165333
57888A165333N446M959N489N789M895M130M790N815N709N110N355O043N942N161
$$ 1165333 1170779 1175738 1181227 1187016 1191911 1196041 1200831 1206646 1212355 1217465 1222820 1228863 1234805 1239966
57874A239966M545M097L593L635M563N469N682N927O723P042O103M911M529M252
$$ 1239966 1244511 1248608 1252201 1255836 1260399 1265868 1271550 1277477 1284200 1291242 1297345 1302256 1306785 1311037
57860A311037L211K306K736L874M440M616N215N836N649M998M630M232L413L020
$$ 1311037 1314248 1316554 1319290 1323164 1327604 1332220 1337435 1343271 1348920 1353918 1358548 1362780 1366193 1369213
57846A369213L794M667M171K730J929K196K736L083L239K989K368K214L042M109
$$ 1369213 1373007 1377674 1381845 1384575 1386504 1388700 1391436 1394519 1397758 1400747 1403115 1405329 1408371 1412480
57832A412480M612M872N295N369M914N032O418P860P918P026O464O341O055N791
$$ 1412480 1417092 1421964 1427259 1432628 1437542 1442574 1448992 1456852 1464770 1471796 1478260 1484601 1490656 1496447
57818A496447N894N736M686L380K640K006Q17l62q22j237k447l655l516k267j148
$$ 1496447 1502341 1508077 1512763 1516143 1518783 1520789 1521606 1521244 1520422 1519185 1516738 1513083 1509567 1507300 1506152
57803A506152m69K60R28J137J232J640J948J855K173L446M565M337L515L659M738
$$ 1506152 1505683 1505943 1506871 1508008 1509240 1510880 1512828 1514683 1516856 1520302 1524867 1529204 1532719 1536378 1541116
57788A541116N551N736N795N733N295M984N374O068O625P639R434J0733J0387
$$ 1541116 1546667 1552403 1558198 1563931 1569226 1574210 1579584 1585652 1592277 1599916 1609350 1620083 1630470
57775A630470R414R441R950R171P052N252M539M282M190M599N054M562L313K527
$$ 1630470 1639884 1649325 1659275 1668446 1675498 1680750 1685289 1689571 1693761 1698360 1703414 1707976 1711289 1713816
57761A713816K567K698K694L109M013M845N614O833Q233Q907Q742Q625R120R971
$$ 1713816 1716383 1719081 1721775 1724884 1728897 1733742 1739356 1746189 1754422 1763329 1772071 1780696 1789816 1799787
57747A799787J0784J1279J1139J0506J0239J0740J1037J0137Q639P795P630P331
$$ 1799787 1810571 1821850 1832989 1843495 1853734 1864474 1875511 1885648 1894287 1902082 1909712 1917043
57735A917043O889O854O961O529N855N773O119O063N709N924O651O870O148N116
$$ 1917043 1923932 1930786 1937747 1944276 1950131 1955904 1962023 1968086 1973795 1979719 1986370 1993240 1999388 2004504
57721B004504M497M632N633P031P710P174O435O616P352P619P335O940O275N277
$$ 2004504 2009001 2013633 2019266 2026297 2034007 2041181 2047616 2054232 2061584 2069203 2076538 2083478 2089753 2095030
57707B095030M941O051P666Q432Q566Q981R373R057Q793R687J0964J1075J0392
$$ 2095030 2099971 2106022 2113688 2122120 2130686 2139667 2149040 2158097 2166890 2176577 2187541 2198616 2209008
57694B209008J0507J1218J0754Q943P605P589P712P105O451O297O136N836O274
$$ 2209008 2219515 2230733 2241487 2250430 2258035 2265624 2273336 2280441 2286892 2293189 2299325 2305161 2311435
57681B311435P795R525J0752J1691J2591J3452J4819J7454K0959K4205K7241L1241
$$ 2311435 2319230 2328755 2339507 2351198 2363789 2377241 2392060 2409514 2430473 2454678 2481919 2513160
57669B513160L6391M1411M5317M7943M8339M4454L5139K1383N357j0370k2783
$$ 2513160 2549551 2590962 2636279 2684222 2732561 2777015 2812154 2833537 2838894 2828524 2805741
57658B805741k9592l1181l0003k7662k3948j8818j3439q696m401o64J634K457
$$ 2805741 2776149 2744968 2714965 2687303 2663355 2644537 2631098 2622402 2618001 2617337 2618971 2621428
57646B621428L185M707O310P152P578Q171Q849R537J0502J1350J1056R751R053
$$ 2621428 2624613 2629320 2635630 2642782 2650360 2658531 2667380 2676917 2687419 2698769 2709825 2719576 2728629
57633B728629R880J1127J1449J1061J0861J0903J0826J0803J0979J0815R974R229
$$ 2728629 2738509 2749636 2761085 2772146 2783007 2793910 2804736 2815539 2826518 2837333 2847307 2856536
57621B856536R511J0586J1437J1589J1385J1324J1571J1852J1673J0987J0573
$$ 2856536 2866047 2876633 2888070 2899659 2911044 2922368 2933939 2945791 2957464 2968451 2979024
57610B979024J1066J1849J1853J1297J1401J2390J3111J2902J2474J2480J2545
$$ 2979024 2990090 3001939 3013792 3025089 3036490 3048880 3061991 3074893 3087367 3099847 3112392
57599C112392J2223J1798J1577J1374J1217J1494J2017J1969J1251J0798J1169
$$ 3112392 3124615 3136413 3147990 3159364 3170581 3182075 3194092 3206061 3217312 3228110 3239279
57588C239279J1893J2586J3464J4283J4156J3010J2086J2212J2747J2861J2721
$$ 3239279 3251172 3263758 3277222 3291505 3305661 3318671 3330757 3342969 3355716 3368577 3381298
57577C381298J2668J2393J1823J1761J2708J3872J4289J4073J3832J3619J3362
$$ 3381298 3393966 3406359 3418182 3429943 3442651 3456523 3470812 3484885 3498717 3512336 3525698
57566C525698J3481J4286J5263J5764J5850J5897J5936J5944J6120J6438J6548
$$ 3525698 3539179 3553465 3568728 3584492 3600342 3616239 3632175 3648119 3664239 3680677 3697225
57555C697225J6534J6999J7993J8697J8651J8436J8643J9010J9142J9237J9486
$$ 3697225 3713759 3730758 3748751 3767448 3786099 3804535 3823178 3842188 3861330 3880567 3900053
57544C900053J9515J9026J8401J8152J8346J8877J9625K0117J9852J9156J8853
$$ 3900053 3919568 3938594 3956995 3975147 3993493 4012370 4031995 4052112 4071964 4091120 4109973
57533D109973J8979J8772J8128J7897J8385J8887J9009J9212J9637J9777J9716
$$ 4109973 4128952 4147724 4165852 4183749 4202134 4221021 4240030 4259242 4278879 4298656 4318372
57522D318372K0276K1288K1344K0061J9047J9527K0531K0679K0382K0817K1798
$$ 4318372 4338648 4359936 4381280 4401341 4420388 4439915 4460446 4481125 4501507 4522324 4544122
57511D544122K2219K1897K1476K1163K0809K0754K1308K1790K1242J9845J8734
$$ 4544122 4566341 4588238 4609714 4630877 4651686 4672440 4693748 4715538 4736780 4756625 4775359
57500D775359J8614J9286K0117K0411J9768J8746J8554J9529K0569K0682K0292
$$ 4775359 4793973 4813259 4833376 4853787 4873555 4892301 4910855 4930384 4950953 4971635 4991927
57489D991927K0321K0794K1240K1677K2286K2724K2664K2524K2846K3457K3957
$$ 4991927 5012248 5033042 5054282 5075959 5098245 5120969 5143633 5166157 5189003 5212460 5236417
57478E236417K4390K4804K4766K4054K3209K2766K2556K2368K2533K3154K3623
$$ 5236417 5260807 5285611 5310377 5334431 5357640 5380406 5402962 5425330 5447863 5471017 5494640
57467E494640K3575K3564K4046K4596K4819K5155K5916K6456K6254K5926K6189
$$ 5494640 5518215 5541779 5565825 5590421 5615240 5640395 5666311 5692767 5719021 5744947 5771136
57456E771136K6555K6172K5279K4797K5033K5677K6516K7311K7584K7293K7107
$$ 5771136 5797691 5823863 5849142 5873939 5898972 5924649 5951165 5978476 6006060 6033353 6060460
57445F060460K7374K7601K7582K7929K8788K9125K8350K7497K7620K8114K7893
$$ 6060460 6087834 6115435 6143017 6170946 6199734 6228859 6257209 6284706 6312326 6340440 6368333
57434F368333K7210K6969K7069K6908K6783K7325K8138K8404K8304K8547K9071
$$ 6368333 6395543 6422512 6449581 6476489 6503272 6530597 6558735 6587139 6615443 6643990 6673061
57423F673061K9407K9673L0039K9879K8801K7764K7810K8403K8490K8402K9119
$$ 6673061 6702468 6732141 6762180 6792059 6820860 6848624 6876434 6904837 6933327 6961729 6990848
57412F990848L0297L0840L0863L1345L2153L2205L1396L0586K9866K8586K7168
$$ 6990848 7021145 7051985 7082848 7114193 7146346 7178551 7209947 7240533 7270399 7298985 7326153
57401G326153K6991K8269K9570K9850K9571K9544K9885L0501L1428L2341L2710
$$ 7326153 7353144 7381413 7410983 7440833 7470404 7499948 7529833 7560334 7591762 7624103 7656813
57390G656813L2643L2764L3196L3487L3525L3641L3915L4188L4569L5088L5206
$$ 7656813 7689456 7722220 7755416 7788903 7822428 7856069 7889984 7924172 7958741 7993829 8029035
57379H029035L4569L3798L3524L3229L2253L1254L1269L1816L1590L0724L0510
$$ 8029035 8063604 8097402 8130926 8164155 8196408 8227662 8258931 8290747 8322337 8353061 8383571
57368H383571L1134L1462L1195L1395L2529L3649L4019L4127L4564L5052L5110
$$ 8383571 8414705 8446167 8477362 8508757 8541286 8574935 8608954 8643081 8677645 8712697 8747807
57357H747807L4717L4032L3319L3138L3664L3939L3009L1574L1126L1686L1894
$$ 8747807 8782524 8816556 8849875 8883013 8916677 8950616 8983625 9015199 9046325 9078011 9109905
57346I109905L1309L0874L0941L0633K9566K8603K8373K8559K9092L0464L2221
$$ 9109905 9141214 9172088 9203029 9233662 9263228 9291831 9320204 9348763 9377855 9408319 9440540
57335I440540L2786L1607L0169K9976L0719L1242L1190L0806L0145K9339K8804
$$ 9440540 9473326 9504933 9535102 9565078 9595797 9627039 9658229 9689035 9719180 9748519 9777323
57324I777323K8494K7762K6466K5405K5104K5135K5120K5376K5989K6273K5872
$$ 9777323 9805817 9833579 9860045 9885450 9910554 9935689 9960809 9986185 10012174 10038447 10064319
57313A0064319K5425K5458K5513K5126K4713K4722K4673K3942K2812K1945K1427
$$ 10064319 10089744 10115202 10140715 10165841 10190554 10215276 10239949 10263891 10286703 10308648 10330075
57302A0330075K0987K0734K0942K1511K2147K2718K3009K2648K1636K0528J9839
$$ 10330075 10351062 10371796 10392738 10414249 10436396 10459114 10482123 10504771 10526407 10546935 10566774
57291A0566774J9621J9737J9972J9769J8654J7023J5803J5204J4589J3640J2716
$$ 10566774 10586395 10606132 10626104 10645873 10664527 10681550 10697353 10712557 10727146 10740786 10753502
57280A0753502J1951J1082J0395J0663J1716J2218J1468J0360R980J0138J0026
$$ 10753502 10765453 10776535 10786930 10797593 10809309 10821527 10832995 10843355 10853335 10863473 10873499
57269A0873499R508R001Q671Q401Q071P475O462N438N089N375N528N197M814M589
$$ 10873499 10883007 10892008 10900679 10909080 10917151 10924626 10931088 10936526 10941615 10946990 10952518 10957715 10962529 10967118
57255A0967118M100L153K135J129l03k069l272l506l577m388n909p620r177j0224
$$ 10967118 10971218 10974371 10976506 10977635 10977332 10975263 10971991 10968485 10964908 10960520 10954611 10946991 10937814 10927590
57241A0927590j0445j0205j0265j0615j0439r526q621q123p590o834o288n877
$$ 10927590 10917145 10906940 10896675 10886060 10875621 10866095 10857474 10849351 10841761 10834927 10828639 10822762
57229A0822762m809l058j643q57L75K647M956O362P361Q612R583R661R427R623
$$ 10822762 10817953 10814895 10813252 10812395 10812770 10815417 10820373 10826735 10834096 10842708 10852291 10861952 10871379 10881002
57215A0881002R894R719R529R702R560Q649Q026Q742R885R709Q036N943L525k78
$$ 10881002 10890896 10900615 10910144 10919846 10929406 10938055 10946081 10954823 10964708 10974417 10982453 10988396 10991921 10991643
57201A0991643n679j1257j5372j7422j7678j6772j5389j3928j2493j1492j1649
$$ 10991643 10985964 10974707 10959335 10941913 10924235 10907463 10892074 10878146 10865653 10854161 10842512
57190A0842512j2926j4274j5083j6158j8383k1294k3969k6621l0056l4128l7763
$$ 10842512 10829586 10815312 10800229 10784071 10765688 10744394 10720425 10693804 10663748 10629620 10591857
57179A0591857m0232m1480m1643m1271m1564m3343m6029m8443n0216n1695n3059
$$ 10591857 10551625 10510145 10468502 10427231 10385667 10342324 10296295 10247852 10197636 10145941 10092882
57168A0092882n4484n6542n9474o2530o5013o7414p0544p4115p7229p9845q2524
$$ 10092882 10038398 9981856 9922382 9859852 9794839 9727425 9656881 9582766 9505537 9425692 9343168
57157I343168q5176q7150q8320q9032q9230q8625q7440q6036q4084q1076p7353
$$ 9343168 9257992 9170842 9082522 8993490 8904260 8815635 8728195 8642159 8558075 8476999 8399646
57146H399646p3725p0414o7197o4183o1512n8752n5618n2823n1252n0762n0778
$$ 8399646 8325921 8255507 8188310 8124127 8062615 8003863 7948245 7895422 7844170 7793408 7742630
57135G742630n1602n3943n7652o2093o7385p4044q1665q9112r5790j01553j05636
$$ 7742630 7691028 7637085 7579433 7517340 7449955 7375911 7294246 7205134 7109344 7007791 6902155
57124F902155j06862j04819r9795r1851q1037o8374n5690m4665l6964l4611l8736
$$ 6902155 6795293 6690474 6590679 6498828 6417791 6349417 6293727 6249062 6212098 6177487 6138751
57113F138751m7718n7556o4461o7067o6756o6118o6092o3947n5347l9148j8850
$$ 6138751 6091033 6033477 5969016 5901949 5835193 5769075 5702983 5639036 5583689 5544541 5525691
57102E525691J816K2957M6979P5125J07862J46955J94386K50168L13586L85275
$$ 5525691 5527507 5550464 5597443 5672568 5780430 5927385 6121771 6371939 6685525 7070800
57092G070800M65364N50863O37414P21487P96882Q50415Q64890Q25086P19373
$$ 7070800 7536164 8087027 8724441 9445928 10242810 11093225 11958115 12783201 13502574
57083A3502574N45912L33405J54999R7743J94337L82405N41761N78098M74093
$$ 13502574 14048486 14381891 14536890 14634633 14828970 15211375 15753136 16331234 16805327
57074A6805327K72855L0389k13613m37441o30629p89650r13700j000751j048201
$$ 16805327 17078182 17108571 16894958 16457517 15826888 15037238 14123538 13122787 12074586
57065A2074586j056824j032090r81626r12863q32762p47786o63207n82771n09075
$$ 12074586 11017762 9985672 9004046 8091183 7258421 6510635 5847428 5264657 4755582
57056D755582m43770l87537l40239l01075k68533k40731k16264j94510j75024
$$ 4755582 4311812 3924275 3584036 3282961 3014428 2773697 2557433 2362923 2187899
57047B187899j57173j40696j26031j13690j03507r4793q6853p9135p1292o3495
$$ 2187899 2030726 1890030 1763999 1650309 1546802 1452009 1365156 1286021 1214729 1151234
57037A151234n6219m9470m2602l5243k7882k1043j4323o913J292R813J8319K6062
$$ 1151234 1095015 1045545 1002943 967700 939818 918775 904452 897539 898831 908644 926963 953025
57025I53025L0471K7713J5782l176k4136m2381n5231o1692o2097n8258n2709m7059
$$ 953025 983496 1011209 1026991 1023815 999679 957298 902067 840375 778278 720020 667311 620252
57013F20252m1481l5952l1133k7484k4412k1153j8014j5831j4570j3367j1820
$$ 620252 578771 542819 511686 484202 459790 438637 420623 404792 390222 376855 365035
57002C65035j0356r322q581q092q119q569q772q239p187o054m922l623k041j27
$$ 365035 354679 345357 336776 328684 320565 311996 303224 294985 287798 281744 276822 273199 271158 271031
56988B71031K097M375O376Q063R630J1024J1850J1640R956O416J225m347q630
$$ 271031 273128 277503 283879 291942 301572 312596 324446 336086 346042 352458 353683 349336 340706
56975C40706j0860j1475j1191j0320r004p500o001m552l194j814k0K351M709O369
$$ 340706 329846 318371 307180 296860 287856 280356 274355 269803 266609 264795 264775 267126 271835 278204
56961B78204P639R543J2434J5619J8364K0262K0480J7717J1539L166n522j3065
$$ 278204 285843 295386 307820 323439 341803 362065 382545 400262 411801 414967 409445 396380
56949C96380j8352k0531j9818j7760j5783j3846j1181p935n177l407j858N02L752
$$ 396380 378028 357497 337679 319919 304136 290290 279109 271174 265997 262590 260732 261234 264986
56936B64986P050R677J1903J4692J8419K2056K3936K3240K0207J4999P250k700
$$ 264986 272036 281713 293616 308308 326727 348783 372719 395959 416166 431165 438415 435715
56924D35715j2806k0385k4164k4932k4321k3379k2229k0617j8490j6057j3478
$$ 435715 422909 402524 378360 353428 329107 305728 283499 262882 244392 228335 214857
56913B14857j0781q254o550n998n931n315m030k968k753k911k569j497j48R87
$$ 214857 204076 195822 189272 183274 177343 172028 167998 165030 162277 159366 156797 155300 155152 156139
56899A56139J768K357L023L827M527M964N447O424P856R371J0886J2582J4359
$$ 156139 157907 160264 163287 167114 171641 176605 182052 188476 196332 205703 216589 229171 243530
56886B43530J5941J7357J8556J8531J5796J0157L300k772p309j0459j2100j1807
$$ 243530 259471 276828 295384 313915 329711 339868 343168 340396 333087 322628 310528 298721
56874B98721r720o767l973j732K39K401M856P356R919J3059J7144K1771K6258
$$ 298721 289001 282234 278261 276529 276768 279169 284025 291381 301300 314359 331503 353274 379532
56861C79532L0446L4416L7662L9083L7576L2062K1690P186q240k0647k8262l1815
$$ 379532 409978 444394 482056 521139 558715 590777 612467 619653 611413 590766 562504 530689
56849E30689l2304k9899k5099j9318j3548p618j402M417R440J4470K0491K7549
$$ 530689 498385 468486 443387 424069 410521 402903 401501 405918 415358 429828 450319 477868
56837D77868L5239M3442N1868N9593O5556O8579O6447N6258L7000J1397j5471
$$ 477868 513107 556549 608417 668010 733566 802145 868592 924850 961850 973247 957776
56826I57776l8866n5611o4271o5524o1787n5372m7318l8371k9949k2996j6798
$$ 957776 918910 863299 799028 733504 671717 616345 569027 530656 500707 477711 460913
56815D60913j0155l102L639J0277J7589K5370L2584L8822M4245M7969M7623M0891
$$ 460913 450758 447656 451295 461572 479161 504531 537115 575937 620182 668151 715774 756665
56803G56665K7071P575j4266l4101m8427n6094n7875n5098m9252m2171l5255k8614
$$ 756665 783736 791311 777045 742944 694517 638423 580548 525450 476198 434027 398772 370158
56791C70158k1825j5377j0365o794l268J389O939J2329J6828K0420K3463K6037
$$ 370158 348333 332956 322591 315797 312529 313918 320857 333186 350014 370434 393897 419934
56779D19934K7258K5413J9229R096l198j5446k5516l1727l3750l2944l1019k8592
$$ 419934 447192 472605 491834 500930 497732 482286 456770 425043 391293 358349 327330 298738
56767B98738k5554k2282j9473j7154j4919j2939j1678j0690q928o419m561m345
$$ 298738 273184 250902 231429 214275 199356 186417 174739 164049 155121 148702 144141 139796
56755A39796n046n205m249k745j526j020j110j339j294r47n73m21n61q81j051
$$ 139796 134750 129545 125296 122551 121025 120005 118895 117556 116262 115315 114742 114321 113760 112879 111828
56740A11828p63k44j60p30j284j123l94K91O80Q18O06jo02p70n42j03O34J606
$$ 111828 111065 110821 110661 109931 108647 107524 107130 107421 108101 108919 109525 109524 108922 108152 107610 107507 108141 109747
56722A09747K246K173J770J497J128M01j68qM16K38l67m06M29J436J973K017J695
$$ 109747 111993 114166 115936 117433 118561 118962 118794 118786 119202 119440 119073 118667 119096 120532 122505 124522 126217
56705A26217J128O67N94O47M49J75J80K87K32L96J141J808J486N59K36O98R27
$$ 126217 127345 128012 128606 129253 129702 129877 130057 130344 130576 130972 132113 133921 135407 135966 136202 136900 137827
56688A37827M74Q3L32Q00J033J242J589J614J010K73K6J66J17l98j129j621j597
$$ 137827 138301 138384 138716 139516 140549 141791 143380 144994 146004 146277 146303 146469 146586 146188 145059 143438 141841
56671A41841j221r85j047r44l11M34O57M97N54Q75R85P67N66M79L45L16O66J092
$$ 141841 140620 139635 138588 137644 137333 137767 138424 138921 139475 140350 141335 142102 142668 143147 143492 143808 144474 145566
56653A45566R90L62k39o19j001j273j047m16J11L92O70R10Q87P87Q54P00j58j211
$$ 145566 146556 146918 146679 146060 145059 143786 142739 142323 142434 142826 143496 144406 145293 146080 146934 147634 147476 146265
56635A46265j444q02r7L93J047J640J317R3q86r14n13l26k82k25k90l01K14R52
$$ 146265 144821 144019 143922 144315 145362 147002 148319 148412 147526 146612 146099 145773 145491 145266 144976 144675 144889 145841
56617A45841Q43l70j545j697j256j134j373j424j097n65Q9P33J046Q97N38J56
$$ 145841 146684 146314 144769 143072 141816 140682 139309 137885 136788 136223 136312 137045 138091 138988 139526 139682
56601A39682k24l61Q6Q76J345J306J138Q09j54j495j996r88O92J756J894J624
$$ 139682 139458 139097 139183 140059 141404 142710 143848 144657 144503 143008 141012 140024 140716 142472 144366 145990
56585A45990J379J245J174R86N42Q4P0N39J144J775K538L171L232K870K633K548
$$ 145990 147369 148614 149788 150774 151316 151400 151470 152009 153153 154928 157466 160637 163869 166739 169372 171920
56569A71920K224J896K282L370M367N079O147P708R019R795J0669J1757J2044
$$ 171920 174144 176040 178322 181692 186059 191138 197285 204993 214012 223807 234476 246233 258277
56556B58277J0848Q809O659M119R05k123l822m182l954l507k832k186j909j973
$$ 258277 269125 277934 284593 288712 289617 287494 283672 279490 275536 272029 269197 267011 265102 263129
56542B63129k262k816l410l476k972k689l089l490l066k122j651k049k859l467
$$ 263129 260867 258051 254641 251165 248193 245504 242415 238925 235859 233737 232086 230037 227178 223711
56528B23711l545l153k748k758k921k539j508m89K5J08k82j287k245j966m81N80
$$ 223711 220166 217013 214265 211507 208586 206047 204539 204050 204075 204183 203901 202614 200369 198403 197922 198502
56512A98502P0j137j557j110p72r35j133j005o51l40m61j297k366k547j441j7
$$ 198502 198572 197435 195878 194768 193996 193061 191928 190923 190272 189932 189471 188174 185808 183261 181820 181803
56496A81803O80P80R23J037O77K8l29l33l59m44l01J10O00J097J500J488R72M80
$$ 181803 182483 183263 184186 185223 185900 185928 185599 185266 184907 184463 184162 184272 184872 185969 187469 188957 189929 190409
56478A90409N88J161J541J339P57L28M14P98Q23K71j12M25J391J630R73L30J46
$$ 190409 190997 192158 193699 195038 195795 196123 196537 197335 198158 198429 198317 198742 200133 201763 202736 203066 203212
56461B03212l1l14j18O07J027Q42Q04J246J251J49j221j644j091l26L29R98J608
$$ 203212 203181 202867 202749 203356 204383 205225 206029 207275 208526 208675 207454 205810 204719 204393 204722 205720 207328
56444B07328J976K032J576M63o98q74K7R48J194J099R17L01o28r37l14L19L40
$$ 207328 209304 211336 212912 213375 212677 211803 211830 212778 213972 215071 215988 216289 215661 214724 214410 214729 215069
56427B15069L44Q39J279J150Q48O30J7r45j152j67Q05P87N30R65J473J084K94
$$ 215069 215413 216252 217531 218681 219529 220159 220176 219231 218079 217912 218717 219504 220034 220999 222472 223556 223850
56410B23850J51M93N69N79J187K086K388J904J017m8q60o29N35J175L65q59j099
$$ 223850 224001 224494 225063 225642 226829 228915 231303 233207 234224 234176 233316 232687 233222 234397 234762 233903 232804
56393B32804m74J98R46J961K508K017J295J220J228O00R8O45J414J106K31K36
$$ 232804 232330 232528 233474 235435 237943 239960 241255 242475 243703 244303 244401 245046 246460 247566 247797 248033
56377B48033J016J254O85J45j70o71j003l78R42K055K792L305K945J330j75Q1
$$ 248033 249049 250303 250988 251133 250963 250292 249289 248911 249853 251908 254700 258005 260950 262280 262105 262186
56361B62186J503K140J633J325J717J874J353Q33P11P36J108K227L376L260J996
$$ 262186 263689 265829 267462 268787 270504 272378 273731 274564 275275 276011 277119 279346 282722 285982 287978
56346B87978J056J109J424J401J331J466J615J747J865J566P72N31J716L462M241
$$ 287978 289034 290143 291567 292968 294299 295765 297380 299127 300992 302558 303330 303861 305577 309039 313280
56331C13280M033L893L919L497L077L778N283O020N394M208K966J510K80J13P07
$$ 313280 317313 321206 325125 328622 331699 335477 340760 346780 352174 356382 359348 360858 361138 361251 361958
56316C61958Q31K56n4L67J018J542J938J884J325J363K933M966N647N130N077
$$ 361958 362789 363045 362991 363358 364376 365918 367856 369740 371065 372428 375361 380327 385974 391104 396181
56301C96181N838O216N796N442N399N007M433M622N395N546M991M855N315N413
$$ 396181 402019 408235 414031 419473 424872 429879 434312 438934 444329 449875 454866 459721 465036 470449
56287D70449N203N914P618Q790Q724Q457Q846R493J0085J0989J2070J2633J2833
$$ 470449 475652 481566 489184 497974 506698 515155 524001 533494 543579 554568 566638 579271 592104
56274E92104J3586J4849J5716J6299J7563J9220J9970K0054K1333K4371K7638
$$ 592104 605690 620539 636255 652554 670117 689337 709307 729361 750694 775065 802703
56263H02703L0203L2976L6562M0101M3222M7140N2712N9073O5234P1499P8520
$$ 802703 832906 865882 902444 942545 985767 1032907 1085619 1144692 1209926 1281425 1359945
56252A359945Q6333R4958J04511J14170J22524J29414J35959J42389J47453J50203
$$ 1359945 1446278 1541236 1645747 1759917 1882441 2011855 2147814 2290203 2437656 2587859
56242B587859J50604J48153J41743J31292J17685J00884Q0100N6073L1096O394
$$ 2587859 2738463 2886616 3028359 3159651 3277336 3378220 3458320 3514393 3545489 3551883
56232C551883j8345m2507o4066q2133r7721j11324j21960j29311j34406j37444
$$ 3551883 3533538 3491031 3426965 3344832 3247111 3135787 3013827 2884516 2750110 2612666
56222B612666j37306j34102j29824j25446j19820j12391j04638r7597r0337q2294
$$ 2612666 2475360 2341258 2211434 2085988 1966168 1853777 1749139 1651542 1561205 1478911
56212A478911p4871o9224o4504n9655n5077n1126m6914m2026l7577l4243l1003
$$ 1478911 1404040 1334816 1270312 1210657 1155580 1104454 1057540 1015514 977937 943694 912691
56201I12691k7096k3449k0909j8788j6419j4363j3007j1644j0104r378r570r160
$$ 912691 885595 862146 841237 822449 806030 791667 778660 767016 756912 747534 737964 728804
56189G28804p445n787n256m969l975k822k123j405n49l82p51j54J613K629J920
$$ 728804 721359 715572 710316 705347 701372 698550 696427 695022 694473 694091 693340 693186 694799 697428 699348
56174F99348J139J819L124L765M012M382M402M092M577N902O419N686N641P458
$$ 699348 700487 702306 705430 709195 713207 717589 721991 726083 730660 736562 742981 748667 754308 761766
56160G61766R591J0528J1160J2639J4196J4936J5715J7442J9451K1143K3260K6092
$$ 761766 771357 781885 793045 805684 819880 834816 850531 867973 887424 908567 931827 957919
56148I57919K8610L0684L3820L8307M2241M4883M8145N3106N7998O1600O5485
$$ 957919 986529 1017213 1051033 1089340 1131581 1176464 1224609 1277715 1335713 1397313 1462798
56137A462798P0559P4304P4050P0456O5253N8359N0003M2948L9475L8112L6117
$$ 1462798 1533357 1607661 1681711 1752167 1817420 1875779 1925782 1968730 2008205 2046317 2082434
56126B082434L3004K9080K2927J3565L165n369j1879j7615k2483k6401l1336l9034
$$ 2082434 2115438 2144518 2167445 2181010 2184175 2178806 2166927 2149312 2126829 2100428 2069092 2030058
56114B030058m8254n6748o4164p0595p4333p3861p0261o5230n8632n0344m2278
$$ 2030058 1981804 1925056 1860892 1790297 1715964 1642103 1571842 1506612 1447980 1397636 1355358
56103A355358l5950l0183k3709j7831j3923j0761o971l725k200r43J405L359L497
$$ 1355358 1319408 1289225 1265516 1247685 1233762 1223001 1216030 1212305 1210105 1209162 1210567 1213926 1217423
56090A217423L421M773O077N838N932Q302J1034J1455J0648J1085J2207J2250
$$ 1217423 1220844 1225617 1231694 1237532 1243464 1251766 1262800 1274255 1284903 1295988 1308195 1320445
56078A320445J2080J3313J4877J5214J5644J7683J9537J9224J8650K0404K2898
$$ 1320445 1332525 1345838 1360715 1375929 1391573 1409256 1428793 1448017 1466667 1487071 1509969
56067A509969K3122K1890K1914K2783K2401K1455K1928K2990K2736K2105K2854
$$ 1509969 1533091 1554981 1576895 1599678 1622079 1643534 1665462 1688452 1711188 1733293 1756147
56056A756147K3663K2545K1083K1894K3976K4832K4978K6024K6803K5924K5600
$$ 1756147 1779810 1802355 1823438 1845332 1869308 1894140 1919118 1945142 1971945 1997869 2023469
56045B023469K8198L1529L2382L2040L3382L5355L5658L6022L9176M3193M4591
$$ 2023469 2051667 2083196 2115578 2147618 2181000 2216355 2252013 2288035 2327211 2370404 2414995
56034B414995M4430M5710M7386M6936M6139M8125N1299N2371N2672N5234N8455
$$ 2414995 2459425 2505135 2552521 2599457 2645596 2693721 2745020 2797391 2850063 2905297 2963752
56023B963752N9284N9685O3063O7333O8668O9150P3112P8842Q1801Q3194Q7169
$$ 2963752 3023036 3082721 3145784 3213117 3281785 3350935 3424047 3502889 3584690 3667884 3755053
56012C755053R2317R4447R5199R9276J05524J09495J12379J18395J25936J30540
$$ 3755053 3847370 3941817 4037016 4136292 4241816 4351311 4463690 4582085 4708021 4838561
56002D838561J34167J41904J52066J59416J65525J75609J87779J96327K03079
$$ 4838561 4972728 5114632 5266698 5426114 5591639 5767248 5955027 6151354 6354433
55993F354433K14310K28775K40539K51145K66934K86636L04174L21371L44799
$$ 6354433 6568743 6797518 7038057 7289202 7556136 7842772 8146946 8468317 8813116
55984H813116L72501L97543M22216M54396M92399N28729N66269O14540O72179
$$ 8813116 9185617 9583160 10005376 10459772 10952171 11480900 12047169 12661709 13333888
55975A3333888P30371P91662Q67281R57751J055191J163168J294366J450352J625108
$$ 13333888 14064259 14855921 15723202 16680953 17736144 18899312 20193678 21644030 23269138
55966B3269138J827058K075236K375570K724955L135548L627382M199085M836551
$$ 23269138 25096196 27171432 29547002 32271957 35407505 39034887 43233972 48070523
55958D8070523N550316O374523P334569Q454272R791699J1424966J3406741J5779506
$$ 48070523 53620839 59995362 67329931 75784203 85575902 97000868 110407609 126187115
55950A26187115J8614879K1941719K5591960K9138989L1917542L2945468L0877057
$$ 126187115 144801994 166743713 192335673 221474662 253392204 286337672 317214729
55943C17214729K4466171J3579392j08334j3647206k4311988l0804667l3321426
$$ 317214729 341680900 355260292 355151958 341504752 317192764 286388097 253066671
55936B53066671l2843239l0479319k7179859k3633057k0223569j7105465j4344737
$$ 253066671 220223432 189744113 162564254 138931197 118707628 101602163 87257426
55929H7257426j1983241j0012380q374618p016794n908378n009853m267125l644992
$$ 87257426 75274185 65261805 56887187 49870393 43962015 38952162 34685037 31040045
55921C1040045l133621k717754k368736k069703j820724j614953j434077j270379
$$ 31040045 27906424 25188670 22819934 20750231 18929507 17314554 15880477 14610098
55913A4610098j130421j013656r08277q10727p29203o64609o06351n50011n01950
$$ 14610098 13479677 12466021 11557744 10747017 10017814 9353205 8746854 8196843 7694893
55904G694893m63444m26481l88359l55425l29382l03871k77252k55343k39053
$$ 7694893 7231449 6804968 6416609 6061184 5731802 5427931 5150679 4895336 4656283
55895D656283k22003k02709j86993j76116j64294j49933j38120j29990j20635
$$ 4656283 4434280 4231571 4044578 3868462 3704168 3554235 3416115 3286125 3165490
55886C165490j09385j01460r7460r1715q3096p7396p6846p6965p5685p6053p7867
$$ 3165490 3056105 2954645 2857185 2765470 2682374 2604978 2528132 2451167 2375482 2299429 2221562
55875B221562p6231p0727o7004o6864o5494o0807n6863n5573n3334m8645m5110
$$ 2221562 2145331 2074604 2007600 1940736 1875242 1814435 1757572 1701999 1648665 1600020 1554910
55864A554910m4182m2396l8523l6196l6815l6784l4361l2552l2760l2078k9343
$$ 1554910 1510728 1468332 1429809 1393613 1356798 1320014 1285653 1253101 1220341 1188263 1158920
55853A158920k7457k7384k6092k2794k1045k2314k3373k2468k2137k3553k3850
$$ 1158920 1131463 1104079 1077987 1055193 1034148 1011834 988461 965993 943856 920303 896453
55842H96453k1642j9735j9880j9911j8465j7449j7614j6682j4016j2311j2600
$$ 896453 874811 855076 835196 815285 796820 779371 761757 745075 731059 718748 706148
55831G06148j2446j0923j0396j1472j1236q661o816p474q338p775p566q656q927
$$ 706148 693702 682779 672383 660911 649675 641014 634198 626724 618386 610611 603045 594389 585462
55818E85462p585p186q828r709q056o124n835n624m210l350m112m240k067M99
$$ 585462 577877 570691 561863 552154 544098 537974 532139 526515 522305 518955 514843 510603 508536 509035
55804E09035J505K083L615N000N273N699O976P360N727L568J909o28m665q077
$$ 509035 510540 512623 516238 521238 526511 532210 539186 546546 552273 555841 557750 557122 552457 544380
55790E44380r247r364r626r115p402o194o467o887o875q109j1105j3424j3369
$$ 544380 535133 525769 516143 507028 499626 493432 486965 480078 473203 465094 453989 440565 427196
55777D27196j2449j2179j1475r401p486o930o248m066j728r13r44n97l04o65r30
$$ 427196 414747 402568 391093 381692 374206 367276 361028 356962 355234 354321 353377 352780 352476 351811 350881
55762C50881p45j185k495l119k421j901k299k249j269j201k929m603m957n538
$$ 350881 350136 348951 346456 343337 340916 339015 336716 334467 333198 331997 329068 324465 319508 313970
55748C13970p544r360r460r014r329r274p731o137o078o512n786m428l644k987
$$ 313970 306426 297066 287606 278592 269263 259989 252258 246121 240043 233531 227745 223317 219673 216686
55734B16686j723o97p08q51l40j57j032j841j778k023l341m217l449k431k694
$$ 216686 214963 214266 213558 212707 212367 212210 211178 209337 207559 205536 202195 197978 194529 192098 189404
55719A89404l275k786k003k087k146r93L69M42k00k45kk85m91J03O10K44J37J374
$$ 189404 186129 183343 181340 179253 177107 176114 176483 176925 176725 176480 176478 176193 175702 175805 176415 176659 176796 178170
55701A78170K729K551J390O04j18j613l061l171k392j868j431o53m00j284j872
$$ 178170 180899 183450 184840 185444 185326 183713 180652 177481 175089 173221 171790 171137 170737 169453 167581
55686A67581o65J427K693L390M590N568M893L172K247K303J980Q22l94j257j855
$$ 167581 166916 168343 171036 174426 179016 184584 189477 192649 194896 197199 199179 200001 199607 198350 196495
55671A96495j912j345r76j182r19M66J588R96m08q58m64m60p20k61O14Q85Q75
$$ 196495 194583 193238 192262 191080 190161 190627 192215 193211 192803 191945 191481 191021 190301 190040 190654 191539 192414
55654A92414J625K681K602J366M07M63R61J284J143J34j658l067l269l212m213
$$ 192414 194039 196720 199322 200688 201095 201558 202519 203803 204946 205080 203422 200355 197086 193874 189661
55639A89661n771o288n469m486m172m399m822n041m488l236k337k375k450j647
$$ 189661 183890 177602 172133 167647 163475 159076 154254 149213 144725 141489 139152 136777 134327 132680
55625A32680n30k5J07L92L28n33j242p60K58M26l36j218j999k737k860k118j511
$$ 132680 132150 132125 132232 132624 132952 132419 131177 130417 130675 131101 130765 129547 127548 124811 121951 119833 118322
55608A18322j814k100j261J9M08O6p9k34j093k035j903r60l60k65j22q8n71r68
$$ 118322 116508 114408 113147 113166 113574 113640 113561 113327 112234 110199 108296 107336 106976 106711 106589 106501 105930 104962
55590A04962o06k22p63j464r62L55J000Q38R11J339J384J294K006L209L560K859
$$ 104962 104356 104134 103371 101907 100945 101300 102300 103138 104049 105388 106772 108066 110072 113281 116841 119700
55574A19700K299K532L125L870N046O292O708O164N250M013K046k47j756k099
$$ 119700 121999 124531 127656 131526 136572 142864 149572 155736 160986 164999 167045 166798 165042 162943
55560A62943j952k023k593l684m830n148m504l879l811l456k323j628k381l300
$$ 162943 160991 158968 156375 152691 147861 142713 138209 134330 130519 127063 124740 123112 120731 117431
55546A17431k583q42j51q09j228p44l21n23p40o03n19n70l38J9j08o00p21l88
$$ 117431 114848 114006 113855 113046 111818 111074 110753 110230 109490 108887 108368 107798 107460 107479 107371 106771 106050 105662
55528A05662j65k39m17p87j309j293n06o0q71k014k079j442j363j654j166j33
$$ 105662 105497 105258 104841 104054 102745 101452 100946 100886 100015 98001 95922 94480 93117 91463 90297 90164
55512I0164P6p18j363j418j440j434q55j39l26j125j158j81O07N18L6m78j108
$$ 90164 90240 89522 88159 86741 85301 83867 83012 82873 82547 81422 80264 80083 80690 81208 81244 80766 79658
55495G9658j439q65J00L66L8J02M73J87o22p48lN17M10M38Q76J070Q87R51J242
$$ 79658 78219 77354 77454 77820 77858 77960 78433 78620 77998 77250 77247 77764 78174 78612 79488 80558 81445 82396 83638
55476H3638J014L32J07M60O02M40O41J031O27n52j315j233j062j072o39K19N89
$$ 83638 84652 84984 85091 85551 86153 86593 87234 88265 88892 88340 87025 85792 84730 83658 83019 83238 83827
55459H3827K92J20K28j20q37p84K54J041Q02J88j24l43n60l20L20O44N29N89Q54
$$ 83827 84119 84239 84467 84347 83510 82726 82980 84021 84823 85011 84887 84544 83984 83664 83984 84628 85157 85746 86600
55440H6600O70R9r6J0m05j149j074j87J43m94q13KJ116J609J642J424O48m79j003
$$ 86600 87270 87369 87273 87283 86878 85729 84655 84468 84611 84117 83304 83306 84422 86031 87673 89097 89745 89266 88263
55421H8263o87k40J06P95J463J117J48J80J402J989R56m70j076j263j465j050
$$ 88263 87576 87336 87442 88237 89700 90817 90965 91145 92547 94536 95492 95022 93946 92683 91218 90168
55405I0168L0L73o92j751j465n64k96m65l76l21o85q32l28J2l87n39M43J586J497
$$ 90168 90198 90571 89879 88128 86663 86099 85803 85338 84962 84641 83956 83124 82796 82808 82421 81882 82325 83911 85408
55386H5408N47N2P8k90j139j619j330o00J75N91J59r51j600j007K09J020J309
$$ 85408 85955 86007 86085 85795 84656 83037 81707 81107 81282 81873 82032 81081 79481 78474 78683 79703 81012
55369H1012J477J483J093M86p2n42o55m0P83O69l43q30k26K05m37j090o02K19
$$ 81012 82489 83972 85065 85551 85479 84937 84282 84242 85025 85694 85351 84521 84295 84500 84063 82973 82371 82590
55351H2590J8p87q14o4K62k08p16p69n66k62R3J64j60k52L61J076J061N34K13
$$ 82590 82608 81821 81007 80943 81205 80997 80281 79512 78946 78684 78777 78941 78781 78529 78890 79966 81027 81561 81774
55332H1774R3k07m11jO95Q35L13k30m67o30q78j123j253j108n14K61N80L19P3
$$ 81774 81867 81660 81249 81248 81943 82778 83091 82861 82394 81764 80886 79763 78510 77402 76888 77149 77729 78048 78121
55313G8121R0j68r46j557j447j021p86n01R4O31Q70J161J452R70k36o85M55J744
$$ 78121 78211 78043 77097 75540 74093 73072 72286 71785 71879 72510 73380 74541 75993 76963 76727 76042 76497 78241
55295G8241J398r2q54m20K4j94m71k94j5k4j36j5M09R90J319R21m9p52p08l95
$$ 78241 79639 79547 78693 78273 78297 78103 77632 77338 77323 77299 77163 77148 77557 78547 79866 80787 80738 79986 79278 78883
55275G8883l02j48K98N09J01k78K1M92L14k75m72k01R7M26R61J291R67M01K40
$$ 78883 78581 78433 78731 79240 79341 79063 79084 79576 79890 79615 79143 78942 79039 79465 80426 81717 82684 83085 83325
55256H3325L42K53J93N60R69P98K93J20K64K85K13L06K81j59n98n53l48m79o60
$$ 83325 83667 83920 84113 84673 85642 86440 86733 86853 87117 87402 87615 87921 88202 88043 87445 86892 86544 86065 85405
55237H5405n23n86j350k104j816p18J63N37P22N58j27n48J03J042Q55k24n77L12
$$ 85405 84882 84296 82946 80842 79026 78308 78471 79008 79730 80288 80161 79613 79716 80758 81613 81389 80812 81124
55219H1124J214J159N79J46k31p20r71o97r6N63J114J240Q10L96O45J165J000
$$ 81124 82338 83497 84076 84222 83991 83271 82300 81603 81507 82070 83184 84424 85234 85630 86275 87440 88440
55202H8440R1o40p23o10o26m46J11O36P23L83k46r60j268p73J34O16M61K42M05
$$ 88440 88531 87891 87168 86558 85932 85486 85597 86233 86956 87339 87093 86133 84865 84092 84226 84842 85303 85545 85950
55183H5950Q04J114J107O56n5m58k25K71N36O63Q66Q68M17r9k60l10m91l61L45
$$ 85950 86754 87868 88975 89631 89576 89118 88893 89164 89700 90363 91229 92097 92514 92415 92155 91845 91354 90993 91338
55164I1338Q37M47n6L76J119P25o33j287o71p3m71j120r39j26L13j19j082j844
$$ 91338 92175 92622 92566 92942 94061 94786 94153 92866 92195 92122 91651 90531 89592 89466 89779 89660 88578 86734
55146H6734j766q71J4K05P7L52Q21P33J99R7N91Q97O35L21L35L81K22O3%j39k43
$$ 86734 84968 84097 84111 84316 84393 84745 85566 86299 86498 86595 87186 88083 88718 89039 89374 89755 89977 90040 90040 89901 89658
55125H9658RM03L74k4j53J43L54K34R5O7m3j70m5J28q2m21k08M27O08P2m79m83
$$ 89658 89667 90070 90444 90420 90267 90410 90764 90998 91093 91160 91117 90947 90902 91030 90948 90527 90319 90746 91354 91426 90947 90464
55103I0464j20L49R14J358J304Q69N31L58Q9j21J03N34O61O80J112J612J323L52
$$ 90464 90344 90693 91607 92965 94269 95138 95669 96027 96116 95995 96098 96632 97293 97973 99085 100697 102020 102372
55085A02372l05k95j09J57Q67J630J508O69L78R53J193L64o99j044r11r06j047
$$ 102372 102067 101772 101663 101820 102687 104317 105825 106494 106872 107825 109018 109382 108683 107639 106728 105822 104775
55068A04775j286j823k286j765l07P01L94m30p06n42m54k55L31Q31P42M15L68
$$ 104775 103489 101666 99380 97615 97308 98009 98403 97973 97267 96725 96271 96016 96347 97178 97920 98335 98703
55051I8703M25K63R4J46J44k9L6L71K53n41j031m93K78J93m32n52j12R4r8j13
$$ 98703 99128 99391 99485 99631 99775 99746 99782 100153 100406 99865 98834 98341 98619 98812 98380 97828 97716 97810 97712 97599
55031I7599K31M87M31K59k1n99j240j327n79O54J822K504K433J642N61k26l98
$$ 97599 97830 98317 98748 99007 98986 98387 97147 95820 95241 95895 97717 100221 102654 104296 104857 104631 104233
55014A04233MN81P47K42m39n59j15K65L96P42J439J930J918J797J742J213n8j313
$$ 104233 104237 104818 105565 105807 105368 104809 104694 104959 105355 106097 107536 109466 111384 113181 114923 116136 116078 114765
54996A14765j729j493j257j042n09J12J40n56j292j270k63J256K412K576J875
$$ 114765 113036 111543 110286 109244 108735 108847 108987 108431 107139 105869 105606 106862 109274 111850 113725
54981A13725Q85j06j097j733j495o37j67m70p23j32R29J474J121K86m09n79l61
$$ 113725 114610 114504 113407 111674 110179 109542 109375 108905 108182 108050 108979 110453 111574 111860 111451 110872 110511
54964A10511m25j181j919j448K08J607J708J013N04K95j06q14j439j472n63R78
$$ 110511 110086 108905 106986 105538 105746 107353 109061 110074 110578 110873 110767 109953 108514 107042 106479 107457
54948A07457J871J016q59j807j205m84q06j444j293o67l81j78N92J495J629J175
$$ 107457 109328 110344 109485 107678 106473 105989 105183 103739 102446 101779 101398 101220 101812 103307 104936 106111
54932A06111J074J510J907K124K515L037L285L284L358L433L249L075L366L887
$$ 106111 107185 108695 110602 112726 115241 118278 121563 124847 128205 131638 134887 137962 141328 145215
54918A45215L973L438K536J307k99j848k799l262l701m117m168l873l512l018
$$ 145215 149188 152626 155162 156469 156170 154322 151523 148261 144560 140443 136275 132402 128890 125872
54904A25872k210j408j113j279j468j507j465j200o84l48m94o07m2R27J478J466
$$ 125872 123662 122254 121141 119862 118394 116887 115422 114222 113538 113190 112696 112089 112047 112974 114452 115918
54888A15918J490J812K036J864J510J340J550K174K903L156K797K593L322M585
$$ 115918 117408 119220 121256 123120 124630 125970 127520 129694 132597 135753 138550 141143 144465 149050
54874A49050N106M199K417Q09r9n66j243k423l569l840l190k486k381k627k783
$$ 149050 154156 158355 160772 161581 161482 160916 159673 157250 153681 149841 146651 144165 141784 139157 136374
54859A36374k872k942k685k058j642j762j888j521r93q31r84j265j790k278j852
$$ 136374 133502 130560 127875 125817 124175 122413 120525 119004 118011 117180 116196 114931 113141 110863 109011
54844A09011m32O26L00n52o38k64m99j031o48N22R87J26j029j455j218p32j19
$$ 109011 108579 109205 109505 108953 108315 108051 107552 106521 105873 106395 107382 107508 106479 105024 103806 103074 102955
54827A02955M43O91P95J039J079M84j75N6Q87J032K00m60j76M13M75J67M3J56
$$ 102955 103398 104089 104884 105923 107002 107486 107311 107367 108254 109286 109486 109026 108850 109263 109738 109905 109948 110104
54809A10104K64L37M61O72J026J394J297N80p3l1J84k86j081j108l94k9k69k57
$$ 110104 110368 110705 111166 111838 112864 114258 115555 116135 116062 116031 116215 115929 114848 113740 113346 113317 113048 112791
54791A12791K36L47j67l08M22J055P72K24L24Q00R55R42J228J588J590J450J497
$$ 112791 113027 113374 113207 112899 113321 114376 115148 115372 115696 116496 117451 118393 119621 121209 122799 124249 125746
54774A25746J418R23N70J001J819K206K234K640L533M311M702N000N218M786L389
$$ 125746 127164 128087 128657 129658 131477 133683 135917 138557 142090 146401 151103 156103 161321 166107 169496
54759A69496J501r7j125j916k904m122n200n829n997n652m515k672j046n32q14
$$ 169496 170997 170900 169775 167859 164955 160833 155633 149804 143807 138155 133640 130968 129922 129390 128576
54744A28576q19l14m6k49k33J92J23q22j408m22J414K359J916J046M86R9j19L37
$$ 128576 127757 127443 127397 127148 126915 127107 127230 126408 125000 124578 125992 128351 130267 131313 131799 131898 131779 132116
54726A32116J552K792L392L448L325L091K765K601K665K468J504J2j237j842k131
$$ 132116 133668 136460 139852 143300 146625 149716 152481 155082 157747 160215 161719 161731 160494 158652 156521
54711A56521k571l130l451l476l506l573l219k161q88k00l02p03r03p29k44K71
$$ 156521 153950 150820 147369 143893 140387 136814 133595 131434 130546 130346 130044 129341 128438 127709 127465 127736
54695A27736K88l77j048r18k61k01j109k106k357k093j845j523q89l16k13j89
$$ 127736 128024 127647 126599 125681 125420 125219 124110 122004 119647 117554 115709 114186 113297 112981 112768 112579
54679A12579L46J053J041K54m17m41k71l97o08n35l54l59l08J95Q54R13K27m37
$$ 112579 112925 113978 115019 115273 114856 114415 114144 113747 113139 112604 112250 111891 111583 111778 112632 113545 113772 113335
54661A13335m19L6L01K44J32J5k05k25L45J141J243N16l0L20R44Q75J71m48q14
$$ 113335 112916 112952 113253 113497 113629 113644 113439 113214 113559 114700 115943 116459 116429 116749 117693 118568 118739 118291 117477
54642A17477j152j164l84O22O70l29j037n01O03J035N14k71o20l24L04N60m0r44
$$ 117477 116325 115161 114777 115399 116069 115740 114703 114202 114805 115840 116354 116083 115463 115139 115443 116003 115963 115019
54624A15019r78J11J095P81m47j205p78L87J490K040J836R67j25q91j094q23k91
$$ 115019 114041 114152 115247 116028 115581 114376 113598 113985 115475 117515 119351 120318 120193 119302 118208 117385 117094
54607A17094K04L84K36qk31n01o71m09J15J14p24j535j259j34N79K47l65k08P41
$$ 117094 117298 117682 117918 117910 117679 117178 116507 116098 116213 116327 115603 114068 112809 112675 113254 113501 113136 112928 113669
54588A13669J606J729J296R26R13J056J112J112J108Q60J30p74j188r02m15k02
$$ 113669 115275 117004 118300 119226 120139 121195 122307 123419 124527 125387 125517 124743 123555 122653 122238 122036
54572A22036j29J10L49K07k14l60j0L97L82R2K8K55K90j28m95j82O03R89N67j82
$$ 122036 121907 122017 122366 122573 122359 121999 121989 122386 122768 122860 122888 123143 123433 123305 122810 122628 123231 124220 124787 124605
54552A24605o41o84l20N54J590J899J179L21J57K15k87p81r6J397J938Q72m44
$$ 124605 123964 123280 122960 123514 125104 127003 128182 128503 128660 128875 128588 127807 127711 129108 131046 131918 131474
54535A31474p82o74j110j754j590o37J54K95R3j23k73j58L60Q92Q81L96Q9K78
$$ 131474 130692 130018 128908 127154 125564 124927 125081 125376 125469 125346 125073 124915 125275 126167 127048 127444 127533 127811
54517A27811N85N35R9l65m97k52K2j39p12j115q33PQ00J069P66K50K9K58M32m
$$ 127811 128396 128931 129030 128665 128168 127916 127938 127799 127087 125972 125139 125146 125946 127015 127781 128031 128060 128318 128750 128746
54497A28746p11p03K84J240J212N41K23M17L79k88j045j213q35m42k69nO82J573
$$ 128746 128035 127332 127616 128856 130068 130609 130832 131249 131628 131340 130295 129082 128247 127805 127536 127531 128213 129786
54479A29786K037J842J504J593J884J678Q76J53J6K79O03R59J300J267O83n9m19
$$ 129786 131823 133665 135169 136762 138646 140324 141200 141353 141369 141648 142251 143210 144510 145777 146460 146401 145982
54462A45982l12n8kk82o30m36N16J448J344L60l26k72l50j156j891j580o38k44
$$ 145982 145670 145612 145610 145328 144698 144262 144778 146226 147570 147930 147604 147332 146982 145826 143935 142355 141717 141473
54444A41473o36r84p10o0M92P25N71J54j71k03k46o23j052r82m03J21J63j63l87
$$ 141473 140837 139853 139143 139083 139575 140300 140871 141025 140854 140651 140405 139782 138730 137748 137345 137466 137629 137466 137079
54425A37079p6P34J351J094K72k3O63J549J841J738J658J248J59q84q10K14R68
$$ 137079 137003 137737 139088 140182 140454 140431 141094 142643 144484 146222 147880 149128 149287 148403 147593 147807 148775
54408A48775P93J11n13q77p48L1R81J296R72Q03J072J079L00o75r26m32O5J59
$$ 148775 149568 149679 149166 148289 147541 147572 148553 149849 150821 151624 152696 153775 154075 153400 152474 152042 152107 152266
54390A52266K16O81J360J631J252P12N42O05L39l06q08r55j147j540j527o19P49
$$ 152266 152482 153163 154523 156154 157406 158118 158660 159265 159604 159298 158490 157535 156388 154848 153321 152702 153451
54373A53451J786K334K605K498J857J175J198J939K668K843K480J760Q06j17p35
$$ 153451 155237 157571 160176 162674 164531 165706 166904 168843 171511 174354 176834 178594 179400 179283 178548
54358A78548j037j140j066r66j203j794k128j767j165j047j426j844k128k210
$$ 178548 177511 176371 175305 174339 173136 171342 169214 167447 166282 165235 163809 161965 159837 157627
54344A57627j711n67K71j60j389j994j437m78J70M70L79l55j385j775j185l54
$$ 157627 155916 155349 155620 155460 154071 152077 150640 150162 150332 150802 151181 150826 149441 147666 146481 146127
54328A46127K2J15L44N70L86j87o82o38L9R16J272Q78K98O5r7o24j121r62n34
$$ 146127 146149 146264 146608 147178 147564 147377 146695 146057 146096 147012 148284 149162 149460 149525 149428 148804 147683 146721 146187
54309A46187p34j388j451p95m44o96m94O67J598J103j90p59k56M67Q52J064J209
$$ 146187 145453 144065 142614 141819 141375 140679 140185 140852 142450 143553 143363 142604 142348 142815 143667 144731 145940
54292A45940J090P33M84N38Q15J170J343R44lp54n65L37R60O79j99q95r39m80
$$ 145940 147030 147763 148247 148785 149600 150770 152113 153057 153054 152300 151735 152072 153032 153711 153512 152617 151678 151198
54274A51198m5R0J98O58J242J377J073R84J282J285N29l07l04M50J124J374J488
$$ 151198 151153 151243 151441 152099 153341 154718 155791 156775 158057 159342 159871 159564 159260 159710 160834 162208 163696
54257A63696J539J196M40k27n24p20j063j296j121p82p22q93q54n25l84p23j107
$$ 163696 165235 166431 166871 166644 166120 165400 164337 163041 161920 161138 160416 159523 158669 158144 157760 157037 155930
54240A55930r49m00j48l54m33JN55P60Q05J030J206R78O42P41J074R69M00K8J16
$$ 155930 154981 154581 154433 154079 153646 153647 154202 154962 155767 156797 158003 158981 159623 160364 161438 162407 162807 162835 162951
54221A62951K09jl15o10j050j467j337o47k7J95L29M71J74n88j042p49l38m06
$$ 162951 163160 163159 162844 162234 161184 159717 158380 157733 157706 157901 158230 158701 158875 158287 157245 156496 156158 155752
54203A55752n06k9N92N64J03O3M82N64L0m78m82l00k93k53J15N93P06L43j78m53
$$ 155752 155246 155217 155809 156373 156476 156539 157021 157585 157615 157137 156655 156355 156062 155809 155924 156517 157223 157566 157388 156935
54183A56935k56L27R21J108P99K70q4m9L13O50N58j8o57q92p13n28o78j096j351
$$ 156935 156679 157006 157927 159035 159834 160104 160020 159971 160284 160934 161492 161474 160817 159925 159212 158684 158006 156910 155559
54164A55559j029j97M94M31j75m83q6N17P12O23P63J122J143N02m74j200j347
$$ 155559 154530 154333 154827 155258 155083 154600 154514 155031 155743 156366 157129 158251 159394 159896 159422 158222 156875
54147A56875j025o63o73j013j141o10L73J168J376J139P77M71K61K24M53Q95J200
$$ 156875 155850 155187 154514 153501 152360 151750 152123 153291 154667 155806 156583 157054 157315 157539 157992 158887 160087
54130A60087R30R9o55o80j26K91L27N43J325K139K214J650J238J313J389J070
$$ 160087 161017 161116 160461 159781 159655 159946 160273 160816 162141 164280 166494 168144 169382 170695 172084 173154
54114A73154P89J242K333L138L042K541K635L454L966L255J686L79k05n97j300
$$ 173154 173943 175185 177518 180656 183698 186239 188874 192328 196294 199549 201235 201614 201409 200812 199512
54099A99512k076k477k511k445k303j945j459j151j165j334j366j149q87r47j330
$$ 199512 197436 194959 192448 190003 187700 185755 184296 183145 181980 180646 179280 178131 177244 176297 174967
54084A74967j496j005k02J82L5m7K26M50L72N01J336K451K941K530J765J219R25
$$ 174967 173471 172466 172264 172446 172481 172434 172660 173110 173482 173983 175319 177770 180711 183241 185006 186225 187150
54067A87150N75po26q74n28R8M72M81N21P98R60O22k9m53l96K5O62J507K527L509
$$ 187150 187725 187718 187092 186218 185690 185788 186260 186741 187262 188060 189020 189642 189613 189160 188764 188789 189451 190958 193485 196994
54047A96994M133M195L813L363L095K960K943L276L991M603M748M874N609O633
$$ 196994 201127 205322 209135 212498 215593 218553 221496 224772 228763 233366 238114 242988 248597 255230
54033B55230P012O563N986N576M853L668K719K449K370J973J502J273J031O29
$$ 255230 262242 268805 274791 280367 285220 288888 291607 294056 296426 298399 299901 301174 302205 302834
54019C02834M89P11N07o05j830k209k084k404l132l514l552m029n084n900n881
$$ 302834 303323 304034 304541 303936 302106 299897 297813 295409 292277 288763 285211 281182 276098 270198 264317
54004B64317n249m451l734l385l624m070l993l196k183j420r86q62r77j016p02
$$ 264317 259068 254617 250883 247498 243874 239804 235811 232615 230432 229012 228026 227164 226187 225171 224469
53989B24469l14l60q11j187j286j215q56j1J051J861K475L163L548L024K076K147
$$ 224469 224155 223795 222984 221797 220511 219296 218440 218429 219480 221341 223816 226979 230527 233551 235627 237774
53973B37774L781N786O728O506N918N245M040J970o99l298n116n783n564n226
$$ 237774 241555 247341 254069 260575 266493 271738 275778 277748 277049 273751 268635 262852 257288 252062
53959B52062n261n406n020l810k097n46L32N22M39M52N36O10R40J856L173M247
$$ 252062 246801 241395 236375 232565 230468 229922 230254 230776 231215 231667 232203 232813 233753 235609 238782 243029
53943B43029M652M406L675K715K053K185K996L852M309M357M081L580L230L451
$$ 243029 247681 252087 255762 258477 260530 262715 265711 269563 273872 278229 282310 285890 289120 292571
53929B92571M085M482M312L876L559L499L832M675N662O073N718N213N167N514
$$ 292571 296656 301138 305450 309326 312885 316384 320216 324891 330553 336626 342344 347557 352724 358238
53915C58238N937O386O830O966O625O129N820N457M536L027J447L13k04k67k53
$$ 358238 364175 370561 377391 384357 390982 397111 402931 408388 412924 415951 417398 417711 417507 417240 416987
53900D16987n76j365k375l296m056m704n273n824o445p018p266p216p288p734
$$ 416987 416411 415046 412671 409375 405319 400615 395342 389518 383073 376055 368789 361573 354285 346551
53886C46551q147p892o888n737n104n116n396n474n202m793m460m131l665l226
$$ 346551 338404 330512 323624 317887 312783 307667 302271 296797 291595 286802 282342 278211 274546 271320
53872B71320l178l526l815l754l633l824m080l728k634j562j371j998k550k395
$$ 271320 268142 264616 260801 257047 253414 249590 245510 241782 239148 237586 236215 234217 231667 229272
53858B29272j787j238p48j05L01j77j239j641q55L6k03j207j611j052m62m64n45
$$ 229272 227485 226247 225499 225394 225695 225518 224279 222638 221783 221819 221616 220409 218798 217746 217284 216820 216275
53841B16275j61K50j8q28j380j233o44q8J52P0n8J75R09J752K103J732R87M46
$$ 216275 216114 216364 216346 215518 214138 212905 212261 212173 212325 212395 212337 212512 213421 215173 217276 219008 219995 220441
53823B20441M11O83Q49P57O17N29K89j91n18k27N87J414J944K206K267K275K669
$$ 220441 220852 221535 222384 223141 223758 224287 224576 224385 223867 223640 224227 225641 227585 229791 232058 234333 237002
53806B37002L780N212O139O269O054N957N959N900N768N466M786L826L083K877
$$ 237002 240782 245994 252133 258402 264456 270413 276372 282272 288040 293506 298292 302118 305201 308078
53792C08078L013L120L070K807K174J149L9p91j295j722k253k777k992k860k846
$$ 308078 311091 314211 317281 320088 322262 323411 323450 322659 321364 319642 317389 314612 311620 308760 305914
53777C05914l438m329m654m291m285n369o643o643n372m169l749l492k868k339
$$ 305914 302476 298147 293493 289202 284917 279548 272905 266262 260890 256721 252972 249480 246612 244273
53763B44273k417k774k817k527k181j867j603j441j148l85M59M79m43j277j325
$$ 244273 241856 239082 236265 233738 231557 229690 228087 226646 225498 225113 225572 226051 225608 224331 223006
53748B23006j148j404j591r41J41N69J66k32j59nj39l71m01k40M6M77R39J175
$$ 223006 221858 220454 218863 217922 218063 218632 218798 218566 218407 218402 218263 217892 217491 217251 217297 217774 218713 219888
53730B19888J083P61L48O0K34R40J670J894J777J924K404K587K038J151O10N35
$$ 219888 220971 221732 222080 222140 222374 223314 224984 226878 228655 230579 232983 235570 237608 238759 239369 239904
53714B39904M47Jn32n66J02J084J924K631L436M167M247L407K083J049Q09J381
$$ 239904 240351 240352 239820 239254 239356 240440 242364 244995 248431 252598 256845 260252 262335 263384 264193 265574
53698B65574K372L247L750M089M425M394L614K552K142K413K304J139m90j665
$$ 265574 267946 271193 274943 279032 283457 287851 291465 294017 296159 298572 300876 302015 301525 299860
53684B99860k317k837l145k828j974j150p63p72q89p26p8O72P78P7p37j140j476
$$ 299860 297543 294706 291561 288733 286759 285609 284846 284074 283185 282459 282381 283053 283831 283908 283171 282031 280555
53667B80555k107k485j834m24P07J086J104J139J103R03O57L53j68p92j112q50
$$ 280555 278448 275963 274129 273705 274412 275498 276602 277741 278844 279747 280404 280757 280589 279797 278685 277835
53651B77835l4J140K272K752K327J481R31Q08Q17R34J363J928K174K096K173K612
$$ 277835 277801 278941 281213 283965 286292 287773 288704 289512 290329 291263 292626 294554 296728 298824 300997 303609
53635C03609L035L019K559J906J362J238J695K461L039L213L120K922K687K492
$$ 303609 306644 309663 312222 314128 315490 316728 318423 320884 323923 327136 330256 333178 335865 338357
53621C38357K328K062J742J812K552L513L923L564K877K389K385K909L596L773
$$ 338357 340685 342747 344489 346301 348853 352366 356289 359853 362730 365119 367504 370413 374009 377782
53607C77782L239K692K838L332L316K750K360K360K160J401M61k40o66o70KR66
$$ 377782 381021 383713 386551 389883 393199 395949 398309 400669 402829 404230 404691 404451 403785 403115 403117 404083
53591D04083J213L38q63j508j657j801j913j711j381j318j416j294j082j353k158
$$ 404083 405296 405634 404771 403263 401606 399805 397892 396181 394800 393482 392066 390772 389690 388337 386179
53576C86179k724k328j245n21q42j819k464k273j594r63m39J24N27M17j04n99
$$ 386179 383455 381127 379882 379361 378519 376700 374236 371963 370369 369406 368967 369091 369618 370035 369931 369332
53560C69332r54j346j580j128m8P91P52K49R8M37P38O83N54Q12J559K453L026
$$ 369332 368378 367032 365452 364324 364276 365067 365819 366068 366166 366603 367341 368024 368578 369390 370949 373402 376428
53543C76428L053K737K483K541K907L486M144M710N139N619O257O850P234P679
$$ 376428 379481 382218 384701 387242 390149 393635 397779 402489 407628 413247 419504 426354 433588 441267
53529D41267Q514R477J0049J0306J0793J1509J1801J1465J1257J1892J3085J4111
$$ 441267 449781 459258 469307 479613 490406 501915 513716 525181 536438 548330 561415 575526
53517E75526J4741J5201J5609J6050J6878J8371K0225K1809K2812K3267K3199
$$ 575526 590267 605468 621077 637127 654005 672376 692601 714410 737222 760489 783688
53506G83688K2668K1955K1298K0600J9825J9386J9620J9980J9442J7797J5997
$$ 783688 806356 828311 849609 870209 890034 909420 929040 949020 968462 986259 1002256
53495A002256J5042J4997J5256J5394J5375J5265J5120J5102J5358J5783J6020
$$ 1002256 1017298 1032295 1047551 1062945 1078320 1093585 1108705 1123807 1139165 1154948 1170968
53484A170968J5777J5067J4188J3526J3368J3712J4207J4303J3551J1768R083
$$ 1170968 1186745 1201812 1216000 1229526 1242894 1256606 1270813 1285116 1298667 1310435 1319518
53473A319518N920K955P74o28j870l506n377o984q353j0044j2204j4163j5281
$$ 1319518 1325438 1328393 1329167 1328539 1326669 1323163 1317786 1310802 1302449 1292405 1280201 1266038 1250757
53460A250757j5691j5814j5643j5076j4614j4938j5967j7024j7860j8651j9105
$$ 1250757 1235066 1219252 1203609 1188533 1173919 1158981 1143014 1125990 1108130 1089479 1070374
53449A070374j8524j7089j6094j6371j7142j7107j6048j4635j3151j1316r144
$$ 1070374 1051850 1034761 1018667 1002296 985154 968047 951999 937364 924213 912897 903753
53438I03753p114n437l848k289j103l44N21J815L028L511L578M260N992Q017R383
$$ 903753 896639 891202 887354 885065 883962 883618 884139 885954 888982 892493 896071 900331 906323 914340 923723
53423I23723J0115J1003J2445J4041J5319J6370J7460J8523J9426K0452K2000
$$ 923723 933838 944841 957286 971327 986646 1003016 1020476 1038999 1058425 1078877 1100877
53412A100877K3930K5644K6785K7437K7806K8110K8808L0329L2470L4519L6110
$$ 1100877 1124807 1150451 1177236 1204673 1232479 1260589 1289397 1319726 1352196 1386715 1422825
53401A422825L7544L9187M0973M2672M4189M5435M6256M6733M7190M7784M8391
$$ 1422825 1460369 1499556 1540529 1583201 1627390 1672825 1719081 1765814 1813004 1860788 1909179
53390A909179M8878M9113M8755M7596M6082M4805M3451M1173L8134L5657L4300
$$ 1909179 1958057 2007170 2055925 2103521 2149603 2194408 2237859 2279032 2317166 2352823 2387123
53379B387123L2871L0062K6154K2154J8136J3595Q873M829J315k730p662j2808
$$ 2387123 2419994 2450056 2476210 2498364 2516500 2530095 2538968 2543797 2545112 2542382 2534720 2521912
53367B521912j7767k2953k8508l3763l8091m1510m4195m6178m7770m9398n0710
$$ 2521912 2504145 2481192 2452684 2418921 2380830 2339320 2295125 2248947 2201177 2151779 2101069
53356B101069n0800m9711m8670m8333m7723m5763m3005m0801l9470l8333l7207
$$ 2101069 2050269 2000558 1951888 1903555 1855832 1810069 1767064 1726263 1686793 1648460 1611253
53345A611253l6581l6437l5999l4861l3503l2381l1265k9772k8030k6324k4574
$$ 1611253 1574672 1538235 1502236 1467375 1433872 1401491 1370226 1340454 1312424 1286100 1261526
53334A261526k2488k0044j7541j5287j3383j1728j0190q913q352q744r660j0413
$$ 1261526 1239038 1218994 1201453 1186166 1172783 1161055 1150865 1141952 1133600 1124856 1115196 1104783
53322A104783j0843j1217j1442j0966r616p953o479n073l548k271j660j363n97
$$ 1104783 1093940 1082723 1071281 1060315 1050699 1042746 1036267 1031194 1027646 1025375 1023715 1022352 1021755
53309A021755Q45K473L882N100O137O799P147P646Q635R953J1323J2803J4537
$$ 1021755 1022600 1025073 1028955 1034055 1040192 1046991 1054138 1061784 1070419 1080372 1091695 1104498 1119035
53296A119035J6340J7868J9077K0182K1199K1826K1905K1665K1497K1482K1353
$$ 1119035 1135375 1153243 1172320 1192502 1213701 1235527 1257432 1279097 1300594 1322076 1343429
53285A343429K0800J9729J8203J6239J3820J1167Q794P067N730M066J611j423
$$ 1343429 1364229 1383958 1402161 1418400 1432220 1443387 1452181 1459248 1464978 1469044 1470655 1469232
53273A469232m512p339r869j2130j4158j6080j8009j9855k1420k2697k3875k5015
$$ 1469232 1464720 1457381 1447512 1435382 1421224 1405144 1387135 1367280 1345860 1323163 1299288 1274273
53261A274273k5883k6251k6259k6345k6759k7295k7553k7339k6723k5770k4524
$$ 1274273 1248390 1222139 1195880 1169535 1142776 1115481 1087928 1060589 1033866 1008096 983572
53250I83572k3281k2587k2650k2998k3021k2730k2555k2501k2076k1140k0228
$$ 983572 960291 937704 915054 892056 869035 846305 823750 801249 779173 758033 737805
53239G37805j9704j9082j7746j5990j4662j3962j3188j1830j0288r216q639q129
$$ 737805 718101 699019 681273 665283 650621 636659 623471 611641 601353 592137 583498 575369
53227E75369p610p430p645p740p352o969p445q836j0150j0434r849r338r457r945
$$ 575369 567759 560329 552684 544944 537592 530623 523178 514342 504192 493758 483909 474571 465114 455169
53213D55169j0280j0136r339p867o168m990m672m878n205n632o152o477o472o491
$$ 455169 444889 434753 425414 417547 411379 406389 401717 396839 391634 386002 379850 373373 366901 360410
53199C60410o863p328p435p184o769o070m962l943l697m098m307l886l245k908
$$ 360410 353547 346219 338784 331600 324831 318761 313799 309856 306159 302061 297754 293868 290623 287715
53185B87715k889k975l063l065k856k516k322k328k298k150k081k127j991j458
$$ 287715 284826 281851 278788 275723 272867 270351 268029 265701 263403 261253 259172 257045 255054 253596
53171B53596p03p4K03M9m34q85r70q37r30j295j393q33M9M52j24j423k532k521
$$ 253596 252893 252819 253022 253071 252637 251752 250782 249945 249015 247720 246327 245494 245543 245995 245871 244448 241916 239395
53153B39395j312J58R60J158J352J485R49k10j082j233j296j799k131j394J94
$$ 239395 238083 238241 239201 240359 241711 243196 244145 243935 242853 241620 240324 238525 236394 235000 235194
53138B35194J524J939J725J395J144R67Q53P46N90M75N49Q30J231J619J747J405
$$ 235194 236718 238657 240382 241777 242921 243888 244741 245487 246077 246552 247101 247931 249162 250781 252528 253933
53122B53933P85M62P01J091J067O57L75N47R50J043M66m66q64k15P31N97q63k260
$$ 253933 254718 255180 255881 256972 258039 258696 259071 259618 260568 261611 262077 261611 260747 260532 261263 261860 260997 258737
53104B58737k288j353q61j315j933j983j640j379j212q69l89j42l03n72m99j03
$$ 258737 256449 255096 254235 252920 250987 249004 247364 245985 244773 243904 243515 243373 243070 242498 241999 241896
53088B41896J1o09j522j807j242n65l88m33k24O1M7l3K63O35M01k55k45R16K223
$$ 241896 241907 241298 239776 237969 236727 236162 235774 235341 235117 235178 235225 235192 235455 236090 236491 236236 235991 236907 239130
53069B39130K244P32j181k179j870q76p4J18j40n01p66q09n49j68n3l16n49l28
$$ 239130 241374 242106 240925 238746 236876 236000 235926 236044 235904 235403 234637 233828 233279 233111 233058 232742 232193 231865
53051B31865K26O87Q16N82k3q01j198q24k8M78M48J72j18m47p41p73n05j36K14
$$ 231865 232091 232778 233594 234176 234153 233352 232154 231330 231302 231780 232228 232400 232282 231835 231094 230321 229816 229680 229894
53032B29894M87M27j73r76j306r83m85k38j43J6J25mk27k11J76P84J363J686J633
$$ 229894 230381 230808 230635 229659 228353 227370 226885 226647 226504 226520 226645 226641 226414 226203 226379 227163 228526 230212 231845
53013B31845J296R18O91O53P52Q59P22J82n67j085j108p75l93j22P5L02N61P42
$$ 231845 233141 234059 234750 235403 236155 237014 237736 237918 237351 236266 235158 234383 233990 233868 233943 234245 234806 235548
52995B35548P90Q41J054J300J308J101R66Q98N60j2j47N37J417J652J373J442
$$ 235548 236338 237179 238233 239533 240841 241942 242908 243806 244366 244354 244207 244744 246161 247813 249186 250628
52979B50628K167K942L133K708J883P45n25j550k001j794r99R3Q75Q84L90J63
$$ 250628 252795 255737 258870 261578 263461 264206 263681 262131 260130 258336 257337 257430 258305 259189 259579 259742
52963B59742N03Q82O55j94j120j553j357r48r57j501j934j646q82l25j27j7j25
$$ 259742 260245 261127 261782 261588 260468 258915 257558 256610 255653 254152 252218 250572 249690 249365 249238 249221 249096
52946B49096q29j764j918j044j95l49j133j474r89j95K80K17k23o48p27n99o81
$$ 249096 248267 246503 244585 243541 243346 242997 241864 240390 239401 239206 239486 239703 239480 238832 238105 237506 236825
52929B36825r37q47l06Rl04o41k79M32N96J50j23J97P24J033J116R56L85m37r49
$$ 236825 235888 235041 234735 234744 234440 233799 233520 233952 234548 234698 234575 234772 235496 236529 237645 238601 238986 238549 237600
52910B37600q87n91m02k58j45l47q82j122n70L32P26M76K04K70L88L34L89Q02
$$ 237600 236713 236122 235720 235462 235317 234970 234088 232966 232396 232728 233454 233930 234134 234404 234792 235126 235515 236317
52892B36317J246J273R69P78Q49R38Q48O40L77M9k52l29j26K52O85J025J056P73
$$ 236317 237563 238836 239805 240583 241432 242370 243218 243858 244235 244284 244032 243703 243577 243829 244514 245539 246595 247368
52874B47368O72J264K315K985K790K058J352R30R07J338J827J651O58l46o16m29
$$ 247368 248040 249304 251619 254604 257394 259452 260804 261734 262641 263979 265806 267457 268115 267769 267153 266724
52858B66724n67j196j835k206k491k842l109l075k633j875j334j704k910l794
$$ 266724 266157 264961 263126 260920 258429 255587 252478 249403 246770 244895 243561 241857 238947 235153
52844B35153l313j845o13j59r7j20l66p58q81o88n72o02l42L00P70O85L70L01
$$ 235153 231840 229995 229382 229223 229126 229006 228640 227882 227001 226313 225741 225139 224797 225097 225867 226552 226922 227223
52826B27223M89O52N35n3j018j692j339j79P65R87R72J171J257Q78L57J11J1j08
$$ 227223 227712 228364 228899 228846 227828 226136 224797 224618 225383 226370 227342 228513 229770 230648 231005 231116 231127 231019
52808B31019M4N52P34L9r62j270r23q30j299j613j163l05K00J06k38m01k66r5
$$ 231019 231063 231615 232349 232388 231426 230156 229233 228403 227104 225491 224328 224023 224223 224329 224091 223690 223424 223329
52790B23329k66q81j524j634j076l02J22N8j08Q4N47O60J28m04r0Q51J265O31
$$ 223329 223063 222182 220658 219024 217948 217646 217768 217826 217718 217802 218349 219009 219137 218733 218643 219494 220759 221390
52772B21390k13k96J82L83J57J10M99Q55P07K09j64j23K34N75O09L82K68N18R68
$$ 221390 221177 220881 221063 221446 221603 221713 222212 223067 223774 223983 223819 223696 223930 224505 225114 225496 225764 226282 227250
52753B27250J304J415J361J178J007J109J519J881J863J564J234Q43K89j91k19
$$ 227250 228554 229969 231330 232508 233515 234624 236143 238024 239887 241451 242685 243528 243817 243626 243407
52738B43407J87N57M60j00p09p98j32Q15J212P90J22k00l05n90r94j177j134j087
$$ 243407 243594 244151 244611 244511 243802 243004 242872 243687 244899 245689 245811 245611 245306 244716 243722 242545 241411 240324
52720B40324r72o10k29k70o84r25p64n91p81j104j042n15j4Rk08J10J240K321
$$ 240324 239352 238742 238513 238243 237559 236634 235870 235279 234498 233394 232352 231837 231823 231832 231624 231734 232974 235295
52702B35295K168Q14l99m98PR0k90l86L0L41L3p26j440j658j084J15J132J236
$$ 235295 237463 238277 237878 237380 237387 237477 237187 236801 236831 237172 237205 236479 235039 233381 232297 232412 233544 234780
52684B34780O59K44K81L01O9k1K55M34Q7m34m71N8O26P66M93J53J82P88J701K303
$$ 234780 235439 235683 235964 236265 236334 236313 236568 237002 237089 236655 236184 236242 236868 237634 238127 238280 238462 239250 240951 243254
52664B43254K211J630J002M99O7j87L7P78J614K095K314K740L396L508K358L66
$$ 243254 245465 247095 248097 248596 248663 248476 248513 249291 250905 253000 255314 258054 261450 264958 267316 267682
52648B67682j220j783j968k541l264l403k904k320j762p65O29J457R33m67j460
$$ 267682 266462 264679 262711 260170 256906 253503 250599 248279 246517 245752 246381 247838 248771 248304 246844
52633B46844j281k72P58J374J694J921K020J898J677J495J126K00j072j842j619
$$ 246844 245563 245291 246049 247423 249117 251038 253058 254956 256633 258128 259254 259454 258382 256540 254921
52618B54921r01m85m75m37k05J0J13J62L7l67p06n52j37q3m04m12K27J041J482
$$ 254921 254020 253535 253060 252623 252418 252428 252541 252703 252740 252373 251667 251115 250978 250895 250491 250079 250306 251347 252829
52599B52829J585J572J340P92J73k18l97m32k05K92O90O90M89M60O43Q91J286
$$ 252829 254414 255986 257326 258118 258291 258073 257676 257244 257039 257331 258021 258711 259200 259660 260303 261194 262480
52582B62480J934K484K290J107n43j808k102j405k31O57P80L32o5l2K09J54l65
$$ 262480 264414 266898 269188 270295 269752 267944 265842 264437 264206 264863 265643 265975 265910 265878 266087 266241 265876
52565B65876r72j123o47P7M19J5q41j348r16J02O19Lj094j506r54j83K70O76J231
$$ 265876 264904 263781 263134 263211 263630 263645 262804 261456 260540 260642 261261 261264 260170 258664 257710 257527 257797 258473 259704
52546B59704J399P86L7M9O35Q31L89P2L97R53J114Q37M10O7N1N42J161J113J95
$$ 259704 261103 261889 261926 261975 262610 263441 263830 263902 264299 265252 266366 267203 267613 267680 267731 268273 269434 270547 270742
52527B70742p40p91p8N71O48K85k22o40o69j22P63J531K020K423K792K856K491
$$ 270742 270002 269211 269133 269704 270352 270637 270415 269775 269106 268984 269747 271278 273298 275721 278513 281369 283860
52510B83860K074K122K677L234L285K740J783N68p88k015k816l222l529l836l887
$$ 283860 285934 288056 290733 293967 297252 299992 301775 302343 301555 299540 296724 293502 289973 286137 282250
52495B82250l505k907k370j885j381r80p52m80q3J4n68j366j399l01J292K467
$$ 282250 278745 275838 273468 271583 270202 269222 268470 267990 267907 267921 267353 265987 264588 264287 265579 268046
52479B68046K777K313J538J083J249J645J714J565J715K120K129J621J391J991
$$ 268046 270823 273136 274674 275757 277006 278651 280365 281930 283645 285765 287894 289515 290906 292897
52465B92897K830L050K771K766L106L007K055Q58J32l36j245k580l427l190k404
$$ 292897 295727 298777 301548 304314 307420 310427 312482 313340 313472 313136 311891 309311 305884 302694 300290
52450C00290k078k450k982l317l604l800l360k049m99M33N41R8o41j292j193k21
$$ 300290 298212 295762 292780 289463 285859 282059 278699 276650 276151 276584 277125 277223 276582 275290 274097 273876
52434B73876O30L06q05j290n90M31Q41P15O20P34Q94R60Q61O65P16J209J672J456
$$ 273876 274506 274812 274007 272717 272127 272558 273399 274114 274734 275468 276362 277322 278183 278848 279564 280773 282445 283901
52416B83901Q18P65J668K816L575M183N023N858O307O470O607O742O941P300P239
$$ 283901 284719 285484 287152 289968 293543 297726 302749 308607 314914 321384 327991 334733 341674 348974 356213
52401C56213N582K031j999m768n941o283o180n519m563l907l476k575j104Nn7
$$ 356213 361795 363826 361827 357059 351118 344835 338655 333136 328573 324666 321190 318615 317511 317516 317459
52386C17459q96j344p39M59J245J101M78K33O86J475K252L033L744M006L757L590
$$ 317459 316563 315219 314480 314939 316184 317285 317763 317996 318682 320157 322409 325442 329186 333192 336949 340539
52370C40539L954M377M074L032J932J179N98j3o25j215j712j799j251m68j82n21
$$ 340539 344493 348870 352944 355976 357908 359087 359685 359672 359047 357832 356120 354321 353070 352602 352420 351899
52354C51899q95q50n80m29l19R3R43K067L178L922M014L484K800K533K852L384
$$ 351899 351004 350154 349574 349145 348826 348919 349862 351929 355107 359029 363043 366527 369327 371860 374712 378096
52338C78096L612L492L636M677O437P996Q662Q654Q672R101R878J0888J2127J3515
$$ 378096 381708 385200 388836 393513 399950 407946 416608 425262 433934 443035 452913 463801 475928 489443
52324D89443J4794J5662J5887J5439J4621J3910J3518J3224J2761J2232J1976
$$ 489443 504237 519899 535786 551225 565846 579756 593274 606498 619259 631491 643467
52313F43467J2216J2927J3895J4833J5567J6135J6539J6488J5788J4849J4313
$$ 643467 655683 668610 682505 697338 712905 729040 745579 762067 777855 792704 807017
52302H07017J4089J3429J2123J0886J0206R503P987N823L733J901k2k074l868
$$ 807017 821106 834535 846658 857544 867750 877253 885240 891063 894796 896697 896675 894601 890733
52289H90733n165n979o282o179o203o776p449p302o107m549l264k224j155o4R28
$$ 890733 885568 879589 873307 867128 860925 854149 846700 839398 833291 828742 825478 823254 822099 822035 822963
52274H22963J894L040M448N983P295Q042Q235Q238Q290Q300Q263Q563R445J0526
$$ 822963 824857 827897 832345 838328 845623 853665 861900 870138 878428 886728 894991 903554 912999 923525
52260I23525J1255J1627J2027J2588J3146J3603J3807J3365J2059J0346Q874P599
$$ 923525 934780 946407 958434 971022 984168 997771 1011578 1024943 1037002 1047348 1056222 1063821
52248A063821N952L715J185j411l992o241p704q421q912r489j0063j0624j1369
$$ 1063821 1069773 1073488 1074673 1073262 1069270 1063029 1055325 1046904 1037992 1028503 1018440 1007816 996447
52235I96447j2217j2692j2453j1649j0708j0041r854r930r680q789p626o675n815
$$ 996447 984230 971538 959085 947436 936728 926687 916833 906903 897223 888434 880808 874133 868318
52222H68318m737l732l346l384l058k084q89K32J373K368K766K661K753L269L551
$$ 868318 863581 859849 856503 853119 850061 847977 847088 847320 848693 851061 853827 856488 859241 862510 866061
52207H66061L096K334J907J826J797J936K515L383M077M384M493M684N074N519
$$ 866061 869157 871491 873398 875224 877021 878957 881472 884855 888932 893316 897809 902493 907567 913086
52193I13086N673N389M977M796M658M100L154K256J493M72r30k399l783n220o528
$$ 913086 918759 924148 929125 933921 938579 942679 945833 948089 949582 950054 949124 946725 942942 937722 931194
52178I31194p276p581p978q309p735o238n063m990n071m010k023l82M10Q97J518
$$ 931194 923918 916337 908359 900050 892315 886077 881014 876024 870953 866943 864920 864538 864948 865845 867363
$$ [...]
##END NTUPLES=NMR SPECTRUM
##END=
