##TITLE=AC1734_SEN00007_9275963_ZU9xwk6SZo
##JCAMPDX= 6.0         $$ Bruker NMR JCAMP-DX V2.0
##DATA TYPE= NMR SPECTRUM
##DATA CLASS= NTUPLES
##ORIGIN= BRUKER
##OWNER= Administrator
$$ 1.72 TOPSPIN		Version 2.1
$$ 2015-07-18 20:48:21.400 -0700  Administrator@X
$$ Compression mode = diff/dup
##.OBSERVE FREQUENCY= 400.02188249412
##.OBSERVE NUCLEUS= ^1H
##.ACQUISITION MODE= SIMULTANEOUS (DQD)
##.ACQUISITION SCHEME= undefined
##.AVERAGES= 8
##.DIGITISER RES= 22
##SPECTROMETER/DATA SYSTEM= spect
##.PULSE SEQUENCE= zg30
##.SOLVENT NAME= COFFEE_meoh
##.SHIFT REFERENCE= INTERNAL, COFFEE_meoh, 1, 14.98509
##AUDIT TRAIL= $$ (NUMBER, WHEN, WHO, WHERE, PROCESS, VERSION, WHAT)
$$ ##TITLE= Audit trail, TOPSPIN		Version 2.1
$$ ##JCAMPDX= 5.01
$$ ##ORIGIN= Bruker BioSpin GmbH
$$ ##OWNER= Administrator
$$ $$ E:\/data/COFFEE/nmr/AC1734_SEN00007_9275963_ZU9xwk6SZo/20/pdata/1/auditp.txt
$$ ##AUDIT TRAIL=  $$ (NUMBER, WHEN, WHO, WHERE, PROCESS, VERSION, WHAT)
(   1,<2015-07-18 20:48:13.947 -0700>,<Administrator>,<X>,<go>,<TOPSPIN 2.1>,
      <created by zg
	started at 2015-07-18 20:47:08.025 -0700,
	POWCHK enabled, PULCHK disabled,
       configuration hash MD5:
       21 0F 79 D6 B3 7B B4 F6 88 20 88 DB 03 48 BD 9F
       data hash MD5: 64K
       4F 8C 3D 39 EE C5 00 53 55 F1 C0 BE 15 BE 71 46>)
(   2,<2015-07-18 20:48:17.088 -0700>,<Administrator>,<X>,<proc1d>,<TOPSPIN 2.1>,
      <Start of raw data processing
       efp LB = 0 FT_mod = 6 PKNL = 1 PHC0 = 0 PHC1 = 0 SI = 32K 
       data hash MD5: 32K
       CE 84 40 35 77 86 4A 45 B5 AE 06 44 C4 D8 68 1B>)
(   3,<2015-07-18 20:48:17.400 -0700>,<Administrator>,<X>,<proc1d>,<TOPSPIN 2.1>,
      <pk PHC0 = 88.76953 PHC1 = 0 
       data hash MD5: 32K
       08 B1 66 A2 F3 C9 EB E5 EE ED BA 3B 0E 15 9F 7B>)
(   4,<2015-07-18 20:48:17.510 -0700>,<Administrator>,<X>,<proc1d>,<TOPSPIN 2.1>,
      <abs ABSG = 1 
       data hash MD5: 32K
       5C E5 79 6D FE 5F 08 26 7B 6E 66 D0 7B 93 83 95>)
(   5,<2015-07-18 20:48:17.588 -0700>,<Administrator>,<X>,<proc1d>,<TOPSPIN 2.1>,
      <abs ABSG = 2 
       data hash MD5: 32K
       62 9F 6F 34 E2 FE EC 52 64 7A 1D C4 76 B9 B2 18>)
(   6,<2015-07-18 20:48:17.650 -0700>,<Administrator>,<X>,<proc1d>,<TOPSPIN 2.1>,
      <abs ABSG = 3 
       data hash MD5: 32K
       63 6B 19 9B A6 86 7D CC 1E 2B 02 C5 EE 43 36 8C>)
(   7,<2015-07-18 20:48:17.729 -0700>,<Administrator>,<X>,<proc1d>,<TOPSPIN 2.1>,
      <abs ABSG = 4 
       data hash MD5: 32K
       C8 A8 34 A6 79 8D 1D 78 63 1A 56 54 05 B7 63 CA>)
(   8,<2015-07-18 20:48:17.791 -0700>,<Administrator>,<X>,<proc1d>,<TOPSPIN 2.1>,
      <abs ABSG = 5 
       data hash MD5: 32K
       62 F0 0E B7 B8 49 F8 AC DC 1A 01 72 64 85 60 4A>)
$$ ##END=
$$ 
$$ $$ hash MD5
$$ $$ 2B E0 F6 A8 70 B9 DA B7 69 4B 3A D5 4D EA ED 79
##$RELAX= 
##$RELAX= 
##$RELAX= 
##$RELAX= 
##$RELAX= 
##$RELAX= 
##$RELAX= 
$$ Bruker specific parameters
$$ --------------------------
##$DU= <E:\>
##$EXPNO= 20
##$NAME= <AC1734_SEN00007_9275963_ZU9xwk6SZo>
$$ [...]
150 150 150 150 150 150 150 150
##$TP07= 0
##$TPNAME0= <>
##$TPNAME1= <>
##$TPNAME2= <>
##$TPNAME3= <>
##$TPNAME4= <>
##$TPNAME5= <>
##$TPNAME6= <>
##$TPNAME7= <>
##$TPOAL= (0..7)
0.5 0.5 0.5 0.5 0.5 0.5 0.5 0.5
##$TPOFFS= (0..7)
0 0 0 0 0 0 0 0
##$TUNHIN= 0
##$TUNHOUT= 0
##$TUNXOUT= 0
##$USERA1= <user>
##$USERA2= <user>
##$USERA3= <user>
##$USERA4= <user>
##$USERA5= <user>
##$V9= 5
##$VALIST= <valist>
##$VCLIST= <CCCCCCCCCCCCCCC>
##$VD= 0
##$VDLIST= <DDDDDDDDDDDDDDD>
##$VPLIST= <PPPPPPPPPPPPPPP>
##$VTLIST= <TTTTTTTTTTTTTTT>
##$WBST= 2048
##$WBSW= 25
##$XGAIN= (0..3)
0 0 0 0
##$XL= 0
##$YL= 0
##$YMAX_a= 589338
##$YMIN_a= -508958
##$ZGOPTNS= <>
##$ZL1= 120
##$ZL2= 120
##$ZL3= 120
##$ZL4= 120
##$ABSF1= 14.98509
##$ABSF2= -5.573092
##$ABSG= 5
##$ABSL= 3
##$ALPHA= 0
##$AQORDER= 0
##$ASSFAC= 0
##$ASSFACI= 0
##$ASSFACX= 0
##$ASSWID= 0
##$AUNMP= <proc_prof1d_extract_pilot.lims>
##$AXLEFT= 0
##$AXNAME= <>
##$AXNUC= <1H>
##$AXRIGHT= 0
##$AXTYPE= 0
##$AXUNIT= <>
##$AZFE= 0.1
##$AZFW= 0.1
##$BCFW= 0
##$BC_mod= 0
##$BYTORDP= 0
##$COROFFS= 0
##$CY= 15
##$DATMOD= 1
##$DC= 0
##$DFILT= <>
##$DTYPP= 0
##$F1P= 0
##$F2P= 0
##$FCOR= 0.5
##$FTSIZE= 32768
##$FT_mod= 6
##$GAMMA= 0
##$GB= 0
##$INTBC= 1
##$INTSCL= 1
##$ISEN= 128
##$LB= 0
##$LEV0= 0
##$LPBIN= 0
##$MAXI= 10000
##$MC2= 0
##$MEAN= 0
##$ME_mod= 0
##$MI= 0
##$NCOEF= 0
##$NC_proc= -8
##$NLEV= 6
##$NOISF1= 0
##$NOISF2= 0
##$NSP= 0
##$NTH_PI= 0
##$NZP= 0
##$OFFSET= 14.98509
##$PC= 1
##$PHC0= 88.76953
##$PHC1= 0
##$PH_mod= 1
##$PKNL= yes
##$PPARMOD= 0
##$PPDIAG= 0
##$PPIPTYP= 0
##$PPMPNUM= 2147483647
##$PPRESOL= 1
##$PSCAL= 4
##$PSIGN= 0
##$PYNMP= <proc.py>
##$REVERSE= no
##$SF= 400.02
##$SI= 32768
##$SIGF1= 0
##$SIGF2= 0
##$SINO= 400
##$SIOLD= 32768
##$SPECTYP= <>
##$SREGLST= <1H.CDCl3>
##$SSB= 0
##$STSI= 32768
##$STSR= 0
##$SW_p= 8223.68421052631
##$SYMM= 0
##$S_DEV= 0
##$TDeff= 65536
##$TDoff= 0
##$TI= <>
##$TILT= no
##$TM1= 0
##$TM2= 0
##$TOPLEV= 0
##$USERP1= <user>
##$USERP2= <user>
##$USERP3= <user>
##$USERP4= <user>
##$USERP5= <user>
##$WDW= 1
##$XDIM= 32768
##$YMAX_p= 445424293
##$YMIN_p= -658234
##$CURPLOT= <Network HP LaserJet P1505>
##$CURPRIN= <$Network HP LaserJet P1505>
##$DFORMAT= <normdp>
##$LAYOUT= <+/1D_H.xwp>
##$LFORMAT= <normlp>
##$PFORMAT= <normpl>
##$SURQMSG= 1
$$ End of Bruker specific parameters
$$ ---------------------------------
##NTUPLES= NMR SPECTRUM
##VAR_NAME=  FREQUENCY,     SPECTRUM/REAL,   SPECTRUM/IMAG
##SYMBOL=    X,             R,               I
##VAR_TYPE=  INDEPENDENT,   DEPENDENT,       DEPENDENT
##VAR_FORM=  AFFN,          ASDF,            ASDF
##VAR_DIM=   32768,         32768,           32768
##UNITS=     HZ,            ARBITRARY UNITS, ARBITRARY UNITS
##FACTOR=    0.250966925370066, 1,           1
##FIRST=     8223.43324360094, -192810,      -160221
##LAST=      0,             1032,            -91465
##MIN=       0,             -658234,         0
##MAX=       8223.43324360094, 445424293,    0
$$ Real data points
##PAGE= N=1
##DATA TABLE= (X++(R..R)), XYDATA
$$ [...]
23852 100653 -123397 56192 -35213 -23820 41853 -16745 -172302 -249547 199951 -227299 245648
23840 -84277 18408 -21533 308466 -261829 -130271 176130 20375 187899 238735 -150649
23829 133450 -45570 -217199 86479 -31025 254197 306753 521367 258613 148003 153685 134525
23818 134525 -56812 15879 18512 -121052 -140596 258614 151649 -227578 -177672 264393 112470
23806 -139422 87325 53958 209353 260521 486499 -102205 49496 -153008 107232 -190291
23795 -189729 139067 -69189 -375174 140589 -14598 53582 104060 297654 -138966 54126
23784 66946 -239184 181352 43706 -82148 -70932 -227018 51866 86188 112967 424109 -67246
23772 63930 -141430 -12747 262311 -101264 5036 -48966 -171519 269990 29617 -15455 114437
23760 -194996 -122546 -143387 238646 -102378 -90677 197936 56857 240440 -137176 -55653
23749 -18134 -69096 -34827 -153713 -106199 -205908 -46145 -445079 -340073 389207 -19475 37381
23737 9549 140813 109491 14804 49763 -36782 56577 53229 297827 101037 -63225 -114218
23726 -114218 320565 -47095 59172 101653 -35439 5983 -77893 -213364 145589 -180601 -51495
23714 -251712 -121428 -148539 -99887 299757 -22563 202358 -162917 -64243 -65841 -120492 150483
23702 219666 -117076 259494 217515 -176175 -327651 -25140 -214831 102637 91161 -44807
23691 -409633 -153494 -181431 -136897 -133655 4651 53440 205782 -89718 26523 -279751 -369788
23680 -369788 -210224 -128447 -22147 -29626 218733 -100583 -216610 -336865 43314 49058 315982
23669 315982 -302814 -107800 80605 -370828 330823 271080 327426 -375578 65606 -209128
23658 -11289 -173040 -78240 -279557 196654 -82723 59300 -64827 -79798 -269302 28585 -106269
23646 -216567 -38906 -164211 -144979 -264347 -145515 196222 -152121 154731 201868 -97106
23635 -43987 -403521 172394 -189182 -199716 -132279 -17886 -54820 -78842 -45016 -63931 146119
23623 -285302 222705 32728 167847 11862 203642 -248615 203082 66120 -203784 -429540
23613 -429540 234849 -286772 238301 -147319 -85572 13369 228120 177073 -12447 92746
23602 5782 15995 -51665 -30888 -186899 1616 -77719 431887 -87056 5955 133514 81989 150502
23590 150502 -126205 204442 136195 46274 90983 169882 36710 242907 27711 -8914 -180594
23579 -180594 93872 -255328 -86630 -96451 -39644 87779 66511 -5072 -128540 286853 -132247
23567 -17926 -75013 72810 12248 112375 282711 196702 29797 -177334 123294 79099 56728
23556 56728 -17162 -154066 351503 103816 -289856 -233858 28323 -71412 -267625 -276448 -55594
23544 200586 -102611 177657 8841 239307 -230264 -120409 -134363 -163862 -26807 -4227 -99553
23533 -99553 17118 -47226 -18295 185648 392674 -102859 -92030 144067 -288156 37366 174360
23522 174360 67369 222505 40505 235526 -73513 283961 -26042 -28624 -286378 -79407 90982
23510 10850 -301970 -356370 294649 -1810 -41649 79968 320662 -121157 228171 -273028 -113456
23498 149801 70000 -27861 -125733 -52836 308823 249410 -232642 7030 -88295 305668 -382011
23486 -67274 -29752 -86037 110644 -1328 -55678 -251627 133884 95038 -77074 -253638 51249
23474 45515 -176927 162624 -101703 -68429 -147513 -163440 28715 20679 346979 104001 76166
23463 76166 -60895 -70882 -204477 189618 -40859 -150529 21388 -62675 119971 -41847 -151141
23452 -151141 -324420 -87518 -140068 10124 107655 95122 100012 66426 174804 -38660 138593
23440 -119427 -83729 -736 -19180 1445 89464 -177217 -90105 -24363 -218939 -306550 -160932
23429 -160932 66986 111212 -72317 518044 -26084 25116 25470 -482200 -120423 36415 -396343
23417 282246 13206 -266253 -270813 80955 239194 407044 -31177 -41931 115411 -160183 -86712
23406 -86712 46813 -55301 -159230 49665 58187 7096 -124279 -283865 -87037 -367969 -200243
23395 -200243 -159799 113806 262556 -453317 194661 284621 29496 64084 -177674 439495
23384 -120202 -379969 227147 -59200 -319926 29323 17215 -85711 77325 -213331 -11155 22868
23372 -5866 299046 43830 -387541 57311 -235575 -178386 -87794 118450 -155123 -22697 -327888
23361 -327888 20992 -34612 -65426 -261408 -72586 59394 50559 -182887 -1631 -152601 -290721
23350 -290721 242189 -100114 101015 -345741 426750 -487900 18099 93926 -105803 -202175
23340 -202175 -72374 -320665 -118139 80954 42600 -259887 -311296 -229386 -63892 -91297 -397311
23329 -397311 -153380 -104180 285708 -267031 77590 45317 -262615 -209647 -314068 4627 -190742
23317 -31715 -43094 -139857 -289072 -203493 -172095 -160166 -195916 196196 82437 -168160 99870
23305 160017 148384 160604 28842 -191092 -45116 164889 71070 22881 91684 196055 -190195
23293 22325 -11282 17870 -361431 -83935 131238 -296110 -135342 -40110 -87251 -1098 -261298
23282 -261298 -190203 183813 45136 84861 86681 21882 101251 -474 110571 52064 215390
23271 215390 -99167 47486 -179108 -169882 198813 8378 -55595 -217020 -432354 33096 -181986
23259 47096 -56936 466457 107676 -159763 85637 75168 209294 -178201 -114338 123061
23248 -219519 52226 121974 59172 371415 -91784 21322 -99631 -216288 -168217 -28745 402894
23236 124669 -64713 106278 145391 -39023 33159 -402602 453314 -57501 -213254 -44395 150376
23224 80324 -476492 -289476 -9174 137329 68671 234014 238819 168112 312755 197477 -134204
23212 -265518 -82424 -12479 -48074 -116481 155331 -134798 -2390 107044 -24756 -29417 -456627
23201 -456627 -212803 -37315 176833 -15094 -292196 204126 -164611 -94261 22079 -199291
23190 -24325 118357 192647 -229902 153705 -101404 98786 -94565 -173626 125485 155716 55650
23178 -275203 -340739 -112532 -119656 -127969 -93286 -13331 -106813 -79530 -106210 -81683 145679
23166 43750 198116 146051 145251 228439 -81091 19125 164540 97964 70190 125333 73984 -100370
23153 78453 203033 8874 -208000 -97277 25976 -56870 78652 114035 171204 107946 -216202
23141 199171 -186376 212656 2741 155690 -492895 -254498 75496 66930 34632 -199979 79430
23129 -192149 -310971 73322 41263 338885 -146552 -82647 -142618 175824 79358 -91958 -48348
23118 -48348 85883 -83854 303091 4276 -158827 -43743 -196859 27757 -333384 402239 208527
23107 208527 -170410 -171722 -40991 -183434 -152525 84059 20429 -193265 -59242 -93084 47676
23095 -306898 -279889 156213 -55538 9996 -200947 193282 -42967 -46902 -32172 304791 -77756
23083 58744 -102195 -20777 -148335 -141418 165731 -391610 -19892 110334 18326 150542 -10905
23071 26522 -172638 66845 26560 230024 317358 -781 -31728 -333419 -235419 -3253 99497 85503
23059 85503 70544 187477 55101 -24921 -215873 -128348 -36404 -204734 20878 123975 249229
23048 249229 -8579 -38260 214573 -149906 -261088 125215 -99062 -77539 -417855 -206429
23037 171537 269512 -21986 -126006 -54283 38091 -209050 -368882 -367936 234652 -80233 -226020
23026 -226020 -38724 -175327 66334 -125914 -59821 157758 -347112 -56853 -50049 -16488 -112644
23015 -112644 -225132 358185 -109453 -82092 73907 31974 218375 272311 104891 72968
23005 72968 30246 111877 -173482 -239651 -6899 -318808 -298774 -1789 47415 -290994 246905
22993 190015 -232876 103275 -204895 25944 -205604 66473 -93710 -198852 13551 -48885
22982 91819 61118 25909 -219836 -281344 -65908 -171489 79545 -312964 -258449 213043 230895
22971 230895 485198 -39512 96710 -6606 101048 -80093 -128138 -158677 224283 9581 -33746
22959 -18083 18503 -284415 132855 -81566 -90492 -67365 -74250 -48947 54806 -82386 145079
22947 -149285 -214418 162809 -28269 -58097 -186606 80283 -220791 -157630 -112638 -169734 30078
22935 -293927 -347370 -193837 -940 283951 -81266 -324625 -252277 52495 -73252 314046 217760
22924 217760 -19150 105637 -189320 174466 -357806 127960 -247514 412960 -65099 -255044
22914 -255044 44714 -11618 211577 41607 95585 -59045 -246169 274762 -223438 80803 4809
22902 -94009 183376 -94150 474482 -74624 98182 -349319 19320 -5518 -121800 -447192 -15568
22890 -127213 36553 -171294 -119596 299294 240579 28669 20049 -118396 48887 140897 -42223
22878 15666 -69698 336499 -22425 222372 140397 290523 -166701 16533 -158918 -265240
22868 -265240 168014 -202950 85836 -49414 144645 -6397 126965 -45865 41510 -38214 28657
22856 -348535 -167061 79644 204608 94600 57748 -12090 -343873 -348036 -25860 39566 65047
22845 65047 -171251 -130425 -628 -220664 -116047 -68839 -155851 -235543 -82485 -193364 44487
22833 -66982 -187446 -272164 -79248 -320315 36882 -148424 -56134 -283171 -44493 -138999 -37161
22821 252092 219310 47574 -372237 4951 -114508 24699 136281 -85763 -27787 -113563 -39815
22809 200347 377598 82482 142116 -71438 -130603 212296 262613 206086 436610 -145266 46014
22797 131328 -110625 161926 10264 -190283 144935 -130041 -56866 -2952 237726 -16096
22786 13284 13287 -170712 -296420 -342273 -109536 -12040 -215699 135754 -248389 -54971 -162672
22775 -162672 -150218 -38427 -142473 -357287 354871 -76514 -113007 -28480 162430 63203 -29757
22763 171900 -93733 -267491 -118350 -76892 75947 51644 -68037 203320 -227814 -45221 -158983
22752 -158983 -117849 177192 -77372 30124 32558 -218037 10921 70685 161240 64533 123629
22741 123629 -56669 219937 117106 231055 70361 -184141 -137934 152017 -32891 -41072 241180
22729 126742 -392884 -134013 -124143 155785 -338709 -238130 -223801 20537 29066 -174944 23489
22717 -386799 43615 -201255 -21002 -120270 -173002 -179852 -92262 228314 90260 -184675 72528
22705 -15733 -51224 -192805 -193636 -251897 -129027 -85635 -178419 173663 -189918 15786 -50763
22693 16388 -106121 93904 105263 113132 -55446 -271322 53773 109487 -4435 -48721 103355
22681 -181130 -187800 -6076 -211405 139868 -141797 38622 -137169 243254 123555 -83753 87672
22669 -20065 -39483 -42071 -286731 -8589 -1044 -269598 -824 68317 119517 206873 -159441 90331
22656 -561 -27721 147101 9452 19718 274100 -232350 -18301 -206556 -196440 -67634 -62157 41916
22643 104852 87154 -110698 -194782 -34027 190452 -357594 -124749 -99639 -169939 -94873 -32397
22631 -212719 11148 -35727 -59196 45382 174495 120180 -173203 -101620 127258 199545 50709
22619 -110664 110820 -281971 -301580 -159799 23146 110754 -159074 -87121 -460232 40833
22608 83321 72954 36573 201697 -30578 79674 -214659 157431 -149373 -154379 12345 267691
22597 267691 -197456 -87663 -414776 14886 -199871 3970 -110337 -250534 110907 9148 -450515
22585 1801 -63845 -195486 -436391 -85189 54210 -3182 -60772 -58159 29035 93653 -148573 237983
22572 83398 146364 -78561 -3967 446010 -255210 169686 -226271 -39925 -4366 -26688 139896
22560 435377 62911 32394 135650 -245935 91228 233280 -38993 -19786 -10801 -99339 -75795
22549 -75795 -39941 -272947 -75511 -32894 -88912 258838 -113534 245328 -343424 50609 184575
22538 184575 -183360 -363918 62100 -35102 146060 -51239 -84247 -86326 -129970 -164560 -250006
22527 -250006 -14329 234285 318156 -31054 263738 82720 174435 111635 -161998 -189167 166018
22515 8540 356974 -31641 -145233 24540 -581301 -46078 194834 243455 -101192 -34376 -202991
22504 -202991 -82776 -284176 -38237 273200 -100277 -4616 49776 -86152 -20103 138363 -114806
22492 31124 -126022 -264692 305806 36962 -111397 -397488 -123734 -69930 14087 95122
22482 95122 -24419 84521 184019 214971 -20166 -330466 163148 10086 10145 9697 -333324 -181509
22470 -181509 20757 -98099 -50550 250780 -379826 -14482 -66169 80731 331809 391463 213370
22459 213370 -180147 12689 -76706 -223048 -39858 120725 -119673 -110461 71136 177596 223812
22448 223812 17772 75343 -277337 -164841 -99686 -296842 -39387 -18718 38016 103026 -163133
22436 -79462 -269835 103235 -407622 -658234 4509 235892 -161722 -126925 -337643 50002
22425 -388381 83363 -270884 -53636 -145444 28497 -11030 69826 -58940 102260 10799 42810
22414 42810 196321 -39010 -120978 141231 -41759 46085 -171882 -18385 -155031 61641 110713
22403 110713 173492 41484 144162 26951 54064 86765 -41536 -274669 -121145 269559 -68087
22391 24345 93148 -175243 -296535 1141 -24163 -185797 -109471 -55384 -100449 437 60553 199480
22379 199480 -163489 -46086 -158977 309624 -142789 -18273 -69896 -248750 -96593 72060
22368 73621 -473543 -169882 49147 41330 129732 27207 295571 -36478 -81257 4058 -323218
22356 109729 -142131 -156345 -129582 -7399 460232 -20285 -372047 -150439 195350 83688 -81229
22344 -22716 118223 -346237 -17771 -70618 -244165 -356902 68193 25547 -33857 90312 90548
22333 90548 -379534 -503289 -448316 -328691 -133859 -286108 -73084 -76465 -92137 -79931 -256711
22322 -256711 260916 444936 -165329 -12097 79306 -17093 -78461 19958 -387268 -50658 -96285
22311 -96285 -144299 -230593 -147411 -247020 -173268 56130 111773 -287885 -250776 27876 54016
22300 54016 138076 125404 26266 -522739 -33294 -305479 -320743 27123 -167646 -67040 129838
22288 -126104 79095 -60781 -87017 225698 81396 -116086 -20692 40833 74514 160587 -70559
22276 -8252 -366494 312621 84687 -15865 46682 -99662 243770 -57117 152557 -204354 95022
22264 -72201 -158711 -163296 -159988 -190600 -158944 122696 -214663 91998 -138952 211542 -48964
22252 -45603 -126670 221136 184752 45234 -179406 3521 136432 40293 -537556 8851 -261675
22240 -112749 46526 275386 43196 81873 -80709 -93922 287191 -240085 -7124 -216692 16405
22228 82466 -303625 194783 -69108 -96294 -418368 175912 -216410 73500 86189 166381 -190477
22216 -160061 -134997 65085 -151425 -83980 -154510 104756 -85413 -240243 -31277 -240964 -70518
22204 45536 -42944 -153914 -175048 356489 -62065 136796 -91237 10913 471493 -57137 -176565
22193 -176565 63562 74961 104254 40131 199097 -135249 47003 -113492 -342791 113272
22182 -61571 -20837 -104727 -152098 259213 57704 -178695 -79064 197981 -2383 -214916 203260
22170 -93968 18037 -22935 18545 -120455 164629 43380 43470 -125879 211263 167832 -43988
22158 -91134 -25345 155509 -28293 -145909 193349 7467 106491 -43217 -23214 -120321 -211307
22147 -211307 49353 46355 -106203 4264 -105894 56915 -30755 443417 -21068 127944 8294
22135 -44126 178011 -93680 23544 -159576 -263307 -39623 -46301 -289969 176599 -396166 -97321
22123 -160866 -140401 45363 177981 -137332 57657 52522 -149562 -133368 -125855 147188 -259332
22111 201803 -206157 -37268 -70356 -363627 50628 161299 -92583 -316016 52859 10765 -60114
22099 32277 -38469 -102959 -144287 -65495 -84644 -128283 -146972 -161045 -216801 148417 -161714
22087 45506 25046 -110620 18072 -350397 -18934 -112540 -516256 -128443 264707 140984
22077 140984 93972 32888 193312 -103987 -145431 -82573 -75206 -17019 60309 25174 14157
22066 14157 188314 188692 10192 42541 164830 -190915 -260642 -61270 199258 -29464 23949
22054 -333658 63466 -204863 299602 41430 17226 279273 -25092 82451 -301220 -12964 -110798
22043 -110798 -248288 33433 -42808 -82533 49793 211909 20903 -52125 -144449 -44049 -128237
22032 -128237 -219667 88025 27315 -131478 -329744 260239 43643 -215130 -108099 -174881
22022 -174881 -201928 47840 -47725 -337306 -25955 24820 -257254 -56221 94877 -140252 -49502
22010 95460 -5156 -348312 -160289 180780 -139274 -17076 -43063 308481 -103965 -315705
22000 -315705 -149408 -52307 -291300 -13123 92844 -135191 155488 108926 56962 -52071 -26853
21989 -26853 -49495 164430 -190554 203434 191695 -293309 101151 74574 40657 129280 -239767
21977 129691 78302 78758 -299275 -272367 -33894 309608 43870 -94215 -29910 -28907 -272190
21966 -272190 -156990 -79827 80177 97688 -133011 -236574 -158343 -180450 202740 46929 386082
21955 386082 -53961 -93522 -150257 13661 -132669 -230109 -106912 -36668 -265829 313158 -126430
21943 -66845 -32677 -114713 -149332 -8314 -106799 57007 158094 26328 77468 -124658 125762
21931 -69227 58119 62892 -117132 1618 -111925 96962 -103768 -8163 -199744 -102652 374977
21919 -272395 -118651 -20717 96699 -8709 -198643 -80604 84533 -349189 -20724 -271949 -2275
21907 -240854 -165093 -145201 -43019 -42497 367214 3914 -291445 -172158 -222255 4701 -292797
21895 -203512 29282 -186283 117542 -16711 -41378 -42726 389559 -40773 29614 54747 224492
21884 224492 12443 -199860 -199618 294852 -68365 -110841 -54885 83474 100983 1045 84174 160878
21872 160878 -17359 155382 -322427 204776 -81524 -291526 281249 -54123 -7553 -253751
21862 -253751 118558 -32040 71570 -139218 43979 -115162 150929 58930 -275366 188206
21851 -275116 -14210 -30145 329050 -57476 37332 -84078 -122352 61698 -232136 -47322 61408
21839 -288058 -116870 115255 120143 -219264 -192049 -198560 -20165 -154775 -94428 -143838 -270152
21828 -270152 146222 98841 38881 85353 225135 -14838 -31158 -45402 -23599 34743 -74605
21816 -286109 -13786 307703 -189182 -217550 -127906 25121 -242718 343293 -242995 7832 -280983
21804 23277 51234 -173815 -109962 187186 194081 1410 47526 308213 -28504 63191 -6449 85189
21791 179612 64798 -87531 -102320 -144414 36689 -166089 112768 6208 98726 -366666 -173437
21779 -28361 -380351 173139 -51552 148650 -72969 -15457 -18139 102418 84258 84883 -88553
21767 86612 -10111 -162360 -265567 -249343 105289 -149101 -124746 -355457 88513 -44524 -37755
21756 -37755 -100986 251894 -165984 182463 39939 176996 -44191 -171828 -114382 79377 276200
21745 276200 84973 187452 -4508 29219 64037 122977 87551 -391510 -125422 21398 -201576
21733 -11893 112592 -178262 -108928 19274 121338 267677 -157839 -91136 -18409 -207217
21723 -207217 62797 -88919 -238872 9947 -148914 -381013 220281 -158212 11401 -247896
21712 -10324 223323 -9645 -215584 230137 -63667 178643 -117808 -277046 -59289 -237011
21702 -237011 257233 -138205 -210987 -85166 -152971 -110477 -52697 -44758 -187395 -275171 234473
21690 -223485 24272 114496 -386207 356187 -24697 -420867 220985 43389 -245028 -100170
21679 -339461 -178882 -139593 -8240 -333989 -119060 78672 318091 117815 -143297 31187
21668 75576 -311628 -173768 21260 -273164 -55699 -53691 38528 -21325 430000 -71543 -90708
21657 -90708 139674 -117307 223474 -213724 -181344 -119156 -92717 -93034 129800 -86094 64 -225284
21644 -358046 19919 -22978 99015 -89058 -28284 32754 104793 -1729 -79147 318026 -90913
21632 -70965 30430 410914 -106887 -127128 -134704 -133717 -1810 237517 -50756 26326 -122312 107129
21619 -138432 -71585 -113812 -82102 53311 -96055 126306 -165482 98180 -43506 36430 33054
21608 33054 64437 -128545 -91378 -100579 -161600 -321956 224315 -61806 -146051 -24755 -391891
21597 -391891 -325095 38337 -112165 -158086 -278437 100922 140434 108336 -338724 136679
21586 51401 -178288 120511 33104 -14206 -303753 97845 -234688 -19427 -209646 184012
21575 66663 309005 -122227 147071 293253 -335795 -174875 -288930 124727 -98499 86534
21564 -168195 56600 -118339 42276 -76363 164328 105880 -145060 -517460 -257354 220405
21553 106751 51650 -142787 140234 178522 37140 89523 -61342 14189 198417 -377111 210312
21541 -19135 138518 -16650 37534 47922 -94340 -88252 -44294 -286969 -102458 -401487 72822
21529 -110 -294325 115976 -345662 23416 21539 -173317 -11469 -395533 -159548 -145988 -73034
21518 -73034 420224 -365428 131089 -338141 84061 237245 -101067 -340548 275277 -37004
21507 -277685 211836 -43902 -72335 174424 -339169 -438109 -4690 -246422 -2515 -435089 -76544
21495 58126 174217 83647 109716 -117673 -489001 15474 49222 175947 -117355 57858 -277853
21483 -118513 62372 155579 -174424 -43056 18084 -63736 176171 -157114 13264 -77998 35986
21471 -309619 -79766 16409 -199024 173971 -149073 -188180 -72282 -125474 2273 -236883 -393178
21460 -393178 -126292 -192744 -13879 -118197 -65768 15630 -410062 -510366 59756 -46806 47787
21448 -92232 -53166 -173758 -202415 -226283 -16716 164914 89261 87025 150605 298491 273363
21437 273363 109919 298199 304792 115826 16154 163611 -2071 -74859 56233 -256769 281240
21425 -173750 127419 -39427 -62493 -77745 14014 -180774 -29461 -136420 66211 173369 -257621
21413 384417 -83450 -23451 67725 -39643 -248688 193295 243142 -317383 19317 -158896 -9849
21401 188708 -319912 49720 41769 -21851 35740 -291454 -109239 -133598 15446 2724 78162
21390 78162 125218 160635 143250 -104851 -13398 15089 -100071 -11587 -112828 -89260 -152776
21379 -152776 109727 -166398 -298868 352753 -60095 13832 -173771 -293248 41402 -273758
21368 -166037 170225 164981 -164348 -251130 11509 26532 -85219 -368377 -222236 17052 89467
21357 89467 -30366 -171849 298568 193320 -394580 -143850 47895 131884 -70302 -84412 -258776
21346 -258776 234467 254118 73083 -24652 214524 -118008 -206834 -150272 216836 29199 169934
21335 169934 -110364 -322686 -136107 -166431 -144075 22024 283987 -264344 38235 40780 -321771
21323 -331240 102553 -89980 33990 -301347 -241362 83454 254252 -24729 337481 -95653 -89070
21312 -89070 -183398 -45036 -237975 -105301 -22886 -149751 8077 -152137 -94257 -228164 -231132
21301 -231132 131852 -28933 -21512 96309 110038 -120807 -165938 -98414 -70440 211553 -168598
21289 8222 148190 -60668 -18654 233474 -160146 -231967 -37734 -191405 133732 -58007 -61500
21278 -61500 -343249 -91556 -150904 -88277 -167755 151858 287017 -6435 80153 -156855 158018
21266 -44031 -106496 -326702 -20231 -123785 231588 76776 -37011 84410 -41324 -245066 -172806
21255 -172806 -74029 62949 -55166 -173228 -66650 -331963 -20907 -118100 110088 2249 -61716
21243 -52121 35792 202173 54578 -391022 -201752 35040 -308297 128832 48408 -74288 320690
21231 -76183 26058 -304698 61927 194271 291732 -189494 -141700 5686 -101946 -55788 -35884
21220 -35884 -104102 -195277 -73941 152446 -205312 -214592 -256967 -101526 96137 82822 192797
21209 192797 -71419 -228569 -497477 -249965 27280 -89931 -191999 -28163 -54567 -59491 -135066
21198 -135066 -245265 -61216 -267890 -9204 -75005 46463 -196761 -307947 -187545 -46747 -184823
21187 -184823 53030 239548 122378 -258225 -182870 -317646 139431 -95005 -53351 164901
21176 4056 -163837 1943 -9320 64615 -73675 52961 -252759 -61144 -163067 78657 177661 -346716
21163 -202595 75569 -76720 61989 -154575 68478 -200766 3983 -143388 2064 -295295 433386
21151 -186401 -101770 -24724 31794 -30009 -13191 116543 -35087 -214096 -42564 -152586 234204
21139 274265 -6113 51875 96535 29063 -98461 -74065 -57596 216109 -72137 232080 76151
21127 -382572 368205 -303879 -146896 -400434 184015 -109736 -178882 -270650 43390 156075
21117 156075 -30069 271978 31636 127965 326401 -297640 350298 -141285 -12997 -101398
21107 -101398 178171 173341 -22744 -5380 163050 19691 -2988 -535455 327808 -141400 279004
21095 -54287 71284 12933 3530 -12432 166634 125524 -186605 23186 -347748 60274 -456569
21083 -82775 40884 1811 56037 -10030 -14154 -116316 -139520 -68689 -150765 -98000 -247342 -53688
21070 -219587 123645 -86230 -141998 -3548 -348744 -307826 -274766 28817 12492 -362963 147954
21058 -32148 93503 -6672 -246176 -253883 5184 60631 -117246 -209798 -90089 -180307 -273862 -5209
21045 132209 -272612 -84951 40453 40246 -238699 100747 -512131 -44073 138978 -111272 -170693
21034 -170693 -69274 17814 21531 -238067 -134631 -51742 6879 -87151 -70364 -168497 227242
21022 -254058 183719 -117254 -206620 45475 151536 34995 13178 -130901 -103303 -207171
21012 -207171 199849 -229685 -265373 168126 114303 -136005 229650 -70055 8771 -11139 -88124
21001 -88124 131139 164942 -205959 314841 79458 -443923 198494 68838 -70688 -277743
20991 -277743 59396 -122676 -225164 112086 -195967 462453 -104070 -150324 -38326 -126840
20981 -126840 88067 116999 169853 -139152 -69843 48358 125879 146850 -41565 165580 49506
20969 -87098 -40337 -193571 -98199 205090 -51795 -27182 60621 134295 -6479 -207784 159483
20957 -32411 190301 104235 -40314 -24977 56884 23829 154099 -149909 -215273 45853 -240045
20945 -249950 98585 122034 305124 -82568 -131225 -433519 -176400 37297 -141404 -482843
20935 -482843 -188722 -76818 138817 -50240 69910 19307 15476 -328522 270581 -436877 -139942
20923 34148 296991 26423 -81597 -72893 -86067 353576 -73355 -41010 85730 -25460 84505
20911 25182 49168 31262 2568 191142 106567 -199383 112198 -266980 34585 -402664 -158190
20899 120220 17870 -182407 -141221 -318783 -41376 -163322 -60928 153645 -106802 -92961
20889 -92961 -29567 -189539 -21157 152438 119465 -112791 37239 114356 -2403 -123982 63423
20877 88950 47712 -102253 249415 39666 -31360 -36205 -116585 67783 -105439 77060 63006
20866 63006 -193679 -45900 25046 -348800 51753 -317774 -41344 -18822 -313528 -67128 -78034
20855 -78034 183299 48067 -9624 -224158 -201434 -201725 -188976 -144894 -104558 -311858 -31435 -57211
20843 -57211 -195278 -70211 -145313 -123775 387120 159444 69425 -121494 267643 -256148
20832 -73952 -132412 -287616 -195304 9734 86259 -183616 -200748 -116210 167436 33530 -73252
20820 164374 -267190 -138100 165216 -93052 -11572 247777 110251 -208499 162145 -82040
20809 -128192 -230210 -76058 -244795 21377 -329659 -65762 4028 -14782 -59237 256061 -38840
20797 16833 182014 -95371 -103281 -142819 -359194 -16069 98443 10081 -96552 72980 -242619
20785 -226294 -20066 -296564 -64194 -81033 102444 -21753 188241 -46621 68127 -39226 97460
20773 -397262 231353 -150509 -93484 -152232 -160160 107297 -201469 -86216 166628 64032 -95010
20761 145885 -57618 -25475 31804 -294320 -27865 -7208 -65260 -289380 -92092 100536 -104124
20749 -546867 43914 -23765 -318488 66552 -9860 -304980 241948 -255911 -122364 244261
20738 -170664 -111047 -307968 193329 -149608 -42295 -117022 -29707 85959 -3086 -88537 -106086
20727 -106086 19415 -212585 -328719 -171365 134669 -276482 -130505 -155950 -93622 149507
20716 -373164 208293 -25392 -34535 -619565 -86090 -355498 -97386 68074 55131 268967 319054
20705 319054 -426781 10296 -110501 14750 90598 -217465 -49022 -97309 119442 140477 -75592
20693 164861 -203035 -89713 -5060 -167888 126873 -15404 108015 -32137 36329 -150411 8259
20681 121189 -191141 -7623 -19436 94528 238850 -231362 -88767 60903 -19416 6658 -48145
20669 -93392 -233040 -102361 23580 -108146 12765 -41170 56926 -227549 -282529 -102065 -634472
20658 -634472 13801 -223175 -136671 -55530 -285552 21041 -38172 -163326 -5335 -216452 -364237
20647 -364237 -85000 -110272 -282774 247857 -186841 -42590 -223645 112005 -321121 43973
20636 -154991 -271504 -11514 -223592 145616 196285 -66908 27325 -61690 127659 -32455 -81075
20625 -81075 -30555 -464537 200429 107907 -57908 -59708 166123 47124 153191 -260789 206655
20613 -85700 29189 -284919 -80461 130938 8832 188617 -19506 12632 -83500 48040 -85209
20601 99003 -102426 -127136 14124 59341 65965 130035 -20468 -3320 108900 -121889 208751
20589 -210377 -75087 61557 12898 -67175 187724 86088 -63551 -63388 97283 -84115 283897
20577 345235 311806 -197100 -296950 229447 -78131 -340092 46668 -53776 245582 -186866
20566 -295282 -19477 7658 -135418 -85375 29344 256530 46284 299429 -125874 -206534 -207789
20555 -207789 -98336 -351925 -44782 155433 -75771 32581 158424 -157294 39973 9891 -142405
20543 -46670 8358 93791 -66519 -161661 51526 -257852 -62082 -36876 250730 28541 -218455
20531 -130770 76645 5398 40794 -192718 -45048 -58004 -49946 -212195 105742 46948 -166275
20519 -70752 881 -304390 286245 -87421 -296609 -73321 -202591 -466413 -384044 161981 57928
20507 -231248 76284 -28130 -14067 -171360 84945 -167398 -266036 -269836 69802 119099 -207897
20495 56676 -41908 117239 -212779 -127413 22535 -10352 -155437 128967 -205591 -31682 96098
20483 -124781 4350 -154001 100068 338335 -225283 -157648 61948 14094 -12773 91405 -18849
20471 50300 53102 4688 -227676 -380505 -181199 -85943 -286030 107114 -107283 -11451 -238100
20460 -238100 123194 -34841 75523 -18884 196758 -4551 54422 138834 228287 76566 -36623
20448 62422 28382 -96272 -192973 -100027 -87510 237638 16910 86247 -128714 -185433 -129420
20437 -129420 81514 211554 -97902 5873 69184 -50821 137063 -282261 18496 75573 -228567
20425 -351978 -51521 98312 105394 -27458 9946 14703 -185067 -116558 -91879 -361779 -52604 -22442
20412 71531 335412 -91924 -412245 -291739 -18569 -74085 3796 242113 195906 72799 7974
20400 16105 7618 -24474 12004 19221 47533 113374 91841 -163003 -211007 -65583 -21799 112248
20387 -81595 58781 11936 77077 7557 -170565 -51117 -402674 215656 -98363 -173234 -39544
20375 33913 295324 -97226 8079 254375 -174229 -187186 -293055 216340 117819 65398 -399378
20363 -422244 240556 154973 -245766 54444 -262305 126415 -121873 111907 -50396 -89316
20353 -89316 -243978 13798 -198011 -310274 132221 -164615 87214 164379 -207212 46 -291257
20341 97708 55107 -284541 -337171 -35459 -121599 -94524 -28660 -131982 36843 -348730 -316645
20330 -316645 -293667 -334770 161099 10600 -17900 70916 -97311 -104811 239759 -53348 224172
20318 -243500 -367579 -39299 -11457 -200194 -73490 -306003 -208157 -90478 267182 -239023
20307 -12501 -141907 -65155 -2883 24351 -87962 -33150 -98642 -117584 256362 262091 -223655
20295 15193 -237972 153513 -303277 -70204 138855 21112 -63536 -145191 200626 -287592
20284 -104359 53584 193727 -341815 -23794 -128438 -16723 -385554 52981 -55839 -27805 211876
20272 -114238 -103154 170927 -15955 -34020 -160833 41058 46754 -37449 -199750 -128268 178049
20260 -166394 -82416 -83685 63498 34667 45159 -231103 334561 -186260 236048 190263 102882
20249 102882 91873 56610 5430 184012 -482594 -213791 68940 -63502 16043 -140402 -128258
20238 -128258 84935 35551 66153 -321701 -196854 69792 -296227 -304006 53633 55194 -198453
20226 216347 -54533 57244 -258516 -26092 80946 27240 -449403 -118714 -120013 164948 156149
20215 156149 74269 -33483 -136979 -182335 143521 -99264 -10122 130373 -145883 147108
20204 -194005 -289512 -136581 87198 -105769 65943 -180952 221358 -234321 -161509 -275396
20194 -275396 47917 -91991 -45577 116379 -178270 -65660 178798 -60131 -524370 -15877 -53222
20183 -53222 77672 37168 -171864 19680 112442 226505 -61134 -43040 130812 -362528 101163
20171 -274062 69392 98279 -96994 343574 53782 93464 -100598 -48493 133326 -237071 -263323
20160 -263323 -103052 -209312 30927 -43221 -196958 7018 9751 -12414 82627 -27510 -367786
20149 -367786 75375 -319173 -10700 178536 -207315 -10714 -333505 8536 132530 84397 -143233
20137 62957 35555 315928 -160935 -272264 -344965 -107729 84340 -25337 341706 -314718
20126 -162934 -26909 -175434 22880 456740 -169811 -56238 243193 -161817 -145189 -99138
20116 -99138 -44128 117011 -97924 105102 -29142 87353 -273451 469237 -249219 -49829 306072
20104 148555 -20783 11308 -119080 -51490 -49892 5943 175494 18143 -113871 37320 -366597
20092 92285 -302371 -90647 -314041 -171087 36392 -104600 100257 -242313 -201851 -85705
20081 18516 -130217 193495 55578 16685 -82818 12644 192389 -183513 213583 76116 -311473
20069 -97794 -82503 206456 -35646 -62514 43538 -212417 88530 -300668 159311 160964 -22974
20057 -109640 -182922 79302 -221580 -102243 261371 -140972 -96717 -389226 -103375 170757
20046 -122229 -6673 94553 -11187 -208037 -172720 -120358 -191856 -173097 184505 -78168 -16978
20034 -459498 195498 2133 -69624 77146 -144070 -14255 -92123 3263 -130685 -17269 -139613
20023 -139613 207259 75513 -278300 -45097 -46168 -11754 224041 -98131 -65288 -323067 -207390
20012 -207390 -11419 -5968 -102215 56006 -257573 141516 -23959 -121807 128989 -374869 -253058
20001 -253058 306162 -66840 -32409 63523 -166107 32571 -332547 -4422 -188384 -244133 -299618
19990 -299618 1690 -177766 190947 -588163 -336739 -204016 -304085 -294047 -193353 31304
19979 -71035 234622 62779 -204004 -59529 222196 -264045 282590 -129304 -33626 -45505
19969 -45505 -141920 -117026 383968 -78951 -305668 27825 -206345 -98437 -285471 125850 96032
19958 96032 -186260 97784 61860 94664 305305 -174534 82677 -149277 -406335 -89606 -279900
19947 -279900 269858 163398 -25659 -126259 -62607 -63422 -184259 -85411 -16908 197953 -117763
19935 -23687 -239627 -705 240255 191408 -303290 -128566 266423 -12953 -16861 -326126 -43067
19923 146175 -15602 54057 -265119 -149256 176641 122354 -123646 -253611 51437 -202090
19912 41376 -185397 -131980 -188105 -132256 -225749 -426124 54145 -119058 -89756 -206743 72452
19900 48484 -42073 -33412 175869 -92816 90733 -256876 -207755 -92205 -299687 -36960 -49981
19889 -49981 -146820 -199658 -206906 -114393 -79347 -300351 -173061 -144832 145897 -200441 41909
19877 126332 -63767 -208958 54785 -109212 -59797 -332367 -74617 -13913 -123472 -94361 -37217
19865 -444916 106891 -3778 58080 45115 -83537 115515 -77697 -355706 -12983 -193643 21686
19853 -182971 -71286 28598 -230685 -186661 -41209 -34817 -123048 -156454 -26335 -270666 -11746
19841 -388912 -362967 -64450 105250 155050 67848 -155802 -543418 -193431 -77211 325120
19830 -85297 -370033 -32970 -329635 130721 236243 102069 230214 145105 59337 -59795
19819 -474077 132625 -113694 -60956 122206 -197818 -115565 111630 84647 -223219 152384
19808 35334 252431 -376540 8764 -10602 28763 -30476 -354317 -186836 -291693 29406 -448513
19796 71075 -139901 -87412 -94426 59727 -479690 37612 146478 93592 33371 -76046 -158694
19785 -158694 -132735 -140471 -79021 -195184 -97137 -6736 -184059 -76169 138295 -184570 -180581
19774 -180581 -135293 -149841 1528 140607 -126247 328991 87006 94498 -182228 72837 -586099
19762 -85313 98416 49309 -105362 188353 -179675 31901 284140 -97252 -172121 -155665 57366
19750 45730 145666 -65683 66287 206526 41719 -117611 127826 243475 62690 18366 -65783
19738 82558 -71699 -60656 44064 -118074 -1340 -167639 -47488 206355 -140063 3321 -83696
19726 190352 59007 201925 -37274 316693 59118 -102955 -157200 -188046 -112285 -145536 -123075
19715 -123075 100887 -272727 231202 -154283 261247 102242 -294378 162436 186119 -164610
19704 86109 -227692 68414 267619 33020 -195791 -371961 114774 -14076 -132939 248860
19693 -73619 80265 -163105 24350 124813 -118433 -169016 -130667 -141677 28095 283871 -312960
19681 88624 -209649 -4534 -76584 -117707 -205730 -67624 60658 32917 82264 5737 163825 76821
19668 -129579 194869 34362 -24187 -110173 -247062 191376 -343085 79709 54063 -21334 51029
19656 178922 250747 139784 26294 -465365 -17550 62498 -85645 -371287 -45703 93294 -90495
19644 -355218 -226744 -169649 -117217 286420 -422568 -210187 -150613 -315795 108826 109333 159388
19633 159388 153757 307907 217395 27288 271521 -109710 -301320 -119787 -248115 -26084
19622 74444 -265871 -49249 31111 83982 237717 -13831 -150668 -107966 92342 92941 -79496
19610 -172764 18382 -5685 117843 42727 -82222 -339780 -61324 -327490 -36877 -185851 -31485
19598 -185379 -157042 -110211 163551 140909 -7657 -209964 -307050 67243 87663 57519 -339193
19586 -53424 -124453 -147470 98655 -34711 13193 -263993 40986 -55713 -74626 79437 -345131
19574 -189285 57726 75449 -176720 394 159464 -48177 -60266 -146405 130891 -325610 -165566
19563 -165566 -84273 59370 -124253 -187000 150757 117732 -319772 -74241 16000 -229053 -107966
19551 -43602 -16055 -268371 -76616 -125150 -42468 -49140 383835 186763 -134409 -122166 -129917
19540 -129917 -66679 51277 62170 -269062 121793 -243950 311459 -94727 130997 -158025
19529 -257250 -11199 -220662 201801 340594 -29737 35296 191505 119568 -270863 -64703
19518 184672 -111671 -231606 -73417 -113139 -293240 -137590 -113134 -38951 -59397 -124308 143947
19506 -108240 108521 -177005 -102532 78465 -48016 -85765 2607 22323 216758 75978 5492
19494 90242 -219043 -72980 -161214 -423169 -216572 148727 -3426 217961 -420050 -149214
19483 -130059 -250085 -117146 -261012 -313879 -168063 -69852 -55378 149598 138387 258666
19473 258666 -57060 -80251 -244699 111342 -242364 -188600 82636 -242595 -196166 233451
19462 -183207 198724 109213 -16550 168412 -44657 -397804 -303523 -80434 -224639 -5207 52301
19450 -21884 10931 46009 -2973 -71422 -218243 142576 115280 -224076 -234099 16503 -270375
19438 16003 -118509 -133101 104056 -205876 303105 109083 76204 -50932 203861 -106891
19427 -291398 -303361 -290478 47011 -443236 -70139 -147617 167449 75094 -421308 -111455 280978
19415 -197459 232069 -85438 45855 -291114 326113 -126665 141459 28479 -139690 -261999
19405 -261999 -141333 104626 -29525 -186370 145765 127086 -101379 85009 -225135 -609339
19395 -609339 -145333 -87556 24102 20278 93972 -17542 -106085 -13813 -84173 -51790 259083
19383 -1947 389861 49363 66549 175008 -180844 158738 104811 -143146 95789 -880 -199628
19372 -199628 -254195 -68060 -305342 -95277 78844 75374 -122617 -93644 -188139 -385573 246738
19360 6639 302221 179002 -156184 -5002 103222 -123129 134155 100927 232259 -25561 -291230
19349 -291230 25067 23311 -533593 -536534 179542 -32065 47292 -203245 93118 191416 -14787
19337 -330103 -84883 -335405 -149535 -108938 183107 90232 -177802 -134249 -63127 -22524 -343391
19326 -343391 -103827 -110862 126396 -11441 74346 160851 -99680 -199882 32358 -252236 -139786
19315 -139786 -97763 -84765 87769 -333714 -41799 -399518 40403 -77574 -75670 -103168 -161009
19304 -161009 -61171 -319689 16949 -35625 -56970 -194480 -25986 173302 252491 -112293 -289354
19293 -289354 -265249 176295 5367 268029 -254945 -147122 -62733 -203450 -188455 153791
19282 -39293 107895 -163632 171748 111195 -55257 -237115 -131119 -564923 -12061 62200
19271 25176 -15107 -141518 -237679 -152206 358674 33580 112705 98395 -59171 92143 -30028
19259 60395 143051 -327528 -301303 -111584 -160255 -188587 173512 -11410 -290172 -233337 -6449
19247 -38062 -193165 -40876 -241868 -492220 10568 157571 20040 -164871 -146270 172577
19236 18057 -111919 -454465 -104826 -66935 154619 60714 15438 153562 333060 91316
19225 -43666 65185 53192 83916 142894 -33431 -371701 -20182 -58968 22666 -214334 -162993
19214 -162993 413690 4367 -121927 8887 166127 59166 76571 103255 -454221 -7068 -131910
19203 -131910 -177114 388123 -170645 152705 40044 -194309 -301435 -36154 -188810 85145
19192 -234071 -181590 -337764 323817 186326 -96148 74954 -215108 18718 -11295 -103105 89788
19180 -12685 -381145 -61064 -228393 66974 -91939 -3794 -15990 14676 -280187 -46824 -101117
19169 -101117 -342259 -101275 -100875 -25439 -380102 -107637 -462102 -63671 -1812 -88536 21390
19157 -73510 -226438 -147099 65430 143854 -101040 -215011 54041 -30711 -253258 -99845 -260864
19146 -260864 -238353 -398467 68905 184234 -273711 -121309 -70696 -165043 228012 191380
19136 191380 215122 -54885 106896 187436 -196689 -86164 226997 176224 -102333 111656
19125 -359826 36001 444 90914 49317 -199929 -109112 -161604 -210515 -80488 -235714 142040
19113 -95707 111962 -311833 92816 -40035 688 -242154 37120 -60179 1327 -58347 -207273
19102 -207273 -330504 -164980 -34847 -73917 -6437 -81451 15086 -38814 -225775 52596 -33304
19090 -180140 -110093 -296002 -146311 -32153 -318353 435447 105307 -10578 -330262 -312707
19080 -312707 22100 -140123 -24905 -396079 -200143 -104847 -151107 -52353 -33948 -211738 -30173
19068 -40061 -40181 -28076 -263563 21427 -19662 -188556 162315 -240424 -198522 -124219 90870
19056 -49843 159164 -175504 -220997 33274 90931 -39664 -2927 156232 164915 342387 201263
19045 201263 -35787 -264193 -4291 187728 -187529 -50153 -221925 -123873 9435 169459 -34390
19033 181149 -325529 5800 -181837 -107728 208110 4918 278692 242907 211197 -47330 -62655
19022 -62655 -12659 -104834 -64828 -88189 -104371 -139216 -100225 -102561 -48743 -45876 52870 40020
19010 40020 302052 -119467 -25023 -59177 -58990 45855 -158004 -382825 -326405 -84433 24407
18998 93932 54097 188890 24915 -63721 -135700 -52104 181040 -82321 69016 198392 54857
18986 26215 -18065 -75243 -89954 133063 74704 -20258 181480 -26809 -385795 47555 190864
18975 190864 -63475 -16258 -11012 -186205 83213 179018 -205913 94785 -420228 -6011 -162160
18964 -162160 -44793 -120333 26624 74260 231936 345480 -7556 409801 94819 109465 -38121
18952 -262514 -86947 -87388 -134328 -98365 -233070 -135121 -203538 282110 -36573 -207795 98940
18940 146581 122814 -270885 -24525 -276302 243685 -3387 -197468 -392571 -249810 -35148
18929 112172 268333 320493 -82789 -11524 46214 -23463 -300978 17000 76055 -361688 86143
18917 -162518 92319 106749 -19351 -190165 -17771 238123 171497 -373390 -39153 354116 -217379
18905 -381658 13474 119213 90167 216326 -83003 -321158 288523 -116054 -87626 -234209
18895 -234209 156923 387 124615 -27211 -20329 6670 -4740 -32208 -181491 -91672 -130559 -185447
18883 -185447 344265 12536 -25944 13141 223918 31692 -27223 58987 -295632 -246905 193659
18871 15527 -130765 205697 16640 212392 -214021 -264809 -302935 -16328 171828 -111248
18860 -289723 273281 226357 -95715 193038 -156909 35353 -24358 151095 80274 -143112
18849 25950 -237966 174963 -42838 -251489 4165 -427332 303373 -213075 -279713 85413 -7675
18837 -231889 -178645 -276714 30882 -196267 -166657 -48277 -184370 -239411 -150516 -99288 77350
18825 19399 -104735 -254475 -58865 -165014 114499 301911 -176421 43482 -47685 -17442
18814 -93261 6520 126304 -85576 361698 -449 -62817 -90926 -318303 -27153 26593 295810
18803 295810 30289 -134624 6074 -157039 232989 -21442 -210760 -77395 -291638 -7210 55776
18791 81896 25579 -323927 156894 -216541 -276735 291924 -329143 116907 23457 68148
18781 68148 21008 187621 62882 449965 -254925 -117641 81573 180468 104154 -91940 -109659
18770 -109659 -17386 52343 274927 -113962 60137 -13277 -144043 116871 -275101 29622
18759 -102974 -224313 -384599 112013 56659 113337 186576 -134468 -241861 -132644 136031
18748 197340 75035 -38805 76528 333122 -64762 -179337 -12381 29303 -620210 154904 148639
18737 148639 257484 -162960 64190 -170184 238589 -94014 -15952 -93240 -328715 -233056
18727 -233056 -407556 -94455 42735 251315 1527 -327008 -81509 -70138 -30004 99616 95595
18716 95595 22610 136620 -21188 -347422 -243160 -40658 -227432 -40570 142995 -135371
18705 -216337 -242801 105101 -15966 8268 166253 371326 -7101 45907 -120416 67478 -66538
18693 -98194 -60547 -2528 -229445 31155 -289998 -165366 -268452 -531803 -267005 30148 -209098
18681 112943 89609 -317760 32267 -92845 -67553 107513 127254 -117845 -110459 -470589 -150285
18669 104282 -25230 -55370 -15989 -56187 193926 -394270 175679 -216007 -184550 118344
18658 -73018 31468 -197420 -69630 130142 95693 204600 -331072 -376164 -121793 -98931 3797
18646 -54626 65802 65496 54742 -265244 211202 -148443 360891 -58111 -153189 165097 -106620
18634 144846 122532 47370 -9094 58048 -126931 -9476 -230248 -9873 -61527 -140879 -7304 282295
18621 49558 24504 212603 -94069 79961 -136233 -348341 24313 24943 -395145 -17088 -159173
18610 -159173 -166476 78284 -103209 -8479 6952 -149010 -230696 119966 124001 10442 -361476
18598 -26575 -154170 136053 -327779 160581 -151450 23906 -224229 44512 162959 -31787
18587 -47021 -68723 -190642 -44239 -207599 -252012 12943 39965 396732 -336778 140564 16641
18575 -95809 83424 96060 23849 65235 -138935 72592 15034 330934 23056 -123906 -70756
18564 -70756 -132281 -194136 -44955 -123208 -89733 -7466 84851 -308746 -86421 141397 197169
18553 197169 39048 184942 -36060 96192 -260781 -259161 -122133 -298209 -448502 -35349 -182044
18542 -182044 -110716 -141408 -109321 20592 34065 112626 -81854 28866 -62405 -215005 36061
18530 24509 37493 86011 -56938 -138442 307260 -300904 -247177 -261546 118523 101589 58255
18519 58255 -357761 -152279 54395 -38962 -136704 81927 230606 -97784 132163 20393 153676
18508 153676 -262251 27224 48093 45980 372435 268328 -169922 80781 -321128 -431987
18498 -431987 118238 -195067 199801 -281719 156513 -40563 52612 204957 -11214 -205770
18488 -205770 -32119 -26443 71483 101582 155757 57023 163835 -16636 103436 5243 62208
18477 62208 -280934 26093 208022 -166045 -81471 -31564 -24589 226181 277799 7549 -176406
18465 -115569 62567 -223742 -183800 80690 -316684 -174110 89349 84015 -259739 -148774 -121685
18454 -121685 111437 190642 74838 -83169 146291 -6441 16323 -278811 -104239 -51261 -256482
18443 -256482 -1235 -199102 -83028 -95782 -195934 134172 -267424 2342 -37006 10544 121384
18432 121384 -144141 -97738 169580 -180956 -297134 34513 -79900 -374086 84621 166687
18422 166687 -207833 -66785 127547 138986 -61988 132562 -151922 -24868 -180805 -285952
18412 -285952 11559 54013 -187705 99327 140197 76106 168263 -272617 18611 -204227 156737
18400 -20386 -63384 -144159 113811 -27993 -152292 -388352 -241880 -241985 121021 -578 -302415
18389 -302415 179413 98305 -17427 -252564 280651 -29197 -16437 -133150 3378 -29516 320936
18377 -147275 -45180 83962 -36932 134522 72227 -44686 -229017 -39147 -102907 65748 -156396
18365 -116226 -390522 138499 193340 -176582 268248 -88419 -246694 174479 312118 14712
18354 333146 122218 694 -23809 -181631 -100434 133488 -185374 -115964 -173486 -190200 -58374
18342 -142746 319544 -150974 -76559 99900 72441 75780 -304325 265479 179755 -27230 238137
18330 -216086 -43699 -493521 1391 -529635 246828 -96804 170928 -158914 -164192 -313786 128571
18318 -122751 230776 -63919 -33115 -1095 168 -240146 -98274 43695 150009 98091 -8756 364088
18305 -174642 328508 -91074 97619 -202252 -89763 96625 150772 -427808 36756 -112669 148039
18293 -248362 -50851 -70437 22169 -223477 197565 -30028 -59288 -72421 -84658 -217002 -21733
18281 231062 51609 -65610 -217492 12324 -386581 40525 -140068 -309362 52476 217688
18271 217688 -79339 -81242 -283420 -1529 61084 60726 -168865 122073 122315 74653 -213331 -9088
18258 -320504 -130097 131568 55722 -372229 51375 -178109 -215855 -26814 -123422 184023
18247 35035 329744 173855 61539 -262041 -270899 -138776 -109323 19918 211436 -109111 -175926
18236 -175926 -10372 -8309 -312659 -102080 -92584 389977 -31868 97381 -273638 54488 -127117
18224 165684 130525 -327029 10713 -438777 -181784 -74847 23879 -41719 -263321 -95306 -99912
18213 -99912 -106 -64080 -106861 64089 -222599 26987 -140411 180967 -67675 139050 34741
18201 94267 -81185 115540 -138265 47003 -36964 -365760 4899 -118369 55396 68889 -23701
18189 -375428 -71207 46431 91278 -49257 -92365 -288203 -153179 -255601 366449 78200 -302387
18177 275473 -512860 285884 4412 44769 -154728 -208287 -277817 144204 -56766 -61634 34183
18165 -26154 -82065 223607 15140 124685 -226728 46657 -13764 38292 -269301 274277 5846
18153 -74086 76328 -117619 171601 -155965 -46839 2267 26907 -10164 -35154 35461 -82818
18141 -60406 -161837 -100758 33905 -156416 80804 161051 192672 -16316 -69530 -74300 124591
18129 209285 -277330 342021 -154667 -184660 10451 47545 124606 -161794 -192069 5799 223904
18118 223904 -60424 48197 -147275 65013 -439748 232907 -107393 161077 -275171 84312
18107 -79976 -6781 69365 -341075 -60517 109907 150939 -8185 -148771 -275932 19995 84412
18096 84412 151395 132890 105298 -74238 -275092 143640 351183 152031 86568 199936 40293
18084 -185980 -174858 61580 37672 313686 -165394 -348546 -103659 13620 -83734 201169
18073 -60318 204535 52664 -106594 6867 121481 155907 192097 -190184 250496 -179431 -43112
18061 104560 -168771 92899 25980 -23122 -146757 -62043 -32380 -234912 -82817 -211333 -118625
18050 -118625 -191101 -56805 54935 -104576 -264662 -43957 -194685 -27195 373724 -78189 139865
18038 -88084 -111008 442809 -85565 84481 -312970 -110114 -27624 113557 -314127 369268
18027 146779 -176243 -107698 -146077 114229 3914 61369 -73900 205897 -193533 -92765 81034
18015 -101827 -60135 -110068 215450 64527 179468 107097 -2324 41505 142887 142645 -46205
18003 -29039 131323 255069 175117 -45404 166924 -76891 200815 -106700 59496 45938 48575
17992 48575 -125900 71792 1889 20862 -81163 -77276 -59506 257091 -201775 157514 -155978
17980 107172 340115 -35248 -93708 -212022 -97840 39537 178939 139031 156039 -238263 -48358
17968 -252101 83397 -29409 28591 58656 -147724 54018 -357824 73031 81489 8775 -154855
17956 -152968 -121695 83508 68903 -225661 44488 103749 404395 350510 23386 -190177 20977
17944 -64391 -92620 385777 -7711 -405212 -417854 192659 55406 -143232 -275050 164867 122153
17933 122153 78601 320714 -94068 425377 38344 45171 -145935 -110282 -106124 -52807 -4921
17921 -263178 83802 -179917 -147030 -98300 202947 145091 61804 20300 30887 52906 -228851
17909 68849 -249622 -211637 -32891 -98477 -131243 53299 16456 -382046 -77142 -139630 -332530
17898 -332530 -199001 -139360 -305556 -192523 -164748 -94772 -190933 -82716 16890 50637 4332
17886 209106 -275996 -164333 60733 138058 -90451 -161839 -54405 83989 -126744 389989 4900
17874 67951 239542 -248555 310435 -201340 -194687 229532 8568 -298131 -204512 106859 -157952
17862 267445 49016 23454 -78829 -120940 -51385 266220 34349 -269091 95427 63114 -12298
17850 -100954 271450 8397 -16339 -221358 -130693 -65193 -84066 -16759 -57059 240443 298526
17839 298526 -224264 -215155 -100654 137832 -25079 -77299 -300701 -153289 -315605 -90266
17828 -75853 -27350 -19231 289658 -89400 256823 64764 21324 169645 66908 -272322 101276
17816 171084 -50143 285245 135093 -271970 -463654 -93102 130113 -98999 -66989 -796 4489
17804 -80963 50430 -64321 -71360 -161791 63008 249847 -102632 -336789 -126026 182194 112759
17793 112759 44048 82015 -346237 -15446 -153886 102786 14306 43478 60688 45946 -224139
17781 135308 -112342 -446040 -76814 -106024 -189278 -73897 -139268 -47223 234465 -56964 -74475
17770 -74475 90830 -13472 121057 227935 101875 -55557 236454 24521 4922 -121161 -113249
17759 -113249 105438 -110155 229798 -251950 52700 -36448 159253 65096 5333 19740 -125170
17747 -168599 123390 -12472 11751 36462 -231493 134104 -222871 135248 -387928 15919
17736 507464 108877 -299310 -5635 29437 61691 105752 -15055 -121338 222824 100771 50278
17724 -78236 269712 -94387 -108664 92975 125612 -129303 473936 127056 77234 285007 38724
17712 234835 207252 -42577 208131 165084 138009 -88292 -27002 -242220 -53943 138100 2304
17700 170929 259839 255415 -57480 -182388 128531 129646 -358916 -12439 225089 445358 159276
17688 60190 -53206 13248 -94586 18285 -64205 -20265 -200527 -36630 260179 -18115 393510
17676 -132342 -305267 -35452 310328 -48524 435007 50024 262992 -106705 -91543 -162363
17666 -162363 361530 126978 -61663 112767 260970 344040 -138990 239972 -148444 -86057
17656 -86057 146579 34293 47719 -154733 -3505 -199274 120799 -93710 186353 342877 196208
17645 196208 299817 -77337 30854 201695 51891 43555 -60338 118276 68272 348658 -177628
17633 -84980 517749 343883 33893 77564 -53562 103554 28280 609353 -231730 45664 165248
17622 165248 -89822 -263978 -112033 -51615 273343 -45967 -122733 29495 284265 -1434 327031
17610 -248501 -148447 80043 24460 -202119 -137216 -141404 387197 206023 160251 -6894 -240840
17599 -240840 182818 -281484 -184115 -108616 163316 271710 93391 184709 906 82885 360058
17588 360058 -133983 -123246 -166880 93110 193659 -223651 -67287 35516 -36439 -157370 258267
17576 74097 -115159 -48944 86174 238765 -116941 115941 -100165 171562 -227017 -186115
17566 -186115 -66548 -33905 -196134 2502 152720 -162122 139481 -34583 231958 -117146
17555 254504 370688 215727 -119620 -343303 183435 10659 297888 121271 293059 34451
17544 38636 216113 -407103 73703 343830 58593 349506 135195 64038 264128 54446
17533 211835 -59103 -58125 117945 378399 24224 169925 -10221 288046 164393 41444 229216
17522 229216 139145 80370 -80371 248333 5286 -42967 196551 340786 111293 367726 185971
17511 185971 -93566 190820 31414 282199 122884 32650 -15292 125239 336728 -33215
17500 75866 314192 -132530 91067 -67391 270319 139628 145717 69589 -253223 311090 123307
17488 -210160 272799 276215 101370 -187859 40783 -30679 416715 47381 242716 -41625 77907
17476 134602 124119 79070 188130 143381 -59569 327167 153373 27030 -131386 17771 -283331
17464 405746 124399 205606 190254 -175555 171085 -211339 -87088 -12811 300530 232292
17454 232292 187553 34907 363064 396534 287178 442446 195636 340340 395309 110009
17443 524396 -36683 240887 518300 -3654 465651 286873 301202 135934 143763 67540 119663
17432 119663 40404 32131 52356 112644 164737 54619 316774 324058 516818 562257 -84474
17420 201038 261511 82840 315617 281083 48115 155156 -372321 488314 166433 367987
17410 367987 230889 57701 119936 39055 196074 19744 69057 126968 420158 289088 181499
17399 181499 109755 351945 47849 159519 157509 184398 141032 -38865 -203623 558969 -63504
17387 5 -24013 -154701 278286 121604 99492 282627 232689 464767 -45789 -15237 369331
17375 -188521 -131602 -23552 307935 265520 11481 138749 -72199 180663 475194 -22831 404297
17363 -85947 80988 219320 322428 18914 -22307 446270 -142448 152735 328848 71092
17352 308071 60059 323418 264958 -72068 135326 164375 -195655 448917 374454 73523 125619
17341 125619 368618 412519 108562 61235 216995 257651 112674 187502 41408 372626
17331 372626 112740 111570 73890 72375 205095 382433 242177 -134479 193261 97100 297422
17320 297422 6333 91706 341743 492381 212222 76557 168404 99763 -116906 136124 178906
17309 178906 250746 121054 -95743 76937 399206 254813 227355 159853 211081 -29819 51819
17297 -70210 151826 397338 66868 50985 63241 203207 340290 300472 188505 163713 291321
17286 291321 426773 336744 -76829 -135863 275255 310596 420496 280838 401577 72171
17275 143874 111433 394053 446760 30138 264787 283495 74225 308308 205892 229383 187800
17264 187800 -33525 366794 415936 154527 473860 340585 288450 374433 181753 85844
17253 359709 -3421 165354 185456 189194 366186 194361 225582 56682 561881 277095 371711
17242 371711 112905 231794 208040 373140 -81195 270039 -40926 284161 280628 37858 -22078
17230 345100 317277 99611 175300 351083 230667 192115 421984 52469 219988 417000
17220 417000 428858 202042 483016 89612 318060 -28827 311987 245025 -8700 306366 512808
17209 512808 294496 255964 540597 249836 126717 127035 449475 271611 79856 646987
17199 646987 313330 455133 371215 108214 130805 478414 82541 85373 604245 408542
17189 408542 59739 467705 389795 238676 460911 507718 517742 350296 410634 473726 342561
17178 342561 -8829 400509 505964 381095 284043 377559 445892 282791 313455 526528 336985
17167 336985 483153 320881 410679 414088 596521 230449 277878 135763 250335 483140
17157 483140 475521 299067 280944 483000 32558 300942 318483 142216 531942 195875
17146 84133 354098 482410 175295 448277 215338 321211 566060 289108 620034 436343
17136 436343 521612 116252 382234 247971 283828 460249 426391 667217 333289 612625
17126 612625 304502 616163 289511 265779 400776 449186 713185 242297 397010 505645
17116 505645 369218 520362 564320 292001 137524 730707 652335 383126 506450 199291
17105 248097 375344 389744 428538 491617 136227 471644 226317 343373 325227 342646
17095 342646 315088 592624 519400 480087 529390 678533 714070 362080 418808 325577 601646
17084 601646 701983 523911 523048 593159 640353 584870 60448 334695 537454 402302 418082
17073 418082 602403 715725 511230 452817 502378 590454 305988 613145 602939 823211
17063 823211 703558 797779 530288 723343 867544 596233 472324 560605 554402 716281
17053 716281 723881 161548 491551 528313 596687 360769 431216 544283 461563 607307 867992
17042 867992 595776 474149 643976 742878 594394 704519 363656 518591 935858 662136
17032 662136 684480 590092 635563 663825 487114 810053 514950 611818 339147 660796
17022 660796 618778 595701 852195 568469 651417 743374 576184 717694 883694 894326
17012 894326 599878 888138 920955 948645 757501 816637 835478 714917 629070 1372206
17002 1372206 950859 1117051 850026 845215 704419 858322 1053193 585691 882802 974060
16992 974060 1139004 926874 618636 863854 809521 956862 953467 1130731 1058176 1049233 1423914
16981 1423914 802449 757395 814698 891720 1146655 1156448 813386 1055302 1282376 916993
16971 916993 1265731 992643 972954 943247 779602 1151785 1167498 1030342 1229396 1104981
16961 1104981 1106963 1323094 1154873 1193902 1272890 1305849 1207745 1405120 1001094 1331940
16951 1331940 1503606 1268476 1526598 1497717 1365922 1446062 1350974 1475503 1454553 1251908
16941 1251908 1636645 1162931 1396593 1278119 1190876 1391796 1111010 1537630 1538577 1170320
16931 1170320 1733349 1682498 1261694 1531360 1801296 1569257 1490883 1536994 1696322 1807476
16921 1807476 1779746 1455336 1583054 1198057 1703707 1754995 1929341 1453360 2074595 1471333
16911 1471333 1803115 1979373 1731538 2104686 1755750 2068933 1827141 1591728 2150101
16902 2150101 1698707 1945480 1810310 2032519 2137671 2142235 2080834 2102526 1853595 2257335
16892 2257335 1906034 2382417 1928921 2471697 2353252 1995777 2213644 2164524 2120123 2447437
16882 2447437 2322207 2419448 2240191 2524572 2357495 2633511 2699132 2586121 2757186 2684945
16872 2684945 2644417 2393048 2847070 2678171 2719616 2891936 2987064 2735241 2529546 2966316
16862 2966316 3322961 3304243 2853964 3284881 3067626 3063940 3322455 3502426 3151311 3126156
16852 3126156 3376848 3264855 3553808 3877110 3540498 3411420 3753855 3701415 3482297 3810483
16842 3810483 3816398 4166965 3921798 4172510 3940030 4190751 4098885 4002200 4154116 4625697
16832 4625697 4525665 4717588 4684652 4678199 4849005 4857752 5058746 4902535 5254894 5438636
16822 5438636 5312669 5264027 5359805 5324632 5972078 5480263 5824254 5995966 6142106 6086492
16812 6086492 6188031 6340111 6344413 6549152 6883500 7047609 6941583 7413873 7625551 7475521
16802 7475521 7587106 8050599 7711264 7934424 8170774 8319721 8508112 8603380 8935199 8978983
16792 8978983 9431948 9725223 9938336 10039740 10615742 10620144 10646198 10920650 11218840 11668044
16782 11668044 11653905 12047274 12432235 12910758 13354109 13731823 13963432 14501427 15148643
16773 15148643 15264015 15877200 16184344 16825970 17174466 17798416 18633357 19051141 19624684
16764 19624684 20648979 21112791 21849322 23035471 23611731 24297855 25562690 26230317 27645990
16755 27645990 28664680 29818557 30828252 32402807 33599912 35284250 36565650 38530378
16747 38530378 40427972 41758770 44172502 46466520 48746370 51026856 54178538 56783828
16739 56783828 59913015 63370783 66534794 70198978 74342748 78796603 83491366 88390258
16731 88390258 93480638 99094983 105135918 110699547 117448757 124207612 131271274 138004115
16723 138004115 144931136 151602607 158796014 164437696 169689538 174275269 177872519 180011340
16715 180011340 181379921 181490022 179915630 176992695 173477950 168886939 163329657 156845467
16707 156845467 150565398 143430709 136343018 129464702 122630296 115493178 108672111 102422720
16699 102422720 96412593 90606290 85384325 80188337 74880905 70857810 66478833 62926631
16691 62926631 59086050 55756877 52398458 49670722 46978841 44025633 41926043 39771386
16683 39771386 37484885 35688436 33889127 32634853 30935058 29415270 28024914 27033219
16675 27033219 25599979 24362505 23322596 22259567 21486244 20610972 19731084 19190957 18243460
16666 18243460 17653964 16723694 16415995 15951168 15033153 14723275 13885461 13623654 13386551
16657 13386551 12858839 12146840 12062736 11705321 11162807 10703973 10899898 10227367 9940371
16648 9940371 9708885 9489647 8965450 9132369 8830391 8287584 8173954 7811379 7462960
16639 7462960 7380479 7619090 7159801 7088467 6749621 6519131 6455707 6434669 5787531 6420457
16629 6420457 5832951 5719196 5831830 5651411 5448546 5387034 5051778 4782383 4999784 4468773
16619 4468773 4537120 4403217 4434597 4413457 4296490 4293142 4176020 4147224 4055033 3731380 3673115
16608 3673115 3503758 3581407 3613848 3492995 3126241 3243181 3476965 3187990 3060417 3086975
16598 3086975 2901530 2985182 3039210 2696697 2732431 2633204 2789336 2594126 2412927 2577957
16588 2577957 2566275 2551176 2344062 2523069 2324805 2084986 2503454 2073469 2305739 2512888
16578 2512888 2373721 2040632 2287437 1652562 2315007 2132364 2210646 2040317 2066868 1842712
16568 1842712 1834729 1631266 2002887 1621181 1492419 1661839 1830207 1635449 1428130 1621990
16558 1621990 1620747 1881086 1256020 1651141 1547496 1453927 1215868 1611983 1358214 1462855
16548 1462855 1495141 1235695 1395998 1489399 1210531 1562703 1330547 1415372 1268030 1344082
16538 1344082 1006762 1131275 1158912 1010810 927772 905171 1321842 1517908 932094 1027349
16528 1027349 957707 1089229 1003969 863509 946241 807724 1047859 925982 1035799 1183365
16518 1183365 1100479 1172936 759061 933032 1150429 1100556 790591 836191 1023768 892262
16508 892262 660674 786921 902615 1279725 639625 1100696 805548 612147 987042 714994
16498 714994 602542 703888 870228 638023 814355 641549 1010382 651420 677869 882160
16488 882160 563249 534097 814759 822161 550684 517529 599055 701152 858096 614529
16478 614529 517701 979411 1155935 822984 515000 376465 735995 535900 664550 668310
16468 668310 441861 407653 445906 571039 345342 531381 606691 363402 49357 175189
16458 175189 386911 531858 628613 466035 547294 592601 586349 556469 804675 410174 664992
16447 664992 322920 560337 400280 357884 646397 426022 370256 504569 453531 522712
16437 522712 231131 481561 755289 317919 642887 296692 342464 184407 373699 334487
16427 334487 572626 436592 391505 205510 239979 158518 383345 181263 264741 159084
16417 159084 -87157 296874 581472 304892 -67020 594908 350922 -44425 340995 449093
16407 449093 40031 363138 287390 483179 238014 416525 20654 -182890 177777 58053
16396 160943 795052 317885 332282 385898 311434 259304 -9711 96627 527892 166574 423377
16385 423377 95478 334919 196674 265203 238059 418062 281097 218337 130034 166039 248614
16374 248614 323832 456047 298541 293188 267409 143340 54076 497439 -130231 246661
16363 470889 100689 204938 286871 451556 197922 70825 66490 -53314 57980 188693 168244
16352 168244 287323 233086 441066 446967 214330 308491 288582 -5919 117839 9662 -70805
16340 -33527 -61223 101075 358090 303517 111263 232778 187013 -130150 120235 301537
16330 301537 208426 -22754 334063 279419 30867 107903 259737 -29139 246776 132149 141454
16319 141454 19719 -146814 397629 -169754 26074 385466 4599 164060 -137833 190591
16308 -125598 175544 52282 171769 -52978 169901 278409 258715 -58147 62840 133929 156844
16297 156844 89219 -110048 120714 -54424 -5312 337067 359419 244366 333049 47175 195542
16286 195542 255379 139490 235450 312251 61697 316647 233508 15405 198184 72140 42256
16275 42256 69716 70338 205857 16678 135794 373126 142693 72119 260626 315561 167341
16264 167341 39955 -75655 67691 76676 86246 185178 76663 -66109 -13944 -22629 -88128 156506
16251 76499 206508 202218 93568 125371 163607 -350885 78586 216129 -18219 142311 177705
16240 177705 -12808 -77616 -14250 140953 -273416 19142 1822 110382 -107070 -209649 -297976
16229 -297976 -384721 246607 4808 -166668 22691 -108240 -65722 93651 217058 82993 -59572
16217 464854 -303912 -12681 280498 -347400 21339 6318 119311 -27819 -64925 -107904 407761
16205 -79690 -165286 -82083 244124 321370 -19366 288005 -108929 243896 19975 -273889 234896
16193 113690 84454 169228 156833 -315270 -77856 7384 369398 -95392 131506 -156615 85914
16181 22203 210430 13712 -169442 31567 -259249 -59536 1761 17551 -148631 230133 -55773
16169 -87486 -17723 -231062 268967 174400 -154627 -68475 -22783 79905 73182 -63611 -140316
16158 -140316 -137005 504794 187659 6416 39922 269036 -210504 323532 -18515 -16608 96800
16146 -127163 299785 -17255 -232651 29199 -46143 -85447 -113084 152057 -31373 93095 122846
16135 122846 194675 10757 -144497 -211087 -91247 -60203 -75454 -142583 -160293 126160 160259
16124 160259 108426 59193 12057 -202414 36507 85992 -69750 120964 93360 21048 25986
16113 25986 17466 117224 13998 354306 21435 -113931 32091 128215 47674 230275 203941
16102 203941 122791 191797 -12675 56960 -37725 -275706 84696 -146103 -141306 -9970 112297
16090 187101 -275044 -107548 -53952 58243 70155 -107119 -163306 12135 240201 5146 270707
16079 270707 58051 312643 -188171 61129 164083 548872 -219864 -77279 -56145 -72400
16069 -72400 327141 -200231 -280245 75109 43532 -161652 -10799 -126517 105662 295825
16059 295825 77969 -20504 105295 71844 -53569 -260900 -8189 -13558 -217845 7738 -89550
16047 -3787 -204999 -391841 26842 -106807 -139986 2164 11802 -42940 92012 -65288 -239039
16036 -239039 352911 -88741 -102274 265038 -246879 -162331 -42838 166544 -82535 147284
16025 52511 228874 35876 -3791 -128217 -145350 148047 -25060 -191288 8004 66938 -15099
16013 -21292 184734 228347 38121 25868 -167012 112343 -447833 198718 195711 -60597 180242
16001 -58936 371522 -90908 -187262 59008 -27023 -166660 -223684 221025 -70694 -170446 165245
15989 83936 -207767 156238 121286 -6668 -987 -212190 219985 -29711 249614 230114 44977
15977 5008 -28653 -11952 -85112 -188206 -238161 303280 1945 22380 -117277 -86562 -278763
15966 -278763 -244977 152482 20943 -30958 -125478 -122406 -3925 -154318 13424 -407250 -28804
15954 130900 138531 186820 -126153 -271144 -199815 -162243 -441057 -117969 36270 -30250 110652
15942 56430 87572 -13172 -108087 -53780 8494 -155417 -67111 114428 30787 47238 230064
15931 230064 47631 361716 117518 -59448 -290703 406392 133092 -178591 14774 3608
15920 133612 17671 -192270 -65549 24298 -74692 -58671 -393573 -10138 72718 -127664 76389
15908 -298316 -84842 95920 -91038 -303624 -87856 -85191 -206353 135674 263586 -66170 5187
15896 23231 204306 3460 -82444 172499 30900 -243155 223942 191141 108192 62289 140332
15885 140332 -3527 1896 -62761 78616 -171492 -344399 -152862 -137345 -175792 149737 -233098
15873 -192643 -64506 -3261 -130245 151432 -163394 -75365 -4172 -229168 -100967 -39987 307039
15861 -135730 209722 -123328 223150 331473 183782 114892 142132 -73450 -38724 164016
15850 406385 -62147 -183043 29699 -179921 76784 -229025 -22508 -30993 20481 20713 -136652
15838 -71694 210797 -166734 -243124 233432 95302 -226822 -298253 -96762 361554 -54864 5163
15826 6789 -127900 11296 -182496 -231604 230039 13305 40239 -95691 -149391 -106348 -35827
15814 -185443 -262918 -140424 -77271 129289 80568 -235037 -218201 -250773 201092 88425 94890
15803 94890 5178 -132780 78934 -23030 -227806 167817 -255675 108431 -84991 -52455 166027
15791 78495 125194 150876 -86185 -245366 -169729 72524 175477 72496 -291420 -156074 208916
15779 232035 -47123 131319 -343702 -56055 -46346 74010 63035 -146147 -18813 -90114 218982
15767 -236540 -114955 -7597 161312 -6889 -173156 182306 -187605 78237 -114272 149010
15756 50403 -68942 216232 154083 44299 158413 166585 -178941 145395 138382 51151 85622
15745 85622 172785 -319953 -405950 108241 63225 -183750 -314873 -3712 121601 -207499 -9809
15733 109811 72191 -147738 -149586 283192 -180105 -26227 -56007 -203169 45128 136570 240798
15722 240798 -126132 3911 -209991 73551 -157892 -183244 44661 -79739 -15558 6343 6808 -426434
15709 231072 20163 -70050 69803 -426275 -7230 -31706 270389 -9873 -160149 -21160 106684
15697 -127263 -178416 -183509 76232 -85216 174246 37042 15204 327981 3129 -9700 -239914
15686 -239914 -183772 -164897 112475 155641 501180 126358 33951 -102187 -126260 -216842 411421
15674 -147665 -111831 256011 213827 -159306 133247 -358859 18506 326767 102151 21233
15663 -234480 70157 -204968 10019 248273 -185262 -203594 -231176 -56003 -43938 -15704 143056
15651 -166969 -10522 -27294 1370 -60328 -319547 65477 57174 -139620 151530 -384978 87785
15639 -86712 297986 -166827 -89105 -69416 28605 113039 145340 -115359 -261431 152139 -250581
15627 73693 165 -16423 -27337 -47896 76106 38349 3128 67467 17864 189842 -56197 -154958
15615 -154958 120701 102838 228512 -237346 190448 45572 -388784 414490 21229 95487
15605 95487 -67702 12465 -23745 503 104441 -81115 -215710 -107312 -319178 85232 92314
15594 92314 92288 27029 309944 -201094 -81217 -70439 159250 -84507 57974 -111225 20518
15582 100295 62707 180407 364655 71080 -95737 76349 -17451 165655 239056 122273 21623
15570 -161264 -213224 102166 -82552 208592 -158661 -127425 -142333 197140 46785 190085
15560 190085 -166550 70281 -149206 9438 -277369 36864 57455 -281847 -231398 -236815 -42928
15548 -68643 -145547 -43126 -25263 -56158 -199888 -220772 104556 -58483 -21848 330056 -60776
15536 35903 -112911 45338 -205419 58512 9612 28702 175747 -100437 -66059 100692 -100808
15524 351174 28616 -227141 -88108 49754 18956 142029 -118374 -72300 -60082 -2583 34316
15512 149116 -160372 -42877 91616 -172919 101160 -5895 140142 185259 201814 158060 -24582
15500 207754 77467 -203924 -169614 -533991 -2217 81981 97831 -129674 89509 131377 -99503
15488 -291562 131088 -188578 -130788 171993 -113884 254095 237037 167693 77750 -175844
15477 85112 18852 -115045 -137192 36247 282767 229676 -294828 25183 -221337 137062 -113638
15465 -456261 10061 246628 -35541 267650 -111478 -200075 210876 -14085 -54159 344144
15454 170496 313607 -162681 -74949 130749 84940 97847 83172 370618 110070 -179075
15443 50565 19311 203921 54937 -6182 -3293 76690 230630 50332 -158536 104360 -207560
15431 69583 153762 -31799 -185252 145159 -159658 246593 138061 78795 -184324 -52866
15420 172984 -98178 185588 305021 274161 -167753 62684 -145227 191934 -84735 -282117
15410 -282117 -43610 -248628 -71593 537948 53198 139542 23757 -277263 224374 327677
15400 327677 251864 283612 -265889 105368 176336 134378 203554 -187611 155038 -137254
15389 -47332 136375 103530 -130074 381477 245268 9704 135671 69479 100734 -14782 62084
15377 -60354 257345 108562 -123849 99441 -75588 326950 197499 76643 -27041 337858
15366 3071 -98634 195073 40622 157592 -14365 139028 -103824 -294723 -107356 106998
15355 48101 -124442 72075 -47231 58611 95239 -20185 422324 -65181 -89091 254234 -125599
15343 45127 73092 117442 -188814 99770 -189683 543932 -32060 43202 -64832 8137 114421
15332 114421 32019 -41357 218493 -337328 413142 171302 200741 193140 -133041 96589 -45322
15320 -163415 141562 360054 205571 141221 23762 251183 91506 413270 -28889 398956
15309 25251 89515 286163 -168520 -150743 295097 -150075 -157001 305132 174796 27984 -216557
15297 190542 -34356 163144 106958 136459 154067 134853 314345 107605 96237 96082 137990
15286 137990 -158127 30467 -82194 84575 85003 60557 74203 -115031 -135144 -107257 150427
15274 185440 70369 127531 65236 20894 233962 -54040 407448 10687 -113337 -15761 285389
15262 -103730 152297 316058 -161740 460158 346080 144319 -184333 74068 61749 464889
15252 464889 23522 -74212 257215 1028967 889970 1094098 1310420 984262 383396 490882
15242 490882 83624 293322 72400 366893 461693 -25902 423100 423794 43753 73447 239544
15231 239544 209331 226350 356850 353193 479387 145082 187730 199173 -144911 77276 156291
15220 156291 -27290 -66140 -9648 -149405 152918 -263742 36467 36392 139047 157349 -10657
15208 148589 155417 88291 35992 274325 119556 162489 297628 218401 116908 73677 286796
15197 286796 182334 159514 281937 122960 77587 9558 -290788 484992 53787 259291
15187 259291 127901 -7104 305510 285969 197278 -101426 41700 -87532 192092 102790 211942
15176 211942 -125641 376767 -67712 235527 -41854 -2295 -88128 -82010 44990 199218 -325179
15164 86368 636092 -1381 144889 -146679 25612 244614 369026 97903 -249157 254610
15153 142884 -21446 333400 177291 220293 -29915 483906 223472 92871 497629 -53323
15142 130927 -53229 99030 12076 288449 -85070 -122484 316656 1954 305159 352525 71119
15130 94853 138041 131236 -8075 180691 182580 37468 139570 541096 241612 416727 184878
15118 160615 50484 328709 172551 -260323 296267 -250664 258889 -69108 305014 554188
15108 554188 -345 138261 -61333 2636 237268 377365 148568 180191 255010 75924 168956
15097 168956 72628 233746 281539 49879 203321 273290 205359 -37045 135052 199212 367597
15086 367597 212040 395462 216287 -20664 241857 144390 392028 61201 555401 -142479
15075 329959 256771 201478 367749 120492 146574 145709 -105095 347021 171523 263457 354043
15064 354043 21421 58008 1914 317176 8478 317154 -19472 347778 99374 399206 9152
15052 60943 38212 575 215124 213743 47627 343906 476639 360661 108139 238861 259960
15041 259960 166633 455463 514732 260374 322239 303957 98758 191401 80919 110778 522569
15030 522569 110717 394211 299790 388043 593900 324293 462233 172661 335385 181096
15020 181096 147777 85209 305534 181898 146610 277135 72429 387872 154191 385766
15010 385766 438253 -167869 398048 100272 185799 191781 292405 163325 294837 486399
15000 486399 253860 601440 431205 262872 242337 246755 188181 -26675 561512 322668
14990 322668 294020 416427 164002 493509 41448 16315 224409 153296 164268 379330
14980 379330 295044 332452 -21696 352930 358883 301306 291906 278358 240290 333877 252355 393762
14968 393762 488970 346024 295358 655364 280466 155425 130555 158899 247030 145714
14958 145714 261159 345883 381747 99314 297749 498328 115378 155936 486899 288614
14948 288614 149808 269246 480578 414621 198205 226856 434554 380653 509971 307206
14938 307206 39941 292073 704075 289062 383921 242526 264693 257896 570103 505700 334518
14927 334518 419372 556983 534770 410099 318353 596152 411883 294144 579297 450141
14917 450141 457010 472809 291237 547977 42278 254157 273351 486524 290367 149868
14907 149868 13486 530365 459768 691104 556350 416982 361010 514082 381106 422409
14897 422409 416103 362846 603858 356815 525978 546201 545903 618722 735135 273349 606561
14886 606561 379513 371630 410118 416983 507640 901663 346596 486606 316102 872599 729591
14875 729591 512358 976864 504266 618559 591265 536697 552303 528137 659862 561093
14865 561093 819553 750912 389752 268110 628467 563852 490941 492960 477613 697988 477060
14854 477060 690079 447671 328535 471488 698680 395909 483378 188605 251585 276979
14844 276979 518574 693459 276747 435526 528044 654846 469683 665074 227379 613920
14834 613920 640926 503957 517260 438766 976686 746878 519189 203657 607239 391331
14824 391331 477510 485756 510856 771704 386690 389953 766216 810353 503126 404367 836789
14813 836789 704064 647015 852366 408733 599628 712027 509707 771413 536550 740429
14803 740429 653194 626772 622316 716919 503387 769030 718618 467542 605590 387206 593103
14792 593103 540246 955690 813420 574356 618997 942220 358128 766054 650379 675089
14782 675089 915265 772332 633371 446234 902660 788315 557473 609747 568328 850243
14772 850243 693188 976509 781093 753434 809629 460387 576372 600167 994610 528232
14762 528232 620163 797640 774993 837646 680465 808000 1420577 925312 479401 1025471
14752 1025471 823379 793194 968804 984033 1063888 605036 612263 807135 679324 723637
14742 723637 810221 1176100 1062910 834091 607490 979091 1025352 1156330 808875 655776
14732 655776 626524 1041762 1083236 942445 822736 1133353 964168 831112 998767 844916
14722 844916 1117294 1054817 1069547 750019 1075693 988977 890408 970583 803890 911112
14712 911112 1101720 1073996 1358865 990584 1041320 1124076 890859 1130034 1132504 1016326
14702 1016326 1290777 1096043 1251635 966733 949143 711566 1026023 1045121 964385 959529
14692 959529 1040290 1421102 1083552 928189 1234909 1363159 1098248 842082 939852 1223086
14682 1223086 972125 1224823 1318354 1093696 1191123 1326815 1337231 1056758 1383202 1028401
14672 1028401 1317860 1412705 1131628 1279867 1475645 1282851 1425708 1055354 1013077 934593
14662 934593 1200176 1278455 1280278 1381420 1298218 1184619 1263423 1300291 1468231 1334998 1430898
14651 1430898 1405496 1667892 1530385 1276353 1595072 1322419 1152701 1790870 1449139 1245086
14641 1245086 1405427 1678579 1157393 1440377 1360899 1563454 1709762 1673546 1576316 1341212
14631 1341212 1568759 1481162 1462218 1677528 1634924 1420629 1238568 1768635 1744116 1616762
14621 1616762 1535088 1779811 1667022 1787053 1581407 1730250 1824850 1923362 1898581 1623582
14611 1623582 1557150 1868102 1724443 1958788 2006064 1851814 2150539 2039379 1927118 1912572
14601 1912572 2099798 1932312 2000534 1845858 2182019 2080587 2228978 2175258 1996537 1984023
14591 1984023 2213147 2170347 2023626 2191498 2388174 1867352 2128393 2094508 2260511 2607678
14581 2607678 2202077 1969661 2412397 2340289 2460548 2561458 2273193 2247074 2372416 2381070
14571 2381070 2521233 2511055 2916714 2609101 2773573 2663383 2455045 2928355 3143022 2854343
14561 2854343 3403763 3249618 3284427 3172821 3455661 3534554 3670686 3904510 4167703 4229669
14551 4229669 4997624 5957925 7568618 11235167 19899819 37998323 35421076 18493279
14543 18493279 9177220 5719272 3982701 3364324 3047824 2924312 2952722 2858858 2950868
14534 2950868 2625185 2617049 2798289 3099249 2499042 2587988 2855470 2572008 2831179 2567073
14524 2567073 2717002 3011807 3061758 3065397 3154936 3246232 3283526 3138892 3144895 3337548 2899916
14513 2899916 3299698 3211795 3229404 3542387 2983955 3336100 3271180 3547132 3709884 3493971
14503 3493971 3366589 3680460 3552143 3670741 3849226 3635176 3978307 3827819 3913084 3729085
14493 3729085 3880202 4232742 4048403 3884572 4052342 4027993 3940613 4282201 3949134 4319748
14483 4319748 4219044 4672976 4533598 4286737 4518235 4813721 4883592 5034623 4640746 4803090
14473 4803090 5271541 4848673 5182289 5400527 5373678 5164414 5164010 5025327 5289905 5468129
14463 5468129 5125195 5224274 5201334 5481428 6020457 5691408 5654388 5893531 6018599 6034415
14453 6034415 6125993 5830386 6262388 6418052 6329154 6241064 6437021 6234557 6648796 6586301
14443 6586301 6974559 6763548 6600816 7124685 6899446 7198322 7112984 7434624 7121707 7595326
14433 7595326 7728048 7445460 7523207 7920455 8002636 7699748 8030841 8104319 7952428 8597184
14423 8597184 8584541 8585640 8489280 8696149 9043016 8786576 9283070 9253669 9473450 9862103
14413 9862103 9336875 9695957 9861436 10049297 10260690 10130565 10478442 10472023 10619037 11056243
14403 11056243 10753468 11501726 11378900 11404084 11652745 12118464 12033563 12292726 12687380 12490490
14393 12490490 12753222 13023194 13142536 13471668 13866403 13794328 13848688 14481529 14491275 15007368
14383 15007368 15042667 15430103 15592962 15932359 16233422 16454976 16778480 16694592 17075675 17513989
14373 17513989 17565755 17961931 18353569 18628317 19276120 19418770 20239972 20310194 20473005 21002485
14363 21002485 21193382 22166136 22232367 22930176 23014498 23675229 24505944 24608063 25466092 25891849
14353 25891849 26092555 26835191 27419642 28204483 28766249 29407287 30226884 30758384 31409962
14344 31409962 32356125 33267825 34095732 34705979 35730458 36739539 37774154 38784739 39622498
14335 39622498 40927891 41763089 42939401 44357482 45599241 46720146 47960841 49509034
14327 49509034 51510449 52927290 54525654 56349994 57785689 59595902 62060385 63859495
14319 63859495 66037773 68249627 70471408 73205149 76047133 78906793 82061396 85065368
14311 85065368 88534794 91965959 95424665 99259023 103705647 108079570 112740563 117584230
14303 117584230 122747648 128607278 134115240 140559655 147292289 154015268 161445677 168828362
14295 168828362 177101940 185959973 194697308 204426279 214632315 225471556 236876333
14288 236876333 249235230 261369751 274535984 288104448 302202521 316034122 329564159
14281 329564159 344364722 359763765 374233687 388631170 402184076 414667068 425991689
14274 425991689 435632610 442685983 445424293 444254676 442616475 439646573 431452650 425601532
14266 425601532 417626488 406304343 392880983 378908675 364282540 350228210 335925938
14259 335925938 322069855 308274449 294842075 282206484 269610175 256636197 243999501
14252 243999501 231496003 219398886 207377867 196484830 185811317 175908481 166585619
14245 166585619 158300201 150519967 143045676 136132306 129546240 123124028 117382555 112377057
14237 112377057 107404015 102553753 97845718 93825357 89708680 86199344 82856320 79797441
14229 79797441 76422633 73652229 70420935 67834410 65231514 63195962 60398468 58551860
14221 58551860 56530970 54714550 52593041 51070830 49448827 47615681 46360252 45180116
14213 45180116 43467576 42160984 40863819 39917702 38190015 37501743 36741585 36135555 34805466
14204 34805466 33785716 32694798 31763642 30979239 30272145 29851505 28516583 27900589 27491148
14195 27491148 26476092 25991107 25640490 24694046 24160911 23571278 22995230 22438540 22059033
14186 22059033 21500872 20713824 20600813 20171471 19250115 19010030 18980310 18619467 17950750
14177 17950750 17619270 17522521 17284319 16811177 16379913 15907174 15562270 15286470 14843763
14168 14843763 14624430 14383771 14019434 13636951 13467418 13467142 13122758 13022431 12581545 12638284
14158 12638284 12216143 12050628 11816995 11703773 11727250 11629124 11367763 10794056 10664553 10613898
14148 10613898 10363003 10112010 9993604 9952207 9805687 9496685 9397154 9120460 9146177 8848225
14138 8848225 8859625 8821914 8486589 8450377 8432827 8408413 7930495 8029558 8126771 7791434 7447015
14127 7447015 7305429 7415178 7757183 7403083 7088342 7109558 7101119 6837652 6830802 6704707
14117 6704707 6556202 6522558 6372932 6543854 6301910 6372299 6289935 6125165 6030601 6279537
14107 6279537 6108731 5672655 5706462 5773864 5873312 5499112 5191129 5389077 5383472 5015973
14097 5015973 5280718 5163118 5218843 4771786 4645856 4704437 4747370 4997699 4855386 4776259
14087 4776259 4565144 4346301 4491262 4903081 4669672 4699992 4370850 4060234 4081000 3950280
14077 3950280 4124315 4197702 4210069 4078634 4250134 3901619 3990088 3881674 4085030 3642397
14067 3642397 3753675 3779031 3521461 3913498 3293554 3378810 3590793 3694217 3573964 3473785
14057 3473785 3496884 3275453 3458268 3495631 3279813 3202966 2976510 3146446 3345977 2948237
14047 2948237 3162645 2964161 3220826 3098449 3008346 3131134 2978978 3094776 2851949 2614758
14037 2614758 2962505 2604640 2782544 3004883 3088408 2915383 2804059 2814258 2471252 2783417
14027 2783417 2611220 2512388 2572594 2318528 2357718 2569093 2703791 2538654 2359842 2435313
14017 2435313 2379159 2248738 2320486 2321201 1946677 2544946 2297916 2364967 2534024 1883782
14007 1883782 1798268 2120510 2106745 2091903 2045898 1564018 2069351 2096961 1903686 2214113
13997 2214113 1970979 2213724 2191958 2170387 2028556 2323519 2216969 2873104 3205975 5922984
13987 5922984 12853875 31075148 35577623 21338345 12306957 7785101 5782663 4836597
13979 4836597 4084956 3461623 3568312 2785567 2948070 2791863 2848736 2513492 2567022 2122625
13969 2122625 2194065 2472245 2257912 2131723 2278762 1953394 2180450 2130477 1761219 1778817
13959 1778817 1848646 2005726 1858765 1855568 2004366 1826260 1668436 1906161 2009598 1591378
13949 1591378 1892913 1629195 1513624 1806636 1544875 1789118 1945622 1611707 1705871 1918337
13939 1918337 1647233 1590050 1847935 1832777 1645004 1684769 1587628 1611879 1487021 1207434
13929 1207434 1522482 1381360 1355680 1303663 1459084 1220947 1422939 1381153 1654393 1488103
13919 1488103 1300283 1604373 1068723 1201658 1684270 1348877 1233798 1306539 1534273 1425443
13909 1425443 1326234 1337795 1089049 1123571 1242315 1644126 1079083 1222034 1346108 1463472
13899 1463472 1194972 1336060 1277915 1101865 1076313 970980 1013831 1082601 1055826 1191871
13889 1191871 1199097 1315932 1155895 1015361 958171 893468 1020231 809341 1074465 968209
13879 968209 835726 855451 1022058 1099959 1128921 1052510 1226492 1032173 1105768 915417
13869 915417 801935 947973 617655 1337517 1008876 974703 1046472 1076887 1070874 1374701
13859 1374701 1012397 839548 971225 845913 929739 785858 888064 852596 770668 902705
13849 902705 760759 1032419 1090888 830750 954465 682331 873245 802433 667762 883952
13839 883952 1035779 991630 1153841 803460 952261 728799 844286 803329 854924 843604
13829 843604 472874 771663 998914 1047664 621536 781118 581686 609281 717365 752109
13819 752109 1049630 626151 777336 1033758 836923 761622 799866 1003859 841078 633217
13809 633217 749737 998116 561621 676861 1025966 876149 845675 833818 780793 516949
13799 516949 555873 715005 712920 758184 553730 850513 570284 414349 836285 637885
13789 637885 933386 495084 770828 550581 758301 578194 925650 662089 522897 561375
13779 561375 794126 680127 625954 662936 611823 792994 411554 459943 466865 954910 406718
13767 751215 376697 483666 586999 627864 433381 656605 705276 516623 635962 463711
13757 463711 614415 539705 512181 609472 174934 578369 802776 655148 757898 356634
13746 746239 539576 453310 766718 428922 451158 751831 354410 453282 374810 387069
13736 387069 475635 484445 445900 333978 208726 547795 201241 686080 611208 563319 284940
13725 284940 629800 236888 412404 286298 561660 869271 535224 725049 714293 662398
13715 662398 363792 130215 647180 832832 461733 704420 553419 625965 503415 371754
13705 371754 338511 404365 552229 559288 651141 442801 579559 233568 367535 477807
13695 477807 -16262 617210 500803 402104 429096 441877 614803 340651 274951 264243 683531
13684 683531 242134 317230 490805 283950 490330 523769 398180 376169 597265 809132
13674 809132 508548 269064 482715 275099 186677 376696 448669 715174 602009 606341
13664 606341 660074 410366 -92753 744918 160204 283015 357670 815449 264752 468273
13654 468273 210848 510829 595422 493785 224492 338897 265594 464126 288077 203400
13644 203400 242507 344447 450228 642855 686370 257758 356220 227476 226611 183559 579692
13633 579692 446680 590186 429256 405039 341005 492585 515355 188820 385411 169757
13622 12968 215123 333564 503522 650612 89840 66103 292625 296548 367122 2237 627112
13611 627112 558109 403121 339185 177840 413056 326987 484465 268383 303846 642632
13601 642632 80217 309858 283118 586480 502991 132765 65338 496906 349116 357831 304426
13590 304426 389678 257078 182608 417863 446759 -158274 392404 376957 216951 80433
13579 269759 152516 111535 331654 450008 166433 245428 211321 140404 204014 289326 299727
13568 299727 356386 347133 557523 115864 362017 197497 -50498 113314 213136 295960 324648
13557 324648 408331 324248 565461 362307 428668 175119 360480 541638 207858 124392
13547 124392 -299646 -64689 422104 381256 358898 52496 341075 -12006 189070 214006 379640
13536 379640 232675 26277 169877 288106 140463 476033 41118 359064 43957 -140411
13525 219372 99997 491231 219249 103901 124356 129858 283964 -87015 271462 95189 428995
13514 428995 207362 -178660 210589 64576 639958 403041 218674 190764 288004 87208
13503 13923 277360 238162 283117 356033 507162 78564 325046 188785 309146 221413 210943
13492 210943 164715 -57835 33744 240432 -46514 44543 371680 126540 151390 253485 471512
13481 471512 234186 188157 305826 65108 303777 379767 450732 407073 48156 316449 457582
13470 457582 66018 -271264 391278 -125249 221873 154472 -8037 52540 47069 64167 176454
13459 176454 40615 353892 -74792 153478 79110 154828 198885 165026 341211 443147 278002
13448 278002 -22719 40135 411828 333802 156302 246203 313884 -151921 124194 342166
13438 342166 118289 168849 125006 129306 263714 14796 224598 126023 68958 -82056 -85868
13427 -85868 297602 215649 532941 433788 494282 453321 327723 302666 116291 82330 474831
13416 474831 325091 267360 119737 -52113 386271 218727 341602 35535 146287 325619
13406 325619 120291 15923 412495 130914 229867 130722 -13698 105107 257466 35078
13395 44072 -12710 87866 458135 -64596 23829 189799 202002 570434 270806 155717 -30059
13383 -98272 194099 -205016 87019 65921 69908 107467 86875 333493 249 159965 234404
13372 234404 194259 117065 141275 188840 458829 73964 31466 406659 305297 109276 294892
13361 294892 211813 75072 238875 91987 313341 284961 390352 92983 278911 -125883
13350 123961 211253 47866 225987 249958 200504 414195 696372 399309 108172 128652
13340 128652 633703 293025 58583 83105 199179 206063 -26926 77717 246005 57665 -9588
13328 -94742 -8756 253236 -107627 182082 374653 -31693 145367 279549 362192 217487
13318 217487 349389 243377 295615 108956 162233 329209 160267 45561 270825 10857
13307 717 228869 -19789 42813 440406 117514 10915 55978 190396 66191 193867 336070
13296 336070 72644 423642 -110891 -18978 392206 85160 313191 -87112 304352 172619
13286 172619 -18585 124346 3030 409824 -64006 2785 -284256 45765 -24597 29796 159824
13275 159824 198986 140082 248689 226486 238540 167303 -145680 208349 276171 -131295 113179
13263 -16355 439875 337772 55573 -167663 45250 221529 105351 -24043 373140 134551
13252 133586 -90120 16599 317289 -188992 28796 -61323 183042 -586 234298 201653 147202
13241 147202 31854 25047 26753 51534 -21595 -248897 54570 -216110 286964 89103 134695
13230 134695 163314 198814 140431 -11573 55826 59358 241340 176252 43433 141922 -48127
13218 102202 22256 42244 87725 -249516 -70768 262431 148958 159225 127948 -285131 -116083
13206 110143 56999 120197 -232676 178720 171208 376688 -9625 352701 366656 -32948 112110
13194 -197530 -182003 52473 327837 375414 -92771 -224382 205794 -61895 165429 38357 146763
13183 146763 215989 205024 176158 -28037 -185027 -115613 -105259 133828 -306912 100017 -67289
13171 -112139 222784 -4192 365757 -63817 75319 111828 107177 -84276 -118594 153198 91639
13160 91639 -223449 318227 221188 54513 -194592 117087 130641 87399 284321 152247
13150 152247 73751 -28189 -43479 386677 39867 227143 -318452 298171 -125540 -55420
13139 39293 -136173 62791 -30442 107800 123447 320209 23270 65714 186164 -195274 193611
13127 -47877 112284 -112338 452584 -10059 222005 -136402 -109538 -92062 -110865 424310
13116 -14970 -24614 263010 48804 3087 171701 63440 -84715 85781 -27636 70769 175016
13105 175016 153902 315267 255178 199877 -240100 -286674 217588 283751 -132214 -102431 -43835
13093 36966 29644 16120 -179543 -137371 99542 27731 10990 193334 15830 -127182 -6296
13081 275866 52958 -232576 54484 -311465 -164311 -6615 137855 219958 219582 170889 -172475
13069 145191 168602 -49338 -90996 173553 209455 497299 391533 236835 -146051 -176893
13059 -176893 31771 191948 221789 -69039 169048 183531 58507 -517237 -276324 -79703 -341334
13048 -341334 358242 -204657 -24381 526736 -3845 125659 67253 206990 9324 326927 235326
13037 235326 -196786 -124448 329188 157698 196529 141016 4121 -56518 -6647 9208 223976
13026 223976 55972 -321044 191632 162119 375424 -89334 336326 -72890 -53335 -61930 137156
13014 480451 -188860 280843 -105682 -154254 368801 185945 -307998 -10418 161441 318391
13004 318391 -56526 144719 70 -13520 -152513 46704 280331 396325 131134 -46668 83993
12992 276303 32315 184187 44785 103919 31861 -120677 -13457 -52918 22382 107479 139477
12981 139477 243850 274734 -3537 -40976 87441 190128 -59729 16307 4888 -11419 -42314
12970 -42314 217929 -30855 -110942 -161464 287707 -120322 139490 11293 108081 235926 150809
12959 150809 114686 208179 -149791 102334 68911 144436 184020 -36273 -2275 -17406 -153544
12948 -153544 6450 97173 119622 -172614 139415 121212 211268 27545 197678 -63226 149241
12936 131390 155394 37498 115384 -224962 164593 373757 98990 -12194 -195227 204934
12925 239190 178172 -47738 127042 -187268 313000 31203 -220015 23209 -141277 99680
12914 143647 -45147 167149 -94968 -59561 84055 324525 1909 7118 -5675 -50081 -149050 19469
12901 221515 -601654 130759 80785 -203146 130526 102892 -126551 -111875 186597 225617
12891 225617 150840 30027 43605 -56847 13751 305449 79302 64923 59656 50905 -198025
12879 125640 32494 -22873 -215393 271517 136640 -199741 -18230 -117423 47593 -38272 -290426
12868 -290426 -40883 -115230 -15189 70786 -58893 185097 88797 184120 165060 30683 194899
12857 194899 83451 -65039 24881 234766 -43976 63679 -98068 76204 97631 270723 341826
12846 341826 181431 38550 -152252 173000 166765 156530 523554 33115 -35021 52815 137518
12835 137518 154005 48777 31575 49780 -398559 -33250 110172 -315084 9277 479250 -81803
12823 -140966 107015 98636 -65821 -129350 -87863 343597 244869 -136997 147253 -193724 64436
12811 21436 14885 -57625 300925 -47643 -218898 -138172 116788 -8942 63625 211151 183656
12800 183656 145011 118845 307174 345558 46484 -228555 -95941 -208062 27309 244079 158105
12789 158105 -187676 -142938 -43381 -146106 83217 -7266 -21122 -78047 -226333 153299 -95238
12777 -87547 136011 125648 122079 -57577 -110550 19320 -1987 28494 -1353 -140398 -351661 -271827
12765 -271827 -32526 71861 -177113 266776 39341 -110357 -5434 46341 111131 196772 -367078
12753 -195450 59826 133631 -129335 -180140 -31354 101147 -17522 -220703 -54207 -11277 -11295
12742 -11295 288169 84366 -32487 -146874 321597 -70210 -31416 -11249 192463 8191 238173
12731 238173 -30075 235824 -224391 116641 107448 -14994 -152034 40839 189811 96376 -8937
12719 -53733 -112413 4089 165002 226419 4364 -50107 176359 157839 43946 385522 303232
12708 303232 274610 251114 88616 255992 160638 46127 172948 -207808 366290 -121658
12697 -80404 32938 161979 -81443 -103633 73951 -3488 -14426 4637 138196 329200 193954
12686 193954 294621 -21530 -104370 -176613 123006 -38355 -381174 80268 -133330 336290
12675 339467 -92328 22872 186960 -35826 -151946 270912 143181 355151 88236 -110833
12664 192710 31756 57640 -193449 37706 248712 -1856 141741 28864 267865 66685 113592
12653 113592 -74522 27298 -86042 -18710 236115 -18951 175624 -131280 261705 -297023
12642 144546 26028 59461 -56439 89528 157834 -307499 -172271 100168 16733 178307 -117865
12630 63266 387464 276130 248290 22655 293661 -48335 -149420 187813 25115 -2638 195919
12618 94847 -6970 144051 494771 17251 85081 -181675 -124802 268980 -27218 -121341 -163484
12607 -163484 -386591 -39925 -218519 196922 98462 107576 26089 -32686 -28568 279602 -13387
12595 -107205 -49355 -61411 -47681 145292 -111324 217332 -45708 82345 -95976 135055 -273921
12583 171572 292118 194625 119628 -190584 13429 -179442 207252 53042 -56283 -79008 -112888
12572 -112888 44577 -96787 16263 58260 -7305 248601 210524 223794 147251 -209062 246327
12560 115872 -69748 175089 165064 195579 58709 73326 104081 -161282 239453 64631 -168442
12548 145014 25307 -118591 167526 160320 -54745 239303 207807 198486 -119266 -90605 -23418
12536 -64232 180728 -22555 -62150 300529 233069 230463 -11988 -162943 163854 50603 65501
12525 65501 137919 155998 23153 -81972 12068 -99096 -12071 -183537 60681 -131739 -37762
12513 -162266 -25066 -209160 -202125 158283 50444 -208596 102489 165575 57724 96927 -25909
12501 158656 -156840 -165053 -151974 181660 -96938 -155189 -223090 78272 -45744 -37879 -30675 -139837
12489 -139837 -65391 -9714 197133 -201361 -131639 54715 267042 115902 118360 62652 -285493
12477 -287121 112018 -224554 -69146 -181113 -349806 29767 74482 -43181 18175 419170
12467 419170 -189882 55144 83625 -3882 358053 -17064 -39142 -302510 -164701 -651 -28695
12456 -28695 269768 -114944 -25705 48415 -31011 139332 70980 -172112 -250375 223199 108693
12444 -75942 162665 -125142 75981 121488 -70337 150708 -61205 24813 267227 132375 -35119
12432 -179866 95738 106995 105434 64403 189908 -154194 -58207 -200810 66733 157337 46041
12420 -122826 -244891 -62188 25180 -75104 -66240 -24599 255886 -131715 193434 162219 -136313
12408 -65071 -196455 -16778 49826 133272 -95406 193277 154216 274975 30760 -54289 -60072
12397 -60072 18205 -154874 240231 385020 46749 -55382 92574 141736 -328956 -91518 213939
12385 44877 26736 -18283 42250 -148924 103778 -2471 -160509 17431 -194955 226131 -39109
12373 88367 -143724 -368133 -202923 -54348 -231243 207715 299275 -445081 -21856 242608
12362 -165510 -226536 47240 10156 -167706 -82958 38074 110047 -43230 170885 265250 59445
12350 -64257 110870 63189 -123507 427584 -198414 -19235 94652 111277 -127289 122743
12339 -199674 149534 8104 143778 -237247 90835 -58466 -288785 179290 109383 51462 -64031
12327 449135 -106147 36588 -175073 20595 98971 -246900 153027 137191 -7814 -136922 78906
12315 -232346 117436 77444 93333 195118 322528 -186844 -29309 -14442 3084 -241288 -67400
12303 -65631 -368740 -150334 -127477 76147 255591 140 278097 -34218 -144736 141689 121844
12292 121844 -151894 3299 73180 241715 -151645 155472 193340 267871 11325 -68806 221792
12280 -127081 -21918 -65536 -42234 -178090 155733 329543 475507 344180 285743 -174431
12269 259335 176763 127340 -191324 -31835 287071 -19101 28652 341185 -72595 -32249 123725
12257 -371949 -116282 153746 64019 -73098 -156475 178478 252692 32798 184916 78902 -446325
12245 81394 92462 197377 326439 866 280245 311283 -26348 117937 66704 -185644 -7664
12233 149887 105563 404509 510259 11279 110579 -136758 138079 204189 296294 -12302 -92939
12222 -92939 -57984 62981 107975 171976 280477 58533 175419 297005 165563 142542 -148707
12210 9926 -14985 338811 228624 -70105 -39810 55823 -280534 106572 289182 75651 307094
12199 307094 43030 322516 140671 90018 75231 286740 234776 503303 306139 189628
12189 189628 71373 415948 112765 269482 -17720 36393 -147893 51942 -154249 -29792
12178 367655 6793 102410 348663 97081 193590 -6769 -102940 145872 148759 220089 -112622
12166 -230986 237078 -37446 112502 453972 272899 159972 127847 42634 -181631 -75336
12155 94933 -146859 161888 -39734 293071 252063 384014 308869 216035 473415 -171317
12144 245199 -231787 -28391 139322 175216 23173 -22214 420257 21386 27203 -7990 43897
12132 182761 -283675 169148 -198689 -39483 312416 -153705 204580 29874 -146926 6307
12121 75920 -180702 71808 180155 -76899 123762 116722 -100807 -121687 -44833 226643 -106615
12109 -6713 -26372 -46628 82117 41771 261339 364067 159558 -167867 125293 45807 104643
12098 104643 -83088 -87809 260690 12348 119524 207383 100968 -227104 183738 -92894 -104787
12087 -104787 -26343 20818 -68432 76816 -88019 163432 -289747 32896 130674 394243 1722685
12076 1722685 910584 454586 -196646 159131 164751 312664 -127679 -147462 -449836 -84268
12065 165598 -223228 -2084 29723 46279 50395 99857 -39840 177379 41806 -213952 7687
12053 -196960 90884 -31662 98432 24617 5271 -144538 229090 -234605 -120195 -84189 -301815
12042 -301815 39215 -19496 337027 -313003 -102833 91416 -205709 4076 -201857 -105692 178351
12030 143881 -137381 -36674 -243494 57844 26292 -122845 57073 63220 218521 245689 -128285
12018 -255474 44452 97199 -135012 138893 -16922 -203091 31605 -20898 -183624 -50312 -254304
12007 -254304 -85385 208442 -16902 -239807 -148605 25949 151790 284978 159254 -128984
11996 -206114 1502 294365 219364 -3670 -79511 -125628 -160391 196906 -33076 40598 49490 85878
11984 85878 -80609 -188701 136771 -102238 -102900 -327523 -28081 -122305 5682 -228814 -215912
11973 -215912 363223 -348943 70497 -455329 6626 336671 -110146 -137646 -79464 -84262 -301417
11962 -301417 -166425 -116974 -155464 247372 -90261 128285 -103090 -307241 36115 -154242
11951 -176806 111121 -115816 -175388 147086 -16037 89869 -8091 128196 -66677 110948 67226
11940 67226 295466 -30955 -22389 -348772 44152 155079 97487 -84822 -88706 -246587 70252
11928 486378 50397 141509 -99398 47397 35198 149094 95745 176426 -116412 -338367 109290
11916 -73012 83133 -118815 276719 -59824 31497 362775 156750 48181 -26751 201140 90340
11904 122999 -283755 -95570 -12025 145130 30829 -176114 14709 -325234 21136 6918 -273387
11892 -254195 -126168 -10614 -242598 46338 -93419 155210 217763 215837 -249800 272151 -58987
11880 -82601 -107568 98108 -226811 -73323 -72463 83959 48401 -89818 -133658 -230386 249343 -22998
11867 -188634 21946 -287484 -302683 -412518 221041 -79136 -161228 -81535 -17606 123991 275143
11856 275143 4189 64100 -29842 -274873 -240952 99516 -210106 132276 69999 158421 -232597
11844 -213436 315014 114248 107516 -31046 14284 -110074 114429 60870 -243958 -250431 -118148
11832 2352 205141 -42085 -346004 -8474 -180057 -69481 -226712 -413960 -250850 -6235 98714
11820 -43797 -341540 135161 77929 -226561 -21378 -144997 8866 115765 125851 -171935 -67283
11808 -127518 -258828 293770 -101433 -77548 -51597 54973 6198 71952 -218356 78491 -30624
11796 64250 -212063 -26541 335250 -151580 215357 -212415 130385 242423 6899 113551
11786 113551 -94297 74137 -281952 36446 -141331 -124370 -118750 -140828 186319 22558 -128833
11774 130043 118939 150117 -77496 16133 -93779 147728 213109 -26352 99305 -268480 -265662
11763 -265662 332359 -443621 295343 287114 205732 -222729 -50655 54292 -141730 -27877 -110693
11752 -110693 -244700 -43289 39994 150264 231686 -250364 74811 -106019 -356407 132529
11741 9464 -302984 109911 85263 842 219332 -77205 86687 -86333 308597 -129433 -270898
11730 -270898 295850 139911 -357903 111870 97167 -15959 160513 41553 227552 -89782
11719 58837 -49301 253840 -28470 286583 210707 65465 252889 73777 190652 68887 165635
11708 165635 -428703 -221794 -66539 -223928 -49707 -162766 217198 77724 -386187 -101333
11697 -9072 253329 -91119 156718 -81429 -56950 119297 -102013 -216675 348351 50789 40547
11686 40547 265524 -46773 -174257 -11713 -10378 335061 32721 141732 -59598 58388 90256
11675 90256 -276138 75294 177612 40976 -196303 148330 -258380 12967 125131 216060
11665 216060 -122092 -111895 -15487 89127 38496 -121607 133137 165192 -35431 68685 362098
11654 362098 123400 -5545 173405 -357873 -242406 -318872 -56481 -21327 23850 113945 111091
11643 111091 -234207 130395 97457 -185910 105841 10863 65189 -386369 -205728 231531
11632 -52807 -301465 -12349 -141230 4457 -153761 221624 325930 -102639 296150 236212
11622 236212 70884 50828 -194310 3283 -202 -43072 -355107 29545 -166990 75744 -108034
11610 80015 97737 -148913 29469 -35958 58873 260173 -123706 74753 -345663 23356 6978
11598 147556 -242019 -52928 -23156 236936 -84364 -110616 10371 208971 214946 278852 80417
11586 48126 175594 -46509 97334 -11236 287136 -89235 91275 53042 -6984 196881 6058
11574 133702 -130723 194914 152852 -35028 -30440 -75890 -65049 270808 144033 26723 194144
11563 194144 -49791 -197053 -172526 -31122 -64699 90608 173391 35464 76830 170879 -38064
11551 114844 -123177 -99391 87344 70984 -232816 155043 -298770 -47917 212397 105678
11540 205423 -137257 62098 378980 212727 212217 299309 -63336 454109 166324 54282 58537
11529 58537 -52413 -211402 234039 13192 97952 233422 173884 -185670 385475 36004 276080
11518 276080 -417374 244224 253980 347638 276451 170643 -473080 -42119 177237 110391 87920
11507 87920 34117 359576 -21325 115312 93654 -7181 77518 3465 323123 77794 20333
11495 -171899 61386 -248193 201698 125514 117831 21794 13434 71927 56676 152016 232955
11484 232955 -58422 186713 -57465 23849 205322 83285 13540 7062 -161628 71118 113946
11473 113946 25936 530793 223556 236318 -52043 -69517 196509 574898 -84445 244151
11462 52570 199683 -263498 172610 203210 61256 -238556 -77473 -77611 260681 335130 -275497
11450 202524 298001 171079 74043 341570 -125267 149224 -65881 -74067 -132947 -29429 42761
11438 259605 -111268 144266 166690 -4077 677364 -44113 20778 38334 7874 -211188 -19495
11426 190473 -3570 -248102 -99655 280537 527253 175817 347131 104808 -59963 125780
11415 17124 -11651 -32315 -327478 161929 -113104 282810 -192514 220048 136613 -126475
11404 -70425 148859 -224152 -100412 197010 26295 5101 64742 -26194 181247 125247 -231779
11392 -4263 -53473 -94524 223201 -54705 193259 350226 -15088 -40281 -96899 79509 -125391
11380 -149343 99528 16476 -129859 -367618 2688 47214 -222280 -11829 207611 29020 42261
11369 42261 15520 34798 24921 -30840 375078 -104756 -6862 49743 -11808 -271036 -38359
11357 -129585 -281869 -439739 35594 -313736 -60788 -118374 192621 39112 -114756 252807
11346 -181067 -48530 14392 6713 -96864 88587 -225860 166858 454600 -225423 133792 -80009
11334 125954 142636 -182073 37076 70155 -2375 151276 73201 -217515 -230021 -7966 159439
11322 -162491 -65144 62678 170266 24589 139893 -125714 -59255 -113950 228763 -46272 159065
11310 -44730 -305415 -67107 -126595 -251959 -122460 -14567 119087 -9930 -243266 119127 95062
11299 95062 -87027 60381 240650 6614 -281780 41923 6780 53621 -125547 -22138 102792
11287 284614 -80583 -206291 68244 100252 -177567 -251961 -86343 -199297 -31515 -112889 175233
11275 -287275 -339046 -194578 -99629 63634 -1637 61132 -242184 -68518 -177927 -102973 -134760
11264 -134760 -26701 163630 31941 -179677 -1195 -10010 288549 -144499 -231461 68154 -185877
11252 -32208 195379 -193791 -172842 -407078 -75429 62001 30098 -24330 -81022 -29515 136479
11240 -160701 -270185 -238968 -94295 102835 -14736 -195323 -41488 147983 63913 166466
11230 166466 250509 -8327 61920 307366 -433835 10881 24359 -64147 -286020 -86830 299059
11218 -330565 -446981 -22592 -95881 -107897 130118 -144375 -353062 34396 110543 -41650 -102656
11207 -102656 -205243 -242154 -175030 27222 97884 96933 -36700 -92133 -60204 -258080 327716
11195 212283 -223097 165924 -830 -56465 156581 131368 -148301 -55858 -166801 -15077 -19153
11184 -19153 -105856 240416 -69594 -193501 156735 47019 -181232 -4739 -51014 114412 185477
11173 185477 -163461 -182414 137821 273247 -27367 -168009 258888 -18871 251908 300447
11163 300447 67233 -190752 251449 -301101 55136 -131146 -66246 -16533 -18957 -213934 45538
11151 371694 157391 -224800 -16636 151847 -22529 79822 -86455 -272008 -108507 -180843
11141 -180843 -68633 -98175 -68826 -107849 117763 -20840 -45655 -65180 -21983 -198775 -224882
11130 -224882 6932 227516 -265537 130091 153201 132452 129615 257329 203201 58701 62788
11119 62788 55072 124286 244331 137318 473003 -194697 -4494 13621 257003 -20196 313985
11107 -143287 -160983 387470 118925 613222 311371 224452 -237860 150929 -24677 222566
11096 99755 118010 190164 171625 123753 265172 354984 97631 171930 314370 43930 194962
11085 194962 342878 -34740 210693 345060 102670 280184 383410 330793 188980 -216586
11074 382106 161307 109185 213270 424312 188464 141049 112748 120238 310655 -64452 329372
11062 336478 203968 533996 458173 272306 462208 195866 388235 540465 467212 399973
11052 399973 746050 650941 705279 467837 452837 854469 462244 488709 701506 774200
11042 774200 384760 486200 505369 529793 757681 680119 671864 690244 423776 627954 657604
11031 657604 563623 563253 306106 387317 720694 488322 135214 596034 567186 657454 595792
11020 595792 481529 657773 703230 346371 428832 438366 774687 840971 534011 282117
11010 282117 422352 318547 644186 613206 470258 507447 660414 281211 184228 488271
11000 488271 596654 735392 564723 504885 850906 596613 660990 540026 737820 554342
10990 554342 528090 542238 665912 691467 310532 677663 877141 951510 791528 1013178
10980 1013178 1188034 1180356 1452174 1630624 1337692 1648010 2106107 2028355 1996644 2410381
10970 2410381 2241846 2072578 1673570 1727968 1736604 1286624 1505246 1299709 1254379 1479660
10960 1479660 1495095 1605971 1370244 1682646 1782503 966422 1228271 988821 744969 878697
10950 878697 522392 490374 460470 377260 313901 285166 50536 434895 331628 -32325 107436
10938 160599 228525 375641 -60401 247633 -29667 -6324 -5926 -6041 -47059 -106163 117327 79602
10926 79602 87923 151963 386061 -287350 298885 89045 106537 147055 50266 77434 -197604
10914 -122254 176596 -17398 184418 -306658 57213 141798 162021 -6547 -294748 -194420 -109861
10903 -109861 342739 44733 68641 43835 -43842 61388 -159 -94647 31300 94090 -28062 -266797
10891 -266797 -113079 37007 140993 -75558 -9467 -25672 367627 90051 -241753 -197011 91601
10879 -11541 79316 -1321 278289 65879 104739 188736 -100622 312897 -220539 140860 -1787
10867 -263355 298430 188784 -33709 -157854 -43320 100239 -16242 24730 139364 -76457
10856 -90669 127578 -63526 57505 23730 49809 -294611 106962 157426 -161361 239060 -277496
10844 -286987 -80894 63596 -118903 -15852 282942 134616 199439 135001 -56103 -172638 270324
10832 -15278 95395 80831 141467 -434309 84879 -287714 -341721 54153 -926 38501 14671 40402
10820 40402 61308 44625 102569 63413 -98751 187641 -125264 356460 301653 -112844 -233688
10809 -233688 -148641 79983 136778 203462 -228293 -184903 -106833 -60497 -20446 289653 50603
10797 32222 -220284 -46764 -155167 -147645 104498 49570 3357 202738 -110558 189327 -46800
10785 -311384 -16528 263598 276650 -330352 -72706 -41187 194090 -213984 -67152 -104716 -209738
10774 -209738 -155216 -14388 -298083 -100353 -122417 36456 -90731 -174579 112481 -148084 82409
10762 -71404 -182714 -360281 5246 128597 -58087 53349 129738 -10221 92262 -88140 -172739
10751 -172739 134969 84392 -62682 -77361 -11224 -95516 166298 -58131 -2682 -171373 -396120
10740 -396120 -180172 224835 53377 -61389 -137203 -246989 -53988 52433 -109013 -151066 -475822
10729 -475822 -245725 -64350 -137901 59117 -83 -188221 146018 252197 91639 -51565 -121186
10718 -121186 6342 293161 16700 -243334 -199840 196840 -80756 -130277 380218 -566520 169825
10706 -104462 35769 52009 -41862 -208958 -132673 -434927 27201 -222981 -219722 213810 -232059
10694 -151557 -150571 -57667 -80460 -20444 -17133 -174599 -282846 -3513 -12409 -283030 -185465 226005
10681 160350 -198616 -10837 -306900 -243400 81908 -239726 141581 39360 9872 172930 122248
10670 122248 -41413 42909 -24411 -228388 48190 -359409 -91453 -179879 5092 285083 58756
10658 69690 -249059 13427 303964 -179591 195839 -33341 99876 61194 -90246 -133127 -54275
10646 -323517 22753 100874 93681 -31946 -30826 156963 -289194 -371829 -170460 291719 -23593
10634 -121791 118438 20780 -52109 -86481 108934 -89213 -276942 -179442 -74877 -224848 104092
10622 43241 176608 40648 -67128 -101681 41343 -42340 -110691 54929 -222979 -250552 -91073
10610 -194294 -93515 -247070 -7054 -204998 149490 -183434 -196656 -43667 -204877 121107
10599 77101 -126681 131009 241581 78153 76856 -54875 33627 -62448 32411 -120188 46509
10587 -211770 -248622 10144 24639 -170683 5388 68125 -286591 -78504 -221905 -37667 116924
10575 -46954 -198180 95140 16765 -308372 -170216 -110125 200694 262612 64527 -30604 -177169
10564 -177169 221018 273170 192976 173510 -102935 -110950 -140923 -104068 61379 40838 -78054
10552 58123 51347 -18898 -151166 210823 -377785 -130687 78676 246106 3375 130744 44373
10540 255550 -300943 10543 40665 -20779 92518 -50949 -105240 -82114 -80390 -145554 -227810
10529 -227810 -55999 -272530 65638 -98086 -89595 102891 55884 -89637 190323 -2005 346702
10517 164571 18109 165127 -112717 22105 -393113 -204407 310865 -314099 139294 -202664
10506 71102 -27087 48625 -56881 -103055 -85307 26192 -70293 23444 -228965 58323 236618
10495 236618 -152788 105860 2358 179918 -307371 114786 217819 -218769 -240346 245887
10484 110399 239933 62967 386809 300768 521625 241885 262615 38348 44182 137764 52598
10472 -64308 62534 21562 -70688 109605 115746 -100542 -92798 130920 -44212 -235138 -26373
10460 -360388 102242 12890 -195531 -209334 -124982 374546 9835 -222493 -356891 -103412
10449 -81475 251555 194086 18748 -276274 -383890 78094 -297269 -49694 -114896 -39693 223084
10437 -93273 -181285 -9457 57119 -6374 239631 344157 -152496 -110381 -244630 3875 -117480
10425 -141428 -45728 -146446 340517 136354 -225006 99501 38227 -425447 103098 -91109
10414 -204827 -238620 -188416 34950 235822 -78214 -209230 -115553 286966 159140 -127763
10403 -318370 -271579 -34061 148666 -47881 -64271 6163 -81992 -83037 -17800 29723 60812 19807
10390 -93406 -131775 -33213 -97031 109917 31105 114861 22250 135869 204577 -70854 -18696
10378 62446 192726 203661 67176 323477 376158 74330 330320 178391 374353 287976 140832
10366 325688 -77841 708337 -95824 -54623 38999 461997 260479 125932 80234 153907 409920
10355 409920 122019 127683 247779 451304 275736 227927 302278 455502 356456 25931 517702
10344 517702 504684 194657 -36458 267200 408224 357909 384027 358345 260253 -50096 -216584
10333 -216584 176053 99785 -85289 134890 -147732 173548 -147643 193774 30461 216104
10323 216104 524537 140879 -64639 210770 -77843 92947 192082 339886 250719 -122918
10312 48168 61862 156503 -65788 -297963 -101901 -132297 54324 -307736 204493 37264 -221557
10300 -98540 -26924 -92796 -109074 -35818 -84011 189764 285761 -153296 190201 -106282 -385140
10289 -385140 110600 -174041 -16364 88390 -106646 179454 -18263 -16397 -44089 -223047 -100361
10277 -60800 -130476 55161 -145295 -246327 207676 -231766 -165380 120462 -5304 -239896 40649
10265 102224 327072 -267234 -42704 262438 16967 164679 -26292 458226 305859 -1130
10254 -89950 -170660 -34278 215735 -226721 147195 145386 237898 -43582 -350855 -25126 -102137
10243 -102137 82557 -236799 -97897 172074 -221903 -81368 -144039 75309 -34757 222640 -61654
10231 213535 -299601 -182620 -106861 -316724 -268933 -91823 -199628 227688 122164 205243
10221 205243 -126950 108969 -188951 -296563 -395490 128480 55892 -156116 -48796 -141444
10211 -141444 -304833 -317895 -189399 91637 13034 76635 -296309 36190 216283 -47093 -77495
10200 -77495 -341792 -26993 -257114 172185 -97661 -125795 -23053 -265746 -44542 192368 -189827
10188 -116596 102822 238058 -243652 -67688 19856 -237865 -65238 82127 66814 188986
10178 188986 -288324 -87339 198582 -142296 -191852 -161960 -147933 -161987 -118071 328243 -21778
10166 -113092 -167529 -188893 60047 98218 101523 1557 21325 190811 143130 14267 166389
10155 166389 -248000 12437 71984 228756 -9283 194362 150264 -225347 -181444 23963 -99366
10143 -136035 -89567 163440 61900 -141486 -209826 3340 -24403 155098 140414 220535 41521
10131 216867 40920 148139 221628 63384 -3249 213231 -117042 56955 -115383 -181410 -14351
10119 -10163 196842 -220398 -128968 222004 74769 -11851 -143557 194169 -15567 120467
10108 -125404 107506 -291166 -106332 73571 -220569 -147688 152726 3633 -51910 -314917
10098 -314917 95485 -19814 -67190 -228269 -143360 -74873 -55927 40064 -62288 -392865 -222711
10087 -222711 -324561 -253494 16343 70904 -74907 8558 -70996 -7036 -196854 -53853 -294760
10076 -294760 -6963 77401 -257802 32509 -20992 -213193 -3504 -198100 269811 -140833 -220796
10065 -220796 51969 -263524 -22557 143423 -56140 -231040 -163531 -84928 -27430 -50810 -110118
10054 -110118 -164330 -57894 169590 -201191 -136156 -97181 324204 -183459 -201313 -58447 45890
10042 38603 -321908 -433029 207421 -211100 -357535 -238703 -468486 -169749 171238 -40810
10031 36747 141597 -250946 -105172 128785 -288161 -149782 53072 367610 -156768 111170
10020 -106223 318792 -74739 -247164 -119189 -54369 -196732 306698 52609 -295103 -351574
10010 -351574 -217953 277829 -124773 -44828 11463 -170579 -427271 40542 36073 14786 -236537
9998 -272980 -254663 -44844 -118643 -225356 -313324 -173538 -188475 -252168 129923 -163265 201842
9986 -58632 -37589 203784 76159 -333150 -165720 -7081 -171811 222284 54665 -93481 272369
9974 -248671 68897 93623 -129098 -63243 71977 -53491 -91792 -58306 -185427 -115545 68187
9962 -145179 -128584 -3874 146801 -302112 -120309 -225853 -134691 -126436 -188923 -5085 -55911
9951 -55911 -231230 -54345 19295 32013 -392287 -319689 133496 94899 -291895 -297588 98324
9939 -132988 -82108 -80737 -57160 42089 -90571 -223674 89586 -277060 -82585 61192 -1613 19077
9926 -286155 -90816 -82387 -161012 172159 -18853 -256457 -168330 -58844 252818 14179 -10047
9914 -84935 -144910 -84452 98238 78732 44728 -234036 -144427 -69084 73794 -238768 116489
9902 -58566 108135 -136010 -298692 -27304 -36558 -417832 -256101 -116272 -198732 188835 -37696
9890 112990 8401 -261842 -151300 -217475 -186137 -44423 89624 29361 110356 -16146 -245940
9879 -245940 -225908 24281 242403 -348853 40183 -168950 -77993 115469 110342 -212743 267014
9867 92417 -91073 -113213 -208110 -34767 -168111 160342 -198867 -175656 -290363 -172912 -108634
9856 -108634 -79046 94675 -251552 115565 -82820 85524 22613 -408635 -6629 148004 -160346
9844 -367777 -241100 -99441 -189432 -222640 259819 -234564 -35070 -190218 -238202 418170 -194254
9832 -209429 160678 8912 -139790 13942 -287579 -271466 -67603 -52248 51514 -176530 296038
9820 -17072 10194 9033 176835 -327771 -15612 350531 -166161 56545 -295994 -164953 -236099
9809 -236099 -154664 -181308 142640 135456 -71568 90560 -240647 -49428 -47776 -53014 -107129 -93791
9797 -93791 326762 225899 -159391 -83281 -197212 -140343 95469 -78817 -207782 -8794 -93516
9786 -93516 -185027 246604 -420536 81982 115651 -187494 -22495 -218025 47989 142998 -291945
9774 13034 -334272 361697 285174 80669 -331472 230570 -9524 -73908 -286826 82177 67958
9763 67958 74680 -149858 -254936 -256039 196328 -22573 -154756 -48143 -51961 -24555 116202
9751 120486 -31359 -98216 423108 257549 245949 -262289 226194 -52636 -350613 -14693 -197476
9740 -197476 278703 7194 -104862 -300855 31374 -120496 -137845 -100890 -54330 -87151 44884
9728 -179751 -33655 29846 29835 -458218 -77399 -162195 -254983 7750 -34257 23871 94241 27456
9715 -163193 2048 -129692 -150087 -329955 525892 -137787 -135353 359568 53112 51804 -16583
9703 -986 146157 194103 -199716 210014 16601 -249156 -305660 146884 -38381 -208335 -86784
9691 86512 247050 -234888 -219929 -101162 -260460 -431681 -96463 159459 -98433 212881
9680 -79389 -186801 206254 -6375 -164287 28511 425460 127274 -388378 -96136 -89251 -148113
9669 -148113 -101219 -254810 78930 -59461 74898 -8703 -288359 -107798 -126079 -87235 117796
9657 170914 -12837 132121 -8967 51319 -146621 214666 -178778 -357806 -193880 23928 -88936
9645 -142113 -239854 80456 -5673 159068 -88080 -156206 -84465 -53615 97496 -120991 -83663
9634 -83663 -123697 -148145 -66978 287867 -72902 -18416 250306 -178025 -141058 -347801 -117409
9622 90862 79563 -34961 -380773 51958 -68316 -81957 -58482 -220776 -90971 139547 474369
9611 474369 103495 -66332 -188580 -122484 -124548 -96889 -22494 -177392 -54170 -189177 -81898
9599 -359062 -91335 -77028 -131179 -105348 279696 -367739 -184954 288979 -51381 -59640 -174868
9588 -174868 77848 44421 -376303 -121564 -13244 13121 -44072 -166648 -117763 -199205 -21749
9576 -200236 -378855 30732 -139617 -109006 -369229 -127339 -87171 15851 -175069 10665 66860
9565 66860 94037 -354398 177211 -72727 -79213 -206677 135458 -41037 -361618 54465 70851
9554 70851 -145347 46311 -232053 16029 68746 -113323 240437 -286934 -95102 -422033 -35140
9542 -78603 114507 180523 -379911 212357 26124 8689 123534 -95492 -149914 -22112 58334
9530 -178932 92459 -178240 -107586 -308340 82533 102972 -148189 153922 -55973 148768 119467
9519 119467 -355863 -99765 139343 -1865 -50267 -92919 189586 -92328 -247785 -22762 46952
9507 -63905 -51917 -172742 -197797 -236376 116898 102831 -98029 -83839 -52043 225468 -38318
9495 115065 -496563 -279730 -71782 -94093 -171925 -155125 -296618 -282380 100693 -96075 156286
9483 10554 111419 -194936 33164 -91421 59 -119525 223799 -112095 115433 -332632 -43883
9471 45386 -145444 469222 94025 -147225 -177592 -253300 -38896 55932 -246390 -41470 -78908
9460 -78908 -97208 -66670 -48797 -34415 -45617 -293115 125045 -249432 -52016 -215039 16587
9448 -79047 41113 -67426 -289431 -135838 -47250 -125160 -181732 -183141 -255090 -127627 -370181
9437 -370181 18184 -43809 -115571 -258221 -200140 -31713 -35992 -71257 26120 229071 -45661
9425 131724 -80963 -248749 -97836 -118976 104368 -127352 87792 -138925 -2813 -376402 88056
9413 -29281 -244327 -155019 -39138 -251429 -191777 -325019 -87931 130339 -42635 74864 -100781
9401 34126 -262013 38934 -253289 84617 -73447 -167011 -186964 106796 -22103 -7933 -2128 -117274
9389 -117274 -290899 64444 -260393 -205320 -48821 -254123 275728 -279634 -136483 157280
9378 -82885 -102665 -181434 51317 -29028 -262931 493840 -180396 -305252 -17596 184277 -164199
9366 -43674 -35458 116105 -145966 -283612 -217280 -16561 52027 73948 88389 138480 143862 75339
9354 75339 -278060 284258 31637 -244449 219589 204032 143927 58381 -51003 50980 -9118
9342 -293909 62950 -241251 -167403 -170393 19024 1827 -183217 -239041 46212 -172593 102295
9330 -211222 -87303 -174879 -36680 -36401 -75836 -77903 -141678 12897 -262670 -154812 -381450 -149143
9317 -166371 151315 79498 -169355 91263 -196566 -135130 -361487 -229063 16739 -1802 -100382
9306 -100382 -318969 -319554 -57529 34911 -288435 254833 215430 66814 -17581 -129377 -2501
9294 -191407 -93871 49012 65276 -159642 39188 -417794 12323 -248189 -113275 134087 11804
9282 -39110 -112378 -137937 -78786 84034 17227 102302 274459 30020 -28651 -27090 66737 -196058
9269 -276929 12889 25037 -58004 -185275 129137 121301 -125551 -185727 -89678 -29465 -148322
9258 -148322 166375 52344 -58257 -261460 194206 -294253 -109702 -352366 151960 133548
9248 133548 -168337 -192777 -39852 25714 -406652 -18730 -102463 65500 -103783 112428 -19228
9236 -33643 44146 -207351 246365 63242 23442 133508 1783 126501 -101849 114573 -57189
9224 -392883 -320412 50389 8335 -215168 -154768 194918 79479 -69176 -139453 56434 -123144
9212 -37405 111102 -233969 -355038 205203 -63626 -155941 84725 -156185 282385 518719
9202 518719 5883 -99948 123028 121294 18502 -39308 -94479 39491 -137815 88752 147395 55865
9189 8125 -419718 -30520 224788 -58875 -255386 -59817 -88320 21500 -341434 89887 263950
9178 263950 12479 74443 -53695 299161 -117164 -23601 -216875 69076 96891 -14138 -161373
9167 -161373 -236896 41273 -191943 -92190 132197 -66882 57503 1889 -218990 -104475 -251001
9156 -251001 -32503 -140198 -155471 -186650 -44146 -119121 197750 -354023 -42507 -191721 117804
9144 -197045 187714 379626 -54092 -156239 -167 -213901 102688 -20043 -234455 65676 -228432
9132 222200 227737 287709 -79845 -135312 -101452 -290782 42630 88344 106576 -69791 256255
9120 -226881 194349 -265851 -146517 -56511 22304 -20918 -32021 170572 -27479 -85661 153259
9108 -87063 15774 -170703 -195554 151187 -242988 -267320 -14048 125499 -383120 -198137 16349
9096 -6706 34204 -35726 184859 -192116 -41007 145642 228025 26060 -36840 152600 -202643
9084 -257417 220212 91984 -153325 -46033 -26376 -122140 -158817 15761 -171168 -129782 -100709
9073 -100709 -285540 -78798 136482 -172580 -161176 -163500 -93406 237898 -128540 -10917 137323
9061 93 -330271 -125837 -227014 43100 -90278 -11075 -98341 -67457 -229542 -50630 -225449
9050 -225449 -369503 -10315 -8637 350812 94828 -28290 165011 -7602 -267924 4423 -190230
9038 -135118 -187859 29548 -84297 -202683 -194251 84947 -268355 -8338 -108792 -203171 -41635
9026 -126673 -212187 85550 -19607 45242 81905 -21955 -290919 20726 -305811 -25308 -96176
9015 -96176 41518 -131848 -127082 -15944 -184940 352911 -141628 123252 -111928 90502 122384
9004 122384 104003 -190451 -86339 115356 117133 -289882 -359253 -83875 -68031 -233274 212260
8992 -91401 -20280 5740 38305 -319827 -174797 -169129 -202186 172474 35097 -272616 65895
8980 -267075 -27722 87896 1147 167591 145705 100587 -119731 73655 -294046 -60898 -323833
8969 -323833 -329460 -54756 -170367 -206463 -164408 -156332 -219478 149958 -159418 -7895 -19340 7951
8956 -165934 17633 92682 -161073 69871 -165549 -275447 124695 81967 -189021 -204021 -191658
8945 -191658 -97394 105605 50214 115854 -7881 161426 -1862 124190 212876 -107159 28204
8933 -145845 89063 -66521 -71675 -33893 185518 169390 -31158 222109 -237323 -61756 30958
8921 286186 62681 205244 -240149 12897 -115247 172775 48672 -42331 -99127 433065 -107374
8909 200617 -131763 193730 -218276 -220969 142882 -24810 25986 -127170 54388 -128573 72246
8897 -155393 24933 -108044 -545 149402 -220706 -86228 92265 114845 -103439 -300325 146190
8885 -100189 283040 103326 -180679 -215380 114497 -181349 -61583 162851 -173022 23569
8874 -294430 -291319 -263368 46634 161548 -180126 -68147 -185616 6942 -254146 340814 -217074
8862 -241110 16876 -357777 -62397 -84627 156263 284252 -44923 458400 228129 292815 7392
8850 -86266 -67458 -101176 -131647 236005 -14305 21711 -322771 -83160 87044 -134501 155018
8838 224006 -178280 -54196 193095 -43064 -129720 84900 -59735 24510 -65411 -386760 28048
8826 -72145 -124204 -64455 -23919 -93876 -167617 -294617 54862 -35764 57526 -174816 -225606
8815 -225606 139199 -245917 107216 -219656 -111113 -130892 -170875 -65693 -346235 -411849
8805 -411849 -30526 172259 198395 155412 337463 -10278 -82004 218838 98048 157383 -141402
8793 -10349 -225901 -123706 -112084 -146994 -153893 -25666 -310724 125086 -206083 -337545 -100058
8781 -166261 -422814 -295242 -134115 -471 -437136 139334 -27767 263646 -69311 -191804 -47460
8769 -436691 220400 -81233 -355717 -215129 -251357 -35157 -123238 110324 55426 -197498 -125462
8758 -125462 -29538 -110765 -55328 -210176 -44513 71625 -160007 -120532 -160415 -197905 -81255
8746 -188015 -7854 -185919 -292858 -264715 -2913 195144 83158 -74575 -38688 -186596 372010
8734 -60748 -304853 31627 88820 453273 26219 72366 100737 -27870 106289 -42789 155507
8722 -219274 150874 37623 -253127 36641 -264794 92999 -63290 -406160 41964 -69337 -20612
8710 -16660 -87551 101782 163499 -109928 -124021 213741 -29731 -1923 187911 178863 -200622
8698 261946 -107056 20647 -77451 -26068 -4790 57003 -193063 -205484 -75887 112855 -246713
8686 -17648 -279315 64470 88755 132401 -108174 173507 -413365 -281656 -174506 -78163 64490
8674 -205424 -175111 -241577 41817 -132469 -39965 -133455 -335320 30058 136380 168091 -142401
8662 85063 73444 143215 -18062 -221066 268070 -233635 228878 -261111 -59003 -172945 98399
8650 -14620 -260204 -145921 -220598 -128908 -124255 207002 64480 -284008 -94379 261458 -112918
8638 -101035 -36205 64112 42320 -282954 56665 -301133 142432 -43241 -84893 -134707 98335
8626 -139023 353872 124002 -137643 -16263 -76004 -156289 69991 26146 27047 7633 -371077
8614 -163617 -19581 -302241 25142 25821 -31514 -117432 -252611 -100268 44582 109784 -84920
8602 -36344 -275623 -81401 35579 178130 -213764 -213189 -252762 -4356 108707 240006 144816
8591 144816 -123670 -134770 240728 -85290 -335846 -114994 -63053 -317641 -54365 -181750
8581 -181750 -50643 -253409 102053 -61017 20744 -333982 -156971 319760 -206321 -53537
8570 -302409 -213551 46718 -149810 97723 -9570 -10948 34779 -364322 -305080 -24409 -312090
8559 -312090 185402 -58546 -37450 95972 -256945 -78736 -126260 154548 208100 -337398 106054
8547 -265658 24595 -9340 -251970 28924 65816 -70855 198375 -185491 -241383 -116681 205051
8535 241949 60413 -86256 22875 153789 43583 -147049 38363 -148259 -81982 -213971 31085
8523 -215505 207660 -370939 -83809 -214068 -178466 210958 -54697 110363 20843 297814
8513 297814 18103 -135330 150418 -93340 -86295 -232698 -345079 -208707 103504 -40875 20986
8501 -122960 320713 -127541 -176660 -370097 122667 -138073 -170865 -5076 214079 101673
8490 -313652 -127555 303520 -327275 -20850 -393577 198166 -144755 -223206 77946 137182
8480 137182 -79887 91630 -54221 -324791 -25941 -152417 -387923 -267880 136045 -264860
8469 -12659 -62965 31846 183163 45922 -314649 -19961 -88231 -164368 36276 -320031 -25729
8457 -89967 -73261 -47719 37970 -20601 143578 8472 -347773 -115277 -262473 -229091 11287
8445 -185518 -408644 -203552 132953 -37759 42284 -5915 -129963 157841 76206 -184504 -152923
8434 -152923 -136208 46845 282999 -36392 -72093 -102647 -4680 -69776 62276 -145389 -184703
8423 -184703 28069 60550 -31506 10350 -40071 -112412 260166 263699 30238 -81835 -93020 -30997
8410 92171 -354556 -13719 -401854 -347828 2794 -81572 -45356 40755 3612 -309461 -60468 10947
8397 -54671 -135474 192119 300046 -202350 -222852 71156 -92842 335157 83522 -177217 -136768
8386 -136768 -23427 47058 -102090 -60938 173267 -52502 100085 102538 -58180 -30267 228941
8374 -224978 -215041 -268518 -81810 -120067 -153489 -65194 80617 66571 23369 -221608 -265031 -144881
8362 -144881 -42599 -173831 71991 -18543 186506 -378871 42638 -120193 -72284 103984 86863
8351 86863 -211593 53596 -99796 -5213 65342 -269509 168117 70481 -267517 -64603 10087
8339 174293 -96272 128036 -62830 25252 64574 -9948 -28902 5618 -31426 -123681 100942 -190722
8326 -58078 656 63537 -33175 -27040 201609 -335362 -236432 315066 -235493 35178 1828 -166649
8313 -47342 -126435 -133970 44367 23001 18621 114454 -41596 -55077 -9534 37662 -238152 -298823
8301 -298823 -117160 15252 -62190 28303 -91835 -189946 -67656 115168 65147 18754 -217091
8289 -15194 -81937 223133 -1634 -227012 73901 315821 -300617 -297766 -76354 -43482 148563
8277 -331853 -95049 10651 25427 -96795 -232879 -173389 105317 119091 -35714 -197875 86346
8265 165629 -119921 -182137 350265 49757 120215 92128 55394 110202 111291 28535 -115365
8253 -15763 -20947 -178973 227098 50949 159260 24659 27668 162276 -101908 -18828 -195366
8242 -195366 -243484 -75941 -12226 40045 -246086 125431 -9260 103222 247589 -39503 75449
8230 -19044 141297 -23524 38084 171605 -119499 -355948 -6246 171341 -297550 -76064 302288
8218 527649 -439872 -250735 167128 -49471 -131123 -73281 -137835 128242 152078 -209949 106733
8206 92506 -90774 -116179 -334165 -261494 -93455 -60289 -237796 -331653 123287 100688 75724
8195 75724 -128280 -177865 -68372 115112 -204129 -255003 -188516 -77232 -220245 -257167 -25270
8183 -99027 -53613 -491588 -147944 -20512 -116435 -28275 -221622 39497 -382785 43831 152156
8172 152156 -226103 -234622 -158564 -98590 -223788 65461 -336006 -306023 68925 -284680 225150
8160 -162397 201817 -209526 246195 -105696 -64975 80632 90473 -274368 -13700 -77021 358378
8148 -225256 -68171 -245549 -60398 -77579 208293 215353 -295302 29871 -5163 -119278 -243773
8137 -243773 202794 79956 250520 222510 -234547 -96228 -229021 -13849 17998 -259908 73698
8125 -57926 175326 -186110 -65697 -112980 -148818 -304745 -24217 -107645 -52773 -23156 110683
8113 181328 173375 -81647 106127 -42213 -82745 119199 -421903 85679 -11292 111926 -65271
8101 -45403 366257 99581 328541 233102 -72209 303409 -113039 335272 95340 -3488 -22253
8090 -22253 -200383 -357809 183220 -80112 -154689 30274 -260408 -97224 -77683 132227 -3864
8078 -124796 27669 8685 -110329 99697 -81133 -87489 -91178 -416149 186002 96863 -226884
8066 -239356 114204 102850 -94554 -46484 11775 -288775 40070 -315642 -234632 -69580 31415
8054 -83984 -67446 -207559 -240480 -186442 82848 -311369 -8047 1753 332 -62214 -281857 -268379
8042 -268379 -182993 340535 69390 19127 -369767 -226476 134517 61324 68297 -132530 357595
8030 52037 -454833 63132 -11686 -5263 -48819 -294182 35380 112989 76498 -107520 -198916
8019 -198916 -175426 -423983 -127520 75374 -193434 -105420 -210415 -131205 -16104 -475084 245718
8007 282361 305798 51603 -32126 78932 -120574 -6063 -210545 -196187 233670 -16778 -32774
7996 -32774 -148222 3321 -288424 106806 -5752 155054 89559 -2088 -40814 46617 103469 9168
7983 -80460 96677 204789 77730 71587 -28850 -114175 59590 -3914 29458 374872 -215517 -139130
7971 -139130 -12288 -22783 192573 -134365 177783 -246950 -138797 -170343 -229157 -128094
7961 -128094 83187 -29756 -404359 100105 23768 -28155 173189 -145193 -143629 -193434 -149320
7950 -149320 232834 -139507 -3493 220669 -102762 -230467 -71074 -95077 2477 -37885 102015
7938 -302785 -215066 183823 69553 17305 73847 -188544 53526 -207 69771 220977 -61283
7926 -34689 279926 -127960 -67028 -132213 147780 41873 20959 207453 -59233 51906 7240
7914 72868 -329308 242180 -107381 4294 -294686 -75199 -53740 54092 270634 -122110 -290490
7903 -290490 -185174 -217115 21683 139926 -102304 27327 148679 -137073 -239738 134774
7892 -175682 -315487 36155 -79719 62252 435205 144302 -97950 -172158 129357 46098 -83830
7880 -182440 29108 -147927 211028 -166028 -241877 -158811 -132304 -35257 99776 151995 246330
7869 246330 -172348 -151738 33524 -66100 -142960 -6723 -165735 30668 116395 142535 -118532
7857 28941 -317491 -104257 -259241 113827 -111971 -156069 84131 -13302 82497 373159 7672
7845 -161471 119506 -200395 -266391 -75478 111114 -126016 -188056 -60731 -41604 -301293 -90589
7833 -73144 -90911 229860 -129205 210177 -55580 -103427 -209709 -280862 125085 -276864 -113660
7821 -166520 -300443 -164000 -72375 -72215 -241688 -30338 -80827 -279228 110797 -38179 -183124
7810 -183124 124192 -17440 260925 92582 -171561 180986 142592 67749 145567 263397 -127891
7798 -79221 224866 -137125 -7573 301810 -94847 247470 10708 25725 -108187 -285813 69822
7786 127589 36600 -163418 -180856 280723 321846 -298832 94297 128905 -24972 -38374 164240
7774 -121449 -227299 31979 -1797 -45049 -261570 -244718 341448 131451 -313088 164151 47910
7762 -86953 87621 -191002 -326920 -318252 -161819 282410 -61253 221717 -150710 -470224 -253337
7751 -253337 65892 -50056 -111440 331948 -328688 272733 -86978 -30920 5603 -195761 160291
7739 -156919 57398 -413474 -132691 64140 -16929 -66233 -82308 -90467 15977 285658 -163029
7727 -21595 66431 -92297 158518 -254488 -187374 195999 -17253 217503 -17606 -147813 -14560
7715 136989 -55701 90826 -136406 -122931 -40452 68443 82870 39385 40165 -140848 14596 -423203
7702 149594 -52627 116439 -11793 -73477 -22633 220500 25196 -167404 121986 81320 -110419
7690 -96889 -179667 -197767 27213 -76611 -19110 352138 167054 8841 -23165 102242 -110058
7678 -7454 -54857 3266 -41366 -144752 -273504 -2614 -258786 -83361 -218785 18067 -183821
7666 95465 14412 118548 -216242 -129417 68771 -10343 -149517 -56273 -238153 -146088 128615
7654 -530122 -56691 154399 244492 110096 -335994 -193521 19265 98402 -187828 68040 -440824
7642 -554 -24690 -1005 -29076 91626 108744 -51419 -105394 160221 142396 -92226 -230041 97774
7629 -894 51934 -112534 -67039 -271570 -89374 -239959 56029 -96766 -146639 -32115 -154692
7618 -154692 268961 5692 195591 29379 217546 53958 188273 134595 -6322 -178715 -134601
7607 -134601 -180568 -267314 196410 -183755 -70167 63322 -135110 -173477 -148553 195603 102136
7596 102136 -58573 -236943 -21707 -152431 133153 98576 251360 30277 -22800 -94947 -256597
7585 -256597 -4588 -229469 -112208 -245098 59844 -104404 178328 -91389 152586 -60817 -113737
7574 -113737 195782 105541 -233461 98067 -135597 183087 -4020 -160350 8999 186394 -182675
7562 -162257 -94746 14522 -49427 192377 -40395 84167 -322755 103949 93545 36458 -239168
7550 184023 -13866 78064 -155298 -27807 22494 75376 -84244 173283 55346 185167 -62580
7538 -114422 -74585 -61328 -303847 -47385 185339 205552 -280758 -355475 -330384 166020 38114
7526 343196 -72421 -51784 245133 98586 43311 73083 -240555 50447 53666 -23666 205345
7514 -17859 260710 33525 148419 -190169 -138979 206431 -124226 232015 223518 204959 -79977
7502 166719 -286376 -191479 -107397 -228832 230861 169694 160934 -38144 -549398 -247592 -211758
7491 -211758 -137255 116172 416394 231229 65060 -224459 142833 -37380 -11237 103123
7480 -153950 60617 116670 -255366 -230884 28574 -149796 -70136 -61643 -100482 160462 -52209
7468 129325 10141 -109953 190840 32327 11011 -85721 -151003 409230 -13942 -86719 14899
7456 -139590 51689 72244 76507 123613 -59591 -85562 -62279 -84407 -35025 -57461 145334 162310
7444 162310 -39475 -75782 -196105 -415622 -92597 -229073 -75866 158580 -153167 -319933
7434 -319933 -19209 -106241 402759 51061 138018 -126295 -83249 -20468 -17867 68390 -252380
7422 284556 54241 -84245 62238 106033 44232 66351 38231 14647 -235353 18337 -140360
7410 -92443 -118040 80592 -287491 -407710 253877 61031 -98358 -167332 -314511 58978 216463
7399 216463 -178320 -127720 125065 113377 196162 -258357 6066 343790 29161 -22595 312575
7387 -347169 -33957 -5707 208175 188015 254458 -186884 -91155 -206636 60298 -231214 328982
7375 -38618 78071 -37377 -326164 127596 149065 -67953 -171362 23257 166481 56501 4634
7363 -18256 -251396 -21157 312933 -23110 192143 263270 58233 -222271 43488 -77956 -76564
7352 -76564 -13222 -140714 92657 -119116 -138566 -175425 369193 166153 300618 14787 133332
7341 133332 230915 269340 -51557 -38788 -336956 -273850 -7087 191302 -80524 166588 -15281
7329 108490 -88410 266292 -161963 68574 -72973 -292252 -146784 141299 19287 -181108
7318 -57951 30078 89637 -5724 -272675 77629 29889 -157706 -117410 -318326 -140512 47312
7306 147825 -37117 67677 -189012 5151 189258 -28490 228651 147817 -84384 -206951 80896
7294 138335 118824 -41485 -117440 -307920 -107313 947 -69791 -151877 191952 2046 195160
7283 195160 -91339 -169312 124356 92485 -199041 -47717 -140246 231654 8927 -1348 122168
7271 34058 -257767 153535 80219 -45574 -140332 59862 413704 -300613 -6872 -208277 -34508
7259 138236 -162864 95746 -62318 -218070 79258 -302789 -18647 -103399 79703 97441 91651
7248 91651 111921 49710 -117435 247185 38389 -3612 303072 -33482 100949 -25701 -349452
7237 -349452 -175928 -258962 -95643 248017 156636 114375 -94220 86435 202017 -41511 -137605
7226 -137605 179742 -124956 174853 -60579 77708 44961 58390 -267781 194048 13060 70119
7215 70119 223629 139721 -124602 206392 -54708 -52369 -129050 158410 -27444 5565 -591931
7203 -109875 217455 66230 -96798 -62205 124544 -52640 72966 -11706 -143498 -393076 -255889
7192 -255889 -136820 -84152 134192 -292187 -465941 -173663 -17365 331683 89831 -218272
7181 -109968 198475 -85471 -260332 128815 214393 295803 -18162 78351 55680 190173 169238
7170 169238 -89570 -154824 171822 133476 65076 50056 111154 98706 -92011 -157655 -115733
7159 -115733 133735 181857 -96353 -137658 176897 -413688 -95235 -59910 235006 31237 -253988
7147 -36537 -68837 -6146 -102586 -251929 176319 81626 -79470 272085 -96923 -56376 120959
7135 -73375 -160678 -218883 173831 -61628 -111134 271986 170224 -20518 -58079 109443 114192
7124 114192 -74471 -150346 33886 -31600 -489032 78564 9916 -66618 -384476 -148065 11973
7112 -16255 71309 -135553 277472 19372 -344430 32046 -122855 -128351 -305837 125310 112809
7101 112809 63323 187778 -159462 52897 -232689 93590 263375 11819 348525 21616 173486
7090 173486 45677 -32046 66489 -85067 -156020 -156415 -70546 -243885 -428429 -15159 -6371 -406335
7078 -406335 159645 -223029 314463 -261921 -235244 104251 31665 -279073 -41315 8567 -76899
7066 207931 250311 247813 -128566 167553 -233502 89070 -145143 -102321 25721 -44997 172070
7054 -79660 -190418 -234326 -183607 -221160 -409490 27667 -90194 -125090 -90336 171139 -315734
7042 -56497 176098 100606 77570 54842 99065 -42473 -215081 -150419 210450 -10584 -129641
7031 -129641 -60096 39309 62622 155580 -238431 -376737 38987 56271 -173680 -258478 -53048
7019 182886 -171588 -484953 -11607 -70936 163708 -198365 49030 89031 101973 -3054 110389
7007 -103940 233059 -135573 136239 -257989 116907 -7264 104202 -218005 11722 -130646
6996 16601 -167419 16743 -22602 417069 91299 -42658 -186011 9010 21484 -284139 195000
6984 -243874 -69187 -65419 178596 227859 -24528 -207256 -63575 38409 -51530 -150159 255019
6972 -146622 -60493 -174094 198294 -45645 69819 -127341 189024 -100176 201207 -104902
6961 3626 -251553 -229274 -324897 175886 124073 -168801 167234 -200357 16938 49624 256833
6950 256833 138076 2151 292973 -97211 -12670 84101 29066 -106526 -349605 9216 -179949
6938 -19572 124284 -220786 46484 -174636 172221 210461 56093 -309422 -83698 -235725 -124214
6927 -124214 -128503 -189471 -11058 -222458 190715 -54858 96461 -24946 -59911 144792 88997
6916 88997 376186 98373 -163581 33109 246131 140494 275479 96355 19452 236623 -57578
6904 -98486 -291847 -50308 80083 -175797 -110366 -68485 85305 445221 -8797 -72510 391889
6892 116321 158771 -114410 -145491 187359 -87010 -132074 -284828 148912 -293617 -199817 162927
6880 68812 -368994 64185 452921 -212673 98647 372481 -179176 54451 -70977 -264778 -238702
6869 -238702 -36375 109601 159509 -56965 74212 -110775 -300894 -325564 -102579 77128 -234931
6857 206316 117463 90820 202175 -309877 -54281 -66729 -53700 -19777 203317 45480 -65712
6845 40937 164598 93520 -24556 -243480 179442 156839 -21790 44063 -11860 -252606 -160667
6834 -160667 -240771 -214729 -33059 225497 -228549 -158136 134121 126601 -89857 -65909 53435
6822 -210715 116544 78830 -53463 121226 -138628 -17498 29553 93988 -69346 -105416 -146570
6811 -146570 -73035 115798 -30101 221316 -174829 147712 -362063 -129996 -180086 -388064
6801 -388064 70118 164990 123273 -20280 3471 249069 297538 175419 -6558 52254 117458 148121
6789 148121 -98468 127144 -19494 15186 -242226 -157931 -24498 -216641 215402 196482 -145454
6777 -97784 -86844 -170045 69335 56780 199117 179206 144573 -190026 187715 -15255 -18753
6766 -18753 -316030 -184539 -173991 -103489 233130 -147196 -27561 -208106 86628 -322209 195717
6754 36501 -150940 -74407 129780 -36720 41308 61111 147795 -71294 -278101 119753 -70321
6742 -264804 27896 156251 -319153 96552 6169 -258134 62687 -111125 -117553 -69017 -118378
6731 -118378 153930 212754 -110208 -137101 -357895 20903 -176623 58017 -152363 -87238 -249624
6720 -249624 13838 -37519 -120802 -100213 -62095 -126335 186925 -58107 -126414 267238 117943
6708 64163 -141440 128848 -140400 123363 -160051 -10340 54749 -83480 -7865 -126958 -256676
6697 -256676 40838 108574 -102937 -191015 257980 228081 -278165 -62770 164501 -7064 68906
6685 2249 -420780 -74839 130068 -116256 51139 233436 82334 92589 -130331 -131347 30878
6673 -724 124921 -47255 -77318 137528 -78669 70417 -139007 96801 168625 13675 -143697
6661 -86922 -326493 3800 -304885 130520 158948 56454 215206 169122 104310 65830 -171381
6649 -33527 -291862 -45090 -163177 56901 -105391 102382 -93335 78927 -119355 45544 34490
6638 34490 -119920 150050 121621 325410 25537 101891 138014 -226307 10969 -21465 -266413
6627 -266413 49429 -186216 -183063 -6253 -91699 -95792 -142919 93783 163351 64618 -86292 129609
6614 -238105 -97843 -202520 -165872 -75489 14493 -283782 -10123 206662 382716 17267 -136365
6602 102253 -256140 -285143 -48387 168204 -213457 -170497 255176 -13820 -149101 87944 -44365
6590 163633 -129437 82379 -75966 -147270 -35818 -18991 -11361 100371 -109165 -209551 -63135
6578 349164 247713 123148 146247 8463 149878 -267428 -267173 204412 -85412 -93004 -167230
6567 -167230 160468 215320 108265 -244517 206483 -127840 -65061 55588 -218784 75822
6556 -129629 66928 108806 74600 195507 123195 -50431 37847 -90212 -50536 -178274 -257154
6545 -257154 -112160 139556 302092 117493 -125365 300798 -66949 -133456 -178053 -215049
6535 -215049 -141452 -60587 9042 232445 222087 -20157 -116989 3663 -231830 -144241 124170
6523 58615 17963 171250 332828 -99201 -27043 -10325 347655 -215031 -96732 -77072 -67030
6512 -67030 155462 520 89593 -137703 -269164 13452 -34372 142832 -22612 -166774 -135653
6501 -135653 -103882 -111892 -176006 -81050 56051 350400 -48685 418961 -65380 35197 176703
6490 176703 -169831 133528 -127788 -182387 -50649 228990 -148212 93698 102949 -139953 -79324
6479 -79324 44207 -78182 50736 213878 -61930 -118283 -208737 -293508 -145956 -120213 -505422
6468 -505422 -127224 -42697 -194727 -53963 -105658 308685 56566 -94608 -76446 -59964 -43127
6457 -43127 -49334 58097 -200342 -177835 -228068 -45736 -27220 7099 1206 173109 8819 -134599
6444 -281044 -23467 376935 -12415 -193362 273403 -61870 -9642 -21865 -252048 -119802 -336591
6433 -336591 -125185 -167130 -79518 72152 80937 -305314 106712 33956 206613 -82266 144027
6421 -62099 -39362 85178 -164464 71632 198569 15542 246911 -168240 -29906 -55764 -116878
6410 -116878 -120155 312270 118409 340370 -52334 -191638 -65826 -383383 -135227 -584 -177874
6399 -177874 -25133 33352 -3674 88119 -268672 -117369 -13820 28359 60257 245000 -165809
6387 -250104 -467908 170803 -89796 22864 -171002 120917 115341 -11973 12915 209640 -214816
6375 73919 -149273 -298203 102771 -44829 11155 98604 11875 140186 -170171 145573 7613
6363 59988 189492 -64638 -179539 -73790 -98116 -2681 23072 312304 -178779 -387247 -111570
6351 -232781 -41813 184885 -145294 -140770 -304476 11395 -115519 312634 -21673 52725 -1511
6339 -63054 107675 -278400 -31653 -41639 63896 -19992 126739 -122529 -18645 -299434 147271
6327 -75661 -338363 216330 88145 93250 -229409 -132937 79323 -48227 -72844 -38542 164489
6315 -68840 271239 186077 -66396 -257613 -28375 -138375 -41903 63600 295637 -231572 -243151
6304 -243151 -67413 -231806 -64513 89208 240201 -11420 249281 76475 -63344 34101 -38990
6292 -289992 76978 230399 -182898 -257904 -275715 45261 -71042 100041 69385 -245303 -241980
6281 -241980 -30913 65684 -347058 22504 -19277 -122863 -224008 -108571 76739 -89857 36051
6269 198598 70272 -308553 -168855 -50012 271148 99275 -224738 9543 149235 69629 6874
6257 -131300 94459 73585 308694 26325 -184588 144571 193605 22623 -195177 1449 112114
6246 112114 129336 -138790 -106208 391931 21677 72040 -222363 -217032 36073 -48244 216172
6234 -262956 139406 290034 3430 -162714 -46532 15697 161285 76836 46162 241163 -239977
6222 123418 251675 -239875 -223513 76584 -52646 212712 -184424 132026 100526 63141 -151271
6210 215733 -36738 -123138 21726 -11072 47027 129141 52996 75553 -114897 -192871 -87574
6198 -240400 -108228 218055 -65266 187661 37869 167745 142855 337803 -103634 169715
6187 230034 159223 166392 -22231 -70045 185374 62627 -31077 106944 93541 -139326 -55888
6175 10633 9507 148542 67926 32905 102963 -41174 291291 158164 -168337 -283622 143832
6163 173586 135216 -69173 97449 84273 361931 9269 120270 58864 -8127 -10571 109896 -210573
6150 -52671 -36466 -120040 177418 299966 147821 -198017 -91912 -261078 -173939 -139549 -170955
6139 -170955 -76759 228526 24520 -169846 87049 21511 -204714 104763 16848 255124 -115950
6127 34879 -155517 46138 78430 247847 -491410 -28999 114689 -31113 3275 87419 -131196
6115 208752 -344541 -146439 35718 -78041 -50672 -273290 -41797 31713 453549 97350 -70613
6103 -105128 87375 -185594 -2333 6232 -155921 5871 74463 -322622 2801 -106135 -439146
6092 -439146 -32263 162158 71500 24703 122592 31370 -458195 11290 -167810 -50418 28220
6080 -47239 -131802 10864 -60180 -8292 -27225 63516 4143 52262 -25889 -63388 -11562 -114847
6068 -114847 17617 130273 110075 -204220 -90528 -4255 -350517 -190754 98976 226160 122241
6057 122241 -84931 18744 -180397 -131338 54926 -219440 174085 233257 -121615 -203721 182089
6045 -136113 -74354 -179392 -16687 -72498 -106151 32337 -63446 291870 -246046 122472 -23577
6033 324103 87571 -312954 -92005 -37280 287553 159225 208803 -153538 -169647 -182306 -172029
6022 -172029 177663 245472 208487 -54420 -269191 -234688 63225 42895 -104336 383915 -230277
6010 -139344 133227 -3909 148074 259684 -112985 -2715 -283518 104947 -42420 -349971 -96928
5998 -8240 73552 223715 54507 76065 263340 62569 -96307 -22439 -285789 52099 -164862
5986 -60392 -89192 21550 442378 -151208 295504 79570 -17058 -68856 187043 242772 5749
5974 154327 -174402 -134137 -286965 -97937 -219220 -6554 -198332 -182255 -22811 9943 305583
5963 305583 268729 73932 -228716 -74100 -270118 -185628 97775 189089 -63279 -159289 -43985
5951 -3929 -462096 -227717 75957 24823 -272141 -79363 216454 28710 142957 -108347 -109273
5940 -109273 206598 288193 25864 -150848 -37975 -143963 93094 -283805 -116171 53504 268940
5929 268940 -41391 -42926 199040 248893 32786 -35211 202488 365581 30116 -4599 56471
5917 -118050 177073 70843 204733 85569 148582 -128750 -202757 6463 179817 221621 -22257
5905 108692 -200561 146340 -236356 -320387 257115 388923 -114733 -37453 -126150 196866
5894 201546 -275234 -64809 89241 -138846 -171420 -101574 -67411 -12733 61046 -123288 10133
5882 -140955 96937 -320149 84864 105308 23219 -181083 93447 161013 -49901 92698 -255019
5870 132987 -258229 141709 -114180 117429 91228 138695 34678 219114 414012 -31799
5859 -118506 -173293 -208040 168382 401509 104930 232678 171450 -259760 -190706 165335
5848 296635 171344 -149761 -218486 408932 42150 141118 86260 44426 -73655 -185514 310640
5836 -84543 278227 -294591 33021 -321371 2324 -27812 -160050 -197733 41695 -130568 -34406
5824 -161240 76040 -42638 -60571 121352 -4103 -11251 459795 4634 -71928 -79085 -84038 27179
5811 -90215 -119938 7829 -93140 -356316 -62702 -6028 3236 -70883 122585 173338 103970 -91522
5798 282318 -359987 -19748 37516 -145165 117478 215180 -271877 -272579 -116163 61241 -123205
5786 36473 315271 251478 6470 -228435 -32414 -121002 72098 219115 73531 -42151 -257719
5775 -257719 -297735 -43539 39585 -267535 92616 -179823 -130460 -281678 14060 -196816 -48502
5763 20325 99217 -18773 -40200 239700 -203963 -113754 -127421 -228844 70549 -45416 -50332
5752 -50332 201331 -103578 234209 8817 -109536 271286 346018 24614 -165172 243211 -66847
5740 98787 173575 311769 13495 156520 58256 -73404 -334638 950 -113688 262055 -229983
5728 5448 446786 224956 32860 236703 18294 34884 77181 -24020 -90996 -101133 -3694 -42191
5716 -42191 122691 158372 -377419 -62039 -100834 41008 -120222 199933 9994 272279 -216336
5704 -134644 -53136 -55198 -260475 20328 20603 -53228 43265 -216016 -238533 69179 10024 293328
5692 293328 33989 -68609 -275480 89953 -9003 117694 -169836 38072 -218649 52347 23217
5680 -34063 81924 -50227 47677 -17671 141316 182784 4685 -156520 -7427 -287211 186637
5668 265235 178131 247735 -145757 -61065 -96853 85737 -402122 140654 -12625 -52128 -154632
5657 -154632 173176 -60695 47731 -262643 -27826 -25022 99295 -187465 -174599 -154397 215819
5645 -156402 183240 -190066 -32583 60092 -40886 114285 232119 25114 300532 85073 261651
5634 261651 -28474 -94390 8544 -148084 163718 220156 261131 -79386 -16809 -230148 -219001
5623 -219001 -157419 -36087 20359 12178 -278455 -55852 -42647 -177655 303493 -51676 -266611
5612 -266611 46035 192429 -182084 14481 -63767 -49774 -49139 -226132 17771 -215074 15093
5600 40545 -207655 -38281 4191 117400 -37514 -14576 32689 -159833 197770 -177305 -36774
5588 -70205 100726 132613 -7503 50256 -53809 -196443 98002 187734 -22155 -279933 283492
5576 -141624 154307 156464 130941 -152191 -59777 163003 -45749 -14373 186884 106093 -118206
5564 95158 -133813 209118 80396 -99978 791 -17392 249279 -3794 -170929 209556 -193705
5552 -203015 -49159 -62694 14907 17619 -185510 -185587 -75981 -190975 279870 -161509 -157209 -119538
5540 -119538 -99488 342357 -91368 389369 -53500 59490 -90335 -25869 -99470 -204832 -70280
5528 46907 89204 213828 -4181 -35310 80726 -102309 134890 111131 -134713 249045 -240743
5516 15176 -16805 14868 31350 152708 -140074 117739 222906 22487 1688 -207397 164922
5504 -23962 -56304 -162541 103378 253701 84832 240214 -14125 -123808 -139448 156516 17187
5492 539342 47621 -15616 25061 -67265 135532 -39271 -188099 -18547 -19457 -110520 -107452 -68774
5480 -68774 -74740 271977 -179017 106325 50322 158224 54989 131430 139899 205063 1779 -65165
5467 -228316 -207641 296045 131139 -67893 107781 407277 48800 13736 -201068 86656 165341
5456 165341 -417141 52779 -381996 -117865 139481 266055 141148 84853 -117066 134033
5445 65727 271571 -5115 -174336 47811 -12199 -134478 205426 204981 -138573 -395892 -35398
5433 -190840 -161857 -63785 -266308 487304 64657 7443 -157456 -109791 -137943 3251 -134290
5421 195516 -153334 -273865 262913 63863 138999 43056 -146700 -21252 -252773 -35077 -10393
5409 222470 -21931 207857 85827 -164735 -65013 121310 154892 47734 -164855 -145037 -37515
5397 -140146 81917 6814 148948 -21444 -94368 -217303 -11811 -149109 -45075 -48908 52481
5385 -56714 -105757 127349 -38216 36549 108350 -89737 -261309 -333639 -74370 31877 251788
5374 251788 170153 -408524 136276 -8652 -85032 61264 258 131230 58737 -74299 314631
5362 -7243 99272 57238 97515 191717 249042 133513 -16197 -279090 -483732 259909 -229223
5350 -180179 -222149 239290 6242 -35304 98267 196961 -29305 -39419 380863 -144481 -118600
5339 -118600 106228 -98140 -72371 104329 -154685 366802 -136260 -107561 244566 -42612
5328 -255661 -50093 -69229 -68985 149026 -197891 124453 192194 -175167 303759 -86912 -82126
5317 -82126 -295497 58973 54507 -137616 77896 280980 137028 166840 261882 -371515 80080
5305 168246 251337 -9603 352658 -44609 151181 -125356 -40486 92289 -67261 -202824 113498
5293 155306 148349 97905 37962 -95759 -217943 208436 75023 -85275 186936 234365 136040
5282 136040 -318958 106031 -63997 75705 193472 275791 -378921 -39790 -339482 -39899 -76186
5271 -76186 -103585 -157243 -70545 10475 220751 -7410 -241484 -294219 162498 -138697 -49897
5259 -69626 90297 -114909 -8974 120734 156385 -31186 -29881 5079 186492 32429 104321 -54217
5246 491019 -10625 -196895 -211705 -86478 -55393 -334347 -275552 49219 -419002 155868 33172
5234 71920 -125513 -85472 121513 -272377 31739 1420 110422 -443637 156984 215167 -206019
5222 232228 12536 239139 -148889 647 -112831 188374 -333191 52775 23799 225171 -25699
5210 130888 65460 -47521 -155755 38465 -374077 72389 49143 333226 58138 -160616 214210
5198 314840 131632 -46289 9185 74535 -162893 -347126 -235907 115684 28747 281948 -3668
5186 -98140 218367 -156032 -162362 -25523 93022 -49333 -188856 311010 171846 -309284 121235
5174 34072 139518 -52173 -11904 -6223 23918 -131435 9554 -183158 -172755 -67851 37392 -1717
5161 -11953 151003 -230296 183242 -136322 190190 306718 324269 182070 236844 -416661
5150 267291 -602 -43139 -92323 -110633 224463 -368307 -63309 -207330 115123 127300 -10496
5138 225217 143835 26393 316858 -379320 -296580 -116514 272515 165032 35066 -130207
5127 -159231 435310 -134907 75983 187942 112708 64739 109550 -247516 51545 -240839 -43824
5115 -46690 219506 -122964 100800 -85246 20566 660528 99831 12987 106256 -93629 289173
5103 -195861 111814 -92416 -290229 -80154 161448 -74423 382169 -232952 170745 -194468
5092 -6188 50836 -108309 177149 -55435 102218 -31454 -131766 -61637 261026 464514 63422
5080 -166929 40128 177913 -150532 231427 -86892 -75661 -322509 111454 -67077 263231
5069 -49140 6981 -41131 131167 43904 -146890 43726 -241113 26999 52549 -459572 -112121
5057 108201 -133071 -119076 369849 184240 139051 181476 64733 48767 -2851 -130075 -90218
5046 -90218 214204 89332 -203724 -77300 172291 -87083 -91796 -32623 183407 -89328 -110755
5035 -110755 -150387 -19073 -43025 -7773 187382 133842 461386 -82458 222987 57308 453050
5024 453050 296421 242899 54527 6256 -136693 15453 249252 -153488 -146362 85129 -127769
5012 -2714 36341 4944 161143 -148614 195744 -253531 -158489 95560 -178409 -273842 -46648
5000 90134 -133277 398731 173820 152034 -15719 -106856 -291741 -126715 302345 -36976 513306
4988 14929 -38015 97453 -51858 8371 599136 -8381 161131 31789 -142262 53647 -326114
4976 165032 214218 88660 -97420 96049 24742 173329 277097 343250 86515 229171 160578
4965 160578 -53060 190597 58242 175530 -229991 92242 -60621 19514 420048 -287960 -327442
4954 -327442 -96683 -221697 11912 -305589 222856 -346801 64010 -3692 137019 185177 -164333
4942 -50070 -297123 57898 88017 189003 232610 -208045 88033 83963 38407 -210312 -13220
4930 -22665 122587 98162 222422 -179945 113189 37364 -57824 -143908 69101 -128018 -54262
4918 -147608 -98941 293100 -80537 188383 21480 158363 80180 21258 107243 151807 22783
4906 187757 5550 -379611 15341 203844 -173031 -154938 71064 -18996 -11706 184426 14851
4894 -77417 167798 -354067 -69955 -332690 -141144 -133632 -16567 -6669 297879 146283 128312
4883 128312 208336 156514 -372632 29675 -78733 -50928 -119268 231817 -255302 -54358 -56699
4872 -56699 132441 304109 100783 16111 -172646 166470 19208 -226326 6194 -53760 352817
4860 19435 -65123 -139286 113927 211246 248588 162357 16737 -111350 -22191 77391 -63332
4848 -75246 -73669 161880 240009 -186802 151656 123932 119281 -182504 253006 -137729 112563
4836 -205508 111363 -177397 -223343 -98459 155705 123158 -110085 -87231 13726 -59189 330030
4824 -489461 -318637 -4029 109651 -172112 -175444 -190572 202474 -123867 -32877 24972 133001
4813 133001 103580 42030 62064 97452 177353 169794 43871 -71335 242643 107002 261539
4802 261539 -33477 -113899 -111055 36093 -293793 60960 211223 -164676 -146089 107602 59292
4791 59292 26799 99651 176239 -74540 -109768 113297 160132 24341 -117948 281093 -135729
4779 11746 301820 73535 27805 -215451 51906 -318809 46833 -64708 -365103 300879 -109710
4767 98606 -34573 -44190 -161979 48927 -139074 175847 -223190 -23851 171615 -368083 -337731
4756 -337731 -38783 296702 -186049 78019 177002 175171 -201872 441333 100054 -148683 -226497
4745 -226497 -49121 133053 -4145 -2262 324665 -198581 -57311 278949 -286150 142000 -49769
4733 -20686 145957 78392 -29663 131355 -103169 -48566 123078 189473 160117 5446 220849
4722 220849 141327 182257 217418 -36190 -202957 90084 -99964 220552 -278338 82924 -180414
4710 -149835 533507 -17438 247794 -111480 -113960 184928 -20924 -343639 -155448 157239
4699 -200992 -142344 -81652 44327 -253647 4242 -178088 8553 -41342 -181781 -75315 24115
4687 -96590 -33199 -30850 -6838 95353 190429 158219 -175105 -30524 172336 -65477 -261956 -90284
4674 -206854 346142 56394 183610 4799 257522 -229791 -74416 150448 -160297 -79304 -115007
4663 -115007 5457 -17934 93736 -285039 -191844 -191133 -47536 98708 33121 -158904 -149725 -186673
4651 -186673 75171 119755 4161 145234 69588 350464 144925 185368 -39886 397628 153677
4639 110273 212759 123344 -187131 202777 -115543 5692 42053 107847 -30152 222753 -189468
4627 40686 91148 -63441 369099 -164581 -147094 14091 -197427 29760 5660 -192581 146108
4615 55502 19061 -111868 -136787 -179007 474512 108184 239590 38147 262529 -87268 -47365
4604 -47365 -76817 44403 170730 99099 5231 251538 -144090 -8718 264203 241569 396600
4593 396600 340701 -218606 228642 45023 185012 199139 283773 -129258 -113360 199941 151052
4582 151052 165781 -101270 -164197 -137711 128508 -186325 -253296 71422 -238654 -7757 -251269
4571 -251269 61219 142205 228416 -8564 -272227 60770 32637 -231031 50830 140517 177253
4560 177253 108405 89217 15163 412426 -114396 91173 57442 -27190 111950 -37147 112325
4548 -160093 -294155 -120001 -117766 225762 -25625 99955 48930 -15757 179007 35745 211630
4537 211630 -145069 95956 -218236 -54087 71891 -143469 -13155 304292 61523 229486 -38337
4525 98842 23249 67759 -35508 75277 52684 55191 229236 -112404 -31339 92990 18897 -165299
4512 -41513 -65881 -221619 -965 -27612 174638 130118 116680 -36088 -133640 -99822 -53021 39038
4499 -174329 -69212 -131834 -77834 -6772 -66113 -22814 -274589 -30336 214213 -218932 -268207
4488 -268207 -118048 -139158 -24666 65946 178875 154577 -148944 -49905 -245157 164252 258235
4477 258235 196057 -40443 -18018 98099 3195 -155528 -98323 40598 139115 -146679 90294
$$ [...]
##END NTUPLES=NMR SPECTRUM
##END=
