##TITLE=AC1734_SEN00007_9275963_ZU9xwk6SZo
##JCAMPDX= 6.0         $$ Bruker NMR JCAMP-DX V2.0
##DATA TYPE= NMR SPECTRUM
##DATA CLASS= NTUPLES
##ORIGIN= BRUKER
##OWNER= Administrator
$$ 1.72 TOPSPIN		Version 2.1
$$ 2015-07-18 21:01:25.916 -0700  Administrator@X
$$ Compression mode = diff/dup
##.OBSERVE FREQUENCY= 400.02188249412
##.OBSERVE NUCLEUS= ^1H
##.ACQUISITION MODE= SIMULTANEOUS (DQD)
##.ACQUISITION SCHEME= undefined
##.AVERAGES= 64
##.DIGITISER RES= 22
##SPECTROMETER/DATA SYSTEM= spect
##.PULSE SEQUENCE= noesygpps1d.comp
##.SOLVENT NAME= COFFEE_meoh
##.SHIFT REFERENCE= INTERNAL, COFFEE_meoh, 1, 14.96054
##AUDIT TRAIL= $$ (NUMBER, WHEN, WHO, WHERE, PROCESS, VERSION, WHAT)
$$ ##TITLE= Audit trail, TOPSPIN		Version 2.1
$$ ##JCAMPDX= 5.01
$$ ##ORIGIN= Bruker BioSpin GmbH
$$ ##OWNER= Administrator
$$ $$ E:\/data/COFFEE/nmr/AC1734_SEN00007_9275963_ZU9xwk6SZo/22/pdata/1/auditp.txt
$$ ##AUDIT TRAIL=  $$ (NUMBER, WHEN, WHO, WHERE, PROCESS, VERSION, WHAT)
(   1,<2015-07-18 21:01:20.322 -0700>,<Administrator>,<X>,<go>,<TOPSPIN 2.1>,
      <created by zg
	started at 2015-07-18 20:49:50.900 -0700,
	POWCHK enabled, PULCHK disabled,
       configuration hash MD5:
       21 0F 79 D6 B3 7B B4 F6 88 20 88 DB 03 48 BD 9F
       data hash MD5: 64K
       A9 BB 30 BD 2E 3E 4F BC 35 27 E9 C2 13 C7 30 79>)
(   2,<2015-07-18 21:01:23.791 -0700>,<Administrator>,<X>,<proc1d>,<TOPSPIN 2.1>,
      <Start of raw data processing
       efp LB = 0.3 FT_mod = 6 PKNL = 1 PHC0 = 0 PHC1 = 0 SI = 128K 
       data hash MD5: 128K
       56 66 93 EC 40 A7 5B E1 DE 2F 2B 26 10 61 A7 F6>)
(   3,<2015-07-18 21:01:24.682 -0700>,<Administrator>,<X>,<proc1d>,<TOPSPIN 2.1>,
      <pk PHC0 = -89.0332 PHC1 = 0 
       data hash MD5: 128K
       AF D3 8A D6 1E C0 FC 3D EC C6 F7 7A AE 9A B9 64>)
(   4,<2015-07-18 21:01:25.088 -0700>,<Administrator>,<X>,<proc1d>,<TOPSPIN 2.1>,
      <abs ABSG = 1 
       data hash MD5: 128K
       E6 E0 E0 D5 CC 31 18 CD F5 A6 17 28 C8 A7 BC FD>)
(   5,<2015-07-18 21:01:25.182 -0700>,<Administrator>,<X>,<proc1d>,<TOPSPIN 2.1>,
      <abs ABSG = 2 
       data hash MD5: 128K
       69 8B 3C 4D 77 88 87 BA EF 23 32 74 6A 73 A3 91>)
(   6,<2015-07-18 21:01:25.275 -0700>,<Administrator>,<X>,<proc1d>,<TOPSPIN 2.1>,
      <abs ABSG = 3 
       data hash MD5: 128K
       50 9B F2 1E 3A 78 33 8A 71 77 5D BC CD BA B7 E8>)
(   7,<2015-07-18 21:01:25.354 -0700>,<Administrator>,<X>,<proc1d>,<TOPSPIN 2.1>,
      <abs ABSG = 4 
       data hash MD5: 128K
       2E F6 A2 2E FA 4D 33 B2 26 1E 0D 10 5A 88 9D 52>)
(   8,<2015-07-18 21:01:25.447 -0700>,<Administrator>,<X>,<proc1d>,<TOPSPIN 2.1>,
      <abs ABSG = 5 
       data hash MD5: 128K
       F4 FF A2 5A 38 01 4A 63 98 0E 9F 1B 85 5F 9A DE>)
$$ ##END=
$$ 
$$ $$ hash MD5
$$ $$ 3E 31 75 28 9E 4C 29 1E 16 2F 7C CB 2E 62 16 90
##$RELAX= 
##$RELAX= 
##$RELAX= 
##$RELAX= 
##$RELAX= 
##$RELAX= 
##$RELAX= 
##$RELAX= 
$$ Bruker specific parameters
$$ --------------------------
##$DU= <E:\>
##$EXPNO= 22
$$ [...]
##$TP07= 0
##$TPNAME0= <>
##$TPNAME1= <>
##$TPNAME2= <>
##$TPNAME3= <>
##$TPNAME4= <>
##$TPNAME5= <>
##$TPNAME6= <>
##$TPNAME7= <>
##$TPOAL= (0..7)
0.5 0.5 0.5 0.5 0.5 0.5 0.5 0.5
##$TPOFFS= (0..7)
0 0 0 0 0 0 0 0
##$TUNHIN= 0
##$TUNHOUT= 0
##$TUNXOUT= 0
##$USERA1= <user>
##$USERA2= <user>
##$USERA3= <user>
##$USERA4= <user>
##$USERA5= <user>
##$V9= 5
##$VALIST= <valist>
##$VCLIST= <CCCCCCCCCCCCCCC>
##$VD= 0
##$VDLIST= <DDDDDDDDDDDDDDD>
##$VPLIST= <PPPPPPPPPPPPPPP>
##$VTLIST= <TTTTTTTTTTTTTTT>
##$WBST= 2048
##$WBSW= 25
##$XGAIN= (0..3)
0 0 0 0
##$XL= 0
##$YL= 0
##$YMAX_a= 8748023
##$YMIN_a= -14716418
##$ZGOPTNS= <>
##$ZL1= 120
##$ZL2= 120
##$ZL3= 120
##$ZL4= 120
##$ABSF1= 14.96054
##$ABSF2= -5.597642
##$ABSG= 5
##$ABSL= 3
##$ALPHA= 0
##$AQORDER= 0
##$ASSFAC= 0
##$ASSFACI= 0
##$ASSFACX= 0
##$ASSWID= 0
##$AUNMP= <proc_prof1d_extract.lims>
##$AXLEFT= 0
##$AXNAME= <>
##$AXNUC= <1H>
##$AXRIGHT= 0
##$AXTYPE= 0
##$AXUNIT= <>
##$AZFE= 0.1
##$AZFW= 0.1
##$BCFW= 0
##$BC_mod= 0
##$BYTORDP= 0
##$COROFFS= 0
##$CY= 15
##$DATMOD= 1
##$DC= 0
##$DFILT= <>
##$DTYPP= 0
##$F1P= 0
##$F2P= 0
##$FCOR= 0.5
##$FTSIZE= 131072
##$FT_mod= 6
##$GAMMA= 0
##$GB= 0
##$INTBC= 1
##$INTSCL= 1
##$ISEN= 128
##$LB= 0.3
##$LEV0= 0
##$LPBIN= 0
##$MAXI= 10000
##$MC2= 0
##$MEAN= 0
##$ME_mod= 0
##$MI= 0
##$NCOEF= 0
##$NC_proc= -2
##$NLEV= 6
##$NOISF1= 0
##$NOISF2= 0
##$NSP= 0
##$NTH_PI= 0
##$NZP= 0
##$OFFSET= 14.96054
##$PC= 1
##$PHC0= -89.0332
##$PHC1= 0
##$PH_mod= 1
##$PKNL= yes
##$PPARMOD= 0
##$PPDIAG= 0
##$PPIPTYP= 0
##$PPMPNUM= 2147483647
##$PPRESOL= 1
##$PSCAL= 4
##$PSIGN= 0
##$PYNMP= <proc.py>
##$REVERSE= no
##$SF= 400.020009822018
##$SI= 131072
##$SIGF1= 0
##$SIGF2= 0
##$SINO= 400
##$SIOLD= 131072
##$SPECTYP= <>
##$SREGLST= <1H.CDCl3>
##$SSB= 0
##$STSI= 131072
##$STSR= 0
##$SW_p= 8223.68421052631
##$SYMM= 0
##$S_DEV= 0
##$TDeff= 65536
##$TDoff= 0
##$TI= <>
##$TILT= no
##$TM1= 0
##$TM2= 0
##$TOPLEV= 0
##$USERP1= <user>
##$USERP2= <user>
##$USERP3= <user>
##$USERP4= <user>
##$USERP5= <user>
##$WDW= 1
##$XDIM= 131072
##$YMAX_p= 346618627
##$YMIN_p= -11846
##$CURPLOT= <Network HP LaserJet P1505>
##$CURPRIN= <$Network HP LaserJet P1505>
##$DFORMAT= <normdp>
##$LAYOUT= <+/1D_H.xwp>
##$LFORMAT= <normlp>
##$PFORMAT= <normpl>
##$SURQMSG= 1
$$ End of Bruker specific parameters
$$ ---------------------------------
##NTUPLES= NMR SPECTRUM
##VAR_NAME=  FREQUENCY,     SPECTRUM/REAL,   SPECTRUM/IMAG
##SYMBOL=    X,             R,               I
##VAR_TYPE=  INDEPENDENT,   DEPENDENT,       DEPENDENT
##VAR_FORM=  AFFN,          ASDF,            ASDF
##VAR_DIM=   131072,        131072,          131072
##UNITS=     HZ,            ARBITRARY UNITS, ARBITRARY UNITS
##FACTOR=    0.0627417313425164, 1,          1
##FIRST=     8223.62146879497, 1042,         -57721
##LAST=      0,             3774,            -57617
##MIN=       0,             -11846,          0
##MAX=       8223.62146879497, 346618627,    0
$$ Real data points
##PAGE= N=1
##DATA TABLE= (X++(R..R)), XYDATA
$$ [...]
64833 187183 187262 186724 186051 185823 185944 186021 186019 186125 186347 186729 187750 189977 193302 196939 200218 203106 205893 208663
64815 208663 211295 213852 216779 220610 225563 231472 238106 245400 253307 261526 269552 276930 283334 288467
64801 288467 292043 293869 293823 291859 288203 283427 278072 272324 266320 260625 255926 252207 248662 244547 239831
64786 239831 235022 230786 227774 226237 225558 224646 223110 221640 220948 220908 221173 222084 224232 227447 231002 234677
64770 234677 238869 243693 248743 253922 259720 266340 273126 279323 284942 290430 295812 300710 304975 308808
64756 308808 312270 315129 317274 318939 320380 321553 322245 322372 322070 321540 320856 319814 317958 314860 310473
64741 310473 305158 299333 293152 286542 279483 272204 265201 259166 254756 252206 251073 250519 249950 249323 248807
64726 248807 248334 247683 246854 246129 245733 245669 245869 246300 246904 247667 248784 250466 252476 254228 255538 256934 258868
64709 258868 260866 261904 261441 259693 257061 253885 250711 248140 246130 243990 241333 238575 236112 233481
64695 233481 229957 225699 221707 218665 216460 214886 214191 214622 215882 217393 218836 220109 221054 221671 222502
64680 222502 224318 227305 230906 234609 238598 243363 248938 254879 260974 267561 274913 282569 289614 295577
64666 295577 300720 305286 308757 310164 309050 305832 301239 295748 289670 283447 277576 272299 267636 263625
64652 263625 260370 257894 256126 255017 254508 254462 254824 255734 257326 259449 261928 265037 269325 274888 281201
64637 281201 287841 295105 303666 313877 325621 338478 351621 363726 373543 380674 385607 389002 391132
64624 391132 391926 391159 388544 384010 378035 371543 365363 359863 355046 350740 346638 342430 338095 333955 330399
64609 330399 327590 325407 323443 321106 317975 314137 309964 305608 301007 296367 292160 288376 284161 278620
64595 278620 271855 264926 258899 254227 250879 248634 247172 246175 245534 245361 245728 246529 247688 249335 251647
64580 251647 254528 257642 260815 264284 268308 272589 276369 279275 281729 284251 286561 287859 287844 286902 285192
64565 285192 282200 277493 271458 264972 258694 253037 248306 244327 240268 235556 230846 227423 225693 224876
64551 224876 224247 223936 224225 224703 224662 223985 223189 222777 222953 223762 225058 226395 227344 227999 228785 229766 230413 230208
64533 230208 229188 227729 226059 224273 222678 221737 221600 221896 222088 221936 221555 221170 220931 220815 220654 220365 220248
64516 220248 220880 222496 224636 226642 228383 230222 232377 234682 237038 239682 242873 246588 250744 255508
64502 255508 261165 267814 275295 283276 291382 299413 307397 315103 321517 325356 326378 325711 324551 322959
64488 322959 320416 317088 313793 310803 307437 303034 297894 293055 289418 287119 285470 283417 280392 276774
64474 276774 273339 270359 267544 264762 262295 260293 258479 256650 255098 254268 254260 254957 256379 258507 260855
64459 260855 262629 263521 264206 265713 268188 270487 271303 270641 269740 269543 269801 270017 270559 272141 274560 276898
64443 276898 278853 281105 284235 288071 292292 297016 302505 308816 315987 324007 332425 340657 349037 358972
64429 358972 371620 386866 403991 422832 443869 467742 495314 527793 566232 611089 662689
64418 662689 721586 787774 859743 934941 1010949 1085772 1157444 1224222 1285125 1339557 1386405
64407 1386405 1424084 1451408 1467873 1473181 1467260 1450917 1425744 1393060 1353224 1306030 1251379 1189628
64395 1189628 1121973 1050724 978743 908260 840458 776102 716078 661222 612135 569323 533033
64384 533033 502750 477262 455418 436524 420020 405364 392373 381079 371054 361467 352106 343698
64372 343698 336799 330972 325535 320562 316406 312690 308595 303981 299512 295637 292076 288334 284202 279663
64358 279663 274855 270327 266980 265502 265944 267832 270515 273490 276708 280614 285569 291205 296572 300946
64344 300946 304306 306956 308968 310099 310120 309093 307384 305365 303074 300273 296861 293088 289265 285576 282350
64329 282350 280184 279380 279494 279856 280361 281300 282563 283620 284272 284775 285091 284644 283074 280792 278439 276248
64313 276248 274266 272746 271807 270992 269639 267559 264936 261793 258102 254383 251568 250004 248994 247573 245525
64298 245525 243356 241422 239480 237173 234769 233139 232922 233864 235166 236459 238183 240909 244540 248388 251878
64283 251878 254950 257917 261273 265569 271079 277423 283757 289538 295007 300812 307319 314443 321878 329198
64269 329198 335712 340554 343069 343092 340895 337134 332882 329404 327485 326988 327310 328221 329911 332116 333670
64254 333670 333364 331098 327771 324050 319681 314134 307544 300698 294259 288241 282228 275932 269608 264009
64240 264009 259918 257596 256680 256564 256731 256774 256454 255938 255792 256480 257884 259424 260530 260917 260624 259981 259365
64223 259365 258817 258097 257223 256611 256374 255806 254087 251339 248478 246186 244513 243384 242768 242282 241308 239839
64207 239839 238665 238444 239022 239908 240879 241779 242312 242558 243239 244870 247053 249285 252094 256461 262228 268048
64191 268048 273131 278317 285080 294046 304843 316753 328967 340612 351156 360683 369317 376481 381084
64178 381084 382412 380483 375632 368203 358707 347896 336467 324926 313890 304168 296225 289666 283623
64165 283623 277679 272147 267420 263431 259991 257342 255952 255789 256190 256529 256687 256769 256713 256434 256085 255956 256297
64148 256297 257389 259481 262342 265194 267470 269399 271517 273841 276049 278186 280522 282752 284011 283795
64134 283795 282388 280323 278039 276112 275070 274703 274219 273431 273180 274179 276018 277867 279613 281697 284351
64119 284351 287696 292194 298122 304809 311224 317258 323802 331516 340225 349423 358659 367361 375006 381652
64105 381652 387661 392800 396330 398249 399747 402049 405438 409763 415244 422110 429886 437654 444745 450726
64091 450726 455083 457544 458440 458140 456240 452009 445559 437941 429992 421676 412755 403597 394977 387369 380741
64076 380741 374803 369173 363423 357283 350924 344961 340090 336625 334257 332388 330750 329654 329460 329894 330141
64061 330141 329624 328529 327564 327416 328416 330422 332855 335072 336913 338805 341199 344050 347038 350223 354216
64046 354216 359566 366163 373420 381051 389413 398943 409346 419620 428924 437204 444845 451913 457999 462719
64032 462719 466098 468368 469591 469591 468266 465922 463266 461018 459454 458369 457473 456671 455897 454856 453127 450412
64016 450412 446563 441518 435441 428852 422339 416169 410359 405047 400509 396792 393611 390658 387784 384897
64002 384897 381981 379345 377493 376590 376221 375833 375266 374730 374533 375012 376504 379062 382259 385530 388741 392273
63986 392273 396529 401493 406823 412335 418340 425386 433664 442797 452415 462736 474264 486992 500395
63973 500395 514237 528831 544227 559690 574449 588634 602902 617398 631739 645953 660806
63962 660806 677062 694934 714472 736074 760335 787777 819041 855110 896990 945348 1000790
63951 1000790 1064422 1137859 1222684 1320096 1431074 1556539 1697000 1851982 2019949 2199020
63941 2199020 2387801 2585361 2790319 3000019 3210630 3417747 3616680 3802535 3970713
63932 3970713 4117603 4240573 4337246 4405199 4442506 4448220 4422114 4364417 4276298 4160415 4020506
63921 4020506 3860372 3683576 3494049 3296468 3095664 2895713 2699665 2509954 2328828
63912 2328828 2158306 1999892 1854394 1722030 1602632 1495761 1400844 1317390 1244960 1182667
63902 1182667 1128759 1081132 1038435 1000393 966855 936883 909141 882951 858473 835901 814864
63891 814864 794622 774452 753833 732722 711869 692467 675108 659202 643726 628533 614686
63880 614686 603518 595494 590017 586166 583470 581955 581648 582363 584029 587018 591766 598168 605631 613771
63866 613771 622704 632499 642661 652465 661710 670816 680222 689846 699126 707296 713589 717479 719027 718969
63852 718969 718193 716981 714848 711140 705662 698586 689955 679635 667720 654639 640667 625642 609370
63839 609370 592081 574196 555960 537687 520064 503614 487931 472101 456060 440897 427580
63828 427580 415946 405299 395417 386341 377607 368546 359305 350850 343794 337762 332134 326936 322627 319338
63814 319338 316704 314330 312042 309748 307373 304988 302823 301007 299418 297890 296505 295506 294890 294207 292933
63799 292933 291058 289116 287561 286208 284426 281820 278587 275219 272045 269159 266642 264651 263205 262049
63785 262049 260919 259934 259427 259255 258592 256812 254426 252656 252042 251937 251517 250747 250038 249458 248835 248340 248364 248885
63767 248885 249388 249380 248630 247098 245145 243678 243478 244352 245415 246222 247038 248019 248846 249357 249811 250175 249894 248872
63749 248872 248037 248279 249271 250075 250585 251494 253078 254842 256463 258271 260594 263268 266058 268982 271898 274256
63733 274256 275689 276598 277781 279639 282007 284536 286985 289309 291723 294613 298169 302166 306207 310032
63719 310032 313558 316807 319933 323070 325938 327811 328138 327086 325275 323198 321089 319141 317445 315846
63705 315846 314193 312714 311782 311303 310778 310061 309673 310104 311087 311909 312326 312883 314296 316750 319851 323101 326251
63688 326251 329224 331879 334051 335812 337490 339267 340881 341912 342320 342464 342579 342490 342028 341532 341689 342831
63672 342831 344554 346117 347195 348178 349658 351682 353602 354661 354589 353576 351885 349747 347415 344937 341895
63657 341895 337772 332748 327817 323910 321076 318738 316506 314522 313110 312355 311993 311623 311035 310434 310194 310382
63641 310382 310825 311684 313586 316822 320760 324468 327775 331214 335063 338978 342592 346028 349699 354048 359552
63626 359552 366475 374423 382543 390464 398664 407726 417646 428277 440015 453472 468601 484738 501555
63613 501555 519538 539417 561415 585224 610448 636834 664095 691624 718412 743224 764830
63602 764830 782100 794137 800731 802769 801824 799084 794875 789339 783164 777202 771544 765364 757580 747361
63588 747361 734224 718208 700001 680500 660211 639403 618771 599355 581593 564979 548990
63577 548990 534028 521099 510812 503037 497380 493612 491635 491274 492213 494104 496729 500062 504060 508477
63563 508477 513086 518154 524408 532364 541828 552155 562868 573910 585539 598156 612136 627796
63551 627796 645587 666235 690293 717499 746927 777819 809689 841294 870192 893986 911772
63540 911772 923784 930033 930267 925320 917499 909038 900708 892334 884127 876696 869882 862236 851921 837875
63526 837875 820085 799112 775698 750657 724806 698767 672844 647188 622032 597656 574182
63515 574182 551662 530528 511702 495893 482830 471512 461274 452237 444611 437965 431528 425023
63503 425023 418832 413351 408502 403983 399816 396426 394201 393004 392223 391376 390587 390274 390395 390284 389373 387807
63487 387807 386140 384679 383515 383003 383739 385905 388940 391988 394511 396455 398088 399783 401724 403675 405174
63472 405174 405998 406202 405702 404165 401533 398295 394959 391575 388112 385010 382827 381442 380175 378775 377835
63457 377835 378019 379236 380790 382108 383176 384433 386398 389225 392580 396163 400336 405834 412785 420467
63443 420467 428346 436859 446692 457634 468822 480117 492654 507878 526325 547353 569640 591748
63431 591748 612553 631440 648146 662488 674481 684692 694167 703931 714736 727325 742589 761234
63419 761234 783415 808753 836632 866413 897429 928696 958477 984379 1004415 1018107 1026293 1029870
63407 1029870 1029211 1024816 1017905 1009896 1001589 993082 984133 974121 961955 946511 927240 904344 878620
63394 878620 851336 823800 796625 769623 742703 716442 691374 667199 643472 620802 600568
63383 600568 583540 569570 558579 550801 545828 542390 539641 538038 538424 540860 544934 550623 558086 566976
63369 566976 576738 587382 599283 612409 626506 641973 659672 679773 701550 724567 749380 776625
63357 776625 805949 836264 866634 896410 924796 950799 973450 991775 1004792 1012012 1013871 1011351
63345 1011351 1005344 996769 986997 977410 968344 958898 947915 934789 919290 901228 880680 858138
63333 858138 834011 808245 780884 752824 725494 699851 676097 654394 635360 619661 607433
63322 607433 598364 592084 588065 585189 581794 576446 568720 559161 548476 536836 524069 510392 496687
63309 496687 483874 472195 461336 451162 442059 434548 428792 424518 421183 418168 415045 411899 409246
63296 409246 407462 406326 405208 403625 401511 399005 396192 393042 389532 385773 382040 378684 375962 373901
63282 373901 372255 370627 368724 366608 364628 363034 361765 360682 359823 359197 358468 357208 355523 354144 353729
63267 353729 354289 355345 356403 357127 357328 357091 356864 357224 358528 360828 363994 367838 372176 376814 381458 385747
63251 385747 389605 393485 397967 403091 408425 413849 419820 426741 434463 442703 451535 461133 471415 482414
63237 482414 494631 508459 523437 538677 553950 569787 586496 603665 620783 637878 655301
63226 655301 673201 691421 709680 727699 745392 763037 781072 799615 818384 837093 855644
63215 855644 873800 890920 906140 918630 927574 932190 932012 927120 918046 905517 890283 872982 854108
63202 854108 834117 813530 792830 772453 753048 735552 720596 707984 697200 688339 682027 678372
63190 678372 676569 675785 675976 677597 680931 686031 692965 701759 712240 724133 737067 750369 763236
63177 763236 775427 787438 799767 812346 824958 837678 850372 862162 872062 879989 886476 891439
63165 891439 893903 893058 888985 882120 872483 859812 844199 826275 806817 786304 764836 742515 720032
63152 720032 698680 679455 662196 645959 630260 615536 602342 590678 580436 572049 566025 561953
63140 561953 558511 554633 550371 546414 543006 539691 536124 532863 531040 531192 532640 534210 535499 537195
63126 537195 540156 544472 549487 554453 558934 562834 566375 569986 573887 577750 581000 583511 585728 588068
63112 588068 590545 593145 596169 599781 603403 606120 607722 608912 610312 611732 612727 613489 614649 616307 617786
63097 617786 618446 618378 618137 618087 618194 618320 618465 618766 619337 620087 620697 620895 620816 620973 621841 623491 625618 627792 629736
63078 629736 631548 633685 636590 640333 644728 649719 655384 661639 668312 675505 683485 692133 701013 710265
63064 710265 720955 734083 749527 766419 784320 803536 824434 847102 871775 899072 929493
63053 929493 962932 998867 1036850 1076662 1118105 1160817 1204209 1247597 1290559 1333176 1375781
63042 1375781 1418407 1460696 1502428 1543955 1585939 1628760 1672207 1715586 1757933 1798236 1835615
63031 1835615 1869366 1898718 1922581 1939570 1948320 1947760 1937206 1916449 1885982 1847141 1801879 1752189
63019 1752189 1699686 1645623 1591164 1537504 1485808 1437156 1392500 1352518 1317512 1287574 1262841
63008 1262841 1243446 1229287 1220096 1215688 1215946 1220563 1229096 1241245 1256713 1274693 1293965 1313760
62996 1313760 1334128 1355199 1376458 1397226 1417569 1438154 1459278 1480423 1500715 1519394 1535841
62985 1535841 1549554 1560109 1566852 1568734 1564873 1555232 1540298 1520120 1494232 1462691 1426610 1387330
62973 1387330 1345546 1301728 1257035 1213224 1171639 1132701 1096343 1062528 1031281 1002519 976110
62962 976110 951923 929667 908791 888752 869365 850805 833282 816834 801423 786982 773198
62951 773198 759448 745259 730813 716714 703234 690103 677082 664370 652248 640745 629969
62940 629969 620382 612194 604772 597240 589650 582921 577580 573138 568892 564817 561283 558353 555815 553638
62926 553638 551974 550821 549994 549361 548808 548002 546544 544409 542028 539836 537861 535842 533645 531424 529378
62911 529378 527471 525565 523769 522355 521203 519562 516734 512938 509188 506321 504419 503130 502116 501049
62897 501049 499577 497661 495769 494489 494044 494285 494908 495509 495686 495444 495308 495709 496320 496359 495559 494489 493826
62880 493826 493609 493425 493093 492819 492749 492710 492503 492180 491804 491169 490099 488938 488277 488101 487725 486879 486382 487198 489095
62861 489095 490838 491647 491856 492112 492586 493223 494201 495691 497478 499125 500358 501084 501361 501576 502315 503752 505373
62844 505373 506636 507573 508425 508987 508871 508279 507929 508143 508454 508250 507433 506257 504864 503294 501764 500708 500511
62827 500511 501328 503049 505259 507282 508575 509282 510307 512555 516050 519962 523518 526597 529332 531556 533126
62812 533126 534553 536679 539648 542757 545482 548221 551756 556444 562214 568966 576544 584557 592633 600729
62798 600729 608973 617397 626092 635390 645623 656953 669674 684312 701063 719514 739492 761916
62786 761916 788235 819170 854607 894502 939114 988300 1041414 1098193 1159019 1223909 1291767
62775 1291767 1361067 1430790 1500053 1567085 1629221 1683989 1729882 1766137 1792158 1807290 1810955
62764 1810955 1802905 1783497 1753775 1715198 1669218 1617136 1560242 1499968 1437807 1375078 1312732
62753 1312732 1251351 1191471 1133905 1079653 1029320 982718 939151 898147 859868 824810 793246
62742 793246 764978 739558 716612 695882 677112 660091 644873 631766 620904 611812 603532 595318
62730 595318 587243 580142 574896 571635 569595 567824 565971 564334 563329 563209 564250 566736 570553 575119
62716 575119 580008 585386 591615 598786 606960 616511 627743 640482 654711 671380 691798 716101 743061
62703 743061 771623 801981 834868 870508 908802 950000 994377 1041485 1090380 1140502 1191668
62692 1191668 1243088 1292969 1339307 1380722 1416304 1445004 1465537 1476779 1478090 1469410 1451367 1425299
62680 1425299 1392888 1355476 1313674 1267661 1218018 1166270 1114491 1064243 1015978 969591 925438
62669 925438 884454 847234 813343 781879 752541 725760 701786 680118 660055 641506 624880
62658 624880 610346 597650 586640 577426 569718 562425 554431 545718 537255 529738 522860 516062 509614
62645 509614 504406 500671 497483 493829 489903 486893 485590 485664 486375 487420 488662 489489 489179 487845 486379
62630 486379 485283 484086 482177 479718 477367 475524 474201 473363 472924 472663 472539 472964 474396 476876 480332
62615 480332 484986 490898 497279 502995 507789 512467 517829 523998 530907 538754 547639 557297 567603 579019
62601 579019 592173 607290 624342 643417 664601 687713 712608 739628 769352 801791 835950
62590 835950 870181 902938 933329 961021 985528 1005660 1020041 1028184 1030637 1027978 1020179 1007270
62578 1007270 990027 969381 945516 918304 888572 858197 828721 800359 772607 745410 719349
62567 719349 694925 672098 650600 630475 612155 596032 582068 569893 559232 550078 542399 535878
62555 535878 530102 524951 520590 517141 514460 512242 510299 508717 507696 507159 506619 505677 504609 504184 504810
62540 504810 506137 507529 508517 508683 507683 505834 504252 503845 504371 505013 505694 507219 510168 514304 519154 524649
62524 524649 531034 538611 547758 558835 571875 586736 603602 622949 644878 668976 694993 723117
62512 723117 753293 784778 816737 848772 880374 910390 937733 962303 984449 1003703 1018844
62501 1018844 1029238 1035360 1037879 1036955 1032717 1025774 1016909 1006799 996452 987364 980798 977323 977442 982056
62487 982056 991633 1005437 1022536 1043344 1069197 1100419 1135820 1174242 1215510 1259236 1303534 1345691
62475 1345691 1383635 1416042 1441574 1458980 1467839 1468399 1460691 1444478 1420054 1388344 1350103 1305715
62463 1305715 1256054 1202938 1148402 1093948 1040696 989661 941470 896284 854504 817190 785213
62452 785213 758224 734928 714268 695988 680314 667595 658063 651363 646354 641966 638332 636578 637308
62439 637308 639751 642601 645248 647924 651000 654512 658139 661181 662648 661748 658373 652916 645717 636953
62425 636953 627087 617048 607739 599498 592189 585629 579686 574096 568489 562660 556605 550320 543846 537587
62411 537587 532170 527756 523782 519708 515827 512863 510928 509365 507602 505677 503831 502178 500974 500708
62397 500708 501536 502938 504322 505711 507510 509854 512479 514971 516767 517255 516462 515490 515723 517592 520519
62382 520519 523941 527837 532293 537228 542759 549287 556930 565216 573602 581967 590405 598984 608075 618599
62368 618599 631436 646681 663763 682233 702172 723934 747803 774008 802919 835170 871573
62357 871573 912664 958129 1006693 1056668 1106554 1155078 1200911 1242647 1279073 1309348 1332963
62346 1332963 1349606 1359005 1360866 1355148 1342473 1324055 1301016 1273929 1243118 1209126 1172669 1134503
62334 1134503 1095783 1058276 1023579 992118 963407 937326 914487 895161 878543 863580 850032
62323 850032 838053 827020 815524 802564 788171 772821 756812 740450 724320 708914 694261
62312 694261 680254 667121 655235 644658 635241 627104 620583 615752 612302 609975 608833 609020 610397
62299 610397 612476 614554 616014 616787 617570 619265 622076 625340 628286 630752 633095 635652 638394 640901 642584
62284 642584 643153 642922 642438 641809 640788 639613 639255 640494 643118 646432 650216 654738 660063 665915 672186
62269 672186 679111 686937 695800 705974 717906 731972 748464 767760 790161 815587 843821 875174
62257 875174 910633 951203 997139 1047546 1100365 1152978 1203351 1250684 1294558 1333654 1365942
62246 1365942 1390175 1406488 1415369 1416805 1410817 1398071 1379237 1354165 1322365 1284180 1240976 1194404
62234 1194404 1146010 1097352 1049873 1004521 961823 922254 886191 853651 824492 798776 776515
62223 776515 757198 740114 725087 712312 701465 691692 682666 674980 669054 664239 659479 654521 649835
62210 649835 645662 641786 638261 635686 634526 634491 634822 634994 634967 634989 635350 636253 637797 640058 643157 647109 651635
62193 651635 656383 661417 667248 674191 681909 689884 698249 707762 718870 731025 743074 754198 764356
62180 764356 773970 783391 792646 801510 809753 817367 824675 832269 840888 851275 864035 879589 898286
62167 898286 920528 946591 976331 1009182 1044486 1081529 1119123 1155444 1188561 1217121 1240377
62156 1240377 1257900 1269601 1275834 1276998 1273044 1263806 1249724 1231684 1210052 1184594 1155687 1125028
62144 1125028 1094507 1064750 1035426 1006765 979990 956127 935089 916284 899671 885723 874614
62133 874614 865884 858851 853015 847997 843382 838809 834193 829759 825846 822710 820499 819337 819362 820666 823234
62118 823234 826880 831099 834954 837390 837908 837000 835736 834928 834692 834633 834152 832654 829806 825703 820592 814401
62102 814401 806955 798783 791328 785833 782186 779305 776617 774624 773945 774392 775403 776945 779338 782337 785114
62087 785114 787386 789982 793871 798912 804090 808815 813515 818910 825242 832458 840767 850637 862371 875938
62073 875938 891074 907220 923493 939196 954542 970661 988720 1009112 1031524 1055511 1080778
62062 1080778 1106978 1133455 1159113 1182486 1202099 1217025 1227102 1232515 1233347 1229723 1222198 1211457
62050 1211457 1197548 1179860 1158093 1132887 1105159 1075195 1042926 1009001 974951 942152 911010
62039 911010 881342 853153 826740 802290 779669 758555 738622 719759 702230 686505 672780
62028 672780 660794 650199 640836 632510 624796 617375 610379 604020 598007 591639 584452 576547 568388 560616
62014 560616 553937 548807 545091 542236 539819 537800 536376 535846 536493 538326 540991 544168 547900 552236 556712
61999 556712 560664 563916 566692 569029 570895 572766 575255 578041 579950 580429 580140 579640 578256 574991 569987
61984 569987 564282 558438 552211 545437 538478 531707 525134 518674 512370 506333 500746 495868 491742 488043
61970 488043 484582 481703 479699 478046 475941 473531 471839 471387 471597 471811 472157 473016 474185 475179 475995 477051
61954 477051 478591 480641 483397 487082 491437 495766 499610 503104 506646 510573 515280 521308 528949 537858
61940 537858 547402 557424 568302 580046 591681 602107 611534 621475 632907 644898 655553 664046
61928 664046 671079 677441 682878 686684 688796 689769 689886 688757 685826 681040 674974 668472 662234 656738 652489
61913 652489 650125 650105 652389 656705 662978 671213 680945 691229 701200 710379 718465 725323 731293 736880
61899 736880 741762 744491 743742 739649 733542 726552 718955 710717 702138 693804 686221 679578 673595 667571
61885 667571 660906 653720 646780 640619 634884 628709 621685 614271 607180 600485 593580 586027 578193 570878
61871 570878 564563 559387 555579 553285 551992 550868 549938 550208 552202 555074 557886 561197 566464 574204 583740
61856 583740 594633 607182 621362 636422 652090 669206 688444 709105 730035 751124 772876
61845 772876 794818 815398 833511 849149 862376 872559 879080 882117 882122 879083 872994 864790 856113
61832 856113 848184 841416 836138 833026 832527 834328 837777 842629 848958 856523 864600 872476 879703 885734
61818 885734 889621 890407 887716 881714 872610 860564 846127 830370 814266 798042 781438 764489 747791
61805 747791 731970 717237 703544 690897 679238 668249 657579 647281 637801 629535 622591 616928
61793 616928 612388 608482 604459 599899 595123 590850 587466 584848 582771 581164 579925 578739 577335 575778
61779 575778 574317 572961 571418 569493 567382 565379 563423 561227 558925 557290 557030 557936 559027 559555 559636
61764 559636 559885 560792 562541 565081 568050 570913 573514 576325 579793 583612 587056 589845 592167 593906 594548
61749 594548 594035 593080 592223 591084 589019 586125 583020 579934 576678 573367 570463 567997 565434 562547 559925
61734 559925 558271 557544 557155 556676 556031 555255 554555 554448 555378 557185 559290 561414 563763 566465 569215 571639
61718 571639 573710 575600 577311 578701 579711 580416 580939 581489 582280 583192 583624 582994 581378 579387 577429 575338
61702 575338 572842 570110 567653 565776 564253 562474 559901 556529 552923 549716 547030 544557 542071 539574
61688 539574 536904 533694 529926 526141 522763 519563 516220 513079 510755 509120 507311 504834 502090 499691
61674 499691 497795 496311 495200 494239 492949 491191 489516 488527 488150 487898 487615 487522 487760 488352 489479 491355
61658 491355 493883 496833 500222 504033 507663 510280 511852 513246 515089 517021 518427 519483 521001 523376
61644 523376 526065 528115 529058 529337 529941 531544 533910 536268 538186 539778 541106 541899 542079 542062 542118 541797 540475
61627 540475 538192 535424 532175 527983 522798 517311 512259 507882 504225 501456 499557 498110 496764 495673
61613 495673 495123 494895 494326 492904 490533 487325 483457 479216 474973 471067 467795 465332 463406 461224 458115
61598 458115 454292 450670 447778 445156 442059 438530 435461 433524 432332 430838 428461 425618 423121 421345
61584 421345 420171 419469 419187 418977 418270 416985 415806 415378 415483 415410 414978 414699 414984 415606 416056 416038 415501 414530
61566 414530 413447 412816 413139 414577 416937 419719 422206 423851 424677 425127 425490 425760 426007 426485 427263 428184 429333
61549 429333 431125 433631 436257 438399 440052 441430 442416 442869 443135 443661 444285 444488 444279 444275 444870 445782 446508
61532 446508 446814 446756 446604 446779 447477 448271 448447 447840 447029 446682 446900 447203 446838 445214 442447 439490 437343 436192
61514 436192 435709 435959 437272 439239 440713 441093 440906 440785 440592 440051 439513 439370 439159 438086 436200 434452 433725
61497 433725 434358 436366 439450 442849 445800 448204 450457 452690 454705 456518 458400 460322 461920 463098
61483 463098 464180 465410 466767 468359 470437 472829 474858 476153 477150 478511 480356 482308 483925 484802 484592
61468 484592 483366 481779 480514 479633 478689 477326 475532 473468 471420 469797 468800 468085 467084 465777 464852
61453 464852 464959 466008 467300 468193 468456 468157 467503 466883 466810 467580 468964 470343 471226 471615 471925 472585 473677
61436 473677 474896 475897 476770 478115 480462 483587 486593 488726 489956 490747 491541 492600 494120 496228 498869
61421 498869 501853 504881 507499 509259 510144 510605 510988 511167 511009 510929 511578 513090 515042 517000 518687 519719
61405 519719 519739 518898 517744 516504 514892 512803 510775 509461 508920 508704 508477 508289 508396 508930 509653 509978 509461
61388 509461 508360 507518 507535 508268 509255 510408 512045 514401 517335 520502 523732 527237 531384 536182 541081
61373 541081 545472 549304 552925 556386 559237 561015 561569 560919 559255 557155 555317 553883 552460 550954 549851
61358 549851 549413 549147 548546 547967 548244 549699 552021 554908 558338 562324 566778 571549 576288 580473 583890
61343 583890 586913 589974 593018 595860 598723 601874 604909 607074 608266 609114 610043 610836 611237 611422 611648 611885
61327 611885 612027 612114 612110 611772 610972 609915 608910 608170 607951 608664 610629 613875 618247 623548 629519 635890 642519
61310 642519 649417 656715 664762 674083 684856 696531 708338 720109 732130 744168 755206 764343
61298 764343 771487 776880 780342 781346 779647 775550 769712 762833 755426 747712 739824 732037 724586 717321
61284 717321 709946 702535 695455 688743 682124 675740 670282 666209 663341 661467 660734 661092 661946 662870 664107
61269 664107 665888 667773 669380 671267 674243 678042 681512 684095 686387 689228 692948 697562 702976 708691
61255 708691 713830 717802 720702 722941 724811 726446 727832 728757 729064 729014 729033 729102 728752 727715 726173 724324
61239 724324 722182 719834 717447 714935 712166 709631 708258 708294 708946 709534 710489 712730 716486 721260 726586
61224 726586 732290 738264 744569 751556 759296 767061 774014 780377 787197 794815 802239 808419 813614 818981
61210 818981 825061 831161 836201 839730 842077 843886 845731 848046 851117 855060 859875 865546 872029 879187
61196 879187 886928 895463 905268 916585 928950 941363 952861 962824 970844 976695 980532 982925 984494
61183 984494 985566 986109 985807 984170 980862 976115 970666 965139 959624 953927 947983 941829 935324 928177 920211
61168 920211 911556 902631 893984 885946 878303 870468 862040 853022 843503 833547 823525 814134 805707 797862
61154 797862 790282 783521 778466 775213 773169 772249 773153 776102 779873 782688 783753 783425 782036 779258 774885
61139 774885 769715 765098 761592 758544 755254 752199 750660 751232 753251 755777 758678 762453 767441 773658
61125 773658 781180 790139 800417 811743 824130 837926 853393 870533 889256 909446 930831 953049
61113 953049 975861 999057 1022317 1045404 1068365 1091139 1113126 1133694 1153086 1172150 1190991
61102 1190991 1208441 1223214 1235062 1244383 1251134 1254805 1255314 1253339 1249611 1244269 1237021 1227720 1216607
61089 1216607 1204204 1191210 1178426 1166516 1155647 1145493 1135865 1127361 1121067 1117497 1116093 1116003 1117037
61076 1117037 1119500 1123462 1128809 1135939 1145656 1158221 1173063 1189691 1208418 1229867 1254159 1280956
61064 1280956 1309973 1341105 1374236 1409247 1446040 1484287 1523338 1562575 1601676 1640302 1677765
61053 1677765 1713239 1746147 1776113 1802743 1825696 1844799 1859901 1870814 1877615 1880803 1880903 1878147
61041 1878147 1872825 1865808 1858388 1851608 1845919 1841430 1838364 1837337 1839201 1844476 1852970 1864231 1878262
61028 1878262 1895286 1914771 1935427 1956598 1979213 2005058 2035603 2071955 2115230 2166185 2224785
61017 2224785 2290833 2364791 2447626 2540466 2645467 2766908 2910783 3083779 3293769 3551258
61007 3551258 3869349 4262459 4746438 5340054 6065141 6944834 8001397 9250057 10681249
60998 10681249 12234714 13788251 15184304 16287658 17036328 17452629 17618520 17644561 17647499
60989 17647499 17724303 17913077 18162281 18342501 18304076 17942300 17228581 16201317 14940100
60980 14940100 13543286 12110380 10725617 9446647 8303627 7306021 6449995 5723590
60972 5723590 5111080 4596672 4165952 3805387 3502087 3244558 3023413 2831382 2663008
60963 2663008 2514160 2381370 2261572 2152584 2053512 1964161 1884137 1812641 1748774 1691559
60953 1691559 1639841 1592581 1549131 1508900 1470941 1434313 1398762 1364717 1332665 1302742 1274766
60942 1274766 1248341 1223095 1199053 1176574 1155580 1135141 1114296 1093100 1072318 1052197 1032175
60931 1032175 1011890 991859 972877 955165 938459 922643 907881 894205 881325 868957 857191
60920 857191 846378 836685 827867 819573 811855 805129 799526 794473 789189 783550 778174 773661 770034 767063
60906 767063 764809 763423 762513 761143 758701 755488 752148 748767 745012 741086 737828 735557 733317 729793
60892 729793 724675 718609 712177 705556 699012 692880 686918 680391 673039 665485 658404 651830 645457 639148
60878 639148 632841 626496 620498 615613 612097 609211 606079 602733 599930 598265 597901 598838 600892 603548 606305
60863 606305 609099 612091 615241 618445 621860 625688 629820 634031 638280 642429 645970 648538 650528 652659
60849 652659 655100 657507 659764 662064 664384 666465 668320 670162 671754 672425 671893 670541 668703 666189 662808
60834 662808 658970 655353 652209 649239 646047 642451 638442 633988 629030 623747 618793 614922 612096 609240
60820 609240 605245 600135 594902 590351 586568 583356 580565 577882 574787 571036 566921 562951 559469 556580
60806 556580 554142 551855 549659 548007 547315 547192 546727 545627 544582 544329 544846 545633 546313 546715 546838 547088 548146
60789 548146 550222 552699 554872 556791 559050 561957 565241 568402 571063 573098 574679 576123 577523 578719
60775 578719 579751 581041 582795 584498 585418 585453 585093 584644 583928 582776 581365 579916 578385 576666 574871 573172
60759 573172 571492 569575 567347 564987 562670 560456 558514 557255 556986 557505 558284 559057 559986 561198 562444
60744 562444 563409 564068 564505 564599 564221 563538 562760 561655 559727 556845 553340 549548 545716 542347 540053 538840
60728 538840 537952 536773 535602 535233 536028 537687 539709 541684 543291 544429 545466 547078 549601 552627 555398
60713 555398 557670 560085 563482 567811 571948 574814 576504 578021 580011 582178 583960 585321 586593 587834
60699 587834 588667 588720 588057 587151 586433 585806 584721 582865 580661 578784 577337 575940 574631 574079 574634 575636
60683 575636 576092 575769 575203 574800 574415 573809 573126 572741 572846 573339 574058 574965 576032 577032 577605 577620 577377 577268
60665 577268 577286 576981 575903 573969 571483 569010 567146 566148 565747 565519 565421 565739 566584 567723 568948 570335 572092
60648 572092 574347 577100 580148 583083 585568 587585 589157 589999 589802 588729 587184 585157 582349 578948 575700
60633 575700 573121 571164 569750 568973 568582 568015 567320 567386 568689 570356 571108 570804 570414 570740 571758 573077 574391
60616 574391 575450 576039 576189 576171 576237 576424 576542 576308 575730 575426 576180 577953 579705 580531 580644 580876 581614 582685
60598 582685 583989 585646 587558 589308 590529 591126 591215 591163 591572 592891 594997 597310 599210 600293 600522 600341
60582 600341 600340 600585 600604 600302 600456 601914 604655 608094 611961 616351 621241 626545 632468 639291 646997 655561
60566 655561 665212 675747 685865 694024 699850 703984 706676 707431 706093 703315 699719 695375 690489 685885
60552 685885 682334 679950 678626 678551 679858 682237 685463 689906 696013 703514 711700 720368 730022 741124
60538 741124 753550 766842 780683 794938 809302 823074 835304 845180 852212 856080 856550 853803 848699
60525 848699 842380 835575 828498 821372 814684 808865 804008 800054 797004 794785 793070 791433 789662 787964
60511 787964 786919 787185 789056 792360 796903 802893 810805 821014 833839 849668 868661 890450 914593
60498 914593 941291 971194 1004440 1040218 1077245 1114256 1150075 1183712 1214456 1241396 1262807
60487 1262807 1276568 1281472 1277688 1265825 1246113 1218910 1185551 1148142 1108623 1068313 1028204 989320
60475 989320 952719 919262 889347 862870 839574 819370 802083 787062 773471 761037 750044
60464 750044 740543 732049 724200 717201 711290 706151 701283 696624 692502 689134 686444 684158 681820 678960
60450 678960 675580 672306 669802 668108 666656 664780 662120 658884 655903 654092 653610 653751 653798 653597 653128 652011
60434 652011 649980 647491 645358 643907 642902 642097 641401 640628 639592 638487 637785 637760 638360 639441 640743 641774
60418 641774 642146 642097 642244 642815 643533 644370 645825 648144 650652 652390 653187 653633 653986 653716 652506 651264 651535
60401 651535 653851 657199 660294 662918 665620 668569 671345 673736 676054 678538 680959 683038 684818 686493
60387 686493 688212 690218 692683 695256 697216 698376 699412 701014 703142 705385 707517 709240 709944 709461 708739
60372 708739 709079 710776 713082 715311 717352 719188 720654 721792 722864 723889 724705 725586 727233 729951 733331
60357 733331 736999 741185 746172 751571 756565 760721 764240 767593 771165 775019 778675 781208 781929 781015 779338
60342 779338 777652 776086 774345 772219 769853 767648 765920 764672 763726 763035 762653 762397 761783 760537 758996
60327 758996 757703 756648 755205 752904 750026 747296 745202 743827 743214 743515 744739 746683 749323 753044 758157
60312 758157 764288 770639 776921 783679 791498 800187 809132 818211 827842 838026 847814 856071 862445 867146
60298 867146 869857 869464 865161 857525 848167 838460 828876 819427 810337 802211 795821 791733 789866 789331 789056
60283 789056 788638 788277 787954 787260 786169 785235 784597 783467 781284 778778 777007 775735 773799 770910 767970 765540
60267 765540 763087 760108 756986 754230 751718 749240 747052 745273 743405 741143 739116 738035 737595 737031 736409
60252 736409 736507 737613 739259 741086 743150 745321 747102 748253 749042 749757 750412 751095 752096 753461 754738 755433
60236 755433 755546 755559 756042 757229 758798 760143 761071 762104 763774 765761 767200 767839 768451 769993 772682 776050
60220 776050 779618 783320 787420 792168 797561 803411 809574 815952 822245 828075 833613 839758 847285 855881
60206 855881 864360 871753 878044 884028 890644 898217 906048 913017 918825 924270 929976 935373 939497 942349
60192 942349 944673 946736 948167 948865 949073 948508 946327 942233 936924 931198 925314 919418 913886 908822 903779
60177 903779 898392 892846 887492 882475 877980 874242 871017 867647 863964 860586 857880 855280 852193 849088
60163 849088 847062 846613 847380 848734 850101 851040 851613 852404 853632 854539 854337 853564 853616 854889 856144 856005 854622
60146 854622 853519 854113 856618 860146 863629 866790 870295 874904 880533 886370 891861 897251 903106 909581
60132 909581 916341 922906 928876 933978 938216 941975 945787 949909 954178 958342 962403 966594 971077 975848
60118 975848 980860 985986 990801 994697 997472 999570 1001441 1002884 1003459 1003398 1003543 1004299 1005201 1005708 1005854 1005786 1005087
60101 1005087 1003039 999379 994472 988970 983607 979047 975509 972645 970133 968244 967466 967689 968211 968492 968465
60086 968465 968043 966814 964567 961889 959868 959120 959217 959207 958573 957535 956397 954943 952761 949928 946811 943212
60070 943212 938316 931767 924301 916977 910197 903903 898284 893606 889540 885356 880844 876474 872589 868965
60056 868965 865385 862260 860325 859852 860323 860812 860769 860633 861658 864831 869873 875521 880800 885784 891078 896955
60040 896955 903180 909452 915736 922167 928740 935088 940641 945114 948741 951831 954204 955373 955274 954415 953199
60025 953199 951399 948481 944111 938161 930544 921488 911776 902275 893194 884132 874958 866308 859009 853243
60011 853243 848491 844215 840304 836863 833875 831271 829169 827803 827248 827397 828172 829545 831309 833036 834387
59996 834387 835313 835884 836128 836193 836486 837414 839094 841406 844279 847742 851874 856780 862449 868405 873746 877804
59980 877804 880636 882532 883307 882568 880619 878445 876642 874853 872525 869770 867164 865072 863539 862529 861794
59965 861794 860774 859210 857840 857890 859681 862130 863861 864544 864917 865781 867291 869119 870936 872655 874314
59950 874314 875876 877177 878136 878959 880003 881352 882740 884002 885361 886973 888348 888678 887820 886604 885960
59935 885960 886025 886338 886661 887274 888605 890822 893773 897104 900542 904312 909090 915159 921709 927389 931564
59920 931564 934499 936287 936341 934369 931230 928162 925491 922867 920552 919561 920327 922000 923500 924741 926301
59905 926301 928332 930418 932329 934314 936605 939095 941536 943676 945156 945703 945627 945759 946691 948327 950363
59890 950363 952837 955960 959735 964161 969476 975672 981910 987072 990962 994419 998158 1002080 1005996 1010364
59876 1010364 1015664 1021418 1026477 1030221 1032946 1035084 1036626 1037445 1037650 1037362 1036508 1035166 1033850 1033078 1032765
59861 1032765 1032417 1031983 1032173 1033711 1036409 1039267 1041604 1043856 1047058 1051689 1057337 1063458 1069939 1076626 1082744
59846 1082744 1087293 1089893 1090801 1090266 1088393 1085724 1083395 1082348 1082556 1083130 1083051 1081740 1079178 1075615 1071187
59831 1071187 1065949 1060466 1056041 1053782 1053474 1053870 1054145 1054460 1054975 1055113 1054317 1052973 1051899 1051180 1050091 1048015
59815 1048015 1044910 1041090 1037196 1034320 1033409 1034232 1035372 1035556 1034723 1033655 1032933 1032639 1032824 1033651 1034962 1036028
59799 1036028 1036097 1035175 1033967 1032973 1031831 1029787 1026703 1023255 1020140 1017351 1014422 1011129 1007709 1004494 1001590
59784 1001590 998947 996605 994715 993297 992058 990690 989431 989005 989660 990457 990132 988727 987817 988808 991466
59769 991466 994451 996944 999240 1001968 1005297 1008996 1012933 1017304 1022422 1028248 1034208 1039657 1044581 1049592
59755 1049592 1055157 1061193 1067522 1074290 1081582 1089017 1096130 1102911 1109575 1116107 1122530 1129306 1136798 1144352
59741 1144352 1150537 1154462 1156480 1157510 1158137 1158494 1158590 1158410 1157882 1156937 1155573 1153821 1151798 1149787 1148171 1147271
59725 1147271 1147263 1148055 1149081 1149512 1149028 1148173 1147610 1147214 1146390 1145150 1144223 1144042 1144205 1144223 1144343 1145275 1147344 1150138
59707 1150138 1152793 1154471 1154915 1154817 1155504 1157929 1162001 1166927 1172050 1177199 1182484 1188016 1193786 1199510 1204562
59692 1204562 1208293 1210557 1211857 1212790 1213311 1212747 1210649 1207493 1204274 1201513 1199022 1196612 1194485 1192651 1190442
59677 1190442 1187086 1182588 1177666 1172964 1168668 1164649 1160593 1156099 1151138 1146329 1142448 1139708 1137833 1136601
59663 1136601 1135911 1135498 1135157 1135098 1135534 1136043 1136013 1135708 1136164 1137894 1140455 1143474 1147344 1152345 1157691 1162110 1165077
59646 1165077 1166984 1168275 1168879 1168448 1166864 1164424 1161600 1158505 1154698 1149840 1144545 1140089 1137163 1135358
59632 1135358 1134056 1133243 1133076 1133200 1133070 1132546 1131619 1129835 1126682 1122457 1118145 1114331 1110702 1106690 1102213
59617 1102213 1097637 1093371 1089707 1086874 1085024 1084197 1084300 1085085 1086191 1087397 1088841 1090833 1093401 1096066 1098170
59602 1098170 1099409 1100074 1100773 1101878 1103249 1104541 1105685 1106907 1108292 1109601 1110685 1111885 1113857 1116938
59588 1116938 1120704 1124089 1126003 1126080 1124902 1123434 1122219 1121213 1120288 1119543 1119111 1118898 1118658 1118183 1117378 1116348
59572 1116348 1115420 1114867 1114597 1114331 1113998 1113594 1112779 1111144 1109020 1107467 1107167 1107752 1108495 1109211 1110029 1110767 1111125
59555 1111125 1111393 1112336 1114313 1116890 1119396 1121550 1123478 1125368 1127261 1129114 1131028 1133469 1137186 1142771
59541 1142771 1150305 1159585 1170654 1183939 1199575 1216406 1231682 1242235 1246524 1245650 1242172 1237931 1233246
59528 1233246 1227908 1222295 1217381 1214285 1214005 1216949 1222226 1227849 1232256 1235519 1238701 1242311 1245783 1248225
59514 1248225 1249064 1248078 1245376 1241544 1237467 1233720 1230183 1226287 1221609 1216261 1210796 1205687 1201005 1196705
59500 1196705 1193085 1190496 1188652 1186771 1184625 1182888 1182084 1181715 1180977 1179984 1179685 1180706 1182805 1185351 1187854
59485 1187854 1190077 1192109 1194405 1197414 1201173 1205456 1210221 1215614 1221676 1228357 1235635 1243231 1250341 1256117
59471 1256117 1260399 1263653 1266216 1267935 1268512 1267903 1266472 1265045 1264658 1265796 1267908 1270024 1271839 1273824 1276438
59456 1276438 1279773 1284009 1289628 1296885 1305350 1314243 1323062 1331743 1340364 1348774 1356469 1362824 1367502 1370510
59442 1370510 1371791 1371039 1368202 1363951 1359251 1354580 1349920 1345357 1341228 1337610 1334127 1330425 1326640 1323305
59428 1323305 1320917 1319614 1319153 1319355 1320666 1323983 1329677 1337138 1345677 1355619 1367989 1383284 1401200 1421542
59414 1421542 1444754 1471240 1500229 1529266 1554662 1572957 1582694 1584984 1582081 1575683 1566945 1557662
59402 1557662 1550453 1547568 1549913 1556898 1566400 1574994 1579366 1578014 1571262 1559876 1544687 1527543 1511198
59389 1511198 1497409 1485906 1475810 1467238 1460749 1456039 1452248 1449189 1447315 1446667 1446714 1447155 1448074 1449271
59375 1449271 1450114 1450183 1449576 1448525 1447189 1445878 1444996 1444615 1444482 1444513 1444905 1445637 1446243 1446372 1446379 1447103 1449104 1452236
59357 1452236 1455917 1459714 1463623 1467941 1473073 1479566 1488015 1498571 1510555 1522968 1535490 1548649 1562915
59344 1562915 1578017 1593342 1608609 1623860 1639017 1653709 1667273 1678710 1687014 1691971 1694394 1695142
59332 1695142 1694145 1690796 1685142 1678106 1670507 1662255 1652670 1641329 1628527 1615041 1601592 1588532 1576095
59319 1576095 1564782 1555088 1546741 1538693 1530239 1521842 1514433 1508190 1502509 1496978 1491824 1487466 1484197 1482354
59305 1482354 1482314 1484226 1488059 1493899 1501679 1510459 1518441 1523873 1525722 1523492 1517016 1506842 1494443 1481621
59291 1481621 1469685 1459277 1450629 1443661 1438036 1433507 1430205 1428407 1428049 1428645 1429661 1430907 1432646 1435393
59277 1435393 1439467 1444647 1450401 1456592 1463758 1472541 1482984 1494578 1506801 1519271 1531507 1542977
59265 1542977 1553497 1563274 1572340 1580198 1586258 1590449 1593122 1594370 1593803 1591172 1587035 1582617 1578908 1576010
59251 1576010 1573319 1570331 1567254 1564908 1564064 1564878 1566954 1569889 1573625 1578245 1583587 1589228 1594828 1600270
59237 1600270 1605450 1610129 1614254 1618329 1623188 1629149 1635422 1640557 1643629 1644929 1645347 1645154 1643616 1639909
59223 1639909 1634130 1627173 1619786 1612097 1604039 1595794 1587678 1579875 1572538 1565986 1560517 1556040 1552071 1548141
59209 1548141 1544168 1540533 1537859 1536623 1536704 1537319 1537544 1537055 1536343 1536225 1537174 1539104 1541650 1544483 1547387 1550262
59193 1550262 1553222 1556620 1560720 1565309 1569894 1574427 1579617 1586233 1594133 1602217 1609389 1615396 1620756 1626084
59179 1626084 1631527 1636731 1641243 1644966 1648184 1651089 1653448 1654941 1655683 1656140 1656601 1657036 1657460 1658104 1659171
59164 1659171 1660693 1662625 1664690 1666148 1666224 1664961 1663231 1661656 1659974 1657716 1654968 1651928 1648171 1643082
59150 1643082 1636859 1630332 1623837 1616978 1609707 1602850 1597113 1592080 1586774 1580995 1575555 1571245 1568090 1565684
59136 1565684 1563771 1562246 1560916 1559635 1558641 1558403 1559072 1560329 1561892 1563954 1566844 1570373 1573844 1576867 1579914
59121 1579914 1583863 1589081 1595208 1601831 1609078 1617328 1626502 1635967 1645191 1654244 1663453 1672808 1682003 1690994
59107 1690994 1700037 1709115 1717714 1725394 1732250 1738511 1744012 1748488 1752167 1755556 1758643 1760782 1761460 1760879
59093 1760879 1759709 1758561 1757712 1757066 1756386 1755807 1756001 1757420 1759466 1760963 1761432 1761262 1760616 1759003 1756254 1753088
59077 1753088 1750068 1746680 1742254 1737278 1732847 1729063 1725037 1720476 1716286 1713274 1711070 1708788 1706130 1703364
59063 1703364 1700723 1698419 1696916 1696514 1696746 1696750 1696256 1695734 1695541 1695404 1694994 1694654 1695163 1696839 1699142 1701130 1702170
59046 1702170 1702322 1702244 1702690 1703883 1705315 1706311 1706839 1707538 1708975 1711149 1713805 1716865 1720269 1723715 1727015 1730546
59030 1730546 1734939 1740285 1746088 1752025 1758401 1765742 1774251 1783810 1794264 1805565 1817803 1831098 1845174
59017 1845174 1859000 1871211 1881076 1888818 1894963 1899694 1902884 1904342 1903915 1901811 1899080 1897224 1896896 1897370
59003 1897370 1897750 1898326 1900131 1903462 1907563 1911744 1916130 1921026 1926104 1930579 1934016 1936701 1939264 1942091
58989 1942091 1945079 1947894 1950394 1952628 1954381 1955023 1954126 1952101 1949990 1948685 1948613 1950003 1953001 1957495 1963180
58974 1963180 1969968 1978062 1987525 1997989 2008948 2020076 2031099 2041645 2051643 2061840 2073387 2086570
58962 2086570 2100068 2111889 2121089 2128274 2134330 2139118 2141811 2142161 2140736 2137904 2133295 2126603 2118413 2109785
58948 2109785 2101311 2092976 2084718 2076668 2068871 2061219 2053720 2046610 2040086 2034086 2028422 2023163 2018840 2016091
58934 2016091 2015010 2014993 2015497 2016672 2018829 2021465 2023639 2025365 2027733 2031268 2034973 2037689 2039665 2041891 2044345
58919 2044345 2046035 2046689 2047340 2048992 2051483 2054006 2056269 2058713 2061947 2066254 2071481 2077280 2083571 2090717
58905 2090717 2099039 2108298 2118038 2128321 2139607 2151879 2164310 2175952 2186368 2195486 2203346 2210244
58893 2210244 2216880 2224023 2232113 2241256 2251461 2262831 2275624 2290084 2306040 2322743 2339360 2355530
58881 2355530 2371153 2385698 2398214 2408057 2415299 2420309 2423289 2424328 2423548 2420938 2416303 2409626 2401428
58868 2401428 2392700 2384530 2377761 2372725 2369164 2366454 2363967 2361211 2357821 2353609 2348585 2342782 2336182 2328920
58854 2328920 2321287 2313307 2304638 2295211 2285718 2276999 2269204 2262036 2255567 2250114 2245450 2240874 2236157 2231694
58840 2231694 2227566 2223157 2218018 2212533 2207344 2202597 2198166 2194156 2190749 2187808 2185116 2182834 2181395 2181066
58826 2181066 2181831 2183535 2185933 2188816 2192309 2196865 2202672 2209184 2215471 2220941 2225667 2230145 2234929 2240278
58812 2240278 2245972 2251509 2256599 2261334 2265805 2269741 2272699 2274486 2275246 2275243 2274673 2273637 2272201 2270450 2268460
58797 2268460 2266151 2263329 2260051 2256837 2254269 2252420 2250863 2249183 2247274 2245263 2243468 2242357 2242282 2243315
58783 2243315 2245557 2249314 2254516 2260216 2265365 2270040 2275236 2281358 2287633 2293185 2297966 2302198 2305530 2307369
58769 2307369 2307697 2307009 2305599 2303324 2300040 2295996 2291870 2288515 2286473 2285593 2285267 2285064 2284914 2284768 2284660 2285183
58753 2285183 2287257 2291044 2295580 2299876 2303945 2308312 2312967 2317411 2321464 2325431 2329557 2333885 2338593 2343968
58739 2343968 2349991 2356396 2363186 2370669 2378849 2387179 2395160 2402939 2410982 2419282 2427244 2434421 2441118 2447978
58725 2447978 2455100 2461963 2468324 2474812 2482282 2490854 2499969 2509251 2518822 2528837 2539235 2550059 2561513
58712 2561513 2573503 2585398 2596465 2606299 2614696 2621378 2626034 2628431 2628445 2626262 2622520 2617805 2611903 2603982
58698 2603982 2593692 2581737 2569175 2556634 2544456 2533134 2523098 2514267 2506249 2498915 2492460 2486990
58686 2486990 2482357 2478406 2475157 2472642 2470653 2468806 2466991 2465667 2465398 2465958 2466365 2466168 2466286 2468007 2471410
58671 2471410 2475530 2479872 2484937 2491219 2498537 2506582 2515316 2524527 2533748 2543022 2553015 2563825 2574228
58658 2574228 2582691 2588732 2592855 2595544 2596855 2596714 2595239 2592966 2590964 2590281 2590959 2591979 2592482 2592613 2592932
58643 2592932 2593538 2594227 2595052 2596228 2597816 2599911 2602808 2606566 2610690 2614631 2618380 2622345 2626951 2632418 2638457
58628 2638457 2644091 2648396 2651608 2654779 2658191 2661126 2663544 2666778 2671665 2677047 2681277 2684467 2688100 2693017
58614 2693017 2699123 2706576 2715678 2725591 2734596 2742030 2748886 2756191 2763694 2770557 2776497 2781731 2786450 2790850
58600 2790850 2795247 2799655 2803568 2806507 2808578 2810278 2811932 2813563 2815216 2817225 2820117 2824234 2829479 2835623
58586 2835623 2842852 2851728 2862412 2874293 2886600 2899072 2911732 2924387 2936668 2948307 2959080 2968802
58574 2968802 2977744 2986760 2996658 3007719 3020006 3033613 3048328 3063704 3080028 3098607 3120446 3145142
58562 3145142 3171758 3200269 3231227 3264357 3298264 3331244 3361618 3387661 3408319 3423977 3435774
58551 3435774 3444170 3448914 3450261 3449341 3447325 3444951 3442840 3441479 3440757 3440047 3438714 3436029 3430862 3422304 3410596
58536 3410596 3396786 3381542 3365026 3347813 3331054 3315649 3301907 3290060 3280349 3272585 3266307 3261386
58524 3261386 3257831 3255148 3252730 3250866 3250448 3251546 3253111 3254281 3255158 3256138 3257349 3259004 3261430 3264362 3266960
58509 3266960 3268962 3271158 3274308 3278216 3282324 3286602 3291260 3296091 3300684 3305047 3309525 3314299 3319363 3324841
58495 3324841 3330931 3337532 3344137 3350178 3355475 3360426 3365815 3372417 3380754 3391012 3402856 3415436 3428140
58482 3428140 3441534 3456974 3475058 3495044 3516090 3538208 3561421 3584768 3607041 3627826 3646889
58471 3646889 3663141 3675383 3683600 3688412 3689709 3687224 3682243 3677235 3673631 3671157 3669506 3669387 3671635 3676478
58457 3676478 3684087 3694772 3708180 3723192 3739085 3755995 3773864 3791717 3808402 3823300 3835934
58446 3835934 3845515 3851312 3853059 3850889 3845470 3838255 3830891 3824192 3818248 3813387 3810193 3808590 3807930 3808182
58432 3808182 3810177 3814522 3821047 3829427 3839417 3850421 3861840 3874058 3888112 3904049 3920469 3935920
58420 3935920 3949869 3962160 3972557 3981184 3988418 3993999 3997100 3997635 3996681 3995375 3994193 3993457 3993497 3993994 3994231
58405 3994231 3994396 3995722 3998951 4003495 4008441 4013483 4018638 4023997 4030081 4037566 4046375 4055820 4065718 4076392
58391 4076392 4087665 4099070 4111035 4124392 4138573 4151936 4164316 4177561 4192903 4209314 4225219
58380 4225219 4240271 4254486 4267152 4277804 4287223 4296371 4305287 4313914 4322995 4333162 4344019 4355037
58368 4355037 4366513 4378920 4392181 4406332 4421925 4439044 4456883 4474978 4493863 4513795 4533938
58357 4533938 4553522 4572709 4591496 4608964 4624462 4638477 4651465 4662966 4672793 4681977 4691520 4701234
58345 4701234 4710780 4720873 4732510 4745814 4760383 4775866 4791635 4807099 4822983 4841012 4861691
58334 4861691 4883833 4906829 4931577 4958221 4984950 5010365 5035213 5060332 5084558 5106349 5125939
58323 5125939 5144195 5160896 5175911 5190592 5206047 5221296 5235114 5248511 5263367 5279679 5296181
58312 5296181 5312773 5330319 5348869 5368060 5388523 5410991 5434641 5458154 5481775 5506661 5532944
58301 5532944 5560150 5588669 5618964 5650029 5680467 5710477 5741086 5772180 5802989 5833770 5865267
58290 5865267 5897308 5929629 5963258 5999304 6037171 6075699 6115145 6156306 6198783 6242036 6287081
58279 6287081 6334970 6384478 6433470 6481743 6530469 6579664 6628378 6676646 6725177 6773977 6823303
58268 6823303 6875041 6930951 6990443 7052157 7116641 7185241 7257542 7332379 7410183 7491742 7575743
58257 7575743 7660324 7745946 7833943 7923278 8011841 8100157 8190789 8284745 8381407 8481194 8585241
58246 8585241 8693091 8803793 8918773 9040732 9170324 9306686 9450337 9602601 9763108
58237 9763108 9930983 10107531 10294674 10491836 10697576 10913097 11140926 11381591 11635101
58228 11635101 11904073 12191735 12498549 12824668 13173582 13549017 13950480 14376879 14832439
58219 14832439 15323967 15854577 16425785 17043482 17715796 18447534 19243535 20115265 21077106
58210 21077106 22138910 23310157 24608984 26058736 27678916 29490233 31527515 33839080
58202 33839080 36478430 39511231 43031905 47165843 52064961 57923026 64998831 73612150
58194 73612150 84122147 96926917 112471277 131213158 153548996 179712168 209555464
58187 209555464 242124779 275221746 305444225 328982925 342812729 345549168 337565429
58180 337565429 320561079 296988430 269536650 240689111 212401148 185981227 162156858
58173 162156858 141212667 123124637 107684278 94604072 83577247 74297835 66476930
58166 66476930 59864230 54253901 49473066 45375136 41842705 38783472 36118121 33776681
58158 33776681 31704178 29859666 28207448 26715017 25358770 24123753 22996309 21962340
58150 21962340 21012172 20140228 19338887 18597969 17910376 17272709 16680026 16125287 15604157
58141 15604157 15115143 14654579 14216609 13798698 13402389 13027881 12672283 12333704 12012409
58132 12012409 11706998 11413658 11130387 10858260 10597761 10347570 10107775 9880535 9666326
58123 9666326 9462632 9267369 9080653 8902439 8731427 8567218 8410844 8262330 8120296
58114 8120296 7984576 7856622 7736686 7623115 7515091 7413583 7318974 7230053 7145988 7067041
58104 7067041 6992856 6922216 6854948 6791919 6732827 6676155 6621586 6570272 6522508 6477456 6435376
58093 6435376 6397668 6364395 6334221 6307182 6284891 6267374 6252277 6237995 6225224 6214497 6204578
58082 6204578 6194416 6184514 6175221 6165602 6155144 6144840 6135418 6126192 6116683 6107750 6100060 6092939 6085824
58069 6085824 6079453 6074519 6070401 6066258 6062403 6059705 6058522 6058764 6060110 6061774 6063061 6064342 6066388 6068754
58055 6068754 6070285 6071264 6073269 6076548 6079368 6080537 6080854 6081480 6082616 6084562 6088248 6093701 6099532 6104907 6110594
58040 6110594 6117090 6123312 6128297 6132787 6137849 6143146 6147866 6152315 6157269 6162595 6167660 6172354 6176637 6179857
58026 6179857 6181681 6183114 6185509 6189017 6192865 6196713 6200909 6205864 6211923 6219392 6228060 6237001 6245386 6253131
58012 6253131 6260532 6267875 6275727 6284835 6295247 6306159 6316952 6327663 6338156 6347801 6356495 6365113 6374358
57999 6374358 6383872 6393047 6401974 6411064 6420442 6430168 6440310 6450368 6459441 6467487 6475610 6484635 6494301
57986 6494301 6504350 6515420 6528109 6541976 6556212 6570518 6584613 6597740 6609538 6620766 6632324
57975 6632324 6644106 6655499 6666432 6677203 6687852 6698458 6709493 6721198 6733134 6744969 6757109
57964 6757109 6769863 6782655 6794841 6806733 6818935 6831217 6842976 6854410 6866265 6878625 6890798
57953 6890798 6902286 6913142 6923493 6933402 6943215 6953521 6964754 6977063 6990336 7004016 7017282 7029936
57941 7029936 7042906 7057389 7073614 7090814 7108164 7125431 7142894 7160919 7179533 7198332 7216979
57930 7216979 7235664 7254522 7272660 7288500 7301365 7312053 7321690 7330709 7339219 7347531 7355834 7364048
57918 7364048 7372435 7381653 7391691 7401485 7410229 7418483 7427412 7437587 7449052 7461851 7475762 7490101
57906 7490101 7504546 7519626 7535762 7552334 7568449 7584084 7599744 7615465 7630999 7646572 7662607
57895 7662607 7678969 7695270 7711682 7728697 7746303 7764025 7781611 7799042 7816107 7832558 7848515
57884 7848515 7864250 7879838 7895479 7911740 7928912 7946449 7963626 7980333 7996746 8012762 8028530
57873 8028530 8044999 8062996 8082029 8100892 8119133 8137123 8154923 8172185 8189087 8206369 8224221
57862 8224221 8241989 8259176 8276059 8293106 8310369 8327668 8344905 8362023 8379047 8396261 8413963
57851 8413963 8432032 8450027 8467674 8484897 8501595 8517828 8534002 8550319 8566149 8580613 8593797
57840 8593797 8606848 8620800 8635729 8651067 8666244 8681026 8695703 8711028 8727587 8745209 8763281
57829 8763281 8781600 8800437 8819849 8839434 8858803 8877936 8896999 8916202 8935801 8955875 8976060
57818 8976060 8995826 9014967 9033508 9051227 9067692 9082760 9096677 9109713 9122061 9134062 9146097
57807 9146097 9158203 9170170 9182089 9194525 9208058 9222834 9238532 9254523 9270164 9285261 9300273
57796 9300273 9315815 9331976 9348299 9364387 9380371 9396833 9414365 9433030 9452104 9470565 9488084
57785 9488084 9505331 9523207 9542061 9561870 9582706 9604596 9627214 9650153 9673250 9696281 9718725
57774 9718725 9740415 9762141 9784856 9808255 9830732 9850909 9868866 9885824 9903045 9921055 9939552
57763 9939552 9957870 9975689 9993339 10011352 10029854 10048586 10067387 10086394 10105860 10125955 10146708
57752 10146708 10167949 10189445 10211121 10233009 10255059 10277294 10300163 10324238 10349440 10375039 10400503
57741 10400503 10425735 10450350 10473523 10495069 10515969 10537278 10559020 10580663 10602020 10623065 10643443
57730 10643443 10662924 10681840 10700462 10718481 10735908 10753834 10773349 10794140 10815149 10836203 10857844
57719 10857844 10879818 10900979 10920769 10939802 10958860 10978213 10998025 11018481 11039288 11059796 11079888
57708 11079888 11100161 11121055 11142365 11163725 11185062 11206527 11228451 11251318 11275331 11300146 11325487
57697 11325487 11351662 11378753 11405697 11431088 11454704 11477288 11499010 11519259 11537946 11555859 11573531
57686 11573531 11590822 11607895 11625588 11644417 11664064 11684204 11705078 11726963 11749854 11774001 11800044
57675 11800044 11828326 11858887 11892343 11929909 11972179 12018773 12069480 12124669 12183699 12243479 12299261
57664 12299261 12346487 12381877 12403918 12413415 12413240 12406841 12397019 12386155 12376671 12370440 12368013 12368952 12372735
57651 12372735 12379158 12388294 12400359 12415235 12431986 12449441 12467421 12486651 12507303 12528506 12549800
57640 12549800 12572048 12596099 12621244 12645931 12669605 12693073 12717337 12742714 12768794 12794630 12819216
57629 12819216 12842325 12864673 12886953 12909191 12931455 12954457 12978689 13003447 13027554 13050723 13073473
57618 13073473 13096057 13118369 13140676 13163484 13186711 13209824 13232838 13256365 13280611 13305112 13329699
57607 13329699 13354908 13381036 13407375 13432910 13457388 13481257 13504814 13527934 13550555 13572911 13595174
57596 13595174 13617207 13638948 13660767 13683078 13705676 13727934 13749744 13771801 13794623 13817788 13840611
57585 13840611 13863163 13885899 13908596 13930598 13952075 13974064 13996949 14019778 14041562 14062578 14083873
57574 14083873 14105963 14128567 14151212 14173578 14195575 14217502 14239904 14262916 14285990 14308532 14330501
57563 14330501 14352203 14373896 14395804 14418148 14440898 14463863 14487123 14510842 14534570 14557548 14580018
57552 14580018 14603333 14628159 14653362 14677428 14700350 14723205 14746393 14769320 14791593 14813621 14835957
57541 14835957 14858744 14881850 14905123 14928490 14952088 14976095 15000156 15023405 15045446 15066851 15088241
57530 15088241 15109439 15130181 15151083 15172970 15195567 15217841 15239481 15261154 15283358 15305902 15328579
57519 15328579 15351476 15374430 15396894 15418640 15440076 15461731 15483876 15506682 15530163 15553764 15576610
57508 15576610 15598351 15619412 15640223 15660648 15680442 15699832 15719388 15739454 15759918 15780363 15800369
57497 15800369 15819732 15838521 15856969 15875377 15894068 15913134 15932212 15950858 15969222 15987890 16006894
57486 16006894 16025489 16043267 16060830 16078855 16097111 16115168 16133549 16153173 16173850 16194215 16213144
57475 16213144 16230520 16246709 16262094 16277181 16292401 16307631 16322466 16336995 16351682 16366448 16380631
57464 16380631 16394088 16407704 16422452 16438328 16454458 16469949 16484502 16498498 16512629 16527228 16541957
57453 16541957 16556319 16570222 16583692 16596344 16607740 16618162 16628398 16638796 16649125 16659392 16670108
57442 16670108 16681570 16693373 16704836 16715617 16725812 16735822 16746114 16756773 16767323 16777244 16786567
57431 16786567 16795556 16804156 16812229 16820064 16827954 16835495 16842122 16848218 16854785 16861992 16868932 16875033 16880875 16887286
57417 16887286 16894323 16901483 16908290 16914408 16919784 16925004 16930924 16937630 16944281 16950250 16955820 16961341 16966320 16969884
57403 16969884 16971845 16972891 16973983 16975831 16978600 16981785 16984570 16986579 16988118 16989671 16991435 16993409 16995508 16997423
57389 16997423 16998742 16999402 16999790 17000318 17001219 17002680 17004709 17006826 17008326 17008890 17008603 17007434 17005301 17002576 16999854
57374 16999854 16997069 16993525 16988891 16983520 16977623 16970907 16963276 16955190 16946968 16938340 16929017 16919109 16908728
57361 16908728 16897858 16886924 16876701 16867168 16857151 16845724 16833416 16821433 16810218 16799391 16788618
57350 16788618 16777781 16766564 16754566 16741754 16728389 16714701 16700908 16687267 16673669 16659539 16644508
57339 16644508 16628878 16613024 16596710 16579423 16561099 16541998 16522160 16501548 16480534 16459685 16439102
57328 16439102 16418283 16396549 16373376 16348551 16322413 16295842 16269655 16244021 16218573 16192893 16166682
57317 16166682 16139686 16111726 16082769 16052909 16022419 15991708 15960882 15929404 15896695 15863056 15829405
57306 15829405 15796061 15762494 15728397 15694127 15659773 15624644 15588300 15551338 15514553 15477936 15441150
57295 15441150 15404340 15367655 15330462 15291956 15252225 15211945 15171287 15129938 15087992 15046012 15004319
57284 15004319 14962889 14921864 14881387 14840938 14799564 14756981 14713963 14671485 14629811 14588409 14546415
57273 14546415 14503184 14458757 14413820 14369004 14324295 14279303 14233836 14187935 14141642 14095121 14048707
57262 14048707 14002357 13955307 13906768 13856776 13805839 13753943 13700478 13645180 13588626 13531700 13474922
57251 13474922 13418306 13361526 13304093 13245593 13185880 13125154 13064001 13003254 12943410 12884123 12824695
57240 12824695 12765234 12706864 12650681 12596989 12545714 12496860 12450174 12405035 12361205 12319141 12279157
57229 12279157 12240944 12204369 12169953 12137862 12107210 12077311 12048985 12023640 12001547 11981978 11964512
57218 11964512 11949045 11934838 11920927 11907457 11895518 11885548 11876887 11869020 11862325 11857405 11854472 11853459
57206 11853459 11853905 11854393 11852777 11847220 11836714 11820891 11800162 11776017 11750263 11723662 11695861 11666583
57194 11666583 11636101 11604480 11571186 11535732 11498082 11458247 11416050 11371478 11324792 11276259 11226219
57183 11226219 11175296 11123912 11071683 11017895 10962457 10905725 10847661 10787986 10726928 10664881 10601577
57172 10601577 10536755 10471568 10408050 10347049 10287928 10230422 10175332 10122849 10071555 10019950 9967932
57161 9967932 9915968 9863660 9810016 9754494 9697082 9637903 9577314 9515816 9453338 9389219 9323286
57150 9323286 9256228 9188505 9119854 9050522 8982163 8916733 8855082 8797085 8742294 8689933 8639207
57139 8639207 8589858 8540293 8483608 8407628 8302596 8169644 8019871 7864687 7708818 7553068
57129 7553068 7401130 7261069 7140510 7042154 6963956 6901847 6851308 6807322 6764606 6718752 6667010
57118 6667010 6607944 6541014 6467231 6389811 6313207 6241028 6175238 6117327 6069470 6034305 6014419
57107 6014419 6012765 6033021 6078759 6152469 6256259 6393699 6570770 6795353 7076726 7426221
57097 7426221 7858645 8393280 9053597 9865727 10856473 12051527 13473404 15138391 17053434
57088 17053434 19214551 21606329 24200314 26951708 29796793 32654402 35434414 38054504
57080 38054504 40459393 42626865 44547181 46185447 47459371 48256908 48482043 48092332
57072 48092332 47105522 45583954 43617029 41308916 38766981 36090188 33363345 30658827
57064 30658827 28039691 25558981 23256922 21160051 19282482 17627202 16187305 14948596
57056 14948596 13893091 13001212 12252143 11624167 11096282 10649918 10269206 9940347 9651724
57047 9651724 9394764 9163986 8955637 8766285 8592616 8431968 8282480 8142693 8011322
57038 8011322 7887341 7770211 7660106 7558060 7465604 7383931 7313403 7254006 7205864 7168283
57028 7168283 7137433 7104743 7058210 6986322 6881952 6743653 6574364 6379610 6166486 5942685
57018 5942685 5714788 5486929 5261184 5038837 4820682 4606524 4395570 4187594 3983110
57009 3983110 3782327 3584851 3390839 3201622 3018715 2842786 2674073 2513081 2360205
57000 2360205 2215231 2077869 1948412 1827211 1713882 1607681 1508353 1416023 1330552 1251622
56990 1251622 1179183 1113237 1053529 1000073 953579 914490 881720 853077 826782 801842 777137
56979 777137 751205 723187 693369 662572 631561 601089 571896 544438 518992 496048 476114
56968 476114 459109 444512 432156 422370 415357 411044 409583 411341 416295 424072 434674 448234 463527
56955 463527 477362 486086 487525 481369 468438 450346 429513 408493 388824 370657 353528 337398
56943 337398 322996 311350 303065 298086 296163 297370 301930 309721 320366 333845 350528 370401 392472
56930 392472 414951 435610 451822 460958 461476 453740 439469 420391 397683 372619 347206 323604
56918 323604 302801 284135 266487 249850 235371 223792 214386 205814 197634 190452 184757 180286 176559
56905 176559 173482 171226 169932 169755 170724 172321 173598 174227 175280 178459 184430 192128 199875 207119 214919
56890 214919 224764 237127 251391 266959 283833 301750 319092 333203 341857 344307 341134 333581
56878 333581 323122 311257 299372 288625 279780 273006 268008 264641 263395 265158 270645 280177 293811
56865 293811 311410 332842 358537 389595 426707 468665 512094 552555 585815 608528 618728
56854 618728 616294 602865 581085 553875 524123 494470 466983 443025 423516 409215 400799 398789
56842 398789 403423 414636 432369 457075 489797 531588 582917 643438 711584 783632 853270 912691
56830 912691 954718 974617 971114 946546 905775 854155 796268 736353 678910 627674 584143 547938
56818 547938 518639 496565 481970 474572 474217 481223 495721 517329 545919 582061 625940 675704
56806 675704 726786 772536 805794 821095 816548 794031 757626 711879 661034 608826 558327 511964
56794 511964 471634 438369 411887 391087 375261 364464 358771 357821 361431 370020 383955 402864
56782 402864 425849 451805 478886 503952 523146 533197 532225 519967 497948 469368 438044 406874
56770 406874 377070 348698 321752 296703 274176 254349 236948 221825 209203 199121 190958 183907
56758 183907 177672 172284 167453 162675 157870 153368 149335 145737 142731 140392 138135 135176 131662 128558
56744 128558 126296 124352 122434 121166 121074 121581 121621 120772 119323 117704 116386 115893 116293 116890 116886 116215 115469 115275
56726 115275 115995 117684 120034 122583 125147 127711 129870 130947 130867 130342 129948 129657 129529 130014 131043 131629
56710 131629 131140 130380 130549 131617 132624 133261 134144 135536 136737 136993 136397 135709 135655 136504 137925 139101 139273
56693 139273 138348 136954 135981 136137 137610 139962 142485 144796 146847 148371 148887 148509 148133 148363 148776 148712 148270
56676 148270 147898 147479 146579 145315 144185 143223 142100 140967 140442 140781 141662 142849 144420 146279 148011 149341
56660 149341 150254 150637 150353 149762 149613 150212 151158 152078 153089 154214 154789 153973 151767 149205 147512 147211 148014
56643 148014 149399 151129 153168 155260 156908 157847 158329 158775 159327 159884 160324 160538 160468 160273 160224 160256 159938 159150
56625 159150 158469 158523 159154 159581 159232 158171 156912 156080 156013 156310 156032 154699 152972 151968 152095 152834 153497 153797
56607 153797 153826 153839 154020 154222 154089 153605 153293 153653 154657 156004 157470 158743 159387 159450 159698 160700 162035 162969
56589 162969 163538 164309 165358 166263 166952 167796 168889 169961 170992 172278 173783 175029 175792 176435 177426 178895
56573 178895 180698 182541 184044 185111 186277 188341 191715 196418 202452 209688 217581 225657 234212 243921
56559 243921 254793 266085 277011 286770 294036 297547 297601 296083 294558 293024 290969 288825 287550 287195
56545 287195 286737 285287 282941 280452 278540 277527 277241 277119 276591 275452 273838 271890 269546 266626 263095
56530 263095 259237 255592 252594 250220 248050 245664 242972 240222 237821 236069 234921 234007 232970 231759
56516 231759 230561 229534 228672 227776 226522 224781 222943 221679 221224 221201 221331 221932 223361 225258 226741 227272
56500 227272 227027 226567 226424 226840 227624 228413 229168 230139 231180 231605 231094 230260 229842 229781 229697 229871 230967 232944
56482 232944 234919 236093 236269 235669 234864 234770 235999 238142 240223 241769 242907 243578 243433 242603 241850 241759 242275
56465 242275 243120 244165 245227 246009 246397 246480 246227 245601 245005 245124 246200 247819 249426 250694 251442 251754 252265
56448 252265 253838 256759 260516 264332 267612 269951 271247 271831 272106 272054 271455 270511 269843 269848 270447 271340 272133
56431 272133 272406 272140 271953 272422 273356 274198 274970 276149 277771 279287 280268 280725 280846 280982 281677 283023 284199
56414 284199 284353 283818 283740 284652 286169 287836 289413 290492 290891 291308 292578 294358 295615 296354 297538 299204
56398 299204 300147 299933 299733 300410 301090 300684 299844 300206 302212 304736 306566 307451 307903 308701 310462 313164 316135
56381 316135 318748 320887 322570 323594 323889 323827 323874 324240 325023 326211 327372 327877 327754 327845 328858 330713 333010
56364 333010 335565 338264 340918 343499 346032 348111 349176 349475 350023 351362 353095 354847 356851 359133 361047
56349 361047 362229 363294 364888 366691 368046 369135 370775 373329 376371 379270 381765 384175 387167 390955
56335 390955 394670 397144 398476 400139 403285 407697 412639 417827 423061 427764 431566 434742 437495 439502
56321 439502 440692 441824 443605 445750 447531 448726 449547 450177 450936 452357 454553 457023 459501 462364 465820
56306 465820 469469 473169 477467 482558 487767 492746 498237 504650 510873 515709 519796 524771 530984 537320
56292 537320 543004 548298 553542 558684 563871 569552 575885 582752 590310 598786 607839 616893 626006 635679
56278 635679 645902 656184 666498 677417 689313 702092 715721 730308 745665 761535 778344
56267 778344 797106 818349 841672 866438 892480 920069 949696 982089 1018054 1058160 1102778
56256 1102778 1152437 1207849 1269627 1338276 1414533 1499459 1594029 1698607 1812739 1935490 2066078
56245 2066078 2203990 2348093 2495795 2643660 2788849 2929308 3062501 3184731 3292010
56236 3292010 3380942 3448664 3492915 3512810 3508930 3482256 3433730 3365316 3280562 3183300 3076302
56225 3076302 2961781 2842406 2720870 2598874 2477428 2357899 2242186 2132079 2028842
56216 2028842 1933033 1844238 1761468 1684251 1612881 1547313 1486590 1429891 1377397 1329450 1285629
56205 1285629 1245357 1208710 1175770 1145783 1117772 1091523 1067270 1044965 1024558 1006377 990477
56194 990477 976190 963039 951464 941871 933708 926334 920080 915416 911759 908168 904718 902065 900061
56181 900061 897849 895074 892125 889502 887677 887115 887611 888196 888504 889569 892281 895777 898566 900739 903753
56166 903753 908338 913827 919417 925060 931184 938378 947175 957400 968044 978466 989316 1001616 1015507
56153 1015507 1030672 1047319 1065860 1086307 1108974 1135147 1166114 1202167 1243475 1291065 1345740
56142 1345740 1406792 1473009 1544186 1620240 1699406 1778648 1855341 1927352 1992309 2048630 2097152
56131 2097152 2140475 2180850 2219505 2257121 2293334 2326177 2353389 2374033 2387956 2394655 2394131 2387900
56119 2387900 2377326 2361393 2337710 2305094 2263608 2212979 2153219 2086558 2016730 1946384 1876855
56108 1876855 1810100 1748887 1694915 1648348 1609074 1576903 1550730 1529201 1512094 1499632 1490857
56097 1490857 1484284 1479725 1477717 1477602 1478089 1479388 1482777 1488275 1494584 1501132 1508303 1516036 1524106 1533446
56083 1533446 1545061 1557928 1570082 1581452 1593472 1606292 1618844 1631444 1645603 1661196 1676487
56072 1676487 1691253 1707294 1725428 1744401 1763313 1782736 1802895 1823070 1843498 1865703 1890168
56061 1890168 1915547 1940667 1965473 1989730 2012878 2035504 2058966 2083205 2106986 2130417 2155032
56050 2155032 2181164 2207568 2233940 2261408 2290169 2319031 2347829 2378011 2410400 2444494 2480318
56039 2480318 2518664 2559115 2600095 2641110 2682787 2724697 2765634 2806064 2847739 2890891 2934584
56028 2934584 2979683 3028352 3080425 3133404 3186369 3240801 3297425 3355619 3416225 3481451 3551364
56017 3551364 3623835 3698353 3776516 3858463 3942546 4028959 4119798 4215040 4312453 4412069 4516586
56006 4516586 4626718 4740518 4858047 4982152 5113623 5250253 5391795 5541073 5698936
55997 5698936 5863034 6033083 6212374 6402487 6601512 6809255 7029188 7263540 7511498
55988 7511498 7773967 8054797 8355557 8674558 9012764 9375096 9764347 10179996 10624641
55979 10624641 11105062 11625172 12184999 12788593 13445523 14162640 14942620 15793143 16729009
55970 16729009 17762913 18903670 20166653 21576327 23156187 24928180 26926520 29201432
55962 29201432 31807607 34805382 38281371 42358041 47185412 52949123 59899748 68358575
55954 68358575 78689216 91285754 106590975 125082885 147200133 173237755 203158955
55947 203158955 236185581 270274095 301994390 327265104 342687880 346618627 339360049
55940 339360049 322644286 298970866 271096444 241621178 212634788 185538836 161099878
55933 161099878 139615927 121067921 105240973 91833926 80531453 71024003 63014594
55926 63014594 56241213 50491383 45590018 41385411 37753388 34600468 31850682 29434851
55918 29434851 27296379 25395779 23700775 22178435 20801541 19553667 18421274 17387152
55910 17387152 16436313 15561060 14754755 14006543 13306943 12652746 12041832 11468413 10927443
55901 10927443 10418435 9940857 9490546 9064147 8662248 8284713 7927583 7587784 7266090
55892 7266090 6962233 6671844 6391633 6123143 5868098 5624425 5390074 5166295 4953492
55883 4953492 4747911 4546068 4348946 4158464 3973444 3792481 3617411 3450375 3290383
55874 3290383 3135957 2988312 2848827 2716247 2589340 2469575 2358145 2253053 2152171
55865 2152171 2056634 1968208 1885685 1806923 1732234 1662805 1597782 1535712 1476996 1422213 1369910
55854 1369910 1318753 1270190 1226398 1187029 1150267 1115570 1083182 1052505 1023119 995887 971066
55843 971066 946882 921933 897355 874734 853586 832938 813530 796234 779876 762896 745820
55832 745820 730000 715268 700836 687212 675246 664508 654459 645892 639285 633070 625425 616582
55820 616582 607527 597795 586513 574457 563109 552720 543012 534570 527722 521291 514312 507855 503225
55807 503225 499602 495483 491339 488713 487661 487282 487996 491086 496432 502661 509092 515690 521538 525247 526742
55792 526742 527056 526545 524739 521726 518340 515068 511751 508038 503225 496182 486387 474502 461207 446358
55778 446358 430149 414054 399502 386566 375014 365483 358333 352381 346231 340004 334501 329611 324870
55765 324870 320618 317198 313968 310449 307385 305182 302475 297959 292607 288206 284579 280180 274670 268844
55751 268844 262641 255366 247620 240983 235897 231632 228241 226708 227093 228204 229283 230472 231514 231452 229895
55736 229895 227455 224826 222519 221333 221782 222955 223180 221939 220154 218563 216886 214561 211359 207212 202327
55721 202327 197446 193274 189823 186936 184936 183924 183035 181456 179688 178701 178388 178079 178058 179137 181059 182742
55705 182742 183885 184967 185861 185912 185309 184930 184712 183576 181124 178217 175641 173304 170951 168664 166509 164545
55689 164545 163202 162769 162607 161803 160464 159371 158670 158112 158321 160325 163756 166982 169236 171294 173732 175895
55673 175895 177109 177697 178152 178299 177941 177536 177614 178149 178970 180149 181600 182851 183585 183987 184354 184846 185676 186952
55655 186952 188315 189364 190487 192501 195354 198028 199915 201469 203118 204332 204355 203376 202331 201742 201140
55640 201140 199593 196591 192373 187452 182007 176020 169903 164403 159731 155407 151274 147914 145643 143902
55626 143902 142298 141427 141810 142792 143486 144084 145082 145900 145605 144471 143425 142358 140528 138340 137031 136560
55610 136560 135469 133130 130587 128783 127345 125676 123960 122464 120948 119408 118436 118224 118055 117363 116460
55595 116460 115713 114821 113495 112097 111031 110122 109193 108650 108996 110141 111605 112977 113961 114526 115238 116913
55579 116913 119682 122919 126211 129822 134068 138930 144481 151014 158469 166273 173895 180951 186764 190593
55565 190593 192396 192587 191022 187189 181535 175497 169807 163801 156875 149632 142950 136884 131232 126339
55551 126339 122491 119149 115657 112281 109810 108476 107871 107546 107136 106326 105322 105013 105986 107610 108673 108700
55535 108700 108176 107649 107191 106681 106205 106058 106487 107360 108055 107907 106798 105111 103195 101266 99698 98804 98291
55518 98291 97527 96423 95438 94677 93749 92656 91935 91582 90721 88836 86655 85189 84572 84361 84351 84406 84065 83106
55500 83106 82103 81731 81764 81448 80630 79909 79808 80341 81225 82018 82157 81404 80168 79043 78055 76763 75011 73241
55482 73241 72084 71926 72822 74575 76853 79280 81441 82926 83585 83737 83818 83891 83798 83674 83783 83909 83543 82770
55464 82770 82296 82404 82519 82121 81487 81187 81368 81895 82667 83376 83524 83131 82906 83278 83709 83438 82437 81139
55446 81139 79727 78320 77430 77529 78343 79117 79407 79206 78630 77995 77900 78596 79435 79542 78858 78072 77708 77820 78419
55427 78419 79561 80984 82193 82973 83482 83838 83995 83972 83871 83682 83389 83243 83582 84375 85254 86001 86679 87273
55409 87273 87455 86829 85320 83326 81542 80519 80282 80456 80770 81182 81518 81357 80574 79694 79372 79690 80182 80428
55391 80428 80357 80170 80205 80801 82011 83492 84719 85255 84950 84186 83847 84545 85730 86123 85172 83534 81880 80048
55373 80048 77889 76279 76345 77993 79982 81310 81839 81749 81226 80751 80888 81474 81618 80770 79355 78086 77121
55356 77121 76280 75665 75532 75703 75587 74894 73985 73413 73349 73621 74148 75040 76271 77533 78500 79062 79202 78898 78345
55337 78345 78020 78182 78463 78313 77749 77339 77483 78138 79123 80205 80846 80496 79341 78348 78232 78695 78910 78461
55319 78461 77544 76522 75581 74739 74013 73574 73669 74227 74687 74593 74233 74260 74752 75165 75217 75177 75213 75100 74789 74644 74809
55298 74809 74886 74570 74130 73978 74237 74972 76290 77850 78854 78939 78646 78606 78832 79205 80012 81336 82403 82316 81285
55279 81285 80488 80781 81927 82988 83157 82380 81411 81045 81201 81197 80983 81414 82898 84545 85276 85139 84832 84531
55261 84531 84028 83602 83759 84282 84418 83993 83638 83910 84727 85606 85966 85375 84064 83029 83007 83440 83133 81806
55243 81806 80371 79633 79390 78966 78100 77128 76584 76749 77419 78178 78959 80066 81430 82369 82446 82127 82069 82205 82152
55224 82152 82066 82378 82998 83508 83865 84162 84054 83265 82386 82170 82258 81675 80504 79912 80343 80833 80474 79637 79281
55205 79281 79837 81199 83077 84918 86102 86649 87202 88003 88496 88334 88047 88181 88372 87936 86994 86410 86798 88008
55187 88008 89399 90285 90316 89762 89280 89170 89055 88417 87224 85896 84930 84733 85448 86722 87900 88599 88856 88692
55169 88692 87959 86814 85858 85501 85490 85420 85378 85777 86743 88027 89397 90866 92520 94241 95593 96062 95594 94732
55151 94732 94016 93428 92741 92173 92117 92419 92614 92829 93597 94672 94981 94139 93158 93026 93321 93002 92066 91545 92072
55132 92072 93216 94191 94577 94359 93721 92906 91976 90718 89033 87267 85884 85010 84615 84888 85966 87443 88643
55115 88643 89371 89996 90782 91570 92117 92376 92365 92158 92080 92556 93604 94746 95546 95933 95899 95288 94188 93257 93210
55096 93210 94009 94911 95340 95378 95287 94986 94359 93842 94166 95445 96919 97810 98118 98332 98708 99211 99914 100944 102050
55077 102050 102655 102454 101670 100699 99771 99042 98716 98884 99416 100102 100786 101336 101644 101670 101403 100863 100291 100114 100442
55058 100442 100806 100781 100718 101281 102324 102856 102228 100831 99417 98305 97508 97089 96988 96965 97095 97847 99187 100047
55040 100047 99361 97459 95793 95320 95669 95884 95407 94245 92658 91032 89810 89278 89444 90145 91156 92225
55024 92225 93171 93982 94670 95054 94915 94399 93976 93891 93866 93533 92986 92678 92841 93281 93720 94131 94566 94891 94929 94765
55004 94765 94726 94985 95437 95948 96538 97202 97784 98143 98259 98061 97438 96658 96467 97359 98872 100011 100358 100362 100531
54985 100531 100820 101045 101495 102698 104614 106390 107121 106755 106106 105876 105853 105340 104257 103365 103256 103633 103940 104222
54967 104222 104847 105711 106396 106984 107962 109326 110455 111011 111328 111693 111781 111159 109934 108606 107592 107149 107415
54950 107415 108207 109022 109408 109165 108207 106666 105220 104721 105187 105603 105092 103933 103022 102753 102838 102902 102748 102252
54932 102252 101485 100815 100522 100488 100658 101581 103952 107622 111536 114724 117062 119096 121571 125127 130005 135712
54916 135712 141222 145692 149000 151536 153636 155221 155841 155008 152658 149363 145938 142769 139603 136049 132163
54901 132163 128430 125316 122939 121140 119692 118397 117162 116112 115532 115541 115865 116101 116181 116307 116479 116468 116411 116972
54883 116972 118539 120621 122499 124247 126551 129606 132826 135684 138299 140959 143623 146166 148734 151374
54869 151374 153546 154382 153482 151268 148617 146206 144147 142103 139727 136990 134129 131476 129428 128289 127787
54854 127787 127011 125249 122833 120724 119268 117826 115667 112851 110102 108129 107110 106587 105878 104796 103836
54839 103836 103383 103101 102589 102277 102814 103815 104199 103853 103861 104843 105996 106286 105732 104942 104161 103411 102975 103038 103291
54820 103291 103447 103650 103955 103995 103762 104044 105369 107003 107787 107553 106961 106416 106033 106240 107358 108727 109295 109110
54802 109110 109326 110555 112049 112722 112349 111498 110877 110974 111837 112905 113377 112980 112093 111105 110005 108706 107390
54785 107390 106384 105910 106046 106715 107730 109012 110627 112446 113948 114758 115196 115936 117192 118721 120487 122828
54769 122828 125888 129294 132534 135453 138379 141868 146229 151112 155740 159719 163233 166173 167645 166972
54755 166972 164871 162796 161209 159208 155919 151595 147225 143578 140754 138227 135274 131745 128408 126126
54741 126126 124859 123997 123478 123831 125138 126783 128336 129874 131167 131408 130254 128533 127370 127087 127417 128322
54725 128322 129962 132096 134130 135749 137198 138978 141505 144907 148871 152706 155736 157641 158393 158038 156613
54710 156613 154127 150657 146624 142907 140283 138684 137317 135566 133456 131229 128984 126875 125177 123862
54696 123862 122524 121060 120056 120059 120684 120873 119993 118397 116955 116295 116425 116851 117017 116744 116295 116057 116207 116668
54678 116668 117198 117550 117670 117755 117924 117923 117445 116665 116098 115901 115745 115482 115414 115672 115777 115277 114497 114135 114263 114195
54658 114195 113390 112116 111071 110624 110577 110559 110466 110538 111088 112182 113531 114660 115256 115412 115533 115907 116416 116760
54640 116760 116906 117030 117060 116666 115857 115139 114806 114486 113833 113283 113518 114391 115061 115134 115005 114989 114835 114368 114001 114142
54620 114142 114500 114426 113811 113284 113532 114629 115969 116774 116689 116003 115306 115064 115512 116663 118166 119337 119681 119302
54602 119302 118597 117778 117055 116931 117722 118901 119561 119530 119464 119788 120154 120084 119611 119140 119084 119676 120697 121400 121275
54583 121275 120845 121069 121907 122311 121747 120917 120670 121039 121771 122894 124144 124626 123856 122614 122004 122060 121975 121331
54565 121331 120342 119203 117999 117127 117067 117739 118642 119559 120524 121222 121122 120304 119600 119688 120429 121292 122093 123179
54547 123179 124983 127424 129666 130644 130058 128749 127876 127899 128557 129466 130347 130917 131061 131019 131001 130730 129813 128452
54529 128452 127285 126586 126090 125622 125395 125535 125764 125738 125419 124959 124494 124193 124302 124916 125794 126529 126867 126904 126975
54510 126975 127294 127636 127541 126914 126208 125861 125829 125922 126325 127338 128743 129874 130284 130052 129455 128763 128290 128280 128637
54491 128637 129043 129367 129661 129751 129278 128324 127700 128274 130067 132208 133818 134806 135750 137024 138256 138844 138810 138789
54473 138789 139144 139603 139915 140396 141428 142863 144338 145810 147237 148095 147908 147123 146700 146858 146928 146514 146052
54456 146052 145985 146060 145821 145220 144340 142966 140990 138916 137481 136920 136960 137327 137877 138455 139048 139961 141305 142399
54438 142399 142234 140704 138932 138093 138257 138675 138903 139203 139964 141132 142317 143154 143442 143156 142492 141796 141333
54421 141333 141173 141275 141533 141660 141346 140685 140192 140196 140383 140264 139896 139755 140033 140448 140734 140894 141001 141160 141720
54402 141720 143048 144958 146742 147927 148651 149146 149359 149333 149532 150399 151811 153276 154409 154991 154894 154278 153644
54385 153644 153362 153362 153435 153564 153702 153622 153337 153275 153682 154194 154424 154645 155387 156685 158296 160362 163165 166339 169014
54366 169014 170806 172104 173333 174394 174905 174614 173556 172165 171132 170716 170231 168760 166352 164016 162482
54351 162482 161526 160605 159599 158692 157956 157284 156443 155051 152863 150244 148046 146845 146493 146474 146370 146000 145520
54334 145520 145452 146163 147224 147743 147487 147178 147500 148268 148912 149272 149531 149710 149697 149534 149303 148876 148130 147252 146508
54315 146508 145883 145263 144793 144697 144839 144883 144855 145115 145678 145946 145339 143976 142476 141203 139973 138533 137095 136188
54297 136188 136128 136779 137827 139082 140456 141880 143357 144929 146451 147624 148395 149103 149964 150651 150711 150241 149780
54280 149780 149634 149645 149607 149529 149495 149607 150038 150810 151512 151622 151117 150482 150154 150354 151357 153304 155650 157358 157958
54261 157958 157974 158092 158371 158622 159045 159954 161151 162083 162552 162881 163450 164351 165384 166099 165954 164795 163147 161736
54243 161736 160772 159923 158920 157857 156874 155938 155095 154673 154938 155651 156202 156178 155617 154696 153436 151910 150541
54226 150541 149848 149903 150363 151107 152394 154170 155648 156045 155536 154991 154911 155161 155663 156711 158309 159685 159849
54209 159849 158502 156258 154087 152607 151742 150936 149844 148750 148177 148244 148670 149251 149899 150385 150526 150595 150945
54192 150945 151238 150742 149535 148712 149086 150336 151763 153163 154459 155159 155002 154670 155005 155717 155727 154749 153764
54175 153764 153774 154744 156045 157337 158594 159570 159724 158706 156726 154405 152387 151026 150308 149943 149503 148699
54159 148699 147743 147351 148061 149466 150442 150311 149532 149114 149622 150889 152353 153338 153265 152048 150269 148711 147829
54142 147829 147770 148614 150234 152042 153259 153473 152803 151655 150506 149727 149354 149184 149296 150165 151904 153673 154372
54125 154372 153859 153063 152971 153925 155835 158466 161361 163876 165596 166558 167088 167649 168796 170829 173428 175971
54109 175971 178271 180641 183166 185447 187255 188926 190686 191987 192121 191321 190664 190816 191368 191592 191416 191294
54093 191294 191365 191202 190457 189362 188414 187770 187193 186464 185544 184337 182632 180496 178532 177499 177645 178530 179446
54076 179446 179976 180192 180464 181042 181789 182357 182655 182997 183680 184534 185104 185230 185289 185789 186790 187756 187980 187225 186009
54057 186009 185193 185203 185723 186144 186230 186273 186748 187960 189917 192356 194906 197317 199597 201941 204597 207783 211602
54040 211602 215932 220448 224860 229121 233464 238314 244046 250590 257287 263347 268527 273088 277079 280086
54026 280086 281958 283469 285829 289566 294033 297932 300116 300114 298303 295617 292885 290341 287813 285209 282615
54011 282615 280012 277175 273911 270204 266063 261454 256456 251436 246946 243375 240676 238470 236465 234749
53997 234749 233553 232771 231888 230422 228275 225697 223105 220969 219548 218577 217463 215938 214386 213465 213562 214612
53981 214612 216089 217168 217309 216898 216953 218004 219762 222086 225663 231140 238000 245015 251570 257830 263685
53966 263685 268289 270851 271314 270015 267120 262745 257358 251774 246750 242663 239454 236868 234783 233314
53952 233314 232540 232364 232803 234151 236479 239156 241316 242834 244442 246829 249959 253361 256743 260101 263433
53937 263433 266613 269519 272220 274941 277778 280510 282932 285355 288428 292286 296299 299974 303672 307982
53923 307982 312709 317185 321397 326155 332074 338967 346281 353588 360568 367061 373351 379935 386740 392941
53909 392941 397727 400948 402863 403686 403595 402857 401647 399966 397931 395892 394029 392020 389290 385505 380777
53894 380777 375533 370163 364588 358240 350781 342772 335212 328436 322014 315784 310313 306037 302515 299050
53880 299050 295566 292355 289206 285460 280850 275831 271094 267109 264112 262043 260393 258429 255805 252813
53866 252813 249880 247045 244091 241095 238506 236554 234825 232720 230254 228029 226306 224519 222030 219066
53852 219066 216433 214481 212862 211302 210073 209555 209694 210080 210259 209936 209195 208626 208846 209821 210947 211871 212763
53835 212763 213674 214131 213705 212604 211370 210325 209639 209631 210512 211898 212961 213110 212424 211528 211139 211616 212760
53818 212760 214150 215648 217449 219667 222177 224866 227701 230490 232988 235356 238092 241334 244667 247794
53804 247794 250971 254571 258688 263441 269116 275556 281873 287266 291784 295841 299420 302326 304914 307858
53790 307858 311324 314867 317970 320172 320956 320177 318535 316948 315508 313553 310731 307359 303758 299913 295859
53775 295859 291746 287396 282408 276962 271963 268115 265302 263047 261001 258688 255414 251083 246700 243425
53761 243425 241283 239365 237194 235223 233881 232668 230664 227735 224802 222845 221895 221194 220217 219242 218877
53746 218877 219282 220067 220778 221272 221697 222295 223125 223834 223864 223094 222086 221381 220814 219977 219143 219114 220128 221617
53728 221617 223171 225026 227245 229102 229955 230356 231568 234020 236833 238876 239866 240355 241030 242128 243284
53713 243284 243853 243622 243252 243756 245526 248096 250836 253504 256024 258150 259719 261004 262443 264113 265736
53698 265736 267262 269157 272064 276246 281361 286607 291160 294691 297499 299946 301742 302080 300596 297908
53684 297908 294983 292252 289673 287449 286108 285823 286103 286373 286566 286923 287475 288029 288482 288839 289001 288789 288187
53667 288187 287332 286307 285119 283913 283009 282655 282833 283318 283856 284212 284161 283501 282178 280474 279046 278605 279416
53650 279416 281153 283231 285161 286591 287339 287622 288078 289313 291439 294199 297339 300594 303529 305800 307630
53635 307630 309688 312396 315529 318547 321074 323015 324470 325728 327150 328898 330794 332491 333756 334669
53621 334669 335714 337636 340906 345266 349950 354462 358925 363577 368182 372139 375088 377231 379186 381586
53607 381586 384714 388316 391793 394673 396916 398731 400236 401361 401998 402139 401949 401777 402034 402909 404187 405355
53591 405355 405918 405706 405017 404445 404369 404522 404245 403156 401406 399237 396639 393629 390533 387625 384656 381169
53575 381169 377314 373935 371728 370548 369698 368699 367658 366994 366967 367429 367986 368382 368723 369206 369750 370087 370158 370134
53557 370134 369998 369481 368620 368045 368365 369403 370420 371074 371878 373605 376473 379948 383238 385976 388515 391538
53541 391538 395311 399448 403543 407752 412416 417319 421871 426060 430659 436312 442935 450277 458568 468160
53527 468160 478863 490078 501355 512395 522905 533072 543925 556533 570820 585867 601345
53516 601345 617935 636142 655459 675098 694942 715268 736066 757217 778994 801662 824692
53505 824692 846970 867850 887562 906688 925640 944622 963515 981649 998211 1013237 1027885
53494 1027885 1043383 1059833 1076339 1092160 1107316 1122142 1136682 1150796 1164583 1178337 1192138
53483 1192138 1205844 1219543 1233589 1247949 1261812 1274217 1284874 1293930 1301071 1305480 1306865 1306007
53471 1306007 1304001 1301250 1297440 1292094 1284763 1274980 1262641 1248474 1233781 1219550 1205869 1192109
53459 1192109 1177538 1161921 1145709 1129571 1113583 1097086 1079503 1061073 1042534 1024343 1006572
53448 1006572 989350 972945 957451 942842 929352 917419 907214 898517 891071 884758 879432 874967
53436 874967 871559 869582 869019 869329 870110 871657 874686 879616 886181 893672 901513 909776 919142 930233 943013
53421 943013 957012 972058 988537 1006902 1027202 1049009 1071618 1094346 1117039 1140350 1165216
53410 1165216 1192023 1220523 1250459 1281859 1314672 1348723 1384199 1421660 1461240 1502175 1543542
53399 1543542 1585175 1627633 1671544 1717255 1764733 1813335 1861922 1909654 1956625 2003371 2049894
53388 2049894 2095580 2139880 2182592 2223491 2262204 2298584 2332796 2364875 2394449 2421016 2444211
53377 2444211 2463662 2478864 2489448 2495455 2497189 2494809 2488118 2476593 2459626 2436935 2408832 2376035
53365 2376035 2339203 2298863 2255769 2210972 2165253 2118678 2071014 2022562 1974349 1927504 1882573
53354 1882573 1839401 1797487 1756425 1716170 1676973 1638966 1601867 1565280 1529206 1493982 1459690
53343 1459690 1426045 1393131 1361858 1333223 1307227 1283058 1260342 1239694 1221783 1206281 1192091
53332 1192091 1178383 1164974 1151854 1138835 1125832 1113191 1101501 1091050 1081502 1072141 1062510 1052856
53320 1052856 1043832 1035782 1028575 1022239 1017391 1014621 1013591 1013201 1012659 1012120 1012249 1013530 1016094 1019949 1025137
53305 1025137 1031747 1039816 1049191 1059610 1071139 1084307 1099460 1116106 1133391 1151193 1170202 1190803
53293 1190803 1212522 1234846 1257899 1281716 1305337 1327362 1347263 1365478 1382340 1397643 1411324
53282 1411324 1423728 1434806 1443590 1449068 1451258 1450885 1448171 1442557 1433732 1422437 1409918 1396733 1382395
53269 1382395 1366076 1347476 1326999 1305288 1282721 1259311 1235016 1210055 1184836 1159587 1134183
53258 1134183 1108434 1082452 1056578 1031026 1005748 980677 955897 931576 907887 885008 862970
53247 862970 841435 819880 798161 776686 755899 735849 716478 698065 680991 665223 650468
53236 650468 636786 624630 614203 605108 596739 588706 580766 572696 564469 556356 548654 541327 534058
53223 534058 526487 518310 509338 499638 489518 479227 468748 457999 447178 436817 427483 419387 412193
53210 412193 405260 398261 391575 385867 381209 376816 371736 365661 358993 352268 345752 339494 333578 328183
53196 328183 323379 318947 314506 309878 305199 300587 295962 291369 287291 284256 282223 280702 279370 278209
53182 278209 277041 275425 273130 270347 267340 264262 261451 259414 258199 257087 255232 252458 249313 246574
53168 246574 244853 244279 244317 244116 243333 242433 242107 242610 243768 245185 246209 246165 245015 243478 242153 240888 239366
53151 239366 237865 236956 236781 237186 238198 239699 240900 240979 240223 239798 240306 241187 241655 241538 241014 240226 239527 239525
53133 239525 240415 241667 242778 243948 245581 247444 248886 249676 250133 250476 250629 250711 251225 252540 254436 256413
53117 256413 258218 259845 261158 261853 261839 261373 260681 259692 258363 257043 256108 255251 253659 251116 248585 247234
53101 247234 247125 247239 246710 245605 244516 243901 243913 244406 244841 244515 243236 241638 240579 240328 240519 240681 240510
53084 240510 239771 238380 236699 235407 234852 234674 234221 233243 232001 230787 229620 228468 227487 226855 226500 226213
53068 226213 225970 225943 226188 226542 226833 226944 226645 225654 224085 222638 222105 222686 223910 225133 225998 226621 227468 228936
53050 228936 230867 232622 233799 234671 235661 236546 236583 235390 233372 231230 229410 228068 227210 226678 226219 225783
53034 225783 225607 225844 226291 226626 226785 226905 227010 226982 226763 226374 225722 224653 223292 222195 221932 222488 223219 223459
53016 223459 223173 222897 223143 223941 224987 226090 227331 228751 229994 230434 229746 228335 227029 226341 226195 226415
53000 226415 227179 228698 230659 232388 233544 234317 234910 235260 235355 235424 235581 235636 235526 235712 236815 238927 241445
52983 241445 243492 244506 244701 245062 246583 249255 252047 254037 255231 256063 256555 256413 255672 254744 253915 253167
52967 253167 252419 251651 250910 250476 250792 251950 253401 254515 255162 255414 255071 254040 252865 252148 251571 250217 247930
52950 247930 245625 244122 243370 243046 243226 243969 244674 244491 243273 241717 240519 239622 238449 236794 235328 234972
52934 234972 235809 236905 237349 237059 236356 235259 233772 232458 232001 232345 232918 233506 234209 234702 234433 233619 233143
52917 233143 233357 233808 234324 235427 237236 238837 239359 239044 238683 238581 238568 238470 238006 236749 234828 233210 232700
52900 232700 233029 233463 233835 234364 234893 235084 235075 235235 235516 235710 236121 237219 238755 239914 240272 240010 239263 237983
52882 237983 236431 235137 234323 233909 234063 235090 236721 238210 239291 240453 242129 244221 246580 249252 251952
52867 251952 253931 254861 255405 256405 257863 259152 259923 260270 260192 259469 258131 256567 255042 253368 251206 248519
52851 248519 245608 242813 240349 238305 236621 234974 232901 230256 227487 225224 223608 222336 221378 221188 221918
52836 221918 222858 223166 222909 222808 223077 223144 222642 222063 222127 222889 223814 224490 224946 225351 225726 225926 225811 225387 224813
52817 224813 224257 223812 223613 223842 224365 224565 223913 222720 221919 222029 222717 223457 224180 224977 225516 225193 223767 221630
52799 221630 219532 218184 217922 218461 219025 218957 218193 217103 215978 214888 213903 213244 213178 213870 215329 217385 219726
52782 219726 221984 223749 224591 224324 223393 222723 222896 223538 223755 223128 222045 221057 220173 219025 217581 216480 216511
52765 216511 217773 219432 220400 220239 219360 218426 217796 217561 217745 218167 218315 217830 217169 217424 219161 221611 223304
52748 223304 223507 222895 222773 223839 225733 227620 228971 229838 230576 231510 232786 234326 235788 236632 236489 235583
52732 235583 234729 234721 235708 237208 238679 239851 240530 240448 239574 238362 237360 236645 236011 235619 236003 237265 238673
52715 238673 239371 239269 238916 238687 238424 237848 236937 235820 234513 232995 231461 230344 229970 230174 230378 230158 229688
52698 229688 229435 229474 229452 229223 229104 229311 229501 229260 228777 228606 228926 229396 229643 229484 228791 227643 226625 226434 227033
52679 227033 227626 227688 227613 228099 229250 230650 232043 233438 234648 235208 234927 234230 233760 233854 234526 235807 237755
52662 237755 240115 242297 243870 244938 245839 246671 247451 248574 250546 253122 255221 256013 255724 255016 254022 252575
52646 252575 251049 250146 249841 249274 247959 246483 245635 245280 244606 243248 241793 241253 242253 244619 247461 249739
52630 249739 250996 251655 252552 254184 256342 258281 259210 258860 257718 256584 255801 255030 253773 251928 249809 247881
52614 247881 246596 246189 246457 246925 247372 247921 248520 248719 248284 247742 247842 248593 249270 249350 249055 248885 249027 249429 250174
52595 250174 251430 253066 254576 255526 255997 256436 257113 257860 258396 258729 259102 259666 260414 261330 262348 263235 263801
52578 263801 264168 264496 264510 263819 262752 262335 263158 264697 266098 267122 267896 268217 267757 266760 265796 264884 263491
52561 263491 261550 259872 259270 259646 260178 260193 259669 259108 259020 259404 259691 259412 258864 258798 259444 260220 260470 260108 259364
52542 259364 258345 257173 256191 255682 255528 255470 255579 256170 257395 259138 261172 263139 264573 265330 265885 266828 268057
52525 268057 268839 268712 267985 267281 266963 267142 267832 268788 269472 269579 269501 269982 271371 273488 276115 279206 282583
52508 282583 285799 288484 290583 292120 293019 293381 293577 293658 292886 290408 286442 282360 279390 277586 276225 274812
52492 274812 273343 271945 270801 270280 270576 271159 271027 269757 267989 266652 266021 265789 265776 266196 267285 269005
52476 269005 271142 273427 275537 277211 278439 279452 280456 281454 282319 282926 283289 283749 284977 287520 291274
52461 291274 295556 299720 303429 306330 307924 308040 307154 305816 303847 300566 295858 290719 286629 284462 284016
52446 284016 284300 284241 283357 281932 280435 278858 276852 274493 272506 271444 270984 270415 269624 269195 269517 270219 270627
52429 270627 270502 270123 269874 269958 270491 271634 273503 275954 278527 280631 281880 282296 282239 282200 282651 283959 286333
52412 286333 289817 294356 299845 306130 313073 320647 328809 337135 344662 350292 353396 353991 352369 348762
52398 348762 343405 336862 330134 324330 320061 317091 314691 312389 310265 308508 306984 305495 304306 303983
52384 303983 304725 306140 307742 309382 311099 312839 314498 316144 317999 320315 323317 327127 331621 336465
52370 336465 341350 346085 350385 353815 356173 357794 359196 360436 361045 360637 359385 357837 356481 355612 355417
52355 355417 355868 356540 356845 356625 356366 356657 357575 358817 360312 362297 364741 367102 368997 370860 373572 377467
52339 377467 381984 386334 390328 394512 399655 406113 413572 421396 429286 437522 446515 456327 466892 478511
52325 478511 491755 506827 523288 540424 557630 574444 590514 605705 620097 633866 647342
52314 647342 660998 675090 689310 703154 716580 729898 743007 755302 766507 777033 787196
52303 787196 796551 804507 811266 817571 823753 829476 834324 838141 840795 842091 842033 840791 838251 833885 827361
52288 827361 819203 810754 803396 797624 792727 787466 781310 775020 769983 767144 766684 768434 772065 776987
52274 776987 782638 789086 796976 806605 817311 827982 838015 847511 856818 866213 875961 886249 896956
52261 896956 907753 918482 929222 939812 949613 958087 965505 972732 980262 987740 994495 1000201 1004729
52248 1004729 1007710 1008619 1007258 1003760 998173 990462 981030 970807 960514 950045 938815 926621 913951
52235 913951 901556 889910 879022 868612 858475 848779 839962 832327 825889 820582 816398 813143 810363
52222 810363 807790 805694 804492 804092 803923 803644 803502 803941 805114 806926 809342 812406 815961 819550 822742
52207 822742 825529 828290 831322 834460 837247 839396 841014 842440 844082 846294 849194 852515 855849 859086
52193 859086 862463 866216 870472 875424 881229 887562 893600 898655 902567 905328 906599 905929 903216 898744
52179 898744 892967 886475 879843 873192 866103 858355 850499 843367 837199 831764 827177 824045 822704 822773 823648
52164 823648 825087 827146 829723 832436 834943 837393 840467 844708 849639 853873 856383 857470 858129 858741 858933
52149 858933 858549 858131 858355 859502 861572 864375 867358 869865 871814 873734 875892 877857 879232 880476 882588
52134 882588 886171 891156 897210 904183 912282 922110 934318 948957 965331 982785 1001490 1022133 1044889
52121 1044889 1069028 1093542 1117859 1141911 1165786 1189438 1212527 1234400 1254276 1271619 1286337
52110 1286337 1298631 1308653 1316313 1321381 1323806 1323942 1322475 1320071 1317098 1313639 1309725 1305504 1301227 1297043
52096 1297043 1292780 1287886 1281691 1273743 1263958 1252509 1239625 1225486 1210259 1194260 1178070 1162434
52084 1162434 1148033 1135360 1124707 1116025 1108882 1102966 1098726 1097154 1098632 1102355 1107201 1112873 1119764
52071 1119764 1127995 1137197 1147093 1157676 1168760 1179926 1191015 1202090 1212753 1222083 1229563 1235671
52059 1235671 1241273 1246855 1252554 1258496 1264574 1270168 1274520 1277262 1278337 1277661 1275180 1270991 1265039 1256824
52045 1256824 1245825 1232113 1216253 1198756 1179963 1160384 1140748 1121714 1103773 1087325 1072538
52034 1072538 1059170 1046870 1035624 1025601 1016615 1008082 999524 990836 982082 973376 964989 957137 949530
52021 949530 941526 932958 924521 917030 910511 904277 897724 890741 883447 875871 867924 859447 850186 839950
52007 839950 828921 817732 807062 797075 787199 776494 764403 751312 738317 726324 715473 705596
51995 705596 697004 690313 685396 681065 676171 670704 665349 660254 654856 648802 642302 635375 627516 618491
51981 618491 608918 599429 589626 578545 566012 552949 540416 528928 518750 510224 503539 498593 495351
51968 495351 494004 494530 496438 499258 503104 508408 515201 522876 530622 537842 544106 548864 551457 551526 549388
51953 549388 545844 541598 537038 532617 529023 526664 525301 524647 525235 528226 534431 543931 556610 572546
51939 572546 591781 614028 638570 663955 687878 707990 723037 732860 737375 736250 729682 718699
51927 718699 704299 686908 667032 645797 624352 603311 583174 564541 547236 529959 511925
51916 511925 494462 479918 469027 460316 452169 444479 438027 433208 429967 428369 428525 430194 433010 436971
51902 436971 442279 448707 455483 461883 467685 472838 476800 478449 476889 472235 465436 457366 448418 438994
51888 438994 429898 421854 414977 409090 404387 401346 400067 400116 401066 402937 406095 410909 417395 424911 432314
51873 432314 438687 443918 448403 452358 455659 458113 459500 459540 458200 455926 453216 450100 446468 442735 439672
51858 439672 437708 436904 437481 439704 443189 446964 450370 453316 455529 456267 455123 452585 449326 445334 440178
51843 440178 433821 426783 419701 413110 407446 402884 399162 395821 392578 389413 386551 384459 383629 384092 385296
51828 385296 386618 387770 388563 388583 387437 385183 382277 379225 376471 374393 373095 372259 371464 370622 370003 369945
51812 369945 370701 372351 374559 376568 377812 378566 379647 381371 383014 383473 382335 380183 377975 376318 375368
51797 375368 375086 375277 375394 374697 372852 370222 367423 364825 362698 361544 361787 363264 365455 368176 371530
51782 371530 375210 378414 380627 381956 382604 382532 381963 381606 381958 382767 383614 384702 386637 389786 394238 400060
51766 400060 407028 414444 421762 429201 437077 444695 450535 453513 453481 450595 445037 437497 429149 420723 412135
51751 412135 403358 395100 388079 382049 376212 370436 365551 362418 361114 361028 361471 362156 363355 365648 369424
51736 369424 374651 381121 388574 396316 403047 407671 410266 411852 413164 414150 414782 415737 417782 420783 423726
51721 423726 425596 425878 424415 421318 417127 412634 408341 404257 400330 396791 393971 391970 390655 389847 389422
51706 389422 389361 389787 390866 392562 394617 396784 398916 400789 402056 402550 402442 402092 401907 402323 403495 404825
51690 404825 405223 404169 402225 400191 398121 395584 392501 389175 385756 382408 379883 379054 379737 380664 381005
51675 381005 381376 382974 386223 390651 395686 400989 406274 411356 416404 421761 427470 433150 438247 442196
51661 442196 444460 444682 442875 439364 434616 429319 424523 421448 420948 423008 426672 430556 433676 435837 437149
51646 437149 437331 435888 432916 429172 425233 421068 416704 412791 410001 408182 406577 404660 402332 399581
51632 399581 396481 393392 390638 388016 385099 381948 378995 376256 373220 369633 365864 362341 359120 356207
51618 356207 353808 351949 350255 348460 346796 345511 344303 342688 340753 339117 338230 338086 338519 339385 340450
51603 340450 341580 343135 345834 350072 355650 362313 370169 379251 388903 397935 405304 410384 412752 412223
51589 412223 409179 404535 399201 393793 388921 385345 383515 383139 383597 384734 387006 390885 396433 403443 411719
51574 411719 420978 430729 440522 450406 460981 472808 485643 498363 509848 520003 529816 540473
51562 540473 552812 567634 585958 608349 634194 662156 691243 720925 750213 777230 799955
51551 799955 817120 828336 833713 833506 827855 816833 800995 781789 760922 739313 717163 695062
51539 695062 674277 655735 639377 624854 612104 600675 589218 576464 562417 547895 533251
51528 533251 518350 503598 490080 478497 468530 459347 450281 441043 431813 423250 415999 410114 405269
51515 405269 401381 398491 396109 393335 389827 386149 383056 380831 379385 378450 377505 376050 374221 372777 372231
51500 372231 372346 372637 372928 373225 373444 373625 374081 375040 376366 377823 379322 380803 382163 383495 384977 386326
51484 386326 386794 386034 384568 383036 381367 379079 376081 372731 369342 366085 363138 360491 357706 354366 350655
51469 350655 347129 344042 341296 338905 336995 335445 334024 332846 332215 332007 331714 331181 330755 330630 330659 331032
51453 331032 332481 335297 338583 341147 342991 345414 349685 356070 364144 373522 384003 395261 406676
51440 406676 417454 426853 434407 440058 444072 446811 448552 449450 449482 448412 445957 442040 436806 430386 422822
51425 422822 414347 405612 397501 390718 385536 381787 378988 376638 374585 373071 372286 371986 371786 371725 372184 373219
51409 373219 374298 374874 374975 375038 375372 375970 376648 377180 377458 377775 378758 380740 383351 386030 388851 392553 397778
51392 397778 404587 412630 421332 429912 437774 445213 453568 464421 478733 496734 518301 543234 571432
51379 571432 603129 638893 679074 723172 769639 816112 859770 897843 928267 950041 962973
51368 962973 967206 963119 951500 933512 910331 882792 851363 816486 779078 740593 702437 665346
51356 665346 629605 595875 565269 538392 514707 493354 474362 458550 446228 436519 428136 420462
51344 420462 413682 408088 403565 399660 395994 392588 389862 388258 387725 387571 386867 385125 382654 380219 378259
51329 378259 376419 373977 370702 367134 363969 361415 359251 357216 355136 352924 350796 349343 348987 349423 349977
51314 349977 350517 351605 353626 356142 358282 359503 359772 359282 358293 357155 356191 355539 355185 355071 355087 355019 354617
51297 354617 353687 352175 350336 348824 348296 348736 349408 349644 349462 349215 349008 348904 349460 351430 354889 359222 364072
51280 364072 369713 376166 382456 387313 390344 392015 392698 392394 391420 390640 390652 391148 391524 391833 392720 394465 396516
51263 396516 398012 398490 397983 396667 394613 391858 388603 385278 382331 379869 377554 374969 372066 369189 366709
51248 366709 364746 363238 362097 361251 360640 360211 359824 359179 358002 356397 354885 353949 353572 353320 352863 352322 352053
51231 352053 352131 352160 351655 350529 349108 347706 346410 345344 344778 344764 344852 344550 343985 343776 344317 345471 346941 348503
51213 348503 349888 350944 352098 354104 357014 359882 361933 363583 365708 368243 370280 371507 372758 374901
51199 374901 377817 380789 383334 385217 386075 385676 384391 382876 381292 379311 376925 374805 373659 373512 373878
51184 373878 374421 375166 376166 377260 378227 379025 379801 380716 381838 383152 384576 385933 386948 387305 386816 385599
51168 385599 384109 382902 382299 382265 382605 383256 384325 385862 387696 389528 391140 392451 393396 393870 393817 393299 392388
51151 392388 391046 389256 387294 385727 384993 384934 384878 384231 383011 381797 381209 381448 382285 383382 384494 385363 385624
51134 385624 385123 384371 384327 385356 386550 386535 385066 383389 382824 383387 384191 384895 386092 388231 390716 392434 392984
51117 392984 393090 393851 395738 398320 400866 403152 405536 408226 410766 412525 413559 414562 415981 417590 419021
51102 419021 420252 421370 422268 422927 423676 424757 425865 426514 426765 427153 427967 428958 429805 430476 431055 431519 431789
51085 431789 431846 431720 431538 431534 431807 432062 431914 431521 431587 432556 434053 435392 436443 437721 439710 442379 445436 448847
51067 448847 452975 458300 465144 473713 484377 497731 514250 533722 554959 575988 594657 609516
51055 609516 620531 629064 636952 645446 654862 664851 674627 683119 689493 693689 696153 696863 695133 690597
51041 690597 683951 676219 667753 658632 649797 642709 637502 632190 624369 613431 600641 587422 574276
51028 574276 561347 549253 538923 530877 524980 520769 517824 515993 515440 516480 519309 523962 530585 539399
51014 539399 550154 561748 572709 582138 590092 597102 603563 609587 615171 620261 624639 627901 629667
51001 629667 629893 629041 627846 626815 625927 624858 623482 622091 621142 620846 621025 621364 621955 623572 627210 633190
50985 633190 640880 649498 659038 670118 682932 696669 710040 722181 733087 743421 754042 765548
50973 765548 778221 792483 809225 829383 853179 880177 910164 943602 981043 1022420 1067117
50962 1067117 1114469 1163935 1215018 1267237 1319986 1372196 1422426 1469550 1513112 1552728 1587477
50951 1587477 1616396 1639403 1657249 1670617 1679779 1685181 1687835 1688876 1688980 1688337 1686842 1684135 1679743
50938 1679743 1673532 1665952 1657626 1648749 1639033 1628172 1616172 1603116 1588685 1572092 1552597 1530044
50926 1530044 1504696 1476564 1445246 1410662 1373685 1335770 1298043 1260963 1224646 1189130 1154481
50915 1154481 1121078 1089809 1061481 1035937 1012172 989517 968370 949583 933445 919428 906583
50904 906583 893995 881211 868628 857249 847731 839813 832879 826748 821527 816948 812461 807995 804060
50891 804060 800996 798542 796413 794872 794399 795006 796261 797887 799960 802517 805329 808160 811028 814144 817821
50876 817821 822590 829044 837186 846060 854464 862218 870453 880523 892829 906864 922078 938410 956097
50863 956097 975357 996332 1019114 1043766 1070513 1100003 1133204 1170899 1213389 1260801 1313592
50852 1313592 1372546 1438207 1510435 1588713 1672894 1763473 1860936 1964986 2074610 2188692 2306046
50841 2306046 2424753 2541972 2654778 2760842 2857943 2943317 3014237 3069257 3108384 3132183
50831 3132183 3141391 3137469 3122741 3099573 3069937 3036140 3001381 2968851 2940446 2916862 2898660 2886444
50819 2886444 2879774 2876468 2873352 2867579 2857117 2840342 2815654 2781625 2737425 2683043 2619081 2546335
50807 2546335 2465607 2377983 2285339 2190335 2095643 2003011 1913202 1826978 1745967 1672203 1606770
50796 1606770 1549242 1498623 1454448 1416653 1384803 1358151 1336357 1319482 1307135 1298203 1291644 1287046
50784 1287046 1284107 1282114 1280339 1278549 1276667 1274265 1270968 1267106 1263336 1259624 1255136 1249173 1241701 1232897
50770 1232897 1222637 1210712 1197233 1182575 1167084 1150957 1134295 1117201 1099954 1083099 1067196
50759 1067196 1052465 1038840 1026360 1015250 1005703 997857 991972 988287 986704 987066 989769 995588 1004623
50746 1004623 1015954 1028803 1043706 1061978 1084201 1109785 1138028 1169064 1203552 1241747 1283154
50735 1283154 1327008 1372990 1421461 1472982 1527440 1583749 1640619 1697509 1754589 1811900 1868978
50724 1868978 1925242 1980097 2032356 2080012 2121083 2154406 2179214 2194321 2198424 2191218 2173682 2147290
50712 2147290 2113660 2075156 2035085 1996603 1961643 1931219 1906324 1887870 1875811 1869003 1866055 1865946
50700 1865946 1867674 1869679 1869847 1865945 1856026 1838827 1814070 1782289 1744284 1700881 1653250 1603147
50688 1603147 1552497 1502768 1454880 1409571 1367683 1330080 1297467 1270302 1248795 1233001 1222913
50677 1222913 1218506 1219680 1226123 1237204 1251966 1269436 1289086 1310841 1334391 1358573 1381806 1403221
50665 1403221 1423034 1441746 1459363 1475710 1491180 1506702 1522937 1539779 1556637 1573018 1588806
50654 1588806 1604297 1620132 1637113 1655887 1676636 1699082 1722903 1748241 1775754 1806015 1838948
50643 1838948 1873990 1910778 1949315 1989461 2030555 2071750 2112417 2152028 2189901 2225495 2258896
50632 2258896 2290780 2321839 2352484 2383005 2413645 2444019 2472197 2494431 2506244 2504422 2488426
50621 2488426 2460232 2423276 2381789 2340528 2303821 2274053 2251276 2234577 2223556 2218247 2218190 2222240
50609 2222240 2228941 2236389 2241858 2242403 2236146 2222568 2201422 2172033 2134011 2088275 2036755 1981175
50597 1981175 1922434 1861194 1798648 1736424 1675762 1616989 1559881 1504479 1451444 1401695 1355904
50586 1355904 1314316 1276777 1242888 1212357 1185233 1161509 1140528 1121408 1104310 1090657 1081456
50575 1081456 1075849 1072085 1069637 1069443 1072118 1076950 1083030 1090495 1099971 1111351 1123905 1137450 1152671
50562 1152671 1170175 1189691 1210467 1232170 1255022 1279113 1303941 1328939 1354248 1380458 1407482
50551 1407482 1434244 1459849 1484553 1509031 1533146 1556352 1579214 1603525 1630718 1660979 1694250
50540 1694250 1731242 1772808 1818921 1869006 1922956 1981246 2044327 2112525 2186357 2266329 2352425
50529 2352425 2444184 2541225 2643279 2749756 2859621 2971581 3084071 3195105 3302540 3404387
50519 3404387 3498570 3582545 3653650 3709848 3749864 3772764 3777888 3765121 3734773 3687288 3623653
50508 3623653 3546233 3458647 3364627 3267421 3170381 3077466 2992569 2918574 2857413 2810695 2779747
50497 2779747 2765032 2765854 2780645 2807304 2843291 2885483 2929922 2971627 3005038 3025209 3028830 3014161
50485 3014161 2980394 2927667 2857743 2774067 2680558 2580370 2475964 2369913 2264916 2162855
50475 2162855 2064446 1970211 1881380 1799262 1723969 1654416 1589658 1529618 1474371 1423488 1376603
50464 1376603 1334137 1296772 1264415 1236309 1212053 1191873 1175885 1163760 1155226 1150311 1148807 1150021
50452 1150021 1153459 1159339 1168028 1179292 1192594 1207909 1225709 1246189 1268869 1292922 1317474 1341445
50440 1341445 1363387 1381690 1395009 1402703 1405221 1404006 1400697 1396264 1391046 1385499 1380542 1377026 1375183
50427 1375183 1374820 1375867 1378560 1383243 1390200 1399654 1411805 1426955 1445691 1468713 1496291 1528038 1563520
50414 1563520 1603001 1647222 1696371 1749519 1805199 1862229 1919763 1976840 2032392 2085723 2136557
50403 2136557 2184312 2227547 2264426 2293701 2314956 2327850 2331321 2323795 2304112 2272285 2229561 2177977
50391 2177977 2119786 2057061 1991746 1926050 1862550 1803586 1750518 1703878 1664299 1632961 1610903
50380 1610903 1598143 1593698 1596319 1604843 1618012 1634336 1652126 1669304 1683255 1691357 1691940 1684537 1669192
50367 1669192 1645970 1615344 1578646 1537730 1494412 1450505 1407982 1368471 1332591 1300204 1271225
50356 1271225 1245653 1222754 1200784 1177816 1152592 1124546 1093628 1060620 1027228 995194 965296
50345 965296 937552 912372 890988 874493 862745 854440 848204 843469 840451 839557 840827 843727 847272
50332 847272 850402 852535 853963 855684 858652 863043 868223 873407 878312 883206 888442 894051 899685 904856
50318 904856 909174 912409 914444 915307 915340 915200 915491 916330 917401 918489 919890 922189 925676 930040 934683 939332
50302 939332 944364 950545 958463 968257 979837 993233 1008699 1026647 1047658 1072484 1101932 1136672
50290 1136672 1176819 1220984 1265215 1303350 1329331 1339777 1334557 1315549 1285613 1248559 1208797
50279 1208797 1170044 1134429 1102931 1076172 1054344 1036955 1023330 1013246 1006606 1002808 1001076 1001305
50267 1001305 1003958 1009111 1016219 1024903 1035371 1047803 1061785 1076666 1092136 1108058 1123938 1138968
50255 1138968 1152661 1165325 1177884 1191139 1205072 1218752 1230943 1240679 1247138 1249341 1246552 1239028
50243 1239028 1227910 1214217 1198363 1180917 1163379 1147722 1135202 1125823 1118693 1112495 1105715 1096852
50231 1096852 1084752 1068731 1048548 1024414 997074 967736 937869 908976 882277 858351 837067
50220 837067 817970 800740 785270 771482 759280 748635 739558 731958 725615 720245 715580 711511 708231
50207 708231 706065 704953 704231 703124 701419 699431 697419 695306 693018 690761 688768 686877 684593 681509
50193 681509 677579 672991 667914 662463 656884 651630 647096 643259 639712 636154 632694 629570 626766 624182
50179 624182 622042 620759 620341 620292 620262 620505 621351 622476 623107 623012 622925 623859 626202 629612 633595 637932 642692
50162 642692 648073 654285 661413 669308 677759 686827 696961 708746 722652 739024 758107 779922 804205
50149 804205 830699 859496 890914 924954 960970 997925 1034855 1071094 1106153 1139616 1171251
50138 1171251 1201317 1230761 1260883 1292439 1324864 1356371 1384840 1408431 1425476 1434293 1433703 1423686
50126 1423686 1405130 1378949 1345932 1307613 1266666 1225737 1186010 1147428 1110219 1075517 1044275
50115 1044275 1016276 990765 967628 947212 929190 912411 896030 880196 865350 851411 838094
50104 838094 825622 814606 805382 797838 791723 786675 782065 777287 772259 767292 762557 758098 754387 752317
50090 752317 752379 754116 756557 758964 761118 763243 765850 769304 773292 776987 779886 782202 784218 785757 786643
50075 786643 787269 788086 788748 788429 786950 784940 782785 780066 776408 772344 768800 765971 763219 759981 756341
50060 756341 752678 749170 745863 742959 740764 739388 738702 738590 739135 740545 743017 746695 751629 757631 764270
50045 764270 771166 778318 785995 794317 803129 812341 822130 832625 843590 854683 865922 877627 889992
50032 889992 903120 917537 934206 953674 975340 997891 1020403 1042843 1065539 1088388 1110635
50021 1110635 1131237 1149440 1165176 1179055 1191873 1204006 1215170 1224686 1231831 1235907 1236095 1231459
50009 1231459 1221145 1204615 1181787 1153142 1119823 1083571 1046412 1010212 976369 945777 918945
49998 918945 896143 877487 862898 851953 843765 837128 830942 824600 818027 811377 804676 797630 789691
49985 789691 780361 769555 757648 745112 732196 719082 706253 694327 683442 673087 662848 653124
49973 653124 644698 637642 631048 624106 617172 611411 607486 604921 602813 600817 599138 597720 595853 592895
49959 592895 589317 586772 586847 589702 594124 598960 604239 610707 618574 627223 636116 645314 654760 663565 670693
49944 670693 676147 680892 685526 689656 692709 694775 696174 696570 695046 690992 684478 675834 665332 653392
49930 653392 640760 628226 616301 605298 595546 587304 580508 574841 570170 566832 565312 565555 566762
49917 566762 568012 569059 570328 572179 574439 576712 578814 580820 583035 586131 590889 597352 604501 611302
49903 611302 617954 625612 634935 645412 656129 666561 676438 685395 693136 699587 704592 707735 708740
49890 708740 707713 704766 699778 692878 684811 676381 667733 658603 649047 639517 630342 621557 613104 604772
49876 604772 596163 587273 579061 572858 569074 566949 565579 564704 564349 564326 564466 565026 566496 569165 573115 578410
49860 578410 585036 592782 601363 610587 620354 630631 641404 652380 662797 671919 679753 686810 693029
49847 693029 697581 700050 701234 702175 702742 701801 698625 693553 687315 680249 672318 663552 654331 645392 637413
49832 637413 630461 624108 618390 614325 612869 613526 614612 614980 614931 615388 616803 619108 622239 626296 631446
49817 631446 637885 645626 654163 662681 670742 678447 685727 691996 696811 700499 703722 706633 708840 709976
49803 709976 709934 708727 706513 703618 700185 695886 690300 683479 675803 667468 658479 649027 639377 629414 618866
49788 618866 608123 598384 590685 585082 580945 577731 575150 572932 570901 569306 568638 568998 569901 570915 572333
49773 572333 574957 579163 584397 589769 595026 600728 607449 615059 622844 630082 636310 641244 644883 647719
49759 647719 650562 653906 657406 660011 660628 658757 654637 648783 641502 633007 624015 615813 609377 604558
49745 604558 600460 596547 593009 590141 587863 586095 585117 585217 586121 587163 587996 588877 590252 592276 594826
49730 594826 597782 601160 605031 609443 614455 620118 626383 633172 640679 649503 660202 672604 685705
49717 685705 698338 709775 719581 727226 732192 734375 734045 731456 726806 720544 713411 706098 699195 693486
49703 693486 689842 688570 689067 690311 691468 691888 690900 688034 683371 677404 670681 663857 657913 653798 651719
49688 651719 651130 651593 653381 656957 662069 667771 673479 679802 688107 699320 713351 729673 748055 768250
49674 768250 788994 807805 822225 831260 835504 836085 833852 829540 824251 819377 816133 815333 817515 822850
49660 822850 830656 839053 845420 847484 844215 835853 823346 807857 790622 772908 755815 740063 726003
49647 726003 713801 703575 695364 689045 684358 681105 679348 679219 680409 681917 682575 681934 680521 679126
49633 679126 677943 676483 674196 670988 667152 662958 658451 653561 648336 642995 637809 633009 628814 625404
49619 625404 622795 620861 619571 619057 619239 619528 619327 618878 619207 620963 623639 626242 628481 630822 633491 635979
49603 635979 637703 638724 639510 640285 640940 641424 641843 642240 642664 643540 645582 649027 653042 656128 657176 656184
49587 656184 654185 652593 652377 653457 654875 655698 655841 655856 656075 656275 656237 656242 656822 658293 660842 664800 670397
49570 670397 677241 684422 691310 698130 705593 714093 723396 733030 742742 752414 761556 769159 774243 776460
49556 776460 776033 773316 768749 763095 757181 751276 745164 739032 733813 730336 728540 727826 727750 727962 727998 727772
49540 727772 727982 729328 731535 733817 736118 739085 742913 747099 751470 756630 763152 771143 780922 793290
49526 793290 808580 825998 844409 863211 881923 899444 914426 926114 934351 939137 940792 940318
49514 940318 939036 938008 938140 940460 945576 952961 961264 969195 975725 979721 980105 976396 968681 957249
49500 957249 942821 926895 911066 895853 880755 865521 850782 837346 825505 815294 806890 800374
49488 800374 795443 791634 788631 786233 784310 782931 782275 782287 782686 783350 784345 785481 786281 786623 787057 788227
49472 788227 790265 792995 796368 800263 804041 806805 808272 809175 810637 813150 816253 819209 821931 825024
49458 825024 828874 832918 836030 837470 837256 835801 833590 831118 828739 826488 824255 822064 819913 817509
49444 817509 814611 811588 809166 807616 806686 806367 807161 809393 812795 817032 822181 828378 835441 843248 852191
49429 852191 862942 875971 891501 909534 929665 951393 975080 1002027 1032584 1064105 1091454
49418 1091454 1109957 1117819 1116024 1106666 1091761 1073216 1053221 1034274 1018642 1007702 1001709 1000211
49406 1000211 1002649 1008539 1017291 1028109 1040220 1053138 1066681 1080733 1095011 1109110 1122802 1136169
49394 1136169 1149275 1161794 1173158 1183006 1191193 1197421 1201215 1202393 1201241 1198058 1192842 1185615 1176800
49381 1176800 1167033 1156805 1146472 1136458 1127239 1119257 1112897 1108356 1105452 1103865 1103676 1105255 1108449
49368 1108449 1112288 1115867 1119157 1122575 1126111 1129278 1131615 1132719 1132091 1129564 1125758 1121496 1116834 1111155
49354 1111155 1104214 1096484 1088459 1080249 1072086 1064639 1058516 1053758 1050067 1047130 1044473 1041410 1037535 1033102
49340 1033102 1028632 1024306 1020004 1015710 1011630 1008048 1005336 1003975 1004287 1006188 1009518 1014577 1022054 1032304
49326 1032304 1044850 1058621 1072456 1085192 1095481 1101916 1103642 1100846 1094555 1085942 1075889 1065065
49314 1065065 1054039 1042996 1031530 1019122 1005991 993257 982142 973054 965560 959168 953964 950489
49302 950489 949109 949545 951013 952742 954367 955924 957606 959590 961984 964758 967640 970062 971356 971173 969787
49287 969787 967807 965445 962189 957488 951635 945631 940184 935305 930986 927771 926235 926264 927239 928725 930562
49272 930562 932498 934312 936258 938800 941814 944494 946245 947250 947968 948489 948731 948917 949446 950403 951737 953973
49256 953973 958339 965887 976679 990033 1005366 1022302 1039849 1055928 1068213 1075419 1077498 1074794
49244 1074794 1067603 1056619 1043169 1028510 1013211 997599 982491 968959 957610 948604 942247 938932
49232 938932 938411 939702 941967 945126 949365 954375 959427 964113 968771 974108 980368 986891 992655 997425
49218 997425 1002158 1007973 1014889 1021929 1028326 1034136 1039645 1044820 1049597 1054352 1059807 1066624 1075151 1085236
49204 1085236 1096193 1107266 1118347 1130004 1142711 1156335 1170374 1184356 1197829 1210399 1221960
49193 1221960 1232576 1242062 1250085 1256811 1262876 1268536 1273427 1277552 1281796 1286880 1292402 1297779 1303778 1312147
49179 1312147 1323799 1338213 1354776 1373886 1396490 1423289 1454799 1491477 1532933 1576965 1619796
49168 1619796 1657428 1686977 1707287 1718888 1723383 1722525 1717629 1709755 1700254 1690908 1683416 1678711 1676667
49155 1676667 1676396 1676900 1677515 1677903 1677908 1677624 1677512 1678179 1679972 1682925 1687004 1692228 1698533 1705752 1713824 1722821
49139 1722821 1732715 1743254 1754160 1765339 1776885 1789011 1801981 1815916 1830626 1845823 1861506
49128 1861506 1877890 1894858 1911818 1928298 1944491 1961023 1978426 1997066 2017340 2039511 2063365
49117 2063365 2088486 2115012 2143965 2176842 2215149 2260437 2314608 2380047 2459597 2556023 2670427
49106 2670427 2800048 2937763 3075129 3207393 3335935 3464987 3594659 3716322 3814819 3876305
49096 3876305 3895488 3876773 3829237 3760435 3674061 3571826 3456113 3330594 3199366 3066540
49086 3066540 2936704 2814910 2705519 2610872 2531037 2464636 2409872 2365026 2328424 2298264 2272733
49075 2272733 2250433 2230671 2213264 2197986 2184283 2171500 2159269 2147652 2137020 2127773 2120077 2113822
49063 2113822 2108780 2104742 2101471 2098691 2096222 2094023 2091953 2089803 2087782 2086699 2087162 2088810 2090913 2093689
49049 2093689 2098303 2105372 2114095 2123161 2131818 2139539 2145324 2148274 2148675 2147703 2146045 2143512 2140139 2136993
49035 2136993 2135496 2136262 2138838 2142344 2146131 2150055 2154352 2159182 2164213 2168688 2171957 2173889 2174958 2176072
49021 2176072 2178149 2181424 2185221 2188716 2191899 2195458 2199764 2204447 2209083 2213834 2219105 2224952 2231080 2237281
49007 2237281 2243659 2250604 2258542 2267412 2276271 2283843 2289664 2294333 2298466 2301851 2303987 2304931 2305063 2304369 2302655
48992 2302655 2300265 2297846 2295311 2291740 2286598 2280549 2274726 2269608 2264970 2260678 2256961 2253954 2251377 2248904
48978 2248904 2246667 2245152 2244597 2244629 2244602 2244145 2243201 2241572 2238812 2234798 2230203 2226084 2223011 2220782 2218946 2217395
48962 2217395 2216437 2216514 2217864 2220286 2223260 2226455 2230185 2235259 2242421 2252016 2264019 2278148 2294056 2311691
48948 2311691 2331400 2353305 2376650 2400202 2423401 2446708 2470734 2495573 2521234 2548203 2577058
48937 2577058 2607770 2639927 2673532 2709073 2746819 2786466 2827541 2869789 2913075 2957271 3002428
48926 3002428 3048789 3096431 3145025 3194142 3243620 3293472 3343546 3393452 3442774 3491244 3538689
48915 3538689 3584848 3629276 3671456 3711170 3748783 3785050 3820528 3855256 3888981 3921549 3952957
48904 3952957 3983121 4011818 4038929 4064686 4089577 4113861 4137035 4157813 4174819 4187510 4196431
48893 4196431 4202598 4206699 4208923 4209315 4207960 4204769 4199299 4191028 4179815 4166006 4150057 4132186 4112415
48880 4112415 4090793 4067345 4041842 4013856 3983171 3949908 3914142 3875655 3834355 3790705 3745317
48869 3745317 3698209 3648991 3597919 3546342 3495804 3447005 3399935 3354690 3311683 3271148 3232928
48858 3232928 3196935 3163522 3133174 3105919 3081173 3058175 3036563 3016563 2998655 2983140 2970091
48847 2970091 2959602 2951756 2946368 2943124 2942158 2944062 2948931 2955713 2963080 2970872 2980170 2991950 3006184
48834 3006184 3022320 3039972 3058782 3078073 3097159 3115843 3134276 3152414 3169981 3186908 3203566
48823 3203566 3220530 3238217 3256609 3275196 3293313 3310696 3327647 3344605 3361718 3378964 3396367
48812 3396367 3413912 3431487 3449195 3467415 3486238 3505152 3523757 3542541 3562383 3583449 3605220
48801 3605220 3627603 3651214 3676310 3702147 3727801 3753063 3778016 3802143 3824478 3844524 3862551
48790 3862551 3879131 3894730 3909550 3923265 3934980 3943933 3950206 3954371 3956458 3955674 3951054 3941886 3927579
48777 3927579 3907783 3882868 3853746 3820926 3784306 3744190 3701879 3658690 3614787 3569667 3523455
48766 3523455 3476909 3430252 3382891 3334529 3285853 3237790 3190681 3144667 3100374 3058598 3019467
48755 3019467 2982501 2947362 2914089 2882674 2853004 2825363 2800441 2778558 2759166 2741430 2725041
48744 2725041 2710198 2696976 2685209 2674935 2666609 2660631 2656880 2654812 2653884 2653712 2653987 2654454 2654982 2655495
48730 2655495 2655793 2655613 2654950 2654164 2653636 2653330 2652914 2652269 2651712 2651595 2651878 2652317 2652993 2654333 2656489 2658917 2660888
48713 2660888 2662346 2663960 2666224 2668809 2671094 2673126 2675596 2678807 2682149 2684831 2686800 2688533 2690241 2691863
48699 2691863 2693787 2696913 2701738 2707827 2714456 2721349 2728452 2735485 2742347 2749702 2758431 2768484 2778834
48686 2778834 2788602 2797635 2805900 2813075 2819252 2825488 2833021 2842064 2851832 2861585 2871156 2880556 2889640 2898357
48672 2898357 2906963 2915769 2924746 2933397 2940838 2945995 2947919 2945946 2939458 2927655 2909858 2886001 2856584
48659 2856584 2822244 2783715 2742122 2698795 2654689 2610386 2566783 2525291 2487062 2452363 2421064
48648 2421064 2393319 2369313 2348530 2329742 2311737 2293815 2275701 2257350 2238798 2219985 2200796
48637 2200796 2181411 2162363 2143974 2126070 2108617 2092258 2077519 2063695 2049380 2034175 2019092
48626 2019092 2005053 1991795 1978633 1965561 1952972 1940915 1929364 1918940 1910514 1904222 1899463 1895867
48614 1895867 1893696 1893278 1894581 1897411 1901584 1906729 1912269 1917695 1922631 1926665 1929477 1931206 1932327 1933140
48600 1933140 1933713 1934357 1935739 1938414 1942490 1947794 1953904 1959866 1964310 1966228 1965520 1962603 1957675 1950490 1940725
48585 1940725 1928407 1914056 1898392 1881789 1864222 1846064 1828727 1813863 1801817 1791409 1781468
48574 1781468 1772016 1763715 1756796 1751147 1746950 1744478 1743357 1742632 1741633 1740396 1739243 1738273 1737238 1735537 1732261
48559 1732261 1726503 1717775 1706169 1692304 1677236 1662126 1647678 1633957 1620961 1609086 1598701 1589427
48547 1589427 1580224 1570171 1558910 1546491 1533138 1519189 1504921 1490439 1475860 1461536 1447827
48536 1447827 1434832 1422549 1411191 1401107 1392572 1385938 1381717 1380172 1381048 1384204 1390152 1399231 1410160
48523 1410160 1420134 1426631 1428745 1426650 1420435 1410013 1395927 1379724 1363439 1348763 1336571 1327033
48511 1327033 1320134 1316072 1315208 1317780 1323770 1332866 1344420 1357701 1372462 1389032 1407460 1426618 1444384
48498 1444384 1458543 1467329 1469633 1465454 1456126 1443546 1429129 1413842 1398855 1385231 1372927 1360934
48486 1360934 1348662 1336543 1325050 1313880 1302518 1291048 1279927 1269392 1259499 1250353 1241990 1234333
48474 1234333 1227586 1222261 1218523 1215832 1213476 1211081 1208429 1205334 1202096 1199559 1198270 1198003 1198491 1200071
48460 1200071 1203068 1207023 1211257 1215821 1221053 1226391 1230523 1232776 1233613 1233563 1232371 1229545 1225318 1220604 1216194
48445 1216194 1212266 1208541 1204648 1200354 1195620 1190491 1184924 1178711 1171624 1163710 1155482 1147690 1140714 1134168
48431 1134168 1127274 1119623 1111401 1102942 1094392 1085889 1077726 1070099 1062931 1056149 1049906 1044333 1039194 1034034
48417 1034034 1028605 1023026 1017587 1012442 1007482 1002483 997463 992797 988814 985368 981992 978423 974766 971304
48403 971304 968349 966075 964097 961428 957386 952545 948298 945517 943982 942941 941632 939364 935874 931771
48389 931771 928154 925620 924007 922976 922298 921739 921293 921440 922525 924062 925400 926832 929065 931756 933803
48374 933803 935092 936749 939500 943023 947173 952472 959035 966304 974333 984099 996039 1009565 1024511
48361 1024511 1041539 1060359 1078851 1094826 1107441 1116372 1121249 1122940 1123784 1125328 1127169 1129085 1132699
48348 1132699 1139649 1149575 1161431 1175377 1191890 1210393 1230442 1253029 1279118 1308171 1339754 1375154
48336 1375154 1415745 1461280 1511575 1568349 1633510 1707374 1790566 1885906 1996420 2123847 2271572
48325 2271572 2446746 2657183 2909781 3215920 3595567 4072403 4669044 5412207 6338352
48316 6338352 7488276 8900469 10611008 12633639 14896517 17181073 19150591 20482231
48308 20482231 21001610 20715257 19748970 18278443 16497862 14600515 12746816 11039217
48300 11039217 9526200 8222371 7121616 6203233 5441053 4811947 4295845 3872275 3522091
48291 3522091 3231174 2989027 2785330 2610965 2460940 2333070 2224402 2131027 2050164 1980001
48281 1980001 1918223 1862745 1813198 1769894 1731941 1697921 1667641 1641587 1619234 1599287 1581050
48270 1581050 1564286 1548338 1532672 1517817 1504628 1493079 1482810 1474305 1468445 1465307 1464306 1465085
48258 1465085 1467434 1470693 1473900 1476069 1475845 1471688 1463109 1451068 1436579 1419826 1401318 1382766 1365671
48245 1365671 1349844 1334453 1319771 1306656 1294923 1283579 1272373 1261893 1252330 1243266 1234639 1226910
48233 1226910 1220154 1213680 1206583 1198189 1188189 1177011 1165825 1155573 1146054 1136379 1125984 1114705
48221 1114705 1102304 1088637 1074004 1058720 1042626 1025559 1007941 990223 972149 953334 934261
48210 934261 915884 898401 881195 863922 846961 830835 815775 801857 788976 776759 764994
48199 764994 754053 744419 735916 727872 719890 711981 704179 696633 689936 684642 680432 676369 672049 667977
48185 667977 664684 661979 659258 656206 653039 650266 648329 647267 646686 646054 645007 643452 641682 640419 640220
48170 640220 640596 640211 638371 635920 634240 633692 633561 633169 632450 631584 630676 629811 629047 628361 627772 627323 626788 625796
48152 625796 624584 624070 624666 625510 625539 624919 624670 625171 625920 626581 627265 627794 627655 627013 626931 628131 630120 631932
48134 631932 633246 634373 635590 637032 638973 641656 644833 647828 650158 651949 653700 655749 658104 660700
48120 660700 663642 667091 670954 674906 678711 682404 686213 690549 695924 702529 709828 717026 723994 731318
48106 731318 739335 747728 756301 765485 775632 786321 796923 807446 818263 829371 840473 851564
48094 851564 862828 874167 885295 896074 906313 915625 924018 932285 941122 950133 958437 965950 973235
48081 973235 980273 986384 991441 996249 1001455 1006825 1011867 1016470 1020618 1024152 1027284 1030900 1035859 1042127
48067 1042127 1048860 1055165 1060764 1066150 1072109 1078800 1085369 1090775 1094781 1097598 1098840 1097759 1094604 1090731
48053 1090731 1086934 1082433 1076098 1068020 1059130 1049784 1039544 1028242 1016448 1004750 993077 980904
48041 980904 967801 953694 938854 923797 909052 894880 881262 868133 855527 843502 831997
48030 831997 820881 810096 799722 789756 779860 769538 758689 747814 737461 727616 717889 708263
48018 708263 699337 691807 685856 681037 676599 671984 667261 662942 659250 655695 651691 647385 643451 640140
48004 640140 637016 633668 630216 626949 623870 620762 617521 614298 611525 609742 609054 608729 607803 606173 604641
47989 604641 603683 602655 600572 597291 593480 589738 586229 583074 580529 578617 576940 575089 573093 571299
47975 571299 569891 568722 567587 566514 565671 565099 564700 564487 564673 565453 566728 568069 568914 568980 568726 569212 571083
47958 571083 573738 575965 577482 579260 582159 585924 589947 594333 599492 605114 610363 614991 619598 624914
47944 624914 631329 638922 647275 655417 662604 669163 675940 683045 689824 695934 701568 706587 710326 712529
47930 712529 713685 714137 713614 712021 709987 708144 706414 704391 701867 698567 693949 687838 680876 673895 667202
47915 667202 660850 655133 650204 645612 640785 635837 631403 627832 624952 622506 620430 618816 617868 617815 618692
47900 618692 620347 622722 625776 629048 631858 634222 637046 640988 645675 650584 656078 662745 670029 676507
47886 676507 681578 686078 691048 696550 701986 707007 711609 715631 718630 720332 720973 721022 720621 719408 717004
47871 717004 713562 709556 705080 699781 693528 686738 679763 672356 664151 655392 646817 638951 631822 625139
47857 625139 618474 611546 604604 598245 592542 586776 580590 574972 571317 569714 568933 568070 567377 567322 567686 568055
47841 568055 568628 569991 572380 575579 579260 583043 586370 588757 590224 591280 592503 594236 596534 599260
47827 599260 602201 605221 608257 611202 613918 616445 619016 621741 624395 626729 629028 632178 637054 643835
47813 643835 651996 661021 671087 682948 697179 713692 732010 751727 772494 793732 814745 835073
47801 835073 854562 873066 890304 906010 919909 931422 939654 943955 944431 941805 936845 930059 921896
47788 921896 912974 903921 895011 886115 877107 868289 860332 853818 848863 845109 841983 838976 835842 832608
47774 832608 829340 825862 821797 816916 811339 805330 798963 792023 784258 775697 766771 758110 750217 743353
47760 743353 737689 733296 729863 726693 723313 719994 717397 715843 715211 715401 716396 717895 719470 721245 723949
47745 723949 728101 733519 739820 746921 754723 762797 770850 779263 788705 799342 810652 821883 832446
47732 832446 842144 851268 860272 869063 876885 883108 887803 891197 893007 892857 891048 888275 884698 879818
47718 879818 873243 865031 855370 844476 832800 820772 808258 794826 780703 766985 754712 744118
47706 744118 734906 726802 719627 713283 707977 704137 701819 700542 699994 700510 702479 705548 708923 712353 716377
47691 716377 721590 728070 735619 744152 753608 763703 774066 784573 795343 806407 817591 828734
47679 828734 839755 850319 859610 866779 871720 875194 878046 880448 881989 882286 881218 878702 874564 868736
47665 868736 861420 852974 843720 833916 823842 813847 804251 795171 786427 777690 768776 759837 751291 743665
47651 743665 737413 732685 729142 726179 723484 721371 720456 721085 723099 726087 729708 733749 737935 741818 745051
47636 745051 747895 751286 756190 762907 771146 780575 791031 802294 814137 826686 840418 855695 872526
47623 872526 890760 910157 930252 950475 970393 989480 1006779 1021340 1032979 1041901 1047575 1048818
47611 1048818 1045209 1037509 1026258 1010912 991085 967822 942704 916234 888113 858720 829256 800587
47599 800587 772889 746406 721682 698920 677872 658433 640800 625095 611384 599975 590901 583178
47587 583178 575427 567361 559929 553872 548872 544332 540255 536983 534644 533156 532356 531916 531531 531305 531529
47572 531529 532015 532205 531900 531282 530221 528408 526311 525069 525056 525330 524952 524083 523256 522325 520849 518952 517121
47555 517121 515527 514178 513331 513098 512940 512221 511033 509954 509179 508393 507313 505856 503994 501929 500195 499059
47539 499059 498001 496317 494048 491839 490034 488478 487094 486006 485119 484106 482886 481699 480680 479761 479012
47524 479012 478650 478714 479092 479868 481204 482899 484530 486031 487628 489087 489663 489064 488002 487367 487119 486417 484713
47507 484713 482378 480314 479217 479130 479473 479511 479022 478547 478789 479782 480810 481223 481084 480864 480726 480404 479789 479225
47489 479225 479082 479275 479474 479646 480108 481115 482595 484288 485891 487174 488205 489470 491479 494214 497177
47474 497177 499943 502414 504623 506623 508644 510940 513414 515656 517465 519002 520419 521690 522787 523547
47460 523547 523369 521707 519069 516859 515874 515652 515682 516440 518485 521237 523757 526343 530214 535663 541697 547712
47444 547712 554412 562635 572197 582593 594136 607581 622984 639656 657014 674792 692604 710024
47432 710024 727175 744523 761908 778327 792898 805468 815932 823548 827607 828519 827509 825212 821173
47419 821173 814762 805980 795167 782620 768980 755451 742949 731247 719565 707853 696899 687291
47407 687291 678922 671510 664891 658645 652123 645255 638860 633727 629742 626229 622847 619750 617154 615165
47393 615165 613928 613580 614101 615440 617670 620848 624797 629137 633429 637272 640517 643449 646494 649680 652739
47378 652739 655754 659197 663072 666575 668887 669846 669456 667313 663134 657459 651227 644857 638288 631565 624697
47363 624697 617177 608410 598631 588668 578838 568796 558564 548904 540315 532293 524074 515719 507999 501398
47349 501398 495654 490192 484714 479376 474596 470758 468046 466463 465810 465617 465341 464886 464768 465480 466825 468246
47333 468246 469660 471498 473875 476277 478255 480033 482060 484204 485731 486083 485509 484917 485104 486092 487178
47318 487178 487677 487555 487280 487219 487337 487346 486922 485843 484191 482423 481101 480517 480698 481561 482838 484028 484764 485265
47300 485265 486158 487868 490387 493536 497186 501267 505840 511149 517375 524390 531984 540183 548983 557954
47286 557954 566578 575045 584261 594960 607101 620234 634145 648989 664989 681941 698750 713530
47274 713530 724527 731072 733465 732136 727369 719751 710352 700273 690338 681116 672735 664627 656105 647403
47260 647403 639611 633358 628048 622692 616935 610925 604750 598581 592962 588306 584258 580127 575875 572176
47246 572176 569569 568022 567385 567752 569149 571139 573049 574519 575715 577037 578754 580923 583559 586696 590292
47231 590292 594249 598776 604525 612007 620880 630168 639219 648006 656412 663782 669625 674358 678826 683206
47217 683206 686869 689291 690648 691377 691498 690585 688240 684454 679587 674161 668631 663309 658414 654093 650305
47202 650305 646730 642958 638899 635026 632116 630675 630526 631025 631697 632669 634484 637662 642454 648757 656052
47187 656052 663613 671083 678760 687161 696405 706363 717172 729118 742000 755131 768157 781467 795528
47174 795528 810125 824486 837898 849938 860336 868913 875623 880535 883882 886130 887713 888548 888036
47161 888036 885743 881908 877141 871861 866230 860379 854412 848281 841918 835442 829093 823032 817334 812049
47147 812049 807192 802766 798900 795823 793591 792049 791174 791252 792508 794738 797533 800731 804408 808522 812844
47132 812844 817190 821511 825633 829027 831029 831327 830222 828253 825520 821492 815618 807990 799250 790018
47118 790018 780632 771243 761780 751929 741585 731323 721980 713754 706115 698650 691512 684968 678966 673350
47104 673350 668017 662745 657300 651919 647115 642771 638011 632384 626681 622163 619374 618101 617996 618683 619603
47089 619603 620429 621455 623125 625400 628000 630956 634432 638283 642273 646519 651180 655944 660329 664244
47075 664244 667761 670696 673047 675415 678192 680580 681466 681159 681178 682157 683067 682937 682342 682467 683480 684649
47059 684649 685625 686735 688204 689835 691574 693856 697191 701624 706691 711791 716653 721524 726860 732736
47045 732736 738745 744523 750178 756035 762180 768467 774820 781235 787526 793387 798799 804284 810559 817903
47031 817903 825894 833839 841428 848781 855836 862012 866759 870285 873328 876217 878460 879299 878360 875780 872042
47016 872042 867895 864143 861216 858928 856683 853889 850293 846133 841945 838052 834305 830568 827312 825362
47002 825362 825076 826132 828088 830716 833734 836744 839619 842559 845560 848278 850638 853204 856587 860859
46988 860859 865824 871534 878153 885626 893876 902985 912718 922228 930841 939006 947831 957684 967859 977637
46974 977637 987083 996576 1006106 1015321 1023875 1031428 1037683 1042770 1047276 1051579 1055343 1057965 1059308 1059686
46960 1059686 1059433 1058904 1058668 1059138 1060096 1061110 1062414 1064755 1068246 1072065 1075590 1079229 1083641 1088591 1093291
46945 1093291 1097574 1102036 1107052 1112327 1117565 1123036 1129285 1136637 1145095 1154312 1163536 1172017 1179667 1187001
46931 1187001 1194260 1200968 1206483 1210557 1213180 1214389 1214455 1213709 1211756 1207420 1200015 1190278 1179501 1168126
46917 1168126 1155849 1142757 1129542 1116668 1104103 1091907 1080522 1070355 1061623 1054563 1049304 1045557
46905 1045557 1043056 1042303 1044228 1048968 1055609 1063302 1072048 1082271 1094302 1108521 1125287 1144206 1164009
46892 1164009 1183571 1202657 1221345 1239276 1255980 1271470 1285935 1299163 1310787 1320822 1329457
46881 1329457 1336668 1342576 1347875 1353201 1358204 1361960 1364314 1366222 1368721 1372130 1376391 1381602 1387877 1395086
46867 1395086 1403071 1411932 1421857 1432803 1444532 1456886 1469887 1483498 1497314 1510559 1522549 1533185
46855 1533185 1542787 1551302 1558010 1562276 1564368 1565100 1564806 1563119 1559790 1555228 1550041 1544378 1537948 1530515
46841 1530515 1522255 1513822 1506186 1500170 1495942 1493021 1490849 1489282 1488492 1488635 1489808 1492259 1496416 1502538
46827 1502538 1510366 1519246 1528708 1538818 1549747 1561023 1571603 1580825 1588894 1596163 1602284 1606579 1608966
46814 1608966 1609904 1609517 1607442 1603593 1598439 1592277 1584860 1576077 1566478 1556683 1546759 1536615 1526580 1516996
46800 1516996 1507587 1498002 1488795 1481026 1474854 1469323 1463763 1458663 1454723 1451763 1449190 1447089 1446084 1446283
46786 1446283 1447116 1448258 1450004 1452527 1455378 1458095 1460884 1464224 1468054 1471803 1475183 1478468 1481936 1485465
46772 1485465 1488895 1492520 1496897 1502164 1507796 1513103 1517913 1522718 1528267 1535051 1543073 1551914 1561049 1570327
46758 1570327 1580253 1591603 1604510 1617992 1630687 1642067 1652660 1663122 1673451 1683248 1692266 1700335
46746 1700335 1707071 1712187 1716040 1719361 1722367 1724540 1725441 1725395 1725179 1725251 1725563 1725946 1726393 1726985 1727770 1728852 1730536
46729 1730536 1733240 1737143 1741864 1746660 1751045 1755177 1759471 1763959 1768238 1771977 1775141 1777650 1779063 1778804
46715 1778804 1776614 1772678 1767384 1760941 1753206 1743924 1733252 1721879 1710343 1698288 1684740 1669207
46703 1669207 1652179 1634463 1616369 1597716 1578390 1558640 1538958 1519869 1501661 1484196 1467146
46692 1467146 1450577 1435089 1421201 1408760 1397148 1385948 1375205 1365162 1355954 1347496 1339541 1331922
46680 1331922 1324802 1318557 1313356 1309062 1305592 1303112 1301678 1301033 1300985 1301738 1303551 1306296 1309714 1313928 1319310
46665 1319310 1325948 1333547 1341821 1350584 1359519 1368240 1376609 1384703 1392420 1399418 1405454 1410464 1414304 1416741
46651 1416741 1417792 1417745 1416732 1414637 1411651 1408607 1406389 1405166 1404536 1404394 1405321 1408075 1412956 1419829 1428537
46636 1428537 1439034 1451225 1464974 1480321 1497372 1515778 1534508 1552378 1568651 1583034 1595348
46625 1595348 1605572 1613939 1620433 1624314 1624734 1621839 1616577 1609298 1599313 1586234 1570957 1554695 1537660
46612 1537660 1519521 1500704 1482290 1464755 1447686 1430786 1414416 1399026 1384705 1371494 1359582
46601 1359582 1348942 1339198 1330043 1321418 1313247 1305403 1297978 1291072 1284298 1277080 1269555 1262530 1256352 1250434
46587 1250434 1244234 1238032 1232272 1226670 1220568 1213896 1207244 1201106 1195447 1189965 1184573 1179710 1176155 1174168
46573 1174168 1172833 1170844 1168134 1166073 1165735 1166693 1167991 1169472 1171354 1173190 1174368 1175289 1176960 1179470 1181911
46558 1181911 1183829 1185695 1187754 1189479 1190642 1192034 1194454 1197659 1201032 1204757 1209562 1215501 1221732 1227545
46544 1227545 1233107 1239121 1246149 1254358 1263610 1273656 1284354 1295778 1308135 1321583 1336153 1351704
46532 1351704 1367930 1384611 1401942 1420422 1440251 1461022 1482128 1503279 1524396 1545254 1565462
46521 1565462 1584828 1603521 1621896 1640181 1658123 1674845 1689270 1700948 1710331 1718075 1724323 1728930
46509 1728930 1732150 1734550 1736278 1736923 1736269 1734850 1733442 1732155 1730260 1726959 1722234 1716958 1712197 1708315
46495 1708315 1704739 1700482 1694837 1687593 1678869 1668949 1658066 1646065 1632452 1617062 1600603 1584066
46483 1584066 1567554 1550143 1530957 1509971 1487555 1463753 1438526 1412471 1386776 1362417 1339704
46472 1339704 1318564 1298931 1280760 1263984 1248666 1235091 1223651 1214675 1208338 1204577 1203124 1203753
46460 1203753 1206558 1211838 1219643 1229482 1240479 1251763 1262819 1273629 1284471 1295463 1306385 1317056
46448 1317056 1327697 1338496 1348843 1357454 1363513 1367390 1369992 1371706 1372287 1371532 1369585 1366660 1362955 1358956
46434 1358956 1355426 1352831 1351008 1349638 1348801 1348860 1349933 1351871 1354694 1358781 1364509 1371970 1381156 1392249
46420 1392249 1405548 1421203 1439191 1459408 1481691 1505798 1531619 1559284 1588854 1619890 1651609
$$ [...]
##END NTUPLES=NMR SPECTRUM
##END=
