##TITLE=AC1735_SEN00008_9276063_m2krqmUzbs
##JCAMPDX= 6.0         $$ Bruker NMR JCAMP-DX V2.0
##DATA TYPE= NMR SPECTRUM
##DATA CLASS= NTUPLES
##ORIGIN= BRUKER
##OWNER= Administrator
$$ 1.72 TOPSPIN		Version 2.1
$$ 2015-07-17 22:55:30.510 -0700  Administrator@X
$$ Compression mode = diff/dup
##.OBSERVE FREQUENCY= 400.02188249412
##.OBSERVE NUCLEUS= ^1H
##.ACQUISITION MODE= SIMULTANEOUS (DQD)
##.ACQUISITION SCHEME= undefined
##.AVERAGES= 64
##.DIGITISER RES= 22
##SPECTROMETER/DATA SYSTEM= spect
##.PULSE SEQUENCE= noesygpps1d.comp
##.SOLVENT NAME= COFFEE_meoh
##.SHIFT REFERENCE= INTERNAL, COFFEE_meoh, 1, 14.96102
##AUDIT TRAIL= $$ (NUMBER, WHEN, WHO, WHERE, PROCESS, VERSION, WHAT)
$$ ##TITLE= Audit trail, TOPSPIN		Version 2.1
$$ ##JCAMPDX= 5.01
$$ ##ORIGIN= Bruker BioSpin GmbH
$$ ##OWNER= Administrator
$$ $$ E:\/data/COFFEE/nmr/AC1735_SEN00008_9276063_m2krqmUzbs/12/pdata/1/auditp.txt
$$ ##AUDIT TRAIL=  $$ (NUMBER, WHEN, WHO, WHERE, PROCESS, VERSION, WHAT)
(   1,<2015-07-17 22:55:25.213 -0700>,<Administrator>,<X>,<go>,<TOPSPIN 2.1>,
      <created by zg
	started at 2015-07-17 22:43:55.322 -0700,
	POWCHK enabled, PULCHK disabled,
       configuration hash MD5:
       21 0F 79 D6 B3 7B B4 F6 88 20 88 DB 03 48 BD 9F
       data hash MD5: 64K
       D1 C0 53 FF A3 C2 E4 11 D9 C8 5A 49 45 2A E6 91>)
(   2,<2015-07-17 22:55:28.619 -0700>,<Administrator>,<X>,<proc1d>,<TOPSPIN 2.1>,
      <Start of raw data processing
       efp LB = 0.3 FT_mod = 6 PKNL = 1 PHC0 = 0 PHC1 = 0 SI = 128K 
       data hash MD5: 128K
       C6 7C 37 0A 11 42 25 DE 1C 7A 18 E7 67 9B 19 D9>)
(   3,<2015-07-17 22:55:29.572 -0700>,<Administrator>,<X>,<proc1d>,<TOPSPIN 2.1>,
      <pk PHC0 = -89.599 PHC1 = 0 
       data hash MD5: 128K
       8B 1C 85 42 11 CE 7D 24 34 A9 AB FE 05 87 FA 0A>)
(   4,<2015-07-17 22:55:29.979 -0700>,<Administrator>,<X>,<proc1d>,<TOPSPIN 2.1>,
      <abs ABSG = 1 
       data hash MD5: 128K
       0F 37 C9 DD 0F 22 DB 4D 96 C2 EB 57 73 38 5C 84>)
(   5,<2015-07-17 22:55:30.088 -0700>,<Administrator>,<X>,<proc1d>,<TOPSPIN 2.1>,
      <abs ABSG = 2 
       data hash MD5: 128K
       59 59 F8 69 2A C4 FC 6A 4A FE 33 A9 87 6C 6F 13>)
(   6,<2015-07-17 22:55:30.182 -0700>,<Administrator>,<X>,<proc1d>,<TOPSPIN 2.1>,
      <abs ABSG = 3 
       data hash MD5: 128K
       95 45 A9 56 FE BC B4 59 18 61 97 30 5C C5 AA 52>)
(   7,<2015-07-17 22:55:30.260 -0700>,<Administrator>,<X>,<proc1d>,<TOPSPIN 2.1>,
      <abs ABSG = 4 
       data hash MD5: 128K
       DC 75 C0 C1 EA C7 56 1D 4C 27 FC 92 1B 0B 91 07>)
(   8,<2015-07-17 22:55:30.338 -0700>,<Administrator>,<X>,<proc1d>,<TOPSPIN 2.1>,
      <abs ABSG = 5 
       data hash MD5: 128K
       5B 04 10 85 19 47 98 68 6D E3 48 C8 30 41 57 E8>)
$$ ##END=
$$ 
$$ $$ hash MD5
$$ $$ E0 86 37 11 D2 9B 0C C7 FB 44 AC 12 A0 72 43 B3
##$RELAX= 
##$RELAX= 
##$RELAX= 
##$RELAX= 
##$RELAX= 
##$RELAX= 
##$RELAX= 
##$RELAX= 
$$ Bruker specific parameters
$$ --------------------------
##$DU= <E:\>
##$EXPNO= 12
$$ [...]
150 150 150 150 150 150 150 150
##$TP07= 0
##$TPNAME0= <>
##$TPNAME1= <>
##$TPNAME2= <>
##$TPNAME3= <>
##$TPNAME4= <>
##$TPNAME5= <>
##$TPNAME6= <>
##$TPNAME7= <>
##$TPOAL= (0..7)
0.5 0.5 0.5 0.5 0.5 0.5 0.5 0.5
##$TPOFFS= (0..7)
0 0 0 0 0 0 0 0
##$TUNHIN= 0
##$TUNHOUT= 0
##$TUNXOUT= 0
##$USERA1= <user>
##$USERA2= <user>
##$USERA3= <user>
##$USERA4= <user>
##$USERA5= <user>
##$V9= 5
##$VALIST= <valist>
##$VCLIST= <CCCCCCCCCCCCCCC>
##$VD= 0
##$VDLIST= <DDDDDDDDDDDDDDD>
##$VPLIST= <PPPPPPPPPPPPPPP>
##$VTLIST= <TTTTTTTTTTTTTTT>
##$WBST= 2048
##$WBSW= 25
##$XGAIN= (0..3)
0 0 0 0
##$XL= 0
##$YL= 0
##$YMAX_a= 6199337
##$YMIN_a= -11716790
##$ZGOPTNS= <>
##$ZL1= 120
##$ZL2= 120
##$ZL3= 120
##$ZL4= 120
##$ABSF1= 14.96102
##$ABSF2= -5.597161
##$ABSG= 5
##$ABSL= 3
##$ALPHA= 0
##$AQORDER= 0
##$ASSFAC= 0
##$ASSFACI= 0
##$ASSFACX= 0
##$ASSWID= 0
##$AUNMP= <proc_prof1d_extract.lims>
##$AXLEFT= 0
##$AXNAME= <>
##$AXNUC= <1H>
##$AXRIGHT= 0
##$AXTYPE= 0
##$AXUNIT= <>
##$AZFE= 0.1
##$AZFW= 0.1
##$BCFW= 0
##$BC_mod= 0
##$BYTORDP= 0
##$COROFFS= 0
##$CY= 15
##$DATMOD= 1
##$DC= 0
##$DFILT= <>
##$DTYPP= 0
##$F1P= 0
##$F2P= 0
##$FCOR= 0.5
##$FTSIZE= 131072
##$FT_mod= 6
##$GAMMA= 0
##$GB= 0
##$INTBC= 1
##$INTSCL= 1
##$ISEN= 128
##$LB= 0.3
##$LEV0= 0
##$LPBIN= 0
##$MAXI= 10000
##$MC2= 0
##$MEAN= 0
##$ME_mod= 0
##$MI= 0
##$NCOEF= 0
##$NC_proc= -2
##$NLEV= 6
##$NOISF1= 0
##$NOISF2= 0
##$NSP= 0
##$NTH_PI= 0
##$NZP= 0
##$OFFSET= 14.96102
##$PC= 1
##$PHC0= -89.599
##$PHC1= 0
##$PH_mod= 1
##$PKNL= yes
##$PPARMOD= 0
##$PPDIAG= 0
##$PPIPTYP= 0
##$PPMPNUM= 2147483647
##$PPRESOL= 1
##$PSCAL= 4
##$PSIGN= 0
##$PYNMP= <proc.py>
##$REVERSE= no
##$SF= 400.020009628891
##$SI= 131072
##$SIGF1= 0
##$SIGF2= 0
##$SINO= 400
##$SIOLD= 131072
##$SPECTYP= <>
##$SREGLST= <1H.CDCl3>
##$SSB= 0
##$STSI= 131072
##$STSR= 0
##$SW_p= 8223.68421052631
##$SYMM= 0
##$S_DEV= 0
##$TDeff= 65536
##$TDoff= 0
##$TI= <>
##$TILT= no
##$TM1= 0
##$TM2= 0
##$TOPLEV= 0
##$USERP1= <user>
##$USERP2= <user>
##$USERP3= <user>
##$USERP4= <user>
##$USERP5= <user>
##$WDW= 1
##$XDIM= 131072
##$YMAX_p= 395019586
##$YMIN_p= -10087
##$CURPLOT= <Network HP LaserJet P1505>
##$CURPRIN= <$Network HP LaserJet P1505>
##$DFORMAT= <normdp>
##$LAYOUT= <+/1D_H.xwp>
##$LFORMAT= <normlp>
##$PFORMAT= <normpl>
##$SURQMSG= 1
$$ End of Bruker specific parameters
$$ ---------------------------------
##NTUPLES= NMR SPECTRUM
##VAR_NAME=  FREQUENCY,     SPECTRUM/REAL,   SPECTRUM/IMAG
##SYMBOL=    X,             R,               I
##VAR_TYPE=  INDEPENDENT,   DEPENDENT,       DEPENDENT
##VAR_FORM=  AFFN,          ASDF,            ASDF
##VAR_DIM=   131072,        131072,          131072
##UNITS=     HZ,            ARBITRARY UNITS, ARBITRARY UNITS
##FACTOR=    0.0627417313425164, 1,          1
##FIRST=     8223.62146879497, 1386,         -53673
##LAST=      0,             2236,            -54469
##MIN=       0,             -10087,          0
##MAX=       8223.62146879497, 395019586,    0
$$ Real data points
##PAGE= N=1
##DATA TABLE= (X++(R..R)), XYDATA
$$ [...]
61603C92773n158n099m930m505l984l921m551n247n121m036k770k163k331k726
$$ 392773 387615 382516 377586 373081 369097 365176 360625 355378 350257 346221 343451 341288 338957 336231
61589C36231k797k517k221j958j373l86L26N7r17j597j479j001p26p18q41j052
$$ 336231 333434 330917 328696 326738 325365 324979 325305 325362 324445 322848 321369 320368 319642 318924 318083 317031
61573C17031j206j031o17m03m95m26L7M15J91l54m66J71J137J782J698R43J0n02
$$ 317031 315825 314794 314177 313774 313279 312853 312890 313305 313496 313142 312676 312847 313984 315766 317464 318407 318417 317915
61555C17915l97L1M17O45P53P91Q81J163J610K094K537K741K294J077j79m99J72
$$ 317915 317518 317549 317966 318611 319364 320155 321036 322199 323809 325903 328440 331181 333475 334552 334373 333874 334046
61538C34046R61J282J453J955K696L275L512L428L131K809K437J586M8j401j709
$$ 334046 335007 336289 337742 339697 342393 345668 349180 352608 355739 358548 360985 362571 362619 361218 359509
61523C59509j083q42j582k454k684k664k903k922k164j128o05l55L37J241J427
$$ 359509 358426 357584 356002 353548 350864 348200 345297 342375 340211 339083 338478 338123 338460 339701 341128
61508C41128O73l41j121j634j664r21R9L62l02q75n96%n3p29j115o56J63M90J63
$$ 341128 341801 341460 340339 338705 337041 336120 336219 336581 336279 335404 334808 334808 334755 334026 332911 332255 332418 332908 333071
61489C33071j13L41J296J850J540Q18L30J39l1r6K95J129J911K170J874J385J165
$$ 333071 332958 333299 334595 336445 337985 338803 339133 339272 339241 339145 339440 340569 342480 344650 346524 347909 349074
61472C49074J406J772J681J003K46j08j49j81k60l79p42j393j877j753j264r76
$$ 349074 350480 352252 353933 354936 355182 355074 354925 354744 354484 354105 353363 351970 350093 348340 347076 346100
61456C46100r52p70k53L28P42J080J465J806J935J768J392J099J160J449J540
$$ 346100 345148 344378 344125 344453 345195 346275 347740 349546 351481 353249 354641 355740 356900 358349 359889
61441C59889J404J658K738M125M810M408L414K571K317K656L146L184K681K297
$$ 359889 361293 362951 365689 369814 374624 379032 382446 385017 387334 389990 393136 396320 399001 401298
61427D01298K594L172L184K477J669J170P65K79L4L79J110J638J583J041L78q3
$$ 401298 403892 407064 410248 412725 414394 415564 416329 416608 416642 417021 418131 419769 421352 422393 422771 422688
61411D22688l11n35j050j964l072l867l849l146k646k994l577l207j895j078j667
$$ 422688 422377 421842 420792 418828 415756 411889 408040 404894 402248 399254 395677 392470 390575 389497 387830
61396C87830k777l071k543k056j696p76P06J787J817J164M67m9l38l12q8O4J64
$$ 387830 385053 381982 379439 377383 375687 374911 375617 377404 379221 380385 380852 380803 380465 380153 380065 380129 380293
61379C80293M48Q28J013J136J610K270K443K017J749K105K536K358J798J573J836
$$ 380293 380741 381569 382582 383718 385328 387598 390041 392058 393807 395912 398448 400806 402604 404177 406013
61364D06013K176K391K689L179L679M070M453M946N521O105O632O996P142P244
$$ 406013 408189 410580 413269 416448 420127 424197 428650 433596 439117 445222 451854 458850 465992 473236
61350D73236P572Q156Q699Q934Q929Q839Q464P363N537L684K516K000J663J443
$$ 473236 480808 488964 497663 506597 515526 524365 532829 540192 545729 549413 551929 553929 555592 557035
61336E57035J674K206K227J245k06j272j842k451l421m462n015m685l598k478
$$ 557035 558709 560915 563142 564387 564181 562909 561067 558616 555195 550733 545718 541033 537435 534957
61322E34957k122k488k622j873p57j54n8K86J190K154K662K805L054L802N109
$$ 534957 532835 530347 527725 525852 525095 524941 524883 525169 526359 528513 531175 533980 537034 540836 545945
61307E45945O592P713Q389R142J0222J0934J0381Q636O552M566K402m6k275l860
$$ 545945 552537 560250 568639 577781 588003 598937 609318 617954 624506 629072 631474 631428 629153 625293
61293F25293n011o140p228p878p809p100o100n168m460l952l667l606l444k750
$$ 625293 620282 614142 606914 599036 591227 584127 578027 572859 568399 564447 560780 557174 553730 550980
61279E50980j634p33k12O15K212L957M980N296N399N221M508L837M155N339O270
$$ 550980 549346 548613 548401 549016 551228 555185 560165 565461 570860 576081 580589 584426 588581 593920 600190
61264F00190O357O141O329P065Q244R657J0729J0990J0861J1122J1471J0657Q208
$$ 600190 606547 612688 619017 626082 634326 643983 654712 665702 676563 687685 699156 709813 718021
61251G18021N071K282Oj772k799l301m140n474o252n832n160n402o213o469o003
$$ 718021 723092 725374 725380 723608 720809 717508 713368 707894 701642 695810 690650 685248 679035 672566 666563
61236F66563n551n327m937m428m239m129l228j371N10J613K062K273K276K118
$$ 666563 661012 655685 650748 646320 642081 637952 634724 633353 633863 635476 637538 639811 642087 644205
61222F44205K238K900L663L924L699L402L061K367J426R40J389K408L200L361
$$ 644205 646443 649343 653006 656930 660629 664031 667092 669459 670885 671825 673214 675622 678822 682183
61208F82183L031K432J755J385J754K724L582L935M279N352P210R431J1876J4687
$$ 682183 685214 687646 689401 690786 692540 695264 698846 702781 707060 712412 719622 729053 740929 755616
61194G55616J7574J9793K0923K1208K0949J9986J7959J4859J1141P572M929L495
$$ 755616 773190 792983 813906 835114 856063 876049 894008 908867 920008 927580 932509 936004
61182I36004K786K044J040P6o66j351k107k956m150o003q206r891j0636j0916
$$ 936004 938790 940834 941874 941950 941284 939933 937826 934870 930720 924717 916511 906620 895984 885068
61168H85068j1317j1866j2404j3132j4236j5336j5823j5635j5254j5002j4667
$$ 885068 873751 861885 849481 836349 822113 806777 790954 775319 760065 745063 730396
61157G30396j3854j2501j0951r511p989n903l278r25M65J202K006K733K482R62
$$ 730396 716542 704041 693090 683579 675590 669687 666409 665484 665949 667151 669157 671890 674372 675334
61143F75334j056k861m534o232p529p999p877p472o554m863k837j096M23K141
$$ 675334 674278 671417 666883 660651 653122 645123 637246 629774 623220 618357 615520 614424 614847 616988
61129F16988L957N431O687Q360J0614J2858J4586J5981J7498J9245K0992K2517
$$ 616988 620945 626376 633063 641423 652037 664895 679481 695462 712960 732205 753197 775714
61117G75714K3748K4685K5365K5832K6135K6382K6664K6841K6494K5363K3683
$$ 775714 799462 824147 849512 875344 901479 927861 954525 981366 1007860 1033223 1056906
61106A056906K1901K0078J7861J5027J1789Q501N209J709k131o208j0334j4378
$$ 1056906 1078807 1098885 1116746 1131773 1143562 1152063 1157272 1158981 1156850 1150642 1140308 1125930
61094A125930j8180k1445k3862k5382k6224k6672k6855k6767k6276k5200k3631
$$ 1125930 1107750 1086305 1062443 1037061 1010837 984165 957310 930543 904267 879067 855436
61083H55436k2145k1217k0475j9026j6782j4761j3642j2670j0751q158o207n438
$$ 855436 833291 812074 791599 772573 755791 741030 727388 714718 703967 695809 689602 684164
61071F84164n053m213k978j775o80L93J360K183L055M094N165O109O895P469P796
$$ 684164 679111 674898 671920 670145 669465 669858 671218 673401 676456 680550 685715 691824 698719 706188 713984
61056G13984Q063Q598R571J1032J2999J5150J6768J7575J8337J9920K2016K3603
$$ 713984 722047 730645 740216 751248 764247 779397 796165 813740 832077 851997 874013 897616
61044H97616K4443K5229K6322K7393K8333K9533L0991L2147L2814L3490L4505
$$ 897616 922059 947288 973610 1001003 1029336 1058869 1089860 1122007 1154821 1188311 1222816
61033A222816L5635L6682L7582L7913L7346L6663L7263L9339M1712M3656M5562
$$ 1222816 1258451 1295133 1332715 1370628 1407974 1444637 1481900 1521239 1562951 1606607 1652169
61022A652169M7549M8908M9679N1329N5012O0331O6683P4556Q4500R6055J08801
$$ 1652169 1699718 1748626 1798305 1849634 1904646 1964977 2031660 2106216 2190716 2286771 2395572
61011B395572J23514J41204J62144J87018K17846K56414L02723L56237M17737
$$ 2395572 2519086 2660290 2822434 3009452 3227298 3483712 3786435 4142672 4560409
61002D560409M88877N71621O69825P89578R35282J106305J298758J505744J707017
$$ 4560409 5049286 5620907 6290732 7080310 8015592 9121897 10420655 11926399 13633416
60993A3633416J856644J890462J758639J458779J041193N86613J79833j06715
$$ 13633416 15490060 17380522 19139161 20597940 21639133 22225746 22405579 22298864
60985B2298864k27827j86771m8332P9220R1958o3705l76738p88216j216757j579338
$$ 22298864 22071037 21884266 21835934 21915154 22007112 21943407 21566669 20778453 19561696 17982358
60975A7982358j811152j885256j819161j659142j454104j239500j036836q58152
$$ 17982358 16171206 14285950 12466789 10807647 9353543 8114043 7077207 6219055
60967F219055p07615n83120m80554l96972l29906k76144k32896j98831j72689
$$ 6219055 5511440 4928320 4447766 4050794 3720888 3444744 3211848 3013017 2840328
60958B840328j51994j34342j19079j06567r6501q7904q0030p2495o5098n8297
$$ 2840328 2688334 2553992 2434913 2328346 2231845 2143941 2063911 1991416 1926318 1868021
60948A868021n3158n0075m8130m6454m5483m6058m7812m9364m9734m8817m6880
$$ 1868021 1814863 1764788 1716658 1670204 1624721 1578663 1530851 1481487 1431753 1382936 1336056
60937A336056m4390m2093m0495l9313l7930l6211l4452l2728l0800k8529k6055
$$ 1336056 1291666 1249573 1209078 1169765 1131835 1095624 1061172 1028444 997644 969115 943060
60926I43060k3668k1697k0288j9156j7874j6521j5563j5056j4510j3682j2759
$$ 943060 919392 897695 877407 858251 840377 823856 808293 793237 778727 765045 752286
60915G52286j1563r500o777m736m221m373l896k823k021j593j018n27r87k310
$$ 752286 740723 731223 724446 719710 715489 711116 707220 704397 702376 700783 699765 699238 698251 695941
60901F95941l202k904k181k131k733l214l261l233l454l853m203m370m343m253
$$ 695941 692739 689835 687654 685523 682790 679576 676315 673082 669628 665775 661572 657202 652859 648606
60887F48606m283m410m347m002l817m343n512o627p149p229p292p436p443p255
$$ 648606 644323 639913 635566 631564 627747 623404 617892 611265 604116 596887 589595 582159 574716 567461
60873E67461o978o533n679m510l511l009k875k939l241l580l327k213r17k47j2
$$ 567461 560483 553950 548271 543761 540250 537241 534366 531427 528186 524606 521279 519066 518149 517902 517890
60858E17890N38J311J324K15j045j375r20o21q35r97n08N12J450J808J533Q64
$$ 517890 518428 519739 521063 521278 520233 518858 517938 517317 516482 515485 514977 515489 516939 518747 520280 521144
60842E21144K0r13j868k749l592m486n228n319m613l707l218k986k456j723j443
$$ 521144 521164 520251 518383 515634 512042 507556 502328 497009 492396 488689 485471 482485 480029 478306 476863
60827D76863j759k022j710j034l80K66R84J483J411Q39J31m52q23j069j414j974
$$ 476863 475104 473082 471372 470338 469958 470224 471208 472691 474102 474941 475072 474620 473797 472728 471314 469340
60811D69340k380k155j526j344j992k782k833k128j333r42j013j433k017k440
$$ 469340 466960 464805 463279 461935 459943 457161 454328 452200 450867 449925 448912 447479 445462 443022
60797D43022k513k384k344k497k829l334l795l747k999k035j506j470j427j058
$$ 443022 440509 438125 435781 433284 430455 427121 423326 419579 416580 414545 413039 411569 410142 409084
60783D09084n76l81o65j316j990k223j788j012n55p14j089j065n06K12P46J113
$$ 409084 408508 408127 407462 406146 404156 401933 400145 399133 398578 397864 396775 395710 395204 395416 396162 397275
60767C97275J436J722K083K839L998M811M491L319K428K413K771K939L021L046
$$ 397275 398711 400433 402516 405355 409353 414164 418655 421974 424402 426815 429586 432525 435546 438592
60753D38592K385P39r04j299n86M8J45K77P07P99J12r06j768k669l885n040n532
$$ 438592 440977 441716 440812 439513 438927 438975 439120 439397 440104 440903 441015 440109 438341 435672 431787 426747 421215
60736D21215n352n037m987n142n204m917m324l710l219k676j954j293r17o68m75
$$ 421215 415863 410826 405839 400697 395493 390576 386252 382542 379323 376647 374693 373400 372483 371815 371340
60721C71340p39j561k112j647q51r75j820j862n69P73R67M21J27K05K55L01N23
$$ 371340 370601 369040 366928 365281 364430 363455 361635 359773 359204 359977 360944 361365 361492 361697 361952 362253 362776
60704C62776O88O08N96Q97J183J201J315J780K100J828J428J602K194K553K584
$$ 362776 363464 364072 364668 365565 366748 367949 369264 371044 373144 374972 376400 378002 380196 382749 385333
60689C85333K651K754K501J765Q66K59M10J509K987L766L546L271L733M315L909
$$ 385333 387984 390738 393239 395004 395870 396129 396539 398048 401035 404801 408347 411618 415351 419666 423575
60674D23575K619J615J540J883J787Q03r54k729l410k633j464j288k162k944k887
$$ 423575 426194 427809 429349 431232 433019 433822 432868 430139 426729 424096 422632 421344 419182 416238 413351
60659D13351k370k017j898j743j391p94k1O85J122J418J796K156K181J782J118
$$ 413351 410981 408964 407066 405323 403932 403138 403117 403802 404924 406342 408138 410294 412475 414257 415375
60644D15375L85j79l82m86j122k323l164k971k412k605l451l798l147k147j386
$$ 415375 415760 415581 415199 414713 413591 411268 408104 405133 402721 400116 396665 392867 389720 387573 386187
60629C86187o20M44J409J688J260N95J22qJ17K80L70N07P35P71M05n0k15l14q13
$$ 386187 385567 386011 387420 389108 390368 390963 391085 391077 391194 391474 391844 392351 393086 393857 394262 394212 393997 393683 392870
60610C92870j491j590r60l14j31k3M74J061J091M83k87q08j000q89n27j36K6P9
$$ 392870 391379 389789 388829 388515 388384 388361 388835 389896 390987 391470 391183 390375 389375 388486 387959 387823 387849 387928
60592C87928N48J763L284M171L921K950J962J149L68j92j17M86R83J118J251J525
$$ 387928 388476 390239 393523 397694 401615 404565 406527 407676 408044 407852 407735 408221 409204 410322 411573 413098
60576D13098J540J236J343K334L595M306M626N237O191P061P903R149J0708J1952
$$ 413098 414638 415874 417217 419551 423146 427452 432078 437315 443506 450567 458470 467619 478327 490279
60562D90279J2519J2455J1689J0111Q034N907L674J135j280k904l821m622n223
$$ 490279 502798 515253 526942 537053 545087 550994 554668 555803 554523 551619 547798 543176 537953
60549E37953m978l940k954k256j052J106L436M970N726O273O815P360Q286J0012
$$ 537953 532975 529035 526081 523825 522773 523879 527315 532285 538011 544284 551099 558459 566745 576757
60535E76757J2323J4431J5577J5369J3855J1586R321P330N236K668k13k973n286
$$ 576757 589080 603511 619088 634457 648312 659898 669219 676549 681785 684453 684240 681267 675981
60522F75981o803p182o585n829n545n472m960l951l044k642k437j852p53M46J352
$$ 675981 669178 661996 655411 649582 644037 638565 633605 629654 626610 623968 621531 619679 618926 619372 620724
60507F20724K084L079M459N915P294Q970J1319J4196J7326K0913K5263K9991L4232
$$ 620724 622808 625887 630346 636261 643555 652525 663844 678040 695366 716279 741542 771533 805765
60494H05765L7698M0792M3615M5471M5630M4108M1384L7640L2548K5603J6526
$$ 805765 843463 884255 927870 973341 1018971 1063079 1104463 1142103 1174651 1200254 1216780
60483A216780N587o340j8194k9158l8573m5767n0363n2576n2773n1041m7681m3746
$$ 1216780 1222367 1216027 1197833 1168675 1130102 1084335 1033972 981396 928623 877582 829901 786155
60471G86155m0212l6812l2624k7799k3613k0744j8543j6389j4659j3705j2892
$$ 786155 745943 709131 676507 648708 625095 604351 585808 569419 554760 541055 528163
60460E28163j1436r591q175p409o959o633o366n845m941m183m141m517m495l777
$$ 528163 516727 507136 498961 491552 484593 477960 471594 465749 460808 456625 452484 447967 443472 439695
60446D39695k743j806j155r72j285j631j463q33l00k03m14o67p56n97m34p25j377
$$ 439695 436952 435146 433991 433019 431734 430103 428640 427807 427507 427304 426890 426223 425467 424870 424436 423711 422334
60429D22334j481m69Q25J002n2j079j185q03o79p34m43K56J008J592J953K039
$$ 422334 420853 420384 421209 422211 422159 421080 419895 419092 418413 417679 417236 417492 418500 420092 422045 424084
60413D24084J966K073K388K362J583N58J44M48P64O26K91J40J96L64P21J215J521
$$ 424084 426050 428123 430511 432873 434456 435014 435158 435606 436370 436996 437287 437427 437623 437987 438708 439923 441444
60396D41444J506J487J681J815J644J531J931K519K526J894J391J462J707J730
$$ 441444 442950 444437 446118 447933 449577 451108 453039 455558 458084 459978 461369 462831 464538 466268
60382D66268J837K371K888K682J913J563K263L564M423M161K980J746J214J318
$$ 466268 468105 470476 473364 476046 477959 479522 481785 485349 489772 493933 496913 498659 499873 501191
60368E01191J379J068Q14J018J338J188O50L53O36J350K312L388M193M299L854
$$ 501191 502570 503638 504452 505470 506808 507996 508646 508999 509635 510985 513297 516685 520878 525177 529031
60353E29031L503L626M079M755N854P391Q820R413Q842P314N295L208J210p26
$$ 529031 532534 536160 540239 544994 550848 558239 567059 576472 585314 592628 597923 601131 602341 601615
60339F01615k489l795m617n345o151o539o056n222m972n295n232m305l207k801
$$ 601615 599126 595331 590714 585369 579218 572679 566623 561401 556429 551134 545902 541597 538390 535589
60325E35589k996l089k723k142j706j552j564j485j141n45K79J486L069M572N555
$$ 535589 532593 529504 526781 524639 522933 521381 519817 518332 517191 516646 516925 518411 521480 526052 531607
60310E31607O271P344Q882J0435J1815J3302J5019J6739J8334J9734K0344J9329
$$ 531607 537878 545222 554104 564539 576354 589656 604675 621414 639748 659482 679826 699155
60298F99155J6730J3535J0278O311J003n037j0513j4730j7690j9397j9721j8755
$$ 699155 715885 729420 739698 746009 747012 741975 731462 716732 699042 679645 659924 641169
60286F41169j6841j4373j1886r947q654p620o658o012n632m965l964l572m398
$$ 641169 624328 609955 598069 588122 579468 571848 565190 559178 553546 548581 544617 541045 536647
60273E36647n534n602m633l885m006m354m151l427k626k069j919k050j871r11
$$ 536647 531113 525511 520878 516993 512987 508633 504482 501055 498429 496360 494441 492391 490520 489609
60259D89609K86O06j06p18l52N03R19Q45Q53R94P86J94j65J78J036J951K595K676
$$ 489609 489895 490501 490395 489677 489325 489828 490747 491592 492445 493439 494225 494419 494254 494432 495468 497419 500014 502690
60241E02690J969O77n56j283j570j555j077r5Q60J243J247J440J857K069K150
$$ 502690 504659 505336 504780 503497 501927 500372 499295 499200 500060 501303 502550 503990 505847 507916 510066
60226E10066K698L707M223L623K601K248K714L475M344N377O121O081N765O268
$$ 510066 512764 516471 520694 524317 526918 529166 531880 535355 539699 545076 551197 557278 563043 569311
60212E69311P619Q652Q713Q500Q756R117Q969Q599Q578Q606P967O786N859N347
$$ 569311 576930 585582 594295 602795 611551 620668 629637 638236 646814 655420 663387 670173 676032 681379
60198F81379M603L388K303J733J084l46k238l600m022m030m213m576m837n006
$$ 681379 685982 689370 691673 693406 694490 694144 691906 688306 684284 680254 676041 671465 666628 661622
60184F61622n289n678n901n800n462n092m886m997n317n368m802l933l372l052
$$ 661622 656333 650655 644754 638954 633492 628400 623514 618517 613200 607832 603030 599097 595725 592673
60170E92673k296j053l29q24j748j760p26K94N79M55M70O58Q11Q52P70O28P01
$$ 592673 590377 589324 588995 588171 586423 584663 583937 584231 584810 585265 585735 586393 587204 588056 588826 589454 590155
60153E90155J153J628J685J558J808K344K574K579L176M634O132O966P402P940
$$ 590155 591308 592936 594621 596179 597987 600331 602905 605484 608660 613294 619426 626392 633794 641734
60139F41734Q430Q584Q700R170R677R625R086Q725Q821Q950Q522P305N452L312
$$ 641734 650164 658748 667448 676618 686295 695920 705006 713731 722552 731502 740024 747329 752781 756093
60125G56093J226n65j844k302j818q19J3M11N85O50M60qo37j498k632l469l259
$$ 756093 757319 756754 754910 752608 750790 749971 749984 750395 750980 751630 752090 752082 751445 749947 747315 743846 740587
60108G40587k274j719k279l380m278m962n603n933n818n716n916n888n113l962
$$ 740587 738313 736594 734315 730935 726657 721695 716092 710159 704341 698625 692709 686821 681708 677746
60094F77746l075k385j484n14J26O01J368K303K854K933L025L410L824L888L512
$$ 677746 674671 672286 670802 670288 670414 671015 672383 674686 677540 680473 683498 686908 690732 694620 698132
60079F98132K965K706K876K786J395j309m039n694o630p717q864r315r068q930
$$ 698132 701097 703803 706679 709465 710860 709551 705512 699818 693188 685471 676607 667292 658224 649294
60065F49294r245r465r064q114o893n515m212l456l476l874l948l306k181j185
$$ 649294 640049 630584 621520 613406 606513 600998 596786 593330 589854 585980 582032 578726 576545 575360
60051E75360o27j31Q15K037K912L406M154N320O199O328O200O284O158N379M489
$$ 575360 574733 574602 575417 577454 580366 583772 587926 593246 599445 605773 611973 618257 624415 629794 634283
60036F34283M147L918K865J028p52k143l443m637n373n797o439p223p536p317
$$ 634283 638430 642348 645213 646241 645489 643346 639903 635266 629893 624096 617657 610434 602898 595581
60022E95581p216p509p720p506p150o982o904o730o505o293o135o178o383o175
$$ 595581 588365 580856 573136 565630 558480 551498 544594 537864 531359 525066 518931 512753 506370 500195
60008E00195n027l366k275k163k406k283j666o36P20J944K276J594P91Q10J635
$$ 500195 495168 491802 489527 487364 484958 482675 481009 480373 481093 483037 485313 486907 487698 488508 490143
59993D90143K543L093L446L900M437M827M990N106N294N269M632L505K443J683
$$ 490143 492686 495779 499225 503125 507562 512389 517379 522485 527779 533048 537680 541185 543628 545311
59979E45311Q05n41k083l356m204m559m227l442l012l328l664l133j914p88J31
$$ 545311 546116 545575 543492 540136 535932 531373 527146 523704 520692 517364 513700 510567 508653 507865 507996
59964E07996J299K731L964M862N629O141O036N423M726L940K737J227j39j300
$$ 507996 509295 512026 515990 520852 526481 532622 538658 544081 548807 552747 555484 556711 556572 555272
59950E55272k427l203l102k340j724j538j352j000q80j210j776k414l077l382
$$ 555272 552845 549642 546540 544200 542476 540938 539586 538586 537706 536496 534720 532306 529229 525847
59936E25847k930k119j796k024j992j255j85Q41J863K751L128L124L358L970M427
$$ 525847 522917 520798 519002 516978 514986 513731 513546 514387 516250 519001 522129 525253 528611 532581 537008
59921E37008M591N021N966O893P387P728Q119Q140P480O490N600M814M204M206
$$ 537008 541599 546620 552586 559479 566866 574594 582713 590853 598333 604823 610423 615237 619441 623647
59907F23647M810N204M802M054L551K944J586j47j062p40j61n50j940l179l202
$$ 623647 628457 633661 638463 642517 646068 649012 650598 650451 649389 648649 648488 647938 645998 642819 639617
59892F39617k100p83K39J285K554L392L088K050J407J675K528L662M959N893N823
$$ 639617 637517 636734 636973 638258 640812 644204 647292 649342 650749 652424 654952 658614 663573 669466 675289
59877F75289N044M563M637M448L490K270J249J29j278k372k666k634k953l501
$$ 675289 680333 684896 689533 693981 697471 699741 700990 701119 699841 697469 694803 692169 689216 685715
59863F85715l805l914m081m100l632k916k433k213j992j767j627j331o46J13N15
$$ 685715 681910 677996 673915 669815 666183 663267 660834 658621 656629 654862 653235 651904 651258 651371 651886
59848F51886P65J476K740L972M709N062N302N290M552K876P66p86j159o80j58
$$ 651886 652651 654127 656867 660839 665548 670610 675912 681202 685754 688630 689396 688610 687451 686771 686613
59833F86613O5K73O73R53O05o48k749n207p142p851p524o926o412n734m826m079
$$ 686613 686678 686951 687624 688577 689182 688534 685785 680578 673436 665585 658061 651135 644723 638989 634163 630084
59817F30084l689l366k922k598k509k327j916j677j934k365k508k412k423k570
$$ 630084 626395 623029 620107 617509 615000 612673 610757 609080 607146 604781 602273 599861 597438 594868
59803E94868k550k205j685j264j123j218j368j523j869k455k995l354l886m774
$$ 594868 592318 590113 588428 587164 586041 584823 583455 581932 580063 577608 574613 571259 567373 562599
59789E62599n355m851l561k578k366k429k313k039j561p46k0r7p72r36q4J055
$$ 562599 557244 552393 548832 546254 543888 541459 539146 537107 535546 534800 534780 534683 533911 532975 532891 533946
59773E33946J749K189K776L261L294L124L214L557L848L940L874L824M139M935
$$ 533946 535695 537884 540660 543921 547215 550339 553553 557110 560958 564898 568772 572596 576735 581670
59759E81670N682N818N722O232P245P798P694P877Q876R960J0324J0002R185P769
$$ 581670 587352 593170 598892 605124 612369 620167 627861 635738 644614 654574 664898 674900 684085 691854
59745F91854O130N296N493N556M529K952J790J008J07q42j631k546l619m002l180
$$ 691854 697984 703280 708773 714329 718858 721810 723600 724608 724715 723873 722242 719696 716077 712075 708895
59730G08895k103k077l053l979m367m419m109l281k351j975k144k386k580k831
$$ 708895 706792 704715 701662 697683 693316 688897 684788 681507 679156 677181 675037 672651 670071 667240
59716F67240k842k314j637j434j635j693j432r45j32R28J499J019J15l8P69J754
$$ 667240 664398 662084 660447 659013 657378 655685 654253 653308 653176 654104 655603 656622 656737 656699 657468 659222
59700F59222K387K860L378L755L770L383K696K095K167K939L474K884J467K54
$$ 659222 661609 664469 667847 671602 675372 678755 681451 683546 685713 688652 692126 695010 696477 696731
59686F96731l46p60j350j993k467k749k861k856k896l103l445l917m552n117n318
$$ 696731 696385 695625 694275 692282 689815 687066 684205 681349 678453 675350 671905 667988 663436 658319 653001
59671F53001n350n678o099n797m595l329k575k007j459j461k007j956o79O96Q99
$$ 653001 647651 641973 635874 630077 625482 622153 619578 617571 616112 614651 612644 610688 610009 610705 611604
59656F11604N25J051K558L782M014L629L045K393K040K245K437J820M95q99k308
$$ 611604 612129 613180 615738 619520 623534 627163 630208 632601 634641 636886 639323 641143 641638 640739 638431
59641F38431l960n322n611n091m696m511l805k557j650j513j663j729j907k250
$$ 638431 634471 629149 623538 618447 613751 609240 605435 602878 601228 599715 598052 596323 594416 592166
59627E92166k463k597l082l885m440m502m379m231l883l367k943k553j990j546
$$ 592166 589703 587106 584024 580139 575699 571197 566818 562587 558704 555337 552394 549841 547851 546305
59613E46305j715k259k342j560k54J176K529L464L668L354L022K805K544K275
$$ 546305 544590 542331 539989 538429 538175 539351 541880 545344 549012 552366 555388 558193 560737 563012
59599E63012K011J418L72n38p74o53n97j89R26J847J363j82j317j521j500j596
$$ 563012 565023 566441 566813 566275 565501 564848 564251 564062 564988 566835 568198 568016 566699 565178 563678 562082
59583E62082j363q20o77j134j647k122l033m112m290l321k319k109k184j832j233
$$ 562082 560719 559899 559222 558088 556441 554319 551286 547174 542884 539563 537244 535135 532951 531119 529886
59568E29886q37n24p8K66K98K66L53L44J87K45O11P95M73N9J54Q37J761K507K727
$$ 529886 529049 528525 528447 528713 529011 529277 529630 529974 530161 530406 531017 531812 532285 532344 532498 533335 535096 537603 540330
59549E40330K410K101K386L069L416L234L208M059N837Q016R878J1030J2000J3934
$$ 540330 542740 544841 547227 550296 553712 556946 560154 564213 570050 578066 587944 598974 610974 624908
59535F24908J6964J9283J8728J4999R509L627j808n571o493m966k824j296j38
$$ 624908 641872 661155 679883 694882 704391 708018 706210 700639 694146 689180 686356 685060 684922
59522F84922J042J844J899J555J183N69o55k529m902p399r284j0124j0434j0854
$$ 684922 685964 687808 689707 691262 692445 693014 692359 689830 684928 677529 668245 658121 647687 636833
59508F36833j0926r877q297p629p951p820o543n073m217l518k525j797j748j684
$$ 636833 625907 616030 607733 600104 592153 584333 577790 572717 568500 564982 562457 560660 558912 557228
59494E57228r24P9N55N64O14Q23J106J535K055K456K931L810M629M433L350K733
$$ 557228 556304 556383 556938 557502 558116 558939 560045 561580 563635 566091 569022 572832 577461 581894 585244 587977
59478E87977L297M238M702M967N508N990N941N518M924L952K767K133K221K155
$$ 587977 591274 595512 600214 605181 610689 616679 622620 628138 633062 637014 639781 641914 644135 646290
59464F46290J432P57P78J052J163J748L364N212O165O385O818P735Q774R830J0803
$$ 646290 647722 648479 649257 650309 651472 653220 656584 661796 667961 674346 681164 688899 697673 707503 718306
59449G18306J0959R633P333N210L623J981j44k541m829o812q429r752j0854j1446
$$ 718306 729265 738898 746231 751441 755064 757045 756901 754360 749531 742719 734290 724538 713684 702238
59435G02238j1022r575p793o243m951l934l430l283k749j369N80K774N260P944
$$ 702238 691216 681641 673848 667605 662654 658720 655290 652007 649258 647889 648469 651243 656503 664447
59421F64447J0366J2340J4043J5340J5940J6402J7692J9477K0247J9673J9260
$$ 664447 674813 687153 701196 716536 732476 748878 766570 786047 806294 825967 845227
59410H45227J9641J8821J4522P179q10p837j3555j7357j8294j6326j2391p248
$$ 845227 864868 883689 898211 905390 904580 896743 883188 865831 847537 831211 818820 811572
59398H11572j421L856O804O423K983k561q977j4782j8716k0415k0249j8745j6454
$$ 811572 810151 814007 820811 827234 830217 827656 818679 803897 785181 764766 744517 725772 709318
59385G09318j3873j1125q067n095l086k167j347L1J310J704J587J768K271K715
$$ 709318 695445 684320 676253 671158 668072 665905 664558 664589 665899 667603 669190 670958 673229 675944
59371F75944L215L908M285L991L630L849M219M079L801M054M508M459M255M766
$$ 675944 679159 683067 687352 691343 694973 698822 703041 707120 710921 714975 719483 723942 728197 732963
59357G32963N904O955P966R435J0970J1743J2129J3369J5434J6785J6574J5811
$$ 732963 738867 745822 753788 763223 774193 785936 798065 811434 826868 843653 860227 876038
59345H76038J5765J6362J6697J6302J5188J3317J0663P502M171Q12k480n503q167
$$ 876038 891803 908165 924862 941164 956352 969669 980332 987834 992005 992817 990337 984834 976667
59332I76667j0625j3024j5258j6977j7823j7704j6961j6055j5115j4009j2817
$$ 976667 966042 953018 937760 920783 902960 885256 868295 852240 837125 823116 810299
59321H10299j1785j0763r404p986p261p179o715n378l997l392l208k863k705l223
$$ 810299 798514 787751 778347 770361 763100 755921 749206 743828 739831 736439 733231 730368 727663 724440
59307G24440l783l377k151j113n89j7R60K155L441M908O526Q157R691J0531R479
$$ 724440 720657 717280 715129 714016 713427 713410 714370 716525 719966 724874 731400 739557 749248 759779 769258
59292G69258N924P90m416r064j3085j5854j6500j5147j2852j0399p971n773l987
$$ 769258 775182 775972 771556 762492 749407 733553 717053 701906 689054 678655 670684 664911 660924
59279F60924k158M01L512O093P396P803Q412J0147J3001J5790J6995J6255J4599
$$ 660924 658766 659167 662679 668772 676168 683971 692383 702530 715531 731321 748316 764571 779170
59266G79170J2934J1023Q486N854L798J974k37k546m291n654p174q534r041q910
$$ 779170 792104 803127 811613 817467 821265 823239 823002 820456 816165 810511 803337 794803 785762 776852
59252G76852q943r127q736p680o611n755m675l194j627j15J410K687L385L800
$$ 776852 767909 758782 750046 742366 735755 730000 725325 722131 720504 720389 721799 724486 727871 731671
59238G31671M465N199N381N050M865N023N008M382L202J733L29o48j379k588m426
$$ 731671 736136 741335 746716 751766 756631 761654 766662 771044 774246 775979 776308 775660 774281 771693 767267
59223G67267n907o252o143o668p650q156q119q229q504q324p693p234o995o373
$$ 767267 761360 755108 748965 742297 734647 726491 718372 710143 701639 693315 685622 678388 671393 665020
59209F65020n224m099l407l174l414l893l875l014k083j889j958j451o94m64l49
$$ 665020 659796 655697 652290 649116 645702 641809 637934 634920 632837 630948 628990 627539 626845 626381 626032
59194F26032N57J718J782R42Q26J909K849K795K607L184M077M523M616M789M997
$$ 626032 626589 628307 630089 631031 631857 633766 636615 639410 642017 645201 649278 653801 658417 663206 668203
59179F68203N094N159N097M729M472M976N923O196N589N201N836O966P752Q152
$$ 668203 673297 678456 683553 688282 692754 697730 703653 709849 715438 720639 726475 733441 741193 749345
59165G49345Q512Q849Q915Q476P226N067K518K38j846m191o598q420r750j1321
$$ 749345 757857 766706 775621 784097 791323 796390 798908 799146 797300 793109 786511 778091 768341 757020
59151G57020j3248j4824j5539j5408j4336j2340j0332r449r446q928p417n979
$$ 757020 743772 728948 713409 698001 683665 671325 660993 651544 642098 633170 625753 619774
59139F19774n610o012o375o289n595m292k901k130j928j635j004k52P89K501M534
$$ 619774 614164 608152 601777 595488 589893 585601 582700 580570 578642 577007 576003 575751 576540 579041 583575
59124E83575O056O912P466P568O944O444P301R213J0631J1040J1326J1830J1872
$$ 583575 589631 596543 604009 611577 618521 624965 632266 641479 652110 663150 674476 686306 698178
59111F98178J1485J1711J2544J2397J0542Q421P575P688P620P070O168M673K642
$$ 698178 709663 721374 733918 746315 756857 765278 772853 780541 788161 795231 801399 806072 808714
59098H08714Q89j95j319k971m401m792m484m146l643k669j664j179j060j072j624
$$ 808714 809603 809408 808089 805118 800717 795925 791441 787295 783652 780983 779319 778140 777080 776008 774384
59083G74384l005m566n528o120p105q664j0236j1133j0934r800q675q437q665
$$ 774384 771379 766813 761285 755165 748060 739396 729160 718027 707093 697293 688618 680181 671516
59070F71516q069o369m772m219m252m119l943m089m267m045l563l154k785k375
$$ 671516 663447 657078 652306 648087 643835 639716 635773 631684 627417 623372 619809 616655 613870 611495
59056F11495k045j732j287j018j366j890j605n46J56o6o02r24j189j235m86O83
$$ 611495 609450 607718 606431 605413 604047 602157 600552 600006 600162 600096 599494 598570 597381 596146 595660 596343
59040E96343J006L75L25J682L193L533L229L505M332M957N374O109P234Q626J0402
$$ 596343 597349 597724 598049 599731 602924 606457 609686 613191 617523 622480 627854 633963 641197 649823 660225
59025F60225J2383J3865J4720J5726J7083J7707J6858J5295J3824J1815Q412M223
$$ 660225 672608 686473 701193 716919 734002 751709 768567 783862 797686 809501 817913 822136
59013H22136M98k499n073o831p236o848o687o740o177m698k646k03K505M782N870
$$ 822136 822634 820135 815062 808231 800995 794147 787460 780720 774543 769845 767199 766996 769501 774283 780153
58998G80153N890N555N205M726M102L460K793K105J434N25r59k706l984m775n782
$$ 780153 786043 791598 796803 801529 805631 809091 811884 813989 815423 815948 814989 812283 808299 803524 797742
58983G97742p034p609p169o493n943m674k233L16J822K589L529M792O123P603
$$ 797742 790708 783099 775930 769437 763494 758820 756587 756903 758725 761314 764843 769635 775758 783361
58969G83361R088R872R838R945J0669J1074J0450R667R647R631Q395O257M313
$$ 783361 792449 802321 812159 822104 832773 843847 854297 863964 873611 883242 891637 897894 902207
58956I02207K473k32l870p507j0549j3004j4755j5681j6156j6508j6410j5580
$$ 902207 904680 904448 900578 893071 882522 869518 854763 839082 822926 806418 790008 774428
58944G74428j4448j3384j1995j0047q211o923n504l484j814j443j594r84nn9j208
$$ 774428 759980 746596 734601 724554 716343 709420 703916 700432 698618 697175 695581 694597 694592 694533 693325
58929F93325k058j816j079o57p90j440k358k929k755k230j930j807j596j410j253
$$ 693325 691267 689451 688372 687715 686925 685485 683127 680198 677443 675213 673283 671476 669880 668470 667217
58914F67217o43N21J490J887K505L956N456O039O112O608P431P974Q495R640J1284
$$ 667217 666574 667095 668585 670472 672977 676933 682389 688428 694540 701148 708579 716553 725048 734688 745972
58899G45972J2928J4657J6452J7341J6602J5161J4522J4825J5308J5985J7454
$$ 745972 758900 773557 790009 807350 823952 839113 853635 868460 883768 899753 917207
58888I17207J9514K1380K2905K4270K4799K3444K0196J6017J1639P396L633L03
$$ 917207 936721 958101 981006 1005276 1030075 1053519 1073715 1089732 1101371 1108767 1112400 1112703
58876A112703l341p616j1667j4737j7294j9776k1291k1003j9809j9040j8319j6393
$$ 1112703 1109362 1101746 1090079 1075342 1058048 1038272 1016981 995978 976169 957129 938810 922417
58864I22417j3466j0933r347q327p983q637r559r676r335r684j0578j0742r838
$$ 922417 908951 898018 888671 880344 872361 863724 854165 844489 835154 825470 814892 804150 794312
58851G94312q764q024p240o260n362m536l774l760n047o909q303r365j0626j1486
$$ 794312 785548 777524 770284 764024 758662 754126 750352 746592 741545 734636 726333 716968 706342 694856
58837F94856j1087j0100r788r800q813o978n721n339m776l759l165l163k873k064
$$ 694856 683769 673669 663881 654081 645268 638290 632569 627230 622454 618695 615530 612367 609494 607430
58823F07430j472j178l22J315K910L955M636M811M150L275L239L789L716K879
$$ 607430 605958 604780 604458 605773 608683 612638 617274 622085 626235 629510 632749 636538 640254 643133
58809F43133K315K285J895Q59K5j77k54m34l93m24j341k914l835l542k816k384
$$ 643133 645448 647733 649628 650487 650512 650335 650081 649647 649254 648830 647489 644575 640740 637198 634382 631998
58793F31998k242k474l296m099l839k514j037L19J970L570M172L970M269N499
$$ 631998 629756 627282 623986 619887 616048 613534 612497 612816 614786 618356 622528 626498 630767 636266
58779F36266O676P084O995O578N548M123K964J927K49j916l550m437n348o473
$$ 636266 642942 650026 657021 663599 669147 673270 676234 678161 678410 676494 672944 668507 663159 656686
58765F56686p198p429p606p364n857l578k100j724j060P27K873M549N733O163
$$ 656686 649488 642059 634453 627089 621232 617654 615554 613830 612770 613497 616370 620919 626652 632815
58751F32815N123K950J217Q60J267J634J877J948J693J639K575M063M783M533
$$ 632815 637938 640888 642105 642965 644232 645866 647743 649691 651384 653023 655598 659661 664444 668977
58737F68977M406M878N360N804O930Q490R152Q645Q280Q727Q977Q169O838N658
$$ 668977 673383 678261 683621 689425 696355 704845 713997 722642 730922 739649 748626 756795 763633 769291
58723G69291M422L070K312K498L043L547M309N367O206O762P452P980P468N921
$$ 769291 773713 776783 779095 781593 784636 788183 792492 797859 804065 810827 818279 826259 833727 839648
58709H39648M177K272n01l795o264p698r340j1727j4006j5725j7473j9204j9885
$$ 839648 843825 846097 845596 841801 835537 827839 818499 806772 792766 777041 759568 740364 720479
58696G20479j9398j8978j9050j8455j6518j4104j1943r690p418o218o432o908
$$ 720479 701081 682103 663053 644598 628080 613976 602033 592343 584925 578707 572275 565367
58684E65367o798o542o383n684m465l804l884l425j926o30l06J30J587L255M250
$$ 565367 558569 552027 545644 539960 535495 531691 527807 524382 522456 521826 521520 521650 523237 526492 530742
58669E30742N175O697Q143Q870R586J1018J2424J2797J2356J1701J0417P744L823
$$ 530742 535917 542614 550757 559627 569213 580231 592655 605452 617808 629509 639926 647670 651493
58656F51493n08m398o956p694p455p756q691q883p892p043p229p499o712n073
$$ 651493 650985 646587 639631 631937 624482 616726 608035 599152 591260 584217 576988 569489 562777 557704
58642E57704l341j829q53o99n80P71K923L910L129K194K256K480K080J699J694
$$ 557704 554363 552534 551681 550982 550402 551173 554096 558006 561135 563329 565585 568065 570145 571844 573538
58627E73538J098l74j228n63K91j4o01O0J754L259M218M907N265N421O114P470
$$ 573538 574636 574262 573034 572471 572762 572748 572147 572207 573961 577220 581438 586345 591610 597031 603145 610615
58611F10615Q433Q276P500O514M862K580P94M4n32j521k302k596l174m166m426
$$ 610615 619048 627324 634824 641338 646200 648780 649574 649618 649086 647565 645263 642667 639493 635327 630901
58596F30901l549k705k526k023p03L15N15J280L545O033P377Q154R363J0608J1334
$$ 630901 627352 624647 622121 620098 619395 619710 620225 621505 625050 631083 638460 646614 655977 666585 677919
58581F77919J2122J3197J3341J1857J0086R347Q976P921O812O776P625Q672J0069
$$ 677919 690041 703238 716579 728436 738522 747869 756845 764766 771578 778354 785979 794651 804720
58568H04720J2062J4204J6493J9731K3752K6978K8736L0180L1774L2034K9999
$$ 804720 816782 830986 847479 867210 890962 917940 946676 976856 1008630 1040664 1070663
58557A070663K6808K3360J8707J2431O261J515k843p639j1219j1953j0973j0308
$$ 1070663 1097471 1120831 1139538 1151969 1158230 1159745 1156902 1149263 1138044 1126091 1115118 1104810
58545A104810j0071r701j0045j1896j4181j5830j7843k1285k4835k6574k6658
$$ 1104810 1094739 1085038 1074993 1063097 1048916 1033086 1015243 993958 969123 942549 915891
58534I15891k6104k4589k1701j8756j7002j5508j2982j0184q367o874m600k326
$$ 915891 889787 865198 843497 824741 807739 792231 779249 769065 760698 753824 749224 746898
58522G46898j295r12j04M84j49j173j355j209j592j799j181j006k353l769l493
$$ 746898 745603 744691 744587 745071 744922 743749 742394 741185 739593 737794 736613 735607 733254 729485 725992
58507G25992k380k222k665k376j718j724j808j074m71j161k137j949j291j393
$$ 725992 723612 721390 718725 716349 714631 712907 711099 710025 709554 708393 706256 704307 703016 701623
58493G01623j409o3J694K417K950M705O680P180P154Q689J1396J3294J4224J5500
$$ 701623 700214 700151 701845 704262 707212 711917 718597 725777 732931 741620 753016 766310 780534 796034
58479G96034J7176J8430J9608K1155K1551J9098J4701J0358O076R39m195p846
$$ 796034 813210 831640 851248 872403 893954 913052 927753 938111 944187 945126 940931 933085
58467I33085j0460j3004j4435j3439j1341j0272r731p900n025k466K24M077P952
$$ 933085 922625 909621 895186 881747 870406 860134 850403 842503 837478 835012 835236 839313 847265
58454H47265J0123J1262J2740J3469J1695Q478N906L367p98n463q291r820j1982
$$ 847265 857388 868650 881390 894859 906554 915032 920938 924305 923507 918044 909753 899933 887951
58441H87951j3886j3189j0672r145q614o720l423j094k50P56K147K701L052N102
$$ 887951 874065 860876 850204 841059 832445 825725 822302 821208 820958 821714 823861 826562 829614 834716
58427H34716Q309J0304J0981J2320J4285J4713J3113J1029Q713N056O58k575m821
$$ 834716 843025 853329 864310 876630 890915 905628 918741 929770 938483 943539 944197 941622 936801
58414I36801p801j1106j2509j1820j1054j0934j0527j0002j0327j0616r179o820
$$ 936801 929000 917894 905385 893565 882511 871577 861050 851048 840721 830105 820926 814106
58402H14106n683n415l929j397J85P80J976L424L442K620L041M340M349L140K650
$$ 814106 808423 803008 799079 797682 797867 798647 800623 804047 807489 810109 813150 817490 821839 824979 827629
58387H27629K861K195J122J428K518K384J532J972L139K978K213L188N247N795
$$ 827629 830490 832685 833807 835235 837753 840137 841669 843641 846780 849758 851971 855159 860406 866201
58373H66201N139N674P101P264O900Q499J1125J1650J0605J1480J4454J6214J5919
$$ 866201 871340 877014 884115 891379 898279 906778 917903 929553 940158 951638 966092 982306 998225
58360I98225J5970J6808J6271J4287J2995J2090R237N189L167L010J412j839l374
$$ 998225 1014195 1031003 1047274 1061561 1074556 1086646 1095883 1101072 1104239 1107249 1108661 1106822 1103448
58347A103448k211q13J40K537O029P917Q235R597J1866J2393J1682J2985J6147
$$ 1103448 1101237 1100424 1100564 1103101 1109130 1117047 1125282 1134879 1146745 1159138 1170820 1183805 1199952
58334A199952J7665J7151J7728J9763K0238J8748J7926J7605J4820J0004O839
$$ 1199952 1217617 1234768 1252496 1272259 1292497 1311245 1329171 1346776 1361596 1371600 1378439
58323A378439N561K955p69j864j68O60L74K419O428Q073P150Q165J1828J3775
$$ 1378439 1384000 1386955 1386186 1384322 1384154 1384814 1385188 1387607 1394035 1402108 1409258 1417423 1429251 1443026
58309A443026J3023J3731J7013J8895J8167J8419K0448K0602J8467J8222K0384
$$ 1443026 1456049 1469780 1486793 1505688 1523855 1542274 1562722 1583324 1601791 1620013 1640397
58298A640397K0462J7782J7289K0257K1787K0002J9270K1601K3345K3108K4457
$$ 1640397 1660859 1678641 1695930 1716187 1737974 1757976 1777246 1798847 1822192 1845300 1869757
58287A869757K8000K9410K8120K9163L3578L6073L5154L6158M1039M4572M4301
$$ 1869757 1897757 1927167 1955287 1984450 2018028 2054101 2089255 2125413 2166452 2211024 2255325
58276B255325M4678M7728M9247M8076M9347N4499N7836N6997N6993N9984O1418
$$ 2255325 2300003 2347731 2396978 2445054 2494401 2548900 2606736 2663733 2720726 2780710 2842128
58265B842128O0274O2244O8366P1662O9781O9626P4393P7648P5786P4515P7266
$$ 2842128 2902402 2964646 3033012 3104674 3174455 3244081 3318474 3396122 3471908 3546423 3623689
58254C623689P9038P7688P9219Q5629Q9852Q9231R1344R9830J07502J10489J15686
$$ 3623689 3702727 3780415 3859634 3945263 4035115 4124346 4215690 4315520 4423022 4533511 4649197
58243D649197J26667J36097J40170J46413J58802J69606J74827J82778J98033
$$ 4649197 4775864 4911961 5052131 5198544 5357346 5526952 5701779 5884557 6082590
58234F082590K12082K19873K30041K48338K66810K80178K96550L20708L43827
$$ 6082590 6294672 6514545 6744586 6992924 7259734 7539912 7836462 8157170 8500997
58225H500997L61563L84576M18755M53473M82514N17189N64868O15016O61560
$$ 8500997 8862560 9247136 9665891 10119364 10601878 11119067 11683935 12298951 12960511
58216A2960511P17562P91573Q71853R51501J045784J166064J301500J446741J621437
$$ 12960511 13678073 14469646 15341499 16293000 17338784 18504848 19806348 21253089 22874526
58207B2874526J840785K095392K384598K739880L189316L731016M368730N135773
$$ 22874526 24715311 26810703 29195301 31935181 35124497 38855513 43224243 48360016
58199D8360016O050351P087981Q238108R549584J1085884J2891216J5045296J7674285
$$ 48360016 54410367 61498348 69736456 79286040 90371924 103263140 118308436 135982721
58191A35982721K0825467K4386477K8177201L1950699L5067941L6234772L3918934
$$ 135982721 156808188 181194665 209371866 241322565 276390506 312625278 346544212
58184C46544212K7306456J6902235M266683q656880k0010387k8315980l2862272
$$ 346544212 373850668 390752903 395019586 386362706 366352319 338036339 305174067
58177C05174067l3962919l2678932l0159727k7194325k4206491k1399234j8810561
$$ 305174067 271211148 238532216 208372489 181178164 156971673 135572439 116761878
58170A16761878j6375174j4062371j1938531j0077157q476845p104325n954148
$$ 116761878 100386704 86324333 74385802 64308645 55831800 48727475 42773327
58163D2773327n019901m255708l612375l077967k648848k294498j984180j718987
$$ 42773327 37753426 33497718 29885343 26807376 24158528 21864030 19879850 18160863
58155A8160863j506831j331422j173282j037139r32087q46032p63864o90941o35850
$$ 18160863 16654032 15322610 14149328 13112189 12180102 11334070 10570206 9879265 9243415
58146I243415n88444n36287m85745m46543m11694l71739l33453l06039k83157
$$ 9243415 8654971 8118684 7632939 7186396 6774702 6402963 6069510 5763471 5480314
58137E480314k56186k31574k18042k09530j97066j85214j80917j77832j67312
$$ 5480314 5224128 4992554 4774512 4564982 4367916 4182702 4001785 3823953 3656641
58128C656641j54171j46717j41261j30740j18998j12695j08188r9622r1175q8570
$$ 3656641 3502470 3355753 3214492 3083752 2964754 2852059 2743871 2644249 2553074 2464504
58118B464504q7021q0057p2064o9934p0165o6066o0232n8377n7972n4146m9993
$$ 2464504 2377483 2297426 2225362 2155428 2085263 2019197 1958965 1900588 1842616 1788470 1738477
58107A738477n0226n1293m8059m3773m3380m3681m0004l5927l6373l7592l4058
$$ 1738477 1688251 1636958 1588899 1545126 1501746 1458065 1418061 1382134 1345761 1308169 1274111
58096A274111k8990k8000k8344k4633j9435j8141j8546j5560j1389j1235j3280
$$ 1274111 1245121 1217121 1188777 1164144 1144709 1126568 1108022 1092462 1081073 1069838 1056558
58085A056558j2510j0365j1414j4279j4729j4109j6145j9006j8755j7186j8226
$$ 1056558 1044048 1033683 1022269 1007990 993261 979152 963007 944001 925246 908060 889834
58074H89834k0159j9217j7211j7854j9090j6926j3357j2733j3670j2186r547r368
$$ 889834 869675 850458 833247 815393 796303 779377 766020 753287 739617 727431 717884 708516
58062G08516j0147q250n388n576p528p358o011o865q716q284o973q043r758q483
$$ 708516 698369 690119 684731 679155 671627 664269 658258 651393 642677 634393 627420 619377 609619 601136
58048F01136n966o343q338p660m949m172n156m738l569m768p242p193m911l852
$$ 601136 595170 588827 580489 572829 567880 563708 558552 553814 550245 545477 538235 531042 526131 522279
58034E22279m283l964l613n558q327q575p073p083q328q211p332q052r170p893
$$ 522279 517996 514032 510419 504861 496534 487959 480886 473803 465475 457264 449932 441880 432710 424817
58020D24817n435m939n473l966j434j250k756k610j193j578l336l395k005j980
$$ 424817 419382 414443 408970 405004 403570 402320 399564 396954 395761 394183 390847 387452 385447 383467
58006C83467k884j943J60K66j241j108O31R45k98k81J250J805J119J158J590M78
$$ 383467 380583 378640 378800 379066 377825 376717 377348 378293 377995 377714 378964 380769 381888 383046 384636 385114
57990C85114j157o46J007M25k062k971j822j334j874j186M70L57j418j954j057
$$ 385114 383957 383311 384318 384743 382681 379710 377888 376554 374680 373494 373964 374321 372903 370949 369892
57975C69892j491l467m025k415j116j085o53L61J79r09o14Q63R41m50p18L59J70
$$ 369892 368401 364934 360909 358494 357378 356293 355640 356001 356180 355271 354657 355520 356461 356011 355293 355652 355822
57958C55822j643k353j154m14j162j661j329j779l049k976j265k21n47k87J225
$$ 355822 354179 351826 350672 350258 349096 347435 346106 344327 341278 338302 337037 336816 336269 335982 337207
57943C37207K210K032K293L552M463M851O087P961Q654Q237Q623R783R743Q444
$$ 337207 339417 341449 343742 347294 351757 356608 362695 370656 379310 387547 396170 405953 415696 424140
57929D24140P779P567N641K270K44kj057l589n126m711m575n908o908o401n723
$$ 424140 431919 439486 445127 447397 447641 447639 446582 442993 437867 433156 428581 422673 415765 409364 403641
57914D03641n741n518n012n561o744o387m513l612m106l580j526o52k010k959
$$ 403641 397900 392382 387370 381809 375065 368678 364165 360553 356447 352867 351341 350689 348679 345720
57900C45720j796n39j068k055j883j330j268p30P55J686J343J300K522L570L307
$$ 345720 343924 343385 342317 340262 338379 337049 335781 335051 335806 337492 338835 340135 342657 346227 349534
57885C49534K748K743K480J680J628K506K437O24j216j874k411l497l867k970
$$ 349534 352282 355025 357505 359185 360813 363319 365756 366380 365164 363290 360879 357382 353515 350545
57871C50545k362k799k683j048N31P48P50J761K885L099L147L797M320M239M541
$$ 350545 348183 345384 342701 341653 342184 342932 343682 345443 348328 351427 354574 358371 362691 366930 371471
57856C71471N683O463O181N743N537M578K915K297L062L029R89j276k156k707
$$ 371471 377154 383617 389798 395541 401078 405656 408571 410868 413930 416959 417948 416672 414516 411809
57842D11809m221n731o090o224p171p878p087n698n237n487n365m802m085k840
$$ 411809 407588 401857 395767 389543 382372 374494 367407 361709 356472 350985 345620 340818 336733 333893
57828C33893j031L07O15N81N45j61j328j363J42J388J101L14J43o3r43j582j271
$$ 333893 332862 333169 333784 334365 334910 334749 333421 332058 332200 333588 334689 335003 335146 335083 334140 332558 331287
57811C31287j031j852l150m228n508p103p980p756p387p090n680l153j581j944
$$ 331287 330256 328404 325254 321026 315518 308415 300435 292679 285292 278202 272522 269369 267788 265844
57797B65844k386j234M72J210J497K352L177L202L212L953M496M037L661M497
$$ 265844 263458 262224 262696 263906 265403 267755 270932 274134 277346 281299 285795 289832 293493 297990
57783B97990N649N809N471N834O824P736Q517Q963Q190O272M825M630M321K825
$$ 297990 303639 309448 314919 320753 327577 335313 343830 352793 360983 367255 372080 376710 381031 383856
57769C83856J243P36M21r61k966m728o588q745r987r443q127p172o217n004m674
$$ 383856 385099 385835 386256 385295 382329 377601 371013 362268 352281 342838 334711 327539 321322 316318 311644
57754C11644n651o140m679k457j165l49J078K416K502J935J886K024J626J345
$$ 311644 305993 299853 295174 292717 291552 291203 292281 294697 297199 299134 301020 303044 304670 306015
57740C06015J853K224J606J055J663K420K071J517K085K874K365J287J309K016
$$ 306015 307868 310092 311698 312753 314416 316836 318907 320424 322509 325383 327748 329035 330344 332360
57726C32360J796P75K99K59n41j897k502k249k145k366k400k541l239l623k716
$$ 332360 334156 334931 335230 335489 334948 333051 330549 328300 326155 323789 321389 318848 315609 311986 309270
57711C09270j482j604k794l392l090k955l151k839k106j906k225k069j264n76
$$ 309270 307788 306184 303390 299998 296908 293953 290802 287963 285857 283951 281726 279657 278393 277817
57697B77817k12K44N93K20o46j195j331j533j841k108k664l484l498j986N5J264
$$ 277817 277605 277849 278442 278662 278016 276821 275490 273957 272116 270008 267344 263860 260362 258376 258431 259695
57681B59695J811K653L864N157P060R976J2984J5199J7443K0973K5476L0014L4955
$$ 259695 261506 264159 268023 273180 280240 290216 303200 318399 335842 356815 382291 412305 447260
57668D47260M1132M7818N3309N6486N6064M9536L5279J5257o350k6514m3593n5474
$$ 447260 488392 536210 589519 646005 702069 751605 786884 802141 795791 769277 725684 670210
57656F70210o0332n9026n4426m8346m1021l3185k6419k1381j7491j4391j2045
$$ 670210 609878 550852 496426 448080 407059 373874 347455 326074 308583 294192 282147
57645B82147r790p033m615l736l898l616k735k167j871j118l79p87j879j960p03
$$ 282147 272357 265324 260709 256973 253075 249459 246724 244557 242686 241568 241189 240402 238523 236563 235860
57630B35860N66J076J249J223O19j64k93k1l01j029j375j517k212k918k451j270
$$ 235860 236426 237502 238751 239974 240593 240429 240136 240115 239814 238785 237410 235893 233681 230763 228312 227042
57614B27042j010j792k137j593j276j627j741j266j013j288j425j282j453j793
$$ 227042 226032 224240 222103 220510 219234 217607 215866 214600 213587 212299 210874 209592 208139 206346
57600B06346j453o17l57o51l77M97O67k45j138j494k058k982l212k376j535j386
$$ 206346 204893 204276 203919 203268 202891 203388 204055 203810 202672 201178 199120 196138 192926 190550 189015 187629
57584A87629j371j103j144j685k044j991k079k250j696o33m79j585k488k172j503
$$ 187629 186258 185155 184011 182326 180282 178291 176212 173962 172266 171633 171154 169569 167081 164909 163406
57569A63406j524j783j439p56m93p16j064j387j505j105l56J73M11Q03J319J452
$$ 163406 161882 160099 158660 157904 157411 156695 155631 154244 152739 151634 151278 151451 151862 152665 153984 155436
57553A55436J291J474K023K434K848L762M577M058K373J084Q00N30j82l59M96
$$ 155436 156727 158201 160224 162658 165506 169268 173845 177903 180276 181360 182160 182690 182508 182149 182645
57538A82645J254Q87l6n05n12n34n60m88n34o59m37N0J45k22l23Q7M17N11J026
$$ 182645 183899 184786 184750 184245 183733 183199 182639 182151 181617 180958 180521 180571 180716 180494 180171 180258 180675 181186 182212
57519A82212K068K694K384J826J678J618J226Q13Q07J145J749K656L445L433K729
$$ 182212 184280 186974 189358 191184 192862 194480 195706 196519 197326 198471 200220 202876 206321 209754 212483
57504B12483K115J756J139L24j4L1m30j485k189k185k096k059j420l60p0p70j206
$$ 212483 214598 216354 217493 217817 217803 217834 217404 215919 213730 211545 209449 207390 205970 205610 205540 204770 203564
57487B03564p73m67r54j280o05L14M52P1o9P0L48J030J859J749M18p93q06l95
$$ 203564 202791 202324 201370 200090 199485 199799 200251 200322 200253 200323 200671 201701 203560 205309 205727 204934 204128 203733
57469B03733q10j833k385k206j761j227o14k93l93k63O19J734K348K559K771K775
$$ 203733 202923 201090 198705 196499 194738 193511 192897 192604 192211 191948 192567 194301 196649 199208 201979 204754
57453B04754K196J351Q26O79O93R73J637K285K334J647O07j47j4R80J920K023
$$ 204754 206950 208301 209127 209806 210499 211472 213109 215394 217728 219375 219982 219835 219821 220801 222721 224744
57437B24744J745K054K771K840K089J492J539J760J957K457K949K622J716J409
$$ 224744 226489 228543 231314 234154 236243 237735 239274 241034 242991 245448 248397 251019 252735 254144
57423B54144J810J769J098J028J859K129J094J62O13J633J952J844K124K548K661
$$ 254144 255954 257723 258821 259849 261708 263837 264931 265093 265706 267339 269291 271135 273259 275807 278468
57408B78468K933L717M203L801L294L391L346K513J945K755M051M280L728L782
$$ 278468 281401 285118 289321 293122 296416 299807 303153 305666 307611 310366 314417 318697 322425 326207
57394C26207M500M769M434M442N077N595N628N601N836O230O704P108O989O299
$$ 326207 330707 335476 339910 344352 349429 355024 360652 366253 372089 378319 385023 392131 399120 405419
57380D05419N821O070O321N685M472L541K934K284J927K350L006K886J922R12
$$ 405419 411240 417310 423631 429316 433788 437329 440263 442547 444474 446824 449830 452716 454638 455550
57366D55550L45K68P90J862K964L733M489N343N668N256N139O180P663Q398Q513
$$ 455550 455895 456163 456953 458815 461779 465512 470001 475344 481012 486268 491407 497587 505250 513648 522161
57351E22161Q921R701J0283J0614J0897J0746R876R037R030R334R038Q513Q749
$$ 522161 531082 540783 551066 561680 572577 583323 593199 602236 611266 620600 629638 638151 646900
57338F46900R519R723R279R117R501R793R825J0137J0784J1192J1239J1422J1893
$$ 646900 656419 666142 675421 684538 694039 703832 713657 723794 734578 745770 757009 768431 780324
57325G80324J2345J2810J3558J4293J4381J3906J3550J3568J3674J3801J4132
$$ 780324 792669 805479 819037 833330 847711 861617 875167 888735 902409 916210 930342
57314I30342J4553J4878J5350J6142J6750J6702J6500J6931J7813J8430J8780
$$ 930342 944895 959773 975123 991265 1008015 1024717 1041217 1058148 1075961 1094391 1113171
57303A113171J9356K0088K0574K0974K1594K2013K1773K1508K2172K3478K4389
$$ 1113171 1132527 1152615 1173189 1194163 1215757 1237770 1259543 1281051 1303223 1326701 1351090
57292A351090K4835K5519K6326K6449K6022K6126K7048K7928K8352K8944L0028
$$ 1351090 1375925 1401444 1427770 1454219 1480241 1506367 1533415 1561343 1589695 1618639 1648667
57281A648667L0923L1058L0759L0515L0384L0442L1036L2157L3316L4323L5547
$$ 1648667 1679590 1710648 1741407 1771922 1802306 1832748 1863784 1895941 1929257 1963580 1999127
57270A999127L7158L8683L9587L9870L9989M0568M2001M3946M5476M6121M6452
$$ 1999127 2036285 2074968 2114555 2154425 2194414 2234982 2276983 2320929 2366405 2412526 2458978
57259B458978M7083M7652M7554M7137M7233M7940M8750M9535N0398N0986N0925
$$ 2458978 2506061 2553713 2601267 2648404 2695637 2743577 2792327 2841862 2892260 2943246 2994171
57248B994171N0659N0767N0840N0135M9041M8718M9485N0756N2362N4660N7475
$$ 2994171 3044830 3095597 3146437 3196572 3245613 3294331 3343816 3394572 3446934 3501594 3559069
57237C559069O0141O2612O5372O8244P0510P2127P3690P5196P6010P6021P5604
$$ 3559069 3619210 3681822 3747194 3815438 3885948 3958075 4031765 4106961 4182971 4258992 4334596
57226D334596P4337P1138O5999O0432N5880N2623N0372M8817M7323M5231M2873
$$ 4334596 4408933 4480071 4546070 4606502 4662382 4715005 4765377 4814194 4861517 4906748 4949621
57215D949621M1446M1533M2537M3761M5236M7324N0202N3818N7623O0534O2043
$$ 4949621 4991067 5032600 5075137 5118898 5164134 5211458 5261660 5315478 5373101 5433635 5495678
57204E495678O3210O5501O8751P1537P3351P5086P7169P8666P8615P7056P4361
$$ 5495678 5558888 5624389 5693140 5764677 5838028 5913114 5990283 6068949 6147564 6224620 6298981
57193F298981P0758O6985O4208O2660O1232N8988N6249N3793N1838N0358M9524
$$ 6298981 6369739 6436724 6500932 6563592 6624824 6683812 6740061 6793854 6845692 6896050 6945574
57182F945574M9227M8692M7142M4465M1017L7163L3001K8156K1877J3991N477
$$ 6945574 6994801 7043493 7090635 7135100 7176117 7213280 7246281 7274437 7296314 7310305 7315782
57171G315782k574j0138j7600k4387k9522l3297l6948m0795m4002m6206m7801
$$ 7315782 7313208 7303070 7285470 7261083 7231561 7198264 7161316 7120521 7076519 7030313 6982512
57160F982512m8556m7535m4809m1692l8694l4701k8843k1916j5274r489m741j315
$$ 6982512 6933956 6886421 6841612 6799920 6761226 6726525 6697682 6675766 6660492 6651003 6646262 6644947
57148F644947J039L191N194N803M069M72m220j0215j7939k6837l5678m3380m8908
$$ 6644947 6645986 6649177 6654371 6660174 6664243 6664715 6660495 6650280 6632341 6605504 6569826 6526446 6477538
57135F477538n1196m9856m5417l8544l0094k2308j8648k1317k9619m1286n4367
$$ 6477538 6426342 6376486 6331069 6292525 6262431 6240123 6221475 6200158 6170539 6129253 6074886
57124F074886o7011p6786q1789q2144p9393p4916o9817o5650o3843o4344o5485
$$ 6074886 6007875 5931089 5849300 5767156 5687763 5612847 5543030 5477380 5413537 5349193 5283708
57113E283708o5171o1878n5168m6016l6306k7261j8490q781K935J7891L7818O4038
$$ 5283708 5218537 5156659 5101491 5055475 5019169 4991908 4973418 4964637 4967572 4985463 5023281 5087319
57101E087319R6876J37023J87032K50554L30638M29957N51927O99620Q73014J068298
$$ 5087319 5184195 5321218 5508250 5758804 6089442 6519399 7071326 7770946 8643960 9712258
57091I712258J279482J498412J711825J899471K035924K093659K047404J886669
$$ 9712258 10991740 12490152 14201977 16101448 18137372 20231031 22278435 24165104
57083B4165104J637370J372618J186502J135706J195308J272609J268788J132365
$$ 24165104 25802474 27175092 28361594 29497300 30692608 31965217 33234005 34366370
57075C4366370Q64905M93509M9186m34953r20882j370450j752311k044173k233536
$$ 34366370 35231275 35724784 35773970 35339017 34418135 33047685 31295374 29251201 27017665
57066B7017665k320193k316218k240560k113158j952950j777093j598509j424682
$$ 27017665 24697472 22381254 20140694 18027536 16074586 14297493 12698984 11274302
57058A1274302j259977j108043r71058q48707p39850o44341n61966m90947m29105
$$ 11274302 10014325 8906282 7935224 7086517 6346667 5702326 5140360 4649413 4220308
57049D220308l75546l29865k90628k56111k25828j99934j77767j58150j40572
$$ 4220308 3844762 3514897 3224269 2968158 2742330 2542396 2364629 2206479 2065907
57040B065907j24999j11086r8581q7795p8746p0477o2062n3632m5470l7011k7711
$$ 2065907 1940908 1829822 1731241 1643446 1564700 1494223 1432161 1378529 1333059 1296048 1268337
57029A268337j8019q405J874J3887K7498M1512N4199O2475O1747M8637K4042p393
$$ 1268337 1250318 1241913 1243787 1257674 1285172 1326684 1380883 1443358 1505105 1553742 1577784 1570391
57017A570391m0213o9624r1323j02374j02951r6205q5949p4931o4684n5707m7646
$$ 1570391 1530178 1460554 1369231 1266857 1163906 1067701 981752 906821 842137 786430 738784
57006G38784m0125l3564k8570k4889k1747j8998j7060j5847j4630j2942j0942
$$ 738784 698659 665095 636525 611636 589889 570891 553831 537984 523354 510412 499470
56995D99470q948p151n673m388k793n64J989M402O691R084J1470J3441J4502J3926
$$ 499470 490522 483371 477698 473310 470517 469953 471942 476344 483035 492119 503589 517030 531532 545458
56981E45458J1036O100L60n258j0756j5951j9683k0961k0234j8618j6511j3787
$$ 545458 556494 562594 562954 557696 546940 530989 511306 490345 470111 451493 434982 421195
56969D21195j0771q089n845l720j528R72M288Q500J2752J6198J9030K1886K4507
$$ 421195 410424 402335 396490 392770 391242 392214 396502 405002 417754 433952 452982 474868 499375
56956D99375K5582K3597J7633Q013l315j3629k1337k6487k9287k9223k6270k1840
$$ 499375 524957 548554 566187 574200 570885 557256 535919 509432 480145 450922 424652 402812
56944D02812j7481j3415r236n152j598J594M696P458R950J3162J7735K2798K6980
$$ 402812 385331 371916 362680 357528 355930 357524 362220 369678 379628 392790 410525 433323 460303
56931D60303K9710L0571K8339K2081J2548J363j0376k1562l0189l4661l5550l4590
$$ 460303 490013 520584 548923 571004 583552 584915 574539 552977 522788 488127 452577 417987
56919D17987l2524k9193k5179k1663j8881j6144j3253j0635q408o456n168m855
$$ 417987 385463 356270 331091 309428 290547 274403 261150 250515 242107 235651 230483 225628
56907B25628m736l798k320j402j241j066n24R2O95J369J852K116K953M862O950
$$ 225628 220892 217094 214774 213372 212131 211065 210541 210633 211328 212697 214549 216665 219618 224480 231430
56892B31430Q233R348J1482J4184J6046J7020J8208J9464J9137J6321J1746O248
$$ 231430 239663 249011 260493 274677 290723 307743 325951 345415 364552 380873 392619 398867
56880C98867N3o199j1195j4093j4948j3843j0921p170l866j147J759M935P753
$$ 398867 398920 392721 381526 367433 352485 338642 327721 320551 316685 315538 317297 322232 329985
56867C29985J0377J3792J8265K3064K7800L2674L7354M0811M2342M1456L6929
$$ 329985 340362 354154 372419 395483 423283 455957 493311 534122 576464 617920 654849
56856F54849K7548J4052r70j5073k6676l4221l6537l4327k9741k4150j7699j0898
$$ 654849 682397 696449 695479 680406 653730 619509 582972 548645 518904 494754 477055 466157
56844D66157m792O87O717J3566K0238K6576L3893M2903N2613O1809O9823P4988
$$ 466157 461365 462052 468769 482335 502573 529149 563042 605945 658558 720367 790190 865178
56832H65178P4079O4618M6866K3066l951l0624n2795o7483p4127p3753o7885n8640
$$ 865178 939257 1003875 1050741 1073807 1069856 1039232 986437 918954 844827 771074 703189 644549
56820F44549m8428l8585k9042j9818j1610m534K407R809J7108K4028L1481L9940
$$ 644549 596121 557536 528494 508676 497066 492532 494939 504748 521856 545884 577365 617305
56808F17305M7912N2950N3325M7993L6103J7936m070k6080m4504n6891o2341o1844
$$ 617305 665217 718167 771492 819485 855588 873524 869454 843374 798870 741979 679638 617794
56796F17794n7567n1177m3233l4334k5752j8462j2381p079k440J753N996J0394
$$ 617794 560227 509050 465817 431483 405731 387269 374888 367809 365369 367122 373118 383512
56784C83512J4612J8765K3273K7467K9374K7454K1700J2818J521j0797k1860k9873
$$ 383512 398124 416889 440162 467629 497003 524457 546157 558975 560496 549699 527839 497966
56772D97966l4464l5986l4849l1871k8213k4464k0566j6896j4322j2928j1782
$$ 497966 463502 427516 392667 360796 332583 308119 287553 270657 256335 243407 231625
56761B31625j0310q751p112n065l156k571l214l574l036k683l162l511l013k538
$$ 231625 221315 212564 205452 200387 197231 194660 191446 187872 184836 182153 178991 175480 172467 169929
56747A69929k870l188k511j343o78n03m21o66j296j476p71q6k74p45o35k33j43
$$ 169929 167059 163871 161360 160017 159339 158836 158415 157749 156453 154977 154206 154120 153846 153101 152466 152233 152090
56730A52090J9P98J673J874J589J333R10J42k98J95J168J947K573L023K642J383
$$ 152090 152109 152907 154580 156454 158043 159376 160286 160428 160130 160325 161493 163440 166013 169036 171678 173061
56714A73061M94P81J259P40l52j011j313j614j206M93K259K332Q43n15p68k59
$$ 173061 173555 174336 175595 176335 175983 174972 173659 172045 170839 171332 173591 175923 176766 176251 175483 175224
56698A75224M80J080J027K88k23P6L89r8p31n47m8k66q66q81o44j123j810j278
$$ 175224 175704 176784 177811 178099 177876 177952 178341 178243 177512 176965 176917 176651 175785 174904 174260 173137 171327 170049
56680A70049L48J357R80K54J91N61Q12R08Q61N30J57K58P99J254J435J538J524
$$ 170049 170397 171754 172734 172988 173179 173740 174552 175460 176321 176851 177008 177266 178065 179319 180754 182292 183816
56663A83816J217P84M43K3m65l76N61J450J470J293J937K847K604J279M83J055
$$ 183816 185033 185817 186260 186283 185818 185442 186003 187453 188923 190216 192153 195000 197604 198883 199366 200421
56647B00421K049K287J688P88n1o54r71j195j451j465j116q93j173j407r06p5
$$ 200421 202470 204757 206445 207233 207182 206528 205557 204362 202911 201446 200330 199437 198264 196857 195951 195876
56631A95876K3q15j756k078j745j097o37q54j614k064j782j450j730k105j696
$$ 195876 195899 195084 193328 191250 189505 188408 187771 186917 185303 183239 181457 180007 178277 176172 174476
56616A74476o60J41M04M06K83P4J6P7k30q54q72Q2J003J024P42R11R89K67n33
$$ 174476 173816 173957 174361 174767 175050 175124 175140 175217 174987 174133 173261 173343 174346 175370 176112 177023 178012 178279 177746
56597A77746l64K49M8q03j053l72N10J215J880K226J870J241R92R48P00N16O07
$$ 177746 177382 177631 177679 176876 175823 175451 175961 177176 179056 181282 183152 184393 185385 186333 187033 187549 188156
56580A88156L56m07n07P02J753J173O9M25J882K537K249K470L277L270K386K210
$$ 188156 188512 188105 187598 188300 190053 191226 191295 191720 193602 196139 198388 200858 204135 207405 209791 212001
56564B12001L236M253M791N884P934R852J0864J1285J1081R567O888M075J351
$$ 212001 215237 219490 224281 230165 238099 247951 258815 270100 281181 290748 297636 301711 303062
56551C03062j790m660n626m612l396k949k547j927k126l441m576m656m270l797
$$ 303062 301272 296612 290986 286374 282978 280029 277482 275555 273429 269988 265412 260756 256486 252689
56537B52689k685j166p04j663k432j941j287j650k328k202j633j481j492j123
$$ 252689 250004 248838 248134 246471 244039 242098 240811 239161 236833 234631 232998 231517 230025 228902
56523B28902q27j192j702j588j116r06q30o09p46j724k830k872j751n11m1l40
$$ 228902 228075 226883 225181 223593 222477 221571 220741 220132 219386 217662 214832 211960 210209 209698 209657 209317
56507B09317p41o25l8K60k34r80j136p95o56p82p49o47p62n58N61J785J755P30
$$ 209317 208576 207951 207913 208173 207939 206959 205823 205028 204372 203590 202841 202194 201432 200874 201435 203220 204975 205705
56489B05705K18N33N83J19J63Q57R88K35j19N40J030M91k15j67J24M7J46R07J575
$$ 205705 205923 206456 207039 207158 207321 208178 209166 209401 209282 209822 210852 211343 211128 210961 211085 211132 211278 212185 213760
56470B13760J341O42L02L99P19J308J849J629P21Q7K3k13p42o30K56N75l45j307
$$ 213760 215101 215743 216045 216444 217163 218471 220320 221949 222670 222757 222780 222567 221825 221195 221451 222026 221681 220374
56452B20374j142m26j73j57K83Q87J110J127J275J288R15M15r6q36j454j166k28
$$ 220374 219232 218806 218633 218476 218759 219646 220756 221883 223158 224446 225361 225776 225680 224844 223390 222224 221996
56435B21996O8o13j069o13n4K2L54J356K015J492M91mj03j56J39Q43J246J155
$$ 221996 222064 221451 220382 219769 219715 219737 220091 221447 223462 224954 225445 225441 225338 225182 225321 226164 227410 228565
56417B28565J384K169K523J940J288J106O42m37j087o80j27j40n2M88M56n92j296
$$ 228565 229949 232118 234641 236581 237869 238975 239617 239180 238093 237413 237286 237146 237094 237582 238038 237446 236150
56400B36150p06J02J03K72J640L030K812J616J168J594J723J261P82L85p1r0N93
$$ 236150 235444 235546 235649 235921 237561 240591 243403 245019 246187 247781 249504 250765 251547 251932 251861 251771 252364
56383B52364J102P60K92M84P20L66K79J289K360K064Q70K05J25k55q38q50m04
$$ 252364 253466 254226 254518 255002 255722 256088 256367 257656 260016 262080 262950 263155 263280 263025 262187 261337 260933
56366B60933j30J06O29Q98M36L7M97J075P59J47L87J107J190Q04R22J425J442
$$ 260933 260803 260909 261538 262436 262872 262909 263406 264481 265240 265387 265774 266881 268071 268875 269797 271222 272664
56349B72664J022Q13N96j52p96k44J189K171K224J906J578J274J386K202L160
$$ 272664 273686 274499 275095 274943 274147 273903 275092 277263 279487 281393 282971 284245 285631 287833 290993
56334B90993L523L295K694J649O78J007K676L836L281K252K315K917K861K669
$$ 290993 294516 297811 300505 302154 302832 303839 306515 310351 313632 315884 318199 321116 323977 326646
56320C26646L345L978L000R92m7K98O69L47k01p25j266j186R8J723K379K297K619
$$ 326646 329991 333969 336969 337961 337914 338212 338881 339228 339027 338302 337036 335850 335948 337671 340050 342347 344966
56303C44966L357L692L788M508N670O236N952N316M328K770J327R75J574K277
$$ 344966 348323 352015 355803 360311 365981 372217 378169 383485 387813 390583 391910 392885 394459 396736
56289C96736K799L190L088K484K418L583N086N830O136O691P118O969O913P469
$$ 396736 399535 402725 405813 408297 410715 414298 419384 425214 431350 438041 445159 452128 459041 466510
56275D66510P815P427P465Q833J0383J0850J1017J1899J2614J2313J2518J4822
$$ 466510 474325 481752 489217 498050 508433 519283 530300 542199 554813 567126 579644 594466
56263E94466J7811J9163J9537K1337K4600K7352K9288L2014L6003M0320M4999
$$ 594466 612277 631440 650977 672314 696914 724266 753554 785568 821571 861891 906890
56252I06890N0898N7391O2959O7858P3676Q0346Q6219R0786R4886R8404J00221
$$ 906890 957788 1015179 1078138 1145996 1219672 1300018 1386237 1477023 1571909 1670313 1770534
56241A770534J00254R9190R6466R0765Q2194P1794N9461M4738K8890J3655j444
$$ 1770534 1870788 1969978 2066444 2157209 2239403 2311197 2370658 2415396 2444286 2457941 2456497
56230B456497j7771l4232m8122n8896o8163p6326q2182q5733q8363r0214r0091
$$ 2456497 2438726 2404494 2356372 2297476 2229313 2152987 2070805 1985072 1896709 1806495 1716404
56219A716404q8052q5407q2309p7852p2457o7561o3181n8345n3482m9746m6472
$$ 1716404 1628352 1542945 1460636 1382784 1310327 1242766 1179585 1121240 1067758 1018012 971540
56208I71540m2208l7625l4440l1986k8266k3870k1335k0755j9630j7181j5251
$$ 971540 929332 891707 857267 825281 797015 773145 751810 731055 711425 694244 678993
56197F78993j4584j3693j1909j0357r426q201o722n874n084l111r81q19j986j907
$$ 678993 664409 650716 638807 628450 619024 610823 604101 598227 593143 590032 589051 588232 586246 584339
56183E84339o27n57j695j300J114K697K068J210J512J747J264J444K657L153K361
$$ 584339 583712 583155 581460 580160 581274 583971 586039 587249 588761 590508 591772 593216 595873 599026 601387
56168F01387K119L391M877N874P323R069R394Q291P938Q973R657R616J0836J3745
$$ 601387 603506 606897 611774 617648 624971 634040 643434 651725 659663 668636 678293 687909 698745 712490
56154G12490J6020J6550J7214J9361K1920K4284K7678L2372L6876M1154M7252
$$ 712490 728510 745060 762274 781635 803555 827839 855517 887889 924765 965919 1013171
56143A013171N5473O3483P0544P9006R0027J01294J10612J18294J24344J26646
$$ 1013171 1068644 1132127 1202671 1281677 1371704 1472998 1583610 1701904 1826248 1952894
56133A952894J23829J16955J06959R3614P8406O5061N5564M8569M2756L8218L3534
$$ 1952894 2076723 2193678 2300637 2394251 2472657 2537718 2593282 2641851 2684607 2722825 2756359
56122B756359K5429J3170j62j2148k3351l4012m2534m9022n6550o7103p9562r2855
$$ 2756359 2781788 2794958 2794796 2782648 2759297 2725285 2682751 2633729 2577179 2510076 2430514 2337659
56110B337659j07080j20110j27389j27135j22017j14233j03103q9090p5572o4449
$$ 2337659 2230579 2110469 1983080 1855945 1733928 1619695 1516592 1427502 1351930 1287481
56100A287481n4093m3665l5153k9178k3282j6557j1601r574p744m314j263j4J242
$$ 1287481 1233388 1189723 1154570 1125392 1102110 1085553 1073952 1064378 1056634 1052320 1051057 1051043 1052285
56087A052285L428M397L415L268N323P006O781O883Q488R074P589P247R986J2857
$$ 1052285 1055713 1060110 1063525 1066793 1072116 1079122 1085903 1092786 1101274 1110348 1117937 1125184 1135170 1148027
56073A148027J3166J2633J3244J3734J3300J4045J6531J7749J6594J6354J8630
$$ 1148027 1161193 1173826 1187070 1200804 1214104 1228149 1244680 1262429 1279023 1295377 1314007
56062A314007K0116J8769J7622J8842J9607J7843J6420J7519J8421J7111J6513
$$ 1314007 1334123 1352892 1370514 1389356 1408963 1426806 1443226 1460745 1479166 1496277 1512790
56051A512790J8668K0400J9313J8538K0784K3311K3663K4639K8519L2050L2421
$$ 1512790 1531458 1551858 1571171 1589709 1610493 1633804 1657467 1682106 1710625 1742675 1775096
56040A775096L2609L5584L8761L9467M0179M3042M5030M3953M3335M5849M8134
$$ 1775096 1807705 1843289 1882050 1921517 1961696 2004738 2049768 2093721 2137056 2182905 2231039
56029B231039M7660M8208N2547N6411N6044N4963N6826N8538N7251N7046O1347
$$ 2231039 2278699 2326907 2379454 2435865 2491909 2546872 2603698 2662236 2719487 2776533 2837880
56018B837880O5882O6666O7807P3528P9762Q1936Q3710Q9454R5448R7401R9372
$$ 2837880 2903762 2970428 3038235 3111763 3191525 3273461 3357171 3446625 3542073 3639474 3738846
56007C738846J05995J13216J16139J18680J25776J33755J38190J43377J53749
$$ 3738846 3844841 3958057 4074196 4192876 4318652 4452407 4590597 4733974 4887723
55998D887723J64183J69587J75566J88295K02649K12214K22011K38633K57014
$$ 4887723 5051906 5221493 5397059 5585354 5788003 6000217 6222228 6460861 6717875
55989F717875K70345K83872L04936L28722L48359L69473L99484M32500M60878
$$ 6717875 6988220 7272092 7577028 7905750 8254109 8623582 9023066 9455566 9916444
55980I916444M91476N33617N81664O27276O77800P43613Q18916Q95229R81722
$$ 9916444 10407920 10941537 11523201 12150477 12828277 13571890 14390806 15286035 16267757
55971A6267757J090952J217532J354084J514458J716364J956296K229438K558914
$$ 16267757 17358709 18576241 19930325 21444783 23161147 25117443 27346881 29905795
55963B9905795K975497L485075M088335M812151N682412O685963P804238R067380
$$ 29905795 32881292 36366367 40454702 45266853 50949265 57635228 65439466 74506846
55955G4506846J0533675J2247099J4271907J6727333J9697722K3124753K6855393
$$ 74506846 85040521 97287620 111559527 128286860 147984582 171109335 197964728
55948A97964728L0691741L4147300L6098784L4957664K9522157J9801692P076052
$$ 197964728 228656469 262803769 298902553 333860217 363382374 383184066 390260118
55941C90260118o689166j9438202k9402736l5473976l7539389l6414976l3307061
$$ 390260118 383570952 364132750 334730014 299256038 261716649 225301673 191994612
55934A91994612k9261834k4989789k0947354j7391342j4387599j1889782r842911
$$ 191994612 162732778 137742989 116795635 99404293 85016694 73126912 63284001
55927F3284001q197772o876119n791016m894410m165887l570811l067450k640370
$$ 63284001 55086229 48210110 42419094 37524684 33358797 29787986 26720536 24080166
55919B4080166k290170k000663j747013j525131j343222j193397j058481r37823
$$ 24080166 21789996 19789333 18042320 16517189 15173967 13980570 12922089 11984266
55911A1984266q40671p61704o87049o17403n62514n19074m75364m32114l98431
$$ 11984266 11143595 10381891 9694842 9077439 8514925 7995851 7520487 7088373 6689942
55902F689942l72186l43530l13299k89749k71324k49863k27030k11034k00516
$$ 6689942 6317756 5974226 5660927 5371178 5099854 4849991 4622961 4411927 4211411
55893D211411j87337j72003j61454j54679j44881j32982j25137j19738j10208
$$ 4211411 4024074 3852071 3690617 3535938 3391057 3258075 3132938 3013200 2902992
55884B902992r8137r0665q7208q1173p2566o7078o4786o1416n8491o0880o6252
$$ 2902992 2804855 2714190 2626982 2545809 2473243 2406165 2341379 2279963 2221472 2160592 2094340
55873B094340o7939o6333o6819o8650o6652o1963o0256o0799n7826n1506m7377
$$ 2094340 2026401 1960068 1893249 1824599 1757947 1695984 1635728 1574929 1517103 1465597 1418220
55862A418220m5914m2634l7650l5422l5641l3664k9478k7256k6671k3488j8299
$$ 1418220 1372306 1329672 1292022 1256600 1220959 1187295 1157817 1130561 1103890 1080402 1062103
55851A062103j5910j6531j5932j3968j4575j7601j8877j8201j9243k1701k1473
$$ 1062103 1046193 1029662 1013730 999762 985187 967586 948709 930508 911265 889564 868091
55840H68091j8646j7514j8538j7892j5218j4295j5600j5451j3089j1667j1726
$$ 868091 849445 831931 813393 795501 780283 765988 750388 734937 721848 710181 698455
55829F98455j0421p735o852p900p781o532p378j0124j0920r220q608j0082j0689
$$ 698455 688034 680299 673447 665547 657766 651234 643856 633732 622812 613592 604984 594902 584213
55816E84213r521q997r429q264n525m216m593l669j094J78j73R59M115O152O157
$$ 584213 574692 565695 556266 548002 542477 538261 533668 529999 528905 529083 528910 529869 533984 540136 546293
55801E46293O858Q962R543P556N737N493M667J958r89l273o177r698j1731j1829
$$ 546293 553151 562113 571656 579212 584949 590442 595109 597067 596078 592805 586628 576930 565199 553370
55787E53370j1797j1835j0232p475o402p560q598q844j0083j2193j2621j1038
$$ 553370 541573 529738 519506 512031 505629 498069 489471 480627 470544 458351 445730 434692
55775D34692j0123j0730j0585q733o983o033m341j889q33j419j345j76k59k198
$$ 434692 424569 413839 403254 394521 387538 381505 377164 375275 374442 373023 371678 371502 371243 369045
55761C69045l536l137k839l583l873l301l665n267n937n029m655n767o604o317
$$ 369045 365509 362372 359533 355950 352077 348776 345111 339844 333907 328878 324223 318456 311852 305535
55747C05535o371p120o680m595l144l542m237m173m377n113m863l333k275k155
$$ 305535 299164 292044 285364 280769 277625 274083 269846 265673 261296 256183 251320 247987 245712 243557
55733B43557j368K63O70o59j584j119r09j726k047j379j457k803l519k878k647
$$ 243557 242189 242452 243122 242463 240879 239760 238851 237125 235078 233699 232242 229439 225920 223042 220395
55718B20395l461l428j819o10p96o18Q15J644Q11J02P58J344Q81Q81K117K606
$$ 220395 216934 213506 211687 211077 210281 209663 210478 212122 212933 213035 213793 215137 216018 216899 219016 221622
55702B21622J053o64p51m45j396k726k990k752k934k804j732q35r71j069k21N96
$$ 221622 222675 222011 221260 220815 219419 216693 213703 210951 208017 205213 203481 202646 201675 200606 200385 200981
55686B00981M96K82N40L94l29rK056M125M737M691M702L686J169r86j312j027
$$ 200981 201477 201759 202299 202693 202364 202355 204411 208536 213273 217964 222666 226352 227521 226535 225223 224196
55670B24196j698k689k861k744l028k814j388K2J77r2M84J507K054K368K870K995
$$ 224196 222498 219809 216948 214204 211176 208362 206974 206996 207173 207081 207565 209072 211126 213494 216364 219359
55654B19359K434J994K049J800J096J085J882J818J74j419j782k082l429m790
$$ 219359 221793 223787 225836 227636 228732 229817 231699 233517 233691 232272 230490 228408 224979 220189
55640B20189m993m765n000n030m244l579l643l356k024r26j107j570j295j079
$$ 220189 215196 210431 205431 200401 196157 192578 188935 185579 183555 182629 181522 179952 178657 177578
55626A77578j644j944j149l38m23l69O30J247L35q49q09m07j021j914j703r19
$$ 177578 175934 173990 172841 172503 172080 171711 172341 173588 173923 173074 172265 171858 170837 168923 167220 166301
55610A66301q22j105r21q70j771k719k523j801j699j744j067m61j066k105k022
$$ 166301 165479 164374 163453 162583 160812 158093 155570 153769 152070 150326 149259 148798 147732 145627 143605
55595A43605r78k39l4J58R0o42j358j266q29p10m71K44N70L6n5J343L003L267
$$ 143605 142627 142388 142354 142512 142602 141960 140602 139336 138507 137797 137326 137570 138140 138176 138121 139464 142467 145734
55577A45734K630K559K940K813K504K996M023M704N280O346P212O848N673M698
$$ 145734 148364 150923 153863 156676 159180 162176 166199 170903 176183 182529 189741 196589 202262 206960
55563B06960L728K105L22q25j844l570n423o280o288o193n810m746l792l845m296
$$ 206960 210688 212793 213115 212290 210446 206876 201453 195173 188885 182692 176882 172136 168344 164499 160203
55548A60203m033l212k525j741n47K44jl34J87P28K09n47l18J59m87j524j167
$$ 160203 156170 152958 150433 148692 148145 148389 148388 148054 148241 148969 149178 148631 148313 148472 147985 146461 145294
55531A45294L01Q84j5j023j202j006r21q88j053j653k209k121j658j353j058p28
$$ 145294 145595 146479 146464 145441 144239 143233 142312 141424 140371 138718 136509 134388 132730 131377 130319 129591
55515A29591j130k403l024j868k23k6j015j547j277j057q89j79N79M01l95p39
$$ 129591 128461 126058 123034 121166 120943 120917 119902 118355 117078 116021 115132 114953 115532 115933 115538 114799
55499A14799o85q91r09N3J201J122K22J24R36J235N86M1J65M15N31Q13J066Q02
$$ 114799 114114 113223 112314 112367 113568 114690 114912 115036 115972 117207 117793 117834 117999 118414 118945 119758 120824 121626
55481A21626L77M23M71k73j166r15K19P64L72L2J29N6k96l87l21o74j142r25l19
$$ 121626 122003 122426 122897 122624 121458 120543 120762 121526 121898 121930 122059 122115 121819 121432 121111 120437 119295 118370 118051
55462A18051l90j155j603j455j281j118m70M02P30O30P83J002O18OJ08P07P83
$$ 118051 117661 116506 114903 113448 112167 111049 110579 110981 111711 112341 113124 114126 114744 114750 114858 115565 116348
55445A16348L55K70M39Mq62j063m67NQl8k05q82j522j207k91J79K95Q58J435R58
$$ 116348 116703 116973 117412 117416 116554 115491 115024 115029 115037 114999 114794 113912 112390 111183 110892 111071 111366 112224 113659 114617
55425A14617k0J50J405J912J055K80M97Q28N48L56Q03J127N56m90j276j681j738
$$ 114617 114597 114747 116152 118064 119119 119399 119896 120724 121272 121628 122431 123558 124114 123624 122348 120667 118929
55408A18929j353q81r16j249j031j63N48O34L07l33j200j472l96J233J807J083
$$ 118929 117576 116695 115779 114530 113499 113336 113884 114518 114825 114492 113292 111820 111424 112657 114464 115547
55392A15547K49p8l71p39o04j2K49L7k5J69J03j67j50j22o89j319r27K08P81N53
$$ 115547 115796 115718 115347 114608 114004 113992 114241 114278 114253 114422 114525 114358 114208 114086 113397 112078 111151 111359 112140 112693
55372A12693L93L82j19o90j86J032J336M48k48k44n15j260j339n52j84n68l83
$$ 112693 113086 113468 113349 112659 112473 113505 114841 115289 115041 114797 114282 113022 111683 111131 110947 110379 109996
55355A09996P59J278K97p41m57L77M92J96L06M48p3q38j075q97p77o45l91l33
$$ 109996 110755 112033 112330 111589 111132 111509 112001 112197 112503 112951 112878 112040 110965 110068 109291 108646 108255 107922
55337A07922m53j41O95J257J120P63M12l63j452j917j487r65o87m6R60J313P38
$$ 107922 107469 107328 108023 109280 110400 111163 111575 111212 109760 107843 106356 105391 104704 104658 105618 106931 107669
55320A07669L32P26J154J077J042J232Q92N8qR43J291J58j031q95k41l07o04j55
$$ 107669 108001 108727 109881 110958 112000 113232 114124 114182 114174 115117 116408 116566 115535 114640 114399 114092 113488 113333
55302A13333M86L46j57j83j62p46j154l93P55Q37P6j95J41Q6m59n69m7L04K02
$$ 113333 113819 114165 114008 113825 113663 112917 111763 111370 112125 112962 113038 112843 112984 113070 112611 112042 111995 112299 112501
55283A12501L13R80J623J598Q53k31j098j254p53j92J40O16J338J661J156L49
$$ 112501 112814 113794 115417 117015 117868 117637 116539 115285 114532 114340 114480 115096 116434 118095 119251 119600
55267A19600j26l67n84n26j79j49n71n95J63P25K52n35n40nK00J01J97J65n78
$$ 119600 119474 119107 118523 117997 117818 117669 117098 116503 116666 117391 117643 117108 116568 116563 116763 116864 117061 117226 116648
55248A16648j524j593o49N23J345J563P90q09j988j728p63n24j027j070k85M25
$$ 116648 115124 113531 112882 113405 114750 116313 117103 116294 114306 112578 111815 111291 110264 109194 108909 109334
55232A09334M92M23P07J087J214J206J223J060M76m78j468j999j654o04M16Q86
$$ 109334 109826 110249 110956 112043 113257 114463 115686 116746 117222 116744 115276 113277 111623 111019 111435 112321
55216A12321R99J005O61j83q98o90L78J436J727J088j12j153j427j009m52J32
$$ 112321 113320 114325 114986 114803 113905 113215 113593 115029 116756 117844 117732 116579 115152 114143 113691 113823
55200A13823J072K130K349J381J30m68n21n26m85l10l08n80n97p9M19M12K51L33
$$ 113823 114895 117025 119374 120755 120885 120417 119896 119370 118885 118575 118267 117687 117090 117011 117430 117842 118093 118426
55182A18426L81J69J62O44J021P76L39J72j67j083j880j654o46L01R63J497J641
$$ 118426 118807 118976 119138 119782 120803 121579 121918 122090 121923 120840 118960 117306 116660 116961 117924 119421 121062
55165A21062J150M85J28j55n98o51L6P19O35K09J23l4q58j629j179K27J280J494
$$ 121062 122212 122697 122825 122670 122072 121421 121457 122176 122811 123020 123143 123109 122251 120622 119443 119670 120950 122444
55147A22444J378J064K46p53j170j028r37r47o26k10l07o88n31J40M90K97J62
$$ 122444 123822 124886 125132 124379 123209 122181 121244 120297 119671 119461 119154 118466 117935 118075 118565 118862 119024
55130A19024K84K46O3L28J026J314P46j44p14q44o14j49J13j80n48j45R32J677
$$ 119024 119308 119554 119617 119945 120971 122285 123031 122887 122173 121329 120715 120566 120679 120499 119951 119806 120738 122415
55112A22415J570J124Q46N57K5m13l22K34Q26J091Q97M35J48L06O80Q75P90N03
$$ 122415 123985 125109 125955 126512 126537 126124 125802 126036 126862 127953 128850 129285 129433 129739 130419 131294 132084 132587
55094A32587Q7j66J57Q51J026L18m65n86n19r93j567j285l20L01K85K53M45M30
$$ 132587 132674 132508 132665 133516 134542 134860 134395 133809 133290 132297 130730 129445 129125 129426 129711 129964 130409 130839
55076A30839J00j06o8j39l40l08j18k64p28r01n31l8K22L24L39K23J54L37N18
$$ 130839 130939 130833 130765 130626 130286 129978 129860 129596 128868 127967 127436 127398 127620 127944 128283 128506 128660 128997 129515
55057A29515L26n8k29l80r32j574j574j014p19r07q27OJ135J915K171J888R90
$$ 129515 129841 129783 129554 129174 128242 126668 125094 124080 123361 122454 121627 121633 122768 124683 126854 128742 129732
55040A29732k10r56q62l70j43l58p46r94r55o54j78M86J315J847J369j30j620
$$ 129732 129522 128566 127704 127334 127191 126833 126087 125093 124138 123484 123306 123792 125107 126954 128323 128193 126573
55023A26573k111j647q61p6O02Q46N22R8K4J02J03M18J267J900J560P01L03M13
$$ 126573 124462 122815 121954 121878 122480 123326 123848 123946 123970 124072 124175 124593 125860 127760 129320 130021 130324 130737
55005A30737M44M51Q78J449J504J259J456J949J884J220P80P54M30m67j302j602
$$ 130737 131181 131632 132510 133959 135463 136722 138178 140127 142011 143231 144011 144765 145195 144728 143426 141824
54989A41824j517j107k19P42J041P78P96J250J329O69p3l94o68j251j764j705
$$ 141824 140307 139200 138981 139723 140764 141542 142338 143588 144917 145586 145513 145119 144451 143200 141436 139731
54973A39731j134l73L08N57K23j20K71J120J431R94O77R47J137O23j45l67N8O05
$$ 139731 138597 138224 138532 139089 139312 139192 139463 140583 142014 143008 143685 144632 145769 146392 146247 145880 145938 146543
54955A46543P89M85K7O4P82J360R17j65p10m60k77n91q24n84l10m03o56r36j385
$$ 146543 147332 147817 147844 147908 148690 150050 150967 150802 150092 149632 149355 148764 147940 147356 147046 146643 145987 145051 143666
54936A43666j615p47J177K725K748J753R77Q28R58J226J842K805L830M675N210
$$ 143666 142051 141304 142481 145206 147954 149707 150684 151512 152470 153696 155538 158343 162173 166848 172058
54921A72058N378N293N195N155N078M937M651L853K278K61j608l182m500n203
$$ 172058 177436 182729 187924 193079 198157 203094 207745 211598 213876 214137 212529 209347 204847 199644
54907A99644m993m431m371m728m738m311m109m199l834k677j291j74O63J044N79
$$ 199644 194651 190220 185849 181121 176383 172072 167963 163764 159930 157253 155962 155788 156451 157495 158074
54892A58074m63j176j159p54p4J133K471K993K629K375K722L056L038L332M321
$$ 158074 157611 156435 155276 154522 154448 155581 158052 161045 163674 166049 168771 171827 174865 178197 182518
54877A82518N264N422N028M542L870K970K244J659M42j620l491m240m268m396
$$ 182518 187782 193204 198232 202774 206644 209614 211858 213517 213959 212339 208848 204608 200340 195944
54863A95944m677m848n139n683n829m987l632k576j838j022l31k96p99j198j255
$$ 195944 191267 186419 181280 175597 169768 164781 161149 158573 156735 155713 155382 155086 154287 153089 151834
54848A51834j281j545j976k349k460k254j982j884j720j108k33L59O55R99J110
$$ 151834 150553 149008 147032 144683 142223 139969 137987 136103 134383 133275 133042 133401 134056 135055 136165
54833A36165L92o06m46J079K330K008P60j52n84r12q56q3P48P66K14l7J24J75
$$ 136165 136557 135951 135505 136584 138914 140922 141682 141530 140946 140034 139178 139095 139843 140609 140823 140786 140910 141085
54815A41085J3k4O9k0l21n81o49m36J74R60J415J453J462J353M93r52j654q71
$$ 141085 141098 141074 141143 141123 140802 140221 139572 139136 139310 140270 141685 143138 144600 145953 146446 145494 143840 142969
54797A42969L82Q36P71J216K087K309J439Q5j007j433j052k37J79j15l48J70R49
$$ 142969 143351 144187 144958 146174 148261 150570 152009 152094 151087 149654 148602 148365 148544 148429 148081 148251 149200
54780A49200J152R75J179J776K246K637L378M264M633M435M172M011L815L860
$$ 149200 150352 151327 152506 154282 156528 159165 162543 166807 171440 175875 180047 184058 187873 191733
54766A91733M553N524N973N789N508N136M017J954l59k222l618m796n673n966
$$ 191733 196286 201810 207783 213572 219080 224216 228233 230187 229828 227606 223988 219192 213519 207553
54752B07553n622n008m737n123n694n569m534l305k502j905j117l61n6j15k33
$$ 207553 201931 196923 192186 187063 181369 175800 171266 167961 165459 163554 162437 162076 162020 161905 161672
54737A61672l50l09K99J372J963J489O51M31P92J151J576K451L459L968M159M695
$$ 161672 161322 161013 161312 162684 164647 166136 166787 167218 168010 169161 170737 173188 176647 180615 184774 189469
54721A89469N509N854N462M750L966K962J749M58j157l377n722p185p279o339
$$ 189469 194978 200832 206294 211044 215010 217972 219721 220179 219022 215645 209923 202738 195459 189120
54707A89120n030m024l857m389m681m050k894j885r18L00J162P99m12j165r41
$$ 189120 184090 180066 176209 171820 167139 163089 160195 158310 157392 157692 158854 159653 159241 158076 157135
54692A57135m63m59r12j535k054k025j204j72K16ko1K58M07J31j14N6M85R46J367
$$ 157135 156672 156213 155301 153766 151712 149687 148483 148311 148527 148525 148464 148722 149129 149260 149146 149202 149687 150633 152000
54673A52000J531J150L46m44j069j605j850j531q78m55m28o09r01j112o98N25
$$ 152000 153531 154681 155027 154583 153514 151909 150059 148528 147650 147195 146767 146158 145257 144145 143447 143972
54657A43972J658J681Q40K04O1j49n47o10k42R4L88J024J611J131l93j504j189
$$ 143972 145630 147311 148151 148355 148416 148267 147720 147110 146868 146962 147350 148374 149985 151116 150723 149219 148030
54640A48030p3P60J157J428J329M68p89j534j275k85P47J117N79l10o20j17M32
$$ 148030 147957 148717 149874 151302 152631 153099 152310 150776 149501 149216 149963 151080 151659 151349 150729 150612 151044
54623A51044K57n26j198j289r22n18l47k74M0N82Q26M80M4J53O22P37L60K1N7
$$ 151044 151301 150775 149577 148288 147366 146848 146501 146227 146267 146849 147675 148155 148199 148352 148974 149711 150071 150092 150149
54604A50149K84M87O27N66K33l7R4L09Q2l21j20P13J291J050L63j95m31k13N78
$$ 150149 150433 150920 151547 152113 152346 152309 152403 152712 152794 152473 152353 153066 154357 155407 155770 155575 155144 154931 155509
54585A55509J533J806J150K48k56m88q26j197j293j097q75q16q87q56n03K5K64
$$ 155509 157042 158848 159998 160246 159990 159502 158676 157479 156186 155089 154214 153398 152511 151655 151152 151177 151441
54568A51441M6j40J33N85P60Q35J150J364R24Q5l49j80J85O02J084J124K63q21
$$ 151441 151487 151347 151480 152065 152825 153660 154810 156174 157098 157183 156834 156654 156839 157441 158525 159649 159912 159091
54550A59091r75k96L9k85l50K54O87M22J79O69J452J823J860J894J804J493J319
$$ 159091 158116 157820 157859 157574 157224 157478 158165 158587 158766 159435 160887 162710 164570 166464 168268 169761 171080
54533A71080J387J165M12k86m88o22j043j191m85N46R12M54k73q96j292j193n50
$$ 171080 172467 173632 174044 173758 173270 172648 171605 170414 169929 170475 171387 171841 171568 170672 169380 168187 167637
54516A67637O3O8k69l17p2m8l05l04K26Q30Q82L05l65n62k68J5o5l25m84o94j188
$$ 167637 167700 167768 167499 167182 167110 167062 166757 166453 166679 167509 168391 168696 168331 167769 167501 167516 167451 167126 166642 165948 164760
54495A64760j662j599j045l93L26J203J802J679J355J603J970J315q5n59M20J347
$$ 164760 163098 161499 160454 160061 160387 161590 163392 165071 166426 168029 169999 171314 171229 170670 171090 172437
54479A72437J056M25P05J430J399O91L50O59J016J101J047Q03L24M8L20P31Q26
$$ 172437 173493 173918 174623 176053 177452 178143 178493 179152 180168 181269 182316 183119 183443 183491 183811 184542 185368
54462A85368R46J447J721J064K6k51K19L88j95r77j502j833j872j390p40n55p12
$$ 185368 186314 187761 189482 190546 190572 190321 190540 190928 190733 189756 188254 186421 184549 183159 182419 181864 181152
54445A81152n81k48m17j006j064m11q9o50j099l57R96J474O42n10r31m99K67Q10
$$ 181152 180571 180323 179906 178900 177836 177425 177336 176686 175587 175230 176226 177700 178342 177832 176901 176402 176669 177479
54427A77479Q47N35L80O33Q38L55o90j333q57L69J317J381Q01J33l34n82o17m61
$$ 177479 178326 178861 179241 179874 180712 181067 180377 179044 178187 178556 179873 181254 182055 182188 181854 181272 180655 180194
54409A80194k55j28K7M12R78J448J679J758J775J617J126L16n37r70o55J83Q47
$$ 180194 179939 179811 179838 180250 181228 182676 184355 186113 187888 189505 190631 190947 190410 189440 188785 188968 189815
54392A89815R21P46P92Q66M90k03o28p35j048j610j707r84q2K43R8J6J37K84M76
$$ 189815 190736 191482 192274 193140 193630 193427 192799 192064 191016 189406 187699 186715 186633 186876 186974 186990 187127 187411 187887
54373A87887P63R07P56O48R41J333J174L73m01m87J74J119J868K257K414K453
$$ 187887 188650 189557 190313 190961 191902 193235 194409 194782 194381 193894 194068 195187 197055 199312 201726 204179
54357B04179K272J876J665K013K551K415J309j75j367k138k505k264j487q54r87
$$ 204179 206451 208327 209992 212005 214556 216971 218280 218105 216738 214600 212095 209831 208344 207490 206503
54342B06503j715k393k726k844k829k542j927j160n55l33m09m26j79L1j17l38
$$ 206503 204788 202395 199669 196825 193996 191454 189527 188367 187812 187479 187070 186644 186465 186496 186379 186041
54326A86041j01M59O41K63j00j51l41j006j700j870j605j233p66j46L46M37K36
$$ 186041 185940 186399 187040 187303 187203 187052 186711 185705 184005 182135 180530 179297 178531 178385 178731 179168 179404
54309A79404p6n08r65j150j020q38n73N5P19N55m74j144n36P48J613J956K274
$$ 179404 179328 178820 177855 176705 175685 174847 174274 174329 175048 175603 175129 173985 173449 174197 175810 177766 180040
54292A80040K490K164J437Q10L24k89r07j268j581k064k263j621n01K04L00L00
$$ 180040 182530 184694 186131 186941 187265 186976 186069 184801 183220 181156 178893 177272 176771 176975 177275 177575
54276A77575L39O2m99p21k33O76J566K133K072J227M6o80o35j57K94M92L74J25
$$ 177575 177914 177976 177477 176756 176523 177199 178765 180898 182970 184197 184243 183563 182928 182771 183065 183557 183931 184056
54258A84056K05Q39J488J335L10p20q62k6J050J450R10J29j7L58L57k47n46k0
$$ 184056 184261 185100 186588 187923 188233 187513 186651 186625 187675 189125 190035 190164 190147 190505 190862 190615 190069 190049
54240A90049M23k46j508k000j407n71Q0R04J877K185J366J08n39k77L45N56M1
$$ 190049 190472 190226 188718 186718 185311 184740 184820 185724 187601 189786 191152 191260 190721 190444 190789 191345 191386
54223A91386p02p34K72J479J795J124K21l87p03o96k31L66M46j10o56n79N7O72
$$ 191386 190684 189950 190222 191701 193496 194620 194841 194454 193751 193055 192824 193190 193636 193526 192870 192291 192348 193020
54205A93020O58j73j305j790j233l17O4j06k17o4Pj90m59o26o36l60J19K34m37
$$ 193020 193678 193505 192200 190410 189177 188860 188924 188818 188601 188537 188544 188354 187895 187269 186633 186273 186392 186626 186189
54186A86189j352j541q43n0J70r0l62k85K80J070J456J075L21k40n94r13q99k72
$$ 186189 184837 183296 182453 182403 182573 182483 182121 181836 182116 183186 184642 185717 186038 185798 185204 184291 183392 183120
54168A83120L74J22r06j602j303m47K45N43N78N53O45P60M54l80j065r18k62J02
$$ 183120 183494 183616 182710 181108 179805 179358 179603 180146 180724 181277 181922 182682 183136 182756 181691 180773 180511 180613
54150A80613J28L51P51P49L21J07L70P19Q98J020J023P49N96J079J760J566M36
$$ 180613 180741 181092 181843 182592 182913 183020 183390 184109 185007 186027 187050 187799 188395 189474 191234 192800 193236
54133A93236m62m23l4K5K1L66P16N20o6m31k92K26Q44J209J073O75N27O61O23
$$ 193236 192774 192351 192317 192342 192363 192729 193445 193965 193899 193468 193176 193402 194246 195455 196528 197203 197730 198391 199014
54114A99014K79O0K33N11N93M99K19l31q34p19j1N53N22K38J09k3m28r68j279
$$ 199014 199293 199353 199586 200097 200690 201189 201408 201077 200243 199524 199513 200066 200588 200826 200935 200912 200484 199516 198237
54095A98237j097l14Q79J860K158K114K389K902L107L170L857N114N907N778N523
$$ 198237 197140 196826 197705 199565 201723 203837 206226 209128 212235 215405 219262 224376 230283 236061 241584
54080B41584N891O584P008P058O535M785J711j587l949n308o103o261n583m553
$$ 241584 247475 254059 261067 268125 274660 279445 281156 279569 275620 270312 264209 257948 252365 247812
54066B47812l861l433k714j704j020j018j362j451j004k85P1k84r04j052o65k66
$$ 247812 243951 240518 237804 236100 235080 234062 232700 231249 230245 229960 230031 229747 228843 227791 227126 226860
54050B26860K9O07J394J733J528J612K531L768M679N284N613N229M189L635M469
$$ 226860 226889 227496 228890 230623 232151 233763 236294 240062 244741 250025 255638 260867 265056 268691 273160
54035B73160O044P084P334P441P639P654P558P734Q099Q152P720O966N803M030
$$ 273160 279204 286288 293622 301063 308702 316356 323914 331648 339747 347899 355619 362585 368388 372418
54021C72418J943J67j073k007k735l160l415l765m213m621n127n870o496o478
$$ 372418 374361 374528 373455 371448 368713 365553 362138 358373 354160 349539 344412 338542 332046 325568
54007C25568n939n592n773n989n575m495l377k892l177l703l822l400k783k222
$$ 325568 319629 314037 308264 302275 296700 292205 288828 285936 282759 279056 275234 271834 269051 266829
53993B66829j719j420j620k143k306j827j281j291j736k128k316k326j970j220
$$ 266829 265110 263690 262070 259927 257621 255794 254513 253222 251486 249358 247042 244716 242746 241526
53979B41526n58m27n58m33j03k0k20k92n8K47M59O78R30R21L65o13j413j425o47
$$ 241526 240968 240541 239983 239550 239447 239427 239207 238915 238857 239104 239563 240241 241171 242092 242457 241844 240431 239006 238359
53960B38359K34O38P94J168J496J105J81k34K97J068J484J937K861L836M352M727
$$ 238359 238593 239231 240025 241193 242689 243794 243975 243741 244038 245106 246590 248527 251388 255224 259576 264303
53944B64303N395O003O041N840O024O463O702P022Q051R594J0848J1604J2230
$$ 264303 269698 275701 281742 287582 293606 300069 306771 313793 321844 331438 342286 353890 366120
53931C66120J2548J1726R435O268K886m57l332m938m930l938k911k189j419j28
$$ 366120 378668 390394 399829 406097 408983 408526 405194 400256 395326 391388 388477 386288 384869 384741
53917C84741J791L955N712O675O984O977O744O262N734N432N285M890L952K555
$$ 384741 386532 390487 396199 402874 409858 416835 423579 429841 435575 441007 446292 451182 455134 457689
53903D57689J104P4m03q02j741l104m041m025l509l269l585m300n204o013o468
$$ 457689 458793 458867 458464 457662 455921 452817 448776 444751 441242 437973 434388 430088 424884 418871 412403
53888D12403o799p564q692r254q668p523o668o163n722n445n401n116m355l816
$$ 412403 405604 398040 389348 380094 371426 363903 357235 351072 345350 339905 334504 329388 325033 321217
53874C21217m087m439l781k454j884k629l891m795n140m818l731k432j848k121
$$ 321217 317130 312691 308910 306456 304572 301943 298052 293257 288117 283299 279568 277136 275288 273167
53860B73167k518k679k990l525l573k733j637j069r58p88m82l48m32m77l54j68
$$ 273167 270649 267970 264980 261455 257882 255149 253512 252443 251485 250697 250215 249867 249435 248958 248604 248436
53844B48436k9P3J81K76K52%l92o94q34r76j138j058o38k32j85m13p23j078j182
$$ 248436 248407 248480 248661 248937 249189 249189 248797 248103 247269 246293 245155 244097 243459 243227 243042 242629 241906 240828 239646
53825B39646l95J237K469K182R86M56J021J562J188M27L04J017J939K445K388
$$ 239646 239251 240488 242957 245139 246125 246581 247602 249164 250352 250779 251083 252100 254039 256484 258872
53810B58872K050J914K288L086M044M978N682N840N418M855M508M225L900L932
$$ 258872 260922 262836 265124 268210 272254 277232 282914 288754 294172 299027 303535 307760 311660 315592
53796C15592M574N176M950M155L700L771L665K949K000J330J079J132J154O48
$$ 315592 320166 325342 330292 334447 338147 341918 345583 348532 350532 351862 352941 354073 355227 355875
53782C55875m35j405j733j947k794l894m297m071m154m741n098n035n272n990
$$ 355875 355440 354035 352302 350355 347561 343667 339370 335299 331145 326404 321306 316271 310999 305009
53768C05009o276n522m302l377k791k421k496k932l004k302j387r67j030j264
$$ 305009 298733 293211 288909 285532 282741 280320 277824 274892 271888 269586 268199 267232 266202 264938
53754B64938j580j790j466p21l93q32j216p75q0k48j329k263k234j333r5R60J347
$$ 264938 263358 261568 260102 259381 258988 258156 256940 256165 256085 255837 254508 252245 250011 248678 248583 249543 250890
53737B50890Q26l00j315j568q51M56J532J735J251P69N53K95m0M3O66J177J108
$$ 250890 251716 251416 250101 248533 247682 248138 249670 251405 252656 253425 253978 254273 254233 254276 254942 256119 257227
53720B57227R77J472K333K680K205J467J091J230J690K191K456K373K084J860
$$ 257227 258204 259676 262009 264689 266894 268361 269452 270682 272372 274563 277019 279392 281476 283336
53706B83336J901K250K710K864K473J924J921K644L523L973L984L893L885L877
$$ 283336 285237 287487 290197 293061 295534 297458 299379 302023 305546 309519 313503 317396 321281 325158
53692C25158L638K980K022J220Q62O75K45l33p47j037j312j218n04J52j02q78
$$ 325158 328796 331776 333798 335018 335880 336555 336800 336467 335720 334683 333371 332153 331649 331801 331699 330821
53676C30821j028n24n36j407j943j314l66j75n01n57m13m81m90j0M92K75m48q58
$$ 330821 329793 329269 328733 327326 325383 324069 323703 323528 323027 322470 322057 321576 321086 321076 321568 321843 321395 320537
53658C20537q10p58p55n17k82n51j081j060l57K59K39j35l28j31L95R85J094M08
$$ 320537 319727 318969 318214 317697 317415 316864 315783 314723 314366 314625 314864 314729 314401 314270 314665 315650 316744 317152
53640C17152n07o09M51J971L020L210K573J320m4p87m91N86J815K710L139L219
$$ 317152 316645 316036 316487 318458 321478 324688 327261 328581 328537 327750 327259 327845 329660 332370 335509 338728
53624C38728L122K957K814K843L140L557L896M228M678M951M578L788L506M119
$$ 338728 341850 344807 347621 350464 353604 357161 361057 365285 369963 374914 379492 383280 386786 390905
53610C90905M867M939M675N011O097P157P520P102O046M537L019J966J299M86
$$ 390905 395772 400711 405386 410397 416494 423651 431171 438273 444319 448856 451875 453841 455140 455626
53596D55626o14j439j432p98l42o75j639k460k475j713p79j90lp7l73q64j423
$$ 455626 455012 453573 452141 451343 451001 450326 448687 446227 443752 442039 441260 441070 441067 440990 440617 439753 438330
53579D38330j991k584l034l017k529j981j649j397j121j040j278j548j568j494
$$ 438330 436339 433755 430721 427704 425175 423194 421545 420148 419027 417987 416709 415161 413593 412099
53565D12099j539j573j353q91k94M32J122J377J117P80P12P60P68R70J347J299
$$ 412099 410560 408987 407634 406743 406449 406881 408003 409380 410497 411277 411989 412749 413517 414487 415834 417133
53549D17133N55k4N52J957K904K833K380K233K300K210J967J858K124K940M315
$$ 417133 417688 417664 418216 420173 423077 425910 428290 430523 432823 435033 437000 438858 440982 443922 448237
53534D48237N899P081P487P246O786O520O645P115P818Q807J0132J1482J2355
$$ 448237 454136 461217 468704 475950 482736 489256 495901 503016 510834 519641 529773 541255 553610
53521E53610J2737J3168J3937J4714J5158J5420J5714J5990J6392J7420J9133
$$ 553610 566347 579515 593452 608166 623324 638744 654458 670448 686840 704260 723393
53510G23393K0808K1924K2874K4014K4789K4677K4333K4654K5168K4653K3109
$$ 723393 744201 766125 788999 813013 837802 862479 886812 911466 936634 961287 984396
53499I84396K1786K1233K0684J9620J8727J8690J9096J9197J8981J8857J8825
$$ 984396 1006182 1027415 1048099 1067719 1086446 1105136 1124232 1143429 1162410 1181267 1200092
53488A200092J8670J8484J8437J8286J7625J6565J5666J5358J5603J5989J6026
$$ 1200092 1218762 1237246 1255683 1273969 1291594 1308159 1323825 1339183 1354786 1370775 1386801
53477A386801J5517J4738J4076J3459J2418J0748Q717O595M333J859o87l167n576
$$ 1386801 1402318 1417056 1431132 1444591 1457009 1467757 1476474 1483069 1487402 1489261 1488574 1485407 1479831
53464A479831p805r628j1118j2682j4439j5864j6429j6382j6523j7303j8409j9235
$$ 1479831 1472026 1462398 1451280 1438598 1424159 1408295 1391866 1375484 1358961 1341658 1323249 1304014
53452A304014j9528j9488j9381j9258j9084j8972j9074j9238j8999j8126j6902
$$ 1304014 1284486 1264998 1245617 1226359 1207275 1188303 1169229 1149991 1130992 1112866 1095964
53441A095964j5793j4993j4410j3803j2733j0724p834m910k840j733j099n98j88
$$ 1095964 1080171 1065178 1050768 1036965 1024232 1013508 1005674 1000764 997924 996191 995092 994494 994306
53428I94306L62J507L371N494P219Q228Q750R416J0810J2893J5007J6647J7974
$$ 994306 994668 996175 999546 1005040 1012259 1020487 1029237 1038653 1049463 1062356 1077363 1094010 1111984
53415A111984J9330K0602K1538K2404K3687K5297K6716K7862K9180L0748L1987
$$ 1111984 1131314 1151916 1173454 1195858 1219545 1244842 1271558 1299420 1328600 1359348 1391335
53404A391335L2599L3277L4988L7775M0684M2842M4266M5585M7176M8850N0318
$$ 1391335 1423934 1457211 1492199 1529974 1570658 1613500 1657766 1703351 1750527 1799377 1849695
53393A849695N1588N2733N3568N4034N4607N5680N6600N6154N4183N1864N0073
$$ 1849695 1901283 1954016 2007584 2061618 2116225 2171905 2228505 2284659 2338842 2390706 2440779
53382B440779M8287M5720M2712M0106L7836L5113L1706K8086K4496K0727J6738
$$ 2440779 2489066 2534786 2577498 2617604 2655440 2690553 2722259 2750345 2774841 2795568 2812306
53371B812306J2737Q686M337l18n200j0577j6741k3382k9939l6218m2108m7005
$$ 2812306 2825043 2833729 2838066 2837748 2832548 2821971 2805230 2781848 2751909 2715691 2673583 2626578
53359B626578n0417n2778n4732n5937n5686n4457n3587n3295n2404n0351m8134
$$ 2626578 2576161 2523383 2468651 2412714 2357028 2302571 2248984 2195689 2143285 2092934 2044800
53348B044800m6738m5743m4316m2738m1987m2300m2885m2822m1737l9863l7812
$$ 2044800 1998062 1952319 1908003 1865265 1823278 1780978 1738093 1695271 1653534 1613671 1575859
53337A575859l6064l4467l2424k9748k6889k4330k2197k0459j8939j7161j4829
$$ 1575859 1539795 1505328 1472904 1443156 1416267 1391937 1369740 1349281 1330342 1313181 1298352
53326A298352j2607j1633j2062j2832j3119j3191j3473j3627j3088j1861j0227
$$ 1298352 1285745 1274112 1262050 1249218 1236099 1222908 1209435 1195808 1182720 1170859 1160632
53315A160632q285o361n218n133n198m255k258r5J593K856L858M619N319O362
$$ 1160632 1152347 1145986 1140768 1135635 1130437 1126182 1123924 1123829 1125422 1128278 1132136 1136755 1142074 1148436
53301A148436P943R774J1413J2731J4110J6026J8410K0537K1782K2308K2744K3395
$$ 1148436 1156379 1166153 1177566 1190297 1204407 1220433 1238843 1259380 1281162 1303470 1326214 1349609
53289A349609K4233K5340K6636K7370K6720K4952K3151K1742K0091J7745J5163
$$ 1349609 1373842 1399182 1425818 1453188 1479908 1504860 1528011 1549753 1569844 1587589 1602752
53278A602752J2891J0877Q969P228N330K506j331n125p907r866j1681j3535j5415
$$ 1602752 1615643 1626520 1635489 1642717 1648047 1650553 1649222 1644097 1636190 1626324 1614643 1601108 1585693
53265A585693j7684k0571k3537k5810k7191k7899k8105k8192k8804l0028l1024
$$ 1585693 1568009 1547438 1523901 1498091 1470900 1443001 1414896 1386704 1357900 1327872 1296848
53254A296848l1044l0390k9801k9451k9106k8691k8095k7026k5655k4804k4795
$$ 1296848 1265804 1235414 1205613 1176162 1147056 1118365 1090270 1063244 1037589 1012785 987990
53243I87990k4852k4363k3960k4351k4853k4284k2784k1450k0520j9367j7986
$$ 987990 963138 938775 914815 890464 865611 841327 818543 797093 776573 757206 739220
53232G39220j7104j6675j5602j3325j0670q739p866p882q511r200r327q966q800
$$ 739220 722116 705441 689839 676514 665844 657105 649239 641357 632846 623646 614319 605353 596553
53219E96553r114r538r919j0611j1627j2276j2082j1394j0792j0403j0151j0037
$$ 596553 587439 577901 567982 557371 545744 533468 521386 509992 499200 488797 478646 468609
53207D68609r800q920p396o028n466n515n742o250p188p947p668o431n277m960
$$ 468609 458809 449889 442493 436465 430999 425484 419742 413492 406304 398357 390689 384258 378981 374021
53193C74021n149n109m757m663n135n611n242l890k304j269r09r99j510k466l441
$$ 374021 368872 363763 359006 354343 349208 343597 338355 334465 332161 330892 329983 328984 327474 325008 321567
53178C21567l785l366k796k782l407m047l878k673j187m94p43r50l13O59Q81J16
$$ 321567 317782 314416 311620 308838 305431 301384 297506 294833 293646 293152 292409 291459 291146 291805 292686 292802
53162B92802r19j577j674j190l82n5p76j803j742m45P33P91K54L4Q2j36n50p30
$$ 292802 291883 290306 288632 287442 287060 287005 286229 284426 282684 282239 282972 283763 284017 284051 284133 283997 283447 282717
53144B82717o90o81n56o1M26K90l33o99n34l23m06m70j64L24N79N27K98r3n80
$$ 282717 282027 281346 280790 280729 281155 281445 281112 280413 279879 279556 279150 278680 278516 278840 279419 279946 280244 280151 279571
53125B79571p43j60R56J881K272K542L060L416K986K045J577J812J787P46o53
$$ 279571 278828 278668 279624 281505 283777 286319 289379 292795 295781 297826 299403 301215 303002 303748 303095
53110C03095j246j034j040j655k166k033j759k007k549k679k178j376n79KN9n13
$$ 303095 301849 300815 299775 298120 295954 293921 292162 290155 287606 284927 282749 281373 280794 280796 280855 280342
53094B80342j182j170l30O78J093P24q8q53j275j289r44k67N56R81N15m97r83
$$ 280342 279160 277990 277660 278338 279431 280155 280067 279214 277939 276650 275706 275439 275995 276976 277491 276994 276011
53077B76011l96N50Q15L96P3J05l2n74r86q65o53r68j658k041j816j217n49j6
$$ 276011 275615 276165 276980 277376 277449 277554 277522 276948 275962 275097 274444 273476 271818 269777 267961 266744 266195 266179
53059B66179J70K4NM83J021Q08j62r22p39Q6Q71J468K007K247J762O72l95r54
$$ 266179 266349 266373 266378 266861 267882 268690 268528 267606 266867 266953 267824 269292 271299 273546 275308 275980 275585 274631
53041B74631q92k09R40K008K301J618L27j097k259k727k349j666j400j472j107
$$ 274631 273739 273530 274470 276478 278779 280397 280724 279627 277368 274641 272292 270626 269226 267754 266647
53026B66647r0P74Q11M02L08N67O95N62M51M35L12J09R0L33O51R09J066R63N06
$$ 266647 266557 267331 268142 268544 268852 269419 270114 270676 271127 271562 271874 271983 272073 272406 273057 273966 275032 275995 276501
53007B76501J7j1M83J040J274J212J053Q67O28K95j51o45j016j145j083q21j84
$$ 276501 276518 276507 276990 278030 279304 280516 281569 282436 283064 283359 283208 282563 281547 280402 279319 278498 278314
52990B78314Q28J777K157J962J532J069N89K87M08Q03J041J027J117J478J750
$$ 278314 279142 280919 283076 285038 286570 287639 288228 288515 288923 289726 290767 291794 292911 294389 296139
52975B96139J565J143J050J503K084K122J351J59p48r96p43l39O9M31O41O41N34
$$ 296139 297704 298847 299897 301400 303484 305606 306957 307116 306368 305372 304629 304290 304359 304790 305431 306072 306606
52958C06606L68J9m84q21q16p52q97j035r27r39j557k403k467j452k10L17P9l68
$$ 306606 306974 306993 306509 305688 304872 304120 303223 302188 301261 300322 298765 296362 293895 292443 292233 292550 292629 292261
52940B92261o26n92l24q8k55p83j072o88k7J45l21p98p68m88n34r42j117p01j28
$$ 292261 291635 291043 290719 290631 290376 289593 288521 287833 287806 287951 287630 286832 286064 285576 285042 284100 282983 282282 282154
52921B82154lj56J05Q21J149O55Q4K69Q06O72j49o81m86j90l19n79o36p38j035
$$ 282154 282151 281995 282100 282921 284070 284725 284809 285078 285884 286556 286407 285726 285240 285050 284731 284152 283516 282778 281743
52902B81743j100o92l94p13j093o42M31J051P97L56L82O84Q59J010J328J502J107
$$ 281743 280643 279951 279557 278844 277751 277109 277540 278591 279388 279744 280126 280810 281669 282679 284007 285509 286616
52885B86616M23J76M37L41p86k345k996k191p42K18M40N19R31J570K083K305K256
$$ 286616 287039 287215 287652 287993 287207 284862 281866 279675 278933 279151 279591 280110 281041 282611 284694 286999 289255
52868B89255K101K122K555L266L834L919L451K497J236R8m73n50p54j494k426
$$ 289255 291356 293478 296033 299299 303133 307052 310503 313000 314236 314334 313861 313311 312557 311063 308637
52853C08637k882k752k569k749l017k827k191j772k010k466k380j705j156j200
$$ 308637 305755 303003 300434 297685 294668 291841 289650 287878 285868 283402 281022 279317 278161 276961
52839B76961j540j809k123k506k394j372r7L95R7p1K94O53O25O18R12R72K85o85
$$ 276961 275421 273612 271489 268983 266589 265217 265120 265515 265612 265541 265835 266488 267113 267731 268643 269615 269900 269215
52821B69215j068p85m57l65j51M55J125J322R28L85K65P14J272J333Q71M20L16
$$ 269215 268147 267362 266905 266540 266389 266844 267969 269291 270219 270604 270869 271583 272855 274188 275059 275479 275795
52804B75795K25l42j331k229k709k846k817k652k293j719r93k89J72K72O8l26
$$ 275795 276020 275678 274347 272118 269409 266563 263746 261094 258801 257082 256089 255800 255972 256244 256312 255986
52788B55986p35r02o84l11j43j37Q8N58P94N93M97J061J929K232J724R87N60L69
$$ 255986 255251 254349 253665 253354 253211 253074 253162 253720 254514 255107 255604 256665 258594 260826 262550 263537 264097 264466
52770B64466J52p2k11m03p67j067j015p84q21j105j045l65L23K39m12o47n5O73
$$ 264466 264618 264546 264335 263932 263165 262098 261083 260299 259478 258373 257328 256963 257286 257525 257113 256466 256411 257084
52752B57084Q28O71Q48J326J602J659J928K324K228J537J030J262J695J448N41
$$ 257084 257912 258583 259431 260757 262359 264018 265946 268270 270498 272035 273065 274327 276022 277470 278011
52737B78011j14J38R54J430J078L10j1M33J093J274R61M94j82j304k430k675j881
$$ 278011 277897 278035 278989 280419 281497 281807 281796 282229 283322 284596 285557 286051 285869 284565 282135 279460 277579
52720B77579q81l06K5K76M2p63j236n77O73J282Q72J4q59j677k084j568m17L14
$$ 277579 276698 276392 276417 276693 276735 275972 274736 274159 274832 276114 276986 277000 276141 274464 272380 270812 270395 270709
52702B70709J01l84k55M60J074J175R75Q38Q68Q88O93L40J71M55J058J598J846
$$ 270709 270810 270426 270171 270631 271705 272880 273855 274693 275561 276449 277142 277482 277653 278108 279166 280764 282610
52685B82610J812J496Q88J97k41l19k38j95j64o7L6Rk27n70p34m60M7J66m13j120
$$ 282610 284422 285918 286806 287003 286762 286443 286205 286010 285846 285779 285815 285824 285597 285027 284293 283833 283880 284046 283633 282513
52665B82513j074j93P07R73Q27Q47J101J177Q98O16P41J235J709J876J839J852
$$ 282513 281439 281246 281953 282926 283753 284600 285701 286878 287776 288392 289133 290368 292077 293953 295792 297644
52649B97644J886J536M62j085k330k612j958r92l02K0J90K67P6l60n87j46Q22
$$ 297644 299530 301066 301528 300443 298113 295501 293543 292551 292249 292269 292459 292726 292802 292442 291855 291709 292531
52632B92531J703K059K012K002K381L204M095M374L585J984K02j507l236m688
$$ 292531 294234 296293 298305 300307 302688 305892 309987 314361 317946 319930 320132 318625 315389 310701
52618C10701n090m120k507j309r52j200j603j627q15O56J829J957J352Q00M07
$$ 310701 305611 301491 298984 297675 296723 295523 293920 292293 291478 292134 293963 295920 297272 298072 298479
52603B98479k39r76j038k62M72L58l65r56j162j196j044m32O24J665K257K303
$$ 298479 298240 297264 296226 295964 296436 296794 296429 295473 294311 293115 292071 291639 292263 293928 296185 298488
52587B98488J906J191L97j01q0L54R55J600K188K415K001J166N66N58P95P81M94
$$ 298488 300394 301585 301982 301881 301801 302155 303110 304710 306898 309313 311314 312480 313046 313604 314399 315180 315674
52570C15674J61k98r81j349p26M99R31j14j690k531k619k688k721k043p42O8k23
$$ 315674 315835 315537 314556 313207 312481 312980 313911 313797 312107 309576 306957 304269 301548 299505 298763 298831 298608
52553B98608q01n60M34J185J120O12K61J69M3k96p28j051j212j313j379j266q27
$$ 298608 297807 297247 297681 298866 299986 300598 300859 301028 301071 300775 300047 298996 297784 296471 295092 293826 292999
52536B92999j86L22M94M67N40Q36J195J385J356J298J437J775K105K191J971J516
$$ 292999 292813 293135 293629 294096 294636 295472 296667 298052 299408 300706 302143 303918 306023 308214 310185 311701
52520C11701R96N85L76L43M70Q65J581K406L007L267L352L398L396L328L156K683
$$ 311701 312697 313282 313658 314001 314471 315336 316917 319323 322330 325597 328949 332347 335743 339071 342227 344910
52504C44910J697L42r48j937k690l191l242k971k959l471l924l494k154p54j34
$$ 344910 346607 346949 346001 344064 341374 338183 334941 331970 329011 325540 321616 318122 315968 315214 315080
52489C15080l91r28j055n80N3K46j27p06j132j251q88M2J048J323P92L99R47K062
$$ 315080 314689 313761 312706 312126 312179 312425 312298 311592 310460 309209 308321 308363 309411 310734 311526 311925 312872 314934
52471C14934K804K844K562K233J853J569J675K145K615K884L051L088K673J539
$$ 314934 317738 320582 323144 325377 327230 328799 330474 332619 335234 338118 341169 344257 346930 348469
52457C48469j68j923l123l566l609l759l967l746k985k232j881j722j533j558
$$ 348469 348301 346378 343255 339689 336080 332321 328354 324608 321623 319391 317510 315788 314255 312697
52443C12697j915k136j965j987k639l111k219j51J697K487K554K285J509K90o12
$$ 312697 310782 308646 306681 304694 302055 298944 296725 296574 298271 300758 303312 305597 307106 307396 306784
52428C06784n94J6M82N05K45m0j08J66N57O34L41Q9K09O82J401K345L373M241
$$ 306784 306190 306206 306688 307193 307438 307398 307290 307456 308013 308647 308988 309077 309286 309968 311369 313714 317087 321328
52410C21328M874N394N833O212O793P843R159J0218J0680J0347Q872O129K692
$$ 321328 326202 331596 337429 343641 350434 358277 367436 377654 388334 398681 407553 413682 416374
52397D16374o91l921p121r563j0148q956p310o101n065l966l283l176k838j682
$$ 416374 415683 411762 404641 395078 384930 375974 368664 362563 357498 353532 350249 347073 344235 342553
52383C42553l07M96R18J486J950J823J474J682K403K950L081L104L080K864K762
$$ 342553 342246 342742 343660 345146 347096 348919 350393 352075 354478 357428 360509 363613 366693 369557 372319
52368C72319L237L963M065L344K441J708P90m81j579k050k080j956j517o58J92
$$ 372319 375556 379519 383584 386928 389369 391077 391867 391386 389807 387757 385677 383721 382204 381546 381738
52353C81738N89P61J188J798K076J865J507J200Q30N00P36J768K981L459L047
$$ 381738 382327 383088 384276 386074 388150 390015 391522 392722 393552 394052 394788 396556 399537 402996 406043
52338D06043K446K364K922L922N255O699P735Q012P908Q203R176J0317J1054J1412
$$ 406043 408489 410853 413775 417697 422952 429651 437386 445398 453306 461509 470685 481002 492056 503468
52324E03468J1841J2626J3628J4494J4956J4962J4620J4092J3577J3385J3718
$$ 503468 515309 527935 541563 556057 571013 585975 600595 614687 628264 641649 655367
52313F55367J4294J4509J4250J4217J5041J6293J6939J6667J6170J6134J6472
$$ 655367 669661 684170 698420 712637 727678 743971 760910 777577 793747 809881 826353
52302H26353J6743J6737J6424J5783J4968J4241J3510J2296J0386Q103N789L432
$$ 826353 843096 859833 876257 892040 907008 921249 934759 947055 957441 965544 971333 974765
52290I74765J039j012k410l350m255n284o374p328p654o839n151l734l304l165
$$ 974765 975804 974792 972382 969032 964777 959493 953119 945791 938137 931298 926147 922413 919109 915944
52276I15944k213n78N73P91R58J885L148L908M310N311P194R030R843R807R827
$$ 915944 913731 913153 913726 914517 915475 917360 920508 924416 928726 934037 941231 950261 960104 969911 979738
52261I79738J0282J0739J0878J1065J1681J2459J2954J3381J4299J5595J6440
$$ 979738 990020 1000759 1011637 1022702 1034383 1046842 1059796 1073177 1087476 1103071 1119511
52250A119511J6283J5297J3765J1635Q956O169L613J127j412l640n128n996o685
$$ 1119511 1135794 1151091 1164856 1176491 1185447 1191616 1195229 1196356 1194944 1191304 1186176 1180180 1173495
52237A173495p315p737p985q265q541q519q113p672p631q111q785r147q915q203
$$ 1173495 1166180 1158443 1150458 1142193 1133652 1125133 1117020 1109348 1101717 1093606 1084821 1075674 1066759 1058556
52223A058556p251o122m806l508k504j793j242r77j113j133k80J303K464K543
$$ 1058556 1051305 1045183 1040377 1036869 1034365 1032572 1031330 1030353 1029240 1028107 1027827 1029130 1031594 1034137
52209A034137K316K970M548N991O430N867M799L773L220L265L659M149M807N734
$$ 1034137 1036453 1039423 1043971 1049962 1056392 1062259 1067058 1070831 1074051 1077316 1080975 1085124 1089931 1095665
52195A095665O648P137P208P224P393P565P478O929N815M224K375L66j809l869
$$ 1095665 1102313 1109450 1116658 1123882 1131275 1138840 1146318 1153247 1159062 1163286 1165661 1166027 1164218 1160349
52181A160349n259n903o552p928r658j0641j0362r410q594q008p194n945m624
$$ 1160349 1155090 1149187 1142635 1134707 1125049 1114408 1104046 1094636 1086042 1078034 1070840 1064895 1060271
52168A060271l622k786j607NJ444K190K485K934L616M127M296M236L780K633J098
$$ 1060271 1056649 1053863 1052256 1052261 1053705 1055895 1058380 1061314 1064930 1069057 1073353 1077589 1081369 1084002 1085100
52153A085100r2p65j308j636j158n8N18J66pR06K137K484K084J746J277l9j710
$$ 1085100 1085008 1084243 1082935 1081299 1080141 1080083 1080601 1080767 1080760 1081666 1083803 1086287 1088371 1090117 1091394 1091355 1089645
52136A089645k340j624o66j65M37J683L148M327N536P363R786J2350J4686J6569
$$ 1089645 1087305 1085681 1085015 1084850 1085287 1086970 1090118 1094445 1099981 1107344 1117130 1129480 1144166 1160735
52122A160735J7951J9173K0681K2264K3153K3059K2604K2423K2329K1811K0869
$$ 1160735 1178686 1197859 1218540 1240804 1263957 1287016 1309620 1332043 1354372 1376183 1397052
52111A397052J9895J8971J7786J6218J4695J3879J3937J4223J3911J2990J2331
$$ 1397052 1416947 1435918 1453704 1469922 1484617 1498496 1512433 1526656 1540567 1553557 1565888
52100A565888J2454J2705J2084J0473Q350N665J984k309o018q585j0709j3119
$$ 1565888 1578342 1591047 1603131 1613604 1621954 1627619 1629603 1627294 1621276 1612691 1601982 1588863
52088A588863j5528j7219j7943j7784j6698j4868j3073j1993j1338j0263q556
$$ 1588863 1573335 1556116 1538173 1520389 1503691 1488823 1475750 1463757 1452419 1442156 1433600
52077A433600o903n928n386m499k890r67O28J843L250N198P221Q576R160R555
$$ 1433600 1426697 1420769 1415383 1410884 1407994 1407027 1407655 1409498 1412748 1417946 1425167 1433743 1442903 1452458
52063A452458J0168J0779J0981J0788J0676J1166J2300J3436J3679J2786J1368
$$ 1452458 1462626 1473405 1484386 1495174 1505850 1517016 1529316 1542752 1556431 1569217 1580585
52052A580585J0019Q582O711M692K990J262j296m627p714r875j1450j2927j4202
$$ 1580585 1590604 1599186 1605897 1610589 1613579 1614841 1613545 1608918 1601204 1591329 1579879 1566952 1552750
52039A552750j4961j5166j4833j3906j2759j2216j2603j3257j3297j2622j1783
$$ 1552750 1537789 1522623 1507790 1493884 1481125 1468909 1456306 1443049 1429752 1417130 1405347
52028A405347j1254j1130j1271j1449j1550j1743j2162j2433j2022j1100j0495
$$ 1405347 1394093 1382963 1371692 1360243 1348693 1336950 1324788 1312355 1300333 1289233 1278738
52017A278738j0576j0796j0513r670q407o747n075m261m720n853o984q294j0254
$$ 1278738 1268162 1257366 1246853 1237183 1228776 1222029 1216954 1212693 1207973 1202120 1195136 1186842 1176588
52004A176588j2596j4622j6186j7627j8870j9331j8755j7557j6310j5286j4493
$$ 1176588 1163992 1149370 1133184 1115557 1096687 1077356 1058601 1041044 1024734 1009448 994955
51993I94955j3775j2950j2164j1981j2803j4202j5286j5610j5422j5121j4955
$$ 994955 981180 968230 956066 944085 931282 917080 901794 886184 870762 855641 840686
51982H40686j5172j5972j7099j7848j7789j7273j6960j6887j6213j4151j1066
$$ 840686 825514 809542 792443 774595 756806 739533 722573 705686 689473 675322 664256
51971F64256q298o644n353l083K53L328N094N973O907P963Q428P934O783N275
$$ 664256 655958 649314 643961 640878 641131 644459 649553 655526 662433 670396 678824 686758 693541 698816
51957F98816L273N66k685n854q085q835q385p670p278o861n771l992k016l4K237
$$ 698816 702089 702655 699970 694116 686031 677196 668811 661141 653863 647002 641231 637239 635223 635189 637426
51942F37426M910P550R550J0722J1403J2087J2880J3294J2738J1275R569P970
$$ 637426 642336 649886 659436 670158 681561 693648 706528 719822 732560 743835 753404 761374
51930G61374O050L320M3l083n757q098j0029j1149j1255j0600r556q258o620m547
$$ 761374 767424 770744 770787 767704 761947 753849 743820 732671 721416 710816 701260 693002 686382 681835
51916F81835k190j37Q50M37j074l257n894q527j0195j0154q706o783m897k940
$$ 681835 679645 679508 680358 680795 679721 676464 670570 662043 651848 641694 632988 626205 621308 618368
51902F18368q82R29K145K570J982K45k335n219q166j1083j3402j4318j3823j2874
$$ 618368 617486 618415 620560 623130 625112 625357 623022 617803 609637 598554 585152 570834 557011 544137
51888E44137j2174j1308r475o729l920j694l0J290K400L577N342P916J0733J2765
$$ 544137 531963 520655 511180 504451 500531 498837 498807 500097 502497 506074 511416 519332 530065 542830
51874E42830J3369J2693J1321R686P879N836L490Q04k099m773o605p327p302p091
$$ 542830 556199 568892 580213 589899 597778 603614 607104 607908 605809 601036 594431 587104 579802 572711
51860E72711o843o198m837l002j289j2J037K041K545J872J42j567k436k898l889
$$ 572711 565868 559670 554833 551831 550542 550530 551567 553608 556153 558025 558167 556600 554164 551266 547377
51845E47377n436o675p150p260p318o964n937m801m247m112l669k655j454l63
$$ 547377 541941 535266 528116 520856 513538 506574 500637 495836 491589 487477 483808 481153 479699 479336
51831D79336P01J769K503K517J845R51L53J05l13j373k793l695l587k790j758
$$ 479336 480037 481806 484309 486826 488671 489622 489975 490080 489767 488394 485601 481906 478319 475529 473771
51816D73771n06R34J946J861Q77o8l12j5K45R4m23j009j455j875k425k825k553
$$ 473771 473265 474199 476145 478006 478883 478815 478503 478488 478733 478827 478404 477395 475940 474065 471640 468815 466262
51799D66262j629p31k73J14P73J276J043K69m31r40j526k092k206j779j039k1
$$ 466262 464633 463902 463629 463743 464516 465792 466835 467104 466673 465733 464207 462115 459909 458130 457091 457070
51783D57070J205K011J704N58m10o69m93l7R88K506L797M430M857N706P068Q734
$$ 457070 458275 460286 461990 462548 462138 461469 460976 460939 461927 464433 468230 472660 477517 483223 490291 499025
51767D99025J0556J2073J2461J1419R698Q139O541M082O40k957n931q194r917
$$ 499025 509581 521654 534115 545534 555232 563371 569912 573994 574634 571677 565746 557552 547635
51754E47635j1017j1382j1278j1136j1004j0483r303p698o107m623l145j845r76
$$ 547635 536618 525236 513958 502822 491818 481335 472032 464334 458227 453604 450459 448614 447638
51741D47638j93J347L772O023P140P564Q304R226R226P989O447N266L925J902
$$ 447638 447445 448792 452564 458587 465727 473291 481595 490821 500047 508036 514483 519749 523674 525576
51727E25576j07r33l34J009K373L242L050J598m60k181l345m316n059n024m111
$$ 525576 525469 524536 524202 525211 527584 530826 533876 535474 535014 532833 529488 525172 520113 515089 510978
51712E10978l038k478k287j933j339r14r27j116r48r3J296K618L175K655J403
$$ 510978 507940 505462 503175 501242 499903 498989 498062 496946 495998 495905 497201 499819 502994 505649 507052
51697E07052J62n14o41n82n28l03K51R22J327J383J234P78l93k403m647o164o392
$$ 507052 507214 506700 506059 505477 504949 504646 504897 505819 507146 508529 509763 510541 510148 507745 503098 496934 490542
51680D90542n469l968k476j282l26N61J319J658J481J139J145J758K848M172N566
$$ 490542 485073 481105 478629 477347 477021 477582 478901 480559 482040 483179 484324 486082 488930 493102 498668
51665D98668O940Q184R112R515R274Q348O662M178J181j631l577m433m210k800
$$ 498668 505608 513792 522904 532419 541693 550041 556703 560881 562062 560431 556854 552421 548211 545411
51651E45411k72K633M814N779N786M963K845q31n381r651j2920j4984j5683j4990
$$ 545411 545139 547772 552586 558365 564151 569114 571959 571128 565747 556096 543176 528192 512509 497519
51637D97519j3313j1251r042o736m671l227k147q36O04J296R22M22Q49J901K290
$$ 497519 484206 472955 463913 457177 452506 449279 447132 446296 446900 448196 449118 449540 450389 452290 454580
51622D54580J451J91l71n1M66M20m79j976l365l860l205j975j024o88o90o89p04
$$ 454580 456031 456222 455851 455800 456266 456686 456207 454231 450866 447006 443801 441826 440802 440114 439424 438735 438031
51605D38031r35j385j673j221K43K240L783M346M485N134O476P898Q973R822J0311
$$ 438031 437096 435711 434038 432817 433060 435300 439083 443429 447914 453048 459524 467422 476395 486217 496528
51590D96528R638P193L510j47k936m773n771n866n033l401j158J495M291P006
$$ 496528 506166 513359 516869 516722 513786 509013 503242 497376 492343 488942 487784 489279 493570 500576
51576E00576R651J2273J4718J6701J8060J8778J9026J9308K0203K1616K2603K2412
$$ 500576 510227 522500 537218 553919 571979 590757 609783 629091 649294 670910 693513 715925
51564G15925K1441K0756K0915K1869K3706K6738L0850L5348L9449M2302M2705
$$ 715925 737366 758122 779037 800906 824612 851350 882200 917548 956997 999299 1042004
51553A042004L9673L3445K5244J5923N605n208j5264k3748l0990l7338m2132m4597
$$ 1042004 1081677 1115122 1140366 1156289 1161894 1156686 1141422 1117674 1086684 1049346 1007214 962617
51541I62617m5143m4823m3932m2030l9106l5698l1967k7601k2871j8857j6206
$$ 962617 917474 872651 828719 786689 747583 711885 679918 652317 629446 610589 594383
51530E94383j4314j2247r990q220p167o293n096l710k527j593p02R0M25K40k2
$$ 594383 580069 567822 557832 549612 542445 536152 531056 527346 524819 523226 522524 522614 523039 523279 523257
51515E23257%k4o77j927l174m148n170o296o828o126m560l141k452k383k659l073
$$ 523257 523257 523233 522556 520629 517455 513307 508137 501841 495013 488887 484327 481186 478734 476351 473692 470619
51499D70619l341l185k701k170j617r44m49o44j431k018j825j123m93q2K81N28
$$ 470619 467278 464093 461392 459222 457605 456661 456212 455568 454137 452119 450294 449171 448678 448596 448877 449405
51483D49405L48l86j482k626l468l646l031j996j176r17j086j375j674k062k568
$$ 449405 449753 449367 447885 445259 441791 438145 435114 433118 431942 431025 429939 428564 426890 424828 422260
51468D22260k996l032k578k012j901k331k729k476j555l68R07K300L537M061L780
$$ 422260 419264 416232 413654 411642 409741 407410 404681 402205 400650 400282 401189 403489 407026 411087 414867
51453D14867L339L334L590L562L210L035L407M285N566P241R182J1092J2712J3727
$$ 414867 418206 421540 425130 428692 431902 434937 438344 442629 448195 455436 464618 475710 488422 502149
51439E02149J3649J2138R541O655L958J536l17j117j072j225k289l870n293o590
$$ 502149 515798 527936 537477 544132 548090 549626 549309 548192 547120 545895 543606 539736 534443 527853
51425E27853q037r229r356q315o802n429m241l070j820m53Q12J475J326Q42N93
$$ 527853 519816 510587 501231 492916 486114 480685 476444 473374 471554 471101 471913 473388 474714 475556 476149
51410D76149M76J65n3K97Q62Q37L21K90J101J997K375K554K922L203L129L026
$$ 476149 476625 476790 476737 477034 477896 478733 479054 479344 480445 482442 484817 487371 490293 493496 496625 499651
51394D99651L238L597M079N226P269R523J1338J3088J5403J8082K0649K3545K7657
$$ 499651 502889 506486 510565 515791 523060 532583 543921 557009 572412 590494 611143 634688 662345
51381F62345L2850L8010M2502M6758N1289N5971O0316O3671O4881O2570N6184
$$ 662345 695195 733205 775707 822465 873754 929725 990041 1053712 1118593 1181163 1237347
51370A237347M6355L4048J9909M715j0121k3145l3772m2263m8981n3968n7191
$$ 1237347 1283702 1317750 1337659 1342374 1332253 1309108 1275336 1233073 1184092 1130124 1072933
51359A072933n8803n9095n8215n6063n2487m7626m2017l6310l0970k6300k2526
$$ 1072933 1014130 955035 896820 840757 788270 740644 698627 662317 631347 605047 582521
51348E82521j9668j7426j5423j3539j1877j0515r393q418p505o626n891n462n227
$$ 582521 562853 545427 530004 516465 504588 494073 484680 476262 468757 462131 456240 450778 445551
51335D45551m795l970l061k477k234k105j963j775j443j003p68q98r89n83J11
$$ 445551 440756 436786 433725 431248 429014 426909 424946 423171 421728 420725 419957 419059 418070 417487 417598
51320D17598M84M58O33J422K447K994K837K504K854M232N855O197M481J683l90
$$ 417598 418082 418540 419173 420595 423042 426036 428873 431377 434231 438463 444318 450515 454996 456679 456289
51305D56289j002j069j752l093m204m472m131l872m061m429m488m192l984m015
$$ 456289 455287 454218 452466 449373 445169 440697 436566 432694 428633 424204 419716 415524 411540 407525
51291D07525l744k724j458p70m87M17K203L724L877L089K780L723N445O968P628
$$ 407525 403781 401057 399599 398829 398342 398759 400962 404686 408563 411652 414432 418155 423600 430568 438196
51276D38196P234N991M369K859J710R74O16M59K72R1K77J009J898K417K500K385
$$ 438196 445430 451421 455790 458649 460359 461333 461949 462408 462680 462771 463048 464057 465955 468372 470872 473257
51260D73257K026J102l67j848k848l357l617l670l387k804k199j874j921k243
$$ 473257 475283 476385 476018 474170 471322 467965 464348 460678 457291 454487 452288 450414 448493 446250
51246D46250k691l108l330l206k806k526k742l271l369k515j098m5K01Jj72l66
$$ 446250 443559 440451 437121 433915 431109 428583 425841 422570 419201 416686 415588 415543 415744 415745 415573 415207
51230D15207q54j505j843j616r88k62L27N84N59P25J563K771L400L003K274K165
$$ 415207 414353 412848 411005 409389 408401 408139 408466 409050 409609 410334 411897 414668 418068 421071 423345 425510
51214D25510K700L194L319L367L513L500L145K660K257J859J361P75J4r38j576
$$ 425510 428210 431404 434723 438090 441603 445103 448248 450908 453165 455024 456385 457160 457174 456236 454660
51199D54660j190N2R55P11j13n20n43r06j581j693r42j79j49m21j45N84P89l0
$$ 454660 453470 453522 454477 455188 455075 454555 454012 453106 451525 449832 448890 448711 448562 448141 447996 448580 449369 449339
51181D49339j226j830j604j031n25o8L84O29N46M63P67J270J381R34M66N26J054
$$ 449339 448113 446283 444679 443648 443123 443055 443439 444068 444614 445077 445844 447114 448495 449429 449895 450421 451475
51164D51475J614J924J963J878J961K500L323L780L397K419J477R25O63L26n04
$$ 451475 453089 455013 456976 458854 460815 463315 466638 470418 473815 476234 477711 478636 479299 479625 479121
51149D79121j935l380l958l527k938k940l321l540l618l773l598k548r99l9p6
$$ 479121 477186 473806 469848 466321 463383 460443 457122 453582 449964 446191 442593 440045 439046 439007 438931
51134D38931m39l90J04P04J207J475J409J180J121J317J637K136K969L882M356
$$ 438931 438492 438102 438206 438910 440117 441592 443001 444181 445302 446619 448256 450392 453361 457243 461599
51119D61599M331M248M311M197L691L026K453J991J707J742J825J427O08R3K45
$$ 461599 465930 470178 474489 478686 482377 485403 487856 489847 491554 493296 495121 496548 497156 497249 497494
51104D97494N38M80M20R34J855K538K682K346J495J98j003j571j767k305l245
$$ 497494 498032 498512 498932 499866 501721 504259 506941 509287 510782 510980 509977 508406 506639 504334 501089
51089E01089l803l446k617k077j943j734j141l84K05O33J083J548J866K036K222
$$ 501089 497286 493840 491223 489146 487203 485469 484328 483944 484149 484782 485865 487413 489279 491315 493537
51074D93537K351K099J494J201J831L175M486N370N921O220O349O793Q173J0429
$$ 493537 495888 497987 499481 500682 502513 505688 510174 515544 521465 527685 534034 540827 549000 559429
51060E59429J2855J5096J7432J9802K1290K1022J9181J6690J4365J2791J2474
$$ 559429 572284 587380 604812 624614 645904 666926 686107 702797 717162 729953 742427
51049G42427J3466J4997J6088J6321J5697J4001J0934O704J955k775p144j0699
$$ 742427 755893 770890 786978 803299 818996 832997 843931 850635 852590 849815 842671 831972
51037H31972j3058j4335j4850j4495j2999j0895r620j0231j2345j4589j5839j5826
$$ 831972 818914 804579 789729 775234 762235 751340 741720 731489 719144 704555 688716 672890
51025F72890j4787j2953j0415p316m103j434K42J077J628K243K817L245L797M842
$$ 672890 658103 645150 634735 627419 623316 621882 622124 623201 624829 627072 629889 633134 636931 641773
51011F41773O253P451Q100Q474R022R776J0501J1173J1975J2786J3130J2751J1912
$$ 641773 648026 655477 663577 672051 681073 690849 701350 712523 724498 737284 750414 763165 775077
50998G75077J0882R580P963O401N161L886K139K76r25j404j920k898l826l960
$$ 775077 785959 795539 803502 809903 815064 818950 821089 821365 820440 819036 817116 814218 810392 806432
50984H06432l074j325J072L740O210Q434J0748J3090J4752J5291J5262J5588J6591
$$ 806432 803358 802033 803105 806845 813055 821489 832237 845327 860079 875370 890632 906220 922811
50971I22811J8065J9973K2524K5761K9526L3666L7899M1743M4978M7995N1245
$$ 922811 940876 960849 983373 1009134 1038660 1072326 1110225 1151968 1196946 1244941 1296186
50960A296186N4481N6975N8337N8675N8025N6161N3070M9245M5295M1407L7277
$$ 1296186 1350667 1407642 1465979 1524654 1582679 1638840 1691910 1741155 1786450 1827857 1865134
50949A865134L2547K7367K2493J8663J5844J3404J1128R562R076R054Q525P223
$$ 1865134 1897681 1925048 1947541 1966204 1982048 1995452 2006580 2016142 2025218 2034272 2042797 2050020
50937B050020N434K946j028o581j2320j6387j8203j8978k0428k3132k6382k9481
$$ 2050020 2055454 2058400 2057372 2050791 2038471 2022084 2003881 1984903 1964475 1941343 1914961 1885480
50925A885480l2721l6699m1115m5023m8116n0870n3273n4337n3407n1206m8864
$$ 1885480 1852759 1816060 1774945 1729922 1681806 1630936 1577663 1523326 1469919 1418713 1369849
50914A369849m6571m3857m0672l7357l3919l0276k6972k4727k3344k1936k0135
$$ 1369849 1323278 1279421 1238749 1201392 1167473 1137197 1110225 1085498 1062154 1040218 1020083
50903A020083j8336j6729j4994j3121j1643j0748r915q753p587o777o039m882
$$ 1020083 1001747 985018 970024 956903 945260 934512 924597 915844 908257 901480 895441 890559
50891H90559l373j990j013l43K28Q18J378J629J386J016J277K493M174N604O528
$$ 890559 887186 885196 884183 883840 884068 884886 886264 887893 889279 890295 891572 894065 898239 903843 910371
50876I10371P125P601Q091Q762R764J1064J2401J3390J3846J4141J5051J6959
$$ 910371 917496 925097 933188 941950 951714 962778 975179 988569 1002415 1016556 1031607 1048566
50864A048566J9408K1789K4218K7175L0495L3510L6177L9269M3191M7483N1853
$$ 1048566 1067974 1089763 1113981 1141156 1171651 1205161 1241338 1280607 1323798 1371281 1423134
50853A423134N6894O3188P0221P6985Q3260Q9572R6098J02402J08204J13736J19102
$$ 1423134 1480028 1543216 1613437 1690422 1773682 1863254 1959352 2061754 2169958 2283694 2402796
50842B402796J23750J26897J28197J27688J25235J20241J12135J01016Q7685P2939
$$ 2402796 2526546 2653443 2781640 2909328 3034563 3154804 3266939 3367955 3455640 3528579
50832C528579N7117M0589K4428J0015j986j1649j8789k2692k3239k1543j8794
$$ 3528579 3585696 3626285 3650713 3660728 3658742 3647093 3628304 3605612 3582373 3560830 3542036
50821C542036j5004r663l323K294N705O436M350q98r459k0837l4244m9036o4518
$$ 3542036 3527032 3517369 3514046 3516340 3522045 3528481 3532831 3531933 3522474 3501637 3467393 3418357 3353839
50808C353839p9660r3427j05273j15066j22645j27575j29369j27889j23629j17536
$$ 3353839 3274179 3180752 3075479 2960413 2837768 2710193 2580824 2452935 2329306 2211770
50798B211770j10283j01738r1545q0196o9091n9279n0527m2028l3585k5709j8757
$$ 2211770 2101487 1999749 1908204 1828008 1758917 1699638 1649111 1607083 1573498 1547789 1529032
50787A529032j2612p237k960l2J744K706K872K086M79j322k560l000l280m468
$$ 1529032 1516420 1509183 1506223 1506191 1507935 1510641 1513513 1515599 1516078 1514756 1512196 1509196 1505916 1501448
50773A501448o970r982j2290j3580j4586j5999j7763j9557k1371k3172k4498k4909
$$ 1501448 1494478 1484496 1472206 1458626 1444040 1428041 1410278 1390721 1369350 1346178 1321680 1296771
50761A296771k4641k4220k3570k2108j9687j6913j4377j2057r706p369n296l522
$$ 1296771 1272130 1247910 1224340 1202232 1182545 1165632 1151255 1139198 1129492 1122123 1116827 1113305
50749A113305j827L6K191M659P401J0473J3989J7870K1770K5473K9235L3349L7587
$$ 1113305 1111478 1111514 1113705 1118364 1125765 1136238 1150227 1168097 1189867 1215340 1244575 1277924 1315511
50736A315511M1512M5293M9560N4396N8987O2465O4628O5702O5950O5749O5510
$$ 1315511 1357023 1402316 1451876 1506272 1565259 1627724 1692352 1758054 1824004 1889753 1955263
50725A955263O5176O4235O2470O0272N7859N4672M9935M3421L5282K5643J4842
$$ 1955263 2020439 2084674 2147144 2207416 2265275 2319947 2369882 2413303 2448585 2474228 2489070
50714B489070L686o999j6789k5226l1447l4740l5120l2841k7909k0789j3092o578
$$ 2489070 2492756 2485757 2468968 2443742 2412295 2377555 2342435 2309594 2281685 2260896 2247804 2241226
50702B241226j625K504O002Q054P968N795J627m864j3734k4163l4941m5170n4227
$$ 2241226 2239601 2242105 2248107 2256161 2264129 2269924 2271551 2266687 2252953 2228790 2193849 2148679 2094452
50689B094452o1504o6498o9010o9085o6996o3268n8364n2354m5189l7227k9095
$$ 2094452 2032948 1966450 1897440 1828355 1761359 1698091 1639727 1587373 1542184 1504957 1475862
50678A475862k1103j3204n504J735Q550J5226K1646K7351L2139L6100L8913L9921
$$ 1475862 1454759 1441555 1436051 1437786 1446336 1461562 1483208 1510559 1542698 1578798 1617711 1657632
50666A657632L9099L7352L5461L3277L0356K6821K3226J9958J7212J5176J3826
$$ 1657632 1696731 1734083 1769544 1802821 1833177 1859998 1883224 1903182 1920394 1935570 1949396
50655A949396J2793J1803J1063J0840J0874J0565R734Q907Q896J0156J2505J5419
$$ 1949396 1962189 1973992 1985055 1995895 2006769 2017334 2027068 2035975 2044871 2055027 2067532 2082951
50643B082951J8650K2398K6752L1230L5253L8766M1935M4349M5286M4711M3339
$$ 2082951 2101601 2123999 2150751 2181981 2217234 2256000 2297935 2342284 2387570 2432281 2475620
50632B475620M1717L9854L7879L6235L5022L3809L2247L0024K5983J8255N949
$$ 2475620 2517337 2557191 2595070 2631305 2666327 2700136 2732383 2762407 2788390 2806645 2812594
50621B812594r834k6940m3268n6542o4303o5411o1128n3743m4600l4245k3883
$$ 2812594 2802760 2775820 2732552 2676010 2611707 2546296 2485168 2431425 2386825 2352580 2328697
50610B328697j5190q721l683M50L007L048M95m091j0182j7418k5394l3651m1733
$$ 2328697 2313507 2304786 2301103 2301553 2304560 2307608 2308103 2304012 2293830 2276412 2251018 2217367 2175634
50597B175634m9129n5459o0584o4296o6043o5459o3106o0070n6779n2864m8308
$$ 2175634 2126505 2071046 2010462 1946166 1880123 1814664 1751558 1691488 1634709 1581845 1533537
50586A533537m4069m1122l9280l7487l5013l1977k8826k5757k2775k0001j7663
$$ 1533537 1489468 1448346 1409066 1371579 1336566 1304589 1275763 1250006 1227231 1207230 1189567
50575A189567j5749j3798j1199p765l930l76K527M884P029R246J1552J3678J5365
$$ 1189567 1173818 1160020 1148821 1141056 1137126 1136750 1139277 1144161 1151190 1160436 1171988 1185666 1201031
50562A201031J6732J8252K0280K2778K5505K8295L0984L3365L5368L7041L8255
$$ 1201031 1217763 1236015 1256295 1279073 1304578 1332873 1363857 1397222 1432590 1469631 1507886
50551A507886L8708L8414L7921L7682L7530L6988L5925L4624L3438L2741L2950
$$ 1507886 1546594 1585008 1622929 1660611 1698141 1735129 1771054 1805678 1839116 1871857 1904807
50540A904807L4286L6636L9901M4242M9605N5277O0403O4831O9081P3591P8375
$$ 1904807 1939093 1975729 2015630 2059872 2109477 2164754 2225157 2289988 2359069 2432660 2511035
50529B511035Q3316Q8353R3476R8729J04131J09221J13016J14850J14969J13811
$$ 2511035 2594351 2682704 2776180 2874909 2979040 3088261 3201277 3316127 3431096 3544907
50519C544907J10953J05501R7320Q7095P5130O1005M4686K7086R065r520k9005
$$ 3544907 3655860 3761361 3858681 3945776 4020906 4081911 4126597 4153683 4162748 4153228 4124223
50508D124223m8552o6319q1031r2804j02254j09222j12617j11377j05392r5522
$$ 4124223 4075671 4009352 3928321 3835517 3733263 3624041 3511424 3400047 3294655 3199133
50498C199133q2962o8627n3041l6535j9504k696J2757K5723L5576M2010M4314
$$ 3199133 3116171 3047544 2994503 2957968 2938464 2935768 2948525 2974248 3009824 3051834 3096148
50487C096148M1337L2520J8691J359j8468m0221o2636q3399j00255j12205j19605
$$ 3096148 3137485 3170005 3188696 3190055 3171587 3131366 3068730 2985331 2885076 2772871 2653266
50476B653266j23331j24093j22215j17891j11569j03995r5799q7228p8458o9975
$$ 2653266 2529935 2405842 2283627 2165736 2054167 1950172 1854373 1767145 1688687 1618712
50466A618712o2283n5405m8974m2762l6812l1251k6377k2673k0235j8305j5970
$$ 1618712 1556429 1501024 1452050 1409288 1372476 1341225 1314848 1292175 1271940 1253635 1237665
50455A237665j3336j1341j0316r398p604m988k304K5K127M222O341Q417J0431
$$ 1237665 1224329 1212988 1202672 1193274 1185670 1180682 1178378 1178403 1180530 1184752 1191093 1199510 1209941
50442A209941J2380J4201J5613J6093J5310J3663J2037J0958J0230R569R152R360
$$ 1209941 1222321 1236522 1252135 1268228 1283538 1297201 1309238 1320196 1330426 1339995 1349147 1358507
50430A358507J0295J1770J3485J4967J5726J5809J5892J6492J7287J7651J7701
$$ 1358507 1368802 1380572 1394057 1409024 1424750 1440559 1456451 1472943 1490230 1507881 1525582
50419A525582J8290J9974K2478K5254K8237L1772L6041M0874M5993N1091N5641
$$ 1525582 1543872 1563846 1586324 1611578 1639815 1671587 1707628 1748502 1794495 1845586 1901227
50408A901227N8930O0557O0800O0252N9163N7380N4895N1920M8303M3292L6355
$$ 1901227 1960157 2020714 2081514 2141766 2200929 2258309 2313204 2365124 2413427 2456719 2493074
50397B493074K7916J8815R202j474j3446k6082l8389m9563n8970o6072p0673p2899
$$ 2493074 2520990 2539805 2549007 2547533 2534087 2508005 2469616 2420053 2361083 2295011 2224338 2151439
50385B151439p2751o9993o4673n7470m9221m0370l1066k1592j2370l702M199J0921
$$ 2151439 2078688 2008695 1944022 1886552 1837331 1796961 1765895 1744303 1731933 1728231 1732430 1743351
50373A743351J5845J8457J8623J6484J2168N660k864j2619k2407l1340l9168m5724
$$ 1743351 1759196 1777653 1796276 1812760 1824928 1830588 1827724 1815105 1792698 1761358 1722190 1676466
50361A676466n0473n3053n3890n3673n2460m9992m6789m4027m2114m0172l7304
$$ 1676466 1625993 1572940 1519050 1465377 1412917 1362925 1316136 1272109 1229995 1189823 1152519
50350A152519l3659k9920k6302k2647j8917j5048j0659n639o86L252N970P820
$$ 1152519 1118860 1088940 1062638 1039991 1021074 1006026 995367 989728 989042 992294 998264 1006084
50338A006084Q701P789M474p72o517j1172j3858j4778j4767j4318j3246j1336
$$ 1006084 1014785 1022574 1027048 1026276 1019759 1008587 994729 979951 965184 950866 937620 926284
50326I26284q972o719m675k611n34J411L347N401P152P983P990P888P973P753
$$ 926284 917312 910593 905918 903307 902773 904184 907531 912932 920084 928067 936057 943945 951918 959671
50312I59671O898N917N520N694N901N953O194O893P867Q813R665J0462J1090J1377
$$ 959671 966569 972486 978006 983700 989601 995554 1001748 1008641 1016508 1025321 1034986 1045448 1056538 1067915
50298A067915J1436J1690J2438J3615J5101J7008J9400K1840K3756K5247K6955
$$ 1067915 1079351 1091041 1103479 1117094 1132195 1149203 1168603 1190443 1214199 1239446 1266401
50287A266401K8744K9095K6275J9811J0379j179j3724k4973l2148l4084l2043
$$ 1266401 1295145 1324240 1350515 1370326 1380705 1379526 1365802 1340829 1308681 1274597 1242554
50276A242554k7961k2592j6077r498m620k031n76J014K721L868M393M769N030
$$ 1242554 1214593 1192001 1175924 1166426 1161806 1159775 1159199 1160213 1162934 1166802 1171195 1175964 1180994
50263A180994M784M134L823M309N213O102P221R028J1382J3735J5976J8508K1585
$$ 1180994 1185778 1189912 1193735 1198044 1203257 1209359 1216580 1225608 1236990 1250725 1266701 1285209 1306794
50250A306794K4979K8381L1594L4188L5511L5326L4154L2671L1056K9155K7057
$$ 1306794 1331773 1360154 1391748 1425936 1461447 1496773 1530927 1563598 1594654 1623809 1650866
50239A650866K5152K3698K2649K1704K0345J7865J3627P402n88r748j9143k7722
$$ 1650866 1676018 1699716 1722365 1744069 1764414 1782279 1795906 1803308 1802720 1792972 1773829 1746107
50227A746107l4837m0324m3999m5342m4133m1127l7622l4351l1278k8440k6431
$$ 1746107 1711270 1670946 1626947 1581605 1537472 1496345 1458723 1424372 1393094 1364654 1338223
50216A338223k5875k6820k8856l1405l3716l4959l4751l3425l1520k9155k6227
$$ 1338223 1312348 1285528 1256672 1225267 1191551 1156592 1121841 1088416 1056896 1027741 1001514
50205A001514k2995k0047j7669j5556j3258j0765q578p364p437q372r151q995
$$ 1001514 978519 958472 940803 925247 911989 901224 892646 885282 877845 869473 860322 851327
50193H51327q110p386p263p208o487n198m115l682l566l292k923k802k925k849
$$ 851327 843217 835831 828568 821360 814873 809675 805560 801878 798312 795020 792097 789295 786370 783521
50179G83521k241j249l40J38K00J79M40R97J434J371R92R19J506K440L253L981
$$ 783521 781280 780031 779691 779829 780029 780208 780648 781645 783079 784450 785442 786361 787867 790307 793560 797541
50163G97541N041O466P576P693O974O345O550P542Q770R821J0634J1286J1939
$$ 797541 802582 809048 816624 824317 831291 837636 844186 851728 860498 870319 880953 892239 904178
50150I04178J2837J3987J4858J4749J3654J2444J2025J2556J3712J5311J7372
$$ 904178 917015 931002 945860 960609 974263 986707 998732 1011288 1025000 1040311 1057683
50139A057683J9814K2636K6272L1328L7901M5446N3285O0878O7672P3091P6802
$$ 1057683 1077497 1100133 1126405 1157733 1195634 1241080 1294365 1355243 1422915 1496006 1572808
50128A572808P8618P8149P5114P0205O5121O1235N8486N5901N2869M9447M5506
$$ 1572808 1651426 1729575 1804689 1874894 1940015 2001250 2059736 2115637 2168506 2217953 2263459
50117B263459M0168L2255K1150P212q448k4467l9685n3250o4451p2742p8048q0862
$$ 2263459 2303627 2335882 2357032 2364244 2355796 2331329 2291644 2238394 2173943 2101201 2023153 1942291
50105A942291q1730q0726p7716p2987o7373o1642n6113n0935m6433m2843l9924
$$ 1942291 1860561 1779835 1702119 1629132 1561759 1500117 1444004 1393069 1346636 1303793 1263869
50094A263869l7135l4301l1743k9635k7488k4631k1086j7560j4517j1650q500
$$ 1263869 1226734 1192433 1160690 1131055 1103567 1078936 1057850 1040290 1025773 1014123 1005623
50083A005623n285k709j149m06j68k32k99J1P64J642K339K774K848K397J536O76
$$ 1005623 1000338 997629 996480 996074 995906 995674 995375 995386 996150 997792 1000131 1002905 1005753 1008150 1009686 1010362
50067A010362M9m60r09j072r21q88j335k024k557l031l808m817n621o024o157
$$ 1010362 1010411 1009951 1009042 1007970 1007049 1006161 1004826 1002802 1000245 997214 993406 988589 982968 976944 970787
50052I70787n935n042l572k226j563j344q83J48J557L102M760O512Q166R570J0879
$$ 970787 964852 959810 956238 954012 952449 951105 950222 950370 951927 955029 959789 966301 974467 984037 994916
50037I94916J2303J3717J4721J5239J5697J6438J7219J7642J7901J8476J9155
$$ 994916 1007219 1020936 1035657 1050896 1066593 1083031 1100250 1117892 1135793 1154269 1173424
50026A173424J8999J7627J5916J4939J4625J4130J3317J3133J4439J7019J9954
$$ 1173424 1192423 1210050 1225966 1240905 1255530 1269660 1282977 1296110 1310549 1327568 1347522
50015A347522K2522K4436K5579K5995K6096K6524K7635K9147L0337L0533K9470
$$ 1347522 1370044 1394480 1420059 1446054 1472150 1498674 1526309 1555456 1585793 1616326 1645796
50004A645796K7357K4706K2206K0517J9979K0315K0650J9833J6781J0727J484
$$ 1645796 1673153 1697859 1720065 1740582 1760561 1780876 1801526 1821359 1838140 1848867 1850351
49993A850351j0281k3140l5469m6072n4419o0482o4417o6319o6220o4354o1302
$$ 1850351 1840070 1816930 1781461 1735389 1680970 1620488 1556071 1489752 1423532 1359178 1297876
49982A297876n7664n3615m9027m4010l9030l4393k9946k5510k1358j7989j5617
$$ 1297876 1240212 1186597 1137570 1093560 1054530 1020137 990191 964681 943323 925334 909717
49971I09717j3973j2586j1142r731q747q370q141p376n990m573l529k592j401
$$ 909717 895744 883158 872016 862285 853538 845168 837027 829651 823661 819088 815559 812967 811566
49958H11566n5J211K502L991N535O945Q308R634J0531J0678J0362R915Q956O888
$$ 811566 811511 812722 815224 819215 824750 831695 840003 849637 860168 870846 881208 891123 900079 906967
49944I06967M040J571J65o72j786l451n370p166q605r701j0834j2514j4770j6977
$$ 906967 911007 912578 912743 912071 910285 906834 901464 894298 885693 875992 865158 852644 837874 820897
49930H20897j8369j8609j7816j6307j4427j2448j0481q515o569m745l169j870
$$ 820897 802528 783919 766103 749796 735369 722921 712440 703925 697356 692611 689442 687572
49918F87572o79P55K570M263N048M805M318M329M794N413O324P644Q881R580J0241
$$ 687572 686893 687648 690218 694481 699529 704334 708652 712981 717775 723188 729512 737156 746037 755617 765858
49903G65858J1683J3621J4885J5045J4776J4473J3530J1505R050P014N282L151
$$ 765858 777541 791162 806047 821092 835868 850341 863871 875376 884426 891440 896722 899873
49891H99873M06k664n869r097j1929j3935j5236j6224j6855j6664j5501j3879
$$ 899873 900279 897615 891746 882649 870720 856785 841549 825325 808470 791806 776305 762426
$$ [...]
##END NTUPLES=NMR SPECTRUM
##END=
