##TITLE=AC1735_SEN00008_9276063_m2krqmUzbs
##JCAMPDX= 6.0         $$ Bruker NMR JCAMP-DX V2.0
##DATA TYPE= NMR SPECTRUM
##DATA CLASS= NTUPLES
##ORIGIN= BRUKER
##OWNER= Administrator
$$ 1.72 TOPSPIN		Version 2.1
$$ 2015-07-18 22:40:05.307 -0700  Administrator@X
$$ Compression mode = diff/dup
##.OBSERVE FREQUENCY= 400.02188249412
##.OBSERVE NUCLEUS= ^1H
##.ACQUISITION MODE= SIMULTANEOUS (DQD)
##.ACQUISITION SCHEME= undefined
##.AVERAGES= 8
##.DIGITISER RES= 22
##SPECTROMETER/DATA SYSTEM= spect
##.PULSE SEQUENCE= zg30
##.SOLVENT NAME= COFFEE_meoh
##.SHIFT REFERENCE= INTERNAL, COFFEE_meoh, 1, 14.98509
##AUDIT TRAIL= $$ (NUMBER, WHEN, WHO, WHERE, PROCESS, VERSION, WHAT)
$$ ##TITLE= Audit trail, TOPSPIN		Version 2.1
$$ ##JCAMPDX= 5.01
$$ ##ORIGIN= Bruker BioSpin GmbH
$$ ##OWNER= Administrator
$$ $$ E:\/data/COFFEE/nmr/AC1735_SEN00008_9276063_m2krqmUzbs/20/pdata/1/auditp.txt
$$ ##AUDIT TRAIL=  $$ (NUMBER, WHEN, WHO, WHERE, PROCESS, VERSION, WHAT)
(   1,<2015-07-18 22:39:57.854 -0700>,<Administrator>,<X>,<go>,<TOPSPIN 2.1>,
      <created by zg
	started at 2015-07-18 22:38:51.260 -0700,
	POWCHK enabled, PULCHK disabled,
       configuration hash MD5:
       21 0F 79 D6 B3 7B B4 F6 88 20 88 DB 03 48 BD 9F
       data hash MD5: 64K
       98 80 5E 91 27 CB 3F 6D 7C FE 2C 4D F1 9A 5E 01>)
(   2,<2015-07-18 22:40:01.057 -0700>,<Administrator>,<X>,<proc1d>,<TOPSPIN 2.1>,
      <Start of raw data processing
       efp LB = 0 FT_mod = 6 PKNL = 1 PHC0 = 0 PHC1 = 0 SI = 32K 
       data hash MD5: 32K
       1A C2 45 53 34 10 4D 6C 5B 0C 2A 73 65 31 5D 3F>)
(   3,<2015-07-18 22:40:01.354 -0700>,<Administrator>,<X>,<proc1d>,<TOPSPIN 2.1>,
      <pk PHC0 = 88.75305 PHC1 = 0 
       data hash MD5: 32K
       BE C5 A0 FC 97 05 3D 85 03 C7 20 A4 D5 1F 52 16>)
(   4,<2015-07-18 22:40:01.463 -0700>,<Administrator>,<X>,<proc1d>,<TOPSPIN 2.1>,
      <abs ABSG = 1 
       data hash MD5: 32K
       A3 6E BF 7F 63 35 23 35 EC 2D D3 E7 E1 34 6B 66>)
(   5,<2015-07-18 22:40:01.541 -0700>,<Administrator>,<X>,<proc1d>,<TOPSPIN 2.1>,
      <abs ABSG = 2 
       data hash MD5: 32K
       D1 3C 20 41 5C 2C 95 31 06 87 1C D9 0E 19 B0 5D>)
(   6,<2015-07-18 22:40:01.588 -0700>,<Administrator>,<X>,<proc1d>,<TOPSPIN 2.1>,
      <abs ABSG = 3 
       data hash MD5: 32K
       3D 26 F7 45 87 DF A6 98 99 53 4C E6 FE 6E A8 FC>)
(   7,<2015-07-18 22:40:01.650 -0700>,<Administrator>,<X>,<proc1d>,<TOPSPIN 2.1>,
      <abs ABSG = 4 
       data hash MD5: 32K
       6A 26 93 96 10 77 C9 10 64 12 28 78 11 53 6E E0>)
(   8,<2015-07-18 22:40:01.713 -0700>,<Administrator>,<X>,<proc1d>,<TOPSPIN 2.1>,
      <abs ABSG = 5 
       data hash MD5: 32K
       95 91 2A 00 78 73 BB 93 C5 69 D6 B1 1F E8 2B 0C>)
$$ ##END=
$$ 
$$ $$ hash MD5
$$ $$ A8 28 23 2E 87 75 CB DD 3D D7 E8 26 87 FE 55 CD
##$RELAX= 
##$RELAX= 
##$RELAX= 
##$RELAX= 
##$RELAX= 
##$RELAX= 
##$RELAX= 
$$ Bruker specific parameters
$$ --------------------------
##$DU= <E:\>
##$EXPNO= 20
##$NAME= <AC1735_SEN00008_9276063_m2krqmUzbs>
$$ [...]
##$TP= (0..7)
150 150 150 150 150 150 150 150
##$TP07= 0
##$TPNAME0= <>
##$TPNAME1= <>
##$TPNAME2= <>
##$TPNAME3= <>
##$TPNAME4= <>
##$TPNAME5= <>
##$TPNAME6= <>
##$TPNAME7= <>
##$TPOAL= (0..7)
0.5 0.5 0.5 0.5 0.5 0.5 0.5 0.5
##$TPOFFS= (0..7)
0 0 0 0 0 0 0 0
##$TUNHIN= 0
##$TUNHOUT= 0
##$TUNXOUT= 0
##$USERA1= <user>
##$USERA2= <user>
##$USERA3= <user>
##$USERA4= <user>
##$USERA5= <user>
##$V9= 5
##$VALIST= <valist>
##$VCLIST= <CCCCCCCCCCCCCCC>
##$VD= 0
##$VDLIST= <DDDDDDDDDDDDDDD>
##$VPLIST= <PPPPPPPPPPPPPPP>
##$VTLIST= <TTTTTTTTTTTTTTT>
##$WBST= 2048
##$WBSW= 25
##$XGAIN= (0..3)
0 0 0 0
##$XL= 0
##$YL= 0
##$YMAX_a= 599722
##$YMIN_a= -515574
##$ZGOPTNS= <>
##$ZL1= 120
##$ZL2= 120
##$ZL3= 120
##$ZL4= 120
##$ABSF1= 14.98509
##$ABSF2= -5.573092
##$ABSG= 5
##$ABSL= 3
##$ALPHA= 0
##$AQORDER= 0
##$ASSFAC= 0
##$ASSFACI= 0
##$ASSFACX= 0
##$ASSWID= 0
##$AUNMP= <proc_prof1d_extract_pilot.lims>
##$AXLEFT= 0
##$AXNAME= <>
##$AXNUC= <1H>
##$AXRIGHT= 0
##$AXTYPE= 0
##$AXUNIT= <>
##$AZFE= 0.1
##$AZFW= 0.1
##$BCFW= 0
##$BC_mod= 0
##$BYTORDP= 0
##$COROFFS= 0
##$CY= 15
##$DATMOD= 1
##$DC= 0
##$DFILT= <>
##$DTYPP= 0
##$F1P= 0
##$F2P= 0
##$FCOR= 0.5
##$FTSIZE= 32768
##$FT_mod= 6
##$GAMMA= 0
##$GB= 0
##$INTBC= 1
##$INTSCL= 1
##$ISEN= 128
##$LB= 0
##$LEV0= 0
##$LPBIN= 0
##$MAXI= 10000
##$MC2= 0
##$MEAN= 0
##$ME_mod= 0
##$MI= 0
##$NCOEF= 0
##$NC_proc= -8
##$NLEV= 6
##$NOISF1= 0
##$NOISF2= 0
##$NSP= 0
##$NTH_PI= 0
##$NZP= 0
##$OFFSET= 14.98509
##$PC= 1
##$PHC0= 88.75305
##$PHC1= 0
##$PH_mod= 1
##$PKNL= yes
##$PPARMOD= 0
##$PPDIAG= 0
##$PPIPTYP= 0
##$PPMPNUM= 2147483647
##$PPRESOL= 1
##$PSCAL= 4
##$PSIGN= 0
##$PYNMP= <proc.py>
##$REVERSE= no
##$SF= 400.02
##$SI= 32768
##$SIGF1= 0
##$SIGF2= 0
##$SINO= 400
##$SIOLD= 32768
##$SPECTYP= <>
##$SREGLST= <1H.CDCl3>
##$SSB= 0
##$STSI= 32768
##$STSR= 0
##$SW_p= 8223.68421052631
##$SYMM= 0
##$S_DEV= 0
##$TDeff= 65536
##$TDoff= 0
##$TI= <>
##$TILT= no
##$TM1= 0
##$TM2= 0
##$TOPLEV= 0
##$USERP1= <user>
##$USERP2= <user>
##$USERP3= <user>
##$USERP4= <user>
##$USERP5= <user>
##$WDW= 1
##$XDIM= 32768
##$YMAX_p= 321421369
##$YMIN_p= -770139
##$CURPLOT= <Network HP LaserJet P1505>
##$CURPRIN= <$Network HP LaserJet P1505>
##$DFORMAT= <normdp>
##$LAYOUT= <+/1D_H.xwp>
##$LFORMAT= <normlp>
##$PFORMAT= <normpl>
##$SURQMSG= 1
$$ End of Bruker specific parameters
$$ ---------------------------------
##NTUPLES= NMR SPECTRUM
##VAR_NAME=  FREQUENCY,     SPECTRUM/REAL,   SPECTRUM/IMAG
##SYMBOL=    X,             R,               I
##VAR_TYPE=  INDEPENDENT,   DEPENDENT,       DEPENDENT
##VAR_FORM=  AFFN,          ASDF,            ASDF
##VAR_DIM=   32768,         32768,           32768
##UNITS=     HZ,            ARBITRARY UNITS, ARBITRARY UNITS
##FACTOR=    0.250966925370066, 1,           1
##FIRST=     8223.43324360094, -118052,      3934
##LAST=      0,             -69414,          6910
##MIN=       0,             -770139,         0
##MAX=       8223.43324360094, 321421369,    0
$$ Real data points
##PAGE= N=1
##DATA TABLE= (X++(R..R)), XYDATA
$$ [...]
$$ plain form
19547 -48964 -271918 -26226 174081 -165951 60482 138266 -22028 -67303 50990 56896 -48845
19535 176698 -245679 169243 -248241 -250839 -7693 -178110 171662 -239754 102977 -282491
19524 -150768 341961 -21481 -157492 -134554 -179450 147728 120264 -9758 -56780 130039 -128314
19512 -77459 -161793 -132474 -127876 -30849 -209374 123516 44364 107848 -212843 -147520 -261374
19501 -261374 21819 -208746 77512 -339018 36081 -148582 51215 -144351 -90043 -56811 -239197
19490 -239197 71254 -186008 -264131 -67387 41096 -287983 189991 156076 -87669 128981 220570
19479 220570 -144747 -74978 -117261 -507587 -164807 -38720 86736 46439 -93715 -101096 52641
19467 -307791 -115999 -169608 -251209 382329 -36648 -84068 66228 -124273 -219241 -326003 -33292
$$ packed form
19547d8964k22954b6226A74081a65951F0482P7784b2028m5275E0990N906d8845
19535A76698b45679A69243b48241k598g693j70417A71662b39754A02977b82491
19524a50768C41961b1481j36011K2938m4896A47728k7464i758m7022A30039a28314
19512g7459q4334K9319M598c0849j78525A23516D4364O3484b12843O5323j13854
19501b61374B1819b08746G7512c39018C6081a48582E1215a44351N4308L3232j82386
19490b39197G1254a86008p8123f7387D1096b87983A89991l3915h7669A28981R1589
19479B20570a44747O9769m2283l90326a64807c8720H6736m0297i3715p381E2641
19467c07791a15999n3609q1601C82329c6648m7420F6228a24273r4968j06762c3292
$$ plain form
19455 40495 127728 -310351 -136383 218659 76520 -87444 -342786 -150697 -53957 35262 8078
19443 -115106 110624 -128425 -30516 136995 -34360 -284776 -76135 -29465 -205843 8286 -149787
19431 191011 159630 -9989 12050 20583 31576 -354161 32612 22942 70783 -262650 -280180 -184990
19419 -184990 261940 -305097 -34301 -75125 -150887 301329 15963 -227081 74407 -206411
19408 -142182 82799 403636 10510 -373579 57641 -121708 -183678 -28891 -186181 -259025 -367872
19397 -367872 -316049 -102057 92099 133766 -8540 21004 -265828 284115 -173291 -100223 -92052
19386 -92052 -31493 -102073 49630 -184434 -252234 -314090 -233629 -13661 -330144 12905 -349543
19374 415526 146293 -21571 -200578 26974 -356882 29163 117527 70459 -13042 -141465 105662
$$ packed form
19455D0495Q7233c10351a36383B18659G6520h7444k55342a50697e3957C5262H078
19443a15106A10624a28425c0516A36995c4360k50416g6135b9465j76378H286a49787
19431A91011l1381i989A2050Q533J0993c54161C2612r670M7841b62650j7530R5190
19419a84990B61940c05097c4301m0824p5762C01329A5963b27081G4407b06411
19408a42182H2799L20837A0510c73579E7641a21708o1970b8891j57290p2844j08847
19397c67872N1823a02057I2099M1667h540B1004b65828B84115a73291P3068Q171
19386i2052c1493p0580D9630a84434o7800o1856Q0461a3661l16483A2905c49543
19374D15526A46293b1571j79007B6974c56882B9163Q8364m7068a3042j28423A05662
$$ plain form
19362 -112590 -50530 -16444 -119064 -223135 -61322 -254495 191778 -177013 282153 -193244
19351 -51003 42049 11290 -22066 13268 -221669 -174151 83975 262 116003 -261615 -224648
19340 -224648 -158420 36757 48397 -66330 -252627 -172123 -16241 -112739 126531 76407 -299241
19328 -35839 -178908 61685 37905 34260 -187825 -156402 -141819 -191666 -152838 -69539 82342
19316 181365 -43045 191899 -345002 142308 69593 -101620 -172615 187731 -340012 -230896
19306 -230896 -111372 25135 -204871 -27945 -12078 194762 -212123 -464865 163730 24457
19295 329559 -80126 34073 -83240 -1011 -142669 -31968 229595 102692 -50890 -48718 -145341
19284 -145341 68623 -154950 -166250 -339908 -67192 286372 -51692 -293856 113292 116730 112597
$$ packed form
19362a12590e0530a6444j02620j04071f1322j93173A91778a77013B82153a93244
19351e1003D2049A1290b2066A3268b21669M7518H3975B62J15741b61615L6967
19340b24648O6228C6757J1640f6330j86297Q0504a6241r6498A26531n0124b99241
19328c5839j43069F1685k3780l645a87825L1423J4583m9847L8828f9539H2342
19316A81365d3045A91899c45002A42308F9593a01620p0995A87731c40012J09116
19306b30896a11372B5135b04871b7945a2078A94762b12123k52742A63730B4457
19295C29559h0126C4073h3240a011j41658c1968B29595A02692e0890K172r6623
19284a45341F8623a54950j1300j73658f7192B86372e1692k42164A13292L438m133
$$ plain form
19273 112597 139392 155759 -224540 -35810 96169 -44802 -9596 137418 -287393 -48378 -335935
19262 -335935 -338097 -152603 82149 113950 -54012 -217524 123461 29514 -29247 -261879 -177759
19251 -177759 -321578 59965 -97596 -207080 19582 -145623 118879 -16942 -42383 -127742 64249
19239 -12381 -220748 -19200 -187626 -53917 291888 67839 -370929 -42647 -9934 -83725 -174105
19228 -174105 44530 -356221 10390 -88131 275202 131854 -134502 -102394 -181198 -181636 106286
19216 68815 157333 -73817 74802 -198330 -187787 -301828 -240734 123723 52128 -161624 -252855
19205 -252855 -29398 -233335 -348479 -113789 32197 -29988 -437258 -168322 -86286 -367598
19195 -367598 -186532 -117684 -118395 101777 186651 230376 -175542 -197850 -66605 266316 180915
$$ packed form
19273A12597K6795J6367b24540c5810I6169d4802i596A37418b87393d8378k87557
19262c35935k162a52603H2149L1801e4012j63512A23461B9514b9247k32632Q4120
19251a77759j43819E9965i7596j09484A9582a45623A18879a6942k5441q5359F4249
19239a2381k08367a9200j68426e3917B91888F7839c70929d2647i934p3791r0380
19228a74105D4530c56221A0390h8131B75202A31854a34502L2108p8804m38A06286
19216F8815Q8518g3817G4802a98330J0543j14041O1094A23723E2128a61624r1231
19205b52855b9398k03937j15144a13789C2197b9988m07270a68322Q2036k81312
19195c67598J81066O8848p11A01777Q4874M3725a75542k2308f6605B66316q5401
$$ plain form
19184 180915 -142987 -45402 -14881 74370 370089 -72145 114991 -16204 471717 -130928
19173 115365 -281381 267875 -166974 -74028 -191505 -60931 -285201 38928 219413 -342778
19162 93209 -402573 -137531 -268408 -309491 -79005 -14381 -264011 -116935 94581 99176 -220612
19150 -166688 -108416 -135071 179739 60754 -233745 -32176 -175669 12269 -359337 89563 -30587
19138 -12781 -274450 -125233 83342 378314 32464 -117040 54803 -283027 -162510 -239175
19128 -239175 -61417 -158178 -117843 135192 -344810 113981 84419 255318 -243609 174253
19117 129505 -141050 -183531 -119489 -329763 -177725 316009 107821 -381587 391274 -23936
19106 14320 -49028 154834 -182301 -97767 -69885 -427261 -137148 -337268 -123713 -22739
$$ packed form
19184A80915a42987d5402a4881G4370K95719g2145A14991a6204D71717a30928
19173A15365b81381B67875a66974g4028j17477f0931k24270C8928J80485c42778
19162I3209d02573a37531j30877m1083g9005a4381k49630a16935I4581M595b20612
19150a66688N8272k6655A79739F0754b33745c2176j43493A2269c59337H9563c0587
19138a2781k61669a25233H3342K94972C2464a17040E4803b83027J20517p6665
19128b39175f1417r6761M0335A35192c44810A13981k9562J70899b43609A74253
19117A29505a41050m2481O4042k10274J52038C16009A07821c81587C91274b3936
19106A4320d9028A54834a82301Q4534K7882l57376a37148k00120a23713b2739
$$ plain form
19095 269581 -56250 89637 -364308 72327 -235985 -100634 66118 -40624 31175 68806 -26
19083 -72537 -299856 -204439 -3449 30021 -131317 -73517 -25932 -135129 35238 -125252 289887
19071 -188260 288814 3937 83250 301406 -132912 82213 -120302 -211371 189443 67347 -148597
19059 46654 -244983 -115221 173789 55328 92500 -590 -65858 65655 -81673 70284 -29644
19047 -70658 -224357 297566 119566 -90349 36844 138087 122975 -290255 -68002 115252
19036 272158 -236291 -36631 -105137 26795 284709 -218203 -137234 -383454 320906 322920 22934
19024 369668 5290 214155 178202 291784 -159008 36075 -216718 -133041 2856 191396 134386
19013 134386 -654438 -189772 -117263 113301 75315 -32785 -65741 -80454 158537 -187277
$$ packed form
19095B69581e6250H9637c64308G2327b35985a00634F6118d0624C1175L7631b6
19083g2537k27319R5417c449C0021a31317N7800b5932j09197C5238a25252B89887
19071a88260B88814C937P9313K18156a32912H2213a20302r1069A89443F7347a48597
19059D6654b44983a15221A73789E5328L7172e90o5268F5655h1673G0284b9644
19047g0658j53699B97566A19566i0349C6844J01243j5112b90255f8002A15252
19036B72158b36291c6631o8506B6795K57914b18203Q0969k46220C20906K014B2934
19024C69668E290K08865l5953J13582a59008C6075b16718Q3677B856J88540n7010
19013A34386f54438a89772P2509A13301l7986c2785l2956j4713A58537a87277
$$ plain form
19002 302303 61728 -67268 34025 -94886 -65514 -378986 -112145 -236618 114877 -293189
18991 -143831 -3683 524565 -200848 -17904 -176839 -208836 -27422 -46809 -37163 -229342 31140
18979 -144947 -4492 -143851 219508 88355 69814 -102654 -41509 -116448 -183365 -239646 62922
18967 -445749 -50641 -105572 165170 -195936 -35249 -275016 127541 217327 -45859 57720 -178777
18955 -59669 -146636 -5412 304704 -87527 -41708 -166773 121899 11283 31935 -76840 -466981
18944 -466981 141360 -129236 -13379 -87787 3189 691 -50274 24057 -128960 -34966 -46053
18933 -46053 -215422 61825 191617 22288 -278132 191094 -4018 45294 -71126 39315 -238308
18921 68965 196551 -139064 -255688 170107 101546 -25350 67934 -55483 -97608 -195384 -63925
$$ packed form
19002C02303F1728f7268C4025i4886K9372l13472a12145j24473A14877b93189
18991a43831c683E24565b00848a7904j58935l1997b7422j9387R646j92179C1140
18979a44947d492j39359B19508H8355j8541a02654d1509p4939o6917n6281F2922
18967d45749e0641n4931A65170a95936c5249k39767A27541Q9786d5859E7720a78777
18955e9669q6967e412C04704h7527d1708j25065A21899A1283K0652g6840l90141
18944d66981A41360a29236a3379p4408C189F91e0274B4057a28960c4966j1087
18933d6053j69369F1825J29792B2288b78132A91094d018D5294g1126C9315b38308
18921F8965J27586a39064j16624A70107o8561b5350F7934e5483m2125r7776f3925
$$ plain form
18909 -143499 26950 -139437 65471 -265353 294193 -80396 488906 -120916 202537 187062
18899 187062 -119439 -144991 -282652 -225517 52110 -208331 -320994 -15209 -69107 143799
18888 198944 -219103 276161 -182457 176975 -198287 15639 -135975 69308 -4700 157736
18877 -440110 -195088 -271475 61760 396914 -23130 -104511 -281257 146116 50929 -121400
18866 -237686 -112137 -211638 -240188 -284871 -100274 -99287 -151651 -237135 -248284 -68204 -8044 -330873
18854 -330873 -47398 60219 -77615 79452 228578 -295440 -264037 -229666 43508 251567 96598
18842 -168256 -166456 -83352 151993 57967 -4630 -120418 383594 22437 -381059 -140296 104957
18830 -17189 -265731 -415484 15490 -173957 -108730 -100317 38999 -108464 -162884 236615 52945
$$ packed form
18909a43499B6950a39437F5471b65353B94193h0396D88906a20916B02537j5475
18899A87062a19439k5552j37661N7135E2110b08331j12663a5209n3898A43799
18888A98944b19103B76161a82457A76975a98287A5639a35975F9308d700A57736
18877d40110a95088p6387F1760L35154b3130q1381j76746A46116E0929a21400
18866b37686a12137r9501k8550m4683a00274R87n2364q5484j1149f8204h044l22829
18854c30873d7398F0219g7615G9452J49126b95440L1403L4371D3508K08059I6598
18842a68256J800Q3104A51993E7967d630j15788C83594B2437c81059a40296A04957
18830a7189k48542j49753A5490a73957O5227Q413C8999a08464n4420B36615E2945
$$ plain form
18818 -95980 67914 151977 204246 114938 -172114 -395123 -45615 -212227 130347 -58638 1593
18806 90599 -257943 -61578 -103368 65810 -188436 -60097 -1260 52720 16067 -131604 -27386
18794 -6995 182035 135316 -102288 64328 -201425 69764 -73328 21742 -29768 -118266 -283994
18783 -283994 56460 140191 122932 309816 -233389 -37502 -56235 -76135 -324612 95386 -118390
18771 -153138 -149849 3018 -251052 -224933 -87154 161710 -170330 84298 113935 -75784 -411981
18760 -411981 -83829 10536 40472 -46537 -213160 345166 -162892 329332 -168056 -104848
18750 -104848 -49350 -224766 13982 -187659 -10516 -210627 98279 196844 -168380 -20063 -344257
18739 -344257 189530 104843 -110173 -280874 33323 -85633 -124775 -194966 -75964 179454 -205224
$$ packed form
18818i5980F7914Q4063N2269q9308a72114k23009d5615j66612A30347e8638A593
18806I0599b57943f1578m1790F5810a88436f0097a260E2720A6067a31604b7386
18794f995A82035m6719a02288F4328b01425F9764g3328B1742b9768q8498j65728
18783b83994E6460Q3731j7259J86884b33389c7502j8733j9900k48477I5386a18390
18771a53138L289C018b51052K6119h7154A61710a70330H4298K9637g5784l36197
18760d11981h3829A0536K9936d6537j66623C45166a62892C29332a68056O3208
18750a04848d9350j75416A3982a87659a0516k00111I8279R8565a68380b0063l24194
18739c44257A89530q4687a10173j70701C3323h5633l9142p0191g5964A79454b05224
$$ plain form
18727 -57190 -98834 -206590 -55328 106135 68346 104821 75624 31253 8562 -196261 -134098
18716 -134098 82909 -100103 -208651 122752 189342 -100770 36623 3019 277751 -52160 -96491
18705 -96491 -19150 367255 17194 22652 249828 1607 16344 -186478 -353294 56030 105239
18694 105239 81111 -252565 -67695 -151006 -126516 152348 -325236 -43204 72673 264478 71688
18682 -503385 18863 -36807 233110 9496 -51078 76447 -346874 135148 -103541 6210 8780
18671 8780 53706 -359405 97681 216286 21273 -146706 40091 -99541 -30665 270573 -78057
18659 -206729 -472145 -74296 -143306 183902 190846 71254 -103888 -392381 -39947 -68119 136513
18647 -209399 -182977 178615 -3730 -127033 -128703 -130545 50338 -498240 -48002 -308681 -157093
$$ packed form
18727e7190m1644j07756e5328A06135l7789L6475k9197C1253H562a96261O2163
18716a34098H2909a00103j08548A22752O6590a00770C6623C019K74732e2160m4331
18705i6491a9150C67255A7194N458K27176A607J4737a86478j66816E6030M9209
18694A05239k4128b52565f7695q3311K4490A52348c25236d3204G2673J91805G1688
18682e03385A8863c6807B33110I496e1078G6447c46874A35148a03541F210K570
18671H780M4926c59405I7681J18605B1273a46706D0091i9541c0665B70573g8057
18659b06729k65416g4296o9010A83902O944G1254a03888k88493c9947k8172A36513
18647b09399K6422A78615c730j23303j670j842E0338d98240d8002k60679J51588
$$ plain form
18636 -157093 135474 -23356 73637 -305720 375241 -62094 -342575 101464 9605 213446
18626 213446 -148745 -67229 96781 -192140 -36293 6217 228206 -75972 37718 175998 -173878
18614 27981 136847 -161104 -192761 264370 -110267 -73451 36370 -64728 -120732 -43638 252036
18602 -66515 -76201 -76171 50903 100204 -78391 -114663 -93963 -135844 -51543 -440053 -156178 121437
18589 -96411 -346263 -293170 -119888 201773 -91864 58475 -164121 1947 36468 16217 -180105
18577 181303 -315904 -27978 29082 27516 57411 121198 57605 -72628 -133381 -131223 93300 -120027
18564 -58710 -353762 -47588 -266414 -104803 -149550 -15849 -470025 -246666 -5745 -15167 193897
18552 -24375 326328 -46764 -261179 -196293 41623 -41540 243733 -181844 -285767 -59647 -293865
$$ packed form
18636a57093A35474b3356G3637c05720C75241f2094k80481A01464I605K03841
18626B13446a48745f7229I6781a92140c6293F217K21989g5972C7718J38280a73878
18614B7981J08866a61104l1657B64370a10267L6816C6370f4728n6004d3638B52036
18602f6515r686L0E0903M9301g8391l6272K0700m1881e1543l88510a56178A21437
18589i6411k49852N3093a19888B01773i1864E8475a64121A947L4521A6217a80105
18577A81303c15904b7978B9082j566K9895O3787E7605g2628o0753K158I3300a20027
18564e8710k95052d7588k18826a04803m4747a5849m54176K23359e745r422A93897
18552b4375C26328d6764k14415O4886D1623d1540B43733a81844j03923e9647k34218
$$ plain form
18541 -293865 -223672 -131844 -159260 121511 -110534 -108629 -193569 -288093 -245916 50317 -73516
18529 37007 -417171 -62713 42778 152737 159161 -188209 188358 -254222 -176719 149805 -205658
18517 -183257 33094 -107060 74265 -124728 6880 -69619 -413907 68170 -232549 216006 329104
18506 329104 -51667 -41721 71245 -5695 170123 -82616 328439 -97051 118243 -329074 -135213
18494 157770 184753 -316585 -262274 4420 -205357 -355467 56997 35297 -58289 -61581 -305845
18483 -305845 -99821 24284 149323 71089 -253231 81523 47582 -231205 -267767 -24902 -89650
18472 -89650 -98055 -149701 -159525 235446 -203708 -71089 -68552 75456 144949 44590 4595 67745
18460 67745 158902 174033 -41739 -371902 12756 -78127 59282 67428 -33000 85207 -69334 32839
$$ packed form
18541b93865P0193R1828k7416A21511a10534J905q4940r4524M2177E0317g3516
18529C7007d17171f2713D2778J09959O424a88209A88358b54222P7503A49805b05658
18517a83257C3094a07060G4265a24728F880f9619l44288F8170b32549B16006J13098
18506C29104e1667R946G1245e695A70123h2616C28439i7051A18243c29074a35213
18494A57770K6983c16585N4311D420b05357j50110E6997k1700e8289l292k44264
18483c05845i9821B4284J25039G1089b53231H1523l3941b31205l6562b4902o4748
18472h9650q405n1646r824B35446b03708g1089K537G5456O9493D4590D595O3150
18460F7745R1157J5131d1739l30163A2756g8127E9282Q146c3000H5207f9334C2839
$$ plain form
18447 34562 -215106 -72414 79198 -1933 -21455 96109 134680 -160220 -248088 -273993 -190873
18436 -190873 3142 174218 152716 -12467 189732 -190707 97679 -351162 -251710 -49715 -131699
18425 -131699 235032 -79434 -134492 -76857 47214 125133 185148 -218992 201989 -78755 -65386
18414 -65386 -172745 104444 -218592 185364 -164114 138449 325035 16078 -32752 68627
18403 268250 -62125 28090 -58700 -87598 11195 -55477 -230167 14325 -1099 -94723 -4370 -82164
18391 -82164 -136601 120710 -94784 -56028 -119063 -405311 141602 -345537 -22918 59363 -162907
18379 413004 134903 -90535 46310 -115708 19021 -70192 -75894 125613 -2196 -102433 -87530
18368 -87530 -94181 395734 -70257 5476 71871 72352 -44361 -136849 -42416 128940 -196807 -108615
$$ packed form
18447C4562b15106g2414G9198a933j9522I6109L8571a60220q7868k5905Q3120
18436a90873C142J71076k1502a2467A89732a90707I7679c51162R9452d9715q1984
18425a31699B35032g9434n5058N7635D7214P7919O0015b18992B01989g8755J3369
18414f5386j07359A04444b18592A85364a64114A38449J86586A6078c2752F8627
18403B68250f2125B8090e8700k8898A1195e5477j74690A4325a099r3624d370p7794
18391h2164n4437A20710i4784L8756o3035k86248A41602c45537b2918E9363a62907
18379D13004A34903i0535D6310a15708A9021g0192n702A25613b196j00237J4903
18368h7530o651C95734g0257E476O6395M81d4361r2488d2416A28940a96807Q8192
$$ plain form
18356 -108615 -76843 -17587 48351 265216 -58025 -34025 -237013 -116231 -106257 34904 -21355
18344 -8594 -377001 49648 -574843 -96769 61480 92143 -249227 -133142 -34858 -196090 -226491
18333 -226491 -18244 -226864 -165503 -207886 55400 311038 -79737 81774 -403000 -169892 -128335
18322 -128335 335597 -89503 209853 118898 -250054 -59606 -228870 -297661 -343792 82694 212772
18311 212772 2661 -375035 173481 -175417 -13916 -281587 307515 229234 -216309 -120743
18301 -120743 267550 -289933 -168581 -7256 -141439 153824 160790 -1141 -16203 -116458 107843
18289 116086 -166835 32426 -271997 30834 -70676 -266245 -305912 222351 369007 -45115
18278 98882 222410 189015 1118 -183087 412602 145351 -251255 -1 -186612 156127 -186703
$$ packed form
18356a08615L1772a7587D8351K16865e8025K4000k02988a16231R974C4904b1355
18344h594l68407D9648e74843i6769F1480L0663b49227J16085c4858j61232l0401
18333b26491a8244k08620O1361m2383E5400K55638g9737H1774d03000a69892M1557
18322a28335C35597h9503B09853r0955b50054e9606j69264o8791m6131H2694J30078
18311B12772B661c75035A73481a75417a3916k67671C07515p8281b16309R5566
18301a20743B67550b89933J21352g256j34183A53824O966a141j5062j00255A07843
18289A16086a66835C2426b71997C0834g0676j95569l9667B22351J46656d5115
18278I8882J23528l3395A118a83087D12602A45351b51255aj86611A56127a86703
$$ plain form
18266 222669 -36944 -80027 -30002 -6324 119121 4651 -105129 199059 36904 -121639 25608
18254 -102230 147816 -268547 42311 81581 215340 -303608 -123734 -120908 -89033 53699 -95122
18242 -94369 192412 106306 148432 77598 172342 -189025 203428 79208 237138 -46729 9682
18230 -59658 -143271 -128831 -15463 -155561 57888 -192208 -303731 62773 16232 28284 -121372
18218 170795 -420923 -48422 -473561 229642 -190751 -229854 -128935 118453 66054 171004
18208 171004 -142281 79856 215972 -165106 -160635 13540 -26122 -214498 167700 -83031 -27633
18196 -268301 -261332 -135249 -211329 -74358 -323708 -118596 -14578 -285851 27298 -112840 75118
18184 24391 -230829 -36144 -149240 171610 285533 34876 72212 58842 -52168 178524 -208402
$$ packed form
18266B22669c6944m3083c0002f324A19121D651a05129A99059C6904a21639B5608
18254a02230A47816b68547D2311L9270J33759c03608a23734K826L1875E3699i5122
18242i4369A92412q6106M2126p0834R4744a89025B03428G9208J57930d6729I682
18230e9658q3613J4440a5463j40098E7888a92208j11523F2773A6232J2052a21372
18218A70795d20923d8422m25139B29642a90751l9103J00919A18453n2399J04950
18208A71004a42281G9856J36116a65106M471A3540b6122j88376A67700h3031b7633
18196b68301O969J26083p6080g4358k49350a18596a4578k71273B7298a12840G5118
18184B4391b30829c6144j13096A71610J13923C4876L7336j3370e2168A78524b08402
$$ plain form
18172 46524 -129529 173090 -45942 -209592 -336365 21098 29724 68799 -294548 119076 -79355
18160 -339209 340553 -320686 118717 -233821 121984 54680 96894 -94871 -118754 -61296
18150 -61296 -37126 -56175 -224323 -80859 -111096 -238957 -397157 154178 155074 64315 -268987
18138 30427 136591 -153281 -166856 80267 28899 136401 -1142 -368382 -67170 -141571 3792
18126 191124 96828 148520 73772 -148730 -304147 15350 37830 -195267 -46153 -128375 12597
18114 -57308 -128749 -237097 -208502 62751 -15776 315584 -237326 19028 -362718 193242 -6281
18102 60761 8953 -93101 -160429 -60309 -400630 19155 -256278 34703 -60383 -43032 -140106
18091 -140106 -152782 102810 178580 21643 -84186 195785 -115085 -294725 40291 -17370 -269020
$$ packed form
18172D6524a29529A73090d5942j63650j26773B1098Q626L9075b94548A19076g9355
18160c39209C40553c20686A18717b33821A21984E4680M2214i4871k3883N7458
18150f1296K4170j9049j68148h0859l0237j27861j58200A54178Q96F4315b68987
18138C0427J06164a53281j3575H0267B8899J07502a142l67240f7170p4401C792
18126A91124r4296N1692G3772a48730j55417A5350K2480a95267d6153q2222A2597
18114e7308p1441j08348K8595F2751a5776C15584b37326A9028c62718A93242f281
18102F0761H953i3101o7328f0309l40321A9155b56278C4703f0383J7351r7074
18091a40106j2676A02810P5770B1643h4186A95785a15085j79640D0291a7370k51650
$$ plain form
18080 -269020 47303 129936 -93110 4719 300129 -37365 86994 -77859 23975 -349806 -125315
18068 -55425 11601 216071 -255267 -9291 4458 -102078 -117030 20732 -247502 185672 -378981
18056 -76786 -24777 -123270 -179506 -193859 12193 7716 -251728 -270181 11554 -52921 -50925 35373
18043 148468 120868 -93089 42117 -326145 -73502 -168955 -57908 31359 -91578 300714 -163637
18031 -204300 30061 136058 -251725 -293201 237843 -103415 -166120 141121 213619 -323420
18020 -63321 -161429 60828 121225 -131683 -307973 -235814 -150225 85221 13985 -403513 -156020
18008 -193150 -244594 117676 186897 -2168 129718 36146 -184680 184710 -40080 -59798 218933
17996 12736 152090 -242064 -89101 -172439 -14545 -61403 186034 -168097 -379985 150067
$$ packed form
18080b69020D7303Q2633i3110D719K95410c7365H6994g7859B3975c49806a25315
18068e5425A1601K04470b55267i291D458a02078j4952B0732b47502A85672c78981
18056g6786b4777r8493n6236j4353A2193m477b51728j8453A1554e2921J996C5373
18043A48468k7600i3089D2117c26145g3502r5453e7908C1359i1578C00714a63637
18031b04300C0061J05997b51725m1476B37843a03415o2705A41121P2498c23420
18020f3321r8108F0828O0397a31683j76290P2159Q5589H5221A3985d03513a56020
18008a93150n1444A17676O9221b168A29718C6146a84680A84710d0080j9718B18933
17996A2736J39354b42064h9101q3338a4545m6858A86034a68097k11888A50067
$$ plain form
17985 -289166 -29126 109040 -83755 -92993 7535 -292450 -200521 157944 -182730 -178025 -291324
17974 -291324 121217 57265 -249780 -124489 -66673 56947 -31956 -146980 94735 -8685 36576
17962 125607 122618 126111 -174814 -10652 -181184 -94905 200942 183267 292856 -174323 -239438
17951 -239438 653 155837 -105527 -224184 -45924 -255194 -229247 -31812 -252574 143888 53177
17939 -17745 -71306 -6557 93814 -45903 62021 -252773 -74672 -246882 10661 -44753 165835
17927 133490 28726 -156689 -18135 -295681 172169 -97415 -193071 -136109 47971 30405 127973
17916 127973 119812 166502 -229016 159349 -9607 13487 99573 73202 -302371 -18544 -22480
17905 -22480 116344 1148 -208953 -93562 363926 -60294 308690 -39997 -202993 101333 -222447
$$ packed form
17985b89166b9126A09040h3755r238G535b92450R1929A57944a82730M705j13299
17974b91324A21217E7265b49780a24489N7816E6947c1956j15024I4735h685C6576
17962A25607k989L493a74814a0652j70532Q6279B00942j7675J09589a74323o5115
17951b39438F53J55184a05527j18657d5924k09270K5947c1812k20762A43888E3177
17939a7745n3561f557I3814d5903F2021b52773g4672j72210A0661d4753A65835
17927A33490B8726a56689a8135k77546A72169i7415r5656N6962D7971j7566R7568
17916A27973q161M6690b29016A59349i607A3487Q6086k6371c02371a8544l936
17905b2480A16344A148b08953i3562C63926f0294C08690c9997j62996A01333b22447
$$ plain form
17893 -12997 -111217 157242 174404 -160160 51563 167682 -245504 35791 344674 -50316 48337
17881 272420 -121780 182127 24183 28123 -40050 130769 209396 -136137 -3620 -139847 -197357
17870 -197357 -14310 -25907 19485 173451 87774 -277091 250629 -51713 -28647 -232670 56824
17858 173143 -22059 -181777 34975 104549 157554 -54047 -262493 -259147 -489 -149371 -67372
17846 -421042 -46059 93094 -148115 172029 130240 -225850 -41647 -68121 -130301 76651 131567
17835 131567 70862 -77419 -24417 44215 280698 -20438 190471 74340 303609 -9711 51591
17823 -88756 -22585 -393334 218089 226655 142884 192228 -167922 -143928 395366 150911 -381304
17811 -101327 124526 170530 257697 -70700 206698 -222587 118025 -63625 348845 37237
$$ packed form
17893a2997r8220A57242J7162a60160E1563J16119b45504C5791L08883e0316D8337
17881B72420a21780A82127B4183L940d0050A30769P8627a36137c620j36227n7510
17870a97357a4310j1597A9485J53966q5677b77091B50629e1713K3066k04023E6824
17858A73143b2059j59718C4975O9574N3005e4047k08446L346d89j48882f7372
17846d21042d6059I3094a48115A72029m1789b25850d1647k6474o2180G6651N4916
17835A31567o0705g7419b4417D4215K36483b0438A90471G4340K29269i711E1591
17823h8756b2585l70749B18089Q566q3771M9344a67922K3994C95366A50911c81304
17811a01327A24526M6004Q7167g0700B06698b22587A18025f3625C48845C7237
$$ plain form
17800 216124 -38971 321311 5109 346809 -264662 194703 -97487 171863 -221729 81348
17789 -14449 -102912 350412 8191 31017 -215378 -69129 -321637 -43730 -49656 -37053 -244682
17778 -244682 -130574 -48507 302322 -160978 212594 22093 163325 -288043 -82584 -409918
17768 -409918 -82243 -22952 4290 -190571 56165 168117 80239 -57608 -32557 -163430 -106665
17757 -106665 12955 155113 107226 -92518 27234 118757 -93178 244893 436644 335224 -201176
17745 84884 148391 177873 -39185 -41089 -308096 -135973 149890 62192 -85655 -189585 180189
17733 69587 -296354 207661 -117977 -88018 50503 311916 205136 133079 -138913 159915
17722 -119843 112965 71244 -58608 -144783 -21784 -120718 -7028 -374108 95240 -80919 -193118
$$ packed form
17800B16124c8971C21311E109L41700b64662A94703i7487A71863b21729H1348
17789a4449q8463C50412H191K2826b15378f9129k52508d3730n926J2603k07629
17778b44682J14108d8507C02322a60978B12594B2093J41232b88043h2584l27334
17768d09918h2243b2952D290a90571E6165J11952H0239e7608K5051j30873N6765
17757a06665A2955J42158m7887i2518B7234R1523i3178B44893J91751j01420b01176
17745H4884O3507K9482c9185j904k67007a35973A49890F2192h5655j03930A80189
17733F9587b96354B07661a17977K9959E0503K61413j06780p2057a38913A59915
17722a19843A12965m1721e8608q6175b1784r8934g028l67080I5240h0919j12199
$$ plain form
17711 -193118 -4344 -33224 -50058 -132341 38965 23421 -352223 -309071 -182088 34954 50843
17700 50843 102901 -46605 194519 -68533 129589 163102 -82560 -347587 217562 45991 51781
17689 51781 157606 -117697 -209392 -68092 -113113 -149213 29307 146658 -77031 216895 72407
17677 -9823 -186787 -204330 -52215 221255 -7603 -237847 172799 -77557 -18089 -5763 47726
17665 47947 9471 79007 119361 -51695 34717 180572 -84131 115754 192779 17092 97717
17654 97717 -122665 -99363 -17941 -7005 -243185 -141596 200692 217657 112922 -52691 135610
17642 -63278 16887 -42871 -132060 87128 -272767 184910 -481030 20482 -100106 -199127 97689
17630 117919 132200 -49552 193650 -86678 29827 -108126 -199748 112535 149988 355105 153913
$$ packed form
17711a93118d344k8880j6834q2283C8965j5544c52223M3152J26983C4954J5889
17700E0843N2058d6605A94519f8533A29589L3513h2560k65027B17562D5991N790
17689E1781J05825a17697r1695f8092m5021l6100B9307J17351g7031B16895G2407
17677i823j76964j7543e2215B21255g603k30244A72799g7557a8089e763D7726
17665D7947I471O9536M0354e1695C4717J45855h4131A15754P7025A7092Q0625
17654I7717a22665K3302a7941g005k36180J01589B00692J6965j04735e2691A35610
17642f3278A6887d2871q9189H7128b72767A84910d81030B0482a00106r9021I7689
17630A17919J4281d9552A93650h6678B9827a08126r1622A12535L7453K05117A53913
$$ plain form
17618 176925 204086 11651 -5227 -96979 32579 304483 196001 171929 -46312 -390583 24877
17606 -8361 90316 5315 129416 -55215 -295391 266335 102678 39975 24888 42470 231022
17595 231022 196271 -249411 41871 -88181 3233 109597 96944 25352 -158881 -130729 215569
17583 -105705 125887 223530 308209 472077 -42883 -104813 76164 -219892 -36587 52341 296301
17572 296301 49067 73561 94092 -56457 -67955 211994 -91008 140394 56618 -74610 76304
17560 106268 -6788 -42848 156976 254684 151948 -43792 47676 1116 -45235 -191960 -138311
17549 -138311 -49521 230250 -22077 -63576 165932 -32024 265637 89226 341016 77593 422493
17538 422493 99051 -127553 132476 324529 109710 216869 21362 60854 -33304 356202
$$ packed form
17618A76925K7161A1651e227r1752C2579K71904j08482k4072d6312l44271B4877
17606h361I0316E315J24101e5215k40176B66335A02678C9975j5087J7582J88552
17595B31022l4751b49411D1871h8181C233J06364j2653B5352a58881K8152B15569
17583a05705A25887R7643Q4679J63868d2883o1930G6164b19892c6587E2341K43960
17572B96301D9067K4494K0531e6457j1498B11994i1008A40394E6618g4610G6304
17560A06268f788l6060A56976R7708j02736d3792D7676A116d5235j46725N3649
17549a38311d9521B30250b2077m1499A65932c2024B65637H9226K51790G7593L44900
17538D22493I9051a27553A32476J92053A09710J07159B1362L9492c3304C56202
$$ plain form
17527 415644 29601 298390 -26163 391451 -53964 180401 449078 218727 -127712 -25972
17516 -18076 -112726 108630 135917 179773 317865 109547 90916 151280 138825 282322 -62837
17504 64444 46915 173794 234698 157634 -191348 311572 19283 39891 127304 212317 90917
17492 41178 319955 230419 -124044 429254 83330 -294985 134070 380150 -40740 126382
17481 153598 180016 120272 -100578 267123 236016 221775 271255 93923 67548 399480 53312
17469 394266 50755 263867 172758 372970 85218 79156 115201 227309 325292 201327 326398
17458 326398 173211 295735 123891 -205298 53661 165049 276522 137389 118501 166648
17448 166648 212656 251319 59794 542381 112080 -71511 278361 171487 333025 -29905
$$ packed form
17527D15644B9601K68789b6163C91451e3964A80401K68677B18727a27712b5972
17516a8076r4650A08630K7287M3856J38092A09547j8631O0364j2455J43497f2837
17504F4444j7529J26879O0904p7064a91348C11572A9283K0608Q7413Q5013I0917
17492D1178K78777q9536a24044D29254H3330b94985A34070K46080d0740A26382
17481A53598K6418n9744a00578B67123l1107j4241M9480I3923k6375L31932E3312
17469C94266E0755K13112r1109K00212H5218o062L6045J12108R7983j23965J25071
17458C26398j53187J22524A23891b05298E3661J11388J11473A37389j8888M8147
17448A66648M6008L8663E9794M82587A12080g1511B78361j06874J61538b9905
$$ plain form
17437 224113 308966 352728 92941 368381 409821 332507 78157 166721 356038 284960 -255870
17425 70026 318832 355434 -42451 111493 84566 71666 340324 296198 58616 175936 238772
17414 238772 -127113 -68428 173870 -71189 471465 118607 100361 -62689 14646 245944
17404 245944 176974 347008 335600 183099 -213854 -1581 416377 -13240 -91654 390115 399073
17393 399073 164132 256509 111654 9904 -24631 300084 329872 341550 410884 -52204 242815
17381 30335 332737 1391 -111655 92402 -102539 -51142 140036 77877 155912 68286 204487
17370 204487 -251647 -229880 96464 26884 142134 3472 -6507 -137574 106577 170207 136106
17359 136106 29084 256109 284537 160342 145974 123740 112801 66398 247551 -243241 -155508
$$ packed form
17437B24113Q4853M3762I2941K75440M1440p7314G8157Q8564J89317p1078b55870
17425G0026K48806L6602d2451A11493k6927j2900K68658m4126E8616J17320O2836
17414B38772a27113N8685A73870g1189D71465A18607j8246f2689A4646K31298
17404B45944o8970J70034j1408j52501b13854a581D16377a3240p8414C90115Q958
17393C99073A64132R2377A11654I904b4631C00084K9788J1678O9334e2204B42815
17381C0335L02402A391a11655I2402a02539e1142A40036o2159P8035F8286J36201
17370B04487b51647K1767I6464B6884J15250C472f507j31067A06577O3630l4101
17359A36106B9084K27025K8428j24195j4368k2234j0939m6403J81153b43241Q7733
$$ plain form
17348 -155508 305422 177760 196739 192836 -120217 326326 95316 79112 -151456 29822 82591
17337 82591 242719 -186275 401819 164700 215176 263492 233371 319392 453835 -49893 284185
17325 366988 474305 -49573 138558 55277 130666 -67271 266569 136542 -6353 172807 187593
17314 187593 -24910 339566 14752 215596 260512 149103 -57526 143532 348068 5343 309587
17303 309587 252501 -145197 74520 62388 170542 419932 42688 -227359 165734 2817 261453
17292 261453 -185900 220136 269899 371816 129885 313363 400588 -197572 387569 57343
17281 160964 114678 423204 59968 70903 -19959 -89831 192776 92262 243649 328093 -126939
17269 328905 -282106 330005 417866 225088 176819 377476 303808 194805 111043 261567
$$ packed form
17348a55508C05422j27662J8979l903a20217C26326I5316j6204a51456B9822N2769
17337H2591J60128a86275D01819A64700N0476M8316l0121Q6021J34443d9893B84185
17325C66988J07317d9573A38558E5277P5389f7271B66569j30027f353A72807J4786
17314A87593b4910C39566A4752K00844M4916j11409e7526A43532K04536E343L04244
17303C09587n7086a45197G4520j2132J08154K49390D2688b27359A65734B817K58636
17292B61453a85900B20136M9763J01917A29885J83478Q7225a97572C87569E7343
17281A60964m6286L08526E9968J0935a9959o9872A92776I2262J51387Q4444a26939
17269C28905b82106C30005Q7861j92778m8269K00657p3668j09003q3762J50524
$$ plain form
17259 261567 367840 395868 283642 454312 264748 302170 106182 194440 313879 -257132
17248 276510 316653 281164 341907 301696 360976 109969 217378 137985 -43493 389374 272954
17237 272954 -32985 631 147239 247277 338246 189630 199796 480407 7867 514458 441773
17226 441773 184673 511793 178312 275055 24123 2841 135257 48213 67491 -148596 -9345
17214 10223 501693 254088 288571 -41891 439653 115481 261078 427811 219350 383905
17204 383905 -58527 92298 214593 271348 310146 755910 267833 260530 534664 202670 88866
17192 139729 313770 276367 236736 408810 270475 498559 32280 351713 139384 513815
17182 513815 -204435 342576 472422 182123 443423 366736 99141 143971 333756 132538
$$ packed form
17259B61567J06273K8028j12226J70670j89564L7422A06182Q8258J19439b57132
17248B76510M0143l5489O0743m0211N9280A09969J07409p9393d3493C89374j16420
17237B72954c2985F31J46608J00038R0969j48616J0166K80611G867N06591p2685
17226D41773A84673L27120A78312R6743B4123B841J32416D8213J9278a48596i345
17214A0223M91470k47605L4483d1891D39653A15481J45597J66733k08461J64555
17204C83905e8527I2298J22295N6755L8798M45764B67833p303K74134B02670H8866
17192A39729J74041l7403l9631J72074j38335K28084C2280L19433A39384L74431
17182E13815b04435C42576J29846A82123K61300p6687I9141M4830J89785A32538
$$ plain form
17171 274983 395806 514867 352827 437187 401098 400111 176899 -49619 489321 263255 251302
17160 251302 491303 280836 222750 70280 447706 331062 467497 221596 235147 190172
17150 190172 355957 86715 235661 -24936 393855 249928 78852 201743 361413 366695
17140 366695 582387 620898 285901 462721 534886 555873 205419 584057 667834 374286
17130 374286 439737 137517 264160 299912 461867 362031 252097 360452 404114 -19231
17119 296521 388504 216677 315276 304057 314438 198651 384652 262392 70812 515743
17109 515743 606280 457892 590176 274883 408829 282172 309317 183951 362395 301373
17099 301373 518341 318735 617027 630837 432449 258052 217266 650799 296323 523232
$$ packed form
17171B74983J20823J19061j62040Q4360l6089r87A76899d9619D89321k26066j1953
17160B51302K40001k10467n8086G0280L77426j16644J36435B21596J3551m4975
17150A90172J65785H6715J48946b4936C93855j43927G8852J22891J59670N282
17140C66695K15692L8511B85901J76820P2165K0987B05419L78638Q3777k93548
17130C74286O5451A37517J26643L5752J61955r9836j09934J08355M3662a9231
17119B96521R1983j71827R8599j1219J0381j15787J86001j22260G0812M44931
17109E15743R0537j48388J32284B74883J33946j26657K7145j25366J78444o1022
17099C01373K16968j99606K98292J3810j98388j74397m0786M33533B96323K26909
$$ plain form
17089 523232 419208 443278 342770 530735 229873 560147 547284 360065 595123 323858
17079 323858 670404 539592 455610 359482 252080 530102 662017 394656 631513 196368
17068 423368 768068 762444 448211 614772 488834 594153 1067397 472085 550126 526301
17058 526301 430046 388138 749491 515339 745867 360035 631204 791808 670938 461068
17048 461068 449972 680307 519347 432993 735571 716150 662228 532491 825379 815647 820497
17037 820497 684441 618633 690373 777493 595998 458576 507286 582292 862820 1082204
17027 1082204 1066847 638119 838013 699449 980316 714764 1029385 733608 1090953 845652
17017 845652 747196 576666 691178 1179282 521221 828085 639179 897845 746196 619127
$$ packed form
17089E23232j04024K4070j00508J87965B29873L30274j2863j87219K35058k71265
17079C23858L46546j30812q3982r6128j07402K78022J31915k67361K36857A96368
17068D23368L44700n624l14233J66561j25938J05319M73244D72085P8041k3825
17058E26301r6255m1908L61353k34152K30528C60035K71169J60604j20870k09870
17048D61068j1096K30335j60960q6354L02578j9421n3922j29737K92888r732M850
17037H20497j36056o5808P1740Q7120j81495j37422M8710P5006K80528K19384
17027A082204j5357m28728J99894j38564K80867k65552L14621k95777L57345k45301
17017H45652r8456j70530J14512M88104E21221L06864j88906K58666j51649j27069
$$ plain form
17007 619127 602443 932118 916510 786786 1082409 467314 988013 831846 839299 793403
16997 793403 720001 967236 708405 1230626 592685 602157 923264 1007240 887337 735990
16987 735990 959009 865268 1166190 878079 625337 1090819 837780 773697 723983 995319
16977 995319 1009730 673075 826422 776406 874272 1331087 1274069 1403666 844684 898796
16967 898796 1289830 1387916 1073445 1170240 1158324 1013597 1065354 1285846 1241503 1495282
16957 1495282 1475403 1008478 1470868 1093532 1165450 1249858 1192669 1181665 1556865 1160384
16947 1160384 1243519 1081249 1390772 1714574 1340384 1064104 1301169 1517845 1413844 1377740
16937 1377740 1728895 1418227 1504426 1723492 1433207 1419129 1340792 1375056 1613412 1481283
$$ packed form
17007F19127j6684L29675j5608j29724K95623D67314N20699j56167P453m5896
16997G93403p3402K47235k58831N22221E92685R472L21107Q3976j19903j51347
16987G35990K23019r3741L00922k88111k52742M65482k53039o4083m9714K71336
16977I95319J4411l36655J53347n0016R7866M56815n7018J29597n58982N4112
16967H98796L91034R8086l14471R6795j1916j44727N1757K20492m4343K53779
16957A495282j9879m66925M62390l77336P1918Q4408n7189j1004L75200l96481
16947A160384Q3135j62270L09523L23802l74190k76280K37065K16676j04001l6104
16937A377740L51155l10668Q6199K19066k90285j4078p8337L4264K38356j32129
$$ plain form
16927 1481283 1836569 1703079 1655234 1624496 1586105 1460115 1812472 1543675 1739396 1567056
16917 1567056 1762270 1857467 1640313 1488408 2273087 1813621 2142088 1950065 1836831 1978637
16907 1978637 2186599 2192259 2024602 2227268 2185671 2560911 2286142 2487033 2431800 2191859
16897 2191859 2605561 2557119 2226884 2504452 2909454 2712013 2585222 2503276 2590572 2755757
16887 2755757 2789957 2945350 2690752 2799348 3101203 3090151 3039048 3252931 3162059 3362028
16877 3362028 3165313 3725373 3566705 3543354 3576340 3614296 3689255 3973705 4081558 3902745
16867 3902745 3964264 4113619 4070868 4211788 4408602 4343601 4222154 4534840 4450403 4271931
16857 4271931 4649712 4658646 4844190 5404351 5007449 5080017 4998515 5269259 5441115 5564427
$$ packed form
16927A481283L55286j33490m7845l0738l8391j25990L52357k68797J95721j72340
16917A567056J95214R5197k17154j51905P84679m59466L28467j92023j13234J41806
16907A978637K07962N660j67657K02666m1597L75240k74769K00891n5233k39941
16897B191859M13702m8442l30235K77568M05002j97441j26791q1946Q7296J65185
16887B755757L4200J55393k54598J08596L01855j1052n1103K13883r0872J99969
16877C362028j96715N60060j58668k3351L2986L7956P4959K84450J07853j78813
16867C902745O1519J49355m2751J40920J96814o5001j21447L12686q4437j78472
16857D271931L77781Q934J85544N60161l96902P2568q1502K70744J71856J23312
$$ plain form
16847 5564427 5517338 6028030 5933575 5716506 5831013 6219714 6430219 6353878 6265530 6679373
16837 6679373 6660254 7040920 6999704 7302665 7033758 7467937 7582050 7707415 7897466 8346432
16827 8346432 8250761 8522596 8730392 8658469 8839997 9122843 9237372 9785548 9815316 10063335
16817 10063335 10202196 10504383 10634542 11070408 11100791 11479007 11727069 12146368 12191071 12579261
16807 12579261 12970020 13165835 13518256 13789773 14232758 14583161 14910241 15674121 15684068 16205971
16797 16205971 16739489 17053592 17573525 18232937 18464085 19134402 19727397 19902963 20540678
16788 20540678 21235941 22099834 22650529 22952509 24321262 24682670 25547357 26034778 27111605
16779 27111605 27559091 28476635 29481430 30339327 31081106 32023225 33216324 34247981 35341387
$$ packed form
16847E564427m7089N10692r4455k17069J14507L88701K10505p6341q8348M13843
16837F679373j9119L80666m1216L02961k68907M34179J14113J25365J90051M48966
16827H346432r5671K71835K07796p1923J81528K82846J14529N48176K9768K48019
16817A0063335J38861L02187J30159M35866L0383L78216K48062M19299M4703L88190
16807A2579261L90759J95815L52421K71517M42985L50403L27080P63880R947N21903
16797A6205971N33518L14103N19933O59412K31148O70317N92995J75566O37715
16788B0540678O95263Q63893N50695L01980J368753L61408Q64687M87421J076827
16779B7111605M47486R17544J004795Q57897P41779R42119J193099J031657J093406
$$ plain form
16770 35341387 36307745 37380136 38869557 40106438 40842552 42696603 43706256 44640362
16762 44640362 46412454 47708804 49036002 50275308 51802992 53618086 55193764 57016685
16754 57016685 58342015 60148638 61562247 63506319 65294945 66740383 68870154 70719307
16746 70719307 72212577 74589956 76526597 78596588 80842971 82621829 84640067 86917301
16738 86917301 89090714 91441214 93510850 96219334 98322821 100916374 103192078 105707919
16730 105707919 108343689 110637308 113070837 115676509 117849214 120285811 122465975 124342281
16722 124342281 126158162 127421105 129161913 129813783 130225152 130259121 129648189 128807086 127595339
16713 127595339 125664408 123383551 121015926 118077847 115230487 111979608 108376164 104375240
$$ packed form
16770C5341387R66358J072391J489421J236881P36114J854051J009653R34106
16762D4640362J772092J296350J327198J239306J527684J815094J575678J822921
16754E7016685J325330J806623J413609J944072J788626J445438K129771J849153
16746G0719307J493270K377379J936641K069991K246383J778858K018238K277234
16738H6917301K173413K350500K069636K708484K103487K593553K275704K515841
16730A05707919K635770K293619K433529K605672K172705K436597K180164J876306
16722A24342281J815881J262943J740808O51870M11369L3969o10932q41103j211747
16713A27595339j930931k280857k367625k938079k847360l250879l603444m000924
$$ plain form
16705 104375240 100649117 96748968 92467963 88538435 84349011 79925548 75287572 71049108
16697 71049108 66913101 62695223 58866247 54917978 51752318 48388047 45867656 43293327
16689 43293327 39971908 38067598 35423482 33655093 31989182 30470026 28540362 27300136
16681 27300136 25914516 24513201 23525157 22341051 21596054 20401431 19839838 18692185
16673 18692185 17877673 17662594 16693289 15953988 15303858 14614403 14336918 13720831 13057749
16664 13057749 12428617 12240839 11197344 11283853 10821890 10700645 10074627 10084881 9689285
16655 9689285 9558729 9003589 8936841 8625006 8151163 8072486 7814134 7701732 7203043 7328524
16645 7328524 7220452 6734042 6560111 6167008 6066742 6090770 5643094 5719342 5459874 5496266
$$ packed form
16705A04375240l726123l900149m281005l929528m189424m423463m637976m238464
16697G1049108m136007m217878l828976l948269l165660l364271k520391k574329
16689D3293327l321419j904310k644116j768389j665911j519156j929664j240226
16681B7300136j385620j401315r88044j184106p44997j194623n61593j147653
16673A8692185q14512k15079r69305p39301o50130o89455k77485o16087o63082
16664A3057749o29132j87778j043495Q6509m61963j21245o26018J0254l95596
16655I689285j30556n55140o6748l11835m73843p8677k58352j12402m98689J25481
16645G328524j08072m86410j73931l93103j00266K4028m47676P6248k59468L6392
$$ plain form
16635 5496266 5388763 5459877 4995710 5024045 4746119 4362594 4519522 4347086 4200675 4173295
16625 4173295 4114725 3910422 3802522 3585914 3748709 3687335 3936077 3555510 3321630 3302422
16615 3302422 3122683 3120076 3159811 3398503 3168970 2996219 2747725 3019529 2889050 2555648
16605 2555648 2460471 2628131 2594961 2724283 2359724 2297242 2406985 2497750 2498035 2336829 2307065
16594 2307065 2578925 2540431 2061543 2078900 2022908 2442762 2283764 1967782 1911359 1859960
16584 1859960 1906495 1923430 1910285 1644457 1965336 1702091 1767190 1699226 1457327 1325517
16574 1325517 1686313 1815438 1564993 1836115 1515150 1701795 1632841 1361789 1737550 1369235
16564 1369235 1603479 1689747 1391442 1539993 1257649 1297457 1280352 1512067 1073955 1088593
$$ packed form
16635E496266j07503P1114m64167K8335k77926l83525J56928j72436j46411k7380
16625D173295n8570k04303j07900k16608J62795o1374K48742l80567k33880j9208
16615C302422j79739k607L9735K38692k29533j72751k48494K71804j30479l33402
16605B555648r5177J67660l3170J29322l64559o2482J09743R0765K85j61206k9764
16594B307065K71860l8494m78888J7357n5992M19854j58998l15982n6423n1399
16584A859960M6535J6935j3145k65828L20879k63245O5099o7964k41899j31810
16574A325517L60796J29125k50445K71122l20965J86645o8954k71052L75761l68315
16564A369235K34244Q6268k98305J48551k82344L9808j7105K31715m38112J4638
$$ plain form
16554 1088593 1362515 1368494 1088892 1172375 1306063 1350059 1224909 1304007 1243613 1114815
16544 1114815 1187066 1360336 1081060 1021108 1259317 813968 992259 1017096 1160242 1310374
16534 1310374 695948 1084795 1042738 1178106 1082306 1033733 916661 689869 948287 1002866
16524 1002866 944251 447506 766781 923664 671536 657244 797544 641425 905427 788246
16514 788246 1006855 732162 1080349 754703 955260 759018 889356 1215977 674763 937350
16504 937350 589069 998331 900388 914781 968481 599987 397042 818809 563493 929420
16494 929420 840254 773937 458931 778058 662135 443192 1049952 791524 429001 504383
16484 504383 742754 510554 669601 479642 647219 373735 602004 479145 527151 734855
$$ packed form
16554A088593K73922N979k79602Q3483J33688M3996j25150P9098o0394j28798
16544A114815P2251J73270k79276n9952K38209m45349J78291K4837J43146J50132
16534A310374o14426L88847m2057J35368r5800m8573j17072k26792K58418N4579
16524A002866n8615D47506L19275J56883k52128j4292J40300j56119K64002j17181
16514G88246K18609k74693L48187l25646K00557j96242J30338L26621n41214K62587
16504I37350l48281M09262r7943J4393N3700l68494k02945M21767k55316L65927
16494I29420q9166o6317l15006L19127j15923k18943O06760k58428l62523P5382
16484E04383K38371k32200J59047j89959J67577k73484K28269j22859M8006K07704
$$ plain form
16474 734855 530073 327090 232195 490400 648224 579579 182165 635134 426862 461830
16464 461830 447128 555162 507003 645071 211072 259595 377665 468779 171018 296505
16454 296505 604583 285807 350032 359049 265235 400419 749090 115672 420796 454954
16444 454954 465566 287904 412535 473093 158353 262588 164243 688937 315892 331555
16434 331555 172205 195210 105923 303247 426542 221004 -34544 548271 321040 415049
16424 415049 321943 400012 314897 172431 458311 31533 146689 311823 320818 337379 360209
16413 360209 591060 318698 -18630 263813 313153 227787 42326 -106109 -47882 434345
16402 330934 123799 455412 170513 219594 411898 225787 78454 287522 171225 334953
$$ packed form
16474G34855k04782k02983r4895K58205J57824o8645A82165M52969k08272L4968
16464D61830j4702J08034m8159J38068B11072M8523J18070R1114A71018J25487
16454B96505L08078B85807O4225R017r3814J35184L48671A15672L05124L4158
16444D54954J0612j77662J24631O0558A58353J04235r8345N24694C15892J5663
16434C31555j59350K3005q9287J97324J23295k05538c4544E48271k27231R4009
16424D15049r3106P8069q5115j42466K85880C1533J15156J65134Q995J6561K2830
16413C60209K30851k72362a8630B63813M9340q5366D2326a06109d7882D34345
16402C30934A23799L31613A70513M9081J92304j86111G8454K09068j16297J63728
$$ plain form
16392 334953 -46665 435336 41464 663390 290761 219214 134049 111537 152473 171551 -342174
16380 151495 294923 -7901 632180 103579 127292 367385 156705 106765 394280 141748
16369 121018 -42216 416650 213435 45369 -206270 180362 477783 178860 231531 -153994
16358 -23953 199627 110013 -99149 183085 263661 347399 312726 201338 45510 119849 204484
16347 204484 -66661 358470 410196 -38782 17040 -81395 63146 281450 395937 63940 210401
16336 210401 -162094 211471 231297 307058 -144709 -45858 64040 302845 132949 297207
16326 297207 70307 63127 73047 374602 97744 219833 -21157 312310 -105936 159827 201763
16315 201763 75636 759405 -47330 47289 97094 283166 118897 -138681 -3662 135820 215163
$$ packed form
16392C34953d6665D35336D1464O21926B90761p1547q5165k2512M0936J9078c42174
16380A51495J43428g901F32180A03579K3713K40093A56705m9940K87515A41748
16369A21018d2216D16650k03215D5369b06270A80362K97421A78860N2671a53994
16358b3953A99627q9614i9149A83085Q0576Q3738l4673j11388D5510P4339Q4635
16347B04484f6661C58470N1726c8782A7040h1395F3146K18304J14487F3940J46461
16336B10401a62094B11471J9826P5761a44709d5858F4040K38805A32949J64258
16326B97207G0307p180R920L01555I7744J22089b1157C12310a05936A59827M1936
16315B01763G5636O83769d7330D7289M9805J86072A18897a38681c662A35820P9343
$$ plain form
16304 215163 -240666 182244 62943 210119 -57803 213178 63989 336585 278556 -180913
16293 150937 -113832 129600 25450 238850 38823 453537 190546 -93742 -25706 -6596 67809
16281 72644 79934 155119 14384 -131495 -248693 -38334 -142870 58437 -17277 -230792 150695
16269 341857 101888 307490 99302 -68809 74464 -26220 -254457 95494 50808 6285 330912
16258 330912 93244 -68172 43033 60757 192172 203410 -42811 94255 -47431 -80264 8975
16246 234436 272236 50287 82412 -158583 151960 220640 -169347 -111587 -237227 -5088 -38627
16235 -38627 235278 238980 -203351 879 -28128 147082 -226907 230735 420194 260748 112692
16223 54044 -173480 250949 -67735 -388936 151856 164425 -127624 108021 -323784 -93827
$$ packed form
16304B15163b40666A82244F2943J47176e7803B13178F3989K72596n8029a80913
16293A50937a13832A29600B5450K13400C8823M14714A90546i3742b5706f596F7809
16281G2644P290P5185A4384a31495j17198c8334j04536E8437a7277k13515A50695
16269C41857A01888K05602I9302f8809G4464b6220k28237I5494m4686F285L24627
16258C30912I3244f8172D3033J7724J31415J1238d2811I4255d7431l2833H975
16246B34436L7800E0287L2125a58583A51960O8680a69347N7760j25640e088l3539
16235c8627B35278L702b03351H79b8128A47082b26907B30735J89459j59446A12692
16223E4044a73480B50949f7735l21201A51856J2569a27624A08021c23784i3827
$$ plain form
16212 159803 -187341 71969 31438 201088 -22330 63557 -40456 61233 -102454 29470 -274275
16200 112655 -57810 -158644 -48114 135013 -43723 -170827 34603 -72672 75383 -95702 -50905
16189 -50905 11427 -40399 493657 22591 -12777 280748 -60372 -365846 -423204 -63616 55288
16177 -97210 146921 184411 -96036 -192599 -25240 -493959 -78234 338897 122101 -120378 67117
16165 77781 -350806 -27652 -30831 -78537 223523 161760 -32385 24731 92818 -98260 -31843
16153 140977 -191067 32011 77666 -4487 130644 -51321 24939 56327 89043 5360 98887
16142 98887 -78911 -55352 -126151 -189999 -149511 157377 130863 202780 -17942 -249132 194849
16130 -600262 247357 -160429 -359976 62789 -30689 -78461 83256 -115448 -159648 413169
$$ packed form
16212A59803a87341G1969C1438J69650b2330F3557d0456F1233a02454B9470b74275
16200A12655e7810j00834d8114A35013d3723j27104C4603g2672G5383i5702M4797
16189e0905A1427d0399D93657B2591a2777B80748f0372l05474n7358f3616E5288
16177i7210A46921L7490i6036r6563b5240m68719g8234C38897A22101a20378F7117
16165G7781c50806b7652l179m7706B23523o1763c2385B4731O8087i8260c1843
16153A40977a91067C2011M5655d487A30644e1321B4939L1388L2716E360R3527
16142I8887g8911K3559p0799o3848M0488A57377k6514P1917a7942k31190A94849
16130f00262B47357a60429j99547F2789c0689m7772H3256a15448m4200D13169
$$ plain form
16119 260952 93233 -49923 -778 229221 137585 174132 -27125 63469 139220 -63413 126734
16107 304200 169838 -20874 172262 -142063 -50618 -220613 1322 -270808 -21801 -32455 85744
16095 287408 209043 9392 -117564 -149883 -11974 91424 -180680 -263243 218391 36169 15091
16083 173508 225188 138992 -21746 -121355 91513 -73695 -17985 96302 -253417 118981 318586
16072 318586 122232 -36898 -62502 -96911 -73012 -7835 -177711 65357 -30590 62052 438766
16061 438766 194107 -271075 -117581 -72068 -250001 8381 -120852 -114092 -97032 -310062 161258
16049 184719 -25830 77777 -309629 -143379 112979 -142693 -127826 -190082 189663 43683
16038 36866 6794 -30921 319060 -199430 68870 208135 -254759 -51048 -118387 186962 140210
$$ packed form
16119B60952I3233d9923g78B29221r1636L6547b7125F3469P5751f3413A26734
16107C04200j34362b0874A72262a42063e0618j69995A322b70808b1801j0654H5744
16095B87408p8365I392a17564l2319a1974I1424a80680q2563B18391C6169A5091
16083A73508N1680q6196b1746r9609I1513g3695a7985I6302b53417A18981J99605
16072C18586A22232c6898k5604l4409K3899g835j69876F5357c0590F2052L76714
16061D38766A94107b71075a17581M5513j77933H381a20852O760J7060k13030A61258
16049A84719b5830G7777c09629a43379A12979a42693J4867o2256A89663D3683
16038C6866F794c0921C19060a99430F8870J39265b54759e1048o7339A86962m6752
$$ plain form
16027 140210 124047 -123122 -501315 147266 -195508 -197581 138723 -39990 -185921 306195
16016 -179028 184299 232908 -120074 174306 54308 -133366 -222098 9617 56144 -245662 149453
16004 20782 -25576 82565 183798 -296763 32780 -116389 113584 -70371 83578 -12779 -241220
15993 -241220 76629 -175991 -123033 -71041 -20777 -195242 -20199 -47890 -280346 -81461 -101498
15982 -101498 381364 192900 107301 -283783 52141 177366 135637 -45166 48396 -166353
15971 5745 -173200 -40013 110418 -225344 -73688 116861 -21010 -137792 -49501 153132 -160393
15959 432157 -49180 -360461 -145832 -64925 -173941 -3705 -144505 66048 124265 253916 499221
15948 499221 -120931 -240571 -81415 -115967 -114863 -135974 20862 -47952 109202 -90933 37782
$$ packed form
16027A40210j6163a23122l78193A47266a95508k073A38723c9990j45931C06195
16016a79028A84299M8609a20074A74306E4308a33366q8732I617M6527b45662A49453
16004B0782b5576H2565J01233b96763C2780a16389A13584g0371H3578a2779k28441
15993b41220G6629a75991N2958N1992b0777j74465b0199k7691k32456h1461k0037
15982a01498C81364j88464q5599b83783E2141J25225m1729d5166D8396a66353
15971E745a73200d0013A10418b25344g3688A16861b1010j16782d9501A53132a60393
15959D32157d9180l11281a45832f4925j09016c705j40800F6048N8217J29651K45305
15948D99221a20931j19640h1415l4552J104k1111B0862d7952A09202i0933C7782
$$ plain form
15936 -348032 -169616 9324 256634 -357421 -66541 57274 -80592 -312331 19552 -34564 8897
15924 44357 -255963 -182025 -156349 -237637 227015 -226449 -53598 112426 -110836 -331536
15914 -331536 150943 -34546 104605 27471 -3402 173551 143259 87674 107800 59405 -64709
15902 54088 84663 -96305 2667 -23692 30420 117455 -103659 250072 313813 -64978 -31427
15890 250906 -9837 -102799 -91209 -282169 -291227 -190223 193418 248958 114244 -108740 -40659
15878 -158594 -98476 -173057 -400703 235660 -16926 110708 -89037 95811 44545 -92918 68914
15866 -164110 174586 -71817 -222364 -265504 134567 -36621 121625 -29355 -64099 -888 11424
15854 322371 -152962 95026 120576 -228924 119784 -193473 -64852 213442 39841 105850
$$ packed form
15936c48032a69616I324K47310c57421f6541E7274h0592k31739A9552c4564H897
15924D4357b55963P3938K5676q1288B27015b26449e3598A12426a10836k20700
15914c31536A50943c4546A04605B7471c402A73551l0292n5585K0126m8395f4709
15902E4088L0575i6305B667b3692C0420Q7035a03659B50072O3741f4978c1427
15890B50906i837r2962J1590j90960r058J01004A93418N5540A14244a08740d0659
15878a58594O0118p4581k27646B35660a6926A10708h9037I5811D4545i2918F8914
15866a64110A74586g1817j50547m3140A34567c6621A21625b9355l4744h88A1424
15854C22371a52962I5026K5550b28924A19784a93473f4852B13442C9841O6009
$$ plain form
15844 105850 -264141 -50810 238515 22969 262928 115495 222360 -108920 331317 444211
15834 444211 -3533 -185746 46762 -69362 -172450 -139285 -101014 -5106 -127486 187351 78100
15822 54960 -69317 287662 104911 -15389 75111 -167399 -275955 319029 111156 -180293
15811 -264194 -230228 -326143 -270174 -131710 -134378 -89157 -4003 -146339 -122651 -37168 -257285
15800 -257285 76203 18658 155572 1659 292875 1921 -65324 -83438 -76258 -90679 -90775 -136615
15788 -136615 -385730 62074 -18211 -180995 -186956 -83726 -168897 99600 194547 -110204 235117
15776 197106 -47842 252491 -175972 36965 75065 66558 -261093 68189 -108081 -216799 309629
15764 -304697 -129601 41459 -82085 -41112 -137991 36733 11242 -254686 -95176 -122576 -63963
$$ packed form
15844A05850b64141e0810B38515B2969K39959A15495J06865a08920C31317J12894
15834D44211c533j82213D6762f9362j03088L3165L8271e106j22380A87351G8100
15822E4960f9317B87662A04911a5389G5111a67399j08556C19029A11156a80293
15811b64194L3966r5915N5969a31710k668M5221d003j42336K3688c7168k20117
15800b57285G6203A8658J36914A659K91216A921f5324j8114P180j4421r6m5840
15788a36615k49115F2074a8211j62784n961h3726q5171I9600R4947a10204B35117
15776A97106d7842B52491a75972C6965L8100q507b61093F8189a08081j08718C09629
15764c04697a29601D1459h2085M0973r6879C6733A1242b54686i5176k7400N8613
$$ plain form
15753 -63963 -34371 -124698 -160847 5226 67724 68191 -80146 -47631 -24070 -105160 -180024 -182125
15741 -182125 289166 83410 39707 -79101 23067 -56864 236460 103914 120238 -300760 -195443
15730 -195443 109938 -231607 -39820 -128410 171358 -281473 -245550 104662 41489 -4432 -32841
15719 -32841 -181880 -450492 -218313 -105014 -322586 -43772 -285125 -70806 -223299 331672
15708 -52858 -56193 -242096 -384928 -101194 45891 230540 70861 396512 -108903 113513
15697 167670 191166 -146938 35647 40663 150514 110120 -68860 -13153 132675 -359133 -94396
15685 141197 159977 -5180 -56104 -60405 -33996 388952 -42124 201648 87827 113375 -81381
15673 -240050 54856 444426 275681 -38389 -62680 -35153 -196868 -80540 166904 -246332
$$ packed form
15753f3963K9592r0327l6149E226O2498M67h0146L2515K3561q1090p4864k101
15741a82125B89166H3410C9707g9101B3067e6864B36460A03914J6324c00760J05317
15730a95443A09938b31607c9820q8590A71358b81473L5923A04662D1489d432k8409
15719c2841j49039k68612b18313a05014k17572d3772k41353g0806j52493C31672
15708e2858l335j85903j42832a01194D5891J84649G0861L25651a08903A13513
15697A67670K3496a46938C5647N016J09851m0394f8860a3153A32675c59133i4396
15685A41197J8780e180n0924m301K6409C88952d2124B01648H7827K5548h1381
15673b40050E4856L89570j68745c8389k4291K7527j61715h0540A66904b46332
$$ plain form
15662 -204399 -24205 -112610 -14204 390224 -290765 215063 90282 17144 -68314 257518 387313
15651 387313 -106329 168689 -150353 91953 -176880 -149917 -129298 -228324 220748 -117989
15640 -192417 81913 188218 -200255 37322 177950 -390014 -176717 -216830 -33198 107619
15629 -261110 74474 164833 -19269 157654 -56942 -96673 -289764 20210 -79238 -74930 -303071
15618 -303071 -107579 -89282 -52315 -174908 -10495 -448078 152849 6562 -146485 12929 -85951
15606 -171503 69138 80897 -357313 -73491 -38229 -82300 -56907 322120 -151519 80150 -71607
15594 -109686 -114556 -255562 -108019 37101 -32408 -212920 -91089 158635 243167 -359022 -222601
15583 -222601 113482 -150716 -92514 -73669 158529 -208726 170848 -57506 -71918 22318
$$ packed form
15662b04399b4205q8405a4204C90224b90765B15063I0282A7144f8314B57518J29795
15651C87313a06329A68689a50353I1953a76880K6963K0619r9026B20748a17989
15640a92417H1913J06305b00255C7322J40628c90014a76717m0113c3198A07619
15629b61110G4474R0359a9269A57654e6942l9731j93091B0210g9238M308k28141
15618c03071a07579J8297L6967j22593a0495m37583A52849F562a46485A2929h5951
15606a71503F9138J1759c57313g3491L5262m4071K5393C22120a51519H0150g1607
15594a09686m870j41006a08019C7101c2408j80512i1089A58635Q4532c59022J36421
15583b22601A13482a50716N8202J8845A58529b08726A70848e7506j4412B2318
$$ plain form
15572 12305 -173039 20118 211 -57854 -105229 22909 -29940 106354 -255320 -149810 -82370
15561 -82370 6582 50947 -60234 -55489 -88475 -12311 -119413 18542 167530 127570 28719 20586
15549 20586 -221974 -39457 338313 -50498 -91491 51842 -168556 89310 82143 -72560 -292196
15538 -292196 -218670 -14782 148586 255756 -37676 37322 222609 -228054 -116360 123158
15527 401900 -37444 948 145745 -97148 9438 -100656 -16560 53246 213241 -109685 -77533
15516 -77533 -104541 199460 -299596 -69321 285687 115464 191154 13840 156747 -26247 136139
15504 143902 47973 396713 -122975 -28129 -151020 86868 183212 -229682 -111468 -20018
15493 -104799 262082 22876 -21018 165559 -21520 -127905 -28334 144597 -385231 108991
$$ packed form
15572A2305a73039B0118B11e7854m7375B2909b9940A06354b55320J05510O7440
15561h2370F582M4365f0234M745l2986a2311j07102A8542J48988l9960B8719q133
15549B0586b21974c9457C38313e0498m0993E1842a68556H9310p167g2560k19636
15538b92196P3526a4782A48586J07170c7676C7322J85287b28054J11694A23158
15527D01900c7444I48J44797i7148I438a00656a6560E3246J59995a09685L2152
15516g7533k7008A99460b99596f9321B85687A15464P5690A3840J42907b6247A36139
15504A43902D7973L48740a22975b8129j22891H6868R6344b29682a11468b0018
15493a04799B62082B2876b1018A65559b1520j06385b8334A44597c85231A08991
$$ plain form
15482 -47448 -28282 81084 -167095 252751 162494 42415 130893 167367 -100933 24108 -85728
15470 -142512 -117423 60073 -223454 36530 -71367 -224249 -184408 10237 -79422 140089 77121
15459 77121 -374454 13683 121619 -133728 -420128 23942 77101 138810 33098 -14720 -80975
15448 -80975 42918 103324 -93081 34988 -429207 -156340 2296 -222724 65019 -77134 156440
15436 272489 -89720 -29822 -7075 1631 58412 -103330 51877 49916 -46151 38183 210816 186707
15424 186707 -190382 -21644 -232233 206035 144522 41550 78392 86640 -92188 142076 -60014
15412 271022 -114093 94059 238001 14306 -15485 190038 -114290 -188293 -55324 235609
15401 10456 -72631 -26040 219131 173762 54975 8509 79638 -152180 -300140 104572 -394805
$$ packed form
15482d7448J9166H1084a67095B52751r0257D2415Q8478L6474a00933B4108h5728
15470a42512K5089F0073b23454C6530g1367j52882L9841A0237g9422A40089o2968
15459G7121c74454A3683J07936a33728k86400B3942N3159O1709C3098a4720o6255
15448h0975D2918O0406i3081C4988d29207a56340B296b22724F5019g7134A56440
15436B72489h9720b9822g075A631N6781a03330E1877j961d6151C8183J72633k4109
15424A86707a90382b1644k10589B06035o1513D1550L6842Q248i2188A42076f0014
15412B71022a14093I4059J43942A4306a5485A90038a14290p4003e5324B35609
15401A0456g2631b6040B19131m5369E4975H509P1129a52180j47960A04572c94805
$$ plain form
15389 -154985 223803 -83062 -142065 -85741 -126495 -169863 -126652 184291 216666 -15142 168011
15377 -164878 108197 -14527 85140 -853 -180095 55560 -222735 -88358 160511 -58600 9928
15365 -93899 36544 -137684 123527 157007 -8739 127153 267421 236462 306935 -4211 -36452
15354 -36452 -13624 -52428 20339 145157 335033 -52535 -287936 -126423 77532 63501 22377
15342 -94896 -181113 101738 -249456 46954 126552 -61731 399895 136338 -20798 -128241 -39387
15330 -271268 348421 -182919 168915 51278 161062 89412 -157327 -65998 -4974 -2816 -41518
15319 -41518 -88669 -449450 151146 -4047 400881 73808 305260 91515 -100791 293567 -41743
15307 369251 76283 214779 -122006 160824 271342 104576 60162 157339 28850 174856
$$ packed form
15389a54985B23803h3062n9003N6324m0754m3368M3211A84291L2375a5142A68011
15377a64878A08197a4527H5140h53j79242E5560b22735h8358A60511e8600I928
15365i3899C6544a37684A23527L3480h739A27153J40268l0959P0473d211l2241
15354c6452a3624l8804B0339J24818J89876e2535k35401a26423G7532j4031B2377
15342i4896q6217A01738b49456D6954P9598f1731C99895A36338b0798j07443c9387
15330b71268C48421a82919A68915E1278J09784p1650a57327f5998d974K158l8702
15319d1518m7151l60781A51146d047D00881G3808K31452I1515a00791B93567d1743
15307C69251G6283J38496a22006A60824J10518A04576m4414R7177B8850J46006
$$ plain form
15297 174856 130952 225421 -30095 258492 135522 167024 -139835 -25378 -31667 -17308 251171
15285 -155194 258158 183515 2642 456146 163029 43283 189879 6263 267425 236808 252293
15274 252293 131662 33741 287390 272890 85350 125980 54998 173514 16424 434124 -16794
15262 101567 -56938 -60397 98366 -122331 362216 4167 636769 35915 -48618 406777 401119
15251 401119 67909 265051 173002 294317 73300 203595 247443 237393 167095 206526 422505
15240 422505 377805 120454 194694 260950 153523 -168174 144050 278748 250932 91355
15229 396336 269203 -44778 -177088 -22262 -87804 -95084 -195022 131323 -178928 -134225 159859
15217 189665 -8886 79604 -214063 309202 193539 194816 -112495 45498 177765 -117714 65067
$$ packed form
15297A74856m3904R4469c0095B58492j22970L1502a39835b5378o289J4359B51171
15285a55194B58158p4643B642M53504A63029D3283J46596F263K61162l0617J5485
15274B52293j20631C3741K53649j4500H5350M0630E4998J18516A6424M17700a6794
15262A01567e6938l459I8366a22331C62216D167O32602C5915d8618D06777n658
15251D01119F7909J97142r2049J21315G3300J30295M3848j0050p0298L9431K15979
15240D22505m4700A20454P4240O6256j07427a68174A44050J34698k7816I1355
15229C96336j27133d4778j32310b2262o5542p280r9938A31323a78928M4703A59859
15217A89665h886G9604b14063C09202j15663J277a12495D5498J32267a17714F5067
$$ plain form
15205 2020 -84360 78579 -48915 34818 20953 199808 73241 125749 58382 187989 -7221 266929
15192 275505 276721 267901 166019 191485 -234741 80848 14511 136121 125056 -138599 190718
15180 -2926 -7039 34749 -327668 127292 -25391 28656 355137 3728 201316 76021 -189473
15168 125554 -64176 -202632 -65403 -74744 149111 308693 8829 106369 -162774 -229962 -242414
15157 -242414 124613 -144088 36181 117985 267572 11607 -110975 29586 174037 -177747
15146 124562 35921 -144499 -94248 98869 72527 10980 20304 -68802 -211000 -96121 19782
15134 281382 -75654 264237 43017 -158520 -148863 -52205 288237 20775 2177 85009 -15604
15122 18163 233735 52284 271171 53558 163470 51832 129425 -201555 -43293 136036 233898
$$ packed form
15205B020h4360G8579d8915C4818j3865J78855G3241N2508E8382J29607g221B66929
15192B75505J216q820j01882K5466b34741H0848A4511J21610j1065a38599A90718
15180b926m113C4749c27668A27292b5391B8656L26481C728J97588G6021a89473
15168A25554f4176j38456f5403r341A49111J59582H829R7540a62774o7188j2452
15157b42414A24613a44088C6181Q1804J49587A1607a10975B9586J44451a77747
15146A24562C5921a44499N0251I8869k6342A0980R324f8802j42198i6121A9782
15134B81382g5654B64237D3017a58520R657e2205B88237B0775B177Q2832a5604
15122A8163K15572E2284K18887E3558J09912E1832P7593b01555d3293A36036R7862
$$ plain form
15111 233898 -100623 -77264 18659 421891 -49794 15118 338682 164678 442546 55570
15100 155536 372405 145126 89203 -91298 150048 -149169 147015 -24469 301560 344080
15090 344080 275711 217291 5400 219549 -98955 205961 566222 303748 128027 269042
15080 269042 459947 465524 333435 178848 298651 140720 202445 138766 78919 -4954 470443
15068 244681 119911 373623 153247 45675 243700 330255 259781 224951 162542 270103
15058 270103 288971 230389 177928 255814 223371 155855 -34558 312915 153579 187243 111454
15047 111454 229571 219077 297204 341681 -28135 -162719 546825 184506 232106 131 159167
15036 159167 134105 232190 360142 144938 -157410 65682 576246 -109709 174260 99973
$$ packed form
15111B33898a00623K3359A8659M03232d9794A5118L23564A64678K77868E5570
15100A55536K16869A45126n5923i1298A50048a49169A47015b4469C01560M2520
15090C44080o8369n8420E400K14149i8955B05961L60261k62474A28027J41015
15080B69042J90905N577j32089j54587J19803A40720O1725o3679n9847d954D70443
15068B44681A19911K53712A53247D5675J98025Q6555p0474l4830o2409J07561
15058B70103J8868n8582n2461P7886l2443o7516c4558C12915A53579L3664p5789
15047A11454J18117j0494P8127M4477b8135j34584E46825A84506M7600A31J59036
15036A59167k5062R8085J27952A44938a57410F5682N10564a09709A74260p4287
$$ plain form
15026 99973 96255 111627 384926 260446 152427 344867 446037 278568 283722 190244 66630
15014 266711 522414 182086 558652 607834 87659 364393 298949 70917 142319 262995
15004 262995 414544 245985 217162 89053 332683 253840 164207 11737 74379 367554 278792
14993 278792 -38600 247590 -65015 -32094 589350 -12846 245047 413663 462293 196396
14982 33760 369155 -175018 238311 369390 -61815 306256 124258 231402 300762 424470
14972 424470 -19536 323160 198497 43634 302913 257409 -70213 142723 305079 281927
14962 281927 289082 408576 219246 -18573 282315 390134 -158013 25520 -57222 85060 357843
14951 357843 303185 432492 370860 265148 95774 275716 68234 51691 348730 331879 118503
$$ packed form
15026I9973l718J5372K73299j24480j08019J92440J01170j67469N154r3478F6630
15014B66711K55703A82086L76566M9182H7659K76734o5444G0917P1402J20676
15004B62995J51549j68559k8823H9053K43630p8843q9633A1737O2642K93175q8762
14993B78792c8600B47590f5015c2094E89350a2846B45047J68616M8630A96396
14982C3760L35395a75018B38311J31079f1815C06256A24258J07144O9360J23708
14972D24470a9536C23160j24663D3634K59279m5504g0213A42723J62356k3152
14962B81927P155J19494j89330a8573B82315J07819a58013B5520e7222H5060K72783
14951C57843n4658J29307o1632j05712I5774J79942F8234j6543K97039j6851A18503
$$ plain form
14939 18114 331422 57421 264997 263457 472297 198218 344217 294364 408994 362186 257047
14928 257047 355279 189761 624845 249692 365432 416897 130137 491819 594552 547338
14918 547338 152435 340812 209793 388769 148835 194779 625793 299577 135977 349834
14908 349834 476142 344662 417248 357896 139654 461447 153805 194863 292693 -942 437813
14896 192400 303350 218305 30882 282894 427690 235083 245978 444848 388744 455582
14886 455582 431632 272226 559425 417738 485378 446004 241869 555618 404102 208989
14876 208989 87555 339411 212661 304186 450485 624903 520922 495000 308684 380772
14866 380772 171446 59874 601623 573777 405718 337931 67885 689781 562462 323478
$$ packed form
14939A8114L13308E7421K07576j540K08840A98218J45999m9853J14630m6808j05139
14928B57047R8232j65518M35084B49692J15740N1465A30137L61682J02733m7214
14918E47338A52435J88377j31019J78976A48835M5944M31014B99577A35977K13857
14908C49834J26308j31480P2586n9352A39654L21793A53805M1058R7830i42D37813
14896A92400J10950q5045C0882K52012J44796j92607J0895J98870n6104O6838
14886D55582k3950j59406K87199j41687O7640l9374k04135L13749j51516j95113
14876B08989H7555K51856j26750R1525J46299J74418j03981k5922j86316P2088
14866C80772A71446E9874N41749k7846j68059o7787F7885O21896j27319k38984
$$ plain form
14856 323478 387632 242657 353019 530873 700329 515919 497687 119997 430684 249517
14846 249517 235794 492079 361303 -22789 566898 220926 520656 120701 696472 741428
14836 741428 422736 577173 344158 22727 460896 176677 618620 600330 450892 535110
14826 535110 393175 343127 366049 322284 269713 325678 588699 551100 495344 488743 644361
14815 644361 496720 479445 471654 346837 426950 569678 581744 395474 598988 558196 360997
14804 360997 716829 447349 319105 873396 676830 682497 383540 590424 470120 599902
14794 599902 787801 920109 457993 656763 615378 481088 678135 415417 641845 121599
14783 545211 412680 707813 659553 415694 477307 662179 708575 502149 390553 663971
$$ packed form
14856C23478O4154j44975J10362J77854J69456j84410j8232A19997L10687j81167
14846B49517j3723K56285j30776b2789E66898B20926K99730A20701N75771M4956
14836G41428l18692J54437k33015B2727M38169A76677M41943j8290j49438Q4218
14826E35110j41935n0048K2922m3765n2571N5965K63021l7599n5756o601J55618
14815F44361j47641j7275p791j24817Q0113J42728J2066j86270K03514m0792j97199
14804C60997L55832k69480j28244N54291j96566N667k98957K06884j20304J29782
14794E99902J87899J32308D57993J98770m1385j34290J97047k62718K26428A21599
14783E45211j32531K95133m8260k43859O1613J84872M6396k06426j11596K73418
$$ plain form
14773 663971 667438 717139 571925 809540 563593 270895 600961 552991 626037 620709 477974
14762 477974 809724 593276 438080 623622 567747 943964 637054 534119 915367 595999
14752 595999 488157 711046 772717 664914 804583 781577 761699 738295 952706 1018454
14742 1018454 876640 996756 798271 808140 578693 862585 738408 599414 877410 916262
14732 916262 833440 671375 861265 633090 795700 602504 782658 748911 936034 898192
14722 898192 978003 907153 937926 1032650 735778 537393 815845 813852 1157016 1010510 1120136
14711 1120136 899809 856181 823279 891100 824810 1140588 1006730 985449 963183 825537
14701 825537 970413 755808 733896 622305 1026866 1125389 1106998 1121991 813309 964471
$$ packed form
14773F63971L467M9701j45214K37615k45947B70895L30066m7970P3046n328j42735
14762D77974L31750k16448j55196J85542n5875L76217l06910j02935L81248l19368
14752E95999j07842K22889O1671j07803J39669k3006j9878k3404K14411O5748
14742A018454j41814J20116j98485R869k29447K83892j24177j38994K77996L8852
14732I16262q2822j62065J89890k28175J62610j93196J80154l3747J87123l7842
14722H98192P9811p0850L0773R4724k96872j98385K78452j993L43164j46506J09626
14711A120136k20327m3628l2902O7821o6290L15778j33858k1281k2266j37646
14701H25537J44876k14605k1912j11591M04561R8523j8391J4993l08682J51162
$$ plain form
14691 964471 951288 1123108 1023128 867957 910035 1038270 1180443 1166454 912518 923510
14681 923510 1003368 1056855 1334515 1204215 1263042 1311925 939172 1327310 1110043 1395913
14671 1395913 1228529 942538 1318606 1231412 1165336 1372549 1299395 1210045 1431829 1121530
14661 1121530 1184436 1424854 1073794 1235624 1396217 1542247 1204940 1292923 1604205 1188326
14651 1188326 1123150 1403844 1330525 1464478 1368683 1127702 1531368 1309067 1726864 1508744
14641 1508744 1329596 1684708 1674515 1407626 1840551 1641569 1647323 1595978 1577163 1810307
14631 1810307 1391284 1690011 1606203 1689486 1676740 1703102 1681073 1612688 1551433 1335786 1860887
14620 1860887 1625595 1972929 1724136 1718489 1994318 1721012 1594184 1909488 1864688 1678359
$$ packed form
14691I64471j3183J71820r9980j55171M2078J28235J42173j3989k53936J0992
14681I23510P9858N3487K77660j30300N8827M8883l72753L88138k17267K85870
14671A395913j67384k85991L76068q7194o6076K07213p3154q9350K21784l10299
14661A121530O2906K40418l51060J61830J60593J46030l37307Q7983L11282m15879
14651A188326o5176K80694p3319J33953r5795k40981M03666k22301M17797k18120
14641A508744j79148L55112j0193k66889M32925j98982N754n1345j8815K33144
14631A810307m19023K98727q3808Q3283j2746K6362k2029o8385o1255k15647N25101
14620A860887k35292L47334k48793n647K75829k73306j26828L15304m4800j86329
$$ plain form
14610 1678359 1985646 2044685 2020546 2152427 2152151 1779788 2010024 2082427 1908118 2316420
14600 2316420 2199099 2093087 2080214 2487755 2296060 2520956 2398759 2630337 2738207 2437212
14590 2437212 2757428 2752998 2671808 2836294 2853661 2799596 3024541 2824678 2736227 3042059
14580 3042059 3208253 3091461 3182263 3298961 3063402 3514996 3563284 3749084 3475025 3573079
14570 3573079 3772404 3622084 3801305 3775987 3947545 3812620 4291218 4448537 4657265 4582615
14560 4582615 4800236 5072488 4980999 4761131 5112967 5189479 5903209 6094556 6401246 6855853
14550 6855853 7516479 7372666 7568097 8072322 7924507 8169347 7659805 7560401 7081274 6988740
14540 6988740 6210637 5572304 5673577 5170817 4857609 4756811 4598811 4237038 4249319 4339206
$$ packed form
14610A678359L07287N9039k4139J31881k76l72363K30236P2403j74309M08302
14600B316420j17321j06012j2873M07541j91695K24896j22197K31578J07870l00995
14590B437212L20216m430q1190J64486J7367n4065K24945j99863q8451L05832
14580C042059J66194j16792R0802J16698k35559M51594M8288J85800k74059R8054
14570C573079J99325j50320J79221k5318J71558j34925M78598J57319K08728p4650
14560D582615K17621K72252r1489k19868L51836P6512P13730J91347L06690M54607
14550F855853O60626j43813J95431N04225j47815K44840n09542r9404m79127r2534
14540F988740p78103o38333J01273n02760l13208j00798j58000l61773J2281Q9887
$$ plain form
14530 4339206 3873399 3762576 3373368 3291641 3091377 3181021 2990120 2863771 2943227 3144370
14520 3144370 3039897 3318559 3303673 2936601 3081022 3273864 3206573 3329178 3253576 3386572
14510 3386572 3466981 3525988 3841205 3621341 3660034 3666772 3638232 3880294 3731188 4093050
14500 4093050 3353264 3893677 4064038 3991043 3956423 3961917 4133569 4418728 4182394 4207570
14490 4207570 4264485 4215479 4208254 4803365 4238347 4910794 4664801 4574663 4646205 4818813
14480 4818813 4788649 4812865 5050063 5380911 5051863 5436641 5076004 5203381 5413142 5565732
14470 5565732 5465054 5843285 5397505 5846025 5591084 5964519 6019157 6186062 6333545 6293204
14460 6293204 6485672 7008842 6829215 6782228 7039046 7123047 7101780 7052848 7351956 7342662
$$ packed form
14530D339206m65807j10823l89208q1727k00264Q9644j90901j26349P9456K01143
14520C144370j04473K78662j4886l67072J44421J92842o7291J22605p5602J32996
14510C386572Q0409N9007L15217k19864L8693O738k8540K42062j49106L61862
14500D093050p39786N40413J70361p2995l4620N494J71652K85159k36334K5176
14490D207570N6915m9006p225N95111n65018O72447k45993r0138P1542J72608
14480D818813l0164K4216K37198L30848l29048L84778l60637J27377K09761J52590
14470E565732j00678L78231m45780M48520k54941L73435N4638J66905J47483m0341
14460F293204J92468N23170j79627m6987K56818Q4001k1267m8932K99108r294
$$ plain form
14450 7342662 7365532 7711643 7791351 8227901 8146638 8352467 8224316 8387563 8648496 9012472
14440 9012472 8905430 8823699 9336285 9354107 9468581 9763117 9841889 9948606 10681175 10434226
14430 10434226 10637434 10555509 10807225 11002484 11285167 11343700 11280613 11857529 12086285 12236532
14420 12236532 12330696 12689372 13050906 13039048 13092703 13496624 13817066 14019483 14245219 14533824
14410 14533824 14947771 15448346 15327180 15689033 15638302 16383572 16815603 16652877 17304729
14401 17304729 17364279 17633080 18074163 18382477 18923540 19244387 19757543 20240369 20512251
14392 20512251 20656193 21409446 21810594 22186912 22476586 23494711 23716677 24056514 24240670
14383 24240670 24667803 25860420 26137800 26701443 26984323 27359497 27912773 28940013 29539217
$$ packed form
14450G342662K2870L46111P9708M36550q1263K05829j28151J63247K60933L63976
14440I012472j07042q1731N12586J7822J14474K94536P8772J06717P32569k46949
14430A0434226K03208q1925K51716J95259K82683N8533o3087N76916K28756J50247
14420A2236532R4164L58676L61534j1858N3655M03921L20442K02417K25736K88605
14410A4533824M13947N00575j21166L61853n0731P45270M32031j62726O51852
14401A7304729N9550K68801M41083L08314N41063L20847N13156M82826K71882
14392B0512251J43942P53253M01148L76318K89674J018125K21966L39837J84156
14383B4240670M27133J192617K77380N63643K82880L75174N53276J027240N99204
$$ plain form
14374 29539217 30121600 30911064 31453997 31939071 32953059 33828297 34684664 35510006 36454932
14365 36454932 36787554 37647681 38871119 39882922 40737453 41847502 42732060 43724615 44959037
14356 44959037 45996566 47430072 48430408 49973853 50884089 52603594 53716395 55334424
14348 55334424 56806879 58412121 59921005 61435679 63445265 64990446 66931875 69111974
14340 69111974 70792683 73079587 75337096 77234369 79619841 81953931 84422269 86799569
14332 86799569 89421055 91648165 94280082 97349197 99694031 102112539 105102538 107982113
14324 107982113 110736925 113363922 116610686 119824751 123118378 126425455 129694282 132822969
14316 132822969 136659668 140057160 144131552 147579302 151599800 155634983 159178779 163042842
$$ packed form
14374B9539217N82383P89464N42933M85074J013988Q75238Q56367Q25342R44926
14365C6454932L32622Q60127J223438J011803Q54531J110049Q84558R92555J234422
14356D4959037J037529J433506J000336J543445R10236J719505J112801J618029
14348E5334424J472455J605242J508884J514674K009586J545181J941429K180099
14340F9111974J680709K286904K257509J897273K385472K334090K468338K377300
14332H6799569K621486K227110K631917L069115K344834K418508K989999K879575
14324A07982113K754812K626997L246764L214065L293627L307077L268827L128687
14316A32822969L836699L397492M074392L447750M020498M035183L543796L864063
$$ plain form
14308 163042842 166309135 169828635 172649712 175504248 178684371 181312249 184135709 188011281
14300 188011281 191447682 194954114 198729580 201705129 204335255 208061606 211730086 215924667
14292 215924667 219633109 223780243 227759816 231373844 234718068 238577905 242256748 246647231
14284 246647231 250764399 254853560 258589888 262454478 267187802 272937678 279405596 288518418
14276 288518418 297787838 307694487 311740775 311938272 312471964 317425693 321421369 320183673
14268 320183673 316783291 311929220 308271989 305770097 303155524 299113274 293298437 287417627
14260 287417627 282024541 277975250 274159048 270692765 268355306 265857825 263172016 259426048
14252 259426048 252863467 243187060 229480742 211883240 193569019 177770040 164037613
$$ packed form
14308A63042842L266293L519500K821077K854536L180123K627878K823460L875572
14300A88011281L436401L506432L775466K975549K630126L726351L668480M194581
14292B15924667L708442M147134L979573L614028L344224L859837L678843M390483
14284B46647231M117168M089161L736328L864590M733324N749876O467918R112822
14276B88518418R269420R906649M046288J97497N33692M953729L995676j237696
14268C20183673l400382m854071l657231k501892k614573m042250n814837n880810
14260B87417627n393086m049291l816202l466283k337459k497481k685809l745968
14252B59426048o562581r676407j3706318j7597502j8314221j5798979j3732427
$$ plain form
14245 164037613 152635987 142741136 133913060 126131226 119161567 112561257 106361943 101205156
14237 101205156 96327112 91225927 87540786 83285302 79708217 75920535 72857524 69895112
14229 69895112 67043069 64183412 62013150 59459855 57587830 55469102 53451277 51492249
14221 51492249 50144249 48043240 46314153 44966997 43357174 42243740 40662016 39387499
14213 39387499 38029893 37091243 36002780 35040532 33772762 32801990 31642213 30972758 30367424
14204 30367424 29448489 28661452 27576518 26970238 26534558 26006659 25401881 24589277 23750408
14195 23750408 23503688 22654832 22282491 21785849 21261110 20366736 20041868 19628588 19159595
14186 19159595 18690331 18352779 17644041 17364059 17043570 17039899 15970095 15681296 15586612 14963048
$$ packed form
14245A64037613j1401626r894851q828076p781834o969659o600310o199314n156787
14237A01205156m878044n101185l685141m255484l577085l787682l063011k962412
14229F9895112k852043k859657k170262k553295j872025k118728k017825j959028
14221E1492249j348000k101009j729087j347156j609823j113434j581724j274517
14213C9387499j357606r38650j088463r62248j267770r70772j159777o69455o05334
14204C0367424r18935p87037j084934o06280m35680n27899o04778q12604q38869
14195B3750408k46720q48856l72341m96642n24739q94374l24868m13280m68993
14186A9159595m69264l37552p08738k79982l20489l671j069804k88799r4684o23564
$$ plain form
14176 14963048 14883172 14678575 14548248 13971261 13978996 13422522 13298837 12696585 12925567 12869344
14166 12869344 12249544 12233892 11893286 11405352 11272935 11245166 10993278 10982157 10539472 10660536
14156 10660536 10228679 9666513 10187984 9517131 9599129 9673730 9376644 9226474 9283345 8881662
14146 8881662 8666983 8713525 8400629 8696942 8335864 8030230 7998591 7820685 7490856 7660947
14136 7660947 7701503 7298351 7484139 7588526 7297183 6742870 6678832 6736176 6949965 6467947
14126 6467947 6994495 6332248 6602661 6445870 6205417 6201723 6249013 6184658 6199232 6071553
14116 6071553 6181920 5802716 5709206 5759242 5665235 5701918 5447194 5628473 5363724 5370397
14106 5370397 5124287 5668139 5101060 4785258 5086295 4870544 5006061 5058198 4923029 5000794
$$ packed form
14176A4963048p9876k04597j30327n76987P735n56474j23685o02252K28982n6223
14166A2869344o19800j5652l40606m87934j32417k7769k51888j1121m42685J21064
14156A0660536m31857n62166N21471o70853Q1998P4601k97086j50170N6871m01683
14146H881662k14679M6542l12896K96313l61078l05634l1639j77906l29829J70091
14136G660947M0556m03152J85788J04387k91343n54313o4038N7344K13789m82018
14126F467947N26548o62247K70413j56791k40453l694M7290o4355J4574j27679
14116F071553J10367l79204r3510N0036r4007L6683k54724J81279k64749O673
14106E370397k46110N43852n67079l15802L01037k15751J35517N2137j35169P7765
$$ plain form
14096 5000794 4861375 4962630 4632272 4945256 4516381 4477376 4559784 4420802 4529681 4291088
14086 4291088 4275920 4399302 4345533 4425943 4140734 4291363 4246491 4042678 4024429 3815032
14076 3815032 4242193 3885173 3926603 4080654 4067750 3511369 3918601 3662947 3710132 4069857
14066 4069857 3541687 3799806 3557783 3956001 3595475 3668516 3635843 3607807 3511519 3800105
14056 3800105 3107250 3198423 3613737 3491243 3209684 3593561 3273377 3336816 3222701 3369586
14046 3369586 3097852 3678425 3087244 2910228 3251186 3053354 2873859 3462655 2663523
14037 2663523 3051931 3162003 3209436 3036016 2819209 3140095 2786593 2970423 2997995 3002785
14027 3002785 3057144 2813060 3182838 3101124 2782761 3297815 3193988 2948360 2994982 2812282
$$ packed form
14096E000794j39419J01255l30358L12984m28875l9005Q2408j38982J08879k38593
14086D291088j5168J23382n3769Q0410k85209J50629m4872k03813j8249k09397
14076C815032M27161l57020M1430J54051j2904n56381M07232k55654M7185L59725
14066D069857n28170K58119k42023L98218l60526P3041l2673k8036r6288K88586
14056C800105o92855R1173M15314j22494k81559L83877l20184O3439j14115J46885
14046C369586k71734N80573n91181j77016L40958j97832j79495N88796p99132
14037B663523L88408J10072M7433j73420k16807L20886l53502J83830K7572M790
14027C002785N4359k44084L69778q1714l18363N15054j03827k45628M6622j82700
$$ plain form
14017 2812282 3269259 2756058 3021572 3017554 3485239 3150876 2894392 2941750 3289671 3518549
14007 3518549 3170587 3515524 3731623 3395646 3826175 3773223 3617337 3828233 3777107 3837615
13997 3837615 4018802 4020442 4115139 4447271 4555963 4973609 5324426 5873900 5673717 6327215
13987 6327215 6494461 7468916 7225922 7040251 6547638 6573656 6032409 5977915 5364086 4932758
13977 4932758 4844209 4622291 4019790 3808110 3509071 3617078 3419864 3381989 3198277 2618905
13967 2618905 2340684 2152745 2171077 1726412 1636151 1772368 1862560 1628747 1471399 2199671
13957 2199671 1505486 1686785 1571522 1919991 1278210 1493541 1571401 1503602 1638888 1820780
13947 1820780 1354580 1603460 1549002 1377694 1607375 1845806 1724087 1583599 1483157 1520796
$$ packed form
14017B812282M56977n13201K65514m018M67685l34363k56484M7358L47921K28878
14007C518549l47962L44937K16099l35977M30529n2952j55886K10896n1126O0508
13997C837615J81187J640R4697L32132J08692M17646L50817N49474k00183O53498
13987F327215J67246R74455k42994j85671m92613K6018n41247n4494o13829m31328
13977D932758q8549k21918o02501k11680k99039J08007j97214l7875j83712n79372
13967B618905k78221j87939J8332m44665r0261J36217R0192k33813j57348P28272
13957B199671o94185J81299j15263L48469o41781K15331P7860o7799J35286J81892
13947A820780m66200K48880n4458j71308K29681K38431j21719j40488j00442L7639
$$ plain form
13937 1520796 1547071 1165904 1833050 1374268 1519966 1257198 1346852 1526780 1118382 1203093
13927 1203093 1147261 1165504 1614582 1213997 1154242 1421946 877686 1567292 1490794 1279281
13917 1279281 1418292 1323725 1337769 1307949 1089673 1085925 1418285 1650513 1111009 1462279
13907 1462279 1049497 1283206 1013839 1235181 1130783 1108494 1366795 1580989 1121202 1033271
13897 1033271 1399958 918464 1065096 891454 1093751 1035027 1105210 1070677 1272400 997295
13887 997295 1101543 985028 962739 823652 1050085 920501 1022833 1127958 1052638 1010233
13877 1010233 774515 1050178 1245033 950078 808151 705719 1150115 1168244 894323 904396
13867 904396 1015961 1209223 780084 755886 705900 790644 848301 1026173 1037327 842140
$$ packed form
13937A520796K6275l81167O67146m58782J45698k62768Q9654J79928m08398Q4711
13927A203093n5832J8243M49078m00585n9755K67704n44260O89606p6498k11513
13917A279281J39011r4567J4044k9820k18276l748L32360K32228n39504L51270
13907A462279m12782K33709k69367K21342j04398k2289K58301K14194m59787q7931
13897A033271L66687m81494J46632j73642K02297n8724P0183l4533K01723k75105
13887I97295J04248j16515k2289j39087K26433j29584J02332J05125p5320m2405
13877A010233k35718K75663J94855k94955j41927j02432M44396J8129k73921J0073
13867I04396J11565J93262m29139k4198m9986Q4744N7657J77872J1154j95187
$$ plain form
13857 842140 855691 1206811 620779 703164 785739 1032984 737727 785285 815062 692639
13847 692639 1009341 670340 1077052 849632 1038445 765099 922071 1106181 1233037 622703
13837 622703 732221 891316 716426 1112228 1009583 466485 687001 973757 944550 867365
13827 867365 986227 649712 535686 446477 612583 696467 869306 861741 595064 945354
13817 945354 502779 848291 629326 979191 534809 654389 840346 730726 685371 832500
13807 832500 660110 978938 652622 743239 854040 658755 683167 675564 752742 613899
13797 613899 739021 736004 583878 810174 650219 627112 511213 511688 670504 614313 808010
13786 808010 727034 742065 335062 838470 484115 557915 573185 598243 756309 348331
$$ packed form
13857H42140J3551L51120n86032Q2385Q2575K47245k95257M7558K9777j22423
13847F92639L16702l39001M06712k27420J88813k73346J56972J84110J26856o10334
13837F22703J09518J59095j74890L95802j02645D66485K20516K86756k9207p7185
13827H67365J18862l36515j14026q9209J66106Q3884J72839p565k66677L50290
13817I45354m42575L45512k18965L49865m44382J19580J85957j09620m5355J47129
13807H32500j72390L18828l26316R0617J10801j95285K4412p603P7178j38843
13797F13899J25122l017j52126K26296j59955k3107j15899M75J58816n6191J93697
13786H08010q0976J5031C35062N03408l54355P3800J5270K5058J58066C48331
$$ plain form
13775 455001 933167 807408 602461 530187 712034 737800 584956 392319 613808 713366
13765 713366 678720 769932 516278 749210 549416 530543 561807 266762 376376 314017
13755 314017 632964 823009 312485 801846 758819 616728 673573 516000 512569 584947
13745 584947 562650 624991 671166 296718 633913 790772 523035 778916 400937 535793
13735 535793 424012 474749 479502 556807 503310 523484 232139 582809 561483 465883 384148
13724 384148 430266 568785 444162 431914 614211 717098 470195 684854 374386 667016
13714 667016 428336 612201 343973 419179 405561 676525 427140 587113 372289 275783
13704 275783 538609 499230 557742 380530 286455 670653 241558 681792 245849 450884
$$ packed form
13775D55001M78166j25759k04947p2274J81847K5766j52844j92637K21489R9558
13765G13366l4646R1212k53654K32932j99794j8873L1264B66762J09614o2359
13755C14017L18947J90045C12485M89361m3027j42091N6845j57573l431P2378
13745E84947k2297O2341M6175B96718L37195J56859k67737K55881l77979J34856
13735E35793j11781N0737M753P7305n3497K0174B32139L50670k1326r5600q1735
13724C84148M6118J38519j24623j2248J82297J02887k46903K14659l10468K92630
13714F67016k38680J83865k68228P5206j3618K70964k49385J59973k14824r6506
13704B75783K62826l9379N8512j77212r4075L84198B41558M40234B45849K05035
$$ plain form
13694 450884 445624 458526 297812 320379 664729 239986 413726 601238 426695 335504
13684 335504 273158 498049 97706 571734 651925 299844 503335 157096 354528 503819
13674 503819 864954 528691 399582 235283 712367 141328 444946 226745 274214 513677
13664 513677 394370 513182 239638 575273 398759 281412 273038 295327 337356 390213
13654 390213 569079 570813 350912 206144 208229 437640 434384 -12367 210044 137760 170891
13643 170891 277263 287129 185400 418307 328361 251306 289204 432654 278901 426791
13633 426791 183394 188757 493257 79087 402909 188822 208487 427904 76349 236925
13623 236925 358676 299061 249766 163145 132655 443991 561458 247931 276750 344107 263818
$$ packed form
13694D50884n260J2902j60714K2567L44350B39986J73740J87512j74543r1191
13684C35504o2346K24891I7706M74028Q0191B99844K03491A57096J97432J49291
13674E03819L61135l36263j29109j64299M77084A41328L03618k18201M7469K39463
13664E13677j19307J18812B39638L35635j76514j17347q374K2289M2029N2857
13654C90213J78866J734k19901j44768K085K29411l256a2367B10044p2284L3131
13643A70891J06372R866j01729K32907q9946p7055L7898J43450j53753J47890
13633D26791A83394N363L04500G9087L23822A88822J9665K19417G6349J60576
13623B36925J21751n9615m9295q6621l0490L11336J17467B47931K8819O7357q0289
$$ plain form
13612 263818 392666 258175 188713 282321 172093 14415 308764 464376 279898 275459
13602 275459 488387 389173 200840 53711 394948 174818 446276 143961 314683 466197
13592 466197 450141 311695 176127 374207 288700 81078 332380 421060 350637 406191 193916
13580 425081 340338 284513 405688 360265 307875 -49835 312942 -84493 682976 389143 508117
13569 508117 67396 291067 310689 500155 227122 233564 212591 532511 91681 477591 156913
13557 353185 24873 757872 125388 382766 295875 241218 257025 327759 171499 225376 402882
13546 402882 255625 82814 246067 77624 32887 417426 268117 216203 151893 120064 356192
13535 356192 118436 508552 225057 287060 102082 263909 181410 233643 166562 287903
$$ packed form
13612B63818J28848j34491o9462R3608j10228A4415K94349J55612j84478m439
13602B75459K12928r9214j88333E3711L41237A74818K71458A43961J70722J51514
13592D66197j6056j38446j35568J98080q5507H1078K51302Q8680p0423N5554A93916
13580D25081q4743n5825J21175m5423n2390d9835C12942h4493F82976k93833J18974
13569E08117F7396K23671J9622J89466B27122O442k0973L19920I1681L85910A56913
13557C53185B4873P32999A25388K57378q6891n4657J5807P0734j56260N3877J77506
13546D02882j47257H2814J63253G7624C2887L84539j49309n1914o4310l1829K36128
13535C56192A18436L90116B25057O2003A02082J61827q2499N2233o7081J21341
$$ plain form
13525 287903 559763 -86222 154934 166328 126836 289254 275293 19493 281727 465011
13515 465011 125336 191647 335754 53544 399737 168877 220028 11621 246940 84980
13504 276054 194925 273549 74359 170045 -44143 170781 -35001 134496 152502 -175337 75036
13492 171811 237494 181319 -20373 200434 11779 295947 103741 232609 17999 449292
13482 449292 372809 411041 466213 90091 357649 108322 212840 178824 714525 449432
13472 449432 348238 500852 433216 243650 380975 275150 246658 160821 129181 124315 317441
13461 317441 254277 185844 261066 341320 130597 120776 193138 194242 266666 102110 302192
13450 302192 288051 364423 209632 114497 214482 386333 270779 -10634 471346 119228
$$ packed form
13525B87903K71860h6222A54934J1394l9492J62418j3961A9493K62234J83284
13515D65011A25336O6311J44107E3544L46193A68877N1151A1621K35319H4980
13504B76054q1129P8624G4359R5686d4143A70781c5001A34496J8006a75337G5036
13492A71811O5683n6175b0373B00434A1779K84168A03741J28868A7999M31293
13482D49292p6483L8232N5172I0091K67558A08322J04518l4016N35701k65093
13472D49432j01194J52614o7636j89566J37325j05825k8492q5837l1640m866J93126
13461C17441o3164o8433P5222Q0254A30597r821P2362J104P2424A02110K00082
13450C02192j4141P6372j54791r5135R9985J71851j15554a0634D71346A19228
$$ plain form
13439 226975 33875 191815 363592 -54397 -15136 329387 149427 125946 157639 87816 -160304
13427 456220 -85133 117026 126600 424645 155783 88946 135209 171435 310787 210593 362048
13416 362048 138342 36522 11687 59076 -35400 79181 69063 174791 -72456 128410 172977
13405 172977 457660 185380 321725 278473 494723 321207 438745 110590 209871 -67964
13394 343157 183155 79944 320518 289812 168655 166441 274137 293281 295695 515878 93709
13382 353166 180786 200150 180560 450069 39132 95868 345108 272737 348203 121988 222414
13371 222414 264525 123064 -107189 350306 41786 496591 59683 374920 328003 244381
13361 244381 275730 259577 339385 521096 86778 159630 298070 242382 316388 355621 77119
$$ packed form
13439B26975C3875J57940J71777e4397a5136C29387A49427k3481L1693o9823a60304
13427D56220h5133A17026R574K98045A55783o6837M6263L6226J39352j00194J51455
13416C62048A38342C6522A1687M7389c5400G9181j0118J05728g2456A28410M4567
13405A72977K84683A85380J36345m3252K16250j73516J17538A10590R9281f7964
13394C43157j60002G9944K40574l0706j21157k214J07696J9144K414K20183I3709
13382C53166j72380J9364j9590K69509C9132N6736K49240p2371P5466A21988J00426
13371B22414M2111A23064a07189C50306D1786M54805E9683L15237m6917q3622
13361B44381L1349j6153P9808J81711H6778P2852J38440n5688P4006L9233G7119
$$ plain form
13349 41350 65876 254289 233582 -70419 169991 144392 107818 310867 307799 196580 174005
13338 174005 24000 -41812 254823 323753 72158 260966 254657 233535 -206270 -4454 52253
13326 31909 161998 -42467 120201 -66174 258928 182950 10315 -88540 98248 94543 39365
13314 -5440 395531 446527 53878 382116 170599 221733 398596 108426 -194080 228844
13303 177276 222709 -262093 234148 81015 110715 -134254 -35911 121343 91636 32756 68093
13292 68093 228963 168070 158306 76660 108138 -81662 156458 -82985 46074 266579 177697
13281 177697 -136316 160406 -93434 257487 -73877 -62154 224593 182256 201684 451883
13271 451883 355880 417446 221933 -219449 -28535 201644 -58326 76823 -31606 265142 12716
$$ packed form
13349D1350K4526J88413k0707g0419A69991k5599l6574K03049l068j11219k2575
13338A74005B4000d1812B54823O8930G2158J88808o309k1122b06270d454E2253
13326C1909J30089d2467A20201f6174B58928p5978A0315h8540I8248l705C9365
13314e440C95531N0996E3878L28238A70599N1134J76863A08426a94080B28844
13303A77276M5433b62093B34148H1015K9700a34254c5911A21343k9707C2756L5337
13292F8093J60870o0893r764G6660L1478h1662A56458h2985D6074K20505q8882
13281A77697a36316A60406i3434B57487g3877J1723B24593m2337J9428K50199
13271D51883r6003O1566j95513b19449b8535B01644e8326G6823c1606B65142A2716
$$ plain form
13259 101742 50839 125412 190541 -98225 118539 35961 434193 134533 -45586 183244 67650
13247 41273 212170 72503 75988 -110054 205084 140341 -56716 170906 74616 332260 99231
13235 81676 249256 124044 346025 249485 83307 435061 53847 84117 77740 -313184 146985
13223 127532 99554 137840 117408 205304 68327 47219 507078 36016 37032 206151 -16779
13211 158939 -206116 -310213 22433 -395210 148009 -141057 -147640 280838 32873 -84445
13200 79938 65733 270836 251682 95741 212773 -19008 -22497 66083 -125475 -14843 236096
13188 89654 -97996 24552 251918 45320 356595 210938 171881 125839 241219 104155 69329
13177 69329 159696 453805 -233584 -217340 -100344 168398 -73402 -59422 259866 205203 -151853
$$ packed form
13259A01742E0839P4573O5129i8225A18539C5961L98232A34533d5586A83244F7650
13247D1273J70897G2503L485a10054B05084o4743e6716A70906G4616K57644I9231
13235H1676J67580A24044K21981r6540H3307L51754E3847L0270o377c13184A46985
13223A27532k7978L8286k0432Q7896F8327k1108M59859C6016J016J69119a6779
13211A58939b06116j04097B2433c95210A48009a41057o583B80838C2873h4445
13200G9938j4205K05103j9154I5741J17032a9008l489F6083a25475a4843B36096
13188H9654i7996B4552K27366D5320L11275j45657l9057m6042J15380A04155l4826
13177F9329R0367K94109b33584J6244a00344A68398g3402J3980B59866n4663a51853
$$ plain form
13165 360553 -347660 -315788 123303 89221 81237 65924 116178 -176369 96743 -61399 45977
13153 18750 127127 197660 -108180 10667 -32683 182331 -191836 -418213 423450 -85163
13142 220235 -388731 64663 135266 84799 375065 406926 70700 -205500 -70280 -32669 -21813
13131 -21813 19339 245498 -110374 269011 275338 -79705 -181926 113243 59883 38440 26286
13120 26286 319385 -32957 111795 236787 -180610 155817 162553 23025 -59610 251498 109956
13108 -227810 155987 -74935 -4040 -205684 4357 -283653 305385 280084 207952 216630 -53813
13096 93968 37675 59996 492005 78102 -226958 185614 60972 278832 46940 83643 88371
13085 88371 20815 17871 39081 -225288 -244243 -310828 -70483 80110 176073 217520 -100942
$$ packed form
13165C60553c47660L1872A23303l4082p984j5313N0254a76369I6743f1399D5977
13153A8750J08377P0533a08180A0667c2683A82331a91836k26377D23450h5163
13142B20235c88731F4663P0603n0467K90266L1861G0700b05500g0280c2669J0856
13131b1813A9339K26159a10374B69011O327g9705j02221A13243n3360k1443j2154
13120B6286K93099c2957A11795J24992a80610A55817O736B3025e9610B51498A09956
13108b27810A55987g4935d040k01644D357b83653C05385k5301p2132Q678e3813
13096I3968C7675K2321M32009G8102b26958A85614F0972K17860D6940L6703M728
13085H8371B0815k944K1210b25288j8955o6585g0483H0110R5963M1447a00942
$$ plain form
13073 236382 203986 131255 -33780 30098 -231723 373325 74519 207613 194177 238389 150551
13062 150551 122725 56950 -85324 40205 -80001 -88679 119483 -227216 158282 354106 142396
13050 271417 112931 143881 200646 113229 -9953 239262 474743 56662 333718 -65625 192309
13038 -48787 -174011 186213 334532 -39155 121068 276741 40130 -10476 491299 -254649
13027 -52047 32607 -228394 91292 141188 94584 325542 47416 269283 137852 147898 -23576
13015 191734 -96544 189326 95983 216144 17238 86154 65660 49257 274962 -88662 146920
13003 303686 -30097 247404 84642 -2787 76666 69271 111124 149580 99496 33937 376331
12992 376331 -219449 -204443 -73604 -135689 -59070 -100604 68419 284771 -185550 484 112130
$$ packed form
13073B36382l2396p2731c3780C0098b31723C73325G4519J33094j3436M4212q7838
13062A50551k7826E6950h5324D0205h0001q678A19483b27216A58282J95824A42396
13050B71417A12931L0950N6765q7417i953B39262K35481E6662K77056f5625A92309
13038d8787j25224A86213J48319c9155A21068J55673D0130a0476D91299b54649
13027e2047C2607b28394I1292M9896m6604K30958D7416K21867j31431J0046b3576
13015A91734i6544A89326r3343J20161A7238O8916k0494j6403K25705h8662A46920
13003C03686c0097B47404H4642b787G6666p395M1853L8456n0084C3937L42394
12992C76331b19449J5006g3604o2085e9070m1534F8419K16352a85550D84J11646
$$ plain form
12981 112130 15687 184330 95457 -99076 235179 -110866 65296 31819 254978 20499 269739
12970 269739 55348 464736 -12993 -125477 270865 224128 84918 259995 78078 227732
12960 227732 -9319 21333 309674 215933 187782 -35053 -262612 -195001 46439 -151494 124368
12948 116980 -40544 169083 186825 -33891 -186109 -120207 -143505 31937 28928 21448 170532
12937 170532 146250 -103097 -74730 33529 -82439 126387 -37350 4142 -269246 -17916 -240519
12926 -240519 157149 -268530 -213161 4618 17059 283125 162087 50163 84872 -71264 -165033
12915 -165033 -189379 -83737 22419 216619 -1681 -157295 43185 99465 249795 -104833 88681
12903 280562 -1399 54803 -527436 48675 40839 12263 200481 73480 278375 -154340 -14499
$$ packed form
12981A12130A5687J68643q8873i9076B35179a10866F5296C1819K23159B0499K49240
12970B69739E5348M09388a2993j12484B70865m6737H4918J75077G8078J49654
12960B27732i319B1333K88341r3741k8151c5053k27559O7611D6439a51494A24368
12948A16980d0544A69083J7742c3891j52218O5902k3298C1937l009p480J49084
12937A70532k4282a03097K8367C3529h2439A26387c7350D142b69246a7916k22603
12926b40519A57149b68530N5369D618J2441K66066j21038E0163L4709g1264r3769
12915a65033k4346h3737B2419J94200a681j55614D3185N6280J50330a04833H8681
12903B80562a399E4803e27436D8675p836A2263J88218G3480K04895a54340a4499
$$ plain form
12891 -32889 160386 -147012 176802 95930 100863 -364587 207661 64298 154262 7495 -311371
12879 127710 -100745 4563 421543 25010 -13409 -186794 221940 29071 17465 -607844 129539
12867 9993 -74716 190586 37631 -40950 -93557 200456 -311480 353767 -16157 -101683 -412701
12856 -412701 101739 -35426 531 47323 -19779 203540 93136 -135151 161113 -291186 -60537
12844 -235705 366449 156976 133344 -246440 -46074 65657 250471 -75175 -124657 -17086 159209
12832 -285530 -424941 -117545 -62915 -22443 -509876 -281941 -231462 78489 -193816 320445
12821 -37099 -55464 146680 363409 -49532 80804 169147 31556 36157 -67649 -316608 131762
12809 21281 34285 62756 -30449 -242240 179772 133374 -204389 -232157 -144400 348010 -13926
$$ packed form
12891c2889A60386a47012A76802q0872M933c64587B07661F4298Q9964G495c11371
12879A27710a00745D563M16980B5010a3409j73385B21940B9071j1606f07844A29539
12867I993g4716A90586C7631d0950n2607B00456c11480C53767a6157q5526l11018
12856d12701A01739c5426E31M6792a9779B03540I3136a35151A61113b91186f0537
12844b35705C66449A56976k3632b46440d6074F5657J84814g5175m9482a7086A59209
12832b85530j39411a17545N4630b2443m87433K27935N0479G8489a93816C20445
12821c7099j8365A46680K16729d9532H0804Q8343C1556M601f7649k48959A31762
12809B1281J3004K8471c0449k11791A79772m6398b04389k7768Q7757C48010a3926
$$ plain form
12797 316596 -327546 3503 85876 -133003 250048 288887 270253 -18697 -96961 11750 74618
12786 74618 -94333 428297 163572 177094 84812 116529 -19254 -133846 -176299 138842 -19163
12774 -55396 48963 -37311 -224113 201490 192777 20020 -237968 1942 -49233 186432 -140284
12762 121816 205336 -137781 452354 -203923 52340 159965 129582 -26768 147409 175169
12752 175169 -144377 11100 206217 -31777 -128887 184376 111014 351156 41745 135209 128241
12741 128241 71698 -34750 159221 -92616 -112706 70295 325997 -113131 -19690 25785 173413
12730 173413 34983 -27784 327247 -164483 34752 -139993 -113199 4185 -158518 259344 409348
12719 409348 158847 -75984 -20421 -224753 162405 -32123 -162846 -16821 192942 344326
$$ packed form
12797C16596c27546C503Q2373a33003B50048L8839j8634a8697p8264A1750O2868
12786G4618i4333D28297A63572J3522H4812L1717a9254j14592m2453A38842a9163
12774e5396D8963c7311j86802B01490q713B0020b37968A942d9233A86432a40284
12762A21816Q3520a37781D52354b03923E2340J07625l0383b6768A47409K7760
12752A75169a44377A1100J95117c1777r7110A84376p3362K40142D1745R3464o968
12741A28241n6543c4750A59221i2616k0090G0295K55702a13131a9690B5785J47628
12730A73413C4983b7784C27247a64483C4752a39993K6794D185a58518B59344J50004
12719D09348A58847g5984b0421k04332A62405c2123j30723a6821A92942J51384
$$ plain form
12709 344326 83873 18606 -5081 -23097 32214 35470 62919 326221 23793 84687 230832
12698 230832 -66954 -6098 -160301 -78550 108401 -11277 -272424 108612 -184719 47760 305564
12687 305564 -280192 98919 206466 149673 380683 162987 -148773 148017 111626 99366
12677 99366 237403 115312 -32161 240963 222985 76330 208326 -113960 34076 58305 -102485
12665 21956 413168 -454597 367895 -563 145248 90069 -163611 340769 -92731 497677 121725
12653 -41505 14693 63519 -252719 355087 -80170 166139 -203290 -220403 -171979 146877 14696
12641 -18575 16416 318406 200802 -123649 282558 -88493 62902 -96666 -109848 138463 -185969
12629 -16831 -90456 -31981 -193568 91675 135291 -171015 106875 148904 10380 57878 29098
$$ packed form
12709C44326H3873A8606e081j8016C2214L256K7449K63302B3793O0894J46145
12698B30832f6954f098j54203g8550A08401a1277k61147A08612a84719D7760K57804
12687C05564b80192I8919J07547n6793K31010A62987a48773A48017l6391j2260
12677I9366J38037A15312c2161B40963j7978G6330J31996a13960C4076K4229a02485
12665B1956L91212d54597C67895e63A45248n5179a63611C40769i2731D97677A21725
12653d1505A4693M8826b52719C55087h0170A66139b03290j7113M8424A46877A4696
12641a8575A6416L01990j17604a23649B82558h8493F2902i6666j3182A38463a85969
12629a6831p3625c1981j61587I1675M3616a71015A06875M2029A0380M7498k8780
$$ plain form
12618 29098 204176 163216 180031 89520 265589 94733 -54169 186144 311597 -471383 149886
12606 54966 121267 113620 148976 -5822 -50827 263904 -38307 -78234 79679 -41373 114974 307493
12594 307493 283735 232187 31603 -18170 -25670 -186436 386669 -163947 235047 281641 243099
12583 243099 142581 -182577 -82272 -312203 -147667 74007 197012 16929 80150 183903
12573 183903 114379 34664 270959 142533 249364 112835 95172 283723 9744 153349
12563 153349 186568 -55649 -301080 57059 -218944 -31014 129744 358349 218772 -155702
12552 -79122 -37060 -49281 -105207 -63910 138079 -33123 -66478 92014 -73186 -213741 -65961
12540 4012 -195913 -89698 -181788 149321 172892 -42679 299391 206468 388426 75638 -159800
$$ packed form
12618B9098J75078m0960J6815H9520J76069I4733e4169A86144J25453d71383A49886
12606E4966O6301p647L5356e822m5005B63904c8307l9927G9679d1373A14974J92519
12594C07493k3758n1548C1603a8170p500j60766C86669a63947B35047M6594l8542
12583B43099j00518a82577h2272k29931a47667G4007J23005A6929O3221J03753
12573A83903o9524C4664K36295j28426J06831A12835j7663J88551I744J43605
12563A53349L3219e5649k45431E7059b18944c1014A29744K28605j39577a55702
12552g9122c7060j2221n5926M1297A38079c3123l3355I2014g3186j40555f5961
12540D012a95913h9698r2090A49321K3571d2679B99391r2923J81958G5638a59800
$$ plain form
12528 -15775 -407034 -274169 114361 108841 -100751 -23474 -231188 -181638 121996 230530
12518 230530 21854 -13382 -46615 -379132 157726 -323985 165637 -170547 224732 266652
12508 266652 -46637 -46344 379830 342902 -160590 31872 179584 138989 99190 -75319 -259188
12497 -259188 334865 107 -487786 -59230 7636 -161040 -220823 211589 127630 46505 51835
12486 51835 -310095 180997 -225755 89172 -49155 -200198 -184715 -216718 -40585 5007 117753
12475 117753 251199 -23891 61569 110539 -316833 321032 25179 -93296 -199721 115042
12464 49388 314637 -47060 -69364 -270796 -244186 -51403 175305 -140508 67271 -103525 23665
12452 98080 -913 -101683 32106 -182484 -143076 -156761 -332982 32900 -182599 100357 19576
$$ packed form
12528a5775l91259J32865A14361n520a00751b3474k07714M9550A21996J08534
12518B30530B1854a3382l3233l32517A57726c23985A65637a70547B24732M1920
12508B66652d6637K93C79830l6928a60590C1872J47712m0595l9799g5319j83869
12497b59188C34865A07d87786e9230G636a61040n9783B11589q3959D6505N330
12486E1835c10095A80997b25755H9172d9155j51043J5483l2003d0585E007J12746
12475A17753J33446b3891F1569M8970c16833C21032B5179i3296j06425A15042
12464D9388K65249d7060k2304k01432K6610e1403A75305a40508F7271a03525B3665
12452I8080i13j00770C2106a82484L9408j3685j76221C2900a82599A00357A9576
$$ plain form
12440 -17323 58946 -177178 -201085 -127356 83677 120824 197371 -86478 190002 150250 5962
12428 -142764 21812 -42882 81467 -283417 -125060 192012 -208260 -199141 -62088 -230984 72860
12416 235987 -124100 71717 172009 149819 192160 150638 212810 6013 -49028 -95588 128719
12404 -171486 -247678 139129 20659 -118606 9199 77937 -89167 169904 -89442 87144 -119541
12392 -23089 26148 -135600 136087 -46926 -125170 131929 134878 -315446 66483 142405 -131553
12380 31213 -23695 -149727 -27158 -117192 -32835 51010 -113145 -140914 62656 89566 118973
12369 118973 159553 -43616 -113834 -51110 -57627 -342627 67117 10183 -143888 78985 -13944
12357 44241 128181 -277712 111966 198403 -129290 -237602 -349710 -132762 -156700 -157511 -158873
$$ packed form
12440a7323E8946a77178k3907P3729H3677L7147P6547h6478A90002l9752E962
12428a42764B1812d2882H1467b83417a25060A92012b08260R119f2088j68896G2860
12416B35987a24100G1717J00292k2190M2341m1522O2172F013d9028m6560A28719
12404a71486p6192A39129B0659a18606I199O8738h9167A69904h9442H7144a19541
12392b3089B6148a35600A36087d6926p8244A31929K949c15446F6483P5922a31553
12380C1213b3695j26032b7158r0034c2835E1010a13145k7769F2656K6910K9407
12369A18973M0580d3616p0218e1110o517k85000F7117A0183a43888G8985a3944
12357D4241Q3940b77712A11966Q6437a29290j08312j12108a32762k3938q11j362
$$ plain form
12346 -158873 -27980 -104350 -14843 31711 35370 149049 -68766 -377144 29230 275004 174416
12335 174416 161506 100386 57696 -89017 211501 140657 172344 178143 -56846 198081 227668
12324 227668 159756 54141 -85778 386048 -24667 -207307 -3357 199705 35259 159720 64639
12312 -105843 -124066 -87315 -279434 76719 -114498 237372 -61362 319137 69264 278540
12302 278540 -369142 113303 -234741 -274853 19874 -27344 -111492 -27184 -54247 114171 203793
12291 203793 -27704 -16672 -70064 204725 -15322 49602 105668 128552 -34473 118490 334122
12280 334122 -122253 -194939 -322856 272092 -261594 -19897 -229520 23047 137677 260678
12270 260678 97140 104843 246176 -198918 -181314 -42747 147503 -65260 63418 39645 142190
$$ packed form
12346a58873b7980p6370a4843C1711L659J13679f8766l08378B9230K45774j00588
12335A74416j2910o1120m2690h9017B11501p0844L1687N799e6846A98081K9587
12324B27668o7912E4141h5778C86048b4667j82640c357A99705C5259J24461F4639
12312a05843j8223L6751j92119G6719a14498B37372f1362C19137F9264K09276
12302B78540c69142A13303b34741m0112A9874b7344q4148b7184k7063A14171Q9622
12291B03793b7704J1032n3392B04725a5322D9602N6066K2884c4473A18490K15632
12280C34122a22253p2686j27917B72092b61594a9897k09623B3047J14630J23001
12270B60678I7140P703J41333a98918J7604d2747A47503f5260F3418k3773J02545
$$ plain form
12259 142190 351418 143333 -72503 153273 357405 230021 244499 -78198 458060 -66338
12248 328547 190984 -11810 231811 -177916 408585 45620 181847 -20090 -141454 -6373
12237 -65319 199 264283 133679 -64131 91027 118041 21352 110021 82423 102285 147499 165755
12225 165755 334379 156705 202769 66883 -230793 567137 449086 153412 289224 53065
12214 148726 -11751 24068 339976 280418 83081 100611 302513 247864 97670 125920 263971
12203 263971 72385 180513 69613 15708 251965 -23023 226758 54095 -133712 223937
12192 171924 77 231183 79627 -42372 240443 320298 -67185 36087 45120 51186 64290 569763
12180 569763 169425 364392 -221509 208043 179580 182988 -23143 210569 -25929 76505 98230
$$ packed form
12259A42190K09228A43333g2503A53273K04132j27384J4478g8198D58060f6338
12248C28547j37563a1810B31811a77916D08585D5620J36227b0090j21364f373
12237f5319A99K64084j30604f4131I1027K7014B1352Q8669k7598J9862M5214J8256
12225A65755J68624A56705M6064F6883b30793E67137j18051A53412J35812E3065
12214A48726a1751B4068L15908n9558H3081J7530K01902n4649I7670K8250J38051
12203B63971G2385J08128F9613A5708K36257b3023B26758E4095a33712B23937
12192A71924G7K31106G9627d2372B40443P9855f7185C6087R033O066J3104N05473
12180E69763A69425J94967b21509B08043k8463L408b3143B10569b5929G6505K1725
$$ plain form
12169 98230 68132 -56318 198890 104450 -117764 -40596 92496 85834 203634 10952 146523
12158 146523 -55353 -107942 -76128 113314 149636 395964 141792 157680 89638 195631 -139208
12146 25383 -275384 -136903 136555 -71992 -65972 189321 122106 -139523 50562 149530 100276
12135 100276 193463 199974 -109147 226359 165921 -11604 205091 -241245 85251 -49270 154002
12123 83768 77271 -18501 27642 224320 215848 -108095 218451 -56741 -119610 79857 315582
12112 315582 117757 181011 -144059 -185507 -26547 -58827 147096 132445 -124976 266436
12101 -397862 -118506 242175 -35078 -159335 201540 228453 -112285 58836 -251180 -4791
12090 63729 -199227 -157410 -187808 22465 151675 71063 466989 242285 187504 288842 -237298
$$ packed form
12169I8230l0098e6318A98890r4440a17764d0596I2496o662J17800A0952J35571
12158A46523e5353n2589L1814A13314L6322K46328A41792J5888o8042J05993a39208
12146B5383b75384a36903A36555g1992O020A89321o7215a39523E0562R8968m9254
12135A00276R3187O511a09147B26359o0438a1604B05091b41245H5251d9270A54002
12123H3768o497a8501B7642J96678q472a08095B18451e6741o2869G9857K35725
12112C15582A17757O3254a44059m1448b6547l2280A47096j4651a24976B66436
12101c97862a18506B42175c5078j24257B01540K6913a12285E8836b51180d791
12090F3729a99227M1817l0398B2465J29210G1063L95926k24704n4781J01338b37298
$$ plain form
12078 126564 55000 152486 151751 134077 379601 97461 204707 96467 76003 454929 127944
12066 170912 183354 91931 113750 -37553 -36270 272360 96694 21079 -61079 -24493 224252
12054 -339695 140295 89966 297659 99699 186292 24110 -110133 65692 -166060 -58561 173460
12042 -52258 -426544 -42708 -311292 -25210 -43676 -266738 -173723 321429 43841 -416018 82345
12030 31926 -160487 44312 -568566 -306731 220550 -59961 -138866 -103348 207384 -20799 61926
12018 67562 -767 24124 -164778 -56176 -111565 -229227 -58362 -31212 -33942 137044 182449 272834
12006 272834 -212110 86706 -224402 -121903 206416 77132 26980 485981 -187556 176470
11995 -234388 -119123 -40903 316988 -22626 -60832 -14662 14350 -73350 105182 85555 -325823
$$ packed form
12078A26564E5000R7486p35j7674K45524I7461J07246I6467k0464L78926A27944
12066A70912J2442r1423K1819c7553J283B72360I6694B1079f1079b4493B24252
12054c39695A40295n0329K07693I9699Q6593B4110a10133F5692a66060e8561A73460
12042e2258l74286d2708k68584b5210j8466k23062R3015C21429D3841d16018H2345
12030C1926a60487D4312e68566K61835B20550e9961p8905L5518B07384b0799F1926
12018F7562g67B4124a64778e6176n5389j17662e8362K7150k730A37044M5405R0385
12006B72834b12110H6706b24402J02499B06416G7132B6980M59001a87556A76470
11995b34388J15265d0903C16988b2626l8206a4662A4350g3350A05182j9627c25823
$$ plain form
11983 134213 -23202 -129301 159956 -143212 -116784 -313571 -187428 -15539 16933 54199
11973 54199 50229 50072 -138425 -1395 -197670 226021 -219230 -277485 -27762 18015 -109610
11961 155747 -67488 -223540 -153617 19702 -84417 49598 -144979 155527 114395 -133712 15049
11949 -155284 269 -450187 -81969 -18325 -191100 214375 -111460 115351 563412 -43564 -277490
11938 -277490 -134944 -88038 -16535 203613 -25586 -49600 -121736 184867 3769 -173420 -86604
11926 9867 -207374 -207873 -257924 -9834 39786 -91808 18471 166196 -144941 120488 73911 -223898
11913 -91933 69312 -521 470490 -138342 263750 -87911 -14529 145784 -332082 85393 51485
11902 51485 200086 -8431 -117426 -64643 119710 -128766 -19113 113858 -107105 -132599 -38006
$$ packed form
11983A34213b3202j06099A59956a43212K6428j96787J26143a5539A6933L7266
11973E4199l970j57a38425a395j96275B26021b19230n8255b7762A8015a09610
11961A55747f7488j56052O9923A9702h4417D9598a44979A55527m1132a33712A5049
11949a55284B69d50187h1969a8325j72775B14375a11460A15351M48061d3564k33926
11938b77490a34944M6906a6535B03613b5586k4014p2136A84867C769a73420h6604
11926I867b07374m99n0051i834C9786i1808A8471J47725a44941A20488m6577b23898
11913i1933F9312e21D70490a38342B63750h7911a4529A45784c32082H5393l3908
11902E1485J48601h431j08995N2783A19710a28766a9113A13858a07105k5494c8006
$$ plain form
11890 -6306 232949 -110170 -27259 -307798 210309 -7677 -330419 107984 7458 74117 -9331
11878 5702 207886 38100 -160723 -66099 -194869 52500 44812 117272 -373605 -132193 305746
11866 -129664 -149391 219838 253182 393898 -152078 -144873 -20374 76196 -289079 179437 -72477
11854 -103950 120738 -26474 -90623 -115440 -339838 -15134 -506958 178180 104178 -77810 -230202
11843 -230202 173171 183340 -113517 -186623 -115377 327757 75032 -160463 -287838 -125521
11832 230971 -24676 -81185 156910 -252613 -458982 -89251 2557 -110540 8782 50843 75465
11821 75465 -135639 298851 -412269 -24060 95651 -219753 304586 3407 -12707 -31983 21961
11809 258982 13871 14244 112914 88528 -76564 -247094 -348596 -156495 -150715 78591 -50191
$$ packed form
11890f306B32949a10170b7259k80539B10309g677l22742A07984G458O6659i331
11878E702K02184C8100a60723f6099j28770E2500p688P2460c73605a32193C05746
11866a29664j9727B19838L3344J40716a52078P205b0374G6196b89079A79437g2477
11854a03950A20738b6474o4149k4817k24398a5134m91824A78180p4002g7810j52392
11843b30202A73171J0169a13517p3106P1246C27757G5032a60463j27375a25521
11832B30971b4676n6509A56910b52613k06369h9251B557a10540H782M2061K4622
11821G5465a35639B98851d12269b4060I5651b19753C04586C407a2707j9276B1961
11809B58982A3871L73R8670k4386g6564j70530j01502a56495N780G8591e0191
$$ plain form
11797 -253453 32642 156128 -167736 -20538 -121771 917 -103996 236003 18873 199113 121074
11786 121074 -91469 -139388 -168753 -133767 122166 196338 157706 -26840 -54848 -128498 92670
11774 214426 -170821 -12944 -137272 -19132 166008 119 150171 -130088 -164103 -313386 -23731
11762 -11359 -31946 -177722 19111 -251973 -164595 369218 226273 -100347 53553 -54391 227014
11750 136513 191798 3093 -127335 -84595 57173 12327 -33229 139525 6319 253332 -20160
11738 66715 -314212 -145500 137741 106130 62680 -6511 -357608 49617 -294619 -67593 -57818
11727 -57818 -137015 423153 32487 -83047 392359 223326 -67964 125453 -92156 7529 225928
11716 225928 410999 79320 -89973 271094 316294 30439 93189 460238 -161413 -280887
$$ packed form
11797b53453C2642J23486a67736b0538j01233I17a03996B36003A8873J80240p8039
11786A21074i1469m7919k9365L4986A22166P4172l8632b6840k8008p3650I2670
11774B14426a70821a2944j24328a9132A66008A19J50052a30088l4015j49283b3731
11762a1359k0587j45776A9111b51973Q7378C69218j42945a00347E3553e4391B27014
11750A36513N5285C093a27335M2740E7173A2327c3229A39525F319K47013b0160
11738F6715c14212a45500A37741l1611m3450f511l51097D9617b94619f7593R775
11727e7818p9197D23153C2487h3047C92359j69033f7964A25453i2156G529K18399
11716B25928J85071G9320h9973B71094M5200C0439O2750L67049a61413j19474
$$ plain form
11706 -280887 -145820 50227 455621 -140054 158708 -57218 131864 -267207 -53150 138637
11695 292584 -75272 25178 201239 111019 91418 -214454 209216 -237225 -253564 128708
11684 -82176 245834 50324 124226 61799 196967 -220307 -223198 -193366 -524 -22124 -318198
11673 -318198 -86413 296287 83717 -95898 53905 -173934 183962 -77290 70814 90756 17113
11661 -57624 82031 354114 -54527 -189797 251298 197341 -283188 -184634 253803 93216 -34698
11649 -74975 -171538 -227852 -215914 -84125 170588 -4166 -11701 -326517 -43969 354479 -84387
11637 323939 54907 196703 45280 50978 9435 141494 291709 28128 299055 38912 208563
11626 208563 136092 -94670 12984 -95226 288863 -118528 229753 -111941 -346930 130651
$$ packed form
11706b80887J35067E0227M05394a40054A58708e7218A31864b67207e3150A38637
11695B92584g5272B5178J76061r0220j9601b14454B09216b37225j6339A28708
11684h2176B45834E0324P3902F1799J35168b20307k891K9832e24k1600k96074
11673c18198h6413B96287H3717i5898E3905a73934A83962g7290G0814J9942A7113
11661e7624H2031K72083e4527j35270B51298n3957b83188R8554B53803I3216c4698
11649g4975r6563n6314J1938h4125A70588d166p535l14816d3969C54479h4387
11637C23939E4907J41796D5280N698I435J32059J50215B8128K70927C8912J69651
11626B08563p2471i4670A2984i5226B88863a18528B29753a11941k34989A30651
$$ plain form
11615 77179 -5520 146124 -19234 11153 37383 143044 -234378 -187609 90105 -227062 -58200
11603 14573 340130 179364 -62254 166462 124788 81789 403850 -87599 229299 -150994
11592 229474 -39551 456092 40357 61191 75410 2010 95726 9741 114004 48033 181217
11581 181217 76018 120954 -109554 245762 -167066 11777 175614 238726 -259286 57442
11570 68773 118091 85370 46310 -253310 267706 441080 -24698 70534 14403 300497 236960
11559 236960 -70165 130496 -30920 -33628 122843 -187460 164374 166778 65802 -150153 -13034
11547 199680 -13740 52980 283742 73286 -124531 -180384 126749 -62865 -214347 144800
11536 100632 10026 -16576 194071 377975 128615 -177068 -52236 -193371 -215746 26747
$$ packed form
11615G7179e520A46124a9234A1153K6230J05661b34378M6769I0105b27062e8200
11603A4573L25557j60766f2254A66462m1674m2999L22061h7599B29299a50994
11592B29474c9551D56092D0357K0834J4219B010R3716I741J04263D8033J33184
11581A81217G6018M4936a09554B45762a67066A1777J63837O3112b59286E7442
11570F8773M9318l2721l9060b53310B67706J73374b4698G0534A4403K86094o3537
11559B36960g0165A30496c0920k708A22843a87460A64374K404F5802a50153a3034
11547A99680a3740E2980K30762G3286a24531n5853A26749f2865j51482A44800
11536A00632A0026a6576A94071J83904A28615a77068e2236j41135k2375B6747
$$ plain form
11525 166382 107135 6689 19512 -3111 213241 175096 459607 -181688 271039 9797 191309
11514 191309 -4812 -1421 -166267 293866 -68277 242519 -203884 135268 138666 81100 88795
11503 88795 292816 223799 96666 297318 195525 429883 -994 116387 20305 240663 221966
11492 221966 -116775 42798 214692 -23424 -56478 228680 69709 118571 356574 161086
11481 -30286 -90030 125558 159994 60285 307485 -51585 129272 -87639 12689 -40606 154817
11469 165550 83304 33697 253381 402760 98764 -69306 -162734 -27875 -170555 117593 -169064
11457 104445 335687 164000 104367 62725 171636 108094 37771 140512 -55741 66801 -104060
11445 134177 -190486 200616 116071 -136481 111144 222857 237200 -126273 65950 67151
$$ packed form
11525A66382n9247F689J2823c111B13241l8145K84511a81688B71039I797J81512
11514A91309d812a421j64846B93866f8277B42519b03884A35268L398n7566P695
11503H8795K04021o9017I6666K00652j01793K34358i94A16387B0305K20358j8697
11492B21966a16775D2798J71894b3424l3054B28680F9709M8862K38003A61086
11481c0286n9744A25558L4436F0285K47200e1585A29272h7639A2689d0606A54817
11469A65550q2246C3697K19684J49379I8764f9306r3428b7875j42680A17593a69064
11457A04445K31242A64000n9633m1642J08911o3542C7771J02741e5741F6801a04060
11445A34177a90486B00616q4545a36481A11144J11713J4343a26273F5950J201
$$ plain form
11435 67151 199620 154719 -91330 180972 125287 278348 -55404 -9224 14484 212393 -200294
11423 253343 -89805 -108251 -31554 289355 310028 209555 -5762 -232809 46804 203470 73023
11411 321982 -135500 -5616 -19177 98188 -43585 53194 111127 -106971 -116023 -80016 83280
11399 264743 -203145 -127572 -53458 -121388 -125105 167032 6093 -1367 16867 263044 142648
11388 142648 -223901 130336 -29196 -143300 -32850 -186844 -33367 -151593 45285 101864
11378 101864 -111127 -79651 -16623 -129286 -124163 111247 131303 -296147 274203 -125283
11367 48192 33809 109388 -420005 -298954 -64516 -15880 -253324 -7128 147659 -269873 49690
11355 340956 -137667 225013 445111 -252592 145740 26301 200742 -8309 -149604 167627
$$ packed form
11435F7151J32469m4901i1330A80972n5685J53061e5404i224A4484J97909b00294
11423B53343h9805j8446c1554B89355K0673j00473e762k27047D6804J56666G3023
11411C21982a35500e616j3561I8188d3585E3194N7933a06971r052L6007H3280
11399B64743b03145P5573e3458o7930l717A67032F093a367A6867K46177j20396
11388A42648b23901A30336b9196j14104c2850j53994c3367j18226D5285N6579
11378A01864a11127L1476a6623j12663N123A11247K0056b96147B74203a25283
11367D8192j4383P5579d20005J21051f4516a5880k37444g128A47659b69873D9690
11355C40956a37667B25013K20098b52592A45740B6301J74441h309j41295A67627
$$ plain form
11344 -203218 52954 -22364 -290972 -360009 -235290 -223928 -37139 -84226 -159454 117562 245113
11333 245113 -118547 56749 234532 -212111 39977 55668 -298340 -10718 114823 -209455
11322 39107 -29722 -105757 -570086 23040 442912 -99944 -28658 -48687 53434 103912 333130
11311 333130 76987 -99563 -168070 -128852 -94893 12348 -205078 15101 144889 42102 87252
11300 87252 134249 -150358 21673 71153 -143913 143299 -35729 124035 -170738 297032
11289 -53630 -27917 -134040 140883 -255728 -292179 -211557 -34454 -174039 -177199 29103 -9395
11277 -425771 -336117 49402 -257764 254146 -86459 -134334 126907 -84022 -90732 -52094 124525
11265 -238406 -80196 151115 -157258 65680 -215692 1841 -106727 17326 229627 -375957
$$ packed form
11344b03218E2954b2364k68608o9037J24719J1362c7139m7087p5228A17562J27551
11333B45113a18547E6749J77783b12111C9977J5691b98340a0718A14823b09455
11322C9107b9722p6035m64329B3040M19872i9944b8658k0029E3434N0478K29218
11311C33130G6987i9563o8507L9218L3959A2348b05078A5101J29788D2102M5150
11300H7252M6997a50358B1673M9480a43913A43299c5729A24035a70738B97032
11289e3630K5713j06123A40883b55728l6451Q0622c4454j39585l160B9103i395
11277d25771Q9654D9402b57764B54146h6459m7875A26907h4022o710L8638A24525
11265b38406h0196A51115a57258F5680b15692A841a06727A7326K12301c75957
$$ plain form
11254 68220 -347322 -144362 -64233 -3450 -68485 -98343 -118403 68871 -322483 132864 16707
11242 -114633 -36925 112997 11727 108239 -235264 417444 3237 -43218 -3681 -208584 -20195
11230 179163 -79937 -108039 -143366 -127035 -151107 61514 -190564 1192 -101879 94041 39088
11218 40370 133121 -100425 247724 -84263 -165508 -246966 69472 52377 -114487 50314 169579
11207 169579 -217295 141429 93458 -193741 4784 321675 -112255 -108870 -115305 -418543 216785
11195 -123446 -41258 -222004 344012 -60483 -52847 -192430 -193615 -242340 -139229 -150966 -110741
11184 -110741 -222978 -303464 -176569 65173 -11131 -17238 -11999 -154230 -155259 111126 -230853
11172 -161836 1992 -65189 115357 339 -161055 256056 90073 -51753 159221 9754 -101411
$$ packed form
11254F8220c47322a44362f4233c450o5035k9858k0060F8871c22483A32864A6707
11242a14633c6925A12997A1727R6512b35264D17444C237d3218c681k04903b0195
11230A79163g9937k8102l5327J6331k4072F1514a90564A192a01879I4041C9088
11218D0370R2751a00425B47724h4263q1245q1458F9472j7095a14487E0314J19265
11207A69579b17295A41429m7971a93741D784L16891a12255L385o435l03238B16785
11195a23446d1258j80746C44012f0483P636j39583j185m8725J03111j1737M0225
11184a10741j12237q0486J26895F5173a1131o107N239j42231j029A11126b30853
11172a61836A992f5189A15357C39a61055B56056I0073e1753A59221I754a01411
$$ plain form
11160 -45914 -151762 82909 68573 -121988 62159 -40273 -161829 80301 239623 -147971 -105429
11149 -105429 59761 60204 144616 -152880 -71322 -27704 50020 198833 -99116 60958 16509
11137 4306 138583 201849 882 -104481 159939 -96821 285495 336141 129256 186961 277849
11126 277849 181752 120312 129352 159412 476639 -95126 -115546 432093 63217 14316 71328
11115 71328 12885 583160 69879 300930 -234787 188402 300760 224392 -6573 224065 225432
11104 225432 2282 210090 -128179 348984 495262 384708 -34561 140775 120300 294564
11094 294564 -150888 96137 133530 268578 322803 493160 223808 315862 417870 303405
11084 303405 266621 208535 202387 332927 201654 486416 183592 480810 111819 275826
$$ packed form
11160d5914j05848H2909j4336a21988F2159d0273j21556H0301J59322a47971M2542
11149a05429E9761M43Q4412a52880g1322b7704E0020J48813i9116F0958A6509
11137D306J34277O3266H82a04481A59939i6821B85495N0646A29256N7705R0888
11126B77849r6097o1440R040L0060L17227i5126k0420D32093F3217A4316N7012
11115G1328A2885N70275F9879K31051b34787A88402J12358p6368f573B24065J367
11104B25432B282K07808a28179C48984J46278j10554c4561A40775k0475J74264
11094B94564a50888I6137L7393J35048N4225J70357B23808R2054J02008j14465
11084C03405l6784n8086o148J30540j31273K84762A83592K97218A11819J64007
$$ plain form
11074 275826 272327 621581 624905 572502 740546 466577 352986 197586 283738 458725 515215
11063 515215 495357 663055 489727 438435 532910 804985 586785 560752 434000 540628
11053 540628 696528 688203 424542 790237 549241 645503 553846 557743 702637 438598 398000
11042 398000 696284 432564 687353 380457 401736 659410 590054 519315 903142 852362
11032 852362 763414 598974 815769 486151 304073 619615 1199494 424586 759662 643448
11022 643448 725180 450095 796195 685607 936159 677860 604821 706384 721555 898005
11012 898005 800307 674784 975946 927974 699682 684585 728847 749748 700088 756667 685625
11001 685625 978185 768665 755435 815652 846109 941435 972276 1165663 1175729 959286 847862
$$ packed form
11074B75826l499L49254L324n2403J68044k73969j13591j55400Q6152J74987N6490
11063E15215j9858J67698j73328n1292R4475K72075k18200k6033j26752J06628
11053E40628J55900q325k63661L65695k40996R6262r1657L897J44894k64039m0598
11042C98000K98284k63720K54789l06896K1279K57674o9356p0739L83827n0780
11032H52362q8948j64440K16795l29618j82078L15542N79879D24586L35076j16214
11022F43448Q1732k75085L46100j10588K50552k58299p3039J01563J5171J76450
11012H98005r7698j25523L01162m7972k28292j5097M4262K0901m9660N6579p1042
11001F85625K92560k09520j3230O0217L0457R5326L0841J93387J0066k16443j11424
$$ plain form
10990 847862 1089469 924853 1122686 1351259 922197 1248070 1243981 1155963 1238583 1348300
10980 1348300 1265574 998948 1068888 1737963 1494001 1028590 1545375 1530231 1370819 1544817
10970 1544817 1397543 1221921 1517821 1331296 1343137 1289930 1314769 1364265 1258295 1418543
10960 1418543 809005 1234683 1193640 1040005 1106011 1111773 965012 590239 700085 553532
10950 553532 767249 317074 340397 453682 720675 352047 301549 352969 125617 77686
10940 77686 -55052 267631 400720 123333 439879 54695 179304 147179 368775 219456
10930 219456 80648 38450 -48392 192822 39556 -219448 -234627 21380 196721 -124138 -22384
10918 75413 -427126 165559 52350 -77094 228058 -86548 -18208 -291844 191842 -278066
$$ packed form
10990H47862K41607j64616J97833K28573m29062L25873m089q8018Q2620J09717
10980A348300q2726k66626O9940O69075k43962m65411N16785j5144j59412J73998
10970A544817j47274j75622K95900j86525J1841n3207K4839M9496j05970J60248
10960A418543o09538M25678m1043j53635O6006N762j46761l74773J09846j46553
10950E53532K13717C17074K3323J13285K66993C52047n0498N1420A25617m7931
10940G7686e5052B67631J33089A23333L16546E4695J24609l2125K21596j49319
10930B19456H0648C8450d8392A92822C9556b19448j5179B1380J75341a24138b2384
10918G5413d27126A65559E2350g7094B28058h6548a8208k73636A91842b78066
$$ plain form
10907 -178671 193081 -121892 -157830 -155579 -118791 -142487 35127 -67256 20868 122223 50761
10895 -156086 -156622 70345 158167 -147003 108050 112550 -60882 -43186 -115489 248757 154011
10884 154011 -94079 -166530 -201095 74865 -48603 200374 -66876 22065 -112404 -24676 -69295
10873 -69295 4921 -20649 -397375 398118 340724 125996 16394 128026 6196 74189 -116732
10861 -100000 221413 -13176 -271779 -257039 -399281 145384 -84820 168472 139981 -302168
10850 101828 -33921 -23638 -107886 8462 -39154 193226 223636 -163722 -200561 -73015 159185
10838 -60420 72912 232674 12330 -31698 71107 -29053 -52646 481457 459843 24318 5826
10826 70426 6904 287748 -122907 12138 -108463 16224 104747 -34034 73650 17798 -198609
$$ packed form
10907a78671A93081a21892l5938K251L6788k3696C5127f7256B0868J01355E0761
10895a56086n36G0345Q7822a47003A08050M500f0882J7696p2303B48757r4746
10884A54011i4079p2451l4565G4865d8603B00374f6876B2065a12404b4676m4619
10873f9295D921b0649l76726C98118n7394A25996A6394J11632F196O7993a16732
10861a00000B21413a3176k58603J4740j42242A45384h4820A68472k8491c02168
10850A01828c3921J0283q4248H462c9154A93226L0410a63722l6839g3015A59185
10838f0420G2912J59762A2330c1698G1107b9053k3593D81457k1614B4318E826
10826G0426F904K80844a22907A2138a08463A6224Q8523c4034G3650A7798a98609
$$ plain form
10814 39251 -211557 -142912 46693 145572 -194374 171440 9256 7263 -39370 -91403 49241
10802 26272 -385073 -114495 -169291 322492 25098 -191508 202663 -257817 4378 128444
10792 128444 127378 -10496 -5793 -50515 -14026 -53505 90014 -121176 -121069 -55085 135481 173736
10780 173736 19778 42914 100844 -12302 -191583 119284 90616 360174 -131366 -66090 100344
10768 91645 62958 -51263 266100 198096 -133476 -329873 -162038 -95483 -224627 -4571 -212980
10757 -212980 -114 -279959 182629 -132977 -12166 -107393 -145696 -34851 -12227 142786 247941
10746 247941 -175714 -15383 20613 -110211 -1448 84081 110622 22262 -383262 34305 -79766
10734 -141423 73013 -142778 -95463 10269 -293418 -182236 315751 -32231 -53631 -141583 -21016
$$ packed form
10814C9251b11557O8645D6693R8879a94374A71440I256j993c9370n2033D9241
10802B6272c85073a14495n4796C22492B5098a91508B02663b57817D378J24066
10792A28444j066a0496M703m4722a4026l9479I0014a21176J07e5085A35481L8255
10780A73736A9778K3136N7930a2302j79281A19284k8668K69558a31366O5276A00344
10768I1645k8687e1263B66100o8004a33476j96397a62038O6555j29144d571k08409
10757b12980a14k79845A82629a32977a2166r5227l8303c4851a2227A42786J05155
10746B47941a75714a5383B0613a10211a448H4081K6541B2262c83262C4305g9766
10734a41423G3013a42778M7315A0269b93418J11182C15751c2231k1400q7952b1016
$$ plain form
10722 -5902 379209 290730 101172 49952 -211896 77165 -143019 -65598 23868 -89519 27128
10710 -110559 -147041 17110 103775 -191274 -50887 -124553 73103 -24070 352735 -231092 73648
10698 73779 -188027 -489423 103020 -147283 -97421 -57022 49731 -286022 -134456 -72449
10688 -72449 -114925 4876 206886 -83459 149924 -176119 -392926 163062 193413 307286 -48758
10676 58660 -152443 -178249 139977 -66462 -177591 -123499 270289 83467 -78204 29963 -288333
10664 2547 -33878 -131188 78241 -83659 -153676 -199332 -71692 170739 61406 -7974 20 -342559
10651 166084 -56181 -388024 -268142 -325428 -87954 -78010 150397 -92828 -1914 -158032 -61304
10639 -80617 235528 -38707 122284 115932 -20219 -191359 224333 -48979 -238426 104773 -8102
$$ packed form
10722e902C79209q8479A01172D9952b11896G7165a43019f5598B3868h9519B7128
10710a10559l6482A7110Q6665a91274e0887p3666G3103b4070C52735b31092G3648
10698G3779a88027l01396A03020a47283M9862M0399D9731b86022a34456O2007
10688g2449m2476D876K02010h3459A49924a76119k16807A63062L0351J13873d8758
10676E8660a52443k5806A39977f6462j11129N4092B70289H3467g8204B9963b88333
10664B547c3878r7310G8241h3659p0017m5656g1692A70739F1406g974B0c42559
10651A66084e6181l31843J19882n7286h7954R944A50397i2828a914j56118f1304
10639h0617B35528c8707A22284o352b0219j71140B24333d8979j89447A04773h102
$$ plain form
10627 -19553 -22783 -267049 5565 -147115 8055 -113364 -137415 -58929 207220 -284042 -108792
10615 -59631 -13277 221149 -124010 68078 -121338 75436 -68962 -27902 62920 -57719 -49854
10604 -49854 140750 -12762 153488 98054 -197786 -134657 104608 -147953 20409 73814 -116435
10592 -52956 -120573 77578 -38039 174221 27382 186718 -205040 -154629 -178731 379163 74793
10580 301755 -337485 -411665 11735 -23245 -112137 -176895 -83300 -529543 -213085 15652 -419301
10568 -116275 -10492 -78904 -384354 98579 -217294 -31550 129131 -207460 -208310 146170 -114192
10556 -408139 66617 -93432 -87388 -74247 225965 -101305 15414 -150188 -93084 91057 -85836
10544 15210 -82879 -45337 -35625 132247 75150 -241126 -35355 -84011 133650 313159 -4757
$$ packed form
10627a9553l230k44266E565a47115H055a13364k4051e8929B07220b84042a08792
10615e9631a3277B21149a24010F8078a21338G5436f8962b7902F2920e7719P865
10604d9854A40750a2762A53488n5434a97786O3129A04608a47953B0409N3405a16435
10592e2956o7617G7578c8039A74221B7382J59336b05040N0411k4102C79163G4793
10580C01755c37485p4180A1735b3245q8892o4758h3300m46243b13085A5652d19301
10568a16275a0492o8412l05450I8579b17294c1550A29131b07460q50A46170a14192
10556d08139F6617i3432O044J3141B25965a01305A5414a50188N7104I1057h5836
10544A5210h2879L7542R712A32247n7097b41126c5355m8656A33650J79509d757
$$ plain form
10532 -211745 45430 -140014 -188756 36015 6226 118112 317513 -210052 -58012 378372 -194234
10520 -88766 48926 26658 -26156 116919 249034 148671 -163555 -294945 -43693 203820
10509 -87696 263858 77411 -43610 144246 -57826 -48779 131439 -5844 171979 -177857 -52448
10497 2310 93105 -224420 57345 -44805 -14908 76488 412767 174327 47654 300192 404908
10486 404908 -16112 124841 261920 357503 155616 -85000 -38772 105789 32156 -199982
10475 180422 294532 300196 -224013 71238 -142496 276122 140529 177048 -240198 226426
10464 14458 68434 78954 -176069 -208353 -34124 74527 -313887 -33175 -13308 181272 305580
10453 305580 -177621 -94028 -8386 -262354 -60193 -127210 -34666 -536039 145108 88867 71514
$$ packed form
10532b11745D5430a40014m8742C6015F226J11886J99401b10052e8012C78372a94234
10520h8766D8926k2268b6156A16919J32115j00363a63555j31390d3693B03820
10509h7696B63858G7411d3610A44246e7826R047A31439e844A71979a77857e2448
10497B310R0795b24420E7345d4805a4908G6488L36279A74327D7654K52538J04716
10486D04908a6112A24841J37079R5583A55616h5000c8772A05789C2156a99982
10475A80422J14110N664b24013G1238a42496B76122j35593L6519b40198B26426
10464A4458N3976J0520a76069l2284c4124G4527c13887c3175a3308A81272J24308
10453C05580a77621Q3593h386k53968f0193o7017c4666n01373A45108n6241j7353
$$ plain form
10442 71514 42279 153595 -95276 -349689 -16419 66039 -94135 -153755 -53023 8542 227553
10431 227553 -240887 66562 152876 -115991 -266430 -78126 -150399 -101010 -61982 -91354 252242
10419 225020 -187981 114744 31925 48228 -48408 49357 -32 40401 22441 117219 211666 155401
10407 155401 229603 290564 202054 199170 -261362 -41091 142605 87081 -184342 -68286 -121808
10396 -121808 211420 -931 43413 -66928 185878 179145 19621 -124430 96837 236920 -170200
10384 204473 166168 65398 121802 161925 25660 249417 250867 236034 62859 177712 324684
10373 324684 263753 699636 266375 275490 227339 196147 349142 141496 464674 220473
10362 161732 -33104 1799 171475 155200 -60042 616470 -13460 239940 485483 191972 292814
$$ packed form
10442G1514k9235J11316i5276k54413a6419F6039i4135n9620e3023H542K19011
10431B27553b40887F6562Q6314a15991j50439g8126p2273M9389L9028k9372B52242
10419B25020a87981A14744C1925J6303d8408D9357c2D0401j7960R4778R4447n6265
10407A55401P4202O0961q8510k884b61362d1091A42605n5524a84342f8286n3522
10396a21808B11420i31D3413f6928A85878o733A9621a24430I6837J40083a70200
10384B04473l8305F5398N6404M0123B5660K23757J450j4833F2859J14853J46972
10373C24684o0931M35883B66375R115m8151l1192J52995A41496L23178B20473
10362A61732c3104A799J69676j6275f0042F16470a3460B39940K45543A91972J00842
$$ plain form
10351 292814 359125 345599 -167243 213946 -52699 216643 168484 230716 471637 123282
10340 188458 113906 56237 -82086 169882 363487 199910 143686 234626 -137463 62403 298213
10329 298213 125348 -160201 365630 55883 205866 -130750 10515 278297 214835 51712
10318 120670 122771 -184560 -10249 402997 -182527 363493 20346 30884 -211026 -106815
10308 -106815 64175 -74103 125726 -95767 -162874 -135964 -342672 -44296 83688 -61000 34481
10296 110115 -115291 -27837 -140770 164540 -81 -342897 -222307 -128476 1737 137841 155562
10285 155562 -72174 -458487 71634 51476 127189 13364 -68823 177553 -44700 -99571 -286966
10274 -286966 -396799 -134451 79701 -102930 95431 84783 -178730 -6973 126676 -30105 181548
$$ packed form
10351B92814O6311j3526a67243B13946e2699B16643m8159O2232K40921A23282
10340A88458p4552E6237h2086A69882J93605j63577n6224R0940a37463F2403K35810
10329B98213A25348a60201C65630E5883J49983a30750A0515K67782o3462E1712
10318A20670K101a84560a0249D02997a82527C63493B0346J0538b11026J04211
10308a06815F4175g4103A25726i5767o7107K6910k06708d4296H3688f1000C4481
10296A10115a15291b7837j12933A64540h1l42816J20590R3831A737J36104J7721
10285A55562g2174l86313G1634k0158P5713A3364f8823A77553d4700n4871j87395
10274b86966j09833a34451G9701a02930I5431j0648a78730f973A26676c0105A81548
$$ plain form
10262 101091 -383457 143932 -16310 268605 102256 120762 13624 374556 351011 307314
10252 307314 293 -177030 -3832 50332 -177705 -98236 45603 114454 -325523 -66319 61433
10240 283137 -253368 -130887 -4279 -87239 -127805 -195303 -314299 113847 -213355 110425
10229 -7395 -73509 76016 -241235 -350444 -69194 -107288 178156 45176 -81346 -34717 -8658
10217 -44814 -25501 -240938 -91328 -27464 119550 -94946 -71312 -167058 11777 -53166 -121061
10206 -121061 6677 94966 -305557 62819 84496 -359729 178332 26410 -67087 28466 -253817
10194 -387105 -46608 -317944 -59816 -373582 -11993 -214956 -88715 -98219 -43064 -216345 -64987
10182 467160 208889 -176768 -207627 -287443 80649 -125893 -229140 -124225 113172 112262 -51467
$$ packed form
10262A01091c83457A43932a6310B68605A02256J8506A3624L60932k3545m3697
10252C07314B93a77030c832E0332a77705P9469D5603O8851c25523f6319F1433
10240B83137b53368J22481d279q2960m0566o7498j18996A13847b13355A10425
10229g395o6114G6016b41235j09209f9194l8094A78156D5176h1346c4717h658
10217d4814J9313k15437i1328b7464A19550i4946K3634r5746A1777e3166o7895
10206a21061F677Q8289c05557F2819K1677c59729A78332B6410f7087B8466b53817
10194c87105d6608k71336e9816l13766a1993k02963h8715r504d3064j73281f4987
10182D67160B08889a76768l0859p9816H0649a25893j03247J04915A13172r10e1467
$$ plain form
10170 -269020 -99243 -160350 -207146 250331 -166253 -344001 -222888 -417821 -336953 -287940
10160 -287940 91316 -206295 -72413 37151 -357586 -95625 -310813 -445759 -295288 -97056
10149 -5826 -134173 127848 -145861 252915 -341843 -143439 196628 -27640 -184782 364123
10138 37127 -87836 -97560 144953 -74275 80486 159389 59406 -92302 255109 120310 -156724
10126 -108093 15172 -235000 -337437 -20453 205433 -409564 -253633 -367467 -33118 -82616
10116 -82616 15011 -237102 -80880 -186549 -67632 131020 391446 -231785 -207449 168508
10105 11995 99826 173794 78098 116656 -305014 -112694 226227 -512505 45370 -131626 112772
10093 -172339 -62725 120029 -103332 50308 -123306 -136116 -107363 144865 35904 -174691
$$ packed form
10170b69020i9243o1107m6796B50331a66253j77748J21113j94933Q0868M9013
10160b87940I1316b06295g2413C7151c57586i5625k15188j34946J50471i7056
10149e826j28347A27848a45861B52915c41843a43439A96628b7640j57142C64123
10138C7127h7836r724A44953g4275H0486P8903E9406i2302B55109A20310a56724
10126a08093A5172b35000j02437b0453B05433d09564J55931j13834c3118m9498
10116h2616A5011b37102h0880j05669f7632A31020K60426b31785K4336A68508
10105A1995Q7831P3968G8098L8558c05014a12694B26227e12505D5370a31626A12772
10093a72339f2725A20029a03332E0308a23306j2810K8753A44865C5904a74691
$$ plain form
10082 -140575 -297178 42003 -156650 -47049 28554 -82617 -67813 -204511 -264788 272348 101994
10070 -168661 -5440 -281363 55893 -92925 28702 -62467 273396 10858 -25579 -201563 57312
10058 49094 -120366 -236588 212873 49617 -163958 -222849 -192660 11513 -185104 -47122 23383
10046 -734 -116965 51037 -305874 -48929 162727 -41920 -85417 -133510 78752 -222106 -645897
10035 -645897 45640 4545 73424 -189318 -144408 -199305 -21668 -160497 -45024 81902 -103330
10023 -334178 204847 7910 -12308 -59992 -198245 46228 -219648 44434 -275094 14429 43833
10012 43833 -364510 -20902 -76995 -472371 -72683 -99856 -169169 -173703 -45847 180978 17393
10000 -218068 -111804 -94493 -298785 332459 18786 -284968 162721 -141011 23506 -29612
$$ packed form
10082a40575j56603D2003a56650d7049B8554h2617J4804j36698o0277B72348A01994
10070a68661e440k75923E5893i2925B8702f2467B73396A0858b5579j75984E7312
10058D9094a20366j16222B12873D9617a63958n8891L0189A1513a85104d7122B3383
10046g34j16231E1037c05874d8929A62727d1920m3497m8093G8752b22106m23791
10035f45897D5640D545O8879a89318M4910n4897b1668j38829d5024H1902a03330
10023c34178B04847G910a2308m7684j38253D6228b19648D4434b75094A4429K9404
10012D3833c64510b0902n6093l95376g2683k7173o9313m534d5847A80978A7393
10000b18068J06264J7311k04292C32459A8786b84968A62721a41011B3506b9612
$$ plain form
9989 -81218 46759 -238642 -107253 -132057 -95916 -169902 -230602 -162445 33001 -136300 146735
9977 394040 -21472 -34860 36218 -185579 216797 -1804 55591 -139360 -172387 -136278 -42509
9965 122030 -167301 43764 7084 -175615 -149501 -66579 -76437 -199554 -182559 -286063 -4558
9953 -372897 -88809 -160696 258194 56152 186999 6647 -252208 -245311 -24885 -71510 -209868
9942 -209868 70843 160345 -347584 -30932 -168166 11658 -9761 -294866 -28955 48974 -246494
9930 -110674 -180989 254488 69376 -10009 -60554 146720 -187099 -234618 160315 -211505 -294444
9919 -294444 83040 -389382 -98738 215117 144352 162743 -247041 -182425 64691 -40294 -35509
9908 -35509 -89308 -136650 -108679 -179108 392945 -45137 -162357 -132139 -64538 -113034 -144658
$$ packed form
9989h1218D6759b38642a07253k4804L6141p3986o0700O8157C3001a36300A46735
9977C94040b1472j3388C6218a85579B16797a804E5591a39360l3027L6109d2509
9965A22030a67301D3764G084a75615K6114f6579r858j23117J6995j03504d558
9953c72897h8809p1887B58194E6152J30847F647b52208O897b4885m6625j38358
9942b09868G0843Q9502c47584c0932j37234A1658i761k85105b8955D8974b46494
9930a10674p0315B54488F9376a0009n0545A46720a87099m7519A60315b11505q2939
9919b94444H3040c89382i8738B15117p0765J8391b47041O4616F4691d0294M785
9908c5509n3799m7342K7971p0429C92945d5137j17220L0218f4538m8496l1624
$$ plain form
9897 -144658 60188 -63079 1078 270269 28530 -86101 -21982 3118 104032 36836 -106603
9885 -228915 23812 -10447 32485 -158369 85863 177717 -329480 144488 68103 -120814 -250512
9874 -250512 -381994 -436222 142849 71553 -217451 151197 -290639 -118971 -78167 -115692
9864 -115692 82510 246378 138391 256809 -102881 -163776 -435119 81372 -85026 -32585 -18377
9853 -18377 -131026 -351575 -87895 202998 79453 -209570 -146098 55122 237063 -173610 -550071
9842 -550071 23795 322369 428596 -201046 118236 -216697 -138072 55613 -115923 -478939
9832 -478939 -198713 -315996 -51762 -218589 60793 245550 -262775 -198688 -168732 -224648 183562
9820 -150617 -8229 -82642 -417287 -121274 152193 -113696 73174 -166677 54460 -15592 126978
$$ packed form
9897a44658F0188f3079A078K69191B8530h6101b1982C118J00914C6836a06603
9885b28915B3812a0447C2485a58369H5863R1854c29480A44488F8103a20814j29698
9874b50512j31482n4228A42849p1296b17451A51197b90639a18971M0804l7525
9864a15692H2510J63868j07987J18418a02881o0895k71343H1372h5026c2585J4208
9853a8377j12649k20549h7895B02998G9453b09570O3472E5122J81941a73610l76461
9842e50071B3795K98574J06227b01046A18236b16697P8625E5613a15923l63016
9832d78939a98713j17283e1762j66827F0793J84757b62775O4087K9956n5916A83562
9820a50617h229p4413l34645a21274A52193a13696G3174a66677E4460a5592A26978
$$ plain form
9808 -47149 -164985 -243231 -333020 304664 -132087 -187245 -181503 99496 -12344 13355 -297090
9796 -10264 -44051 -93014 -110396 -30985 6198 -219162 -68541 -308129 76622 -201901 -159889
9785 -159889 137305 -14952 -57408 -487632 -335748 -200703 135488 -502704 -200761 -139558
9775 -139558 115658 -9366 -146971 -57847 -91256 98977 332534 -75628 -125443 115699 -130946
9763 109885 240628 -111658 53120 -150328 126846 -116142 -40424 -204526 -265652 -124451
9752 -132609 -220750 230623 -257745 -325511 -64054 201011 139912 36636 -27274 46192 -142849
9740 -38310 -82811 8404 111270 -78317 173247 -154609 -210671 -16598 -60298 83196 178518
9729 178518 -277474 -121787 116070 -31140 -48905 288443 -126814 1113 106564 -58396 91403
$$ packed form
9808d7149j17836p8246q9789C04664a32087n5158N742I9496a2344A3355b97090
9796a0264l3787m8963j7382c0985F198b19162f8541k39588G6622b01901M2012
9785a59889A37305a4952m2456m30224J51884J35045A35488e02704b00761O1203
9775a39558A15658i366j37605e7847l3409I8977K33557g5628m9815A15699a30946
9763A09885J30743a11658E3120a50328A26846a16142d0424j64102o1126a24451
9752a32609q8141B30623b57745o7766f4054B01011o1099C6636b7274D6192a42849
9740c8310m4501H404J02866g8317A73247a54609n6062a6598m3700H3196R5322
9729A78518b77474a21787A16070c1140j7765B88443a26814A113J05451e8396I1403
$$ plain form
9717 55346 -147646 -132891 -193191 -396840 261670 122388 -421094 39254 53895 59094 -59050
9705 -373909 104616 -197343 -35903 -308966 80178 69272 239386 -82734 -35065 -150509 -472974
9694 -472974 -66151 -259946 269665 -55527 -34055 -230240 -72658 -180847 -85175 -20448 19774
9682 -10188 71133 -74713 -227834 176196 35896 -216245 -64963 -6188 -178553 -45105 -88821
9671 -88821 170465 -292602 -96883 -183250 -179876 263412 15192 80109 -276769 -134571 59294
9659 113231 -69515 31547 -151404 -51455 -503234 -243383 248269 2394 -176722 19573 195098
9648 195098 -77948 59817 24023 -31907 48995 128584 -442431 -367333 -54418 -364401 -129227
9636 145772 -3682 -84589 -8812 -96859 222381 -65526 -491356 195704 -133403 -100562 -22936
$$ packed form
9717E5346a47646J4755o0300k03649B61670A22388d21094C9254J4641N199e9050
9705c73909A04616a97343c5903k73063H0178j0906J70114h2734c5065j15444l22465
9694d72974f6151j93795B69665e5527K1472j96185g2658j08189h5175b0448A9774
9682a0188G1133g4713j53121A76196C5896b16245f4963f188j72365d5105m3716
9671h8821A70465b92602i6883q6367L374B63412A5192O4917b76769a34571E9294
9659A13231f9515C1547a51404e1455m51779b43383B48269B394a76722A9573J75525
9648A95098g7948E9817B4023c1907D8995P9589d42431P5098e4418l09983a29227
9636A45772c682q0907h812q8047B22381f5526m25830A95704a33403L2841b2936
$$ plain form
9624 56755 71115 -117736 -120931 -106409 -6133 281269 -83263 -239605 137184 232367 -295246
9612 -88290 -51349 -173458 -364765 -28628 -335413 36206 382686 -156178 172410 -45418 -92358
9601 -92358 114468 113431 -148995 -160060 19300 -234163 380566 -109683 18044 -62342 -377227
9590 -377227 -217053 157630 -359403 150032 -268009 109852 -187365 18668 -4437 -93573
9580 -93573 -317111 -123703 -68845 212984 244562 -71742 245900 40098 144324 -232041 -178236
9569 -178236 -160154 205035 -24979 -109511 9067 191171 -193150 -258533 -8939 -122955 5918
9557 26239 188991 -353955 -156219 -39902 121429 99012 -189063 -187900 -175742 39422 -53813
9545 44945 -106920 -196473 129603 -24145 -91329 -24715 6637 -251628 -101909 -111032 -443916
$$ packed form
9624E6755J4360a17736l195J4522f133B81269h3263j56342A37184R5183b95246
9612h8290L6941j22109j91307b8628l06785C6206L46480a56178A72410d5418m6940
9601i2358A14468j037a48995j1065A9300b34163C80566a09683A8044f2342l14885
9590c77227J60174A57630c59403A50032b68009A09852a87365A8668d437q9136
9580i3573k23538a23703N4858B12984L1578g1742B45900D0098J04226b32041N3805
9569a78236J8082B05035b4979q4532I067J82104a93150o5383h939j14016E918
9557B6239J62752c53955a56219c9902A21429k2417a89063J163J2158C9422e3813
9545D4945a06920q9553A29603b4145o7184b4715F637b51628a01909r123l32884
$$ plain form
9534 -443916 90547 -34011 169884 -172203 23756 -322634 -175494 31749 -8425 -39227 -163333
9523 -163333 -297903 -300980 28568 -25881 -245524 -8070 -278860 -91243 227377 -11886 -51905
9512 -51905 -92781 -23776 -12216 51044 -362344 -278078 -18568 -182004 30575 -244836 -112170
9500 7000 -176730 -183917 39543 -46456 -173745 -344953 140816 -318562 -195256 327848 -56326
9488 -302988 100538 163087 -153069 40015 -412201 99078 48923 328017 17974 -189115 65160
9476 -420827 -97440 70374 33094 -106625 48014 -361057 -211563 -259576 -336052 -108949 197108
9464 -17994 -161727 -274307 -151476 160892 -103958 -16303 363708 -186571 -217210 106342
9453 -164458 86223 134052 13759 109268 -22399 97991 -174882 69682 -367306 -157063 -141628
$$ packed form
9534d43916I0547c4011A69884a72203B3756c22634J47140C1749h425l0802j24106
9523a63333j34570l077B8568b5881k19643h070k70790i1243B27377a1886m0019
9512e1905m0876b3776J1560E1044c62344Q4266a8568j63436C0575b44836a12170
9500G000a76730p187C9543d6456j27289j71208A40816c18562J23306C27848e6326
9488c02988A00538O2549a53069D0015d12201I9078D8923K79094A7974a89115F5160
9476d20827i7440G0374C3094a06625D8014c61057J49494m8013p6476a08949A97108
9464a7994j43733j12580J22831A60892a03958a6303C63708a86571l0639A06342
9453a64458H6223M7829A3759R5509b2399I7991a74882F9682c67306a57063J5435
$$ plain form
9442 -141628 -44876 -970 134753 29526 294321 263957 -66784 -216290 -154791 -44659 -147022
9431 -147022 59395 -75324 30211 -139475 -31566 -4014 68468 -214146 73885 79345 -44976 167593
9418 -27686 -28702 -164823 -65230 75516 -123072 -315085 -222075 -189174 -73586 -315010 15286
9406 -148298 -98050 -79995 239530 -195480 -19850 -288500 -4283 6731 -60977 -15754 207085
9394 233105 -47260 -149584 -188156 -216135 -56729 -158825 382181 4473 -126924 77350 90816
9383 90816 -297404 -100184 -4919 156197 -246879 -275026 -192958 -223211 -226354 -24487 -153061
9372 -153061 -161437 72875 -115817 121502 -137972 -403025 70606 56716 -280758 134062 95035
9361 95035 446378 2208 -120890 -225907 -196822 -192180 -315636 131126 -80955 161885 -135379
$$ packed form
9442a41628d4876i70A34753B9526K64795l0364f6784j49506O1499d4659j02363
9431a47022E9395g5324C0211a39475c1566d014F8468b14146G3885N460d4976A67593
9418b7686j016j36121f5230G5516a23072j92013R3010L2901g3586k41424A5286
9406a48298N0248J8055B39530a95480a9850k68650d283F731f0977a5754B07085
9394B33105d7260j02324l8572k7979e6729j02096C82181D473a26924G7350J3466
9383I0816b97404a00184d919A56197b46879k8147Q2068l0253l143b4487j28574
9372a53061q376G2875a15817A21502a37972k65053G0606j3890b80758A34062l9027
9361I5035L51343B208a20890j05017K9085M642j23456A31126h0955A61885a35379
$$ plain form
9349 1919 7554 110227 -196285 340292 -120471 227011 15813 -85413 104193 -135193 32414
9337 -79479 69837 208918 91656 38142 223728 -394117 67006 105400 -30514 186702 -196611
9325 -255556 95196 52481 128023 45858 -19321 392186 -20369 -5812 -221127 -72907 -213416
9314 -213416 68197 7956 29410 104909 -28204 -118700 11914 -107838 124824 -19685 -120036
9303 -120036 -10750 -80595 -318166 36802 83176 -432781 -317762 182257 -58688 -199412 94167
9291 -68658 26756 -205318 98857 -151990 187601 -241388 -63940 -187296 -214836 -77076 226261
9279 246254 -55755 -298674 -88803 -65249 170379 -160299 -11804 -390923 90063 53197 3791
9267 -77972 -279917 -174615 -159049 -41641 -29292 154463 210377 -22672 -292504 56493 59643
$$ packed form
9349A919N635J02673a96285C40292a20471B27011A5813h5413A04193a35193C2414
9337g9479F9837J39081I1656C8142J85586c94117F7006L8394c0514A86702a96611
9325b55556I5196m2715P5542D5858a9321C92186b0369e812k15315g2907j40509
9314b13416F8197G956K1454P5499b8204r0496A1914a07838A24824a9685j00351
9303a20036a0750o9845k37571C6802M6374d32781J15019A82257e8688j40724I4167
9291f8658B6756b05318I8857a51990A87601b41388f3940j23356k7540g7076B26261
9279B46254e5755k42919h8803K3554A70379a60299a1804l79119I0063l6866C791
9267g7972k01945J05302J5566d1641J2349A54463N5914b2672k69832E6493L150
$$ plain form
9256 59643 102505 69011 -86424 -231649 -19499 -122292 -189177 -60853 172932 115927 29522
9244 -331940 73015 162838 -158076 87583 -166906 156915 18222 -211787 -103817 -432721
9234 -432721 110701 -248348 -247562 -102616 231520 -317477 361303 7780 -381355 -2628 -79381
9223 -79381 16990 32613 -170856 -44150 81165 -158990 19218 41239 97064 -157512 76433
9211 -124533 -70921 -186230 -157217 70531 134524 397483 -14494 -73272 -2942 -149971 -102697
9200 -102697 -69859 -110911 138424 99731 -290145 262074 -198368 17108 -185202 -166647 -32663
9188 -22477 51717 29542 -182637 2940 -198543 273614 12331 -115608 46205 206581 -153971
9176 -53535 -134742 -214733 -293144 -181979 64199 64776 -35005 314394 -2001 -234735 -24929 7230
$$ packed form
9256E9643M2862l3494h6424j45225a9499j02793o6885f0853A72932n7005B9522
9244c31940G3015Q9823a58076H7583a66906A56915A8222b11787a03817l28904
9234d32721A10701b48348P86a02616B31520c17477C61303G780c81355b628p6753
9223g9381A6990J5623a70856d4150H1165a58990A9218K2021N5825a57512G6433
9211a24533N3612j15309K9013G0531O3993K62959a4494n8778b942j47029M7274
9200a02697L2838m1052A38424l8693b90145B62074a98368A7108a85202J8555c2663
9188b2477E1717k2175a82637B940a98543B73614A2331a15608D6205J60376a53971
9176e3535q1207p9991p8411J11165F4199N77c5005C14394b001k32734b4929G230
$$ plain form
9163 -161282 -220836 -127994 -73614 104173 -194075 -84314 -108774 95909 5907 -100420 -504494
9152 -504494 -51902 82162 -61182 152153 -275184 -288497 241924 -206085 -9994 -102005 -173142
9141 -173142 221972 360660 -130073 4818 -114981 -63785 -64038 204801 -84113 -98551 -270560
9130 -270560 4042 307790 19692 -197705 -119215 -169661 179322 -23399 -249802 -262847 -85171
9118 -239572 -100725 -71238 17530 -163996 121405 -241945 -124516 -106410 220306 -182963
9107 -205661 -26715 283712 -248282 -126812 -293330 -71366 115932 50834 93316 76671 -55072
9095 20931 -52773 159357 -157319 186359 133763 51819 -3295 -85448 -261998 -245254 -69063
9083 135251 -25243 -190710 -2293 -99564 287563 -93787 -25228 34801 -159792 194416 -96176
$$ packed form
9163a61282n9554R2842N4380A04173a94075h4314k4460I5909E907a00420m04074
9152e04494e1902H2162f1182A52153b75184j3313B41924b06085i994r2011p1137
9141a73142B21972J38688a30073D818a14981N1196k53B04801h4113j4438j72009
9130b70560D042L03748A9692a97705P8490n0446A79322b3399k26403j3045h5171
9118b39572a00725K9487A7530a63996A21405b41945J17429J8106B20306a82963
9107b05661b6715B83712b48282J21470j66518g1366A15932E0834M2482j6645e5072
9095B0931e2773A59357a57319A86359n2596E1819c295q2153j76550J6744f9063
9083A35251b5243j65467b293r7271B87563i3787b5228C4801a59792A94416i6176
$$ plain form
9071 -196698 63491 -172505 26976 335114 -183128 -45010 -121146 117420 -307521 -137798
9060 -49009 -159133 -120703 -10408 26388 30887 16140 5028 187764 -245095 99222 77408 -145621
9047 90222 134294 -263773 -172741 -9825 92605 -282950 -69604 -1247 65390 -173638 -158817 -79250
9034 -104848 305494 14324 98916 -107245 -241433 -69673 70843 141693 -217784 -240012 4725
9022 175309 -56908 -58575 69637 -76359 -122850 -72975 -73096 -88757 62787 16626 45932 -199789
9009 -44465 31794 -31218 -259497 -85680 -101606 -208946 -220592 -404471 161144 243188 -284428
8997 61555 11560 -34449 31983 -28808 122061 234228 44580 -138738 -229209 -203891 33539
8985 5337 -211737 99665 132804 79292 -161974 74762 -43665 -15222 -29753 -263154 -117286
$$ packed form
9071a96698F3491a72505B6976L08138a83128d5010p6136A17420c07521a37798
9060d9009j10124L8430a0408B6388M499j4747E028J82736b45095I9222k1814a45621
9047I0222M4072b63773R1032i825I2605b82950f9604a247F5390a73638J4821g9250
9034a04848C05494A4324Q4592a07245j34188f9673G0843P0850b17784k2228D725
9022A75309e6908j667F9637g6359m6491M9875j21j5661F2787A6626K9306a99789
9009d4465C1794c1218k28279h5680j5926j07340j1646j83879A61144Q2044b84428
8997F1555A1560c4449C1983b8808A22061J12167D4580a38738r0471K5318C3539
8985E337b11737I9665L3139n3512a61974G4762d3665a5222j4531k33401a17286
$$ plain form
8973 -189224 -143327 -152870 -134964 -452905 -25420 51895 181404 -277245 174543 -349603 -63542
8961 78564 -64933 -2058 -371979 34551 -191699 35011 164924 -20491 295999 102749 22201
8949 327611 5017 -238369 -246753 -54391 -259245 158302 -109627 -25304 -328950 -84160 93493
8937 -227578 18676 -86246 100773 -17508 -145573 -126466 240498 -303857 12687 -221166 143441
8925 -256344 -122564 -249286 235083 126660 -201238 32386 -46135 -162484 -90685 -134664
8915 -134664 -98452 -167491 134088 -64623 145295 -189392 16820 434204 -67835 -183105 -44060
8903 -375382 -29924 -414540 -144156 -62604 66458 -295062 40116 28560 -122115 45552 -72290
8891 -8953 -71627 -71683 6311 -152521 290697 95064 -191497 -162544 -68525 273704 11236 -198642
$$ packed form
8973a89224M5897r543J7906l17941b5420E1895J29509b77245A74543c49603f3542
8961G8564f4933b058l69921C4551a91699C5011J29913b0491B95999A02749B2201
8949C27611E017b38369q384e4391k04854A58302a09627b5304l03646h4160I3493
8937b27578A8676h6246A00773a7508j28065J9107B40498c03857A2687b21166A43441
8925b56344a22564j26722B35083j08423b01238C2386d6135j16349P1799m3979
8915a34664L6212o9039A34088f4623A45295a89392A6820M17384f7835j15270d4060
8903c75382b9924l84616a44156f2604F6458b95062D0116j1556a22115D5552g2290
8891h953o2674n6F311a52521B90697I5064a91497K8953f8525B73704A1236a98642
$$ plain form
8878 -197599 -63164 108877 -53634 412459 -177332 -123749 51824 150609 -75721 -233427 -76193
8866 -219531 130630 -50125 -184499 -51080 54366 -112840 -131500 58107 -166593 -162087 60384
8854 -141012 -163477 119027 -106085 -163191 -22280 139506 -18319 -82565 -1008 -117887 4584
$$ packed form
8878a97599f3164A08877e3634D12459a77332N3583E1824R8785g5721j57706g6193
8866b19531A30630e0125j34374e1080E4366a12840j8660E8107a66593M506F0384
8854a41012k2465A19027a06085n7106b2280A39506a8319o4246a008j16879D584
$$ [...]
##END NTUPLES=NMR SPECTRUM
##END=
