##TITLE=AC1735_SEN00008_9276063_m2krqmUzbs
##JCAMPDX= 6.0         $$ Bruker NMR JCAMP-DX V2.0
##DATA TYPE= NMR SPECTRUM
##DATA CLASS= NTUPLES
##ORIGIN= BRUKER
##OWNER= Administrator
$$ 1.72 TOPSPIN		Version 2.1
$$ 2015-07-18 22:53:08.666 -0700  Administrator@X
$$ Compression mode = diff/dup
##.OBSERVE FREQUENCY= 400.02188249412
##.OBSERVE NUCLEUS= ^1H
##.ACQUISITION MODE= SIMULTANEOUS (DQD)
##.ACQUISITION SCHEME= undefined
##.AVERAGES= 64
##.DIGITISER RES= 22
##SPECTROMETER/DATA SYSTEM= spect
##.PULSE SEQUENCE= noesygpps1d.comp
##.SOLVENT NAME= COFFEE_meoh
##.SHIFT REFERENCE= INTERNAL, COFFEE_meoh, 1, 14.96081
##AUDIT TRAIL= $$ (NUMBER, WHEN, WHO, WHERE, PROCESS, VERSION, WHAT)
$$ ##TITLE= Audit trail, TOPSPIN		Version 2.1
$$ ##JCAMPDX= 5.01
$$ ##ORIGIN= Bruker BioSpin GmbH
$$ ##OWNER= Administrator
$$ $$ E:\/data/COFFEE/nmr/AC1735_SEN00008_9276063_m2krqmUzbs/22/pdata/1/auditp.txt
$$ ##AUDIT TRAIL=  $$ (NUMBER, WHEN, WHO, WHERE, PROCESS, VERSION, WHAT)
(   1,<2015-07-18 22:53:03.385 -0700>,<Administrator>,<X>,<go>,<TOPSPIN 2.1>,
      <created by zg
	started at 2015-07-18 22:41:33.697 -0700,
	POWCHK enabled, PULCHK disabled,
       configuration hash MD5:
       21 0F 79 D6 B3 7B B4 F6 88 20 88 DB 03 48 BD 9F
       data hash MD5: 64K
       D5 F0 AB 4B F0 B3 5E E0 8F 3C E3 3B 26 D9 FF D3>)
(   2,<2015-07-18 22:53:06.557 -0700>,<Administrator>,<X>,<proc1d>,<TOPSPIN 2.1>,
      <Start of raw data processing
       efp LB = 0.3 FT_mod = 6 PKNL = 1 PHC0 = 0 PHC1 = 0 SI = 128K 
       data hash MD5: 128K
       BA 8A 23 5D 23 53 DD 66 DD 39 DD C4 14 2C 23 D4>)
(   3,<2015-07-18 22:53:07.447 -0700>,<Administrator>,<X>,<proc1d>,<TOPSPIN 2.1>,
      <pk PHC0 = -89.08813 PHC1 = 0 
       data hash MD5: 128K
       3A D2 A4 A0 E8 92 5E F8 51 BB 99 6F 9C 03 CF 73>)
(   4,<2015-07-18 22:53:07.838 -0700>,<Administrator>,<X>,<proc1d>,<TOPSPIN 2.1>,
      <abs ABSG = 1 
       data hash MD5: 128K
       D2 F3 39 64 31 DB 84 B7 07 75 90 A3 D4 D6 89 97>)
(   5,<2015-07-18 22:53:07.947 -0700>,<Administrator>,<X>,<proc1d>,<TOPSPIN 2.1>,
      <abs ABSG = 2 
       data hash MD5: 128K
       4D 76 D9 EA F4 38 1E 41 E0 A8 20 C4 BF 3D 2C 95>)
(   6,<2015-07-18 22:53:08.057 -0700>,<Administrator>,<X>,<proc1d>,<TOPSPIN 2.1>,
      <abs ABSG = 3 
       data hash MD5: 128K
       29 A4 B4 1F 92 B4 E3 DC 7F 27 70 84 3C 38 E5 25>)
(   7,<2015-07-18 22:53:08.135 -0700>,<Administrator>,<X>,<proc1d>,<TOPSPIN 2.1>,
      <abs ABSG = 4 
       data hash MD5: 128K
       2A 59 2A FE 3C 50 0A D9 C8 6B 36 60 31 5C DB 45>)
(   8,<2015-07-18 22:53:08.416 -0700>,<Administrator>,<X>,<proc1d>,<TOPSPIN 2.1>,
      <abs ABSG = 5 
       data hash MD5: 128K
       FD 0E CE 3D BC 7A D0 5D 19 68 51 08 FF 63 D7 9D>)
$$ ##END=
$$ 
$$ $$ hash MD5
$$ $$ 97 A9 03 D3 3A 44 ED A5 D5 82 8A 1C 0F E2 D2 55
##$RELAX= 
##$RELAX= 
##$RELAX= 
##$RELAX= 
##$RELAX= 
##$RELAX= 
##$RELAX= 
##$RELAX= 
$$ Bruker specific parameters
$$ --------------------------
##$DU= <E:\>
##$EXPNO= 22
$$ [...]
##$TP07= 0
##$TPNAME0= <>
##$TPNAME1= <>
##$TPNAME2= <>
##$TPNAME3= <>
##$TPNAME4= <>
##$TPNAME5= <>
##$TPNAME6= <>
##$TPNAME7= <>
##$TPOAL= (0..7)
0.5 0.5 0.5 0.5 0.5 0.5 0.5 0.5
##$TPOFFS= (0..7)
0 0 0 0 0 0 0 0
##$TUNHIN= 0
##$TUNHOUT= 0
##$TUNXOUT= 0
##$USERA1= <user>
##$USERA2= <user>
##$USERA3= <user>
##$USERA4= <user>
##$USERA5= <user>
##$V9= 5
##$VALIST= <valist>
##$VCLIST= <CCCCCCCCCCCCCCC>
##$VD= 0
##$VDLIST= <DDDDDDDDDDDDDDD>
##$VPLIST= <PPPPPPPPPPPPPPP>
##$VTLIST= <TTTTTTTTTTTTTTT>
##$WBST= 2048
##$WBSW= 25
##$XGAIN= (0..3)
0 0 0 0
##$XL= 0
##$YL= 0
##$YMAX_a= 14413149
##$YMIN_a= -21507426
##$ZGOPTNS= <>
##$ZL1= 120
##$ZL2= 120
##$ZL3= 120
##$ZL4= 120
##$ABSF1= 14.96081
##$ABSF2= -5.597372
##$ABSG= 5
##$ABSL= 3
##$ALPHA= 0
##$AQORDER= 0
##$ASSFAC= 0
##$ASSFACI= 0
##$ASSFACX= 0
##$ASSWID= 0
##$AUNMP= <proc_prof1d_extract.lims>
##$AXLEFT= 0
##$AXNAME= <>
##$AXNUC= <1H>
##$AXRIGHT= 0
##$AXTYPE= 0
##$AXUNIT= <>
##$AZFE= 0.1
##$AZFW= 0.1
##$BCFW= 0
##$BC_mod= 0
##$BYTORDP= 0
##$COROFFS= 0
##$CY= 15
##$DATMOD= 1
##$DC= 0
##$DFILT= <>
##$DTYPP= 0
##$F1P= 0
##$F2P= 0
##$FCOR= 0.5
##$FTSIZE= 131072
##$FT_mod= 6
##$GAMMA= 0
##$GB= 0
##$INTBC= 1
##$INTSCL= 1
##$ISEN= 128
##$LB= 0.3
##$LEV0= 0
##$LPBIN= 0
##$MAXI= 10000
##$MC2= 0
##$MEAN= 0
##$ME_mod= 0
##$MI= 0
##$NCOEF= 0
##$NC_proc= -4
##$NLEV= 6
##$NOISF1= 0
##$NOISF2= 0
##$NSP= 0
##$NTH_PI= 0
##$NZP= 0
##$OFFSET= 14.96081
##$PC= 1
##$PHC0= -89.08813
##$PHC1= 0
##$PH_mod= 1
##$PKNL= yes
##$PPARMOD= 0
##$PPDIAG= 0
##$PPIPTYP= 0
##$PPMPNUM= 2147483647
##$PPRESOL= 1
##$PSCAL= 4
##$PSIGN= 0
##$PYNMP= <proc.py>
##$REVERSE= no
##$SF= 400.0200097132
##$SI= 131072
##$SIGF1= 0
##$SIGF2= 0
##$SINO= 400
##$SIOLD= 131072
##$SPECTYP= <>
##$SREGLST= <1H.CDCl3>
##$SSB= 0
##$STSI= 131072
##$STSR= 0
##$SW_p= 8223.68421052631
##$SYMM= 0
##$S_DEV= 0
##$TDeff= 65536
##$TDoff= 0
##$TI= <>
##$TILT= no
##$TM1= 0
##$TM2= 0
##$TOPLEV= 0
##$USERP1= <user>
##$USERP2= <user>
##$USERP3= <user>
##$USERP4= <user>
##$USERP5= <user>
##$WDW= 1
##$XDIM= 131072
##$YMAX_p= 479817595
##$YMIN_p= -18478379
##$CURPLOT= <Network HP LaserJet P1505>
##$CURPRIN= <$Network HP LaserJet P1505>
##$DFORMAT= <normdp>
##$LAYOUT= <+/1D_H.xwp>
##$LFORMAT= <normlp>
##$PFORMAT= <normpl>
##$SURQMSG= 1
$$ End of Bruker specific parameters
$$ ---------------------------------
##NTUPLES= NMR SPECTRUM
##VAR_NAME=  FREQUENCY,     SPECTRUM/REAL,   SPECTRUM/IMAG
##SYMBOL=    X,             R,               I
##VAR_TYPE=  INDEPENDENT,   DEPENDENT,       DEPENDENT
##VAR_FORM=  AFFN,          ASDF,            ASDF
##VAR_DIM=   131072,        131072,          131072
##UNITS=     HZ,            ARBITRARY UNITS, ARBITRARY UNITS
##FACTOR=    0.0627417313425164, 1,          1
##FIRST=     8223.62146879497, 21201,        -300318
##LAST=      0,             30331,           -299067
##MIN=       0,             -18478379,       0
##MAX=       8223.62146879497, 479817595,    0
$$ Real data points
##PAGE= N=1
##DATA TABLE= (X++(R..R)), XYDATA
$$ [...]
62393B634515N613L253R32J971M969O302N700N940P876R344R162R010J0408J2272
$$ 2634515 2640128 2643381 2644313 2646284 2651253 2657555 2663255 2669195 2677071 2686415 2695577 2704587 2714995 2727267
62379B727267J2830J2232J2232J4153J7705K0878K1268J8622J5661J4835J5093
$$ 2727267 2740097 2752329 2764561 2778714 2796419 2817297 2838565 2857187 2872848 2887683 2902776
62368B902776J3984J2046J2007J3913J4699J3277J2399J4159J7107J9491K2013
$$ 2902776 2916760 2928806 2940813 2954726 2969425 2982702 2995101 3009260 3026367 3045858 3067871
62357C067871K4995K6131K4052K1381K0921K1097J8926J5534J4539J6050J6601
$$ 3067871 3092866 3118997 3143049 3164430 3185351 3206448 3225374 3240908 3255447 3271497 3288098
62346C288098J4765J2657J1643J0473Q495P034O297M256M93j843k14L288M598
$$ 3288098 3302863 3315520 3327163 3337636 3346131 3353165 3359462 3363718 3364211 3362368 3362154 3365442 3370040
62333C370040K954J162J198J741L05l447p020p506m681j581j421m191p201q694
$$ 3370040 3372994 3374156 3375354 3377095 3377400 3373953 3366933 3359427 3354746 3353165 3351744 3347553 3340352 3331658
62319C331658r504j0955j2775j3803j3570j2373j0589q623o831n255m090m255
$$ 3331658 3322154 3311199 3298424 3284621 3271051 3258678 3248089 3239466 3232635 3227380 3223290 3219035
62307C219035o244q409q114n180k558k727m871o487o324m710k370m84o78l292
$$ 3219035 3212791 3204382 3196268 3191088 3188530 3185803 3180932 3174445 3168121 3163411 3161041 3160557 3159879 3156587
62293C156587o250p157o126n326o042p269o981m148M6K488O80l964o537l773K098
$$ 3156587 3150337 3143180 3137054 3131728 3125686 3118417 3111436 3107288 3107334 3109822 3110502 3106538 3100001 3096228 3098326
62278C098326O233O975O745P669R111R907J0401J0979J0542Q374O325P074J0673
$$ 3098326 3104559 3111534 3118279 3125948 3135059 3144966 3155367 3166346 3176888 3185262 3191587 3198661 3209334
62265C209334J4449J6261J6330J5734J4715J3220J1891J1383J1357J1096J0762
$$ 3209334 3223783 3240044 3256374 3272108 3286823 3300043 3311934 3323317 3334674 3345770 3356532
62254C356532J1091J2172J3458J4646J5480J5050J2848J0558J0761J3171J4112
$$ 3356532 3367623 3379795 3393253 3407899 3423379 3438429 3451277 3461835 3472596 3485767 3499879
62243C499879J1170O608M316M771N273M232K461O44j724m453o222o688o911p175
$$ 3499879 3511049 3517657 3521973 3526744 3532017 3536249 3538710 3539354 3537630 3533177 3526955 3520267 3513356 3506181
62229C506181o559n251m794n237m624k627j870l979o850q158q928j0874j2516
$$ 3506181 3499622 3494371 3489577 3484340 3479716 3477089 3475219 3471240 3464390 3456232 3447304 3436430 3423914
62216C423914j1449q857p934q663q147n876m743o171p803p204m950k843j674k011
$$ 3423914 3412465 3403608 3395674 3387011 3378864 3372988 3368245 3362074 3354271 3347067 3342117 3339274 3337600 3335589
62202C335589m484p757q533n536j626k50j410k854l583m037m146l434k507k430
$$ 3335589 3331105 3323348 3314815 3309279 3307653 3307403 3305993 3303139 3299556 3295519 3291373 3287939 3285432 3283002
62188C283002k860k389o03J403K494K561K305K520L314L687K616Q62N38K381M775
$$ 3283002 3280142 3277753 3277150 3278553 3281047 3283608 3285913 3288433 3291747 3295434 3298050 3298912 3299450 3301831 3306606
62173C306606O214P192Q541R427Q550O199L682J797J201K845O334R147R528Q809
$$ 3306606 3312820 3320012 3328553 3337980 3346530 3352729 3356411 3358208 3359409 3362254 3368588 3377735 3387263 3396072
62159C396072Q888Q874O980M489M395O552P672O318M499L675K638O67l67J011
$$ 3396072 3404960 3413834 3420814 3425303 3429698 3436250 3443922 3450240 3454739 3458414 3461052 3461719 3461352 3462363
62145C462363L160L603K204K66j741l630m200k738r25j319m218p332q235o343
$$ 3462363 3465523 3469126 3471330 3471596 3469855 3466225 3462025 3459287 3458362 3457043 3452825 3445493 3437258 3430915
62131C430915l058o38l16j133j572j976l548n070l674K72K375L51k221j164K008
$$ 3430915 3427857 3427219 3426903 3425770 3424198 3422222 3418674 3413604 3409930 3410202 3412577 3412928 3410707 3409543 3411551
62116C411551K736M44j318p80K01K32K80Q91P98o01k097k893l544l923k715N4
$$ 3411551 3414287 3414731 3413413 3412633 3412834 3413066 3413346 3414237 3415035 3414434 3412337 3409444 3405900 3401977 3399262 3399316
62100C399316K267K494J637R50M78N8o6l71j634k845j955P61K689L007L718N296
$$ 3399316 3401583 3404077 3405714 3406664 3407142 3407200 3407134 3406763 3405129 3402284 3400329 3401090 3403779 3406786 3410504 3415800
62084C415800M882J070k660k379Q54L099L207L145M195O014Q325J0327R531M688
$$ 3415800 3420682 3421752 3419092 3416713 3417567 3420666 3423873 3427018 3431213 3437227 3445552 3455879 3465410 3470098
62070C470098q29k038J359N026O171O185O734P003O082M970M537L865K209M48
$$ 3470098 3469269 3467231 3468590 3473616 3479787 3485972 3492706 3499709 3505791 3510761 3515298 3519163 3521372 3521820
62056C521820r07k953n980p783o596m307m507q054j2401j4833j4747j3162j1572
$$ 3521820 3520913 3517960 3511980 3504197 3497601 3493294 3488787 3480733 3468332 3453499 3438752 3425590 3414018
62043C414018j1178j1993j2721j2506j2488j4397j7832k0291k0241j8901j8328
$$ 3414018 3402840 3390847 3378126 3365620 3353132 3338735 3320903 3300612 3280371 3261470 3243142
62032C243142j8756j8863j8113j7284j6664j5338j3350j3117j6552k1309k2536
$$ 3243142 3224386 3205523 3187410 3170126 3153462 3138124 3124774 3111657 3095105 3073796 3051260
62021C051260j9025j5002j4328j5442j4613j2137j1567j3600j4792j2941j0235
$$ 3051260 3032235 3017233 3002905 2987463 2972850 2960713 2949146 2935546 2920754 2907813 2897578
62010B897578r641j1200j3631j6891k0707k2668k0651j6091j2323j0338q469n932
$$ 2897578 2887937 2876737 2863106 2846215 2825508 2802840 2782189 2766098 2753775 2743437 2734968 2729036
61998B729036m216m754p062r777j2024j3256j3073j1818j0510r656q792p708p308
$$ 2729036 2724820 2720066 2713004 2703227 2691203 2677947 2664874 2653056 2642546 2632890 2624098 2616390 2609082
61985B609082q530j0752j2080j1428r786q985r347r460q524p829q691r725q190
$$ 2609082 2600552 2589800 2577720 2566292 2556506 2547521 2538174 2528714 2520190 2512361 2503670 2493945 2485755
61972B485755m075o80l26j634k407l170n389p654o808k826M69N31n03P11L639
$$ 2485755 2481680 2481000 2480674 2479040 2476633 2473463 2468074 2460420 2453612 2450786 2451255 2451786 2451283 2451994 2455633
61957B455633M625K227n48o9L287N860N449L884M301P146J0051J1197J1104J0942
$$ 2455633 2460258 2462485 2461937 2461868 2465155 2471015 2476464 2480348 2484649 2491795 2501846 2513043 2524147 2535089
61943B535089J0674R918R292R388R083O744L143J341L095O747R607J1148J2275
$$ 2535089 2545763 2555681 2564973 2574361 2583444 2590188 2593331 2594672 2597767 2604514 2614121 2625269 2637544
61930B637544J2354R291L355j194j19N749J1413J3489J3002J2092J0401O643K054
$$ 2637544 2649898 2659189 2662544 2661350 2661231 2666980 2678393 2691882 2704884 2716976 2727377 2734020 2736074
61917B736074l63O09L767P920J2370J5169J4123J0368Q009Q629Q840N414L84j780
$$ 2736074 2735711 2736320 2740087 2748007 2760377 2775546 2789669 2800037 2808046 2816675 2825515 2830929 2831313 2829533
61903B829533l67J458J687J306J300J165R55J807L273K774n97l827l661j185l88
$$ 2829533 2829166 2830624 2832311 2833617 2834917 2836082 2837037 2838844 2842117 2844891 2844294 2840467 2836806 2835621 2835233
61888B835233k675n083m317p26K651L793L151J973P27m85j143q52L7J126K516
$$ 2835233 2832558 2827475 2823158 2822432 2825083 2828876 2832027 2834000 2834727 2834242 2833099 2832247 2832284 2833410 2835926
61873B835926L584K340j987o278o138j644K185J722j007j986n03J424K601K705
$$ 2835926 2839510 2841850 2839863 2833585 2827447 2825803 2827988 2829710 2828703 2826717 2826214 2827638 2830239 2832944
61859B832944P80k799m345r29M276N043O65k830j024L694O893P908Q110P053M008
$$ 2832944 2833724 2830925 2826580 2825651 2829927 2834970 2835635 2832805 2831781 2835475 2842368 2850276 2858386 2865439 2869447
61844B869447R90N55J911K572K708M305O670O453K546k152m633m897m168k477
$$ 2869447 2870437 2870992 2872903 2875475 2878183 2882488 2889158 2895611 2898157 2896005 2891372 2886475 2882307 2879830
61830B879830L44K784K556j000o079r591r046m508Q01K840N24l513o281p481q531
$$ 2879830 2880174 2882958 2885514 2884514 2878435 2868844 2859798 2855290 2856091 2858931 2859455 2855942 2849661 2842180 2833649
61815B833649r785j0260r764r695j1230j3646j5150j5117j4753j5444j6816j6978
$$ 2833649 2823864 2813604 2803840 2794145 2782915 2769269 2754119 2739002 2724249 2708805 2691989 2675011
61803B675011j4768j1343r193r741j2198j4635j5787j5698j5121j4670j4469j4369
$$ 2675011 2660243 2648900 2639707 2629966 2617768 2603133 2587346 2571648 2556527 2541857 2527388 2513019
61791B513019j4157j3572j2295j0250p943o282o000p301r917j3002j5235j5720
$$ 2513019 2498862 2485290 2472995 2462745 2454802 2448520 2442520 2435219 2425302 2412300 2397065 2381345
61779B381345j4911j4062j3571j2711j1272j0418j1039j2137j2066j0862r920
$$ 2381345 2366434 2352372 2338801 2326090 2314818 2304400 2293361 2281224 2269158 2258296 2248376
61768B248376r595q585o140l638l236n629r571j2904j3811j2062r691r462j1646
$$ 2248376 2238781 2230196 2224056 2220418 2217182 2211553 2201982 2189078 2175267 2163205 2153514 2144052 2132406
61755B132406j3162j1171o991m763o275q830q969o664m502l824l550k679k093
$$ 2132406 2119244 2108073 2101082 2096319 2090044 2081214 2072245 2065581 2061079 2057255 2053705 2051026 2048933
61742B048933l045n005o069n272l725l418n221p991r449q133m672j135P84O93
$$ 2048933 2045888 2040883 2034814 2029542 2025817 2022399 2017178 2009187 1999738 1991605 1986933 1985798 1986582 1987275
61728A987275r44l229m790m461k741j699k584m164m369k885j027M26J841L379
$$ 1987275 1986331 1983102 1978312 1973851 1971110 1969411 1966827 1962663 1958294 1955409 1954382 1954808 1956649 1960028
61714A960028M511M921M563K674j692p489j1433j0856o196k24M113M827J571l511
$$ 1960028 1964539 1969460 1974023 1976697 1975005 1967516 1956083 1945227 1939031 1938807 1942920 1947747 1949318 1945807
61700A945807o766o449m543l998n009n492m525l323k991l234l606m248m822m225
$$ 1945807 1939041 1932592 1928049 1924051 1919042 1913550 1909025 1905702 1902711 1899477 1895871 1891623 1886801 1882576
61686A882576k342q34j184k772l749l144j357N00R28j294n449q503p993n029k948
$$ 1882576 1880234 1879400 1878216 1875444 1871695 1868551 1867194 1867694 1868622 1867328 1861879 1853376 1845383 1840354 1837406
61671A837406k986l044j276Q22L44k903n798n456k331N41P50j332l231l002j197
$$ 1837406 1834420 1831376 1830100 1830922 1831266 1828363 1822565 1817109 1814778 1815319 1816069 1814737 1811506 1808504 1807307
61656A807307j15j091l068m097l559k160m00J700L447L471J417j374l544n173
$$ 1807307 1807192 1806101 1803033 1798936 1795377 1793217 1792817 1794517 1797964 1801435 1802852 1801478 1797934 1792761
61642A792761o779p550n963k147J400K049k25k761l134j992k384n818r681r817
$$ 1792761 1785982 1778432 1772469 1770322 1771722 1773771 1773546 1770785 1767651 1765659 1763275 1757457 1747776 1737959
61628A737959n551o86R24o55k682l444l252k822k443k500l278m202m382l889l517
$$ 1737959 1732408 1731722 1732646 1731991 1729309 1725865 1722613 1719791 1717348 1714848 1711570 1707368 1702986 1699097 1695580
61613A695580l586l883m323m674m224l024k561l508l649o65L481M040r1m610n745
$$ 1695580 1691994 1688111 1683788 1679114 1674890 1671866 1669305 1665797 1662148 1661483 1664964 1669004 1668913 1664303 1658558
61598A658558m899n269o589o343m463l400m022m541l692k534k571m039o240p869
$$ 1658558 1653659 1648390 1641801 1635458 1630995 1627595 1623573 1619032 1615340 1612806 1610235 1606196 1599956 1592087
61584A592087o960k713K182L368m3m117m913k723k16J475K534K149m73l344l187
$$ 1592087 1585127 1582414 1584596 1587964 1587921 1583804 1578891 1576168 1575952 1577427 1579961 1582110 1581637 1578293 1575106
61569A575106j76J626l53l834n262m479l645l268k204o43M9K52J636L288J813
$$ 1575106 1574930 1576556 1576203 1572369 1567107 1562628 1558983 1555715 1553511 1552868 1552917 1553169 1554805 1558093 1559906
61554A559906l145o654m433J227M567L742J812J346J698J855K419L686M351L428
$$ 1559906 1556761 1550107 1545674 1546901 1551468 1555210 1557022 1558368 1560066 1561921 1564340 1568026 1572377 1575805
61540A575805J511p10l108m483k666K321P177Q906P812N720L263O06j166j498
$$ 1575805 1577316 1576606 1573498 1569015 1566349 1568670 1575847 1584753 1592565 1598285 1601548 1602154 1600988 1599490
61526A599490j634k281j667J607N176N408K552L48P32J943J994J173L33n85j207
$$ 1599490 1597856 1595575 1593908 1595515 1600691 1606099 1608651 1608999 1609731 1611674 1613668 1614841 1615174 1614589 1613382
61511A613382k99J959L229K175P48J504L766M650L348K156K887M141L397Q37o28
$$ 1613382 1613083 1615042 1618271 1620446 1621194 1622698 1626464 1631114 1634462 1636618 1639505 1643646 1647043 1647880 1647252
61496A647252Q15L564M954M695M353M139K593j33j210J188M944O588N580M022
$$ 1647252 1648067 1651631 1656585 1661280 1665633 1669772 1672365 1672232 1671022 1672210 1677154 1683742 1689322 1693344
61482A693344L179K523J738J369J539J834K376L346L730K519R02J092L031M532
$$ 1693344 1696523 1699046 1700784 1702153 1703692 1705526 1707902 1711248 1714978 1717497 1718399 1719491 1722522 1727054
61468A727054M805N339O867P955P524O353N104L241J142P82K624M097L189J476
$$ 1727054 1731859 1737198 1744065 1752020 1759544 1765897 1771001 1774242 1775384 1776166 1778790 1782887 1786076 1787552
61454A787552J368K250K170J858L811P904J1009J1142R440P622N883M009K481
$$ 1787552 1788920 1791170 1793340 1795198 1799009 1806913 1817922 1829064 1838504 1846126 1852009 1856018 1858499
61441A858499J541O56j38K48K158M100M435L390K471K570L422M543N912P711R671
$$ 1858499 1860040 1860696 1860558 1860806 1862964 1867064 1871499 1874889 1877360 1879930 1883352 1887895 1893807 1901518 1911189
61426A911189J0612R116N376K032J773L994N287L836J760J990M301O209O756P135
$$ 1911189 1921801 1930917 1936293 1938325 1940098 1944092 1949379 1953215 1954975 1956965 1961266 1967475 1974231 1981366
61412A981366P819P486N556L754L868N285O198O250O323O429N690M307L795M778
$$ 1981366 1989185 1996671 2002227 2005981 2009849 2015134 2021332 2027582 2033905 2040334 2046024 2050331 2054126 2058904
61398B058904N945N832M470K767J438J378L693P927J1060J0005N194M75p55J483
$$ 2058904 2064849 2070681 2075151 2077918 2079356 2080734 2084427 2092354 2103414 2113419 2118613 2119088 2118333 2119816
61384B119816M727O882P546P251O417N273M318M187M816N214M609L546L114L391
$$ 2119816 2124543 2131425 2138971 2146222 2152639 2157912 2162230 2166417 2171233 2176447 2181056 2184602 2187716 2191107
61370B191107L812M898P935J2471J5735J5667J3309J1070R948R664J0240J1583
$$ 2191107 2194919 2199817 2207752 2220223 2235958 2251625 2264934 2276004 2285952 2295616 2305856 2317439
61358B317439J2411J1509R545Q094P406O810O591P389Q254P529N527M166M066
$$ 2317439 2329850 2341359 2350904 2358998 2366404 2373214 2379805 2387194 2395448 2402977 2408504 2412670 2416736
61345B416736M248M634O239Q620R878R995J1332J4438J5977J2990P456M392O333
$$ 2416736 2420984 2425618 2431857 2440477 2450355 2460350 2471682 2486120 2502097 2515087 2522543 2526935 2533268
61332B533268J1318J5490J6276J3671R882P344O441N797N040N733Q676J1866J2651
$$ 2533268 2544586 2560076 2576352 2590023 2599905 2607249 2613690 2619487 2624527 2630260 2638936 2650802 2663453
61319B663453J0883Q560P185O863P285Q333R889J1751J3334J3326J0872P554O647
$$ 2663453 2674336 2682896 2690081 2696944 2704229 2712562 2722451 2734202 2747536 2760862 2771734 2779288 2785935
61306B785935R423J3452J5471J4607J1948Q780O505O506Q281R253Q070O731P536
$$ 2785935 2795358 2808810 2824281 2838888 2850836 2859616 2866121 2872627 2880908 2890161 2898231 2904962 2912498
61293B912498R590J0503J0136J0048J0298R584Q079P357P711P996Q067Q920J0358
$$ 2912498 2922088 2932591 2942727 2952775 2963073 2972657 2980736 2988093 2995804 3003800 3011867 3020787 3031145
61280C031145J0885J0280J0049J0833J1348J0595R401R197J0556J3203J6021J7056
$$ 3031145 3042030 3052310 3062359 3073192 3084540 3095135 3104536 3113733 3124289 3137492 3153513 3170569
61268C170569J5210J2180J0991J2403J4367J5054J4507J3093J0754Q571Q815J2117
$$ 3170569 3185779 3197959 3208950 3221353 3235720 3250774 3265281 3278374 3289128 3297699 3306514 3318631
61256C318631J6113J8111J7799J6367J4584J3023J2698J3807J4734J3896J2081
$$ 3318631 3334744 3352855 3370654 3387021 3401605 3414628 3427326 3441133 3455867 3469763 3481844
61245C481844J1525J2887J4505J4751J4006J3821J4709J5623J5714J5844J7327
$$ 3481844 3493369 3506256 3520761 3535512 3549518 3563339 3578048 3593671 3609385 3625229 3642556
61234C642556J9354J9259J5975J1772R379Q937R474J1685J6436K1356K2443J9439
$$ 3642556 3661910 3681169 3697144 3708916 3718295 3727232 3736706 3748391 3764827 3786183 3808626 3828065
61222C828065J6551J6875J8720J8770J6491J3896J2859J4132J7306K0383K0932
$$ 3828065 3844616 3861491 3880211 3898981 3915472 3929368 3942227 3956359 3973665 3994048 4014980
61211D014980J9136J8022J9383K1389K1861K1869K3604K6216K6660K4065K0783
$$ 4014980 4034116 4052138 4071521 4092910 4114771 4136640 4160244 4186460 4213120 4237185 4257968
61200D257968J9256J9963K2127K4382K4730K2085J8355J7158J9828K3799K5526
$$ 4257968 4277224 4297187 4319314 4343696 4368426 4390511 4408866 4426024 4445852 4469651 4495177
61189D495177K3996K1108J9585K0781K3631K5581K5243K4040K4370K6332K7539
$$ 4495177 4519173 4540281 4559866 4580647 4604278 4629859 4655102 4679142 4703512 4729844 4757383
61178D757383K6245K3438K1455K1675K4016K7495L0489L1274K9443K6708K5549
$$ 4757383 4783628 4807066 4828521 4850196 4874212 4901707 4932196 4963470 4992913 5019621 5045170
61167E045170K6977K9775L1811L1725K9476K5731K1344J7608J6441J9155K4613
$$ 5045170 5072147 5101922 5133733 5165458 5194934 5220665 5242009 5259617 5276058 5295213 5319826
61156E319826K9588L1861L2461L3745L5724L5866L2847K8900K7337K8702L0735
$$ 5319826 5349414 5381275 5413736 5447481 5483205 5519071 5551918 5580818 5608155 5636857 5667592
61145E667592L1592L1530L1294L0520K8695K6734K6359K8261L1658L5263L7631
$$ 5667592 5699184 5730714 5762008 5792528 5821223 5847957 5874316 5902577 5934235 5969498 6007129
61134F007129L7312L4323L1361L1513L4330L6156L5236L4165L5704L8407L9011
$$ 6007129 6044441 6078764 6110125 6141638 6175968 6212124 6247360 6281525 6317229 6355636 6394647
61123F394647L7513L6587L6818L6238L4720L5061L8422M1812M2101M0126L8786
$$ 6394647 6432160 6468747 6505565 6541803 6576523 6611584 6650006 6691818 6733919 6774045 6812831
61112F812831L8911L9244L9105L8891L8789L8894M0011M2560M5192M5949M4580
$$ 6812831 6851742 6890986 6930091 6968982 7007771 7046665 7086676 7129236 7174428 7220377 7264957
61101G264957M2466M0640L8942L6816L4162L1852L1719L4992M0066M3309M3090
$$ 7264957 7307423 7348063 7387005 7423821 7457983 7489835 7521554 7556546 7596612 7639921 7683011
61090G683011M1605M1533M2587M3041M2954M3538M4532M4709M4311M4627M5676
$$ 7683011 7724616 7766149 7808736 7851777 7894731 7938269 7982801 8027510 8071821 8116448 8162124
61079H162124M6565M7632M9867N2598N4210N4938N6217N7439N6341N3089N0983
$$ 8162124 8208689 8256321 8306188 8358786 8412996 8467934 8524151 8581590 8637931 8691020 8742003
61068H742003N1999N4398N6084N7807O1103O5131O7777O8457O7769O5518O1428
$$ 8742003 8794002 8848400 8904484 8962291 9023394 9088525 9156302 9224759 9292528 9358046 9419474
61057I419474N7440N6959O1231O7802P3228P6577P9639Q4010Q8801R1788R2425
$$ 9419474 9476914 9533873 9595104 9662906 9736134 9812711 9892350 9976360 10065161 10156949 10249374
61046A0249374R2509R3512R4622R4601R4239R5140R7029R8584J00376J04165J09301
$$ 10249374 10341883 10435395 10530017 10624618 10718857 10813997 10911026 11009610 11109986 11214151 11323452
61035A1323452J12790J13691J14447J16731J18988J19994J22024J27873J36717
$$ 11323452 11436242 11549933 11664380 11781111 11900099 12020093 12142117 12269990 12406707
61026A2406707J45798J54619J64473J74930J84251J93257K05624K23521K44827
$$ 12406707 12552505 12707124 12871597 13046527 13230778 13424035 13629659 13853180 14098007
61017A4098007K65360K82203K94451L02262L05976L05492L00630K92903K86175
$$ 14098007 14363367 14645570 14940021 15242283 15548259 15853751 16154381 16447284 16733459
61008A6733459K83785K85341K88214K91967K98801L09067L18759L22722L18740
$$ 16733459 17017244 17302585 17590799 17882766 18181567 18490634 18809393 19132115 19450855
60999A9450855L07337K89518K66703K41865K18515J98545J82148J69367J60002
$$ 19450855 19758192 20047710 20314413 20556278 20774793 20973338 21155486 21324853 21484855
60990B1484855J51810J40418J22173R6860O7183L5875L839k9012o1834r2540j19568
$$ 21484855 21636665 21777083 21899256 21996116 22063299 22099174 22103013 22074001 22012167 21919627 21800059
60979B1800059j43300j65202j85796k04110k19076k30806k40371k48803k56560
$$ 21800059 21656759 21491557 21305761 21101651 20882575 20651769 20411398 20162595 19906035
60970A9906035k63611k69815k75191k79754k83042k84413k84197k84019k85331
$$ 19906035 19642424 19372609 19097418 18817664 18534622 18250209 17966012 17681993 17396662
60961A7396662k88016k91107k94102k96474k96714k93738k89019k85403k83341
$$ 17396662 17108646 16817539 16523437 16226963 15930249 15636511 15347492 15062089 14778748
60952A4778748k80380k75066k69277k65348k62702k59173k54380k49671k45529
$$ 14778748 14498368 14223302 13954025 13688677 13425975 13166802 12912422 12662751 12417222
60943A2417222k41183k36583k32951k31149k30833k31164k31254k30367k29254
$$ 12417222 12176039 11939456 11706505 11475356 11244523 11013359 10782105 10551738 10322484
60934A0322484k30720k36657k44455k48716k47313k43745k42445k43786k45065
$$ 10322484 10091764 9855107 9610652 9361936 9114623 8870878 8628433 8384647 8139582
60925H139582k44617k42854k40505k38070k36452k36026k35195k31797k26001
$$ 8139582 7894965 7652111 7411606 7173536 6937084 6701058 6465863 6234066 6008065
60916F008065k20122k15276k10073k03274j95872j89187j82176j72491j59927
$$ 6008065 5787943 5572667 5362594 5159320 4963448 4774261 4592085 4419594 4259667
60907D259667j47155j36743j28579j20785j12178j03041r3884q4641p5361o6958
$$ 4259667 4112512 3975769 3847190 3726405 3614227 3511186 3417302 3332661 3257300 3190342
60897C190342o0647n6763n4344n1757m7761m2578l8174l6648l7612l7915l5133
$$ 3190342 3129695 3072932 3018588 2966831 2919070 2876492 2838318 2801670 2764058 2726143 2691010
60886B691010l0696k7911k7332k6265k3320k0878k1610k4489k6366k6117k4858
$$ 2691010 2660314 2632403 2605071 2578806 2555486 2534608 2512998 2488509 2462143 2436026 2411168
60875B411168k3028j9813j5439j1639r450q461q479r911j1930j2408j0807r463
$$ 2411168 2388140 2368327 2352888 2341249 2331799 2323338 2314859 2304948 2293018 2280610 2269803 2260340
60863B260340j0653j3637j5916j6309j5450j3981j1800q927o123m539m938o917
$$ 2260340 2249687 2236050 2220134 2203825 2188375 2174394 2162594 2153667 2147544 2143005 2138067 2131150
60851B131150q865r415q950q561p793n376k534k819p074j0908r877n644l874o609
$$ 2131150 2122285 2112870 2103920 2095359 2087566 2082190 2079656 2076837 2069763 2058855 2048978 2043334 2039460 2032851
60837B032851r957r631n906j958K27O72k07k054m047n321n783n712m988l481j899
$$ 2032851 2022894 2013263 2007357 2005399 2005626 2006298 2006091 2004037 1999990 1994669 1988886 1983174 1978186 1974705 1972806
60822A972806j477k710m860o728p667p831p694p424o786n523l790k316k293m587
$$ 1972806 1971329 1968619 1963759 1957031 1949364 1941533 1933839 1926415 1919629 1914106 1910316 1908000 1905707 1901120
60808A901120q291j0320p953k212K488K874j61l776o699q911r395o899k534Q02
$$ 1901120 1892829 1882509 1874556 1872344 1874832 1877706 1877545 1873769 1867070 1858159 1848764 1841865 1839331 1840133
60794A840133J734J162k17k785n929p489o370l907j701R4J382R55j662m739o264
$$ 1840133 1841867 1843029 1842812 1840027 1834098 1826609 1820239 1816332 1814631 1814725 1816107 1817062 1815400 1810661 1804397
60779A804397o197n427l853j312Q58J213N35P96K198L064K428J060q2q59j414
$$ 1804397 1798200 1792773 1788920 1787608 1788466 1789679 1790214 1791010 1793208 1796272 1798700 1799760 1799678 1798819 1797405
60764A797405j828k132j642R65N194P352M270j802m927k818N12O13j761l086k644
$$ 1797405 1795577 1793445 1791803 1792768 1797962 1805314 1809584 1807782 1802855 1800037 1800549 1801162 1799401 1796315 1793671
60749A793671k463l050k601m91J449J830J637K338L765M768M541K570j122m921
$$ 1793671 1791208 1788158 1785557 1785066 1786515 1788345 1789982 1792320 1796085 1800853 1805394 1807964 1806842 1801921
60735A801921o426n449m493m844m177l33M192M796J417r00J234N257O536M020
$$ 1801921 1795495 1790046 1785553 1780709 1776532 1776199 1780391 1785187 1786604 1785704 1786938 1792195 1798731 1802751
60721A802751J18k966m507m229k560j246j533k090o03K776N391N208K457j466
$$ 1802751 1802869 1799903 1795396 1791167 1788607 1787361 1785828 1783738 1783135 1785911 1791302 1796510 1798967 1797501
60707A797501m799n474k669J524M071M808O029P996P750L620j685m322l689j708
$$ 1797501 1792702 1787228 1784559 1786083 1790154 1794962 1800991 1808987 1816737 1820357 1818672 1814350 1810661 1808953
60693A808953L64K126K591J154p00q94N07J939K978M159M850L828J826J015J642
$$ 1808953 1809317 1811443 1814034 1815188 1814488 1813594 1814101 1816040 1819018 1823177 1828027 1831855 1833681 1834696 1836338
60678A836338J700L84m48Q30L252M768M362J980j672m390l719k81K269K262K592
$$ 1836338 1838038 1838422 1837974 1838804 1842056 1846824 1851186 1853166 1851494 1847104 1843385 1843104 1845373 1847635 1850227
60663A850227N947R749R272M522J28j244j343j644m90K990N547L694r54l398j450
$$ 1850227 1856174 1865923 1875195 1879717 1879845 1878601 1877258 1875614 1875124 1878114 1883661 1887355 1886401 1883003 1881553
60648A881553K533N546O722O195M067J404J50Q02J729J786K007L412M644L646
$$ 1881553 1884086 1889632 1896354 1902549 1906616 1908020 1908170 1908972 1910701 1912487 1914494 1917906 1922550 1926196
60634A926196R82n38N44K788M217M746N330N795M829K109n78r38J432M753P015
$$ 1926196 1927178 1926640 1927184 1929972 1934189 1938935 1944265 1950060 1954889 1956998 1956420 1955482 1956914 1961667 1968682
60619A968682P617O921N209K893J052N41P99P32M65P13O47j375m363m374P12P862
$$ 1968682 1976299 1983220 1988429 1991322 1992374 1992915 1993714 1994446 1994911 1995624 1996271 1994896 1990533 1986159 1986871 1994733
60603A994733J2163J2055R564O886N108N050O356O257K358l249n612l138P46K994
$$ 1994733 2006896 2018951 2028515 2035401 2040509 2045559 2051915 2058172 2060530 2057281 2051669 2048531 2049277 2052271
60589B052271M744P948J1000J0645O946L651L836O832R357Q627M770R58N76L605
$$ 2052271 2057015 2064963 2075963 2086608 2093554 2097205 2101041 2107873 2117230 2125857 2130627 2131585 2132161 2135766
60575B135766O738P432O427N440M495L312L474O578J0921J2699J0519O628L718
$$ 2135766 2142504 2149936 2156363 2161803 2166298 2169610 2173084 2179662 2190583 2203282 2213801 2220429 2224147
60562B224147K496K688M218O442P750P171N689N083N894P122P675P637Q000R261
$$ 2224147 2226643 2229331 2233549 2239991 2247741 2254912 2260601 2265684 2271578 2278700 2286375 2294012 2302012 2311273
60548B311273J0541J0638R760R100Q569O604L167J219L290P649J0101R067O776
$$ 2311273 2321814 2332452 2342212 2351312 2359881 2366485 2369652 2370871 2374161 2381810 2391911 2400978 2407754
60535B407754N518N092M435L782M020N083O005O058N354M814N338O518O629M881
$$ 2407754 2413272 2418364 2422799 2426581 2430601 2435684 2441689 2447747 2453101 2457915 2463253 2469771 2476400 2481281
60521B481281L089L659O467R374J1327J2853J3815J3178J1322J0036R591Q328
$$ 2481281 2484370 2488029 2494496 2503870 2515197 2528050 2541865 2555043 2566365 2576401 2585992 2594320
60509B594320O063N116O541Q016P611P156R093J1849J1609P720L260O49m13o29
$$ 2594320 2600383 2605499 2612040 2620056 2627667 2634823 2643916 2655765 2667374 2675094 2678354 2679003 2678590 2677961
60495B677961L18K207L679M057L959L523J843r48k938k969k427l245n210o502
$$ 2677961 2678279 2680486 2684165 2688222 2692181 2695704 2697547 2696599 2693661 2690692 2688265 2685020 2679810 2673308
60481B673308o129m756l800m586p489j0962j2278j0417p496o174o449o557o261
$$ 2673308 2667179 2662423 2658623 2654037 2646548 2635586 2623308 2612891 2605395 2599221 2592772 2586215 2579954
60468B579954p097r337j0953j0587r836j1278j5036j8648j9783j8086j4694j1020
$$ 2579954 2572857 2563520 2552567 2541980 2532144 2520866 2505830 2487182 2467399 2449313 2434619 2423599
60456B423599q112o434n933o437p697q976r286q571q050q579r331r055q180q249
$$ 2423599 2415487 2409053 2403120 2396683 2388986 2380010 2370724 2362153 2354103 2345524 2336193 2327138 2318958 2310709
60442B310709r501j0342r548p800o645o893q292r783r820p651m700l484m590o002
$$ 2310709 2301208 2290866 2281318 2273518 2266873 2259980 2251688 2241905 2232085 2224434 2219734 2216250 2211660 2205658
60428B205658o123n912o833q153q037o420m908m283l932l635m114n514o882p506
$$ 2205658 2199535 2193623 2186790 2178637 2170600 2164180 2159272 2154989 2151057 2147422 2143308 2137794 2130912 2123406
60414B123406p585p113n406k408M78J623Q26p81k041k607k769k710j987n0K597
$$ 2123406 2115821 2108708 2103302 2100894 2101372 2102995 2103821 2103040 2100999 2098392 2095623 2092913 2090926 2090876 2093473
60399B093473M355M319L549L656M581M768L351J072o97r11P40L148L949K015l43
$$ 2093473 2097828 2102147 2105696 2109352 2113933 2118701 2122052 2123124 2122427 2121516 2122256 2125404 2129353 2131368 2131025
60384B131025L86M251P345O813M438L838N413N996L281q99k270J263P129J0544
$$ 2131025 2131411 2135662 2143007 2149820 2154258 2158096 2163509 2169505 2172786 2171887 2169617 2170880 2178009 2188553
60370B188553R486O397M438L400J155j926k851n68K179K733J853J661K313K791
$$ 2188553 2198039 2204436 2208874 2212274 2213429 2211503 2208652 2208084 2210263 2212996 2214849 2216510 2218823 2221614
60356B221614L400N113P286Q207P506O310N314M319L473L282L593L840M231N254
$$ 2221614 2225014 2230127 2237413 2245620 2253126 2259436 2264750 2269069 2272542 2275824 2279417 2283257 2287488 2292742
60342B292742O235N801L855J788N57j96q81j052k84Q99J594J636J863L165N138
$$ 2292742 2298977 2304778 2308633 2310421 2310978 2310782 2309901 2308849 2308565 2309464 2311058 2312694 2314557 2317722 2322860
60327B322860N884M063J284Q77L462N486L861M97l30J935L881L761L744N416O410
$$ 2322860 2328744 2332807 2334091 2334968 2338430 2343916 2347777 2348274 2347944 2349879 2353760 2357521 2361265 2366681 2373091
60312B373091L922n08k511j59M512Q491J0035Q459M305R0j167Q29L262L824L400
$$ 2373091 2377013 2376505 2373994 2373835 2378347 2386838 2396873 2405332 2409637 2409727 2408560 2409389 2412651 2416475 2419875
60297B419875M097N753N995L466m59l425m622m962n365n501m354j851M30N08j752
$$ 2419875 2423972 2429725 2435720 2439186 2438727 2435302 2430680 2425718 2420353 2414852 2410498 2408647 2409077 2409585 2407833
60282B407833m050l865j195J418J581o93l369m269k633L80K390J870r2j070o91
$$ 2407833 2403783 2399918 2398723 2400141 2401722 2401029 2397660 2393391 2390758 2391138 2393528 2395398 2395306 2394236 2393545
60267B393545j339m421p423o718k538J126J644M86K61J125J365K20j329j888p91
$$ 2393545 2392206 2387785 2380362 2373644 2371106 2372232 2373876 2374362 2374623 2375748 2377113 2377333 2376004 2374116 2373325
60252B373325J447L091K437j31j966r67J946L883L072L54j953k137n16Q83N26
$$ 2373325 2374772 2377863 2380300 2380169 2378203 2377236 2379182 2383065 2386137 2386491 2384538 2382401 2381885 2382768 2383294
60237B383294p40q59M88J584J558J740L163M469L731J213j202k188j361J277M604
$$ 2383294 2382554 2381695 2382183 2383767 2385325 2387065 2390228 2394697 2398428 2399641 2398439 2396251 2394890 2396167 2400771
60222B400771O160M670K208K124N143R056J1647J2266J0992Q281N332L345K374
$$ 2400771 2406931 2411601 2413809 2415933 2421076 2430132 2441779 2454045 2465037 2473318 2478650 2481995 2484369
60209B484369J895J914K339K363K038L219O695R654Q847N389L178L015K154j63
$$ 2484369 2486264 2488178 2490517 2492880 2494918 2498137 2504832 2514486 2523333 2528722 2531900 2534915 2537069 2536906
60195B536906r60J361M082M519L825L700K543j505n778n498k99N125P016O171
$$ 2536906 2535946 2537307 2541389 2545908 2549733 2553433 2555976 2554471 2548693 2543195 2542896 2548021 2555037 2561208
60181B561208N245N071M805L884K621J658J472J923K147J466L24l03k08j7k06
$$ 2561208 2566453 2571524 2576329 2580213 2582834 2584492 2585964 2587887 2590034 2591500 2591824 2591521 2591313 2591296 2591090
60166B591090p59j446j720q45R69K137J413l90j475j318o48K73J826L718N110
$$ 2591090 2590331 2588885 2587165 2586320 2587289 2589426 2590839 2590449 2588974 2587656 2587008 2587281 2589107 2592825 2597935
60151B597935N954O636O312L726J18r09K176O206O783L401n83k252j568J17J878
$$ 2597935 2603889 2610525 2616837 2620563 2620681 2619772 2621948 2628154 2634937 2638338 2637755 2635503 2633935 2634052 2635930
60136B635930L207L856M432N898P677P463M163J81o65K610P204R701R085O500
$$ 2635930 2639137 2642993 2647425 2653323 2661000 2668463 2672626 2672807 2672142 2674752 2681956 2691657 2700742 2707242
60122B707242L518J346N72N39m60l134n622n190j728J608J873k97j713o97J070
$$ 2707242 2710760 2712106 2712678 2713217 2712757 2709623 2704001 2698811 2697083 2698691 2700564 2700267 2698554 2697857 2698927
60107B698927J133l14r22J85Q77q83l742m472k308R9J63j945m493o197o268m376
$$ 2698927 2700060 2699746 2698824 2699009 2699886 2699003 2695261 2690789 2688481 2688580 2688743 2686798 2682305 2676108 2669840 2665464
60091B665464j936j700m282o482m902k23M062N910N547L273n01l503l211o28L96
$$ 2665464 2663528 2661828 2657546 2651064 2646162 2645939 2650001 2655911 2661458 2664731 2664230 2660727 2657516 2656888 2657284
60076B657284j728m498n321m620l921l553l643m850o438o026l241j272k532m878
$$ 2657284 2655556 2651058 2645737 2641117 2637196 2633643 2630000 2625150 2618712 2612686 2609445 2608173 2605641 2600763
60062B600763m959l462l751o315q174p657o529o698p369o588l831k40K505L098
$$ 2600763 2595804 2592342 2588591 2582276 2574102 2566445 2559916 2553218 2545849 2539261 2535430 2535190 2537695 2540793
60048B540793J595k46p94o76j695l767m790l865k647k621k794j503O23J036j664
$$ 2540793 2542388 2542142 2541348 2540672 2538977 2535210 2530420 2526555 2523908 2521287 2518493 2516990 2517613 2518649 2516985
60033B516985o036r036q505m818n80J528R33j008l036m967o557o791n371m023
$$ 2516985 2510949 2501913 2493408 2488590 2488010 2489538 2490471 2489463 2486427 2481460 2474903 2468112 2462741 2458718
60019B458718m808p207q257o178k833j532l019m995n473m937m495l744j992l35
$$ 2458718 2453910 2446703 2438446 2432268 2429435 2427903 2424884 2419889 2414416 2409479 2404984 2401240 2399248 2398913
60005B398913j99o54J45J152o29m669o039j940L912O139M347J757m62l407o329
$$ 2398913 2398714 2398060 2398205 2399357 2398728 2394059 2388020 2386080 2389992 2396131 2400478 2402235 2401773 2398366 2392037
59990B392037o877n252m007l400j167K402L742J896O80K445L906J716j388o80
$$ 2392037 2385160 2379908 2375901 2372501 2371334 2373736 2377478 2379374 2380054 2382499 2386405 2388121 2386733 2386053
59976B386053K756L561N38j656K53L820N214M102K064p09m383p112o547l040P39
$$ 2386053 2388809 2392370 2392908 2391252 2391505 2395325 2400539 2404641 2406705 2405996 2401613 2394501 2387954 2384914 2385653
59961B385653K943L680L470K457J238R97K190L748M087K634L35j121p34Q72K119
$$ 2385653 2388596 2392276 2395746 2398203 2399441 2400438 2402628 2406376 2410463 2413097 2413432 2412311 2411577 2412449 2414568
59946B414568K196J703J564K014K923M231N398N384M081K900K877L062K220J222
$$ 2414568 2416764 2418467 2420031 2422045 2424968 2429199 2434597 2439981 2444062 2446962 2449839 2452901 2455121 2456343
59932B456343J721L114L274K256K326L781M049K467K519O373J0054Q244K262j400
$$ 2456343 2458064 2461178 2464452 2466708 2469034 2472815 2476864 2479331 2481850 2488223 2498277 2506521 2508783 2507383
59918B507383p0K441K887L231N896Q668Q070N004L007K708K004Q38J581M595P225
$$ 2507383 2507313 2509754 2512641 2515872 2521768 2530436 2538506 2543510 2546517 2549225 2551229 2552067 2553648 2558243 2565468
59903B565468P923Q011Q164O484K078j983k088J063L611L687K806K447J995Q29
$$ 2565468 2573391 2581402 2589566 2596050 2598128 2596145 2594057 2595120 2598731 2602418 2605224 2607671 2609666 2610495
59889B610495K61J727M319N925O284P076Q660Q685N317P20p71K097N955P088N533
$$ 2610495 2610756 2612483 2616802 2622727 2629011 2636087 2644747 2653432 2658749 2659469 2658698 2660795 2666750 2673838 2679371
59874B679371L794L028K422J595J383J973K000M31j616j890M32L701N331M349
$$ 2679371 2683165 2686193 2688615 2690210 2691593 2693566 2695566 2695997 2694381 2692491 2692923 2696624 2701955 2706304
59860B706304K375J792K906L628K216o10k998m310m883m469k656l84P76Q26J003
$$ 2706304 2708679 2710471 2713377 2717005 2719221 2718611 2715613 2711303 2706420 2701951 2699295 2698911 2699687 2700513 2701516
59845B701516J299K64k231m085l671j819j20J201K358K408L16l044n569o273n719
$$ 2701516 2702815 2703079 2700848 2696763 2693092 2691273 2691153 2692354 2694712 2697120 2697436 2694392 2688823 2682550 2676831
59830B676831m455k406M1J580J237m13j708j523m25j17j539l621m436l565k555
$$ 2676831 2672376 2669970 2670011 2671591 2672828 2672415 2670707 2669184 2668759 2668642 2667103 2663482 2659046 2655481 2652926
59815B652926k768l613l541k081j80J152J702J650Q73j121m517q259j0049q166
$$ 2652926 2650158 2646545 2643004 2640923 2640743 2641895 2643597 2645247 2646120 2644999 2640482 2632223 2622174 2614008
59801B614008l543P19K474K413K318K213O20k564m956m266j342M64q22l526m638
$$ 2614008 2610465 2611184 2613658 2616071 2618389 2620602 2621222 2618658 2613702 2609436 2608094 2608558 2607736 2604210 2599572
59786B599572l767l306m449m924k146K538M946L296J54j296j110j417k775l291
$$ 2599572 2595805 2592499 2588050 2583126 2580980 2583518 2588464 2591760 2591914 2590618 2589508 2588091 2585316 2582025
59772B582025j134L113O701O987L867K57m38K229N289N669L294M59j027j110l68
$$ 2582025 2580891 2584004 2590705 2597692 2601559 2601816 2601378 2603607 2608896 2614565 2617859 2618318 2617291 2616181 2615813
59757B615813J062L106N077O194O679P588R043R301O740K667M99J608L581L743
$$ 2615813 2616875 2619981 2625058 2631252 2637931 2645519 2654562 2663863 2670603 2673270 2673769 2675377 2678958 2682701
59743B682701K607K017J633J8j753r51K349M884M816L757L342K862J756J587L534
$$ 2682701 2685308 2687325 2688958 2688976 2687223 2686272 2688621 2693505 2698321 2702078 2705420 2708282 2710038 2711625 2715159
59728B715159N952O386M403R83k836n155l581J320N066M400J568P54J965J849
$$ 2715159 2721111 2727497 2731900 2732883 2730047 2724892 2721311 2722631 2727697 2732097 2733665 2734419 2736384 2738233
59714B738233o00k805k841j636n87J71N55J8r20o13J382L315L215Q91k143l922
$$ 2738233 2737633 2734828 2731987 2730351 2729764 2729935 2730490 2730508 2729588 2728975 2730357 2733672 2736887 2737778 2735635 2731713
59698B731713l325j137M87M47k29m87q76j528n39L014N936M252r35m345l376p42
$$ 2731713 2728388 2727251 2727738 2728185 2727956 2727469 2726593 2725065 2724526 2727540 2733476 2737728 2736793 2732448 2729072 2728330
59682B728330J97n02j085j046q70p08o41q52q98k59K32p62k780m170m866o141
$$ 2728330 2728527 2728025 2726940 2725894 2725024 2724316 2723675 2722823 2721925 2721666 2721898 2721136 2718356 2714186 2709320 2703179
59666B703179p502o831m096j891j479j333p69j614m507o653n745l619l380m785
$$ 2703179 2695677 2688846 2684750 2682859 2681380 2680047 2679278 2677664 2673157 2666504 2660759 2657140 2653760 2648975
59652B648975m965k445J617N005N617K594k222n353n555m752m159k278J386L626
$$ 2648975 2644010 2641565 2643182 2648187 2653804 2656398 2654176 2648823 2643268 2638516 2634357 2632079 2633465 2637091
59638B637091J615k641n107n093m527l664j388J262J838N32J22J731L540L734
$$ 2637091 2638706 2636065 2630958 2625865 2621338 2617674 2616286 2617548 2619386 2619918 2620040 2621771 2625311 2629045
59624B629045K117r57m619o639n351k403j012j641k059j378r07j084q18j93o17
$$ 2629045 2631162 2630205 2625586 2618947 2613596 2611193 2610181 2608540 2606481 2605103 2604196 2603112 2602294 2602101 2601484
59609B601484j718j326P49K053J518R26J292J141j28n41P54J284q57l464l409
$$ 2601484 2599766 2598440 2599189 2601242 2602760 2603686 2604978 2606119 2605991 2605450 2606204 2607488 2606631 2603167 2599758
59594B599758j241Q8m93j726k386j830L68L107L654J256q80J44K401K271O24J655
$$ 2599758 2598517 2598605 2598112 2596386 2594000 2592170 2592538 2595645 2599299 2600555 2599675 2599819 2602220 2604491 2605115 2606770
59578B606770N718P749M189j955n012l415m30O03k94q25K97J698J109j339k583
$$ 2606770 2612488 2620237 2624426 2622471 2617459 2614044 2613614 2614217 2613923 2613098 2613395 2615093 2616202 2614863 2612280
59563B612280k60M181P386Q154P608O248L615R30R24L952O793O833N337M860N380
$$ 2612280 2612020 2616201 2623587 2631741 2639349 2645597 2649212 2650142 2651066 2655018 2661811 2668644 2673981 2678841 2684221
59548B684221N282M678N132O508O607M290J112o81l64J514M296P226R112R054
$$ 2684221 2689503 2694181 2699313 2705821 2712428 2716718 2717830 2717149 2716785 2718299 2722595 2729821 2738933 2747987
59534B747987P377N273L471J654n59k305j786J568N701P615O498M236K635J535
$$ 2747987 2755364 2760637 2764108 2765762 2765203 2762898 2761112 2762680 2768381 2775996 2782494 2786730 2789365 2790900
59520B790900M18L71K520N276N348J925k019l301j901L12K699N834R017R999P819
$$ 2790900 2791318 2791689 2794209 2799485 2804833 2806758 2804739 2801438 2799537 2799849 2802548 2808382 2817399 2827398 2835217
59505B835217M372K237J822J655P82l44j065j238n31J696M963P117O331L291M58
$$ 2835217 2839589 2841826 2843648 2845303 2846085 2845741 2844676 2843438 2842907 2844603 2849566 2856683 2863014 2866305 2866763
59490B866763n27K90K526N963R358J0412Q193M830L593N458Q403R791Q711O080
$$ 2866763 2866236 2866526 2869052 2875015 2884373 2894785 2902978 2907808 2911401 2916859 2925262 2935053 2943764 2949844
59476B949844L288R92r47k353j913J626P101J1054J1212Q945P053O146M798K677
$$ 2949844 2953132 2954124 2953177 2950824 2948911 2950537 2957638 2968692 2979904 2988849 2995902 3002048 3006846 3009523
59462C009523J264J506K748M374O456Q227P918N312K704K089K771L207L609M954
$$ 3009523 3010787 3012293 3015041 3019415 3025871 3034098 3042016 3047328 3050032 3052121 3054892 3058099 3061708 3066662
59448C066662O598P028O331N897N944N422M301L962M871N509M506K532J264J369
$$ 3066662 3073260 3080288 3086619 3092516 3098460 3103882 3108183 3112145 3117016 3122525 3127031 3129563 3130827 3132196
59434C132196K254L147L656L584K851J664N82K05O26J293J872K972N187P526Q121
$$ 3132196 3134450 3137597 3141253 3144837 3147688 3149352 3149934 3150139 3150765 3152058 3153930 3156902 3162089 3169615 3177736
59419C177736O811N305M357K952J355K185O125R146P534L822L490O772Q405N648
$$ 3177736 3184547 3189852 3194209 3197161 3198516 3200701 3206826 3215972 3223506 3227328 3230818 3237590 3245995 3251643
59405C251643J692Q3L02P43J830L674M233K598R76P40j96l063m837l011n86j550
$$ 3251643 3253335 3253418 3253720 3254463 3256293 3259967 3264200 3266798 3267774 3268514 3268318 3265255 3260418 3257407 3256821 3255271
59389C255271l935k857J070K329o77l248j938O40N95j776l791m448m330l746l105
$$ 3255271 3251336 3248479 3249549 3251878 3251201 3247953 3246015 3246655 3247250 3245474 3241683 3237235 3232905 3229159 3226054
59374C226054l382m526m804k918N07L958O021N360K053r63n03K400L664K304J775
$$ 3226054 3222672 3218146 3213342 3210424 3210931 3214889 3220910 3226270 3228323 3227360 3226857 3229257 3232921 3235225 3237000
59359C237000M078O357N525K741P33k52r47m06J959M048L958L128L535L979K690
$$ 3237000 3241078 3247435 3252960 3255701 3256434 3256182 3255235 3254829 3256788 3260836 3264794 3267922 3271457 3275436 3278126
59344C278126J400K778N344N405L034J656K135J790m87k465k720k566k895k716
$$ 3278126 3279526 3282304 3287648 3293053 3296087 3297743 3299878 3301668 3301181 3298716 3295996 3293430 3290535 3287819
59330C287819k121l145n978p480n427j741L71K16j097k938m694m871k763J40J807
$$ 3287819 3285698 3282553 3276575 3269095 3263668 3261927 3262298 3262514 3261417 3258479 3253785 3248914 3246151 3246291 3248098
59315C248098J699K13k327n068o527o332n639n062l856j942p11p89j058j017j679
$$ 3248098 3249797 3250010 3247683 3242615 3236088 3229756 3224117 3219055 3215199 3213257 3212546 3211757 3210699 3209682 3208003
59300C208003k811k076R51K621r1m847o881n061k018J79J213O18j654l461k806
$$ 3208003 3205192 3203116 3204067 3206688 3206597 3201750 3194869 3189808 3187790 3187969 3189182 3189800 3188146 3184685 3181879
59285C181879j592l418p684r595o706j933R41J319k3l287p639r469n884J033N942
$$ 3181879 3180287 3176869 3169185 3159590 3152884 3150951 3151892 3153211 3153188 3149901 3142262 3132793 3126909 3127942 3133884
59270C133884N870K482p49k084k278k993m747o081n077j668K079M066L830K168
$$ 3133884 3139754 3142236 3141487 3139403 3137125 3134132 3129385 3123304 3118227 3116559 3118638 3122704 3126534 3128702
59256C128702J44j332k037k703l873m710m212l153k890k520P8L845M292o95p250
$$ 3128702 3128846 3127514 3125477 3122774 3118901 3114191 3109979 3106826 3103936 3101416 3101494 3105339 3109631 3108936 3101686
59241C101686r874p597l698j029r3n24j695k186r96P53J027m20k079k903k723
$$ 3101686 3091812 3084215 3080517 3079488 3079395 3078871 3077176 3074990 3073994 3074747 3075774 3075354 3073275 3070372 3067649
59226C067649j067K389O188P727N829J543l213o625p350n809m529n218o221n068
$$ 3067649 3066582 3068971 3075159 3082886 3088715 3090258 3087045 3080420 3073070 3067261 3062732 3057514 3051293 3046225
59212C046225k714k308l992m504k494o08q64j369J17K249K528J416R70Q27j054
$$ 3046225 3043511 3041203 3037211 3032707 3030213 3029605 3028741 3027372 3027489 3029738 3032266 3033682 3034652 3035479 3034425
59197C034425m395o435n802l967k479j055R16K856L885L971L495K535J127l53
$$ 3034425 3030030 3023595 3017793 3013826 3011347 3010292 3011208 3014064 3017949 3021920 3025415 3027950 3029077 3028724
59183C028724j467j842j283k40K63oK70K138M334M598K846J289J326K048K265
$$ 3028724 3027257 3025415 3024132 3023892 3024155 3024149 3024419 3026557 3030891 3035489 3038335 3039624 3040950 3042998 3045263
59168C045263K160K146J836J248J629L519N106M171J137j529k573k927l405l324
$$ 3045263 3047423 3049569 3051405 3052653 3054282 3057801 3062907 3067078 3068215 3066686 3064113 3061186 3057781 3054457
59154C054457k132q76p52j106k93J793L537M074M464N750O966O390M034J522k73
$$ 3054457 3052325 3051449 3050697 3049591 3049298 3051091 3054628 3058702 3063166 3068916 3075882 3082272 3086306 3087828 3087555
59139C087555j886l453l903k868j998l054n353o396m800j619J175K624L315M405
$$ 3087555 3085669 3082216 3078313 3075445 3073447 3070393 3065040 3058644 3053844 3052225 3053400 3056024 3059339 3063744
59125C063744O008O528M492J342P58L990P483P254M353L157M726N403K722n27
$$ 3063744 3069752 3076280 3080772 3082114 3082872 3086862 3094345 3101599 3105952 3109109 3113835 3119238 3121960 3121433
59111C121433k75L151N908N994N148N731P683R035Q141N098J679J7Q79L115M780
$$ 3121433 3121158 3124309 3130217 3136211 3141359 3147090 3154773 3163808 3171949 3177047 3178726 3178743 3179622 3182737 3187517
59096C187517M430J623k597n602n171k380r13k435m292l450j007l40j824k388
$$ 3187517 3191947 3193570 3190973 3185371 3180200 3177820 3176907 3174472 3170180 3166730 3165723 3165383 3163559 3161171
59082C161171l00K467L383K549J488N74p89k436l355k944j520M3P51J45j092j742
$$ 3161171 3160871 3163338 3166721 3169270 3170758 3171332 3170543 3168107 3164752 3161808 3160288 3160331 3161082 3161227 3160135 3158393
59066C158393j668j959k978l179r45K793M871L143j088m205l806q31J924K930
$$ 3158393 3156725 3154766 3151788 3148609 3147664 3150457 3155328 3158471 3157383 3153178 3149372 3148541 3150465 3153395
59052C153395K750J997K17k303l243q70K757L634J028j359j79L519O044N475L139
$$ 3153395 3156145 3158142 3158359 3156056 3152813 3151943 3154700 3158334 3159362 3158003 3157824 3161343 3167387 3172862 3176001
59037C176001J685K606N039O515N610L901L929N372N449L440K008K755L446K030
$$ 3176001 3177686 3180292 3185331 3191846 3197456 3201357 3205286 3210658 3216107 3219547 3221555 3224310 3227756 3229786
59023C229786O80K439N824O923N922O936J0918J3309J0563N354K662L404M797
$$ 3229786 3230466 3232905 3238729 3245652 3251574 3258510 3269428 3282737 3293300 3298654 3301316 3304720 3309517
59010C309517N280N816O955P561O767N185L680K341J223R79K204M554O830P705
$$ 3309517 3314797 3320613 3327568 3335129 3341896 3347081 3350761 3353102 3354325 3355304 3357508 3362062 3368892 3376597
58996C376597O589M169J884N33j49k69R90L999P183Q251O646L663M05k716m362
$$ 3376597 3383186 3387355 3389239 3389772 3389623 3389354 3390344 3394343 3401526 3409777 3416423 3420086 3420491 3417775 3413413
58981C413413k181M205J1312J4623J3006R067N455K603L83j44J672L942L869J401
$$ 3413413 3411232 3415437 3426749 3441372 3454378 3463445 3468900 3471503 3471886 3471742 3473414 3477356 3481225 3482626
58967C482626n74P9K565N131P146P941N713J5n672o727k844J577K917J941J198
$$ 3482626 3482052 3482131 3484696 3489827 3496973 3504914 3510627 3510642 3504970 3498243 3495399 3496976 3499893 3501834 3503032
58952C503032J133L72j679m303o609p812p140m692j740Q32L386N650N475J414
$$ 3503032 3504165 3504537 3502858 3498555 3491946 3484134 3476994 3472302 3470562 3471394 3474780 3480430 3485905 3487319
58938C487319m306p789q111p637p707o674l248N43J521o53l318m035k675n94J008
$$ 3487319 3483013 3475224 3467113 3459476 3451769 3445095 3441847 3442390 3443911 3443258 3439940 3435905 3433230 3432636 3433644
58923C433644J641J236j14j904k963k158J79K139K500K557M369P476R044P587
$$ 3433644 3435285 3436521 3436407 3434503 3431540 3429382 3429561 3431700 3434200 3436757 3441126 3448602 3457646 3465233
58909C465233M739K660J400J50l49J441N153Q251Q770P386O509P595R344Q645
$$ 3465233 3469972 3472632 3474032 3474182 3473833 3475274 3480427 3488678 3497448 3504834 3511343 3518938 3528282 3536927
58895C536927M105j442l248K2M581O007L867P41j471k140l79M018Q471R562P493
$$ 3536927 3541032 3539590 3536342 3536364 3540945 3546952 3550819 3551560 3550089 3547949 3547570 3551588 3560059 3569621 3577114
58880C577114N995O957P825N737J851n72p91r24k380m116m449l090j139k5n07
$$ 3577114 3583109 3590066 3597891 3603628 3605479 3604907 3604116 3603192 3600812 3596696 3592247 3589157 3588018 3587993 3587486
58865C587486j939k619j605J19Q40J17j101j949k471l271m949p366q958p754l979
$$ 3587486 3585547 3582928 3581323 3581442 3582282 3582399 3581298 3579349 3576878 3573607 3568658 3561292 3552334 3544580 3540601
58850C540601o18m3j168j612j706l742p713j0717j1083j0265r523p700m168j467
$$ 3540601 3539983 3539940 3538772 3537160 3535454 3531712 3523999 3513282 3502199 3491934 3482411 3474711 3470543 3469076
58836C469076k147m563m952l008k221m567p865r350r312r550j0137r677p889o040
$$ 3469076 3466929 3462366 3457414 3454406 3452185 3447618 3439753 3430403 3421091 3411541 3401404 3391727 3383838 3377798
58822C377798n110m893m845m639l809j973J84J002m62l156n001m987l836k733
$$ 3377798 3372688 3367795 3362950 3358311 3354502 3352529 3352713 3353715 3353253 3350097 3345096 3340109 3336273 3333540
58808C333540j931j007p6j32k033n302p970p653l410K778O992P031M905M383O177
$$ 3333540 3331609 3330602 3330526 3330394 3328361 3323059 3315089 3307436 3304026 3306804 3313796 3320827 3325732 3330115 3336292
58793C336292P416O192M027K480J40m213p591n857n6M342M709L798M171M387K766
$$ 3336292 3343708 3349900 3353927 3356407 3356547 3352334 3344743 3338886 3338830 3343172 3347881 3351679 3355850 3360237 3363003
58778C363003J107J473K214Q75r40M30M883Q533R158Q261P644P194O491N766M707
$$ 3363003 3364110 3365583 3367797 3368672 3367732 3368162 3373045 3381578 3390736 3398997 3406641 3413835 3420326 3426092 3430799
58763C430799K790J303K340N250O900O408O689R813J3466J4178J1875R065P118
$$ 3430799 3433589 3434892 3437232 3442482 3449382 3455790 3462479 3472292 3485758 3499936 3511811 3520876 3527994
58750C527994N783N226O041P442P580N889L872L296M401N928O591O623P727J0928
$$ 3527994 3533777 3539003 3545044 3552486 3560066 3565955 3569827 3573123 3577524 3583452 3590043 3596666 3604393 3615321
58736C615321J4836J7166J7537J7034J5442J1625O899M896O666Q876Q690P593
$$ 3615321 3630157 3647323 3664860 3681894 3697336 3708961 3715860 3720756 3727422 3736298 3744988 3752581
58724C752581Q083R309R136Q165Q253Q708P854P040R011J2785J4182J1737Q386
$$ 3752581 3760664 3769973 3779109 3787274 3795527 3804235 3812089 3819129 3828140 3840925 3855107 3866844 3875230
58711C875230O862O857P360Q352R213Q642P333P706R758J0134O940K702P96J446
$$ 3875230 3882092 3888949 3896309 3904661 3913874 3922516 3929849 3937555 3947313 3957447 3964387 3967089 3967885 3969331
58697C969331L035M997P322R124R705R529Q804O939M611L855M501L403m96l264
$$ 3969331 3972366 3977363 3984685 3993809 4003514 4013043 4021847 4028786 4033397 4037252 4041753 4045156 4044660 4041396
58683D041396j222L306N240L919L066M685P188R343J1924J4752J5683J3839J1172
$$ 4041396 4040174 4043480 4048720 4052639 4055705 4060390 4067578 4076921 4088845 4103597 4119280 4133119 4144291
58670D144291R579Q813Q219Q304R382J0530J1164J2035J3557J4595J4173J3158
$$ 4144291 4153870 4162683 4170902 4179206 4188588 4199118 4210282 4222317 4235874 4250469 4264642 4277800
58658D277800J2943J3335J2931J1221R462R496J1779J4424J4656J1992R277R341
$$ 4277800 4290743 4304078 4317009 4328230 4337692 4347188 4358967 4373391 4388047 4400039 4409316 4418657
58646D418657J1342J2327J1985J3234J7535K2051K2849J9263J3950J0025R323
$$ 4418657 4429999 4442326 4454311 4467545 4485080 4507131 4529980 4549243 4563193 4573218 4582541
58635D582541J1996J6262J9444K0441K0478K0658K0182J8163J5932J5636J7347
$$ 4582541 4594537 4610799 4630243 4650684 4671162 4691820 4712002 4730165 4746097 4761733 4779080
58624D779080J9227K0199K0726K1165K1018K0145J9540K0263K2185K4187K5293
$$ 4779080 4798307 4818506 4839232 4860397 4881415 4901560 4921100 4941363 4963548 4987735 5013028
58613E013028K5557K5971K7330K9168L0324L0562L0643L0501K8785K5272K2514
$$ 5013028 5038585 5064556 5091886 5121054 5151378 5181940 5212583 5243084 5271869 5297141 5319655
58602E319655K3395K7673L2404L5374L6421L5788L3390L0200K8393K8872K9962
$$ 5319655 5343050 5370723 5403127 5438501 5474922 5510710 5544100 5574300 5602693 5631565 5661527
58591E661527K9842K9324L0724L4365L7703L8186L5974L3439L2696L4157L6808
$$ 5661527 5691369 5720693 5751417 5785782 5823485 5861671 5897645 5931084 5963780 5997937 6034745
58580F034745L9006L9230L7157L4559L4370L7950M3339M7029M7453M6088M5058
$$ 6034745 6073751 6112981 6150138 6184697 6219067 6257017 6300356 6347385 6394838 6440926 6485984
58569F485984M4643M3602M1086L7458L3945L2301L4206L9656M5980M9594M9203
$$ 6485984 6530627 6574229 6615315 6652773 6686718 6719019 6753225 6792881 6838861 6888455 6937658
58558F937658M6648M4552M3886M4080M4515M4986M5218M4882M4254M4153M4859
$$ 6937658 6984306 7028858 7072744 7116824 7161339 7206325 7251543 7296425 7340679 7384832 7429691
58547G429691M5325M4016M0736L7389L6508L8755M2250M4578M5287M5779M6923
$$ 7429691 7475016 7519032 7559768 7597157 7633665 7672420 7714670 7759248 7804535 7850314 7897237
58536G897237M7748M6923M4861M3375M3483M4428M5072M5372M6007M7127M8118
$$ 7897237 7944985 7991908 8036769 8080144 8123627 8168055 8213127 8258499 8304506 8351633 8399751
58525H399751M8417M8012M7412M7548M9263N2088N3890N3048N0989N1228N5192
$$ 8399751 8448168 8496180 8543592 8591140 8640403 8692491 8746381 8799429 8850418 8901646 8956838
58514H956838O0163O2345O1008N8570N7356N7701N8742N9599N9693N9250N9606
$$ 8956838 9017001 9079346 9140354 9198924 9256280 9313981 9372723 9432322 9492015 9551265 9610871
58503I610871O1919O5385O7909O8788O9662P2271P6257P9660Q0895P9943P8370
$$ 9610871 9672790 9738175 9806084 9874872 9944534 10016805 10093062 10172722 10253617 10333560 10411930
58492A0411930P8252Q0098Q1699Q0397P6834P5022P7829Q3744Q9021R1681R2136
$$ 10411930 10490182 10570280 10651979 10732376 10809210 10884232 10962061 11045805 11134826 11226507 11318643
58481A1318643R1213Q9626Q8989R1349R7127J04284J09782J11609J10102J08114
$$ 11318643 11409856 11499482 11588471 11679820 11776947 11881231 11991013 12102622 12212724 12320838
58471A2320838J09102J13709J18569J19797J17493J15526J16838J20336J22838
$$ 12320838 12429940 12543649 12662218 12782015 12899508 13015034 13131872 13252208 13375046
58462A3375046J22969J22455J23928J27793J31245J31045J27707J25955J29748
$$ 13375046 13498015 13620470 13744398 13872191 14003436 14134481 14262188 14388143 14517891
58453A4517891J37486J43855J46004J45815J46137J47400J49067J51816J56107
$$ 14517891 14655377 14799232 14945236 15091051 15237188 15384588 15533655 15685471 15841578
58444A5841578J59986J60962J59671J59369J61688J64828J66536J66962J67459
$$ 15841578 16001564 16162526 16322197 16481566 16643254 16808082 16974618 17141580 17309039
58435A7309039J68217J68794J70067J73440J78041J80754J79950J77812J77650
$$ 17309039 17477256 17646050 17816117 17989557 18167598 18348352 18528302 18706114 18883764
58426A8883764J79961J82707J84715J86866J89709J91961J92227J91033J90219
$$ 18883764 19063725 19246432 19431147 19618013 19807722 19999683 20191910 20382943 20573162
58417B0573162J91286J94918K00950K07711K12605K14738K16225K19503K24031
$$ 20573162 20764448 20959366 21160316 21368027 21580632 21795370 22011595 22231098 22455129
58408B2455129K27132K27626K26864K26403K26398K26351K25790K23951K20629
$$ 22455129 22682261 22909887 23136751 23363154 23589552 23815903 24041693 24265644 24486273
58399B4486273K17860K19017K25009K32513K37269K38575K39546K43347K50251
$$ 24486273 24704133 24923150 25148159 25380672 25617941 25856516 26096062 26339409 26589660
58390B6589660K58298K66003K73734K82239K90393K95497K96456K95496K95499
$$ 26589660 26847958 27113961 27387695 27669934 27960327 28255824 28552280 28847776 29143275
58381B9143275K96478K96437K95137K94711K96409K99028L01298L03777L07515
$$ 29143275 29439753 29736190 30031327 30326038 30622447 30921475 31222773 31526550 31834065
58372C1834065L12804L20320L31233L44530L56290L63787L68781L74506L80828
$$ 31834065 32146869 32467189 32798422 33142952 33499242 33863029 34231810 34606316 34987144
58363C4987144L85127L86897L88271L90274L91600L91603L91662L92939L95299
$$ 34987144 35372271 35759168 36147439 36537713 36929313 37320916 37712578 38105517 38500816
58354C8500816L99295M06578M17000M27729M37027M46767M59050M72261M83075
$$ 38500816 38900111 39306689 39723689 40151418 40588445 41035212 41494262 41966523 42449598
58345D2449598M90962M97496N01881N00685M92927M82638M74968M71290M69150
$$ 42449598 42940560 43438056 43939937 44440622 44933549 45416187 45891155 46362445 46831595
58336D6831595M65260M57408M45352M32026M22881M21748M27239M34677M41363
$$ 46831595 47296855 47754263 48199615 48631641 49054522 49476270 49903509 50338186 50779549
58327E0779549M48263M56341M63068M63825M56170M42129M26583M13626M03901
$$ 50779549 51227812 51684153 52147221 52611046 53067216 53509345 53935928 54349554 54753455
58318E4753455L95165L85689L76802L71479L70964L74250L80877L92339M10007
$$ 54753455 55148620 55534309 55911111 56282590 56653554 57027804 57408681 57801020 58211027
58309E8211027M33254M60769M91992N25433N56727N80598N94605N99160N94440
$$ 58211027 58644281 59105050 59597042 60122475 60679202 61259800 61854405 62453565 63048005
58300F3048005N79623N55717N26829M97306M68862M41576M16698L97308L86808
$$ 63048005 63627628 64183345 64710174 65207480 65676342 66117918 66534616 66931924 67318732
58291F7318732L87658M00996M26350M61636N03967N50426N97828O42168O78850
$$ 67318732 67706390 68107386 68533736 68995372 69499339 70049765 70647593 71289761 71968611
58282G1968611P03755P14577P12025O99768O82480O63502O44680O27919O15529
$$ 71968611 72672366 73386943 74098968 74798736 75481216 76144718 76789398 77417317 78032846
58273G8032846O08931O08694O16553O35684O67435P08546P53189P97425Q40325
$$ 78032846 78641777 79250471 79867024 80502708 81170143 81878689 82631878 83429303 84269628
58264H4269628Q81006R16226R41613R54545R55545R47562R34372R19150R03678
$$ 84269628 85150634 86066860 87008473 87963018 88918563 89866125 90800497 91719647 92623325
58255I2623325Q88438Q73392Q59043Q47273Q41429Q45512Q63105Q96796R47319
$$ 92623325 93511763 94385155 95244198 96091471 96932900 97778412 98641517 99538313 100485632
58246A00485632J011908J083369J152039J209442J250147J271196J271968J255472
$$ 100485632 101497540 102580909 103732948 104942390 106192537 107463733 108735701 109991173
58238A09991173J227964J195509J161085J125838J092586J067252J057318J069211
$$ 109991173 111219137 112414646 113575731 114701569 115794155 116861407 117918725 118987936
58230A18987936J105936J165914J244376J336251J437145J541716J643873J740987
$$ 118987936 120093872 121259786 122504162 123840413 125277558 126819274 128463147 130204134
58222A30204134J836961J938932K050969K172372K301004K436132K579119K735097
$$ 130204134 132041095 133980027 136030996 138203368 140504372 142940504 145519623 148254720
58214A48254720K915132L133655L400603L714999M064236M425109M762703N030948
$$ 148254720 151169852 154303507 157704110 161419109 165483345 169908454 174671157 179702105
58206A79702105N180735N173885M995263M658325M204288L695347L201578K784873
$$ 179702105 184882840 190056725 195051988 199710313 203914601 207609948 210811526 213596399
58198B13596399K487996K334394K335374K494542K802293L222900L685308M089201
$$ 213596399 216084395 218418789 220754163 223248705 226050998 229273898 232959206 237048407
58190B37048407M329918M333567M084019L624373L030124K371671J691639J008591
$$ 237048407 241378325 245711892 249795911 253420284 256450408 258822079 260513718 261522309
58182B61522309L35914l04431q82810j371803j755129k031412k213821k326933
$$ 261522309 261858223 261553792 260670982 259299179 257544050 255512638 253298817 250971884
58174B50971884k401044k464585k537498k628871k739405k864812k996647l122895
$$ 250971884 248570840 246106255 243568757 240939886 238200481 235335669 232339022 229216127
58166B29216127l232989l325179l407289l487919l567414l638865l696908l743559
$$ 229216127 225983138 222657959 219250670 215762751 212195337 208556472 204859564 201116005
58158B01116005l785940l829717l874106l911471l932287l931829l911309l871587
$$ 201116005 197330065 193500348 189626242 185714771 181782484 177850655 173939346 170067759
58150A70067759l808422l717273l601362l470891l334908l198460l067996k953780
$$ 170067759 166259337 162542064 158940702 155469811 152134903 148936443 145868447 142914667
58142A42914667k863669k797764k751858k722870k707880k701498k699894k706729
$$ 142914667 140050998 137253234 134501376 131778506 129070626 126369128 123669234 120962505
58134A20962505k730315k773753k830976k893366k957346l023989l093280l160898
$$ 120962505 118232190 115458437 112627461 109734095 106776749 103752760 100659480 97498582
58126I7498582l220244l266722l300478l325705l347037l366275l382207l392658
$$ 97498582 94278338 91011616 87711138 84385433 81038396 77672121 74289914 70897256
58118G0897256l395637l388926l370197l338477l294976l241752l179349l105907
$$ 70897256 67501619 64112693 60742496 57404019 54109043 50867291 47687942 44582035
58110D4582035l018799k917321k803530k680150k548128k406963k256776k098580
$$ 44582035 41563236 38645915 35842385 33162235 30614107 28207144 25950368 23851788
58102B3851788j932981j761001j587021j418616j261830j117706r84607q62287
$$ 23851788 21918807 20157806 18570785 17152169 15890339 14772633 13788026 12925739
58094A2925739p51896o53533n66286m90198m26024l73193l29605k93236k62558
$$ 12925739 12173843 11520310 10954024 10463826 10037802 9664609 9335004 9041768 8779210
58085H779210k35997k12687j93285j78144j65297j52234j39171j28104j18953
$$ 8779210 8543213 8330526 8137241 7959097 7793800 7641566 7502395 7374291 7255338
58076G255338j09630j00047r2763q8417q3811p6544o8956o4744o3540o1838n8231
$$ 7255338 7145708 7045661 6952898 6864481 6780670 6704126 6635170 6570426 6506886 6445048 6386817
58065F386817n4485n1549m7717m1793l5853l3203l4546l7438l8935l7818l4623
$$ 6386817 6332332 6280783 6233066 6191273 6155420 6122217 6087671 6050233 6011298 5973480 5938857
58054E938857l0487k6301k2511j9351j7083j5851j5399j5131j4528j3398j1718
$$ 5938857 5908370 5882069 5859558 5840207 5823124 5807273 5791874 5776743 5762215 5748817 5737099
58043E737099r516p015m702l034k065j514j188j239j833k682l132k785j860p60
$$ 5737099 5727583 5720568 5715866 5712832 5710767 5709253 5708065 5706826 5704993 5702311 5699179 5696394 5694534 5693774
58029E693774N05K161L941M846L978J714j49K30L074O722R244J0127J0370J1207
$$ 5693774 5694279 5696440 5700381 5705227 5709205 5710919 5710770 5711000 5714074 5720796 5730040 5740167 5750537 5761744
58015E761744J2958J4874J5685J4618J2269J0300R747J0138J0797J2176J4636
$$ 5761744 5774702 5789576 5805261 5819879 5832148 5842448 5852195 5862333 5873130 5885306 5899942
58004E899942J6666J6370J4698J4929J8210K1820K3016K2547K2517K2611K1089
$$ 5899942 5916608 5932978 5947676 5962605 5980815 6002635 6025651 6048198 6070715 6093326 6114415
57993F114415J8469J7465J9369K2737K5700K7472K7401K5046K2010K1542K4721
$$ 6114415 6132884 6150349 6169718 6192455 6218155 6245627 6273028 6298074 6320084 6341626 6366347
57982F366347K8477K9012K6426K4492K5969K9515L1549L0397K7864K6691K7266
$$ 6366347 6394824 6423836 6450262 6474754 6500723 6530238 6561787 6592184 6620048 6646739 6674005
57971F674005K7703K7027K6750K8438L1011L2065L1216L0455L1220L2853L4203
$$ 6674005 6701708 6728735 6755485 6783923 6814934 6846999 6878215 6908670 6939890 6972743 7006946
57960G006946L5267L6633L8315L9646L9766L8264L6016L4975L6048L7820L8728
$$ 7006946 7042213 7078846 7117161 7156807 7196573 7234837 7270853 7305828 7341876 7379696 7418424
57949G418424L9708M2426M5448M5136M0972L6918L6192L7566L8641M0035M3384
$$ 7418424 7458132 7500558 7546006 7591142 7632114 7669032 7705224 7742790 7781431 7821466 7864850
57938G864850M7231M8458M7009M5810M6072M5993M4780M4802M7997N2330N3948
$$ 7864850 7912081 7960539 8007548 8053358 8099430 8145423 8190203 8235005 8283002 8335332 8389280
57927H389280N1763M8037M5182M3917M4295M6465M9670N1896N1736N0026M8776
$$ 8389280 8441043 8489080 8534262 8578179 8622474 8668939 8718609 8770505 8822241 8872267 8921043
57916H921043M8832M9533N0221N0935N1600N1897N2226N3452N5002N4708N1878
$$ 8921043 8969875 9019408 9069629 9120564 9172164 9224061 9276287 9329739 9384741 9439449 9491327
57905I491327M9356N0692N5642O0134O0811N8227N5690N6218O0427O5969O8966
$$ 9491327 9540683 9591375 9647017 9707151 9767962 9826189 9881879 9938097 9998524 10064493 10133459
57894A0133459O7400O3159N9681N8109N7462N7842O0614O4978O7508O6527O4543
$$ 10133459 10200859 10264018 10323699 10381808 10439270 10497112 10557726 10622704 10690212 10756739 10821282
57883A0821282O4581O6039O6169O4078O1319N9589N9651O1603O4592O7078O8789
$$ 10821282 10885863 10951902 11018071 11082149 11143468 11203057 11262708 11324311 11388903 11455981 11524770
57872A1524770P1237P4913P7523P7059P5296P5633P8349Q0644Q1097Q1297Q2878
$$ 11524770 11596007 11670920 11748443 11825502 11900798 11976431 12054780 12135424 12216521 12297818 12380696
57861A2380696Q5233Q6909Q7298Q6389Q4487Q2800Q2907Q4947Q7434Q9164R0179
$$ 12380696 12465929 12552838 12640136 12726525 12811012 12893812 12976719 13061666 13149100 13238264 13328443
57850A3328443R0833R1254R1884R3172R4355R4126R2771R2182R3220R4677R5594
$$ 13328443 13419276 13510530 13602414 13695586 13789941 13884067 13976838 14069020 14162240 14256917 14352511
57839A4352511R6871R9374J01884J02647J02186J02732J04939J06697J05882J03343
$$ 14352511 14449382 14548756 14650640 14753287 14855473 14958205 15063144 15169841 15275723 15379066
57829A5379066J02299J04857J09826J14153J15860J15030J12575J09517J07574
$$ 15379066 15481365 15586222 15696048 15810201 15926061 16041091 16153666 16263183 16370757
57820A6370757J08545J11971J14761J14788J13925J15709J20593J25369J27141
$$ 16370757 16479302 16591273 16706034 16820822 16934747 17050456 17171049 17296418 17423559
57811A7423559J26052J24318J24328J27662J33721J38915J39368J35418J31703
$$ 17423559 17549611 17673929 17798257 17925919 18059640 18198555 18337923 18473341 18605044
57802A8605044J31829J34693J37104J38170J39329J41384J43554J45110J46328
$$ 18605044 18736873 18871566 19008670 19146840 19286169 19427553 19571107 19716217 19862545
57793A9862545J47926J50486J54045J57356J58225J55937J53051J53313J57562
$$ 19862545 20010471 20160957 20315002 20472358 20630583 20786520 20939571 21092884 21250446
57784B1250446J62808J65727J66122J66320J67756J69225J68770J66711J65872
$$ 21250446 21413254 21578981 21745103 21911423 22079179 22248404 22417174 22583885 22749757
57775B2749757J68493J73589J78147J80524J81720J83362J85797J88474J91047
$$ 22749757 22918250 23091839 23269986 23450510 23632230 23815592 24001389 24189863 24380910
57766B4380910J93336J95025J96243J97808K00003K01745K02055K02018K04128
$$ 24380910 24574246 24769271 24965514 25163322 25363325 25565070 25767125 25969143 26173271
57757B6173271K09270K15199K18520K17959K15264K13065K12386K12600K13349
$$ 26173271 26382541 26597740 26816260 27034219 27249483 27462548 27674934 27887534 28100883
57748B8100883K15440K19433K24235K28084K30599K32852K35512K37942K39208
$$ 28100883 28316323 28535756 28759991 28988075 29218674 29451526 29687038 29924980 30164188
57739C0164188K39120K38207K37549K38689K42539K48005K52698K55390K56821
$$ 30164188 30403308 30641515 30879064 31117753 31360292 31608297 31860995 32116385 32373206
57730C2373206K57701K57370K55467K53858K55254K60060K65838K70114K72744
$$ 32373206 32630907 32888277 33143744 33397602 33652856 33912916 34178754 34448868 34721612
57721C4721612K75093K77720K79717K80296K80148K80654K82210K84257K86695
$$ 34721612 34996705 35274425 35554142 35834438 36114586 36395240 36677450 36961707 37248402
57712C7248402K90078K94131K97646L00687L05243L12196L19066L22987L24804
$$ 37248402 37538480 37832611 38130257 38430944 38736187 39048383 39367449 39690436 40015240
57703D0015240L27533L31433L33952L34831L37677L44936L54220L61696L66928
$$ 40015240 40342773 40674206 41008158 41342989 41680666 42025602 42379822 42741518 43108446
57694D3108446L72070L78088L84227L89948L95062L98836M01162M03903M08865
$$ 43108446 43480516 43858604 44242831 44632779 45027841 45426677 45827839 46231742 46640607
57685D6640607M14911M19160M20811M21932M24625M29188M34644M39158M40279
$$ 46640607 47055518 47474678 47895489 48317421 48742046 49171234 49605878 50045036 50485315
57676E0485315M37278M33514M34057M40029M47202M51103M51755M52143M53642
$$ 50485315 50922593 51356107 51790164 52230193 52677395 53128498 53580253 54032396 54486038
57667E4486038M55011M55237M55500M57929M63275M70241M76781M81875M85982
$$ 54486038 54941049 55396286 55851786 56309715 56772990 57243231 57720012 58201887 58687869
57658E8687869M89933M93749M97055N00205N04178N09173N14161N18263N22092
$$ 58687869 59177802 59671551 60168606 60668811 61172989 61682162 62196323 62714586 63236678
57649F3236678N27496N36184N48521N62861N75748N83718N86049N86073N89044
$$ 63236678 63764174 64300358 64848879 65411740 65987488 66571206 67157255 67743328 68332372
57640F8332372N97868O10545O22078O29268O33515O38511O45607O52421O56169
$$ 68332372 68930240 69540785 70162863 70792131 71425646 72064157 72709764 73362185 74018354
57631G4018354O57133O57998O60563O64138O66762O67163O65705O64257O64945
$$ 74018354 74675487 75333485 75994048 76658186 77324948 77992111 78657816 79322073 79987018
57622G9987018O68383O73095O77038O79420O80573O80780O80182O79642O80646
$$ 79987018 80655401 81328496 82005534 82684954 83365527 84046307 84726489 85406131 86086777
57613H6086777O84181O90127O97714P06106P14884P24501P36129P50426P66514
$$ 86086777 86770958 87461085 88158799 88864905 89579789 90304290 91040419 91790845 92557359
57604I2557359P82617P97565Q11354Q24659Q38155Q52042Q66011Q80036Q95060
$$ 92557359 93339976 94137541 94948895 95773554 96611709 97463751 98329762 99209798 100104858
57595A00104858R11666R27944R40497R48650R56079R66604R79555R91114R99249
$$ 100104858 101016524 101944468 102884965 103833615 104789694 105756298 106735853 107726967 108726216
57586A08726216J005015J009730J013414J016256J019084J021700J022437J020310
$$ 108726216 109731231 110740961 111754375 112770631 113789715 114811415 115833852 116854162
57578A16854162J016254J011682J007023J002166R97086R91601R85633R80115
$$ 116854162 117870416 118882098 119889121 120891287 121888373 122879974 123865607 124845722
57570A24845722R76549R75441R76178R78289R81392R84198R85605R86906R90465
$$ 124845722 125822271 126797712 127773890 128752179 129733571 130717769 131703374 132690280 133680745
57561A33680745R95797R99917J002797J008983J021053J034139J041158J042466
$$ 133680745 134676542 135676459 136679256 137688239 138709292 139743431 140784589 141827055
57553A41827055J045949J056974J072214J085302J095285J106477J121680J139224
$$ 141827055 142873004 143929978 145002192 146087494 147182779 148289256 149410936 150550160
57545A50550160J156465J172888J188475J201741J211701J220294J230090J239946
$$ 150550160 151706625 152879513 154067988 155269729 156481430 157701724 158931814 160171760
57537A60171760J245640J245439J242629J241347J241793J241066J237055J229603
$$ 160171760 161417400 162662839 163905468 165146815 166388608 167629674 168866729 170096332
57529A70096332J219343J207837J198073J192274J189220J185859J181398J177870
$$ 170096332 171315675 172523512 173721585 174913859 176103079 177288938 178470336 179648206
57521A79648206J176801J177645J179683J183018J187233J191180J194758J198796
$$ 179648206 180825007 182002652 183182335 184365353 185552586 186743766 187938524 189137320
57513A89137320J202801J205136J206151J208433J212757J216373J217010J216301
$$ 189137320 190340121 191545257 192751408 193959841 195172598 196388971 197605981 198822282
57505A98822282J217432J221649J229155J241058J257520J275606J291999J307030
$$ 198822282 200039714 201261363 202490518 203731576 204989096 206264702 207556701 208863731
57497B08863731J323261J340919J357489J371382J383121J392940J399881J403700
$$ 208863731 210186992 211527911 212885400 214256782 215639903 217032843 218432724 219836424
57489B19836424J405396J405466J403607J400550J398071J396664J395188J393597
$$ 219836424 221241820 222647286 224050893 225451443 226849514 228246178 229641366 231034963
57481B31034963J394379J400323J412397J430640J455809J488874J529571J576075
$$ 231034963 232429342 233829665 235242062 236672702 238128511 239617385 241146956 242723031
57473B42723031J625634J675264J722771J767520J809646J848429J882081J908890
$$ 242723031 244348665 246023929 247746700 249514220 251323866 253172295 255054376 256963266
57465B56963266J927597J937180J937977J932910J925737J917392J905701J889192
$$ 256963266 258890863 260828043 262766020 264698930 266624667 268542059 270447760 272336952
57457B72336952J869636J850050J831983J816005J803273J794792J789923J787359
$$ 272336952 274206588 276056638 277888621 279704626 281507899 283302691 285092614 286879973
57449B86879973J787429J792021J801905J814836J826395J832370J830406J819880
$$ 286879973 288667402 290459423 292261328 294076164 295902559 297734929 299565335 301385215
57441C01385215J800576J772049J734733J690857J642907J591333J535332J476063
$$ 301385215 303185791 304957840 306692573 308383430 310026337 311617670 313153002 314629065
57433C14629065J417250J361972J310631J263544J224015J196770J183706J182544
$$ 314629065 316046315 317408287 318718918 319982462 321206477 322403247 323586953 324769497
57425C24769497J189342J201318J217564J238151J262545J288469J312901J334761
$$ 324769497 325958839 327160157 328377721 329615872 330878417 332166886 333479787 334814548
57417C34814548J355433J375691J393626J407436J419136J432906J449879J466830
$$ 334814548 336169981 337545672 338939298 340346734 341765870 343198776 344648655 346115485
57409C46115485J480628J492161J505507J525000J553517J591465J636147J683742
$$ 346115485 347596113 349088274 350593781 352118781 353672298 355263763 356899910 358583652
57401C58583652J733121J786401J844460J903564J958391K007265K051874K092047
$$ 358583652 360316773 362103174 363947634 365851198 367809589 369816854 371868728 373960775
57393C73960775K123391K141092K144360K135889K117762K089128K047588J991779
$$ 373960775 376084166 378225258 380369618 382505507 384623269 386712397 388759985 390751764
57385C90751764J922392J841429J751187J653966J552154J447968J343183J239723
$$ 390751764 392674156 394515585 396266772 397920738 399472892 400920860 402264043 403503766
57377D03503766J140532J049061R67565Q96646Q36996P90756P60487P47579P52866
$$ 403503766 404644298 405693359 406660924 407557570 408394566 409185322 409945809 410693388 411446254
57368D11446254P78130Q25558Q95691R86699J094982J215157J340282J464552
$$ 411446254 412224384 413049942 413945633 414932332 416027314 417242471 418582753 420047305
57360D20047305J586196J705756J821048J926159K016441K092122K155325K205622
$$ 420047305 421633501 423339257 425160305 427086464 429102905 431195027 433350352 435555974
57352D35555974K240838K260502K265710K256580K232850K196434K150209K094198
$$ 435555974 437796812 440057314 442323024 444579604 446812454 449008888 451159097 453253295
57344D53253295K026270J947138J861329J771675J676101J572244J462788J353305
$$ 453253295 455279565 457226703 459088032 460859707 462535808 464108052 465570840 466924145
57336D66924145J246637J142568J042255R49449Q67089P94994P31274O73718O19615
$$ 466924145 468170782 469313350 470355605 471305054 472172143 472967137 473698411 474372129 474991744
57327D74991744N66608N14812M66347M22028L80362L40637L04891K75317K51191
$$ 474991744 475558352 476073164 476539511 476961539 477341901 477682538 477987429 478262746 478513937
57318D78513937K30010K10318J91457J71679J48989J23611R7621P1788M4469J3716
$$ 478513937 478743947 478954265 479145722 479317401 479466390 479590001 479687622 479759410 479803879 479817595
57308D79817595k1222o0943j06772j59831k20455k89123l66546m52000n42794
$$ 479817595 479796373 479735430 479628658 479468827 479248372 478959249 478592703 478140703 477597909
57299D77597909o36284p30975q24776r14068r96764j075277j154265j236077j320784
$$ 477597909 476961625 476230650 475405874 474491806 473495042 472419765 471265500 470029423 468708639
57290D68708639j409983j507049j612576j722489j832372j941390k049574k153011
$$ 468708639 467298656 465791607 464179031 462456542 460624170 458682780 456633206 454480195
57282D54480195k244617k318980k373518k404777k406494k372855k302083k195734
$$ 454480195 452235578 449916598 447543080 445138303 442731809 440358954 438056871 435861137
57274D35861137k056104j886463j693360j486529j275532j067464q68643o87050
$$ 435861137 433805033 431918570 430225210 428738681 427463149 426395685 425527042 424839992
57266D24839992n30679m03104l03014k29907j88499j84697k17749k79674l62918
$$ 424839992 424309313 423906209 423603195 423373288 423184789 423000092 422782343 422502669 422139751
57257D22139751m65033n84277p14618q49088r86301j129519j280190j436542j598586
$$ 422139751 421674718 421090441 420375823 419526735 418540434 417410915 416130725 414694183 413095597
57248D13095597j769840j952030k141150k330730k516499k695597k863469l014738
$$ 413095597 411325757 409373727 407232577 404901847 402385348 399689751 396826282 393811544
57240C93811544l146593l258930l351311l421464l466769l485602l477158l441467
$$ 393811544 390664951 387406021 384054710 380633246 377166477 373680875 370203717 366762250
57232C66762250l380446l298191l199082l084268k948546k779738k562110k283123
$$ 366762250 363381804 360083613 356884531 353800263 350851717 348071979 345509869 343226746
57224C43226746j941232j551890j148993p79839m95475l42227l57608n66726r75600
$$ 343226746 341285514 339733624 338584631 337804792 337309317 336967090 336609482 336042756 335067156
57215C35067156j566192k300354l129525m000539m856695n642657o314522o844746
$$ 335067156 333500964 331200610 328071085 324070546 319213851 313571194 307256672 300411926
57207C00411926p217099p420896p452710p319727p036613o619800o087018n459573
$$ 300411926 293194827 285773931 278321221 271001494 263964881 257345081 251258063 245798490
57199B45798490m760663m012333l237738k466091j732203j071289n16283r8324
$$ 245798490 241037827 237025494 233787756 231321665 229589462 228518173 228001890 227903566
57191B27903566J54966K23399R6397k24616p19954j348065k054879k791398l522943
$$ 227903566 228058532 228281931 228378328 228153712 227433758 226085693 224030814 221239416 217716473
57182B17716473m224738m876076n462255n978246o426388o810909p134034p391941
$$ 217716473 213491735 208615659 203153404 197175158 190748770 183937861 176803827 169411886
57174A69411886p570474p647892p606895p445067p173364o807644o364416n861352
$$ 169411886 161841412 154193520 146586625 139141558 131968194 125160550 118796134 112934782
57166A12934782n315411m738447m136709l515078k880233k240646j607232r95883
$$ 112934782 107619371 102880924 98744215 95229137 92348904 90108258 88501026 87505143
57158H7505143m27951P2800M83122P80764R45593R64139Q35482N74322K10143
$$ 87505143 87077192 87149992 87633114 88413878 89359471 90323610 91159092 91733414 91943557
57149I1943557k16008o56362j063712j400971j649854j813881j914048j980925
$$ 91943557 91727549 91071187 90007475 88606504 86956650 85142769 83228721 81247796
57141H1247796k048109k147210k301172k516138k777357l053303l306415l505452
$$ 81247796 79199687 77052477 74751305 72235167 69457810 66404507 63098092 59592640
57133E9592640l635286l700510l720789l720563l719213l724955l731532l718326
$$ 59592640 55957354 52256844 48536055 44815492 41096279 37371324 33639792 29921466
57125B9921466l657581l527738l324238l060640k763175k465901k207147k023005
$$ 29921466 26263885 22736147 19411909 16351269 13588094 11122193 8915046 6892041
57117F892041j937848j957367I29450a306809k418886k562660k617016k543954
$$ 6892041 4954193 2996826 929450 -1306809 -3725695 -6288355 -8905371 -11449325
57109a1449325k325717j966626j489131r27150l20430K89018Q60474J359737J764623
$$ -11449325 -13775042 -15741668 -17230799 -18157949 -18478379 -18189361 -17328887 -15969150 -14204527
57100a4204527K068120K277760K411701K493465b405177A96868K678741K793623
$$ -14204527 -12136407 -9858647 -7446946 -4953481 -2405177 196868 2875609 5669232
57092E669232K944952L112708L266368L375899L420814L397503L322544L224641
$$ 5669232 8614184 11726892 14993260 18369159 21789973 25187476 28510020 31734661
57084C1734661L125001L021767K895454K733272K552141K403294K356525K471554
$$ 31734661 34859662 37881429 40776883 43510155 46062296 48465590 50822115 53293669
57076E3293669K765613L190185L632741L951108M028269L820007L370106K786451
$$ 53293669 56059282 59249467 62882208 66833316 70861585 74681592 78051698 80838149
57068H0838149K193329J686102J308567J056791Q99239P99293P30044O77573O35451
$$ 80838149 83031478 84717580 86026147 87082938 87982177 88781470 89511514 90189087 90824538
57059I0824538N98673N64951N43363N60958O56806Q62895J183689J588830K023480
$$ 90824538 91423211 91988162 92531525 93092483 93749289 94612184 95795873 97384703 99408183
57050I9408183K428302K757756K990662L131881L205571L243684L276982L332570
$$ 99408183 101836485 104594241 107584903 110716784 113922355 117166039 120443021 123775591
57042A23775591L433316L593699L815294M087926M393907M708214M996865N223413
$$ 123775591 127208907 130802606 134617900 138705826 143099733 147807947 152804812 158028225
57034A58028225N364195N420907N422606N419149N466621N601578N812714O031967
$$ 158028225 163392420 168813327 174235933 179655082 185121703 190723281 196535995 202567962
57026B02567962O156309O086024N758394N168472M373143L469326K549015J660162
$$ 202567962 208724271 214810295 220568689 225737161 230110304 233579630 236128645 237788807
57018B37788807Q02419m7864r12983j803975k717532l635334m531925n387378
$$ 237788807 238591226 238543362 237630379 235826404 233108872 229473538 224941613 219554235
57010B19554235o189793o926511p581031q142444q612500r000215r315016r568240
$$ 219554235 213364442 206437931 198856900 190714456 182101956 173101741 163786725 154218485
57002A54218485r772812r931741j0028270j0034219r928677r706249r371877q935849
$$ 154218485 144445673 134513932 124485662 114451443 104522766 94816517 85444640 76508791
56994G6508791q413579p822336p174956o480889n755584n025006m318525l659428
$$ 76508791 68095212 60272876 53097920 46617031 40861447 35836441 31517916 27858488
56986B7858488l062956k538786k091361j719029j415744j173530r82971q33600
$$ 27858488 24795532 22256746 20165385 18446356 17030612 15857082 14874111 14040511
56978A4040511p16204o24069n51207m91211m39786l96738l62889l35840l11351
$$ 14040511 13324307 12700238 12149031 11657820 11218034 10821296 10458407 10122567 9811216
56969I811216k88308k69207k55145k43180k30159k16779k05463j95688j84533
$$ 9811216 9522908 9253701 8998556 8755376 8525217 8308438 8102975 7907287 7722754
56960G722754j71670j60867j55167j52604j48606j41757j35069j31563j30288
$$ 7722754 7551084 7390217 7235050 7082446 6933840 6792083 6657014 6525451 6395163
56951F395163j27544j21291j13256j06674j02676r9586r5773r2024q9978q9027
$$ 6395163 6267619 6146328 6033072 5926398 5823722 5724136 5628363 5536339 5446361 5357334
56941E357334q6758q2608p8811p6810p5090p2420p0855p2550p5112p3949o8903
$$ 5357334 5270576 5187968 5109157 5032347 4957257 4884837 4813982 4741432 4666320 4592371 4523468
56930D523468o4722o4259o4918o3392o0673n9916o1625o3426o3149o0159n5114
$$ 4523468 4458746 4394487 4329569 4266177 4205504 4145588 4083963 4020537 3957388 3897229 3842115
56919C842115n0374m9068n1519n3936n2981n0232m9383n0182m8692m3327l7209
$$ 3842115 3791741 3742673 3691154 3637218 3584237 3534005 3484622 3434440 3385748 3342421 3305212
56908C305212l3731l2701l2129l1361l0858l0537k9923k8929k7325k4520k0859
$$ 3305212 3271481 3238780 3206651 3175290 3144432 3113895 3083972 3055043 3027718 3003198 2982339
56897B982339j8016j6957j6519j5234j3761j3941j5841j7219j6269j3894j2529
$$ 2982339 2964323 2947366 2930847 2915613 2901852 2887911 2872070 2854851 2838582 2824688 2812159
56886B812159j3078j3705j2098q626o298p124r511j0484r838j0089j2445j4923
$$ 2812159 2799081 2785376 2773278 2764652 2758354 2751230 2741719 2731235 2721397 2711308 2698863 2683940
56874B683940j5310j4049j2869j2223j1737j1799j2636j2735j0560p350n845o189
$$ 2683940 2668630 2654581 2641712 2629489 2617752 2605953 2593317 2580582 2570022 2562672 2556827 2550638
56862B550638n716l310j297j784l452l993l697m223n139m640l184l290n351o468
$$ 2550638 2544922 2541612 2540315 2538531 2535079 2531086 2527389 2523166 2518027 2513387 2510203 2506913 2501562 2495094
56848B495094m695k029j445k674l054j620q5J91K55J939N217P869P531L886r91
$$ 2495094 2490399 2488370 2486925 2484251 2481197 2479577 2479492 2479683 2479938 2481877 2487094 2494963 2502494 2506380 2505389
56833B505389m638o568q132r974j0673q729n030k208j977l930o377p241m940L1
$$ 2505389 2500751 2494183 2486051 2476077 2465404 2456675 2451645 2449437 2447460 2443530 2437153 2429912 2424972 2425003
56819B425003M569N611L458J230J029K088K747K619K245J998K118K784L530L433
$$ 2425003 2429572 2435183 2438641 2439871 2440900 2442988 2445735 2448354 2450599 2452597 2454715 2457499 2461029 2464462
56805B464462K338J048rj268k952m716o644r214j1742j2359j0385p461n448m519
$$ 2464462 2466800 2467848 2467839 2466571 2463619 2458903 2452259 2443045 2431303 2418944 2408559 2401098 2395650 2391131
56791B391131m288n300p940j0973j2800j3466j4054j4718j4774j4182j3652j3564
$$ 2391131 2386843 2381543 2373603 2362630 2349830 2336364 2322310 2307592 2292818 2278636 2264984 2251420
56779B251420j3844j4422j4909j4589j3908j4832j8090k1033k0331j6492j3575
$$ 2251420 2237576 2223154 2208245 2193656 2179748 2164916 2146826 2125793 2105462 2088970 2075395
56768B075395j4410j7913k1205k2294k0511j6529j2862j2433j5456j9038k0802
$$ 2075395 2060985 2043072 2021867 1999573 1979062 1962533 1949671 1937238 1921782 1902744 1881942
56757A881942k1387k2288k2861k1437j8470j6448j6596j7307j6422j4061j2582
$$ 1881942 1860555 1838267 1815406 1793969 1775499 1759051 1742455 1725148 1708726 1694665 1682083
56746A682083j4016j7868k1263k1418j8243j4477j2906j3645j4487j3791j2303
$$ 1682083 1668067 1650199 1628936 1607518 1589275 1574798 1561892 1548247 1533760 1519969 1507666
56735A507666j1875j2857j3576j2547j0521r608j0563j1942j2248j1813j1681
$$ 1507666 1495791 1482934 1469358 1456811 1446290 1436682 1426119 1414177 1401929 1390116 1378435
56724A378435j1622j0735r586r805j1202j1185q254m742m399p767j1499j2343
$$ 1378435 1366813 1356078 1346492 1336687 1325485 1314300 1306046 1301304 1296905 1289138 1277639 1265296
56712A265296j0413q207p454p775p870p177o277o073o804p932q873r592j0085
$$ 1265296 1254883 1246676 1239222 1231447 1223577 1216400 1210123 1204050 1197246 1189314 1180441 1170849 1160764
56699A160764r555o875k274J836K505r65o001q911q213n764m371m607m617l153
$$ 1160764 1151209 1144334 1142060 1143896 1146401 1145436 1139435 1130524 1122311 1116547 1112176 1107569 1102952 1099799
56685A099799j626j972l123j547M065J0160J1792P988K353j274k308k595l672
$$ 1099799 1098173 1096201 1093078 1091531 1095596 1105756 1117548 1125536 1127889 1126615 1124307 1121712 1118040
56672A118040n455o806o777n700m985n315n261k908J297M777O075O286O689O818
$$ 1118040 1112585 1105779 1099002 1093302 1088317 1083002 1077741 1074833 1076130 1080907 1086982 1093268 1099957 1106775
56658A106775N819M073K107o26m230o835o359l152N13K707K606M86j428k6M570
$$ 1106775 1112594 1116667 1118774 1118148 1113918 1107083 1100724 1097572 1098085 1100792 1103398 1103884 1102456 1102430 1107000
56643A107000P656N455M01k387k255k453l416j992K172M838L696J790J914J952
$$ 1107000 1114656 1120111 1120512 1118125 1115870 1113417 1110001 1108009 1110181 1115019 1118715 1120505 1122419 1124371
56629A124371n90l315k538M23J166j076k896k173j06K070M772P900R742R022O291
$$ 1124371 1123781 1120466 1117928 1118351 1119517 1118441 1115545 1113372 1113266 1115336 1120108 1128008 1137750 1146772 1153063
56614A153063K996M90k05Q23J990J825N80m95m52J580N951J0319J0431N619J126
$$ 1153063 1156059 1156549 1156344 1157167 1159157 1160982 1161562 1161067 1160615 1162195 1168146 1178465 1188896 1194515 1195641
56599A195641J640M532L648j595n726n380l033j963k152k562l324l751j789K331
$$ 1195641 1197281 1201813 1205461 1203866 1198140 1192760 1189727 1187764 1185612 1183050 1179726 1175975 1174186 1176517
56585A176517N109M615L454M505O405O161M167L343M493N410M307J884r5p01l32
$$ 1176517 1181626 1186241 1189695 1194200 1200605 1206766 1210933 1214276 1218769 1224179 1228486 1230370 1230275 1229574 1229242
56570A229242r8m38pK940P496R989Q135M132K275M245P871R777Q329M645J603
$$ 1229242 1229144 1228706 1228699 1231639 1239135 1249124 1257259 1261391 1263666 1267911 1275782 1285559 1293888 1298533 1300136
56555A300136J313L093M587M915N413P041Q791R235Q051N408J630j665k191p7
$$ 1300136 1301449 1304542 1309129 1314044 1319457 1326498 1335289 1344524 1352575 1357983 1359613 1357948 1355757 1355680
56541A355680J520L93j833k269o31J305K629L691M569M954M844M083K367Q18J779
$$ 1355680 1357200 1357593 1355760 1353491 1352860 1354165 1356794 1360485 1365054 1370008 1374852 1378935 1381302 1382120 1383899
56526A383899N213P221M795N11o09J958M013L268K419M264O914O333K194j259
$$ 1383899 1389112 1396333 1401128 1401639 1401030 1402988 1407001 1410269 1412688 1416952 1423866 1430199 1432393 1431134
56512A431134j41M832R397J0204P751N212N075P171R344R239N811M11l509l091
$$ 1431134 1430993 1435825 1445222 1455426 1463177 1468389 1473464 1480635 1489979 1499218 1505029 1505440 1501931 1498840
56498A498840R91N122O511N242K720J42j062N29M265P392Q421Q797R918J0621
$$ 1498840 1499831 1504953 1511464 1516706 1519426 1519568 1518506 1519035 1523300 1530692 1539113 1547910 1557828 1568449
56484A568449R469P638P053P171O224M570M030M686M992M630M653N114N046M778
$$ 1568449 1577918 1585556 1592609 1599780 1606004 1610574 1614604 1619290 1624282 1628912 1633565 1638679 1643725 1648503
56470A648503N783Q109J0086J0824J0956J0834R901Q161O517N572N553P067J0051
$$ 1648503 1654286 1662395 1672481 1683305 1694261 1705095 1714996 1723157 1729674 1735246 1740799 1747866 1757917
56457A757917J2405J1778Q606N427L687L469N442R775J3444J2589Q227N912Q217
$$ 1757917 1770322 1782100 1790706 1796133 1799820 1803289 1808731 1818506 1831950 1844539 1852766 1858678 1866895
56444A866895J1247J0799Q636R483J3889J7582J7069J3193R298P868R035J1052
$$ 1866895 1878142 1888941 1897577 1907060 1920949 1938531 1955600 1968793 1978091 1985959 1994994 2006046
56432B006046J2044J1818J1712J2645J4383J6668J9378K1137J9865J5688J1468
$$ 2006046 2018090 2029908 2041620 2054265 2068648 2085316 2104694 2125831 2145696 2161384 2172852
56421B172852R252Q066O592N905P684J1324J4939J7830J9938K0333J8694J7174
$$ 2172852 2182104 2190170 2196762 2202667 2210351 2221675 2236614 2254444 2274382 2294715 2313409 2330583
56409B330583J8071K0237K0312J7373J3898J2149J1895J2034J2337J3038J4294
$$ 2330583 2348654 2368891 2389203 2406576 2420474 2432623 2444518 2456552 2468889 2481927 2496221
56398B496221J6461J9361K1218K0173J7232J5796J7579K0540K1791K1035K0115
$$ 2496221 2512682 2532043 2553261 2573434 2590666 2606462 2624041 2644581 2666372 2687407 2707522
56387B707522K0352K1364K1740K0249J7123J4575J4981J8008K0723K1302K1226
$$ 2707522 2727874 2749238 2770978 2791227 2808350 2822925 2837906 2855914 2876637 2897939 2919165
56376B919165K2775K5636K7493K7143K5497K3883K2891K2586K2556K1858K0236
$$ 2919165 2941940 2967576 2995069 3022212 3047709 3071592 3094483 3117069 3139625 3161483 3181719
56365C181719J9263K0846K4500K7579K8462K8085K7925K8057K8157K8782L0304
$$ 3181719 3200982 3221828 3246328 3273907 3302369 3330454 3358379 3386436 3414593 3443375 3473679
56354C473679L1656L1660L0868L0553L0591K9986K9062K9139L0208L0892L0910
$$ 3473679 3505335 3536995 3567863 3598416 3629007 3658993 3688055 3717194 3747402 3778294 3809204
56343C809204L1519L2935L3399L1943L0278L0511L2320L3774L3813L2649L0879
$$ 3809204 3840723 3873658 3907057 3939000 3969278 3999789 4032109 4065883 4099696 4132345 4163224
56332D163224K9738L0881L4266L7204L7420L6037L5683L6667L7419L7737L8629
$$ 4163224 4192962 4223843 4258109 4295313 4332733 4368770 4404453 4441120 4478539 4516276 4554905
56321D554905L9481L8709L7371L8494M1865M3181M0265L6889L7614M1379M3508
$$ 4554905 4594386 4633095 4670466 4708960 4750825 4794006 4834271 4871160 4908774 4950153 4993661
56310D993661M2387M0554M0001M0089M0272M1477M3601M4482M3085M1818M3756
$$ 4993661 5036048 5076602 5116603 5156692 5196964 5238441 5282042 5326524 5369609 5411427 5455183
56299E455183M8566N2885N4224N2956N0869M9395M9430N1356N4319N6430N6637
$$ 5455183 5503749 5556634 5610858 5663814 5714683 5764078 5813508 5864864 5919183 5975613 6032250
56288F032250N5904N5754N6299N6755N7331N8935O1116O2442O3347O6144P0741
$$ 6032250 6088154 6143908 6200207 6256962 6314293 6373228 6434344 6496786 6560133 6626277 6697018
56277F697018P2953O9871O5061O4711O9346P3458P3879P4135P8376Q4658Q7722
$$ 6697018 6769971 6839842 6904903 6969614 7038960 7112418 7186297 7260432 7338808 7423466 7511188
56266G511188Q6328Q4259Q4759Q7150Q9181R0120R0804R2048R3753R4980R4972
$$ 7511188 7597516 7681775 7766534 7853684 7942865 8032985 8123789 8215837 8309590 8404570 8499542
56255H499542R4597R6078J00294J05043J07183J05956J03151J00718R9605J00236
$$ 8499542 8594139 8690217 8790511 8895554 9002737 9108693 9211844 9312562 9412167 9512403
56245I512403J02326J04484J05447J05540J05756J05888J05196J04286J04369
$$ 9512403 9614729 9719213 9824660 9930200 10035956 10141844 10247040 10351326 10455695
56236A0455695J04868J03908J01198R8440R6715R5567R4971R5777R7488R7953
$$ 10455695 10560563 10664471 10765669 10864109 10960824 11056391 11151362 11247139 11344627 11442580
56226A1442580R6433R4802R4309R3369R0596Q8079Q8897R2554R5646R6799R8013
$$ 11442580 11539013 11633815 11728124 11821493 11912089 12000168 12089065 12181619 12277265 12374064 12472077
56215A2472077J00698J02950J02104R8474R5002R4062R5759R9053J03169J07655
$$ 12472077 12572775 12675725 12777829 12876303 12971305 13065367 13161126 13260179 13363348 13471003
56205A3471003J11685J14033J14089J12788J12111J13183J15098J16143J16022
$$ 13471003 13582688 13696721 13810810 13923598 14035709 14148892 14263990 14380133 14496155
56196A4496155J16176J17858J20594J23062J25019J27506J31068J34449J35777
$$ 14496155 14612331 14730189 14850783 14973845 15098864 15226370 15357438 15491887 15627664
56187A5627664J35001J34379J36025J39400J42060J42610J41894J41292J41292
$$ 15627664 15762665 15897044 16033069 16172469 16314529 16457139 16599033 16740325 16881617
56178A6881617J42402J45804J51553J57155J59985J60736J62357J65597J68086
$$ 16881617 17024019 17169823 17321376 17478531 17638516 17799252 17961609 18127206 18295292
56169A8295292J68525J69034J71549J74263J74362J73084J74767J81018J88686
$$ 18295292 18463817 18632851 18804400 18978663 19153025 19326109 19500876 19681894 19870580
56160A9870580J94259J97759K01409K06523K12876K19472K24704K27447K29094
$$ 19870580 20064839 20262598 20464007 20670530 20883406 21102878 21327582 21555029 21784123
56151B1784123K32753K38976K44177K45305K44429K46103K51353K57145K61371
$$ 21784123 22016876 22255852 22500029 22745334 22989763 23235866 23487219 23744364 24005735
56142B4005735K65177K69969K74904K78487K80793K82967K85767K89253K92795
$$ 24005735 24270912 24540881 24815785 25094272 25375065 25658032 25943799 26233052 26525847
56133B6525847K95070K95463K95529K97388L00581L02519L02635L03692L07984
$$ 26525847 26820917 27116380 27411909 27709297 28009878 28312397 28615032 28918724 29226708
56124B9226708L14295L20005L24220L27340L29361L30639L32939L37602L43524
$$ 29226708 29541003 29861008 30185228 30512568 30841929 31172568 31505507 31843109 32186633
56115C2186633L48632L52549L56129L59172L60652L60870L61784L65133L70944
$$ 32186633 32535265 32887814 33243943 33603115 33963767 34324637 34686421 35051554 35422498
56106C5422498L77291L81009L80084L76496L75174L78570L83733L86629L87412
$$ 35422498 35799789 36180798 36560882 36937378 37312552 37691122 38074855 38461484 38848896
56097C8848896L88802L90671L89838L84820L77471L69725L61914L54945L50989
$$ 38848896 39237698 39628369 40018207 40403027 40780498 41150223 41512137 41867082 42218071
56088D2218071L50563L51160L50097L46852L41740L34444L25410L16988L11651
$$ 42218071 42568634 42919794 43269891 43616743 43958483 44292927 44618337 44935325 45246976
56079D5246976L10204L12610L19189L29672L42110L54057L64178L72327L79272
$$ 45246976 45557180 45869790 46188979 46518651 46860761 47214818 47578996 47951323 48330595
56070D8330595L86860L96869M08691M19512M27961M36191M47078M60187M71666
$$ 48330595 48717455 49114324 49523015 49942527 50370488 50806679 51253757 51713944 52185610
56061E2185610M77407M75745M68184M58291M48787M39195M27789M16206M09614
$$ 52185610 52663017 53138762 53606946 54065237 54514024 54953219 55381008 55797214 56206828
56052E6206828M10914M17129M23797M30816M41187M55517M71200M86313N01121
$$ 56206828 56617742 57034871 57458668 57889484 58330671 58786188 59257388 59743701 60244822
56043F0244822N15625N28876N41405N55613N72726N91213O09144O26000O41178
$$ 60244822 60760447 61289323 61830728 62386341 62959067 63550280 64159424 64785424 65426602
56034F5426602O52693O59025O61330O62872O67136O76873O93126P13896P34824
$$ 65426602 66079295 66738320 67399650 68062522 68729658 69406531 70099657 70813553 71548377
56025G1548377P52388P65663P74427P77504P74608P68557P63691P62995P68550
$$ 71548377 72300765 73066428 73840855 74618359 75392967 76161524 76925215 77688210 78456760
56016G8456760P83665Q11319Q49795Q92161R31287R64202R90952J011141J023340
$$ 78456760 79240425 80051744 80901539 81793700 82724987 83689189 84680141 85691282 86714622
56007H6714622J027035J023601J015642J006714J001598J005464J021711J050407
$$ 86714622 87741657 88765258 89780900 90787614 91789212 92794676 93816387 94866794
55999I4866794J088627J131999J176293J217836J252740J276429J285406J280381
$$ 94866794 95955421 97087420 98263713 99481549 100734289 102010718 103296124 104576505
55991A04576505J266951J252542J243274J244092J260142J295852J353135J432308
$$ 104576505 105843456 107095998 108339272 109583364 110843506 112139358 113492493 114924801
55983A14924801J534308J659653J805039J963037K125624K286137K438434K578796
$$ 114924801 116459109 118118762 119923801 121886838 124012462 126298599 128737033 131315829
55975A31315829K712168K854643L026520L242213L506154L813054M145769M472223
$$ 131315829 134027997 136882640 139909160 143151373 146657527 150470581 154616350 159088573
55967A59088573M748765M930009M977940M868232M598191M195115L715683L232140
$$ 159088573 163837338 168767347 173745287 178613519 183211710 187406825 191122508 194354648
55959A94354648K813798K514369K367393K386276K566277K885290L300205L741910
$$ 194354648 197168446 199682815 202050208 204436484 207002761 209888051 213188256 216930166
55951B16930166M119747M341777M343290M107714L668592L091594K445438J777858
$$ 216930166 221049913 225391690 229734980 233842694 237511286 240602880 243048318 244826176
55943B44826176J110438M51089j90999p99651j353365j828157k202212k463797
$$ 244826176 245936614 246387703 246196704 245397053 244043688 242215531 240013319 237549522
55935B37549522k616503k676050k663300k601722k517884k437944k381106k357549
$$ 237549522 234933019 232256969 229593669 226991947 224474063 222036119 219655013 217297464
55927B17297464k371979k426487k520361k650162k810231k990258l172778l338127
$$ 217297464 214925485 212498998 209978637 207328475 204518244 201527986 198355208 195017081
55919A95017081l474896l583638l668649l728766l758765l757282l729391l681168
$$ 195017081 191542185 187958547 184289898 180561132 176802367 173045085 169315694 165634526
55911A65634526l614696l529683l428483l317912l206070l098179k996158k901660
$$ 165634526 162019830 158490147 155061664 151743752 148537682 145439503 142443345 139541685
55903A39541685k817858k747268k689250k641584k603825k577351k563243k563157
$$ 139541685 136723827 133976559 131287309 128645725 126041900 123464549 120901306 118338149
55895A18338149k581955k625287k692420k773720k856952k934574l004276l065804
$$ 118338149 115756194 113130907 110438487 107664767 104807815 101873241 98868965 95803161
55887I5803161l120067l169163l214040l252836l283716l308134l328718l344886
$$ 95803161 92683094 89513931 86299891 83047055 79763339 76455205 73126487 69781601
55879F9781601l353184l351371l339391l316617l281037l231909l171109l101162
$$ 69781601 66428417 63077046 59737655 56421038 53140001 49908092 46736983 43635821
55871D3635821l023206k936854k840482k731700k609384k475359k332640k182278
$$ 43635821 40612615 37675761 34835279 32103579 29494195 27018836 24686196 22503918
55863B2503918k023832j858711j690958j524730j363113j209365j066741r36469
$$ 22503918 20480086 18621375 16930417 15405687 14042574 12833209 11766468 10829999
55855A0829999q18111p12296o20730n43031m76366m19134l72146l34857l03268
$$ 10829999 10011888 9299592 8678862 8135831 7659465 7240331 6868185 6533328 6230060
55846F230060k73619k45976k22308k03171j88023j76322j66110j54149j40309
$$ 6230060 5956441 5710465 5488157 5284986 5096963 4920641 4754531 4600382 4460073
55837D460073j29298j24541j22401j16613j06918r8669r4491r1371q6610q1746
$$ 4460073 4330775 4206234 4083833 3967220 3860302 3761633 3667142 3575771 3489161 3407415
55827C407415p8707p6074p1800o6759o3049o0876n9328n8340n7648n5565n1182
$$ 3407415 3328708 3252634 3180834 3114075 3051026 2990150 2930822 2872482 2814834 2759269 2708087
55816B708087m6435m3634m1878l8410l3007k8638k7662k9307l1419l3094l4604
$$ 2708087 2661652 2618018 2576140 2537730 2504723 2476085 2448423 2419116 2387697 2354603 2319999
55805B319999l5618l4648l0724k5382k2191k3485k7664l0613k9774k6016k1860
$$ 2319999 2284381 2249733 2219009 2193627 2171436 2147951 2120287 2089674 2059900 2033884 2012024
55794B012024j9272j9145k1073k3063k3020k1174j9560j8854j7644j5414j3957
$$ 2012024 1992752 1973607 1952534 1929471 1906451 1885277 1865717 1846863 1829219 1813805 1799848
55783A799848j4502j5659j5749j5197j5083j5183j5271j6359j8634k0083j9294
$$ 1799848 1785346 1769687 1753938 1738741 1723658 1708475 1693204 1676845 1658211 1638128 1618834
55772A618834j7682j6776j5573j3304j2202j3970j5745j4079j1136j1854j5788
$$ 1618834 1601152 1584376 1568803 1555499 1543297 1529327 1513582 1499503 1488367 1476513 1460725
55761A460725j7309j4078r940q401q524q993j1029j4716j6885j5741j3927j3945
$$ 1460725 1443416 1429338 1419398 1410997 1402473 1393480 1382451 1367735 1350850 1335109 1321182 1307237
55749A307237j4072j2069r584r127r486q226o505p178r737j1164j0760j0387j0535
$$ 1307237 1293165 1281096 1271512 1262385 1252899 1244673 1238168 1230990 1221253 1210089 1199329 1188942 1178407
55736A178407r894q432p717q363r694j1337j2556j1264p045l908o063j1413j3543
$$ 1178407 1168513 1160081 1152364 1144001 1134307 1122970 1110414 1099150 1092105 1088197 1082134 1070721 1057178
55723A057178j0294n997m535m667l908k942l585n238o080o016o251p260q625r604
$$ 1057178 1046884 1040887 1036352 1031685 1027777 1024835 1021250 1016012 1009932 1003916 997665 990405 981780 972176
55709I72176q999o262l371l340n870p169n543m229o333r480q699l165K909N416
$$ 972176 963177 956915 953544 950204 944334 937165 931622 927393 921060 911580 902881 899716 902625 908041
55695I08041L887M36k549l737l553l421l483k205N97K064j21l817m892k774q11
$$ 908041 911928 912364 909815 906078 902525 899104 895621 893416 894013 896077 895956 892139 887247 884473 883662
55680H83662j289l050m229m619m419l011k09K774M583M749L120m6k996l423j506
$$ 883662 882373 879323 875094 870475 866056 863045 862836 865610 870193 874942 878062 878016 875020 871597 870091
55665H70091k24j512l701m264l528l764n533o996o533m317j444Q39J079j351m567
$$ 870091 869867 868355 864654 860390 856862 853098 847565 840569 834036 829719 828275 829114 830193 828842 824275
55650H24275n153j922K201L236N53k786l801k421n53L91J99r21k450l143j803
$$ 824275 819122 817200 819401 822637 823190 820404 816603 814182 813629 814020 814219 813298 810848 807705 805902
55635H05902R71K821K107l55k803m828o912q277p229m037j658k268m225m055q55
$$ 805902 806873 809694 811801 811446 808643 803815 796903 788626 781397 777360 775702 773434 769209 765154 764299
55620G64299K833M346L455J355j187l616m898m515l673l910m672l773p23J830
$$ 764299 767132 771478 774933 776288 775101 771485 766587 762072 758399 754489 749817 746044 745321 747151
55606G47151J112k344n486o503o237n830m665j736J945L817K661Qj645j254L27
$$ 747151 748263 745919 740433 733930 727693 721863 717198 715462 717407 721224 723885 723893 722248 720994 721321
55591G21321J656J890J080k5o70j029k172m497o560o508m575k871k273j167J548
$$ 721321 722977 724867 725947 725922 725252 724223 722051 717554 710994 704486 699911 697040 694767 693600 695148
55576F95148L767K645r44l036j964m63j392l790n049m965n014m914l047L7J438
$$ 695148 698915 701560 700616 697580 695616 695153 693761 689971 684922 679957 674943 670029 666982 667019 668457
55561F68457j85k885m278l933k219Q48M177N157K718o32j757q71o20j965l188
$$ 668457 668272 665387 661109 657176 654957 655805 659982 665139 667857 667225 665468 664597 663977 662012 658824
55546F58824k702q91Q94J569M50k146m274l889j481J74o63k890m521n019m893
$$ 658824 656122 655231 656125 657694 658144 655998 651724 647835 646354 646528 645865 642975 638454 633435 628542
55531F28542m316l273k317j896j515n71M01L66n50j204j274j859l690n626n840
$$ 628542 624226 620953 618636 616740 615225 614654 615055 615421 614871 613667 612393 610534 606844 601218 595378
55516E95378m208k553k305k802k665k212l076n288o220l655Q51L144R82l553o439
$$ 595378 591170 588617 586312 583510 580845 578633 575557 570269 564049 560394 561245 564389 565371 561818 555379
55501E55379n668k633j61M85O25K069M254M485J661j674k361p23L15n93k207l540
$$ 555379 549711 547078 546917 547402 548027 550096 554350 558835 560496 558822 556461 555738 556053 555460 553253 549713
55485E49713m785n138k866J128K799J98l182k855P50L677M081L220J889l45k507
$$ 549713 544928 539790 536924 538052 540851 541049 537867 535012 535762 539439 543520 546740 548629 548284 545777
55470E45777k506o65J11j259k456j805r54j803l234l218k159j661j516m07J235
$$ 545777 543271 542606 542717 541458 539002 537197 536243 534440 531206 527988 525829 524168 522652 522245 523480
55455E23480J584L15r83j135m66M09J352K160K537K645K685K205O68j573l658
$$ 523480 525064 525379 524396 523261 522795 523204 524556 526716 529253 531898 534583 536788 537456 535883 532225
55440E32225m900m330j086L493N652L469J62M00L975O228M641J569j77r79k066
$$ 532225 527325 522995 521909 525402 531054 534523 534685 535085 539060 545288 549929 551498 551321 550342 548276
55425E48276k551j129J264K664K503J080j613m612n270k376J134J267j891m520
$$ 548276 545725 544596 545860 548524 551027 552107 550494 545882 540612 538236 539370 540637 538746 534226
55411E34226m150k015m24j90j016k325l036k288q90n78j325j106R76K980K735
$$ 534226 530076 528061 527637 527447 526431 524106 521070 518782 517892 517314 515989 514883 515859 518839 521574
55396E21574Q42k75L05J148Q63J70Q28K782L411N31m042n480j447M470O402K666
$$ 521574 522416 522141 522446 523594 524457 524627 525455 528237 531648 532179 528137 522657 521210 525680 532082 534748
55380E34748k912n768m806j940N82J589J194O14R77J875J942R01j31n63j018j590
$$ 534748 531836 526068 521262 519322 519904 521493 522687 523301 524278 526153 528095 528996 528865 528302 527284 525694
55364E25694j239J95R77r8j501p77K084M534M353J580k029m300l798q78K329L620
$$ 525694 524455 524650 525627 525529 524028 523251 525335 529869 534222 535802 533773 529473 525675 524797 527126 530746
55348E30746K458j25k627l642k356M43K496K309P48m78j123j833j909K04M046
$$ 530746 533204 533079 530452 526810 524454 524897 527393 529702 530450 529972 528849 527016 525107 525311 529357
55333E29357O410M553n92n178n917k540K499O044O183L011j865o289q379p361
$$ 529357 535767 540320 539728 534550 528633 526093 528592 534636 540819 543830 541965 535676 527297 519936
55319E19936m022j8L395N527N359K098k736n370l565L79K108K81k480l399k442
$$ 519936 515914 515896 519291 524818 530177 532275 529539 524169 520604 520983 523091 523372 520892 517493 515051
55304E15051j188o58j068k396m004m485k801O24M236O539P000O306N648N082L106
$$ 515051 513863 513205 512137 509741 505737 501252 498451 499075 503311 509850 516850 523156 528804 533886 536992
55289E36992j052n103n445j586K863M267K488m32l292n818p197o578m576k613
$$ 536992 535940 530837 525392 523806 526669 530936 533424 532992 529700 523882 516685 510107 505531 502918
55275E02918r17J282L834N335M994L510K004J178J529K973L972K524j062l600
$$ 502918 502001 503283 507117 512452 517446 520956 522960 524138 525667 528640 532612 535136 534074 530474
55261E30474k425J312L802K742o42l517m341l689k910k678k656k322j769j381
$$ 530474 528049 529361 533163 535905 535263 531746 527405 523716 520806 518128 515472 513150 511381 510000
55247E10000q44P87L514N565N178L079J979L122M383K730j847n980o573l908p96
$$ 510000 509156 509943 513457 519022 524200 527279 529258 532380 536763 539493 537646 531666 525093 521185 520389
55232E20389O29O35O22J001P76q29k942l762k727j238p31p26K34K130L277K792
$$ 520389 521018 521653 522275 523276 524052 523223 520281 516519 513792 512554 511823 511097 511331 513461 516738 519530
55216E19530J679Q74j60j597j532J606N670O536L605P98R95K076O12k508l311
$$ 519530 521209 522083 521923 520326 518794 520400 526070 532606 536211 537009 538004 540080 540692 538184 534873
55201E34873o94K237K979K590K600J887j052m675o009m781l320k755j954m17M90
$$ 534873 534179 536416 539395 541985 544585 546472 545420 540745 534736 529955 526635 523880 521926 521509 521999
55186E21999N9m49k56p79l003m892l765k51K630L694M422N611N936M621L093K641
$$ 521999 522058 521609 521353 520574 517571 512679 508914 508663 511293 514987 519409 525020 530956 535577 538670 541311
55170E41311K387J268M90J830M330M875K199j467l005j480J797M992O827O749
$$ 541311 543698 544966 545456 547286 551616 556491 558690 557223 554218 552738 554535 559527 566354 573103
55156E73103M888J873j500m367n811n479m123k936k078n54J967L915L279K74k288
$$ 573103 577991 579864 578364 573997 568186 562707 558584 555648 553570 553016 554983 558898 562177 562451 560163
55141E60163j945M40J465p44m039m578j334K870M903M575L726L242K449J033r7
$$ 560163 558218 558658 560123 559379 555340 550762 549428 552298 557201 561776 565502 568744 571193 572226 572129
55126E72129j77L42P07J172K635N175P402P340M037j383o190p958o359l112k87
$$ 572129 571952 572294 573001 574173 576808 581983 589385 596725 600762 599379 593189 585231 578872 575760 575473
55111E75473J153J440J238R50M63o23k260l474l074j119O96N12j668l724l416
$$ 575473 576626 578066 579304 580254 580717 580094 577834 574360 571286 570167 570863 571375 569707 565983 562567
55096E62567p23J997K440P44r26r35L51J626K160J747R6k530m426l407P97N637
$$ 562567 561844 563841 566281 567025 566099 565164 565515 567141 569301 571048 571144 568614 564188 560781 561578 567215
55080E67215P712N912K733K042M920P966O844J510l691n466m943m351k967P65
$$ 567215 574927 580839 583572 585614 590534 598500 605344 606854 603163 597697 592754 588403 585436 586201
55066E86201M858N447K603N21J162J530r04l723l442j075j03o45K11K759L675
$$ 586201 591059 596506 599109 599630 600792 602322 601418 597695 594253 593178 593075 592430 592641 595400 599075
55051E99075J417j036p21R27O66j533k675j199J232K342J669J60j082j176K41
$$ 599075 600492 599456 598735 599662 600328 598795 596120 594921 596153 598495 600164 600324 599242 598066 598307
55036E98307K360L709L658K662Q94j922m636m323K47N545O286J851k396j479L192
$$ 598307 600667 604376 608034 610696 611590 609668 605032 600709 600956 606501 612787 614638 612242 610763 613955
55021F13955N955L934k83k795k795k078j963k293k589k556j660N09L133M369L345
$$ 613955 619910 623844 623561 620766 617971 615893 613930 611637 609048 606492 604832 605341 608474 612843 616188
55006F16188J478J043K468L765L063R61n41j094k280m389m798j417L414N069K587
$$ 616188 617666 618709 621177 624942 628005 628966 628425 627331 625051 620662 615864 614447 617861 622930 625517
54991F25517q9M25K644L051J177m62l90N14J373K448L397K750L42j423k90K744
$$ 625517 625428 625853 628497 631548 632725 632263 631873 632387 633760 636208 639605 642355 642697 641274 640984 643728
54975F43728M540L592J331k11o05o19p00o87m06J81J034J623Q21j731m243m050
$$ 643728 648268 651860 653191 652980 652375 651756 651056 650369 649963 650144 651178 652801 653622 651891 647648 643598
54959F43598q77K150J875j183l656l453j513M19J946L297M063L929L453K963J713
$$ 643598 642721 644871 646746 645563 641907 638454 636941 637360 639306 642603 646666 650595 654048 657011 658724
54944F58724l56j172R23L811L514j84k696n19M149O628N769M100L142J817l38
$$ 658724 658368 657196 658119 661930 665444 665260 662564 662045 666194 672822 678591 682691 685833 687650 687312
54929F87312j499m99R19P02l18J35K076L271K494P44p90j924k447j836m98M30
$$ 687312 685813 685314 686233 686935 686617 686752 688828 692099 694593 695337 694547 692623 690176 688340 687842 688272
54913F88272J141K937N148M758Q76k646j725K284M436K816Q4j384k195l070k830
$$ 688272 689413 692350 697498 702256 703132 700486 698761 701045 705481 708297 708381 706997 704802 701732 698902
54898F98902j114l34k365n261n776l803j776p17K21Q06o06l782n602l602J042
$$ 698902 697788 697454 695089 689828 684052 680249 678473 677756 677977 678783 678177 674395 668793 665191 666233
54883F66233N148O915O691N579M567M366M963N423M884L525K109R53q8r93j597
$$ 666233 671381 678296 684987 690566 695133 699499 704462 709885 714769 718294 720403 721356 721268 720275 718678
54868G18678j981k219k051j342p40j010j894k360k072j674j501j062l74o28k296
$$ 718678 716697 714478 712427 711085 710345 709335 707441 705081 703009 701335 699834 698772 698398 697770 695474
54853F95474l497k022J158K450L67k172j634J414L302K232J48n47k87j375m790
$$ 695474 691977 689955 691113 693563 693930 691758 690124 691538 694840 697072 697220 696673 696386 695011 690221
54838F90221q821j0569q482l677R69L315L334K018n5k234l026j687K1k00j661
$$ 690221 681400 670831 662349 658672 659641 662956 666290 668308 668253 666019 662993 661306 661327 661127 659466
54823F59466j491P78K177P34j675k509k171k236k147l53K615M974O592Q240Q674
$$ 659466 657975 658753 660930 661664 659989 657480 655309 653073 650926 650573 653188 658162 664754 672994 681668
54808F81668N755O25k539j805J63M23k15O31K559K821M94k230l167k818l046m125
$$ 681668 687423 688048 685509 683704 683867 684290 684075 684706 687265 690086 690580 688350 685183 682365 679319 675194
54792F75194m331k404N99K632L166L337L655L173J576N84J748L760L840J527n92
$$ 675194 670863 668459 669058 671690 674856 678193 681848 685021 686597 687181 688929 692689 696529 698056 697464
54777F97464k29K065M054M302K958J073k42l47P87K923N499P025N627J472k338
$$ 697464 697235 699300 703354 707656 710614 711687 711445 711098 711885 714808 720307 727332 732959 734431 732093
54762G32093k945j274o77k495m904n868m949k241J819N147N217K654J082K140
$$ 732093 729148 727874 727197 724702 719798 713930 708981 706740 708559 713706 718923 721577 722659 724799
54748G24799L149J558r44j157P03J791J135M92J168K553L636L838K626M61m07
$$ 724799 727948 729506 728562 727405 728108 729899 731034 731526 732694 735247 738883 742721 745347 745808 745401
54733G45401J503L753K384k279n408m363k438l668o478n767k82N515P173N009
$$ 745401 746904 750657 753041 750762 745354 740991 738553 734885 728407 722640 722358 727873 735046 740055
54719G40055K072k84k702m909n091k818p46j830n380p376n100l40K756K255j46
$$ 740055 742127 741843 739141 734232 729141 726323 725577 723747 718367 710991 705891 705551 708307 710562 710416
54704G10416j806j946j421r45m32L03J123J849K300J940J37k785n173n454l858
$$ 710416 708610 706664 705243 704298 703866 704169 705292 707141 709441 711381 711518 708733 703560 698106 694248
54689F94248k198j745j972j733j033p63j004p85K79J135P69m6M19K334L493J698
$$ 694248 692050 690305 688333 686600 685567 684804 683800 683015 683294 684429 685198 685152 685571 687905 691398 693096
54673F93096k311n048l808L02L539L562J562J04l3o6j068k749l994l633j078K566
$$ 693096 690785 685737 681929 682231 685770 689332 690894 690998 690965 690899 689831 687082 683088 679455 678377 680943
54657F80943M558L205L32p59K71N55j230k449m39L143M246J635k137m293m220
$$ 680943 685501 688706 689038 688279 688550 689105 687875 685426 684987 688130 692376 694011 691874 687581 683361
54642F83361k458L43K794K912J39l489n098l663q12Q79K79j378k095j580j383
$$ 683361 680903 681246 684040 686952 687091 683602 678504 674841 674029 674908 675187 673809 671714 670134 668751
54627F68751k332k999j749P90K797L877M773M984L137k6j408N58L506L958J277
$$ 668751 666419 663420 661671 662461 665258 669135 673908 678892 682029 682003 680595 681153 684659 688617 689894
54612F89894k354m840n546m554k242L64J993K269J900J804K481L882N191M898
$$ 689894 687540 682700 677154 672600 670358 670722 672715 674984 676884 678688 681169 685051 690242 695140
54598F95140K065k252n393n421k967n67j80j369j983o28J649K467Q03j946l512
$$ 695140 697205 694953 689560 684139 681172 680605 680425 679056 677073 676445 678094 680561 681364 679418 675906
54583F75906k880n63K381M873N798M561J983j16p05n99j161k376k941k260j311
$$ 675906 673026 672463 674844 679717 685515 690076 692059 691943 691238 690639 689478 687102 684161 681901 680590
54568F80590r17j85J921L932K915j159l999j785L713O953N309J741K98J121J303
$$ 680590 679673 679488 681409 685341 688256 687097 683098 681313 685026 691979 697288 699029 699327 700448 701751
54553G01751o32k941l169j129R92J092m55r65J541N705Q192P674O025M931L306
$$ 701751 701119 698178 695009 693880 694872 695964 695509 694544 696085 701790 709982 717656 723681 728612 731918
54538G31918k17l645l288R85M777M399J157j074r68n86j727l524m080l029j500
$$ 731918 731701 728056 724768 725753 730530 734929 736086 735012 734044 733458 731731 728207 724127 721098 719598
54523G19598k23J224L190M672L965P19k998m265k049J841M575M794L197J324J99
$$ 719598 719375 720599 723789 728461 732426 733145 730147 725882 723833 725674 730249 735043 738240 739564 739763
54508G39763r4j41n34j107q60J083M329P219P951N724J229l647o838p416n867
$$ 739763 739669 739528 738994 737887 737027 738110 742439 749658 757609 763333 764562 760915 754077 746661 740794
54493G40794l057M79L851N470M775L680M440O133N360J172k958l476j141Q88J619
$$ 740794 737737 738216 742067 747537 752312 755992 760432 766565 771925 773097 770139 766663 765522 766410 768029
54478G68029K095J856q49n124p061m639l14K791M713O593P165M432l17l314k893
$$ 768029 770124 771980 771131 766007 758946 754307 753993 756784 761497 768090 775255 779687 779370 776056 773163
54463G73163p10J538L830N801N751L117J27o66O15J815J481k34k310l484k854
$$ 773163 772453 773991 777821 783622 789373 792490 792617 791951 792566 794381 795862 795628 793318 789834 786980
54448G86980j020J65qP8J745L307K177q36j957K64K602J585j668l174j496R40
$$ 786980 785960 786125 786117 786195 787940 791247 793424 792588 790631 790895 793497 795082 793414 790240 788744 789684
54432G89684J663Q97Q3k34k6J050K566K704N00k056k068L46K200J816Q73J536
$$ 789684 791347 792244 792327 792093 792067 793117 795683 798387 798887 796831 794763 795109 797309 799125 799998 801534
54416H01534L347M296L606J916k66k537l573k196M42J478k47k759l648l059k872
$$ 801534 804881 809177 812783 814699 814433 811896 808323 806127 806569 808047 807800 805041 801393 798334 795462
54401G95462l603l502r32L164N869N365K919J409J985K935K029r02m314o873p854
$$ 795462 791859 788357 787425 790589 796458 801823 804742 806151 808136 811071 813100 812198 807884 801011 793157
54386G93157o397k226K890O138O656O110N753M629J788j255k128q27M12K46m14
$$ 793157 786760 784534 787424 793562 800218 806328 812081 816710 818498 817243 815115 814288 814700 814946 814532
54371H14532k72N82J364J928K594L174K819R31j886l831l373j099N13j07j693
$$ 814532 814260 814842 816206 818134 820728 823902 826721 827652 825766 821935 818562 817463 817976 817869 816176
54356H16176k111j558j949l296l220r17P29r15l853l762r1L026K344n50j930n03
$$ 816176 814065 812507 810558 807262 804042 803125 803854 802939 799086 795324 795233 798259 800603 800053 798123 797620
54340G97620K263M744O077N412K516r28k357j121R31J869J474M45r02k440l547
$$ 797620 799883 804627 810704 816116 818632 817704 815347 814226 815157 817026 818500 818945 818043 815603 812056
54325H12056l477k019M03K792L678K109r42l069k930j628j008j395j809j759j698
$$ 812056 808579 806560 806963 809755 813433 815542 814600 811531 808601 806973 805965 804570 802761 801002 799304
54310G99304j855j595j52K262M184L856J001k269l184j258J373K760K916K338
$$ 799304 797449 795854 795702 797964 802148 806004 807005 804736 801552 800294 801667 804427 807343 809681
54296H09681O57j710k416j50K297R69l524o186m162j85J722J275P19P02L9j531
$$ 809681 810338 808628 806212 806062 808359 809328 805804 799618 795456 795271 796993 798268 798987 799689 799728 798197
54280G98197k792k971k169j35L350O875Q099O646M623L758L423K426J255J239
$$ 798197 795405 792434 790265 790130 793480 800355 808454 815100 819723 823481 826904 829330 830585 831824
54266H31824K334L109K660J335k42j700k420j739j48N95n82k451k772j038Q48
$$ 831824 834158 837267 839927 841262 841020 839320 836900 835161 835013 835608 835026 832575 829803 828765 829613
54251H29613R66l00q49N59K953M473M489M018M121M334L092j83l784n019l049
$$ 829613 830579 830279 829430 829989 832942 837415 841904 845922 850043 854377 857469 857286 853502 848483 845434
54236H45434j24M23k423o113o987m001J80K185J628J017J927K760J404j145j871
$$ 845434 845310 845733 843310 837197 830210 826209 826389 828574 830202 831219 833146 835906 837310 836165 834294
54221H34294j42J286K92j777k548k042j878k439k940l455m448m643j880L446P872
$$ 834294 834152 835438 835730 833953 831405 829363 827485 825046 822106 818651 814203 809560 807680 811126 818998
54206H18998Q671O618M153K392J091L04M56J136J087m51k881m681m500k104J451
$$ 818998 827669 834287 838440 840832 841923 842227 842683 843819 844906 844455 841574 836893 832393 830289 831740
54191H31740M750P006P872O718L153j720n624p103o416m413j645R94K081J232
$$ 831740 836490 843496 851368 858086 861239 859519 853895 846792 840376 835963 834318 835312 837393 838625
54177H38625K19J253M114N823L769r62m014k232K436M745K457p82l22L247N298
$$ 838625 838844 840097 844211 850034 853803 852841 848827 846595 849031 853776 856233 855451 855129 858376 863674
54162H63674L806J570J440K603L084L067L490L435J545j122k083p88R62J531Q03
$$ 863674 867480 869050 870490 873093 876177 879244 882734 886169 887714 886592 884509 883721 884683 886214 887017
54147H87017n74j765j914j018j55K85J635M666P194O047J268l432m413j097M323
$$ 887017 886443 884678 882764 881746 881591 881876 883511 888177 895371 901418 902686 899254 894841 893744 898067
54132H98067Q576R162O353L292K549L056K211K96N8J833K338l63l316k215K907
$$ 898067 906643 915805 922158 925450 927999 931055 933266 933562 933620 935453 937791 937428 934112 931897 934804
54117I34804P610P989M302J06j019J712N578O683L675q70l105j566K105N274O397
$$ 934804 942414 950403 954705 954811 953792 955504 961082 967765 971440 970570 967465 965899 968004 973278 979675
54102I79675N423L202R42n2J235M510P369O705K138k617l417m22K408K565J563
$$ 979675 985098 988300 989242 989190 990425 994935 1002304 1009009 1011147 1008530 1005113 1004691 1007099 1009664 1011227
54087A011227J848L295M188L934L018J321j464m225n080l679j536l0P68J321K024
$$ 1011227 1013075 1016370 1020558 1024492 1027510 1028831 1027367 1023142 1018062 1014383 1012847 1012817 1013585 1014906 1016930
54072A016930L559O467R646J0541P990M265K966M835O860N995K593p59k848m443
$$ 1016930 1020489 1026956 1036602 1047143 1055133 1059398 1062364 1067199 1074059 1080054 1082647 1081888 1079040 1074597
54058A074597n460l928Q80O039Q004P246P376R569J0584P505K337k42J331M090
$$ 1074597 1069137 1065209 1066089 1072128 1080132 1087378 1094754 1104323 1114907 1122412 1124749 1124507 1125838 1129928
54044A129928M719L315K360L279N007N716M923L571K493J681J160J602L175M522
$$ 1129928 1134647 1137962 1140322 1143601 1148608 1154324 1159247 1162818 1165311 1166992 1168152 1169754 1172929 1177451
54030A177451M263L201L394M842M928K063j668k798n30K821M685M296K457O72
$$ 1177451 1181714 1184915 1188309 1193151 1198079 1200142 1198474 1195676 1195146 1197967 1202652 1206948 1209405 1210077
54016A210077L75J741L166K849R53n07O8K368M751N586M233J541p42j656j795
$$ 1210077 1210452 1212193 1215359 1218208 1219161 1218654 1218722 1221090 1225841 1231427 1235660 1237201 1236459 1234803 1233008
54001A233008j824j009J315L410K427j563m800m259j236P47L83q52j618k030k203
$$ 1233008 1231184 1230175 1231490 1234900 1237327 1235764 1230964 1226705 1225469 1226216 1226599 1225747 1224129 1222099 1219896
53986A219896j586l50K97J4OP51N71j867m693m672j540J618K595K479L082M040
$$ 1219896 1218310 1217960 1218257 1218271 1218277 1219028 1219599 1217732 1213039 1208367 1206827 1208445 1211040 1213519 1216601 1220641
53970A220641L979L014K275J872J192N68P54J088J98j414j509O77L125L777L031
$$ 1220641 1224620 1227634 1229909 1231781 1232973 1233541 1234295 1235383 1235581 1234167 1232658 1233335 1236460 1240237 1243268
53955A243268K459K314J702M84k95K69J824K961K298n0k063j674O39K337K264
$$ 1243268 1245727 1248041 1249743 1250227 1249932 1250201 1252025 1254986 1257284 1257234 1255171 1253497 1254136 1256473 1258737
53940A258737K194L870N922N604K855O83J348L818N526N376M243L390L331L951
$$ 1258737 1260931 1264801 1270723 1276327 1279182 1279865 1281213 1285031 1290557 1295933 1300176 1303566 1306897 1310848
53926A310848M877N578N470M315K497P92j89j76R64L140N622P349Q085Q536Q764
$$ 1310848 1315725 1321303 1326773 1331088 1333585 1334377 1334188 1334012 1334976 1338116 1343738 1351087 1359172 1367708 1376472
53911A376472P458M105Q12jQ05K31k116l200j368Q84O26j444k797k892k573j379
$$ 1376472 1383930 1388035 1388847 1388846 1389651 1389882 1387766 1384566 1383198 1384082 1384708 1383264 1380467 1377575 1375002 1373623
53895A373623J432M129L959J182j157j450q13j36J094K381J674j410m337n273
$$ 1373623 1375055 1379184 1383143 1384325 1383168 1381718 1380905 1380769 1381863 1384244 1385918 1384508 1380171 1374898
53881A374898n745p696r875r594o951m723m318m157k413L16J868R97j667m615
$$ 1374898 1369153 1361457 1351582 1341988 1335037 1330314 1325996 1321839 1319426 1319742 1321610 1322607 1320940 1316325
53867A316325o651p133n525j574L524O677M983j037p219r467p402l938j975k142
$$ 1316325 1309674 1302541 1297016 1295442 1298966 1305643 1310626 1309589 1302370 1292903 1285501 1281563 1279588 1277446
53853A277446l232l786l216k019j279j667k758l216j915O77K342J104k138m059
$$ 1277446 1274214 1270428 1267212 1265193 1263914 1262247 1259489 1256273 1254358 1255035 1257377 1258481 1256343 1252284
53839A252284k881q69j201l356l868j511J174K055K371L822N114L765q2l955o290
$$ 1252284 1249403 1248534 1247333 1243977 1240109 1238598 1239772 1241827 1244198 1248020 1253134 1256899 1256817 1252862 1246572
53824A246572p171o544m123j082M22o4p05j13P92M11j036j634j12K571M153L705
$$ 1246572 1239401 1232857 1228734 1227652 1228074 1228010 1227305 1227192 1227984 1228395 1227359 1225725 1225613 1228184 1232337 1236042
53808A236042K942M115O651P580N902M464N698P414N739J126k027j764r06j899
$$ 1236042 1238984 1243099 1249750 1257330 1263232 1267696 1273394 1280808 1286547 1287673 1285646 1283882 1282976 1281077
53794A281077k818o84L700O944P640P035O054M303K075J031K158M343N648N289
$$ 1281077 1278259 1277575 1281275 1288219 1295859 1302894 1308948 1313251 1315326 1316357 1318515 1322858 1328506 1333795
53780A333795M135L656M358N032M115K116J505L294M967L592J32j439O59L760
$$ 1333795 1337930 1341586 1345944 1350976 1355091 1357207 1358712 1362006 1366973 1370565 1370697 1369258 1369917 1373677
53766A373677M199J375k338m353l779j576K91N61rK04J267J710J267J682L878
$$ 1373677 1377876 1379251 1376913 1372560 1368781 1367205 1367496 1368057 1368048 1368252 1369519 1371229 1372496 1374178 1378056
53751A378056O035O145M997M479L941J085l570n871l006K599N903M732J196j564
$$ 1378056 1384091 1390236 1395233 1399712 1403653 1404738 1401168 1395297 1392291 1394890 1400793 1405525 1406721 1405157
53737A405157k310j506K64K738N398P162O910M484J239o27K60L281O484Q344Q724
$$ 1405157 1402847 1401341 1401605 1404343 1409741 1416903 1423813 1428297 1429536 1428909 1429169 1432450 1438934 1447278 1456002
53722A456002Q243P227N583L508J895J665K867M599N922O563O700O406N701M778
$$ 1456002 1464245 1471472 1477055 1480563 1482458 1484123 1486990 1491589 1497511 1504074 1510774 1517180 1522881 1527659
53708A527659L786K596J447J554M024P817R905Q278M333J381J178K791M553N821
$$ 1527659 1531445 1534041 1535488 1537042 1541066 1548883 1558788 1567066 1571399 1572780 1573958 1576749 1581302 1587123
53694A587123O571O539N704M945N258O531P790Q631R617J1169J2626J2798J1159
$$ 1587123 1593694 1600233 1605937 1610882 1616140 1622671 1630461 1639092 1648709 1659878 1672504 1685302 1696461
53681A696461Q265N139K503P00J09J286M224P605R523R489R142J0149J1738J1540
$$ 1696461 1704726 1709865 1712368 1713068 1713177 1714463 1718687 1726292 1735815 1745304 1754446 1764595 1776333 1787873
53667A787873Q930O117N190N382M703L460M122P527J0994J1263Q190M485K545
$$ 1787873 1796803 1802920 1808110 1813492 1818195 1821655 1825777 1833304 1844298 1855561 1863751 1868236 1870781
53654A870781K790M658P551J0387J1446R955P431O572Q412J1216J2473J1624J0095
$$ 1870781 1873571 1878229 1885780 1896167 1907613 1917568 1924999 1931571 1939983 1951199 1963672 1975296 1985391
53641A985391Q998P918O488N896P538J0674J2968J3438J3212J3052J1848Q785
$$ 1985391 1994389 2002307 2008795 2014691 2022229 2032903 2045871 2059309 2072521 2085573 2097421 2106206
53629B106206N478M332N525P397R228J1649J4331J5276J3218R492O744O545Q599
$$ 2106206 2111684 2116016 2121541 2128938 2138166 2149815 2164146 2179422 2192640 2202132 2208876 2215421 2224020
53616B224020J1343J2937J2718J2116J3208J5989J8080J7578J5109J2561J1053
$$ 2224020 2235363 2248300 2261018 2273134 2286342 2302331 2320411 2337989 2353098 2365659 2376712
53605B376712J0831J1745J2696J1885R043O434O282Q126J0227J2388J5136J6961
$$ 2376712 2387543 2399288 2411984 2423869 2432912 2439346 2445628 2453754 2463981 2476369 2491505 2508466
53593B508466J5255J0372O088N079O077O752P355R614J3387J6547J7626J6839
$$ 2508466 2523721 2534093 2540181 2545260 2551337 2558089 2565444 2575058 2588445 2604992 2622618 2639457
53581B639457J4883J2591J1583J3281J6578J8263J6668J3850J2908J4033J4592
$$ 2639457 2654340 2666931 2678514 2691795 2708373 2726636 2743304 2757154 2770062 2784095 2798687
53570B798687J2809R779P600O933P247Q476J1012J4406J7326J9106K0216K0887
$$ 2798687 2811496 2821275 2828875 2835808 2843055 2851531 2862543 2876949 2894275 2913381 2933597 2954484
53558B954484K0393J8503J6661J6359J6794J5854J3596J2971J5984K0424K2116
$$ 2954484 2974877 2993380 3010041 3026400 3043194 3059048 3072644 3085615 3101599 3122023 3144139
53547C144139K0074J7459J7052J7640J6372J3582J3006J6890K2754K6196K5727
$$ 3144139 3164213 3181672 3198724 3216364 3232736 3246318 3259324 3276214 3298968 3325164 3350891
53536C350891K3527K2145K2241K3382K5151K6689K6608K4606K2360K1659K2251
$$ 3350891 3374418 3396563 3418804 3442186 3467337 3494026 3520634 3545240 3567600 3589259 3611510
53525C611510K2613K2558K3738K7403L2513L6528L7538L5568L2187K9154K7262
$$ 3611510 3634123 3656681 3680419 3707822 3740335 3776863 3814401 3849969 3882156 3911310 3938572
53514C938572K6430K6659K8269L0876L2899L2953L1456L0150L0144L1146L2400
$$ 3938572 3965002 3991661 4019930 4050806 4083705 4116658 4148114 4178264 4208408 4239554 4271954
53503D271954L3505L4280L4671L5049L6027L7575L8592L7584L3993K9199K6084
$$ 4271954 4305459 4339739 4374410 4409459 4445486 4483061 4521653 4559237 4593230 4622429 4648513
53492D648513K6609K9450L1074K9912K8213K8492K9518K8065K3927K0661K1162
$$ 4648513 4675122 4704572 4735646 4765558 4793771 4822263 4851781 4879846 4903773 4924434 4945596
53481D945596K4739K8786L1019K9686K4592J9185J8567K3090K6256K2171J3496
$$ 4945596 4970335 4999121 5030140 5059826 5084418 5103603 5122170 5145260 5171516 5193687 5207183
53470E207183Q580J1282J7252K0486J9860J7748J5290J1970Q460O880Q034J0074
$$ 5207183 5215763 5227045 5244297 5264783 5284643 5302391 5317681 5329651 5338111 5344991 5353025 5363099
53458E363099J0623R169P007N471M909N035N520N939N647M338K739K127K954M501
$$ 5363099 5373722 5382891 5389898 5395369 5400278 5405313 5410833 5416772 5422419 5426757 5429496 5431623 5434577 5439078
53444E439078N950P044P333N946L085Q25J068L185N060O121P613R889J1431J1240
$$ 5439078 5445028 5452072 5459405 5465351 5468436 5469261 5470329 5473514 5478574 5484695 5492308 5502197 5513628 5524868
53430E524868J0451J0424J0685J0267R980J1441J4251J6043J5752J5146J6220
$$ 5524868 5535319 5545743 5556428 5566695 5576675 5588116 5602367 5618410 5634162 5649308 5665528
53419E665528J8267J8849J7235J5449J5657J7612J9479K0426K1255K2546K3565
$$ 5665528 5683795 5702644 5719879 5735328 5750985 5768597 5788076 5808502 5829757 5852303 5875868
53408E875868K3584K3273K3864K5494K7285K8630K9511K9970L0375L1683L4087
$$ 5875868 5899452 5922725 5946589 5972083 5999368 6027998 6057509 6087479 6117854 6149537 6183624
53397F183624L5636L3964K9668K6164K5590K6567K6811K6233K5889K5543K4334
$$ 6183624 6219260 6253224 6282892 6309056 6334646 6361213 6388024 6414257 6440146 6465689 6490023
53386F490023K3000K3220K4921K6110K5356K2809J8900J3872R009O406O678Q087
$$ 6490023 6513023 6536243 6561164 6587274 6612630 6635439 6654339 6668211 6677220 6683626 6690304 6698391
53374F698391Q675Q046O520L907K02l564o304p991r067r635j0164j1912j5361
$$ 6698391 6707066 6715112 6721632 6725539 6725741 6722177 6715873 6707882 6698815 6689180 6679016 6667104 6651743
53361F651743j8899k0522k0481k0933k3156k6474k9834l2982l5665l6954l6232
$$ 6651743 6632844 6612322 6591841 6570908 6547752 6521278 6491444 6458462 6422797 6385843 6349611
53350F349611l4250l2444l1489l1108l1184l2542l6050m0836m4068m3450m0045
$$ 6349611 6315361 6282917 6251428 6220320 6189136 6156594 6120544 6079708 6035640 5992190 5952145
53339E952145l7433l7632l9017l9333l9289m1349m5638m9329n0219m8974m7198
$$ 5952145 5914712 5877080 5838063 5798730 5759441 5718092 5672454 5623125 5572906 5523932 5476734
53328E476734m5106m2142l8705l5996l4883l5589l7803m0450m2111m2275m1441
$$ 5476734 5431628 5389486 5350781 5314785 5279902 5244313 5206510 5166060 5123949 5081674 5040233
53317E040233l9775l6882l3559l2112l3556l5584l5068l1976k9200k8768k9856
$$ 5040233 5000458 4963576 4930017 4897905 4864349 4828765 4793697 4761721 4732521 4703753 4673897
53306D673897l0442k9433k6952k3885k1544k0790k1102k1340k1310k1645k2211
$$ 4673897 4643455 4614022 4587070 4563185 4541641 4520851 4499749 4478409 4457099 4435454 4413243
53295D413243k2069k1249k0969k1441k1100j9038j6762j5987j5886j4534j2436
$$ 4413243 4391174 4369925 4348956 4327515 4306415 4287377 4270615 4254628 4238742 4224208 4211772
53284D211772j2209j4676j7519j8628j8727j9379k0278k0488k0944k3205k6206
$$ 4211772 4199563 4184887 4167368 4148740 4130013 4110634 4090356 4069868 4048924 4025719 3999513
53273C999513k7047k5198k3349k3238k3238k1637k0036k1161k4718k7756k8330
$$ 3999513 3972466 3947268 3923919 3900681 3877443 3855806 3835770 3814609 3789891 3762135 3733805
53262C733805k6671k3746k1012k0830k4297k8860l0946l0820l1875l4938l7016
$$ 3733805 3707134 3683388 3662376 3641546 3617249 3588389 3557443 3526623 3494748 3459810 3422794
53251C422794l6492l5713l6365l5940l1969k7065k6137l0017l5126l8328l8993
$$ 3422794 3386302 3350589 3314224 3278284 3246315 3219250 3193113 3163096 3127970 3089642 3050649
53240C050649l7194l3325k9418k7887k8731l0159l1706l4043l6049l5194l1509
$$ 3050649 3013455 2980130 2950712 2922825 2894094 2863935 2832229 2798186 2762137 2726943 2695434
53229B695434k8334k8159k9983l1735l3107l4672l6067l6551l6169l5237l3511
$$ 2695434 2667100 2638941 2608958 2577223 2544116 2509444 2473377 2436826 2400657 2365420 2331909
53218B331909l0743k7380k4424k3150k4706k8680l2397l3238l1531k9447k7471
$$ 2331909 2301166 2273786 2249362 2226212 2201506 2172826 2140429 2107191 2075660 2046213 2018742
53207B018742k4379k0748j9382k1278k3718k3995k2893k2854k4353k5989k6845
$$ 2018742 1994363 1973615 1954233 1932955 1909237 1885242 1862349 1839495 1815142 1789153 1762308
53196A762308k7069k6853k6129k4819k2787k0410j9148j9995k1090j9150j4102
$$ 1762308 1735239 1708386 1682257 1657438 1634651 1614241 1595093 1575098 1554008 1534858 1520756
53185A520756r948r608j1193j1328j0186j0618j3220j4894j2517o742j895k264
$$ 1520756 1510808 1501200 1490007 1478679 1468493 1457875 1444655 1429761 1417244 1410502 1408607 1406343
53173A406343p705j3036j3243r413p266r573j3068j3971j3002j2432j1424q065
$$ 1406343 1398638 1385602 1372359 1362946 1355680 1346107 1333039 1319068 1306066 1293634 1282210 1274145
53161A274145l865k190l194m036l660l842n480p095p493p173o546n066k804r27
$$ 1274145 1270280 1268090 1264896 1260860 1257200 1253358 1247878 1240783 1233290 1226117 1219571 1214505 1211701 1210774
53147A210774j74l36j448l719o331p924q304q057o774l702J7J915J336J49L8P87
$$ 1210774 1210600 1210264 1208816 1205097 1198766 1190842 1182538 1174481 1167707 1164005 1164022 1165937 1167273 1167422 1167460 1168247
53131A168247J368J099l23k246k641j50L438M841L505K047K123K342J049r44j869
$$ 1168247 1169615 1170714 1170391 1168145 1165504 1165354 1168792 1173633 1177138 1179185 1181308 1183650 1184699 1183755 1181886
53116A181886j707j948l365n066n477l923j405L40R12J482K439K178k43k780k899
$$ 1181886 1180179 1178231 1174866 1169800 1164323 1160400 1158995 1159335 1160247 1161729 1164168 1166346 1166103 1163323 1160424
53101A160424j367q85j691j430P21K716K783J393k96j598j704k25J418J433L73
$$ 1160424 1159057 1158172 1156481 1155051 1155772 1158488 1161271 1162664 1162368 1160770 1159066 1158841 1160259 1161692 1162065
53086A162065Qj62k091n051n987m461l309l584k891k44J680J307J245L615N773
$$ 1162065 1162073 1161911 1159820 1154769 1148782 1144321 1141012 1137428 1134537 1134293 1135973 1137280 1138525 1142140 1147913
53071A147913M093n23m264n474n055l662j578P7P21J558L158L597J470j155j606
$$ 1147913 1152006 1151483 1147219 1141745 1136690 1133028 1131450 1131527 1132248 1133806 1136964 1140561 1142031 1140876 1139270
53056A139270n30n4J00J294K498J781M0m08R4m92j765j663o06q72k103j854o03
$$ 1139270 1138740 1138686 1138786 1140080 1142578 1144359 1144399 1143991 1144085 1143593 1141828 1140165 1139559 1138687 1136584 1134730 1134127
53039A134127j625m975o208k851J832L777L336L039L069K029J50j030j072m49
$$ 1134127 1132502 1127527 1121319 1118468 1120300 1124077 1127413 1130452 1133521 1135550 1135700 1134670 1133598 1133149
53025A133149P73K171K192K75j437p48J070R15j444k844j284J294J874L87n28
$$ 1133149 1133922 1136093 1138285 1138560 1137123 1136375 1137445 1138360 1136916 1134072 1132788 1134082 1135956 1136343 1135815
53010A135815Q42L389M837M237K267p5k036k602q48K462M678L795P64j719k438
$$ 1135815 1136657 1140046 1144883 1149120 1151387 1151312 1149276 1146674 1145826 1148288 1152966 1156761 1157525 1155806 1153368
52995A153368k475k958l308k317j63J367O97j716l494k757l15J381J644K425M875
$$ 1153368 1150893 1147935 1144627 1142310 1142147 1143514 1144211 1142495 1139001 1136244 1135929 1137310 1138954 1141379 1146254
52980A146254O723N102J053j229M17L892O101O190M704J671k718o663p795n690
$$ 1146254 1152977 1158079 1159132 1157903 1158320 1162212 1168313 1174503 1179207 1180878 1178160 1171497 1163702 1158012
52966A158012k354k01N8l49J68J761K912K237J45j696k337k218k130k232k182
$$ 1158012 1155658 1155457 1155515 1155166 1155334 1157095 1160007 1162244 1162389 1160693 1158356 1156138 1154008 1151776 1149594
52951A149594j678p61Q3M47Q55K301M343M744K211j400l153k622j625j022M1J648
$$ 1149594 1147916 1147155 1147238 1147685 1148540 1150841 1155184 1159928 1162139 1160739 1157586 1154964 1153339 1152317 1152358 1154006
52935A154006K240Q58j503l408m218l316j12M104O065L922l04k973k759j263n00
$$ 1154006 1156246 1157104 1155601 1152193 1147975 1144659 1144547 1148651 1154716 1158638 1158334 1155361 1152602 1151339 1150839
52920A150839j086k367l214k687p29J776L793M772M543L346K133J873K199J663
$$ 1150839 1149753 1147386 1144172 1141485 1140756 1142532 1146325 1151097 1155640 1158986 1161119 1162992 1165191 1166854
52906A166854j65j884k269k111k969m633m974k536J321L335J621j989l499j124
$$ 1166854 1166689 1164805 1162536 1160425 1157456 1152823 1147849 1145313 1146634 1149969 1151590 1149601 1146102 1144978
52892A144978K534L751K416J834M002O944P367M374k38m135o055o334o436p027
$$ 1144978 1147512 1151263 1153679 1155513 1159515 1166459 1173826 1178200 1177962 1173827 1167772 1161438 1155002 1147975
52878A147975o383k501K891M841J261l690m704k126p42k522m113k201J637L286
$$ 1147975 1141592 1139091 1141982 1146823 1148084 1144394 1139690 1137564 1136822 1134300 1130187 1127986 1129623 1132909
52864A132909J489j302k652k533j896p69J021K273J373j110k261k13L284M806
$$ 1132909 1134398 1133096 1130444 1127911 1126015 1125246 1126267 1128540 1129913 1128803 1126542 1126329 1129613 1134419
52850A134419L138o9k916m640m443j254M049P854O997K204k813n153m593k485
$$ 1134419 1137557 1137488 1134572 1129932 1125489 1124235 1128284 1136138 1143135 1145339 1142526 1137373 1132780 1130295
52836A130295m56K1j588l970m780k941L99L311M702M344K334n63k770l238k861
$$ 1130295 1129839 1129860 1128272 1124302 1119522 1116581 1116980 1120291 1124993 1129337 1131671 1131108 1128338 1125100 1122239
52821A122239l285m193l160P06M406M057j74m235n241m172k967j561P39L015M028
$$ 1122239 1118954 1114761 1111601 1112307 1116713 1120770 1120596 1116361 1111120 1106948 1103981 1102420 1103159 1106174 1110202
52806A110202M218M371L863K531K554N323P661N026j721o674o404l485j615j059
$$ 1110202 1114420 1118791 1122654 1125185 1127739 1133062 1140723 1145749 1144028 1137354 1130950 1127465 1125850 1124791
52792A124791o52q22k134l339l230k603k417j976p04L01L86Q18K154K405L53j495
$$ 1124791 1124139 1123317 1121183 1117844 1114614 1112011 1109594 1107618 1106914 1107215 1107601 1108419 1110573 1112978 1113331 1111836
52776A111836k24K940M469L511J954O51j046k649k515m40K226M518N575L559j924
$$ 1111836 1111612 1114552 1119021 1122532 1124486 1125137 1124091 1121442 1118927 1118487 1120713 1125231 1130806 1134365 1132441
52761A132441p119p447l446J8O40R47L022M872L928J182m40J05J552K325J671
$$ 1132441 1125322 1117875 1114429 1114447 1115087 1116034 1119056 1123928 1127856 1129038 1128598 1128703 1130255 1132580 1134251
52746A134251R5n48J106L619M208K934K797M688N223J663l431n191k659P66K176
$$ 1134251 1134346 1133798 1134904 1138523 1142731 1145665 1148462 1153150 1158373 1160036 1156605 1151414 1148755 1149521 1151697
52731A151697J906J561J525J133J79m49M00K455L413J255k614m100j282L014M634
$$ 1151697 1153603 1155164 1156689 1157822 1158001 1157552 1157952 1160407 1163820 1165075 1162461 1158361 1157079 1160093 1164727
52716A164727K700n32k848l183r41L167O122N148J510n35P83K569J735m11j02
$$ 1164727 1167427 1166895 1164047 1160864 1159923 1163090 1169212 1174360 1175870 1175335 1176118 1178687 1180422 1180011 1179909
52701A179909L287N938M175j178n916o965m893k332j085r50o42O39K331L040K189
$$ 1179909 1183196 1189134 1193309 1192131 1186215 1179250 1174357 1172025 1170940 1169990 1169348 1169987 1172318 1175358 1177547
52686A177547R83R64J753J470j63p75J427M737N965M489K426J533J994L815O740
$$ 1177547 1178530 1179494 1181247 1182717 1182554 1181779 1183206 1187943 1193908 1198397 1200823 1202356 1204350 1208165 1214905
52671A214905Q695P089K550j094j613q95j334k172j567l83j060l627n485n026
$$ 1214905 1223600 1230689 1233239 1232145 1230532 1229637 1228303 1226131 1224564 1224181 1223121 1219494 1214009 1208983
52657A208983l363k070r28J329M753P316O467K054k523l344n51J724P72j306j117
$$ 1208983 1205620 1203550 1202622 1203951 1208704 1216020 1222487 1224541 1222018 1218674 1218123 1219847 1220619 1219313 1218196
52642A218196J072K345J908J903L776O286P462O570M005R85o14J36J714J925Q91
$$ 1218196 1219268 1221613 1223521 1225424 1229200 1235486 1242948 1249518 1253523 1254508 1253894 1254030 1255744 1257669 1258560
52627A258560L21K63o35j685l18L307N331L637J134J073J816j93m057n017j095
$$ 1258560 1258881 1259144 1258509 1256824 1256506 1259813 1265144 1268781 1269915 1270988 1272804 1272611 1268554 1263537 1262442
52612A262442M347O986N646J762k328l828j107L618N620L196k55j137j92J05K50
$$ 1262442 1266789 1273775 1279421 1281183 1278855 1275027 1273920 1277538 1283158 1286354 1286099 1284962 1284770 1284875 1285125
52597A285125K132M227K784j800m136j219K952K956l74j530J773O166Q004P369
$$ 1285125 1287257 1291484 1294268 1292468 1288332 1287113 1290065 1293021 1292647 1291117 1292890 1299056 1307060 1314429
52583A314429N781L277n6k208j625j2j04j567j733M5J665K017K534M048M891L755
$$ 1314429 1320210 1323487 1323431 1321223 1319598 1319586 1319482 1317915 1316182 1316227 1317892 1319909 1322443 1326491 1331382 1335137
52567A335137K285K604L889L816K450K055L373M581M226L046K444K979M623O556
$$ 1335137 1337422 1340026 1343915 1347731 1350181 1352236 1355609 1360190 1364416 1367462 1369906 1372885 1377508 1384064
52553A384064O435K392l220m831l76N242N845J380l284n399o503p807p519m039
$$ 1384064 1390499 1392891 1389671 1384840 1384464 1389706 1395551 1396931 1393647 1388248 1381745 1373938 1366419 1362380
52539A362380J194N735Q796J0321R428N932K039M89J546L171L520K281N58M34
$$ 1362380 1363574 1369309 1378105 1388426 1397854 1403786 1405825 1406314 1407860 1411031 1414551 1416832 1417390 1417824
52525A417824L413Q007J0263Q244M627K968L008K089R1m46J177K490J870R39J568
$$ 1417824 1421237 1429244 1439507 1447751 1452378 1455346 1458354 1460443 1460534 1460088 1461265 1463755 1465625 1466564 1468132
52510A468132K703J954r03l404k854J333O936J0283R411O158L903L332K273k03
$$ 1468132 1470835 1472789 1471886 1468482 1465628 1466961 1473897 1484180 1493591 1499749 1503652 1506984 1509257 1509054
52496A509054k078j838j101j917l434l363j467Q27L154O062Q579Q575N980L611
$$ 1509054 1506976 1505138 1504037 1502120 1498686 1495323 1493856 1494683 1497837 1503899 1512478 1521053 1527033 1530644
52482A530644L973O475Q496Q365O686N272N121N396M549K582J348K060L437L416
$$ 1530644 1534617 1541092 1549588 1557953 1564639 1569911 1575032 1580428 1584977 1587559 1588907 1590967 1594404 1597820
52468A597820K034J141J693K774L288L270L363M026N506P443Q496P340M430J894
$$ 1597820 1599854 1600995 1602688 1605462 1608750 1612020 1615383 1619409 1624915 1632358 1640854 1648194 1652624 1654518
52454A654518J367K546L986M517L867K700K240L093M208L846J865L12J310M742
$$ 1654518 1655885 1658431 1662417 1666934 1670801 1673501 1675741 1678834 1683042 1686888 1688753 1689065 1690375 1695117
52440A695117Q458J0395J0350R851J0306J1281J0860Q042M161J510J139K515M526
$$ 1695117 1703575 1713970 1724320 1734171 1744477 1755758 1766618 1774660 1778821 1780331 1781470 1783985 1788511
52427A788511N869N388L505K614M315O763O839M820M344P228J0737J1326Q939
$$ 1788511 1794380 1799768 1803273 1805887 1810202 1816965 1823804 1828624 1832968 1840196 1850933 1862259 1871198
52414A871198O025M138L494M413O763Q724Q588P625Q895J2953J6709J7036J3823
$$ 1871198 1877223 1881361 1884855 1889268 1896031 1904755 1913343 1920968 1929863 1942816 1959525 1976561 1990384
52401A990384Q916L921K84j74L267Q494J1761J1055P895N890P551J1999J5396
$$ 1990384 1999300 2003221 2003505 2003331 2006598 2015092 2026853 2037908 2045803 2051693 2059244 2071243 2086639
52388B086639J4430R959O405O792R363J0319Q882P467P269O552M244K556L930
$$ 2086639 2101069 2111028 2117433 2124225 2133588 2143907 2152789 2160256 2167525 2174077 2178321 2180877 2184807
52375B184807P122Q850Q357P716Q068Q432Q440R342J1232J1934J0356Q743R609
$$ 2184807 2191929 2200779 2209136 2216852 2224920 2233352 2241792 2251134 2262366 2274300 2284656 2293399 2303008
52362B303008J2145J4044J5327J7521J9894J9818J7051J4639J4618J5230J3873
$$ 2303008 2315153 2329197 2344524 2362045 2381939 2401757 2418808 2433447 2448065 2463295 2477168
52351B477168J0884Q793R071J1119J3558J5123J4986J3561J2647J3651J5934J7719
$$ 2477168 2488052 2496845 2505916 2517035 2530593 2545716 2560702 2574263 2586910 2600561 2616495 2634214
52339B634214J8256J8253J8414J8455J7559J5313J2432J0795J2180J6178J9838
$$ 2634214 2652470 2670723 2689137 2707592 2725151 2740464 2752896 2763691 2775871 2792049 2811887
52328B811887K0251J7486J4524J4483J8198K3802K8009K8325K5034K0970J8834
$$ 2811887 2832138 2849624 2864148 2878631 2896829 2920631 2948640 2976965 3001999 3022969 3041803
52317C041803J8905J9862K1118K3097K5423K6254K4161K0109J6993J7028J9614
$$ 3041803 3060708 3080570 3101688 3124785 3150208 3176462 3200623 3220732 3237725 3254753 3274367
52306C274367K1833K1416J9147J7682J8057J8716J8521J8934K1402K3907K2750
$$ 3274367 3296200 3317616 3336763 3354445 3372502 3391218 3409739 3428673 3450075 3473982 3496732
52295C496732J7629J2418J0348J0773J1594J2641J4842J7679J9567K0017J9753
$$ 3496732 3514361 3526779 3537127 3547900 3559494 3572135 3586977 3604656 3624223 3644240 3663993
52284C663993J9130J8006J6651J5391J3748J1462R951J0961J3771J5552J4904
$$ 3663993 3683123 3701129 3717780 3733171 3746919 3758381 3768332 3779293 3793064 3808616 3823520
52273C823520J3448J3336J4632J5907J6274J5998J5955J7003J8850J9245J5795
$$ 3823520 3836968 3850304 3864936 3880843 3897117 3913115 3929070 3946073 3964923 3984168 3999963
52262C999963R448M552M145O461P739P211P187Q925J0982J1776J1495J0875R945
$$ 3999963 4009411 4013963 4018108 4024569 4032308 4039519 4046706 4055631 4066613 4078389 4089884 4100759 4110704
52249D110704Q848Q233P952O757M432K938L977O237O651M242J472J514M859Q751
$$ 4110704 4119552 4127785 4135737 4142494 4146926 4149864 4153841 4160078 4166729 4170971 4172443 4173957 4178816 4187567
52235D187567R744O931K792O07J178K710L754M788O314O919M841Q77j815q86K962
$$ 4187567 4197311 4204242 4207034 4207641 4208819 4211529 4215283 4220071 4226385 4233304 4238145 4239022 4237207 4236321 4239283
52220D239283O757P650N071J461L47K715N715O014L824K155K494L244K666J419
$$ 4239283 4246040 4253690 4258761 4260222 4260569 4263284 4268999 4275013 4278837 4280992 4283486 4286730 4289396 4290815
52206D290815J103J734K049J519Q93R92K016L780N832P322P458O337M911L985
$$ 4290815 4291918 4293652 4295701 4297220 4298113 4299105 4301121 4304901 4310733 4318055 4325513 4331850 4336761 4340746
52192D340746L531L261L431M421N467M876K382N14J813M922N622K549o10l22J717
$$ 4340746 4344277 4347538 4350969 4355390 4360857 4365733 4368115 4368629 4370442 4375364 4380986 4383535 4382925 4382603 4384320
52177D384320J612k79n7K965M651K570nP01L049K953P16N19L553N845M106L94
$$ 4384320 4385932 4385653 4385596 4388561 4393212 4395782 4395777 4396478 4399527 4402480 4403196 4403715 4407268 4413113 4417219 4417613
52161D417613j062L90J749J071j17M92K728M349M044K736J865J500J010Q56K239
$$ 4417613 4416551 4416941 4418690 4419761 4419644 4420136 4422864 4427213 4431257 4433993 4435858 4437358 4438368 4439224 4441463
52146D441463M954O965O848N556N014N757O955P994Q868R432R319Q634P909P553
$$ 4441463 4446417 4453382 4460230 4465786 4470800 4476557 4483512 4491506 4500374 4509806 4519125 4527759 4535668 4543221
52132D543221P773Q623R429Q829O321L419K280L434N662P521Q082O923M903M329
$$ 4543221 4550994 4559617 4569046 4577875 4584196 4587615 4589895 4593329 4598991 4606512 4614594 4621517 4626420 4630749
52118D630749O597R831J0877R686R580J2454J5829J6003J2533Q073M862L186K654
$$ 4630749 4637346 4647177 4658054 4667740 4677320 4689774 4705603 4721606 4734139 4742212 4747074 4750260 4752914
52105D752914L173M419N598O289O951Q104R233Q839N972J864o50j14J602J616
$$ 4752914 4756087 4760506 4766104 4772393 4779344 4787448 4796681 4805520 4811492 4813356 4812706 4812592 4814194 4815810
52091D815810l5n47J213K620Q63l090n835n672l574j074O87L80k533o133p413
$$ 4815810 4815775 4815228 4816441 4819061 4819924 4816834 4810999 4805327 4801753 4800679 4801366 4801746 4799213 4793080 4785667
52076D785667n838l794l114l075k547k222l355n748q270j0338j1545j0926q062
$$ 4785667 4779829 4776035 4772921 4769846 4767299 4765077 4761722 4755974 4747704 4737366 4725821 4714895 4706833
52063D706833m335j636m06j38j106l905p598j0268j1480j2549j4021j4660j3649
$$ 4706833 4702498 4700862 4700456 4700318 4699212 4695307 4687709 4677441 4665961 4653412 4639391 4624731 4611082
52050D611082j2210j1949j2802j3925j5537j8266k1183k2243k0879j8783j7627
$$ 4611082 4598872 4586923 4574121 4560196 4544659 4526393 4505210 4482967 4462088 4443305 4425678
52039D425678j7166j6357j5550j6305j9067k1945k2497k0482j8169j7783j9184
$$ 4425678 4408512 4392155 4376605 4360300 4341233 4319288 4296791 4276309 4258140 4240357 4221173
52028D221173k0685k1584k2749k4548k5568k4472k2283k1367k2226k2909k2068
$$ 4221173 4200488 4178904 4156155 4131607 4106039 4081567 4059284 4037917 4015691 3992782 3970714
52017C970714k1138k2247k4909k6500k5725k3927k2524k1056j9065j8394k1197
$$ 3970714 3949576 3927329 3902420 3875920 3850195 3826268 3803744 3782688 3763623 3745229 3724032
52006C724032k5983k8216k5815k1972k1040k3242k5538k6431k7141k8382k9005
$$ 3724032 3698049 3669833 3644018 3622046 3601006 3577764 3552226 3525795 3498654 3470272 3441267
$$ [...]
##END NTUPLES=NMR SPECTRUM
##END=
