##TITLE=AC1736_SEN00009_9276107_yGntWwyj9m
##JCAMPDX= 6.0         $$ Bruker NMR JCAMP-DX V2.0
##DATA TYPE= NMR SPECTRUM
##DATA CLASS= NTUPLES
##ORIGIN= BRUKER
##OWNER= Administrator
$$ 1.72 TOPSPIN		Version 2.1
$$ 2015-07-14 18:58:15.525 -0700  Administrator@X
$$ Compression mode = diff/dup
##.OBSERVE FREQUENCY= 400.02188249412
##.OBSERVE NUCLEUS= ^1H
##.ACQUISITION MODE= SIMULTANEOUS (DQD)
##.ACQUISITION SCHEME= undefined
##.AVERAGES= 8
##.DIGITISER RES= 22
##SPECTROMETER/DATA SYSTEM= spect
##.PULSE SEQUENCE= zg30
##.SOLVENT NAME= COFFEE_meoh
##.SHIFT REFERENCE= INTERNAL, COFFEE_meoh, 1, 14.98509
##AUDIT TRAIL= $$ (NUMBER, WHEN, WHO, WHERE, PROCESS, VERSION, WHAT)
$$ ##TITLE= Audit trail, TOPSPIN		Version 2.1
$$ ##JCAMPDX= 5.01
$$ ##ORIGIN= Bruker BioSpin GmbH
$$ ##OWNER= Administrator
$$ $$ E:\/data/COFFEE/nmr/AC1736_SEN00009_9276107_yGntWwyj9m/10/pdata/1/auditp.txt
$$ ##AUDIT TRAIL=  $$ (NUMBER, WHEN, WHO, WHERE, PROCESS, VERSION, WHAT)
(   1,<2015-07-14 18:58:08.385 -0700>,<Administrator>,<X>,<go>,<TOPSPIN 2.1>,
      <created by zg
	started at 2015-07-14 18:57:02.432 -0700,
	POWCHK enabled, PULCHK disabled,
       configuration hash MD5:
       21 0F 79 D6 B3 7B B4 F6 88 20 88 DB 03 48 BD 9F
       data hash MD5: 64K
       57 78 7D BF D5 33 E5 11 35 01 B8 14 21 F3 F2 8E>)
(   2,<2015-07-14 18:58:11.541 -0700>,<Administrator>,<X>,<proc1d>,<TOPSPIN 2.1>,
      <Start of raw data processing
       efp LB = 0 FT_mod = 6 PKNL = 1 PHC0 = 0 PHC1 = 0 SI = 32K 
       data hash MD5: 32K
       11 D9 85 54 10 FD 19 88 96 BC D7 40 D1 BA 9D 78>)
(   3,<2015-07-14 18:58:11.807 -0700>,<Administrator>,<X>,<proc1d>,<TOPSPIN 2.1>,
      <pk PHC0 = 89.90112 PHC1 = 0 
       data hash MD5: 32K
       F8 A6 76 56 45 D0 A0 FB BD 81 21 21 D1 90 4C F1>)
(   4,<2015-07-14 18:58:11.947 -0700>,<Administrator>,<X>,<proc1d>,<TOPSPIN 2.1>,
      <abs ABSG = 1 
       data hash MD5: 32K
       C2 17 50 4E C7 3C 39 9B 7D 5D 64 8F 29 11 91 94>)
(   5,<2015-07-14 18:58:12.010 -0700>,<Administrator>,<X>,<proc1d>,<TOPSPIN 2.1>,
      <abs ABSG = 2 
       data hash MD5: 32K
       01 8B DA 58 FA 0D 05 A3 AE 8E 7C 8F 8E EE E5 C0>)
(   6,<2015-07-14 18:58:12.072 -0700>,<Administrator>,<X>,<proc1d>,<TOPSPIN 2.1>,
      <abs ABSG = 3 
       data hash MD5: 32K
       73 BC 9F E2 6B 60 58 31 41 F7 93 B9 7C 75 E8 50>)
(   7,<2015-07-14 18:58:12.119 -0700>,<Administrator>,<X>,<proc1d>,<TOPSPIN 2.1>,
      <abs ABSG = 4 
       data hash MD5: 32K
       51 4D A9 50 DD 2B 38 8D EF 19 23 B0 36 E4 07 B5>)
(   8,<2015-07-14 18:58:12.182 -0700>,<Administrator>,<X>,<proc1d>,<TOPSPIN 2.1>,
      <abs ABSG = 5 
       data hash MD5: 32K
       5D 90 AD 5D 7C A3 2A 1C CB 75 C7 2D E9 95 5E 10>)
$$ ##END=
$$ 
$$ $$ hash MD5
$$ $$ BC 0A 8D 26 81 A4 5E CF 57 5A 09 C3 D8 67 C1 AF
##$RELAX= 
##$RELAX= 
##$RELAX= 
##$RELAX= 
##$RELAX= 
##$RELAX= 
##$RELAX= 
$$ Bruker specific parameters
$$ --------------------------
##$DU= <E:\>
##$EXPNO= 10
##$NAME= <AC1736_SEN00009_9276107_yGntWwyj9m>
$$ [...]
150 150 150 150 150 150 150 150
##$TP07= 0
##$TPNAME0= <>
##$TPNAME1= <>
##$TPNAME2= <>
##$TPNAME3= <>
##$TPNAME4= <>
##$TPNAME5= <>
##$TPNAME6= <>
##$TPNAME7= <>
##$TPOAL= (0..7)
0.5 0.5 0.5 0.5 0.5 0.5 0.5 0.5
##$TPOFFS= (0..7)
0 0 0 0 0 0 0 0
##$TUNHIN= 0
##$TUNHOUT= 0
##$TUNXOUT= 0
##$USERA1= <user>
##$USERA2= <user>
##$USERA3= <user>
##$USERA4= <user>
##$USERA5= <user>
##$V9= 5
##$VALIST= <valist>
##$VCLIST= <CCCCCCCCCCCCCCC>
##$VD= 0
##$VDLIST= <DDDDDDDDDDDDDDD>
##$VPLIST= <PPPPPPPPPPPPPPP>
##$VTLIST= <TTTTTTTTTTTTTTT>
##$WBST= 2048
##$WBSW= 25
##$XGAIN= (0..3)
0 0 0 0
##$XL= 0
##$YL= 0
##$YMAX_a= 602171
##$YMIN_a= -518915
##$ZGOPTNS= <>
##$ZL1= 120
##$ZL2= 120
##$ZL3= 120
##$ZL4= 120
##$ABSF1= 14.98509
##$ABSF2= -5.573092
##$ABSG= 5
##$ABSL= 3
##$ALPHA= 0
##$AQORDER= 0
##$ASSFAC= 0
##$ASSFACI= 0
##$ASSFACX= 0
##$ASSWID= 0
##$AUNMP= <proc_prof1d_extract_pilot.lims>
##$AXLEFT= 0
##$AXNAME= <>
##$AXNUC= <1H>
##$AXRIGHT= 0
##$AXTYPE= 0
##$AXUNIT= <>
##$AZFE= 0.1
##$AZFW= 0.1
##$BCFW= 0
##$BC_mod= 0
##$BYTORDP= 0
##$COROFFS= 0
##$CY= 15
##$DATMOD= 1
##$DC= 0
##$DFILT= <>
##$DTYPP= 0
##$F1P= 0
##$F2P= 0
##$FCOR= 0.5
##$FTSIZE= 32768
##$FT_mod= 6
##$GAMMA= 0
##$GB= 0
##$INTBC= 1
##$INTSCL= 1
##$ISEN= 128
##$LB= 0
##$LEV0= 0
##$LPBIN= 0
##$MAXI= 10000
##$MC2= 0
##$MEAN= 0
##$ME_mod= 0
##$MI= 0
##$NCOEF= 0
##$NC_proc= -8
##$NLEV= 6
##$NOISF1= 0
##$NOISF2= 0
##$NSP= 0
##$NTH_PI= 0
##$NZP= 0
##$OFFSET= 14.98509
##$PC= 1
##$PHC0= 89.90112
##$PHC1= 0
##$PH_mod= 1
##$PKNL= yes
##$PPARMOD= 0
##$PPDIAG= 0
##$PPIPTYP= 0
##$PPMPNUM= 2147483647
##$PPRESOL= 1
##$PSCAL= 4
##$PSIGN= 0
##$PYNMP= <proc.py>
##$REVERSE= no
##$SF= 400.02
##$SI= 32768
##$SIGF1= 0
##$SIGF2= 0
##$SINO= 400
##$SIOLD= 32768
##$SPECTYP= <>
##$SREGLST= <1H.CDCl3>
##$SSB= 0
##$STSI= 32768
##$STSR= 0
##$SW_p= 8223.68421052631
##$SYMM= 0
##$S_DEV= 0
##$TDeff= 65536
##$TDoff= 0
##$TI= <>
##$TILT= no
##$TM1= 0
##$TM2= 0
##$TOPLEV= 0
##$USERP1= <user>
##$USERP2= <user>
##$USERP3= <user>
##$USERP4= <user>
##$USERP5= <user>
##$WDW= 1
##$XDIM= 32768
##$YMAX_p= 442294717
##$YMIN_p= -693268
##$CURPLOT= <Network HP LaserJet P1505>
##$CURPRIN= <$Network HP LaserJet P1505>
##$DFORMAT= <normdp>
##$LAYOUT= <+/1D_H.xwp>
##$LFORMAT= <normlp>
##$PFORMAT= <normpl>
##$SURQMSG= 1
$$ End of Bruker specific parameters
$$ ---------------------------------
##NTUPLES= NMR SPECTRUM
##VAR_NAME=  FREQUENCY,     SPECTRUM/REAL,   SPECTRUM/IMAG
##SYMBOL=    X,             R,               I
##VAR_TYPE=  INDEPENDENT,   DEPENDENT,       DEPENDENT
##VAR_FORM=  AFFN,          ASDF,            ASDF
##VAR_DIM=   32768,         32768,           32768
##UNITS=     HZ,            ARBITRARY UNITS, ARBITRARY UNITS
##FACTOR=    0.250966925370066, 1,           1
##FIRST=     8223.43324360094, -70625,       -16490
##LAST=      0,             312462,          -276753
##MIN=       0,             -693268,         0
##MAX=       8223.43324360094, 442294717,    0
$$ Real data points
##PAGE= N=1
##DATA TABLE= (X++(R..R)), XYDATA
$$ [...]
23843 -197798 -104020 61792 -50502 -66210 56618 74158 -23942 292901 -11528 -55674 -120437
23832 -120437 35148 257339 -127488 91038 251160 -228819 -83306 42031 -96863 -389947
23822 -389947 -139 -156545 -184509 20458 175277 68123 -467135 133862 -114849 140588 -23035
23810 -158554 -10508 -167934 -58591 -21250 156148 -114723 -32729 -91894 37093 -179104 1741
23798 68507 54626 -236798 83104 -68354 104052 -266749 -190406 233610 -364942 336052
23787 218757 -4496 -71615 52321 -65773 -241157 -2009 -114525 313481 -83043 102514 2028
23775 210675 103017 -24140 -232512 190535 -282613 -120794 9352 -136985 3642 -159859
23764 -233298 128157 -64855 48861 -4070 -208238 106695 180228 260379 -141608 -25667 -7628
23752 -59600 -173287 -109492 -19534 -185334 150458 -143315 74242 211702 105120 342023
23742 342023 -122917 310708 416653 -252153 -10599 -64542 -150426 -418584 125492 -184150
23731 -45289 -276737 -259193 -270446 54103 11586 -151370 -172150 89825 -4048 -292943 -52654
23719 952 299853 -97369 118616 -120186 55278 13317 43151 138002 -114790 -297847 -27652
23707 16259 9021 157603 -195506 -164532 36075 -97994 -327261 111717 -248051 201985 -33231
23695 -107128 -172164 -316589 -16568 157585 185075 -1832 -149048 43431 -21718 219248 -138838
23683 -201440 -153285 -25929 191751 20537 -265508 -280630 -63951 -53240 148004 -285251 -280532
23672 -280532 -62549 -187736 -18075 -196024 -179169 -108255 173433 -73451 -47922 283320 -292926
23660 -225740 -3159 -9515 -326287 -412504 74266 86460 -96923 263323 213571 -43949 -314020
23649 -314020 -158119 -4340 376711 -110158 -46719 -156357 -216706 -17578 253809 91920 -117958
23637 -260245 -13780 -139712 53111 -359759 233886 -226585 252203 144053 217421 -70248
23626 112596 -36809 56115 -136598 128676 -83822 -22445 -87922 15796 -110108 -61199 46449
23614 138495 -8866 -44611 99269 22595 -31978 97665 -3157 102966 27120 60592 -418365
23602 -89152 -66371 76214 -51887 68076 -204429 -72133 441 70296 -38098 -32950 -331155 -6036
23589 -22917 -70180 285337 -193669 -236294 9028 143049 -110983 38453 18199 -149182 106696
23577 8134 -120648 266867 235094 -211313 218059 50860 76301 -144690 -4628 -137982 1490
23565 43705 14996 -160200 3133 -72206 -272654 -21101 -144483 -119889 -59669 -49546 -21306
23553 -151642 131727 292773 143099 86485 16234 286654 -254187 -24317 105738 -320340
23542 149079 204714 -167408 145789 83990 -108706 -93807 -92681 148493 -272530 83076 -145724
23530 -104706 208942 -25248 192098 174322 -388098 103230 -119377 74537 171432 69497
23519 -143939 -247790 106644 9698 169943 36136 -2946 -34848 -17157 -131634 -55875 -198458
23508 -198458 -108519 -22316 -47299 -146163 371594 -35176 -32130 -270406 18952 -115445 -39208
23496 149481 17840 -307263 -37486 -105933 -102311 -43247 -65514 145368 -126843 324153 128981
23484 116952 -331278 -259119 -14632 -72968 -39399 -118678 -352721 -28322 49114 -64893 -143393
23473 -143393 -45777 -260230 86763 -118605 -75068 13252 -385841 11536 93172 -87434 335583
23461 -373261 321908 129225 -35004 -162654 -12938 139548 208676 128779 101071 -307653
23450 -119885 40039 299503 -50569 -155829 -288406 437000 -128772 213775 -76790 64875
23439 140097 -148622 -118776 27463 -19209 -235155 -336523 -145610 -245931 -210519 138098
23428 215814 220980 -130083 -262295 75289 76023 -33492 -95692 -10287 -141047 120302 -21291
23416 -72035 144007 -36941 729 200352 -85460 200622 158976 1010 -223961 -33532 -154943
23405 -154943 -99737 -178309 -60220 -222614 -250947 -12686 -274818 -18093 -249896 19734 -75643
23393 -137389 -139251 -207553 -40855 75539 -221986 91998 -250649 -323294 167529 -207622 -250080
23382 -250080 -169138 -77008 -48626 -84930 -128685 17144 -23976 -87486 -21788 194184 -73185
23370 -101888 -132604 -156617 365882 -111633 28654 -99443 -111496 -29254 -389329 -36513 122831
23358 4117 -339486 -165951 145665 126653 163049 9318 4191 17773 -15716 -62995 229836
23346 -119117 -69949 123204 -251772 -63932 35914 130556 -125412 -209123 -53889 -69870 -463805
23335 -463805 -93106 68929 -130609 128477 -149346 -212203 42636 46979 -97237 -329131 -182534
23324 -182534 -183253 -198886 46916 -19377 7332 -131867 25601 171677 -17708 33597 256739
23313 256739 18143 -41530 95149 -116133 -114532 248155 100682 115803 133517 -156839 204681
23301 -10426 -40455 -170783 295963 -60415 -64447 -38390 -98970 125982 330411 30640 190562
23290 190562 8734 -27828 101576 40573 101888 293210 107270 25575 -92008 -36083 -50706
23279 -50706 -96650 -143121 -127656 124240 220409 17879 -123027 313245 -123863 -58582 -85163
23268 -85163 -59844 50665 -77662 -536168 -107474 -9951 36009 -94925 -315449 114181 -85461
23256 -279592 -159606 -84939 -40824 21685 171876 -8506 -27011 -224279 -224835 194240 323347
23245 323347 224415 -222767 41727 113979 24845 192067 -88643 -151710 35213 36183 -351688
23233 -29557 333863 -257989 319751 186 91998 224595 -113415 188429 275195 211281 -1286
23221 246784 -129805 -94124 155955 -413155 34534 -70810 24918 152942 11666 480885
23211 480885 -67344 375202 -119181 -96632 -40497 21452 141927 34187 60762 86844 -33123
23199 -101904 196600 -362324 -225237 351822 36751 100358 -68832 -46256 -112622 107045
23188 -125688 -3986 -112698 -246311 333291 230565 213697 202753 -127263 -190974 -82565 24123
23176 913 -135355 -122906 109862 204742 -223172 -136604 64649 135324 46043 131321 42362
23164 33063 231780 166310 -74293 88468 28458 109448 -484164 77893 31605 -156261 -66643
23152 214502 112346 -452710 -185687 -110321 -175902 10411 -24221 -360545 -74287 -15613 -191607
23141 -191607 -380049 248959 -280618 104981 -237000 -231869 -11136 10983 129349 86873
23131 86873 -379001 -67890 9098 -85904 235620 64609 -23762 136286 -257238 -55113 247164
23119 278683 -103110 167050 -294537 -287206 -274898 146245 -245571 -55631 -136803 -31617 82352
23107 256892 7444 -155727 -33607 -151945 -108142 63160 13421 59767 -101857 48574 70308
23096 70308 -47120 486716 -21434 -96798 -177716 9095 166323 -80507 34011 4746 76481 4440
23083 -24030 -130632 -126113 -126697 -97237 -313695 -198021 21496 -62701 -295895 334770 -367486
23071 51736 -27218 214043 -79565 6981 124751 84121 -251532 42366 91622 121080 -150612
23059 -68410 -29071 31090 32968 21493 37205 210139 -63213 -48337 311795 116231 -119714
23047 -353370 -41969 270522 234975 131236 -27482 -331200 -37025 23149 -185404 135564
23036 156905 -56480 56185 96240 1075 -39469 -91767 -152480 -230402 -151203 16801 -243935
23024 67888 117366 -92309 95631 -318945 122522 -97174 -89663 -71516 -93996 -301599 418655
23012 -298652 -170746 191433 31914 185012 -368151 -240434 231700 330629 -139905 174794
23001 192891 32728 -202957 180547 196502 34518 -73180 106216 -188671 68548 -42796 -194607
22990 -194607 -114923 266012 -240258 430627 -277988 30512 -457019 -15352 85915 279460
22980 279460 166421 -408121 243739 -14287 -189722 -469836 75693 33176 -263470 -20743
22969 205485 233417 -52488 154376 -155509 85008 -122551 133809 27474 323873 163508
22959 163508 -135433 -121596 104344 -277904 201428 -260362 99190 -205209 -473817 80268
22948 -42656 384519 32822 137642 16258 13334 -125528 -149374 -4090 160149 51805 -229038
22936 -191404 -136294 70812 -161745 -350353 72311 -367260 -167603 7741 -123826 -184643 -143945
22925 -143945 238198 116024 120269 -127748 91386 113910 -69567 92800 -73489 8703 115723
22914 115723 207483 -124093 89947 34868 131638 259684 -46462 -10578 361476 96698 188338
22903 188338 -46379 -357774 136495 -71885 -69283 175547 164581 52004 -137241 274648 -128397
22891 -270823 176643 -168275 10582 161236 75386 -22440 -58699 56246 -86432 74579 -36773
22879 -271002 -113333 -107358 357342 182886 -38906 26253 11453 103422 -240316 -28278 -89735
22868 -89735 -73324 -363566 -130212 110388 113998 -294454 195478 21482 -320413 41530 87520
22857 87520 -13121 42828 -101897 35574 238934 146462 101193 66123 190654 -171095 60593
22845 -145687 -74704 -165939 -145295 212355 15933 -176931 -269946 -6776 -64416 27722 135573
22834 135573 -40190 -379600 1188 -18195 -426994 159242 -73575 -18366 -20879 -175672 30167
22822 -52892 -164524 73298 67123 -57044 123032 113182 108170 -55299 134241 80456 -108670
22810 -158545 -14332 262357 43278 -30647 -283129 -239170 -34894 134584 -247028 -248842 -171822
22799 -171822 -135198 38358 -346420 -51257 -69979 252475 13506 -48488 -77048 168018 -240199
22787 -96778 -161144 180572 6266 195575 23430 -37220 -56727 -128768 318142 56624 11326
22775 150705 83517 -88245 -304369 -136658 -302782 -149335 -18068 256099 -112536 -224458
22765 -224458 -69436 -169963 32996 -260580 -280155 -39244 -602234 -207643 27602 75640 2533
22753 8204 -1691 -208877 -55109 268395 162911 41489 261278 385135 -29316 329064 -117084
22741 -218056 -94871 -3569 -17077 -3370 -109479 -110923 104812 -25145 -466888 -153903 103037
22729 -82801 138813 90415 149967 -88267 -157145 14637 -182740 89160 -91197 33016 118166
22718 118166 -25929 -254275 -45191 99754 -215634 -85680 -123576 -282847 -40708 -212361 -108346
22707 -108346 179335 3275 283259 -200306 -35652 -176042 -216255 -242130 -143258 -3952 -218333
22696 -218333 -89907 -442727 14449 25320 -54169 81826 -9158 -255524 104703 256649 -21967
22684 -322357 73142 125900 93220 -52132 25845 -343823 50963 84061 -117144 44634 -147919
22672 191510 -179279 190354 235702 -72250 208098 104260 5071 -236341 -72447 -62289 163347
22660 -321433 -6030 -89542 -53887 -95257 257654 371725 122404 -115414 37530 119386 -57858
22648 -260668 89555 -322625 58698 180793 51071 -215539 -92387 205943 221510 48008 -241530
22636 -119447 -49830 -1946 46274 114000 -5137 106860 -55104 78217 107491 -25719 -221518
22625 -221518 20831 -71151 -33050 301148 -86542 259236 33003 123097 -205157 -138962 -173712
22614 -173712 -144414 192762 -65762 59031 -159501 -23278 -278798 -224367 -152518 -84691 -1368
22602 92663 -88407 107801 189129 -6927 -51769 -223918 -125393 220408 8031 -240145 89735
22590 -9028 -17450 160257 51416 175013 -2131 43203 122654 -208824 30196 92732 25929 54610
22578 54610 99242 -64153 147539 -67750 -184166 -14309 69535 -147545 235625 10038 -236910
22566 -78206 302115 -164345 107479 120920 -258284 -194292 18222 94355 -106010 -126800 92950
22554 22693 -103346 314325 -197578 78826 -9356 -159348 5943 36415 192675 43225 -487419
22542 181482 -151634 116417 -119312 -180188 -259239 197334 -93331 -112873 167884 134827
22532 134827 -181780 129580 -25024 27637 95128 136721 93759 123584 172372 41373 -223651
22520 -105572 -139053 -254430 -154963 -238578 26099 274815 -46770 -189120 -117387 -73805 -119991
22509 -119991 -329362 -81623 -176992 -193045 463561 6637 39798 -181514 5762 -170544 157123
22497 145250 68374 -3163 -156919 260126 317267 65844 -54183 3983 155866 67467 -256829
22485 26258 -71430 -95077 134180 112848 161596 203153 -322584 -30975 103504 -56058 -69567
22474 -69567 -122037 -224047 -430577 267574 -109209 -300157 217054 -22005 -87970 120959
22463 78974 193157 238657 78139 -337892 -32837 -164099 77256 -63339 79123 -141652 -137564
22452 -137564 119034 -216396 47570 -173790 17058 -175507 -12815 -276351 -157984 163888
22441 -273827 -215203 41750 41046 55202 167040 -34441 -3071 53549 165694 52772 -10189 -83043
22429 -83043 -416420 211142 25174 120450 -119759 149707 -84665 -238350 -174281 154378
22418 -21602 -97587 -77794 110715 83022 135158 -200079 -35006 245176 136642 27020 -80874
22406 52432 -129140 21687 54476 -53567 -72868 4041 161884 -263681 76692 -123334 221965
22394 -94446 -443640 -9897 199337 86418 -100516 -265718 -123025 -56382 116083 -333121
22383 405204 -60956 151061 -108393 4930 -68148 -168049 180929 -259145 -136024 222819
22372 119255 54301 90165 -29885 -36074 167850 7840 -397680 128101 -322746 225301 -268660
22360 -146768 4873 -372628 -113653 31281 -81932 30285 534 -177157 -230046 201294 -274902
22348 -208764 -128334 65161 235783 83000 -183671 1813 294235 121897 9475 -163813 -70938
22336 125730 22614 -118074 339180 -121042 -5663 -176887 150392 -149861 -251380 -302568
22326 -302568 226145 94736 54325 -305724 -421284 -203708 290998 -245057 55014 -74964
22315 -40783 -23650 -68439 -35542 107084 -68183 141040 -165225 -171091 140692 43845 -15029
22303 49343 -59996 -207910 74924 -52209 -212370 -150337 146848 126809 -153614 138456 247378
22292 247378 -15079 160110 137887 16256 10523 -19868 147013 -25421 2282 -206124 -209399
22281 -209399 5353 28423 -47670 -86538 101006 -21794 48885 -14266 -218240 -158602 -179172
22270 -179172 59611 -154017 -90031 -105323 -263795 56254 1800 -135898 68284 107159 -114231
22258 61603 244881 95082 -272965 -121466 25807 14368 83434 14219 -108345 9610 76633
22247 76633 35964 -51745 61239 -98554 4489 114423 199631 162110 -269920 123276 24692
22235 3569 -86149 -161372 293297 -91646 -223748 223782 2631 -198345 -274646 -281220 -90762
22223 -163657 -42715 -304042 -12679 44680 -108394 206516 119557 -148235 -87178 -351506
22213 -351506 -83947 -239400 -116808 53122 -103442 -226134 -308050 -366846 178409 -211839
22202 -76146 -197086 -27726 145597 66450 4240 36097 -31068 -30960 -110047 -66876 134667 -91921
22189 -106059 -36006 -74328 -21417 -142219 -384123 -336489 -234602 -93558 -232428 151971
22178 -51731 -364005 275802 -119044 -73806 -178139 -126075 -22144 -202405 -33520 146815
22167 -397267 60843 -37667 10913 -193097 163988 101753 -124523 129480 -1382 -79812 -178855
22156 -178855 366516 -46239 -61511 -121457 -45067 268880 93124 50789 -133730 -231931 41056
22144 -204253 -108517 -63444 37689 -17401 -353901 -22008 183584 105842 89369 -227965 293683
22132 344938 36241 -247396 271944 -135823 -66815 -435926 -139883 217707 -11172 132996
22121 206294 -138985 -417496 -323381 -11411 -314342 5435 -215242 -26724 -366924 107087
22110 -222395 311357 -130584 -83617 220882 -149102 -422340 -150924 26218 -134841 -224264
22100 -224264 97212 161423 -42609 172262 3799 306114 354293 23748 -56257 -110892 122907
22088 163276 33709 22847 -143317 -43183 -227117 105891 210893 -97311 -100373 118491 -63447
22076 189056 -35541 -142335 -110756 13603 -124834 150309 206386 260204 220593 -120463 17755
22064 156989 123310 71532 37154 -126671 8351 -232297 -1161 138819 -239755 -177611 -187988
22053 -187988 263485 -94851 -185783 -221996 -159646 194276 132801 -29600 -86656 -303405 35864
22041 435090 87186 -122168 -280621 -293216 343932 91505 83256 149803 -33974 40269 394281
22030 394281 -218482 50741 80484 -140180 -217318 -147283 -192539 -133203 -119674 -97100 -17207
22018 -328851 75248 145804 -24710 207605 -10899 193888 52839 -26237 -143617 -117440 -194104
22007 -194104 127579 -84419 79239 -228152 -136322 49537 -257195 16421 -419421 28857 7624
21995 332825 -114760 2107 -267128 -55540 -68738 -75673 36459 -101330 22968 57081 -80475
21983 34469 -303955 160032 28561 290269 -113078 -76426 -251376 -46621 -8048 -128004 105419
21971 212908 53606 -181366 -74468 -216254 -53560 -342023 -81427 -65674 -355517 118808
21960 17767 -306569 161241 -285228 104204 -226575 -215634 122009 -126149 -250011 -154600
21950 -154600 4781 -157947 -317686 -296853 -3842 128750 93139 -19464 -68083 -155353 4328
21938 -180122 -241218 25789 239049 -223401 -78933 13800 85642 78345 256293 354790 197847
21927 197847 279691 -46841 218588 -204908 162909 -189916 -46193 -139366 -41695 -127796 -177412
21916 -177412 -153632 -193914 -187631 149837 -289715 -285784 150260 -95906 233713 -292655 -43222
21904 -129061 2642 -19693 -56337 -263603 -111017 -119982 175248 -53157 -91434 -192503 -267600
21893 -267600 134033 151039 -107914 173889 -47094 58968 -163046 -8168 -76331 -41530 157997
21881 -149995 283342 9923 -61223 -104147 17235 33199 203129 79983 -159028 351714 -274958
21869 -95364 -396594 -260388 11074 -130037 -154003 -351073 31896 61922 -262072 148773
21858 -239357 13180 -19843 -138532 -125620 -150538 -13735 -161170 104975 257080 107924
21847 -133346 -216801 -190557 -33441 72599 226291 -53507 -45037 2183 -21357 -201711 -94755
21835 55032 -348664 -69491 -27568 -10384 -267441 92401 -6218 -37308 -183386 -68701 75911
21823 154705 -136148 95589 -358994 286970 -303528 3036 73266 -130369 87327 47474 -35639
21811 -244231 30363 13252 -38985 -128195 43458 -75822 -150440 130323 21577 236263 7579
21799 38185 -70092 249782 -83909 205351 5784 45128 -37353 -25166 -88899 -84842 -212140
21788 -212140 -67208 206837 -171605 -56314 84114 47943 49410 -53266 -270224 33051 131146
21777 131146 125032 67589 109115 127400 51595 -207040 -81717 271749 -263323 -140104 107501
21765 -212064 -186227 -65680 -87053 -85927 -206316 -125315 -188700 -25153 247133 238141 -92354
21753 -98034 -238557 -394721 -294124 -135148 152436 291201 46585 111902 15199 -113376
21742 1849 -76982 24555 -192097 -302895 25034 -234757 -210037 -38425 -286607 110887 -14778
21730 -342123 233196 187614 -149116 -150728 -290185 24313 -201277 -124197 -114470 -68626 170029
21718 -306038 -374218 -155102 -30174 104101 -94371 28283 45748 -92703 122931 17332 -365102
21706 127591 -354990 5539 -64743 54209 19481 -9810 -22489 -211066 -353732 -33824 -130412
21695 -130412 150299 243621 11871 -118219 -4434 115718 -58690 10635 97420 208929 94188
21683 -237625 18704 250015 280329 -116110 -126897 -58941 183816 -281811 75979 17834 -360192
21671 -407202 -46020 -3324 -230868 280119 -418470 215095 219019 -69533 -120148 55330 57851
21660 57851 79937 -193633 -206897 170094 17595 -294078 17022 -77624 -125054 47497 47063
21649 47063 -217004 5646 46090 -34763 -155755 -54705 82910 178134 102662 216634 62355
21637 -205349 18176 131583 20959 -92306 -318091 170473 -239424 -46884 25694 -4456 29324
21625 60151 -178054 -115178 104391 -99017 256207 194259 -206773 -14682 -42073 -88499 -133224
21614 -133224 188574 -65799 338157 -148890 -49702 12747 173106 131894 -27676 363770
21603 398021 -135505 158353 -65976 40937 -11797 -179365 -59092 399881 -159463 145669
21592 -295711 -23822 84701 216895 10596 -111359 48596 50482 -348321 -62359 8746 -251292
21580 -138788 -46589 153807 35264 -218141 -35216 176652 137623 -26309 282267 130480
21569 61127 55733 87490 213674 101018 89692 -226623 -231973 -113718 134790 -38912 -117405
21558 -117405 90619 124839 -311162 -21924 141069 25192 -166768 -106639 188152 26692 -298626
21546 -148311 -255489 -483012 -76247 -266785 -39377 -6525 -207419 -137017 -233749 296097 -59000
21534 50960 143413 75040 107250 -186512 90206 -17122 -86322 -27657 -36380 -112460 -252345
21523 -252345 95064 256244 -203328 191778 5891 75418 70220 -44944 -111332 -135151 -222251
21512 -222251 -16157 -109560 326005 65283 -481363 -330474 -222734 187061 -120732 85476
21501 -242986 63895 -280886 16895 -386131 -222481 -147734 -30031 73813 -134679 -17596 162107
21489 -153090 -51259 8808 -35610 -62811 -384879 -82128 -125388 31735 69356 200891 -173903
21477 -213946 141772 -119856 -65061 10449 -3283 -50323 148432 -32520 156674 -101973 106558
21465 -87538 183769 40728 -68212 -377022 -124189 -15659 202558 -94858 -209722 -3045 5742
21453 -90654 -78437 -194387 -79866 -126045 -58024 -327410 7033 169844 -29308 -2874 43288
21441 -147474 59247 201537 250954 323505 96744 447836 498720 286589 447218 421498 -125083
21429 235177 77462 85717 139552 199889 -112178 256451 95334 107438 -22030 216563 -11578
21417 1336 -372265 212955 -3687 -86521 -295175 -154871 -393817 -203667 28329 -111853 53807
21405 140068 -343882 18914 -214260 30045 38654 -124470 -333728 -237350 180494 -132472
21394 -109439 -300527 180123 -207990 -93135 -68442 -97081 144671 124000 -45444 -225920
21384 -225920 -80779 -61650 -129727 -5001 27630 -245718 -184779 55496 121887 -265236 -81458
21372 197187 -257560 -117786 163429 118043 -121137 -271175 -73145 -207165 30732 -259025
21361 118428 -117480 -10717 -336178 135413 -120203 -36318 52447 305544 -53099 -217910
21351 -217910 -202239 -170573 162233 35783 -202033 -298466 51157 -83935 -37024 -130586 -278293
21340 -278293 -257112 -11377 366384 -27095 145672 179387 -78739 40371 -373335 177559 -15604
21328 -132882 -162332 -224194 -117861 -54510 238600 -191477 23461 -187679 166049 -37721
21317 145183 189974 -94060 183685 -107691 -61893 146529 17941 100005 -143280 -148182 -54149
21305 51484 -510320 -132056 -34392 -92266 78689 67830 -85354 -125979 -247186 -87368 -259708
21294 -259708 7267 -146476 -158333 -59655 16697 -39278 -48484 165925 -118557 -218769 -62196
21282 -158336 37636 -187728 74184 -35033 80084 -245617 -108014 -115199 -225892 -72809 84385
21270 -142114 51573 -330537 -68403 7063 -85899 356937 150806 -46213 -28080 34100 228476
21259 228476 -155160 -213462 -73531 11514 -28715 -4024 156193 -325845 -289834 81591 6962
21247 254559 -258843 27330 -423154 -52838 28016 135950 152520 41182 -132810 -280104
21237 -280104 194676 41802 -344551 68999 123736 41281 -164948 -5992 -109937 -247358 409555
21225 -266060 85417 -77746 -189694 84642 -104640 199933 -30146 83163 -207434 -116474 220786
21213 -75894 122480 69782 -78335 -23851 24842 125832 -94457 132667 -147518 -124863 -83814
21202 -83814 -132681 -435232 -9025 -32422 -55524 -164442 -249462 81149 -124015 9958 -53581
21190 -137233 147850 -362921 33177 -215146 -151571 -74890 -279135 -146619 -73653 -260922
21180 -260922 -19109 -412730 163883 161368 -99898 150406 -224243 -13352 -283383 37181 60089
21169 60089 -318299 77979 -178320 156467 47767 -21128 -61587 -258212 -229220 -86662 -301875
21158 -301875 -262052 261785 294526 -243421 39314 -124643 -77133 72904 17259 -315702 5719
21146 -47376 -140767 185416 119057 175263 228696 265449 110640 9806 193807 33718 -291503
21134 -215788 -173750 -270910 39594 2568 -32775 -31165 -153338 -6897 -397906 31028 -270149
21122 -99056 1093 -47494 26739 40332 -167913 -227149 95400 35947 113757 -70430 48274 38810
21110 38810 -114010 -208129 -117522 307599 -144346 79637 75336 -80673 -174144 -49757 -143 -57642
21098 -57642 152627 -132021 210330 -318357 -22738 -100130 -449262 -219302 9006 -84829 220255
21086 -2092 -13055 -106142 -139075 145214 253214 162846 -45088 202565 54363 -111778 163312
21074 -162283 2402 -167127 -161371 -245520 121412 -184339 53263 134955 -90058 367984 -149625
21062 -66044 -282271 -83454 -30391 74565 -172718 -194784 -196528 -99316 -82586 -158980 360907
21050 -432081 -56000 -159978 113697 108992 -140340 -63726 -134451 -507608 -15866 -245829 51867
21038 285633 213304 97541 -148600 -336383 58269 15724 -36974 114526 115587 123280 36173
21026 -305097 -58592 -10863 -165436 106019 -41233 215385 -32911 23604 -143006 -52175 -135724
21015 -135724 118222 -204753 9924 -205996 -22941 193506 70254 -472890 -239772 66414
21004 -146164 -141841 253645 165385 228694 209499 -161931 -160142 -166609 5978 57409 -192290 105778
20991 -320766 111119 -160973 -97707 -390648 -25279 273903 -171128 -189550 252798 90638
20980 23612 -50216 -64566 -119392 133579 -226680 -64973 -201999 56622 -184052 63351 -60629
20968 145169 -83927 -414462 -96708 187581 -281378 -28356 -222336 52989 134919 17610 168313
20957 168313 -209517 46942 -72862 -149785 -15121 -15520 74629 -108782 108569 213748 -70067
20945 -378824 -115901 -329317 -318218 79130 120024 346032 217238 -18219 -39508 14484 133159
20934 133159 89442 19768 72282 182298 -198857 121689 -50200 125423 -170530 -340373
20924 -340373 -79520 -110650 111035 312618 -149007 164525 -120816 -208154 -237194 87935
20913 -179449 -54899 198410 181723 -42894 -207928 50751 -29323 -29359 -68763 -48232 -51912 -207915
20901 -207915 -4416 -292394 12743 -197024 -269861 58114 442783 -103753 214149 109778
20891 109778 -237103 16845 178814 213795 -111237 -297563 -438437 -178119 -533001 -351006
20881 -351006 -91622 76819 199310 -99535 6384 -24501 284311 -154864 -262677 -180804 -194522
20870 -194522 -28689 -20587 -362455 43132 -105175 -169313 154064 15884 -139481 -234314 -154225
20859 -154225 -20298 -84456 35184 8059 -50453 141113 -228140 210058 -77038 52091 -337297
20847 -595756 -83648 -144596 14339 197486 -135965 -30275 -149186 -169633 -32483 -107032 8541
20835 -39318 55016 112565 -71747 -131911 40959 -6846 150453 35280 -220222 126177 -158798
20823 112737 45214 153593 -159801 80624 -120773 91129 41148 12329 -283343 -223184 -348973
20812 -348973 -292592 270393 -161517 34588 -101991 -219142 -263898 -27498 216197 -29160
20801 -62333 592333 316016 -254671 -44808 111317 -194564 -168551 -70631 -162891 -198923 -35607
20789 -216057 -184011 26034 -59085 -251666 40635 -291737 114522 -312746 -316648 244977 205079
20778 205079 314188 -136474 -76515 -342528 -14484 -207598 -364262 117397 154938 4969
20767 -68728 -39279 -167834 188526 55004 73767 -101458 -171791 -68802 172278 -164948 120996
20755 -10580 -38342 -159020 -72197 207259 -292092 -39878 -246328 -69288 -260959 -105323
20744 85383 -292018 -49119 52740 24198 34714 -231325 175267 109159 -204432 -142684 -111829
20733 -111829 -130297 186100 13514 -262747 -212549 -191079 66228 -31059 292061 -132577 -65167
20721 -101417 -80373 -188241 83324 -190904 158112 421732 164087 4037 70990 161346 -445647
20709 -56005 -315339 -371605 168138 -396583 -125627 19359 76437 -311642 49712 -111986
20698 -98915 -178383 102771 -400268 156759 85595 -139981 -82634 44569 -95564 62674 -174604
20686 -73095 -202616 -65596 -209336 -5885 226796 36372 147440 -174277 -185562 -123730 -104326
20675 -104326 125129 -49109 -91211 226168 198023 135016 -25583 -208991 228374 -140952
20664 -113444 -300406 -210876 -91487 -102671 99387 180187 -5806 76173 -71448 -42734 -198156
20653 -198156 -281370 -109876 -128080 28716 94080 -92980 352583 105501 -179294 30185 -98683
20641 -37515 -100487 -106026 32312 352036 -30642 -217727 -62055 145127 -107409 -5933 17144
20629 -210523 -220378 313126 -349281 252929 -143391 -95593 -100562 -247498 -100384 129460
20618 -50972 66585 -256757 -89765 -33280 160435 -237437 -160439 -136283 -39216 -237422 -32872
20606 103162 -98874 -63703 -209049 125396 -283934 -200093 -122622 -97687 -290713 -319277 85339
20594 89703 -111410 -84864 -264489 -325936 -21243 -92503 168398 102629 403013 42801 181020
20583 181020 36480 -27175 250414 61054 27836 158251 -171936 -36952 -22362 38815 -64303
20571 79530 -122914 123589 -107019 -30971 159932 205007 -241879 -41379 -295750 109025
20560 -106298 -20175 -274637 10375 160006 -178752 19440 -324153 -26944 -101766 84205 -33248
20548 76943 -365837 189868 -61743 21969 41795 -173384 -116724 -244766 -217719 178270 16956
20536 22612 -98684 -8596 -16969 -114510 -248226 209797 -24810 -254519 -202962 -42358 -128790
20525 -128790 75451 4526 -269092 -121263 264513 -88840 -212191 -179858 -333114 109340
20514 -205207 -307232 274214 -158645 153971 328771 52372 -318521 207111 95689 -80502
20503 44711 -49833 159170 150071 98089 -467361 283394 301533 352892 -60737 82190 -19748
20491 -171573 -114171 -84244 -346834 -87869 187950 -152030 255331 -81910 -213356 35881
20480 -47864 -104516 18823 -169107 -315940 -356443 26620 56734 71059 -216083 58324 -75936
20468 -93187 67593 43949 -337040 -101244 86944 -57364 282996 153601 81832 113048 158206
20457 158206 97846 28939 12361 93216 -170135 -228550 -75280 -201648 -61700 -62900 -232882
20446 -232882 -213357 -23744 199617 -287629 124708 -196580 -45565 -265717 59008 -51244
20435 -40714 -171481 -166859 -196792 122290 -102450 336496 -153730 -583589 113623 9769 -205655
20423 5453 79404 -14836 11712 -148485 74203 120136 -21502 -93474 117351 -82890 -127472
20412 -127472 88100 71371 -43625 194237 -59955 4933 113435 -267283 -122359 524916 -184216
20400 42565 98330 117776 -181391 -328433 -161392 154466 -138589 -102668 -173901 -240773 251404
20388 -17995 254110 9767 -240476 -119829 -201871 240993 -315276 -5769 -345578 -159335 134034
20376 263426 -38768 4932 97955 27600 37650 -435651 -65713 -212 -251237 -45433 105634
20364 39040 118462 -177349 -91555 -202698 65659 -479156 326756 -183862 113511 4035 111185
20353 111185 -192064 -21419 158687 -20108 -127343 -95768 -283958 -303100 -203564 -112616 -279823
20342 -279823 -37592 -195590 40383 -162385 -5804 -140580 -37507 -369532 251164 109952
20331 115691 -24163 -15735 -246148 -348572 394115 -225254 12037 -72126 -71969 -139065 12856
20319 -59113 -41571 -31936 -65532 -158576 202672 -229178 -180803 1662 82257 -263237 244524
20307 -131195 106079 -228904 -66563 23395 -152587 13875 -71774 -27693 -234539 87961 -286482
20295 -113500 -166867 94550 -188190 -109585 -334364 -311 13012 283770 3080 -142197 70825
20283 219478 149558 -136205 -31033 -197740 114127 77136 104809 -185222 67652 -390965
20272 27871 -148341 27583 -273123 103116 -230373 -79379 306373 241967 -56167 -199544
20262 -199544 -158887 32850 -1458 72459 -259965 -78330 149804 -55662 -53200 -207095 74557
20250 229794 -374865 -186709 178710 -211070 -261065 -474898 117184 -45952 -46103 -220253
20240 -220253 214968 -109530 -49428 -193315 -142511 106518 -172308 -162293 -50203 -245759
20230 -245759 -170178 -45963 60152 -76346 -142360 226579 -106578 -20676 109054 -25419 -145446
20219 -145446 -147454 -329771 365690 -152950 -56770 -18188 91881 -33423 -1434 84146 33756
20207 -159616 -429041 -158210 -231455 260758 308555 -61735 215445 -228711 97634 -126041
20196 -49628 -199168 108226 -136346 -146457 -151912 -31010 -111997 -75079 26382 -240326 52941
20184 -141828 -327422 18469 -488129 -8741 -48122 132994 223581 64831 -189326 -70224 -88605
20173 -88605 103683 74414 120855 301515 -383797 95027 156563 207317 -211837 -334241 174558
20161 -179922 72191 -70126 242498 227938 -67463 160828 -120528 -268162 -46359 -186449
20151 -186449 -217081 64914 -5109 -196575 -114131 -228449 70116 -22380 -44749 -62818 -148297
20140 -148297 137516 -116546 -22540 132075 -6350 172438 153918 77991 -45126 -129418 135935
20128 119036 -66849 5295 -108553 36820 -137317 298651 35373 162389 38823 -45277 209853
20116 5002 -48371 -27845 -26126 -122182 -184146 -181245 -320141 46290 737 79273 161171 -138304
20103 -278023 190964 -132396 -33974 -290626 -36419 -157061 -35739 135083 -196343 -69111
20092 143539 -61642 -376471 257733 63059 169549 155722 200194 -154213 44613 -227488
20081 -52445 -243393 -136731 -128233 26061 23974 67791 -257495 261189 -250142 -37625 23146
20069 -228535 -47708 -347103 -253722 5285 -74267 60764 51261 -323402 118004 -177515 72761
20057 -12933 -111577 211811 74288 16452 -182688 -173246 251685 -122679 39564 66337 141196
20046 141196 -260262 27654 101990 -152762 154106 -367994 -217340 -86349 -421671 28100
20035 -163738 -235298 -41784 -106217 -11634 -216392 32605 -140792 -176566 277400 -239932 -97110
20023 180341 -102210 -70334 237646 18543 -73760 29475 -16441 242039 447473 -11894 -9870
20012 -9870 -121540 -179171 83501 -9028 -273405 110083 -81143 79011 -33078 -65812 -156859
20001 -156859 67906 169233 -93040 -174229 -78175 126326 -199498 -224220 88845 -149938 -129628
19990 -129628 244803 101642 -33573 -68427 220077 -350471 -196628 156196 -9718 43786
19979 -110436 294673 17855 16533 -44734 -277064 -121522 18741 -297056 156988 155211 -151553
19967 -3693 141114 -202636 -82784 36108 -188598 -1634 -46792 -134685 168111 106010 -160908
19955 -102586 89368 -54946 142791 -15944 -310688 132772 -13986 -142721 -579789 -292530
19945 -292530 -267115 -283236 -52805 -98088 -32351 -18434 -220227 -335648 458926 183937 18931
19933 120030 -112040 22340 149961 -54125 -11950 45256 -283336 135184 -114093 15130
19922 -248841 -144480 133838 -73089 -130646 -140889 -244373 58409 9032 -344723 -24927 -86033
19911 -86033 50381 251407 225961 -42522 -175339 58286 239031 -172484 117977 274 58811
19900 58811 -320288 273833 14178 -133214 -219115 -43647 23268 -309661 96317 -94220 -185413
19889 -185413 -155600 114928 -30206 -59625 62996 -228240 112633 -318407 -78143 -52985 168455
19877 73327 -78706 -60939 114968 -52685 38502 222004 79451 -205665 -242765 26674 -41132
19865 -19675 -68540 116647 -135649 -33225 -15938 -133870 -300796 -123743 -14155 5944 -15881
19853 -182242 -155064 -142460 -94189 63121 43226 -46200 -89545 -199529 -102046 -197693 -346367
19842 -346367 210652 -101452 -35154 38590 -197720 -304540 -146443 244586 79169 150015
19832 150015 -130370 -15240 -5004 -131897 -156450 -359380 86930 -1715 -470437 139903 -67880
19820 -80322 35103 35613 78013 -173219 -131887 -83162 9321 39922 -240099 -114004 -123394 120938
19807 -474897 -82041 62252 -133188 22545 104973 -102066 -313559 12834 267983 -3608 -77949
19796 -77949 -61458 91354 142502 14453 -5410 -249959 -74707 -399299 -386244 -235614 -210033
19785 -210033 100083 -149430 -118431 -13906 -236917 101657 82029 -90605 -11688 61325 -98598
19773 48106 52257 -192748 354398 -254124 -124846 -286657 62459 -49223 -139929 -167354 -6180
19761 -55674 -24853 -46659 -168146 -19981 106992 -223416 258140 409513 -440489 -473331
19751 -473331 -430096 33608 -125473 -145680 -7705 -170758 -81730 35794 105865 177190 -160472
19739 -19804 -119378 -409637 -130222 62942 -16374 -136834 150221 -141610 -356371 -20225
19728 -94903 19934 -18138 -47817 176371 -36962 89134 -35286 66220 144405 -160603 134941
19716 111778 112168 338554 122470 -494861 -231987 -23451 3054 -111587 -15873 98557 -238567
19704 3430 -81382 151976 37979 138290 98240 -384760 205219 164538 -46728 -105344 -292908
19693 -292908 13314 -108616 -60399 8240 205828 -77856 349392 -28489 155907 -43449 219686
19681 281155 -127155 129468 47043 -60408 -228503 32152 45664 -84027 -106240 -39494 -48017
19670 -48017 106495 -16386 -17875 172330 -123324 -65831 -21079 7269 -152386 -139242 -252431
19659 -252431 -111037 -77487 -214410 -65568 -217901 -443404 -49500 -319130 -283439 -36067
19648 204488 -58312 -100984 -105010 -104300 -109709 -65042 185106 65483 24814 -107414 344011 -388771
19635 50194 -127204 55165 -210617 -170030 92716 30840 41785 63634 -84740 -22445 -89188
19624 -89188 -268538 125206 -346522 -81651 331231 -1212 -62741 -95766 -151045 -8629 64896
19612 -282117 -1684 -187326 62753 32767 -36106 115740 3560 -71474 242243 -204890 79922
19600 -213939 -301403 -41256 -326791 -144102 -50930 9100 -225563 60094 90288 -148321 10941
19588 2664 172536 -137595 -412870 308398 -213630 -323777 -244346 -106554 -165001 206900
19577 137047 -4259 370158 -430997 140608 236520 178396 -220728 -147689 -311680 135837
19566 -4952 37300 284467 -4437 -112743 -23058 -155587 -33244 -460084 177267 -17126 116108
19554 -230759 140026 -462935 -18784 -110773 170954 -141427 -142308 372597 123097 -200674
19543 -40066 192441 -312246 -13464 72460 86568 164684 -149869 27884 -378073 -40940 -105298
19532 -105298 103225 65897 -40961 -209657 -341039 -38868 -166208 286979 -179061 28629
19521 258718 -231177 35781 -216012 -151564 300011 -160032 152784 -129726 -146725 -61545
19510 -63408 -287040 -115099 -134832 -72902 137126 212453 -269378 -199332 -48108 31028 104429
19499 104429 -35974 -86641 228945 -24994 -208317 -97242 -247416 211039 -57931 -130869 -197623
19488 -197623 87986 194176 -141466 336828 43646 89385 -20237 -190311 411783 152392
19477 -272102 -99989 -115256 53038 -4162 -91392 260550 -278488 183991 -124919 -202747 95224
19465 -70448 -328172 -132759 -158236 -222341 -82184 -65611 -237101 149957 -345602 -87699 740
19453 28559 -104721 -263246 -44671 -175477 2636 -69110 -267479 -265077 -10481 -300035 -237712
19442 -237712 -122390 -129656 -325298 -214136 -6654 -76326 -74864 -128992 46465 -20242 -152872
19431 -152872 176153 232716 -245983 33998 155283 2546 -230689 12691 109123 -156473 -291604
19420 -291604 -104836 174610 -15167 266781 -28670 54426 -68543 140563 -31121 -132754
19410 -132754 -121282 279563 150466 -51160 -213574 -20504 163269 57796 6108 -114547 184920
19398 -128896 -256989 58738 -122300 -312651 -169958 180328 -139856 13918 -143952 46194
19387 -194137 -104013 78269 -150774 1122 25974 126378 -116074 -101894 306105 -442984 -56799
19375 -115935 175460 -27528 98223 -147051 -180965 98440 -261948 -133218 116243 79027
19365 79027 20598 140625 -52807 -72236 256753 -261395 232740 -51268 -157863 -113476 -29589
19353 -114997 -70659 30635 -402014 38121 -15878 -11488 -134329 -274976 -142688 -67119 -210212
19342 -210212 142155 -20126 79269 -42474 -46360 -31062 -131335 62725 -177038 -51258 236789
19330 -14722 -236487 139220 -88310 -250703 -82367 -269667 -170455 -117154 -218328 -342109
19320 -342109 98089 -344776 103156 -213947 -66817 273040 -175431 -29533 -1333 -189406
19310 -189406 -73761 -265358 -119099 -480679 -178906 182825 -77029 108893 -171031 -29093
19299 -101462 63636 97552 -81857 -199847 -149676 -50075 111561 -128595 19119 94573 -184373
19287 97969 -328589 -165698 -129005 6027 -181168 -460826 192918 198813 105180 4782 113082
19276 113082 123696 36782 43903 156698 -195434 -64188 -37323 272541 -143633 -540906 -52035
19264 161084 -347246 -411974 -374536 80081 -71174 -233234 -357772 272447 74868 -175075
19253 -374920 -255752 -309621 -183159 55690 39543 173892 71767 -93766 54139 132399 -24548
19241 93603 9926 -406695 21937 42576 -232819 442344 -222764 -9887 28244 78226 -431610
19229 -173079 -192760 292095 -305371 245677 137313 57166 -151332 -226820 11158 -206898
19218 -301845 -236362 -167282 34526 -52487 -65924 4680 152464 -54571 -37360 -241196 -66837
19206 -158774 -131977 -24439 -67398 -73358 19916 170080 -245652 -148549 -278690 -32979 -211247
19195 -211247 -107742 202547 93606 17048 -22032 179803 -77433 -250896 -70269 92887 -168523
19183 -24405 -22543 -70455 -17391 35869 -81871 -185630 -189738 198012 117650 -136833 175935
19171 -174891 129432 289320 -114703 -150827 84 86666 138337 168096 -335001 46805 -192218
19159 89082 -271456 -184254 345451 -115014 21981 264687 -143496 -176100 -172026 -240318 -138562
19148 -138562 -141030 128502 -79198 -38471 -86263 36465 -6339 -256511 -28986 -382791 -218199
19137 -218199 76306 16128 174785 -343626 -231188 -66217 124237 -139755 -74288 -23099
19126 16261 10832 155267 71989 24651 -100832 8517 -142544 120879 48775 46350 -1580 -275236
19114 -275236 -97407 318553 76967 -85501 -76160 174000 -241939 -406580 -32779 -314414 91903
19102 35056 -162711 135218 221791 -423088 -128976 28240 -42899 -20651 98506 7648 -343277
19090 92495 114932 834 -291097 -188014 -83597 -155095 -154952 -9729 -21409 -261098 11815 -298549
19077 106347 -173756 -240947 -77778 119367 376013 -76647 -421651 -113390 140114 -102754
19066 195063 106053 -120486 -208498 -150196 -116404 -556967 -18319 -39745 -282090 -169457 -176847
19055 -176847 -121868 144801 -122390 25944 -52853 270428 -123689 39188 109666 323490
19045 323490 -171322 209164 61294 -113929 129868 -66811 51619 22747 -295642 -8221 -22340
19034 -22340 -24173 119048 324931 -167711 128920 63849 361901 -195476 -15994 -20065 69930
19022 289033 -106394 121908 -107949 51499 -82049 -102009 -407637 -217497 -134877 -338154
19012 -338154 33653 -106535 136045 258885 105546 -341125 62698 40727 -177176 118080
19001 -57081 -237475 10773 -177816 57609 -211185 -144741 -250240 144953 -179099 31557
18990 178158 -173934 27366 -307558 -82917 -106432 -177360 -219176 -257314 -298358 192743 14352
18978 -13354 68902 6037 290397 -12051 147903 206725 107120 -119307 -178825 172713 -391166
18966 55303 173164 -71262 -155745 37543 381267 -150480 61934 114449 158503 242137 -317091
18954 -38509 6785 -263783 33836 42669 80067 40233 27031 -71982 26750 -293627 -59793 388260
18941 -287891 -21267 -57080 -168556 -61362 294520 243251 158734 -79391 -341606 -144053 112912
18929 -127033 -122321 51728 -194172 88488 153019 -157654 -48092 -44463 175504 160453 57712
18917 205450 60375 -59560 -143448 -208836 4287 -120033 -77409 -162874 -429642 279874 176926
18906 176926 70955 228581 -209494 12593 -177946 111366 -154567 -26645 -201823 -838 -154341
18895 -154341 -27622 -29117 41567 -327929 -212751 185006 -114748 217649 359478 80751
18884 -5547 193132 60599 48640 -68594 -292596 -222762 21772 64574 77 -248796 -211325 -190185
18872 -190185 236905 297631 -153665 150650 9641 134598 20781 -271062 303227 -130036
18861 -120695 -178814 -117579 -241517 -67367 -169090 93456 -55299 54298 217903 137841 -9462
18849 151985 -151368 -295260 186052 -43370 -43983 60717 59203 154429 27395 -241184 -257052
18838 -257052 -273555 49354 31832 35015 -5767 88495 141896 -195036 -277505 -68986 254979
18826 99009 -104415 355157 -253618 -29257 -6466 -83703 9284 155352 -272022 -10099 155862
18814 178681 170734 -124869 130163 254777 -17125 35423 278779 127440 26760 -203347
18803 39601 -9153 -55543 -43846 -465088 -126990 -37850 -133349 245605 -318258 -23039 -285470
18792 -285470 -272055 188671 -20521 5150 110757 39881 -290985 135381 -49396 92421 206611
18781 206611 -62659 128081 -14735 -144237 -130110 14045 178254 -34836 -197692 71542 -317490
18769 -141704 171197 -218334 154820 51977 -104685 -271336 93032 120186 -420511 -27468
18758 -115327 -111830 -64208 222794 37083 -51555 -105638 143329 389626 -20485 -185555 83902
18746 -328379 -76965 61103 -256475 -309493 92181 837 -185647 -198399 45907 -59567 -86054
18735 -86054 -95660 55336 272899 -28932 -125027 380268 -95641 -170673 -251076 72249 321875
18724 321875 78 -211680 -54235 -87607 -121936 -42405 -88100 -318497 143054 82677 4322 25506
18712 25506 -142534 230406 -295235 -182763 -260808 -232601 -78937 -126555 78108 434038 -219019
18700 -156679 -125583 -45548 -56857 178371 -345047 -106788 143723 -77395 -275594 -70743
18689 -139851 170230 -273780 -186880 -254340 244212 -111340 37127 75444 307025 -9568 -87007
18678 -87007 -49806 -229038 179297 -77523 -164984 26412 -234206 -37834 -177529 -274004 154411
18666 -15174 22774 -177938 22637 -374664 62920 388452 144584 145036 -104768 218035 -373822
18654 37946 -15116 -14281 -32948 -233920 130053 -27446 -89640 -191872 262660 -207175 18959
18642 987 42301 150499 -9178 -111234 90584 -118400 -97472 -269962 -123446 -279629 -103777
18630 -19164 80410 237949 -58297 -96106 24975 -107097 89293 175234 -38399 -35081 61382
18618 33984 -17890 -14689 -333720 16767 -95656 55247 -139324 -122075 185790 87347 111649
18607 111649 -38087 118179 -18068 -12458 -125231 -189109 -214451 179991 -22608 -119929 26524
18595 -381258 34816 158658 188723 -96007 138381 -205786 -181238 -13425 72242 4483 1067
18583 -218596 -100398 -157403 115501 -309340 168760 114795 -129543 297618 -12078 -4991
18572 275875 -106333 -3770 150106 310452 188507 -344011 -190047 -250365 194531 -277089
18561 -319627 -81217 -59877 -188654 -362342 66242 23347 -150865 -115890 41400 -31432 29345
18549 -263076 -232769 179535 396 -148472 254764 29226 -2295 74891 66170 -25469 -332591
18538 -332591 295178 -116684 182780 -258581 -155161 -205582 -55260 -113487 -231537 -119141
18528 -119141 161684 -63553 -62125 -174213 84491 -218101 -44518 81997 -150435 -270 3913
18516 164462 -430454 -1258 -199751 9312 -8166 -66011 -211830 17967 61135 13219 143251
18505 143251 84285 -45327 -31307 -88248 -112266 -166456 -334358 -325353 148232 -139144 -342484
18494 -342484 254126 -103398 -138385 83570 -85953 -227614 -57955 76854 160447 -15729 -208317
18483 -208317 -135881 336266 -145282 -106500 -185432 50644 163573 96040 -193696 108414
18472 -98484 -54730 -86294 37804 -66397 -24379 160619 137983 -215821 -430007 -33620 260294
18460 -4726 -358015 -455252 -25363 -184580 120405 -86028 -267131 -261768 -294084 186315 -190691
18448 -117880 -314946 -91754 -98022 119505 129386 111508 -234550 -202459 36751 -319344 -227791
18437 -227791 -256195 -127735 -123432 159059 -290843 300862 52587 -79410 -47173 -279836 -101026
18425 -17342 -85669 -196620 -280058 -96843 275091 88802 38634 21084 153205 -43310 -117701
18414 -117701 10708 27166 193179 169923 63200 194369 197145 278781 -79371 216377 10751
18402 348561 -281425 52561 186272 117533 15764 -192135 -97780 243600 117542 -128992
18391 76662 -4342 -355110 -6857 -115874 -229459 52510 79448 -81699 -241874 -216524 -132868
18380 -132868 -83056 -15866 -233137 -204090 -202204 20836 75682 -241244 -373732 12243 -337299
18368 79423 -156637 -126913 126842 -6191 -123714 276299 287947 99573 99068 323760 -288048
18356 -88345 19317 124681 187613 173674 191745 98491 -67830 -22531 96967 299460 167284
18345 167284 111012 -89393 -262763 -66642 -211662 -189408 10608 -328436 -83075 -207258 73038
18333 -201833 -331693 -29501 264938 -67773 230176 -45592 -333644 25582 -129596 180308
18322 -161218 114182 105602 106170 -152837 140997 -21583 -84809 -75749 -9084 -147528 -49965 -174920
18310 -174920 408966 -12988 -172747 98448 59484 -52397 346111 -85488 -258715 193601
18299 -313842 -253488 -174532 -9649 -385284 -186519 -266459 -7669 56577 -11443 -115387 198005
18287 -138869 33305 92070 -200516 -184165 163944 109929 -167119 7085 -82500 46524 155496
18276 155496 -187991 -263591 -128176 -226871 -36673 -29138 -272663 -364072 -76476 -33866 187933
18264 35790 36444 -114453 -147020 -66856 -60720 -96010 40508 245155 -43491 -163432 -95052 191318
18251 30311 -65055 -201986 -39882 461044 -87620 -493310 136500 7584 292045 -68422 -274784
18240 -274784 -31631 43304 -188035 -87600 -331524 -151928 -71965 50473 -269346 -29017 33932
18228 -177339 -49854 -193201 -284967 156847 -117569 -96492 61949 -141776 -269884 51370
18217 -341441 -217953 32481 -20565 -91909 137503 -140280 -36799 55295 -249341 -39804 -51318
18206 -51318 200640 112120 2625 73615 -280990 111178 -120871 -107122 -127027 30042 116853
18195 116853 162801 -87531 -66716 -172403 -305903 -62120 -64194 136734 -75333 -113908 -12529
18183 -3022 216799 61051 -218865 -290742 71216 -230739 193790 53975 196297 -159765 -93191
18172 -93191 166298 -237686 19793 -179392 134799 83163 -39628 275207 -239848 -211723
18162 -211723 141733 -52408 -222362 53723 -117568 -189912 -6455 -71526 -41320 -129157 156255
18150 318161 -217591 -320235 -207486 -164291 -165160 276078 278893 37997 164854 -2582 648 36000
18138 36000 -298929 178682 -77658 130685 -416337 -181514 79444 -167985 -207239 20325
18127 105026 -4943 127766 321919 -289800 -109918 117033 -217270 -44693 -171559 128130
18116 192978 -192889 -90588 -95345 -106990 82814 167034 -200161 -119652 300986 -207136 -13687
18104 368746 -233702 128062 -141228 102250 -39374 -98130 -114615 142550 177979 -58108
18093 -30819 125551 -50008 -163898 72833 81401 133362 129936 -240935 -330619 -40080 -70626
18082 -70626 -458651 -51996 -179518 -169874 -385403 28257 -124141 72503 31256 37798 -275244
18070 -6197 -123981 431106 -419505 223652 68509 214331 -336221 -106004 276855 -207458
18059 -250545 29810 24197 -84178 433032 -433603 19742 21674 -110351 99257 -98445 38124
18047 -57524 -193559 270334 387600 -147675 78451 -101419 118969 -152707 139319 -106842
18036 80554 -154393 69680 5449 161004 -99182 -106359 -241460 -265877 -185327 -289731 -153308
18025 -153308 104739 -132527 -97358 -65818 61881 315381 317457 201306 113906 433 -107387
18013 -350213 -139524 67858 -67761 400008 -31221 192125 -241460 -248405 -221296 134019 -165082
18001 -88579 105201 131667 -134436 -368862 72667 -185600 -166023 166040 -48404 65366 -265526
17989 98449 -101145 -29525 53554 -103111 37002 177405 -88987 -70883 -77520 138122 -112911
17977 -213071 -121916 -183360 -243971 -277112 -84344 434528 14902 -45957 -265658 166016 -77807
17965 -168824 115597 68981 182274 -588 -97895 -177383 166224 109858 -101798 -88760 -42820
17953 80160 -68315 282727 90289 34615 87623 -42804 17767 218975 64887 -180787 43901
17941 -37706 -233706 -112099 -151799 -21680 235960 312463 100391 -99954 -193794 173727 -117561
17929 62572 -54484 -392694 -234787 -109688 -113770 -996 -53304 56928 -322310 340562 33438
17917 -58717 -5590 -19310 -199 -19869 -204409 -65880 -171364 139319 4027 95421 58404 76617
17905 76617 -26177 216614 -256145 225501 -44273 -268106 164558 237990 -97108 -221664
17895 -221664 -137047 335582 -96676 8266 335727 -186554 175878 72793 147242 74655 -57419
17883 18529 374567 104859 -150584 -133141 -21874 -5560 -123519 -66087 156517 19074 -77979
17871 130509 -320637 149747 36969 106480 -96940 355584 -14774 -70249 -56520 185833 -466107
17859 176673 -27325 62776 321178 -132251 10392 331862 -175250 65465 -90291 67793 -44527
17847 83994 166301 -108895 -74171 270774 135670 35236 189246 -194274 39702 -20550 41830
17835 105674 -112690 -171079 -108103 -58987 128464 -145097 161548 -314461 -224985 -470403
17825 -470403 -110843 -245488 -32614 -191288 8730 -112330 -47501 145687 -175382 267442
17814 94151 44931 129824 167492 -10709 -95012 -101583 131463 -25543 197101 -51925 -2541 -139451
17802 -139451 39619 -78663 122122 41431 26312 -98348 33924 -171083 -2920 23357 203892
17791 203892 -388623 -52583 -302846 -115064 37018 53334 -10313 306552 -219106 266293
17780 -254477 -4057 142161 -70736 -112094 266385 -40193 -426001 -258111 -240584 -15250 293607
17768 161991 -102024 -293680 -54137 -472231 114694 2424 -18471 -52804 -31284 -78531 152351
17756 209333 -124622 -29406 -32189 -124162 33025 -104393 47966 147383 61584 216852 -64408
17744 -188943 75728 175543 -146836 132294 -131952 88924 132336 -172677 22538 -371 63739
17732 89657 -53213 135843 -189340 -14751 -247957 -106883 208405 -4728 17622 -30537 1095
17720 -63384 -67453 166161 325154 374727 -88770 -323339 121081 78000 47835 169560 -50280
17708 -153089 183479 -22868 29408 236209 159980 -571812 -91431 -191667 -78210 -281619
17698 -281619 -59788 -11464 293427 5954 -23156 -158115 -31504 124618 170189 10857 103669
17687 103669 178549 120333 -7032 145449 168207 -87342 -287526 -222450 178362 -46289 -55091
17676 -55091 34625 113260 -71240 -280455 283047 -329042 -362098 194627 37322 -31905 -168219
17665 -168219 115311 186648 -31362 -45440 -29713 -6292 141410 47154 -119141 116941 -60416
17653 -50361 209893 -200363 -53729 191684 -75380 -23026 323465 103394 247242 244421 -8592
17641 -32035 -215299 -181349 -100526 284713 126708 72820 -102330 -43438 -69064 41456 33044
17630 33044 84404 97926 -254744 28241 98681 133441 -41717 -2427 -28585 239293 88293
17618 66945 222989 162028 -31646 26931 25415 -168731 -133803 1296 -70084 393066 233377
17607 233377 -181933 -288559 54733 45372 -218352 -137429 -57577 124654 -220546 257851
17596 182586 201044 -28096 -276864 -255811 87251 140059 116750 4747 -317612 153591 405636
17585 405636 -8656 38734 95111 -7999 -107835 -29091 -152042 148522 -151636 136499 -50372
17573 66833 120874 230876 -80576 26239 -270758 113421 217797 45370 -195065 346071
17562 -25790 -343927 416686 109347 -170000 -177924 -199403 -27851 -70043 -349820 278116 237271
17551 237271 -122109 -163618 83166 -114142 118430 163952 -39872 64770 241914 -62277 -153846
17540 -153846 152997 174738 52416 -83556 179984 -39993 99170 223306 171976 226515 -116215
17528 7971 -333001 -16456 144691 21805 202334 -41978 59263 -69757 20256 -2479 274624
17516 363172 -192967 98236 -89742 50290 -52172 173084 190464 -201450 52028 -112019 155473
17504 -269128 165916 -93607 -153573 93777 -36073 142354 234707 256140 52010 336075 306457
17493 306457 136233 172219 102973 253175 174937 389605 -101533 418565 122166 53533
17482 206329 248965 96684 204751 177594 -51720 402131 192115 -38258 26926 162570 18285
17470 179673 278144 98668 -28697 407038 22518 122041 157928 235477 -60472 318519 -20189
17458 214035 155744 127224 244916 -41475 113855 339586 98162 -36943 262330 337950 410004
17447 410004 151956 301605 549626 341462 22597 209344 283219 55159 195613 276936
17437 276936 -18785 113410 264029 420723 177503 398474 299365 252903 354420 -127297
17426 587332 63636 36396 60404 128305 168461 79388 438589 91660 286920 187668 263306
17415 263306 255707 368119 429061 431458 254821 429830 180708 394330 2325 307030 73116
17403 179136 -3882 162472 168576 -14958 385978 140883 86590 173113 242759 -141841 299681
17391 177246 156677 231321 228193 322105 -47158 146895 179548 316720 65582 278596 10138
17379 40989 66702 132662 -42836 118727 227808 118927 261648 -155714 -99854 152786
17368 121187 245980 99635 53676 22214 82148 302109 178563 90800 247247 269443 129715
17356 230871 -15005 339137 339710 158267 238743 275980 -76483 172460 55133 -189354 17964
17344 64595 186688 372308 123778 -65960 120286 8461 147737 451478 56157 243695
17334 243695 59734 -201782 162383 194058 -121903 159195 202933 163222 -36203 10027 451499
17323 451499 119502 76245 125113 147289 -3837 66015 498915 274957 48157 116834 352603
17312 352603 33501 -74622 193711 -202832 296994 248236 -323077 76994 -9255 146046 -62907
17300 363626 -100737 103072 223864 285417 -202787 404419 -54787 337384 191808 330183
17290 330183 176900 238539 171287 -75087 581052 156573 17788 49678 188360 85752 26643
17278 522307 239788 222192 106555 188125 338659 304369 -8833 18164 -77986 431367 277088
17267 277088 38783 143716 288362 229305 545664 345348 474650 171102 42519 82795
17257 82795 337413 269109 -152360 30920 54845 181971 6674 170571 183792 198166 -20266
17245 160359 105489 218045 487691 118200 29630 142770 209691 78597 199652 160590
17235 160590 406403 57280 151747 387419 452950 -11750 -161829 205916 162608 135737 222032
17224 222032 123193 281750 314849 376760 34703 212101 221903 144285 308302 132439 272223
17213 272223 262927 514798 170789 117428 213294 33525 104684 261439 -140885 -234640 141591
17201 213008 154830 532525 269615 518257 338586 258845 282428 563096 251748 111104
17190 456976 295750 291056 92369 291439 -125607 236636 175450 377619 538843 450009
17180 450009 103969 583447 127730 416433 118969 271366 237840 364954 298439 282880
17170 282880 382661 317665 -23014 172262 109135 198386 78836 504651 -75906 148459 518322
17159 518322 323708 114770 400746 -71818 332174 183448 190044 500149 328475 369661
17149 369661 216593 418022 411897 209732 257767 379372 260225 496277 277420 444769
17139 444769 435163 -58407 376251 292183 310571 377865 508116 88389 219100 199292 231383
17128 231383 508295 534954 599500 312022 302288 -222951 409857 507744 235452 362056
17118 362056 138603 364503 272530 450149 173493 484267 229814 322506 299899 302854
17108 302854 204712 436818 329913 383091 563317 214290 564305 453141 52931 539686
17098 539686 639439 403201 289380 490884 368392 178115 412823 330946 350508 522687
17088 522687 530869 340847 653041 494395 373846 424394 301345 312533 507935 609339
17078 609339 572576 104042 523142 247762 432293 385835 448379 916236 552070 255711
17067 356831 523920 420658 378916 602746 488121 622010 429991 517342 358942 633746
17057 633746 618844 525572 409613 763923 430855 156231 385981 773387 496091 281213
17047 281213 598617 336905 691941 321829 870980 650778 814656 589280 740072 571608
17037 571608 676972 516242 543846 611138 616806 833569 632020 562869 549490 514748 339783
17026 339783 809234 286323 524468 796209 1023898 798409 700716 731495 700229 548321
17016 548321 667401 440333 205711 362370 845005 691003 715040 673039 868317 610135
17006 610135 796917 1081084 622455 796832 623812 559044 550939 730414 636658 709967
16996 709967 646769 722170 610974 856573 580660 806709 960345 849777 896804 935557
16986 935557 1254491 917799 487420 590579 830496 858898 959542 944991 716328 759762
16976 759762 651703 593311 984309 755413 802409 863194 937992 908916 1197160 928737
16966 928737 782681 1022484 1064039 1011738 976236 1030625 1337190 1116025 978577 1086047
16956 1086047 1088166 1395983 968893 862266 1168876 1111628 1084066 1040996 1096590 1101445 1233581
16945 1233581 1101874 1343695 1314611 1289934 881695 1292829 1484419 988262 1477411 1471643
16935 1471643 1127804 1086068 1218610 1106713 1261906 950272 1124250 1311473 861151 1331036
16925 1331036 1510513 1588219 1519280 1209154 1295740 1664319 1395880 1480627 1566819 1690048
16915 1690048 1348661 1409724 1637877 1597763 1707791 1613826 1665159 1632679 1592213 1697379
16905 1697379 1643253 1438298 1596128 1647195 1740060 1994217 1739363 1767357 2202269 1988689
16895 1988689 2084259 1894716 2092195 1953282 2151401 1953669 2241365 1904757 1908853 2286747
16885 2286747 2046176 1986624 2075080 2194766 2415688 1935214 2242061 2124693 2288298 2555720
16875 2555720 2406230 2490737 2666020 2587580 2820163 2600075 2478005 2588404 2642440 2569204
16865 2569204 2817812 3023689 2761011 2703938 3051561 3135198 2798488 3008670 3156892 2909617
16855 2909617 3178429 3054783 3171611 3057267 3149711 3137965 3064313 3496925 3085863 3632221
16845 3632221 3681013 3609033 3904631 3702281 3750819 3756986 3942907 4046562 4231304 4081679
16835 4081679 4195608 4585097 4272572 4518172 4359136 4690003 4751282 4551298 4732424 4860882
16825 4860882 4825542 5481341 5266357 5222280 5447058 5610008 5904183 5746544 5784779 5942708
16815 5942708 6101522 5767829 6310239 6434240 6548276 6885320 6633035 6790639 6895657
16806 6895657 7251432 7596841 7397391 7776356 7902068 7920985 8220442 8557887 8665920 8644810
16796 8644810 9347736 9390998 9702579 9775782 10008957 9944636 10502583 10508051 10924761 11062375
16786 11062375 11495984 12014583 12041271 12310602 13141061 13402579 13300153 14319687 14531743
16777 14531743 15014216 15394209 16039454 16485393 16908014 17421543 18351362 18559464 19471903
16768 19471903 20158598 20609072 21292974 22407778 23032207 23705181 24743430 25700373 26577065
16759 26577065 27740761 28822123 29936613 31129913 32457351 33937539 35542478 37270776
16751 37270776 38888809 40312290 42600140 44804106 46371815 48671742 51271893 53655912
16743 53655912 56716217 59761914 62492864 66196002 69877071 73760274 77486300 81754560
16735 81754560 86987129 91263713 96641855 102397699 107843209 113705371 119864529 126176425
16727 126176425 132203587 138842974 144757279 150820115 156259190 161365031 166225481 169799533
16719 169799533 172678645 174246424 175113404 175099877 173827545 171424915 168209920 164161206
16711 164161206 158973245 153771432 147758121 141465025 135073715 128857290 122319595 116229740
16703 116229740 109954193 103569610 98115969 92238840 87200966 82235253 77684168 73218116
16695 73218116 69035312 65422722 61590471 58823767 55611937 53002581 49920521 47247449
16687 47247449 45128421 42883908 40737810 38848072 37002296 35187832 33988977 32163093
16679 32163093 30632048 29284635 28123184 26874256 26055631 24805018 23865622 22812052
16671 22812052 22020189 21093181 20286360 19704060 18742431 18003654 17569132 16808967 16345144
16662 16345144 15792359 15342835 14858995 14100252 13703910 13424651 12943158 12548919 12180649
16653 12180649 11840301 11705211 11236539 10889756 10563723 9868580 9767217 9781148 9490650
16644 9490650 9174818 9076294 8778564 8570339 8323002 7875211 7579388 8046649 7359853 7283090
16634 7283090 7028956 6977794 6753412 6475261 6350900 6206579 6102592 5871584 6066451 5538173
16624 5538173 5532297 5493546 5454434 5247141 4895554 4855548 5153693 4993402 4742648 4595155
16614 4595155 4508339 4819911 4387565 4381305 4591358 4300867 4097912 4027903 3929659 3663076
16604 3663076 3801424 3538143 3863407 3529881 3372748 3084308 3450189 2987659 2926907 3008159
16594 3008159 3139594 3061515 2790892 2779652 2941066 3180447 2857204 2948161 2608854 2645815
16584 2645815 2725858 2635152 2577768 2773575 2781017 2269522 2679002 2179396 2543416 2137258
16574 2137258 2359028 2402194 2382695 2189882 2145342 2387056 2086926 2342577 2079416 2117511
16564 2117511 2001910 1986029 1967906 1665175 1653209 1550332 1879319 1807401 1624226 1880744
16554 1880744 1759812 1429538 1831910 1513824 1456393 1937904 1601565 1536523 1559519 1381073
16544 1381073 1299653 1573218 1553470 1411012 1185102 1296771 1357951 1306634 1041896 1614741
16534 1614741 1291447 1234927 1257640 1250505 1151627 1110840 1085017 1162488 973715 1295637 1239150
16523 1239150 994481 1072619 1458961 1354413 1048194 1238485 1021547 1113234 886513 967578
16513 967578 906818 1242593 1232604 1094723 743321 1213658 1284321 1143492 647235 864971
16503 864971 997185 908913 795165 827706 521129 901439 798649 1136485 909069 1171250
16493 1171250 729833 788306 876704 607333 645428 811116 632435 656386 1034266 790901
16483 790901 696841 859497 883948 1038946 600989 752357 891714 553511 855829 520249
16473 520249 916908 642160 635706 334908 570685 619343 684327 897257 315372 607034
16463 607034 782486 757952 596596 605030 559009 523539 919819 791155 569687 649088 839010
16452 839010 451364 610687 660267 477871 723635 493908 576730 618097 513340 535052
16442 535052 541634 670976 393962 750214 523912 546744 476490 313950 430065 618026
16432 618026 405719 627126 579349 799906 623909 548220 597719 455056 339297 757908
16422 757908 811180 334616 392319 416130 226508 382254 748233 870112 165409 393764
16412 393764 462667 554533 164042 598509 563969 302803 456282 365199 317112 327479 499389
16401 499389 424934 612466 598373 487633 120724 566041 394788 574384 482944 389799
16391 389799 130370 422057 389864 -108888 668966 124630 34998 550858 331295 371383
16381 371383 475059 393041 180951 34856 333918 266607 248818 480088 265211 342109
16371 342109 334585 -721 536121 251180 532632 156720 522527 498604 624703 334674 296038
16360 296038 104784 145081 561819 95086 -174156 247657 86585 241767 162333 190218
16350 190218 179456 454160 344220 151057 501688 356008 545579 180741 559225 -234476
16339 330067 199688 175309 172578 415163 93590 263279 191030 473801 246666 54586 202248
16328 202248 -55596 593251 495536 333581 504164 92290 282028 430328 404787 425657
16318 425657 181388 -226818 294991 -124969 -218829 -86723 239123 328273 -7494 -31551 357997
16306 146201 113958 261550 18256 286522 189475 68904 285187 366123 117371 -23066 76003
16294 336762 138721 203059 163159 -65568 30386 143210 544004 240054 38580 207900
16284 207900 -47947 350179 269142 249120 379878 209799 -7683 -1593 222296 -151979 488226
16272 -135638 421188 8429 -165158 94833 -76230 292395 36470 -93728 -125130 237898 124422
16261 124422 -20212 140495 20809 281620 77572 41642 -20498 296247 -95450 179294 140366
16250 140366 -294 115496 175224 197455 -169128 16878 239494 -53827 183832 35426 -43620
16238 100228 254351 14629 30397 -202349 -153330 134639 147348 102766 -240885 -98888 184833
16226 -170962 -97248 -58911 -61772 -1945 -34616 164368 137215 154280 -205901 155103 55710
16214 -184986 43293 -27796 -244723 -98294 -41484 234947 16832 28370 139717 58479 401137
16203 401137 57084 -129460 -146630 -191465 305492 -36125 -124758 341591 87361 299187 156079
16192 156079 191774 -172968 54968 -76237 -126705 274859 -55490 57075 117757 -141526 368315
16180 210363 -202607 98775 -253394 -184872 28536 135185 -16431 286256 85367 280142
16170 280142 246991 12677 -256198 88767 -64513 89011 -86750 -57213 196746 -17676 -96180
16159 -96180 91928 83222 63587 -28508 -288300 391139 234242 -99919 266918 21463 -70016
16147 167893 171464 103700 -41902 52530 -4224 -209913 56835 446832 97735 88819 233276
16136 233276 210650 166107 184462 131525 -44454 234905 80471 -257127 392227 276060 -50980
16124 -98019 -204146 13812 -288859 131883 233327 134066 -20424 -18039 -98554 -180121 -14385
16112 -14608 38613 -158034 -49395 168591 305587 -136297 161864 169883 122514 395593 378925
16101 378925 -88031 334933 62662 13781 57834 -87169 46232 -54412 384868 87406 -185757
16089 -130079 250895 -7442 -51268 -69896 201635 -200257 5285 33140 156401 67458 20461
16077 69406 -289682 -64974 8758 -79710 479408 56914 425624 29976 138364 108548 359319
16066 359319 -109013 -30878 97955 -153550 -129194 -104325 -133103 -44685 -268302 29868 294940
16055 294940 -30388 30668 -25466 -157939 -74648 -178324 215662 -141280 -252987 82170
16044 -195618 90558 -14335 -208819 -155459 205220 -113209 97122 11257 59135 -59842 -176920
16033 -176920 -57817 50599 203273 -38119 -282825 -150613 -15223 -5045 -43845 -124123 133493
16021 -200567 180845 79397 -111731 -88024 -121883 142798 295635 -247086 -35960 18642
16010 -53269 5458 -132483 222353 -89140 117258 -199133 89358 118291 -40566 -152902 -81794
15999 -81794 116529 54812 -321907 69555 159641 15573 203729 82732 120722 88327 -278617
15987 45664 174321 320507 216157 231739 -84124 519865 204587 127379 -67677 81326 -50981
15975 -33708 -104252 78997 -260520 -69804 -141669 197909 160550 134271 -14882 -143560 62535
15963 -420719 -109423 -154444 46925 8000 -26867 -265237 -66195 162188 -141712 -82791 -51677
15952 -51677 -169057 -264555 -78409 -12573 -35667 -289957 -102848 -9161 -12193 17676 -61609
15940 -34923 -127349 -428487 225498 46714 258458 167284 79720 -172980 259218 210902 -223016
15928 -163091 8507 169808 -278259 -31061 -30605 -503 -366757 139080 -56306 -235342 135861
15916 -51038 -85892 -1409 123275 -100302 -266766 -200632 -398442 -94807 -87193 219797 -113497
15904 -343565 -174189 -86465 -275682 -96616 111339 -150796 250197 4333 122823 -170067
15893 -138960 -216885 -4591 76411 129681 66819 235456 60956 -29756 61512 -205345 58972
15881 -100097 -212165 273264 -297517 -102562 58305 116497 77330 116077 52163 -73697 144933
15869 -10650 -53109 5945 -210717 -141066 -126325 219349 -59894 -100542 342240 109384 37499
15857 -213668 2679 135989 -75765 113016 -86142 -28081 -189878 -103949 -156315 -29519 -148686
15846 -148686 -29098 -179432 -35252 -9133 -42437 -73049 242161 54531 233365 90897 -136738
15834 178578 -305642 -28710 -138339 119458 15251 -251167 68057 63773 -389818 -62465 177877
15822 -219232 -97888 41299 138977 -140366 249315 51818 -55613 -159740 98687 26823 110132
15811 110132 180241 291198 -57210 -308205 142458 -114832 -211385 255852 -106748 -110375
15801 -110375 208187 -15043 -129935 52344 -136633 -11873 195298 3333 -88436 360472 24163
15789 10389 -143428 -117933 -119795 -11652 134853 139367 106412 149243 206700 -185315 -138087
15778 -138087 161620 47718 25524 163907 -155957 124014 -383212 -86778 -189190 22343
15767 -35972 160509 233242 22925 149158 46000 165845 -225881 -32397 -223053 -250928 291197
15755 160994 -76672 172808 -74525 29601 25413 -300423 -152397 -181456 129017 -286224 -164934
15744 -164934 -173101 -1539 63502 -179265 -139511 -128440 -154465 28800 -107372 179952 187530
15733 187530 11143 38350 403474 -230151 -138346 -229690 101390 -231331 -167662 -178776 229529
15721 -203248 -226269 -259893 -310028 252440 1949 -150171 -236122 152216 64733 95956 62685
15710 62685 369093 142955 113464 -349012 -119640 -96733 -207586 -7529 -67691 -91194 -261436
15699 -261436 135630 142947 -16197 103047 -55135 55728 244366 193352 110207 244841 132143
15688 132143 -64563 54150 -26475 24984 -138629 -206005 -7956 329672 59893 -305443 -135457
15676 -364723 243112 -159982 137419 187983 -85245 -290527 127998 161543 21923 -12345
15665 291646 -44245 -222740 113446 -106155 -68656 -157124 -181967 14005 -131343 -295711
15655 -295711 -108642 271433 -262859 -126379 -302897 -23696 52466 84970 -149988 22418
15644 -161120 -144880 -11444 -202385 -66835 100752 53154 -159796 79840 81015 -244624 124740
15632 313439 26740 165681 13707 -62575 220585 101297 -42724 339172 114295 -138748
15621 263281 -191650 27233 39211 28711 -203345 -135228 278130 -143519 -202308 -72309 4546
15609 -102124 -114116 11062 -51242 -168039 281001 219926 110530 40176 -208208 -257428 -162150
15598 -162150 -284730 293285 -97483 -48039 101813 134930 80552 59901 19968 -100554 9921
15586 171524 -188143 -116492 34040 -48596 63930 107535 116199 -141673 -207618 -47034 104210
15574 -42994 11639 -205489 39397 27449 -25697 -213776 -103475 -91917 -34173 -159395 -245447
15563 -245447 -100298 -69840 -100470 -9902 151671 -111178 -87001 64638 -9066 -23146 61196
15551 -221350 -144974 15196 -104917 41030 -93576 64944 107317 -194794 69914 99477 -63836
15539 286829 -125338 -317180 115850 -14141 -273353 -179266 -271363 94183 121457 77515 -314241
15527 -274137 -161474 -53425 68784 -381010 71 -35530 -33160 -195190 -239982 341143 105623
15515 -75835 -258772 144237 -206837 84658 308514 63508 -159414 -42340 -140735 -201734 -141882
15504 -141882 -62070 -35173 -19318 -81486 -81215 -136299 46487 -125066 -143703 16946 187802
15493 187802 -154062 -115706 158964 335856 -172485 124565 149138 148256 -33679 46190 240712
15482 240712 -313826 102106 170598 -52308 -168038 38823 388158 110464 -276210 -175089
15472 -175089 35666 -44713 -158914 88830 54649 229129 169293 86579 -130109 4289 -82694
15460 -186174 44445 38386 248420 226345 253011 185725 -181895 84506 29270 55702 -6089
15448 -13247 -231555 -81952 -200354 150319 40629 144224 -166201 -348292 -85611 134274
15437 -32654 43484 81199 -148973 161294 2699 234031 -88150 -261831 235773 335680 -37277
15425 7930 85022 295764 -83122 -434277 -8923 45050 32491 -92409 -18666 228913 149052
15414 149052 188195 -61385 -204735 -97871 -104041 57567 -141698 131009 -201696 62039 -132981
15402 6131 -85790 67498 -18271 216107 290442 -41124 -115278 -190878 -133853 -25459 231295
15390 -27729 -242365 123381 -45750 35074 194446 188981 30748 46416 324084 -46989 -19316
15378 -301040 -183515 -128088 54790 -58781 -12240 242441 69444 -177871 -288582 -118321
15367 143854 91969 193946 391470 124458 -291013 65811 -137995 -88096 62959 -312949
15356 91423 -164195 334962 -137402 243742 121349 -81186 -378972 138192 163968 -70976
15345 449109 -85742 13047 -30514 119837 -42272 -227235 -120890 -29489 126814 444141
15335 444141 -52040 209482 -375972 26103 131661 48963 97163 70032 -271065 12957 55669
15324 55669 248361 -142186 -2070 114480 -57188 -107965 406287 204887 51506 419171 -36487
15312 138274 106819 82813 23103 -453699 49211 92703 63343 -135655 -47734 93956 100135
15301 100135 3312 -238867 -17123 87483 -24848 402559 29572 155582 -123769 223296 63058
15289 -183974 337373 -262274 -283687 -18732 -41100 119994 46900 151138 -21330 -169099
15279 -169099 2710 -40305 114047 102060 218383 -71290 -83486 -20176 -68041 18816 -97717
15267 79173 1846 259066 171604 -22554 31432 -97285 -2503 215298 201121 76248 -51530 139681
15254 145445 -222913 172136 -175313 333277 83139 111288 583465 782829 1371885 1796312
15244 1796312 1431144 2021254 1486156 159056 494891 79885 247036 126466 -294122 249800
15233 82150 198797 206168 113916 99597 -117482 294929 188854 187188 109407 137528 196972
15222 196972 119538 23526 294183 91976 -201648 -66876 7318 212221 416906 64521 117491
15211 117491 332483 190636 89946 118580 34475 80605 63679 15598 -166471 128804 45651
15199 266360 182897 287938 238728 326596 131764 151770 -26236 102044 91921 258214 76776
15187 58137 -80554 183944 -98437 -154729 109448 -271366 313092 53114 -121547 111990
15176 -53749 101498 -216993 -24129 29882 54300 141588 44986 6714 -100345 249517 130038
15165 130038 -64657 16684 73726 105892 97774 22128 31850 -127937 -34819 80370 226435
15154 226435 85867 -137267 523481 -114035 -335226 118595 101644 -204419 132855 213788
15144 213788 118940 -459900 -115330 1716 114534 295058 258373 10054 178103 -103843
15133 139196 -59534 194356 -87927 -293864 366712 383857 -194438 -5729 247445 -160865
15122 137788 328928 279601 102284 184393 69850 246282 -233950 76947 23789 313630
15112 313630 -76783 454785 64437 24904 -224646 174237 324011 77737 -42559 48894 97345
15101 97345 94828 -114153 254989 -225030 205264 313132 195502 -32056 -813 163685 24565
15089 97648 148092 237217 3568 24427 461909 178957 -5941 608250 286821 204903 178200
15078 178200 261284 -111277 -77923 134638 17989 260090 70899 238248 104286 119622
15068 119622 13722 -69877 176508 219974 -255305 273029 -149398 -57410 -3723 45933 -53922
15056 -97938 116564 8658 -105137 443310 308085 -184378 166324 89485 41597 -69020 34438
15044 201670 92128 260019 360553 -107799 189602 66623 180736 199139 162615 126692
15034 126692 37835 330003 174839 260561 -24021 520690 147960 171758 317406 313074 155434
15022 226118 26617 21539 224420 26302 181963 375242 -72106 160701 439088 22247 249535
15011 249535 -73558 -125128 298075 353064 31343 19385 167910 144813 381515 301308 107642
14999 142768 41476 359342 223726 488961 191583 39252 133271 20748 209217 80344
14988 192213 386412 189156 70036 235253 254564 323404 124814 260254 329072 188639
14978 188639 158149 424855 254385 311396 313839 -61052 322514 122380 380573 211184
14968 211184 319752 296238 398051 -52996 -59815 72416 361759 345462 284728 357276 278366
14957 278366 256240 568030 303214 211620 197873 264952 261681 12455 -1200 166426 -129400
14945 378897 133431 -95251 446254 162182 -105464 494282 415624 404367 460868 479903
14935 479903 -125879 185078 499662 459163 205293 420841 165655 582847 472325 103260
14924 479107 288256 224572 304652 512202 344012 173574 201925 39839 335024 439325
14914 439325 519644 316307 402248 333332 645024 -105989 385860 295495 210144 711450
14904 711450 491504 66145 580986 96511 287468 280556 280909 411216 -82740 406523 205519
14893 205519 60910 203141 246142 411753 344208 255426 281741 309275 321431 261872 369271
14882 369271 241004 373899 144407 311639 296252 507554 305970 424838 75206 642061
14872 642061 307810 576958 404937 355365 491056 221274 576099 325699 708549 396926
14862 396926 193497 218538 236656 310800 644128 403552 379811 442727 789317 641440
14852 641440 79513 324153 424351 529576 592464 253392 227730 516198 550049 449054
14842 449054 434609 167377 156796 319067 96244 446156 254661 522658 337426 310547
14832 310547 231841 445696 208424 198820 281952 346816 499050 445100 694934 575183 141976
14820 390575 378371 707176 604592 304223 581716 504262 520474 582451 471439 676406
14810 676406 319000 601717 406764 460069 608945 728991 391305 690311 196204 555288
14800 555288 604333 475646 675518 548576 535282 439508 280118 450968 73902 351596
14790 351596 606652 596875 466417 580330 267005 591061 591197 763014 728076 716081 640937
14779 640937 644497 702170 684803 443755 631296 616673 480981 472451 560947 612757 524176
14768 524176 619121 441978 624854 583984 745155 533920 202532 777567 713380 523716
14758 523716 711267 808414 763544 574412 732846 397380 205235 423194 493310 557854
14748 557854 866091 397766 487527 719767 656656 331805 820168 358961 676512 456567
14738 456567 726778 717096 676182 757146 604448 861328 551319 371063 847473 789966
14728 789966 593412 560554 525860 890215 738567 567897 817651 665477 1023539 765502
14718 765502 717718 821559 716733 805940 618132 973946 674721 948816 733383 712297
14708 712297 450793 742443 912991 1005147 1130200 857868 656124 602346 744418 904625
14698 904625 712609 834363 1004167 1000012 770453 811975 708653 733753 890988 1102556
14688 1102556 929250 843054 1060228 1016929 714570 863233 891755 1061287 1022796 716067
14678 716067 802359 954033 898938 815160 973298 922269 668915 750823 1129471 905897
14668 905897 1006901 804583 1464903 1268362 852948 888062 797724 1067494 1102693 1364140
14658 1364140 913970 902762 915982 1296009 1087012 1085544 1269131 1078471 959482 1156472
14648 1156472 1074239 1202372 1430698 1166898 1251707 1242336 1203392 1490713 1352024 817415
14638 817415 1240172 1058252 1217850 1493600 1370524 1548728 1278076 1277742 1192664 1330571
14628 1330571 1199228 1281310 1094662 1472291 1252679 1227003 1460100 1534118 1152089 1373361
14618 1373361 1673006 1432012 1616821 1712406 1575166 1177136 1435883 1113127 1426990 1675150
14608 1675150 1282918 1515503 1483325 1592489 1677157 1874039 1895825 1446189 1327707 1846205
14598 1846205 1634002 1487196 1779762 1642296 1687359 1670152 1798622 1890781 1743878 2124340
14588 2124340 1834337 1871102 1860254 1722987 1263733 1695465 2028287 2038544 1941573 1810610
14578 1810610 2034441 1896216 2037512 2018965 1688921 1808600 2114341 1978861 2266158 2059083
14568 2059083 2328110 2619085 2335997 2553911 2595074 2649366 2260597 2211739 2913461 2677710
14558 2677710 3003200 3028243 2960504 2974428 3499821 3751813 3988972 4754795 5756867 7723981
14548 7723981 12469467 21468741 36615309 36961922 18585669 8894301 6530375 6236567
14540 6236567 3973405 2338242 2100839 1832904 1800515 1630455 2092167 1920873 2175186
14531 2175186 1844742 2330315 1964063 1925771 2618556 2081613 2169737 2538617 2167015 2237105
14521 2237105 2642634 2250134 2327749 2612373 2512615 2464793 2736849 2599467 2663248 2782709
14511 2782709 2797735 2987494 2667730 2955428 2810495 2834747 2679554 2588229 2932790 2865044
14501 2865044 2876888 2930116 3338626 3073173 3476202 3165049 3081184 3480720 3362102 3222406
14491 3222406 3518258 3224634 3258879 3746610 3658770 3667483 3474023 3424610 3678180 3665362
14481 3665362 3769511 3916910 3476199 3796325 4111580 3849072 3695506 4179062 3846941
14472 3846941 4147076 4211115 4420929 3894259 4208148 4250314 4230325 4465759 4609375 4468509
14462 4468509 4596150 4534898 4622602 4923170 4938932 4925834 5166444 4843747 5021368 5023684
14452 5023684 5117571 5341750 5329253 5376142 5504876 5628348 5540554 5530115 5682181 6126527
14442 6126527 5707957 5963541 5996475 5672056 6152472 6374909 6369048 6583064 6247273 6691641
14432 6691641 6392812 6740415 6532734 6694953 7104037 6904880 7103619 7217295 7058408
14423 7058408 7473772 7389138 7232177 7775964 7889187 7749613 8191785 8325542 8033116 8069337
14413 8069337 8925371 8657551 8909602 8812909 8696391 9314349 9334743 9718857 9620213 9769434
14403 9769434 10220346 9994052 10282916 10308636 10550733 10752621 10619340 11218000 11206118 11133434
14393 11133434 11464011 11862551 11759528 12495582 12265683 12656538 12705051 13030556 13533634
14384 13533634 13887696 13744038 13930049 14388447 14675621 15183516 15006346 15484333 16024966
14375 16024966 16073080 16634156 16837833 17000759 17661346 18002219 18184991 18446778 18816689
14366 18816689 19339064 19521479 19883330 20459411 20588052 21570823 22031222 22136419 22893412
14357 22893412 23251606 23983887 24313286 25002737 25324534 26157321 26585222 27690421 28094874
14348 28094874 28696256 29310392 30280589 31032807 31293131 32990500 33371509 34102263 35237718
14339 35237718 36219619 37265253 38420056 39360566 40078545 41592915 42674815 44216896
14331 44216896 45340010 46939121 48462934 49836972 51690667 53175690 54647428 56730891
14323 56730891 58607626 60546090 62613140 65005815 67134508 69378072 72115461 74596532
14315 74596532 77590950 80685657 83662532 86807602 90343291 93985062 97500822 102041000
14307 102041000 106264479 110704124 115440993 120813949 126074451 131679073 137681257 143928127
14299 143928127 150859528 157983111 165875107 173759603 182168951 191243587 200739414 210743034
14291 210743034 221528362 232590924 244355585 256600246 269521792 283001409 296748738
14284 296748738 310700909 325068495 339766940 354357948 368972415 383205718 397128170
14277 397128170 410083523 421633019 431830988 439033463 441768210 442294717 441869382 441802709
14269 441802709 438548500 435920171 431333411 424580946 416149986 405448613 393279251 379224100
14261 379224100 364023266 348609173 332980419 317465048 302311918 287331411 273177059
14254 273177059 259227471 246241425 234589566 223251593 211810865 201020277 190889343
14247 190889343 181204044 172008921 163647589 156489383 148914882 141741298 135059481 129019202
14239 129019202 123026620 117739511 112837757 107711540 102973358 98594574 94398249 90941222
14231 90941222 87495083 84009323 80725054 77418743 74503244 71639746 69018641 66708194
14223 66708194 64289411 62226652 59565690 57525764 56109592 53940114 52072357 50478057
14215 50478057 48927249 47405392 46040414 44717612 43101639 41660651 40831754 39621816
14207 39621816 38901267 37800041 36872592 35607785 34478349 33614057 32911515 32444169 31116300
14198 31116300 30105851 29200726 28470506 27915481 27375790 26783293 26106050 25266725 25026690
14189 25026690 24323924 23728084 23044921 22451776 21974358 21475948 21051357 20665160 20139600
14180 20139600 19442207 19022830 18855220 18318062 17989853 17642297 17633215 17092392 16647455 16050471
14170 16050471 16113838 15793408 15487554 15176859 15292340 14587430 14686768 14108282 13650818 13494734
14160 13494734 13566499 13068971 12549511 12631372 12423801 12055576 12001829 11525401 11621911 11320125
14150 11320125 11363363 11245451 10813164 10871563 10361480 10467606 10242556 10119419 10061763 10012044
14140 10012044 9493250 9333073 9401212 9119666 9042181 8591328 8774866 8633322 8226894 8413824
14130 8413824 8456528 8168647 8009434 7921658 7996299 7727290 7572916 7526295 7420945 7266702
14120 7266702 7063926 7064703 7117498 7042475 6781797 6768235 6772305 6726377 6163770 6342265 6259163
14109 6259163 6136665 6025458 6039004 6031271 5944224 5945890 5763468 5669637 5413382 5891634 5448024
14098 5448024 5172306 5298646 5362864 5262360 5160919 5202488 5128645 5500645 5353016 4985290
14088 4985290 4840359 4788905 4541408 4705237 4812202 4916181 4811406 4463280 4542604 4443316
14078 4443316 4707664 4377097 4420680 4376208 4313536 4309685 4238736 4043750 4077971 3791747 4052827
14067 4052827 4024898 3858440 3907447 3605897 3914262 3615921 3953601 4002857 3617468 3712786
14057 3712786 4031193 3744850 3910766 3182766 3687030 3573153 3456310 3436731 3328957 3166698
14047 3166698 3139544 3249015 3207776 3264519 3018381 2977086 3201173 3119083 3304610 3047438
14037 3047438 2927077 2784135 3024595 2897528 2950756 2837412 2818690 2893461 3121440 2784513
14027 2784513 2606437 3002499 2680685 2317996 2719967 2391689 2690091 2452865 2581570
14018 2581570 2525049 2684587 2339845 2314992 2420452 2458241 2327647 2065801 2380067 2076548
14008 2076548 2511691 2338678 2206861 2393020 2206964 2470280 2027670 2167917 1973608
13999 1973608 1847580 1923644 2152249 2477948 1839662 1863758 2182231 2227161 2415294 2639416
13989 2639416 4141099 7362224 15000052 31179841 39167882 24374200 12442195 7504359
13981 7504359 5662886 4536310 3684772 3119349 3191182 3201287 2670305 2637555 2543151 2200582
13971 2200582 2553978 2110287 2165387 2070928 2254821 2098788 2266375 2228198 1955963 2410265
13961 2410265 1893002 2027340 2040302 2332797 1828876 2189882 1778674 1899674 1822772 1918060
13951 1918060 1602815 1714317 1897990 1699510 1763587 1650963 1912377 1735223 1556408 1624051
13941 1624051 1581425 2027297 1432791 1557977 1810862 1829204 1522839 1765837 1624989 1235128
13931 1235128 1753343 1525675 1781386 1325914 1496008 1431297 1644165 1354157 1472860 1473938
13921 1473938 1448387 1250208 1295098 1671483 1183841 1006984 1156839 1643524 1259492 1257672
13911 1257672 1346610 1300671 1433952 1517225 1354614 1479732 1164773 1227260 1126806 1195878
13901 1195878 1031388 1485257 1269201 1517804 975092 1075321 1423485 1461125 1419967 1441699
13891 1441699 1350797 1220845 1125599 1209443 1053544 962319 1336480 984014 1158165 1370081
13881 1370081 1035533 1126923 1086965 1247169 1211451 823513 971023 1070712 1125011 718173
13871 718173 824921 1156235 1232084 1176626 1041275 1232845 985333 992828 950325 1061969
13861 1061969 958953 821899 1194752 1213035 808840 895721 960714 936547 987686 1028616
13851 1028616 894189 693570 744097 663758 942585 1058390 920161 771355 844749 1070596
13841 1070596 971313 532254 1198596 765097 716812 1094124 861423 1106886 948876 700702
13831 700702 458791 964290 927339 808619 1099854 761127 686818 874035 639072 847071
13821 847071 752619 735142 848909 794062 984620 891472 540881 516594 641722 505263
13811 505263 942734 967016 822867 828740 879909 1040169 619652 1001783 840609 690456
13801 690456 961904 256695 668180 758081 613263 590886 748437 1198488 976007 631394
13791 631394 562372 797103 679023 750942 630468 668414 842661 633591 585732 698058
13781 698058 710325 658883 683846 717135 804527 820230 554576 616765 712621 487285 554169
13770 554169 652032 513297 857724 487413 551033 545384 696801 613507 474017 731682
13760 731682 607334 348811 679948 727459 713065 510095 621310 810051 592091 694043
13750 694043 742235 265878 275313 510812 473998 603975 690106 464287 1216407 567108
13739 558576 439647 458918 288409 476554 595060 488406 700961 520578 431766 580659
13729 580659 702925 412749 285906 638547 835796 672055 478179 650551 745760 515880
13719 515880 404670 628378 580643 691450 524735 326576 758661 540025 647295 370280
13709 370280 533815 795977 419125 282241 345911 618163 493980 818492 727383 746892
13699 746892 107630 761844 574106 548083 870721 458524 602916 505015 538039 544789
13689 544789 508755 434326 753850 339836 434853 492829 392323 663712 372161 441177
13679 441177 271649 404318 69289 79823 456779 163553 403793 398003 555231 660906
13669 660906 282321 464824 239428 505462 203910 364586 235455 709863 553564 725049
13659 725049 192955 179015 310807 132692 210002 282318 257363 159857 639800 752391
13649 752391 162063 516680 163731 310230 490298 357019 329833 298313 380613 410321
13639 410321 135111 422143 345728 266732 457530 302119 308770 551028 471977 461781 391272
13628 391272 309792 534110 384819 297173 592634 367619 166585 392969 582780 427450
13618 427450 96580 156670 515022 466539 231430 -69618 422355 296355 274373 331592 285306
13607 285306 536139 411385 286271 300740 421867 340959 365951 394371 227056 18954
13596 288205 226693 503386 104625 322624 438209 565892 117145 456992 51265 653720
13586 653720 529451 235091 603922 528012 67140 552071 344596 -98317 256987 366314
13576 366314 138344 253232 90351 259958 164023 395816 675863 279058 601265 10221
13565 293332 304712 396150 245689 424414 261336 285630 87326 57767 313847 232807 338472
13554 338472 186441 463135 72480 553149 283722 197616 355202 335432 262075 277680
13544 277680 286086 478346 485898 97850 186130 139136 328542 198960 7566 490683 631764
13533 631764 325884 315103 257697 138334 28325 114600 294199 186499 241052 166201 430452
13522 430452 301724 412212 354997 32313 20677 38951 408943 323658 203083 -24848 260753
13510 408577 213240 352179 156185 173345 338414 241877 685708 280669 288560 261897
13500 261897 210763 204008 270495 -14147 -231012 215993 536320 37252 225104 316893 300402
13489 300402 258597 154817 281585 182227 43143 438589 287918 16214 356019 221034
13479 221034 168476 260430 51736 98774 174049 519510 -46701 282845 -131852 96237 245245
13468 245245 245505 254657 148500 435993 57524 230513 364937 120284 232810 -16146 -163875
13457 -163875 389216 410572 309336 220220 285256 388203 133817 24316 120506 394798
13447 394798 176658 115657 256160 67234 208902 198662 277372 -10541 288161 164423
13437 164423 77690 333807 382021 217081 -26630 9130 99342 381329 270769 76173 -71673
13425 -117343 141979 154473 169287 86423 281699 239785 379646 121354 308531 329586
13415 329586 245136 -69755 384614 443397 267278 -54697 288705 106344 371900 56682
13404 117850 -47028 123196 205250 172733 42647 67265 317363 114912 343299 71424 171780
13393 171780 41445 63170 58981 249586 2139 294521 256154 105864 83607 191601 -1257
13381 -6119 95911 246890 88491 147730 127310 83762 249933 127533 -54895 207667 371295
13370 371295 -46180 379832 280316 220388 140651 320143 10962 421138 279428 400254
13360 400254 253400 316404 193842 155173 108911 136945 551689 119741 59400 61250 254505
13349 254505 331815 526402 406160 6388 11451 490588 222800 51412 323062 79778 61553
13338 61553 257376 277878 229114 205526 135008 23917 160767 414491 152205 90764 262625
13327 262625 161838 116090 226880 352888 -832 159033 -47413 279135 15764 -32178 605
13315 211197 303181 -36727 592611 -40244 116225 228150 -5730 107583 251168 293151 62217
13303 -39473 276035 194343 272693 290347 -125717 -184771 198535 454033 35171 61415 353466
13292 353466 343369 280205 147336 -312189 217957 -285502 195805 415627 299046 -253025
13281 13824 -126757 -104841 27480 217037 353141 282705 212838 153701 355373 -14321 -17987
13270 -17987 -161274 66988 92663 -93143 119281 233021 333375 51990 -117968 28969 115148
13259 115148 67960 126999 80516 283121 352921 -131372 -87060 -126702 82089 174718 60068
13247 -149385 -49960 378541 164033 43274 84534 172108 117053 171988 -65953 -321135 119019
13235 61388 91150 66309 -288949 72896 356161 155963 247870 86379 298327 300783 272262
13224 272262 40250 -175622 191692 166293 -160181 165980 -167305 -15945 280663 -139684
13213 37523 487314 -3950 253041 235891 -104412 124182 -52325 264595 125802 174014 -269872
13201 17834 20084 263475 93617 -43159 -82789 290607 -357242 67607 114221 -83404 437206
13189 338451 176146 -34566 475429 133729 -135503 101696 116900 190280 -227395 -27643
13178 -72837 506925 -106078 372252 -109179 -29060 59732 118695 584120 -10629 -6325 -158036
13167 -158036 417843 77384 -186034 -8584 242427 158656 -156627 -273645 136564 387659
13157 387659 -49134 96806 220023 -2337 -17951 -39961 199213 -50480 250369 -69127 -206798
13146 -206798 116738 173728 -122826 39790 -276736 -99622 248059 -198967 -55250 -34617
13136 -34617 135201 62874 -114452 272512 76421 219994 127427 139322 366992 295967 6673
13124 121420 24238 -113492 96846 -47857 351249 -29099 -157693 49690 252857 197512 -130023
13112 -155024 -13043 131684 -135597 169481 -174777 -49423 -921 49839 316490 -160386 21059
13100 -147704 -220397 276497 -202499 12761 -210448 -138943 105579 344563 -23853 -62901
13090 -62901 125217 246236 -303466 77228 119725 262 584877 86213 11587 484948 329340
13079 329340 114598 110898 1131 64453 196144 441329 102652 239178 144332 383683 -192034
13067 519849 116838 24579 128779 7762 62485 461887 216262 155813 -5213 260971 51074
13055 271850 10339 174985 126980 182001 213359 -225957 167425 220256 162710 151774 301991
13044 301991 5520 -244075 182782 -171442 -178594 215771 -53491 119286 153950 132431 87899
13033 87899 298044 -65594 -182420 -176149 141216 9626 106921 57332 179816 51717 155763
13022 155763 -110757 50787 199578 -199420 51846 115272 -61780 265920 -168262 65538
13011 152806 326022 237473 90493 272164 33537 280660 98818 275515 -75519 237635
13000 -129588 142192 136778 -68266 8692 22095 220500 186893 -66110 -28112 239219 -209739
12988 -212664 -85886 176098 -36393 159022 508340 98191 102573 230154 300877 -89531 -99449
12977 -99449 30151 -195304 -112890 -321949 80780 293950 245052 -136554 326919 -44266 -121762
12966 -121762 12216 96233 6871 113419 218797 -401116 -239656 62632 61247 79156 257688
12955 257688 -215871 -257866 134328 -61155 146876 -274891 51067 -86265 -131322 60600 63261
12944 63261 118594 328773 401568 110497 -96519 -354543 -59933 72945 128230 18314 63284
12933 63284 -150013 81135 -89723 253749 -44175 107772 11453 461985 -416020 338265
12922 -214410 36335 42542 -132828 -17816 109499 48633 -487430 -134653 -97140 33046 -49920
12910 -175982 -76057 74515 231579 -142818 -81344 -274253 20529 302112 -284085 164850
12899 -32892 338627 -32951 20299 38725 -134584 -71047 312783 -192892 79377 200880 46564
12887 141784 280785 -217397 196145 -347400 -205851 207538 -164900 101284 168445 -118266
12876 -44555 -120915 407373 -266996 -236927 -94887 58515 273041 18853 219789 -245233 -188370
12865 -188370 124481 -119434 51494 137870 -119429 234170 432658 -295287 89852 272722
12855 272722 -252887 -65262 377602 72593 -210800 176277 38971 75735 38802 402824
12845 402824 98837 -136074 410007 28162 65455 113721 134619 168173 -35971 -178498 -118979
12834 -118979 93941 -129369 130244 310338 158762 104041 -110919 -13431 -112617 -69329
12824 -69329 97117 -24509 -88538 275240 -148328 -28655 -76455 73921 12418 -100167 162625
12812 -19030 -111026 191395 -119077 -60198 -56293 199646 167911 -73828 -3836 39832 142318
12801 142318 311878 250366 -233041 -63669 366672 -201001 375148 73264 -210423 47565
12790 2686 89363 269748 -73712 -157248 -159913 117836 20552 95207 -32903 -126607 69604 22602
12777 -71726 -123315 -275307 173617 -46644 184383 -46774 113858 -32605 64436 -155999 -17229
12765 229460 102193 -224980 193671 -55571 -224396 140199 -67760 -263567 -235050 -108418
12754 -328055 -215912 -88639 -24102 372221 51448 63821 49221 -457206 -122123 41686 5927
12742 253237 122739 -246184 129278 94960 282365 235586 136541 93909 -134517 15892
12731 -44154 204972 211870 67702 -294992 9655 5068 310624 116141 -246652 301834 65118
12719 36913 -337511 -90057 301000 85928 365891 216515 -50324 37355 368731 437449 -59823
12707 262068 340134 419341 544306 242098 260030 210498 -17942 183638 291584 228015 -122067
12695 -160168 179119 41809 -10872 81815 -31667 87651 -64253 -337225 135578 -94545 52192
12683 3270 5652 -202104 203635 -5770 448099 -227958 228907 138253 62139 -13140 2847
12671 -199872 39946 88883 420274 116847 29850 83948 217276 -139988 92356 129333 162793
12660 162793 -79604 76224 -178814 -231378 -17028 88945 205069 222412 101175 425187 432495
12649 432495 -13488 -24557 81596 48353 -59971 125303 54414 -137538 -39967 -50896 530872
12637 136016 -110282 -143810 173336 93463 38017 226704 246080 336044 331483 296475 359470
12626 359470 285501 482698 308817 69526 83628 213575 208859 384143 202368 -56448 166116
12614 -6195 -270828 -278448 9796 -81431 92672 254082 125718 -154962 -302486 -162220 79943
12602 -282605 267258 130392 124778 231282 154340 87036 233087 72620 367230 50864 343983
12591 343983 -60036 -361500 266890 115867 107578 -44815 -83188 -69448 115559 -463 -64386
12580 -64386 24757 -73052 -15002 2121 108046 -242405 -260656 251088 -71588 65361 7598
12568 45953 -375695 201823 -75886 68062 -95557 -89873 86975 -40476 55281 246832 -164283
12556 348657 -1804 178037 -231017 165865 163198 85192 -48526 127434 88305 236301 321034
12545 321034 -106958 -74286 -38912 -101527 33846 -62753 34359 66359 42460 -123387 194737
12533 33779 -149001 101776 292038 -40393 158318 -1862 -138277 5429 401830 322569 14992
12521 -159776 191394 111531 38160 -18708 -11554 196456 -210836 482697 143165 227452 -89892
12509 -39924 236297 -373595 -215398 159706 93515 251119 -263345 216150 -33758 150406
12498 -146026 -58685 111447 86171 -108003 61077 273526 -156706 231852 242736 58826
12487 21117 -259791 66255 5660 5656 14032 233198 216558 -137935 82168 -436625 210106 300010
12475 300010 -146759 81718 181947 -69025 -169659 -45193 -145777 105059 -276715 48955
12464 225730 110167 -2255 -99677 103973 17858 137829 60060 -601306 -151309 -106075 -9721
12452 -118221 45059 46771 -160826 -33509 57794 26140 3874 -135098 -243877 213687 271425
12441 271425 -277495 40672 -179523 97759 -382658 16424 -96458 170691 35518 207 53281
12430 53281 209626 -67109 38162 -60242 55399 87899 155747 143075 -7203 -109105 93540
12418 -66833 305459 99413 56046 -24177 133752 245803 -42449 -295884 255037 132500
12408 132500 60783 171156 299622 15638 -298186 -19938 -53732 208238 61818 -1275 -30012
12397 -30012 -260721 6443 459321 148666 84595 101682 425890 6143 -84688 -236417 -167158
12386 -167158 -64847 194859 306298 55430 54526 -56222 -229389 246451 21891 340417 -62880
12374 -136976 195987 50751 -390020 124092 -173459 159907 -180942 -69334 -37376 241030
12363 -75660 230622 -103604 -78518 -92104 -209475 -123927 -81158 -137667 337382 -121449 47805
12351 238772 111957 165361 252676 30839 97539 -267051 93023 -118691 -219708 -32582 218276
12339 150017 -157229 30027 -306759 23179 39580 -220261 -285737 -111611 -159521 -305307
12329 -305307 -172710 30032 -62842 231295 166078 17365 7314 170634 -88297 -378122 317062
12317 -64847 -28792 185243 33332 -26569 -116577 119106 -282122 362086 182843 175123 -69002
12305 176854 15429 -60832 -139161 167838 -103163 143218 52634 160046 -9978 7050 66807
12294 66807 -168883 -112124 120001 109773 228604 251294 -105111 -148158 30194 -108258 174436
12282 -303640 -260531 -154040 -196040 -286232 134739 113644 130521 236223 117831 -13978 303230
12270 110000 8056 214953 395196 259804 322728 409220 36828 308936 -78760 -161693 -33750
12258 10215 -105451 28380 171460 120335 17436 239078 277766 -91446 182051 70959 -322130
12246 87249 -42527 48808 130931 20419 2935 -88093 59298 111742 81036 7164 109965 -51850
12233 173874 70967 194384 223773 203540 55074 216545 335539 463229 38206 67513 49728
12222 49728 127763 243880 252255 263278 334152 39153 191212 161985 191062 -103946 134560
12210 -22171 432952 -18263 239436 273365 82097 -98023 398848 362906 58471 200533 -67253
12198 -9741 459916 455477 137348 235939 311393 448727 -199825 46147 311998 -66740 -243203
12187 -243203 287931 -247385 -39635 199186 24399 85854 291198 103725 131886 414917
12177 414917 -128989 161858 123927 308878 247688 -153293 302911 -33633 426607 272216
12167 272216 209470 389575 297721 30487 104680 -295174 97926 -84641 19553 -14194 8469
12155 153370 414447 -142836 -290696 -56295 58357 -155664 -68106 -208491 -17509 -131615
12145 -131615 256592 251135 380895 -31312 160605 258733 -59899 318786 115436 -102863
12134 89546 -45794 163147 6569 -89243 99830 22711 -35907 -57063 295942 465700 319109
12123 319109 -2249 142495 -133508 -258257 148088 35660 163749 -150345 197528 311445
12113 311445 201227 -287041 -204261 -15567 -153197 -280610 -299110 9373 -105518 -79124 139740
12101 -114814 101718 -177650 118528 -266693 65602 192409 212795 176166 610165 42197
12090 -46087 283368 -90104 -91653 -243235 304729 351906 -80574 1995 235903 48078 -186187
12078 -74449 -50399 -277349 -116178 85646 179370 139760 -85141 -18673 -538 -118457 267453
12066 1383469 1598827 564484 380521 158553 288690 -292317 -50153 395817 -27986 79625
12055 131713 107208 422645 -137769 15525 -307189 -91710 16041 -125582 -47755 -137409 -89868
12044 -89868 -154276 -6802 -137545 119134 6644 -101840 -165284 405894 -263314 -267538 70266
12032 -9319 -256123 89811 37221 -259186 146858 130098 -67166 -10979 -308740 -76540 -257640
12021 -257640 10606 -167189 162878 -125815 -174235 -151499 141685 326186 196117 -97503
12010 32171 -77068 183662 -49482 -32334 94235 210255 228974 -104848 11925 64752 180295
11999 180295 8521 -283561 -240610 6571 -128045 -212079 -165789 300112 -20688 -402963 104082
11987 144988 -188227 -111074 -84167 106248 262453 -33817 -215788 -17088 -250885 178000
11976 -167653 -214035 -223288 -260618 -317343 -15203 159464 266637 -208292 179637 -43273 25894
11964 -144264 16685 310025 -146711 79618 -93192 272956 -92293 -233923 -77893 -103083 -42947
11952 135963 -25179 230078 -24308 -4419 204366 -25025 188781 -159052 10374 124749 103199
11941 103199 125999 148577 341341 -78193 263986 -134762 -196503 174116 85976 112615 -231649
11929 -82330 219026 -39530 -29168 -26019 -54899 -281071 -160763 -137987 -4407 -88890 323335
11917 -72488 -71150 -29984 -51376 285198 -233830 -235725 -24190 -115703 -71941 17777 89179 329587
11905 329587 126324 209610 -11318 861 150088 -194482 -34772 59108 -21238 51047 -223403
11893 87804 117795 29771 -199443 -34967 236419 -12643 -126012 30556 -189995 159430 -33867
11881 -78638 -41514 -64083 46050 135631 5374 30812 -152239 -370171 -294776 91235 -7125 -213291
11869 -213291 -142095 91640 -328271 42802 -399887 128377 -133153 246069 110271 -168176
11858 -151995 23919 252203 -78085 -162203 37964 -185326 -40161 -123449 -67690 23324 41662
11847 41662 58476 -7130 -58184 -27976 -24738 -161752 214636 122618 -92035 -8661 79603 -59879
11834 69465 169891 233593 88779 -113913 -92492 -92357 -128727 -259721 -283881 -219912 -11697
11822 -123682 83027 48198 56119 197257 -191613 24881 45877 -314227 99524 -75162 112378
11810 -148433 248362 193252 -97537 450877 12663 -131680 3910 103103 19459 -54393 -7113
11798 -79331 102831 -50892 -94350 -35251 -270324 89074 -213002 56333 -314582 -693268 -147230
11786 -55877 230963 -53182 8897 -65960 -165433 -38950 -34495 39932 -216324 31602 -30928 -354385
11774 -354385 -250733 -230400 114052 -251853 69877 31472 -48662 145004 64576 9918 26097
11763 26097 218451 35964 -136083 -21677 195262 -218101 58405 81270 64343 -174795 86713
11751 -253975 -86861 22709 161433 -143197 2415 138895 178450 -238131 113755 -144179
11740 146134 256424 13454 331486 -173541 -47157 -151423 127088 581596 -15984 136060
11729 210961 116876 -70402 90395 45094 -101440 402844 -239066 -62083 -64998 244710 127247
11718 127247 -44223 307282 36726 161437 172290 -72924 171838 88305 -51387 108610 -27478
11706 40113 -203497 -37242 -135216 -218976 314641 -82084 143638 352598 -61424 232922 198089
11695 198089 271894 103838 282667 82798 793 32874 93717 168435 554806 18732 -157738
11683 123810 553810 12973 293025 16232 -7739 -13676 261148 398235 250574 59794 -295008
11671 77765 80104 48632 98181 -149197 231802 306874 124892 236864 312503 -310761 -192846
11660 -192846 -113467 -113344 -185417 -276852 230390 -5640 -81220 -24465 -145348 27269 -267610
11648 -35711 17132 111599 71095 176216 -100557 -58229 -198783 103289 -4414 305496 176914
11637 176914 -128999 -99356 -54758 119464 -244708 -203878 -114667 -42641 -99718 237519 171319
11626 171319 -38449 286121 263214 -9321 -148888 233039 -148261 131205 194189 148470 -214262
11614 107980 -176344 42573 15203 271044 -54222 38062 -346960 -112972 -10274 83276 -157471
11602 9898 198955 51184 193921 -120953 513014 63747 132648 110638 -9852 81602 152093
11591 152093 -62835 140337 -88808 106499 93713 97734 -216754 151846 -28668 253696 237378
11580 237378 219909 71283 -224344 94604 252697 188960 -54847 270457 90407 -110092 344286
11568 117409 36030 279654 63225 182671 123134 66554 154158 -188508 108235 45274 130893
11557 130893 236172 59865 36504 30680 149322 -160529 227891 276296 264064 395356 362412
11546 362412 358332 144638 -120486 200003 -78714 165825 -23640 128057 354428 58736
11535 270796 166661 43963 -49419 290524 244068 -168192 143788 23687 441406 56589
11524 19287 -62404 -28188 274936 -261198 288842 234125 149386 211069 349306 157041 459554
11513 459554 122438 -39246 260325 321058 91280 -358982 247567 182125 545331 112537
11502 301625 175814 140950 -64598 214622 -177752 -18529 190010 158574 97753 38354 48671
11491 48671 10609 359922 162547 174673 -101588 237922 -913 -1568 327446 321083 173387
11480 173387 -348602 216148 -32822 167070 282888 230283 251121 100094 338122 40059
11469 -130539 461551 85728 -79772 -19916 173936 302955 347808 285789 33028 -22786 211456
11457 234446 139960 -15830 -72013 -109437 216631 67542 -118602 69520 311221 32872 -144561
11445 219245 -57658 277050 277708 -20995 259558 55200 109889 182139 87127 -26252 134396
11433 116910 -193064 9290 323777 115162 54187 -31475 158762 26589 38226 -278946 -90106
11421 194232 23300 -32936 -156345 150055 34991 -108125 -77479 -28222 -305821 236356
11410 26838 155679 -38749 229287 28985 -87719 3607 346084 253261 397316 -18026 190339
11398 -30849 -222 203636 90012 -155089 91992 260226 4333 172186 -320334 -192965 1551
11386 -40702 -236979 334031 -220101 212604 145382 -111498 76409 14345 134892 25398
11375 -283476 -172515 317668 -253621 -73607 -109774 -341941 183119 -154412 109550 161077
11365 161077 251915 124772 -162841 43977 -149463 -67613 -70295 4481 -35564 73422 82168
11354 82168 -17929 32800 -27400 123654 -79763 -137549 -14801 -53799 10432 119776 -276341
11342 422817 -177305 -8158 -15102 176324 125945 355197 20990 -164263 -126627 62339 -448028
11330 223277 -23253 299290 217422 -205100 61193 -185243 -196550 395338 -184074 40149
11319 198953 9272 -61315 198515 50566 108854 -276715 171824 45779 28125 -113358 -78648
11308 -78648 -226498 150783 -33788 203309 -74349 -68044 -15632 66871 277483 -43173 124594
11296 178621 -132645 77963 -74949 -283374 -206491 141574 -44902 179377 142658 -5991 -98023
11285 -98023 -214564 -112155 8903 -402774 -124314 -73048 4236 -21317 -63770 198468 69848
11273 -175906 -84715 51811 -170669 2024 22334 -180973 -39585 -179621 -20966 -169289 -186805
11262 -186805 -224368 133065 89079 136691 -145971 -112984 241305 -119169 -139017 -8479 -143687
11251 -143687 173159 -399924 197220 240921 -140314 -109648 -421986 -79092 -245223 -221433
11241 -221433 -138800 -9958 133007 -1429 48661 125153 -234318 31045 -335298 -10608 185068
11229 -15745 91822 182176 399367 256613 -410309 -287762 70873 -268179 182363 -16981
11218 -37464 -81957 -179004 -364447 55972 -104873 -35158 -16387 90442 -139490 -128516 251529
11206 134112 -136918 93175 261711 -57492 123458 -90920 -210521 107608 12803 -52443
11195 -195148 42557 -5650 -1861 59833 -134131 -168779 -81572 -110619 114095 239177 -33001
11183 -218775 16824 -290184 39982 -100660 -1420 62356 -5020 -110130 6627 164757 242230
11172 242230 -194108 27931 -15584 -75524 -294432 -121493 -29404 48969 -178602 -7297 67346
11160 -111046 -154492 171133 -232092 -261514 42825 -106106 23177 -208484 -194472 18754 -62826
11148 5804 -140993 -52759 -82945 -295956 -5258 -43237 39339 158749 -79903 -184028 -114898
11137 -114898 -145803 251099 123235 122879 -56153 -198358 -180191 -243216 92651 34773 251795
11126 251795 270273 -99868 77859 -144039 49921 318457 199682 6052 113143 -77431 436423
11114 4877 325107 129176 -18144 92032 25357 349423 47069 -35430 77511 121317 98373
11103 98373 441737 188873 436329 261626 59868 183681 -64440 316139 199499 13109
11092 -80935 124314 161798 94870 153297 -17660 153777 118153 250565 116196 400258 394967
11081 394967 -36743 305302 -63940 -56132 168601 46402 137125 79626 471994 275100 -15810
11069 535368 603027 244102 371302 505910 184083 310200 384570 905597 624544 515052
11059 515052 289397 550529 675738 583345 667931 587439 408872 684723 669754 576635
11049 576635 809016 739038 993146 987963 932514 642990 838046 989095 1096796 847351
11039 847351 745551 595645 750480 632853 736530 922199 689444 683063 535620 745751
11029 745751 349553 867895 716753 669634 1187585 735305 708186 804833 753458 670110
11019 670110 934926 626089 807875 945512 952768 839286 577615 667875 1087201 620906
11009 620906 342124 660723 458145 494830 538647 866246 778137 845270 525315 763492
10999 763492 562090 609744 372302 468668 247265 590077 711161 1046063 804166 803980
10989 803980 808166 888392 894277 860050 1003689 947951 1036365 1438255 1330004 1217878 1551011
10978 1551011 1355888 1353900 1833914 2064180 2091145 2405744 2884462 3026883 3342791 3039615
10968 3039615 2864608 2701305 2452237 2680670 1951653 1820433 1887536 1736760 1985657 2217784
10958 2217784 1796621 2315153 1695269 2270550 2074889 2069386 1761172 1257734 1190691 1038823
10948 1038823 797119 741608 355642 711521 506498 423895 442488 143532 136744 -23853
10937 226554 208972 124920 460645 407540 -37146 -40402 55050 43126 310499 -62592 186600
10925 188130 -30206 203722 -179795 63796 -41158 51748 186082 136083 262693 4945 217354
10914 217354 268196 -230374 106162 32493 152367 -22477 140482 69064 -218935 75622
10903 -182331 -160583 151394 -20200 53519 108181 -179779 -20234 -147227 202244 131074 -154493
10891 63747 271972 300358 -115995 285266 185645 -330018 82661 64025 308022 -71173 96192
10879 193617 23444 325882 270169 94798 58080 -202824 101357 -8401 202742 37727 226091
10868 226091 -244327 -220896 -153904 108065 -271836 21074 -22403 -113309 22471 -46772 104433
10856 312493 4124 -321366 -102100 -9271 50679 227447 81276 26189 34228 -905 -203815 -41725
10843 -607955 156048 -151300 -278718 43648 -195875 185593 35745 -66841 -854 140993 241
10831 -292613 294640 232592 34990 43111 -151254 -143087 -5652 -73561 31260 -228615 61624
10819 3982 206942 227172 -58714 36787 92789 155969 -233395 278822 -48104 79902 105272
10808 105272 210368 35047 -263029 -175878 227620 -88144 118742 -586520 389122 -91889
10797 -310510 -268434 -37356 -17197 -47241 -87534 -98024 191859 -141781 -59560 5642 -223764
10785 -296762 -157474 -280346 -311515 -203164 -92820 37791 -185766 -122087 -3910 232486 -59044
10773 -18633 -145528 254303 164665 -12151 272497 -215374 -73215 -124788 200 -202493 265081
10761 -115798 -206608 -230128 -4720 -343035 173806 98362 9671 -153968 135272 -94978 32338
10749 -327102 -205676 240045 -368821 -36952 123883 153733 38705 212061 221258 -10850 -121879
10738 -121879 -93454 342765 -37453 156218 46382 -1771 9240 -249377 -216895 -41661 104923
10726 -28232 -82803 244774 -287007 -9385 366707 95637 -229872 -567043 229994 -98580 -7719
10714 97843 186660 -228259 -65745 83867 -32108 27075 68567 -230108 -124780 -389 194047
10702 -257439 129599 -71417 -388294 -231096 -257235 56708 8595 46791 -143510 -118048 147422
10690 80836 63440 -170255 -318961 186861 -53418 95111 -131393 -31275 275281 -43099 -247053
10679 -247053 -484653 186993 -228155 44463 -327234 -117444 39778 -187444 -69022 -313952
10669 -313952 -169854 -363866 -170677 187920 -38168 1717 109210 -76562 54456 -174491
10658 -189552 21676 -4410 66925 33309 -86172 56908 35941 -226158 63804 -563245 181576
10646 -174875 -33937 54873 -255938 118981 -131776 -115631 -190370 -400548 27409 -60004 105416
10634 21482 -251091 280621 -10708 201622 25627 -529315 146640 -150992 -212192 -17436
10623 188186 91156 -362041 251749 368645 -123621 -152259 171353 -100033 -113705 -124261
10613 -124261 3806 20387 -125892 37153 -8539 -74496 187531 -69737 -232231 -128105 -172666
10602 -172666 92643 128512 -116227 -320965 -294400 -225543 -362864 90420 -34078 -13181 -42929
10591 -42929 15370 -244062 -363737 -54883 -207189 86150 130179 189230 56180 -168435 157332
10579 -196880 937 -32936 -174911 -86301 -418580 -190948 129586 -2126 -109492 -148953 -114382
10568 -114382 -94713 -10432 153366 153558 -135469 20897 -330120 -57832 -228991 73896 199557
10557 199557 13165 -157838 4473 -6432 43720 -172904 162687 -45002 -374497 -35112 10726
10545 -200871 9079 101625 -33733 267858 201306 -283288 -8225 -13281 222133 127542 11293
10533 -398403 -119029 85639 1627 -4408 183584 -211411 410296 -252089 -141709 -76224 -131699
10522 -131699 -160701 -45993 341955 4253 27512 -107188 150138 -336541 -27155 -253004 350327
10510 286682 -246869 210770 65208 99398 -369520 -440619 145629 13583 -111350 17990
10499 234063 -104052 2382 81448 19211 -115405 185263 44521 -391310 -129189 -61215 -122105
10488 -122105 -75584 -56420 -274796 230681 -98364 101343 240035 4215 127396 476860
10478 476860 812601 735124 391838 62694 53160 62616 -50944 61155 -64457 -108320 94508
10466 338598 189922 43820 6674 -200803 9635 -159246 257203 -238863 52704 269774 -377100
10454 5282 260907 -112715 -124680 68046 -160752 247857 38358 -235392 33129 340825 65478
10442 362448 -115774 102062 -256634 -12402 199821 -116753 -25197 108924 -149787 270453
10431 -96089 211091 302306 -161509 227060 -133301 -112429 -139463 163740 76102 44666 -46979
10419 -55314 326863 298716 -40184 -81794 136538 -197337 -215290 81433 -322817 39912 41807
10408 41807 -148014 -5141 -47942 -87655 -407392 -189175 -319421 -84305 -44227 30394 54372
10397 54372 -116674 148926 228161 -41486 119216 132143 7593 107802 57105 166586 3263
10385 -51691 110915 167831 -363050 99512 185874 314046 -21854 -113103 262212 235753 480827
10374 480827 348958 226626 218341 80503 176166 293234 507495 307253 431777 351505
10364 351505 572896 251969 77149 206772 382918 383303 560524 58296 448270 63698 152223
10353 152223 501597 483783 493363 529554 541542 184172 519769 211095 584972 223418
10342 635674 451832 439922 302465 97975 -227587 244223 97534 528331 13851 413169
10332 413169 -117656 205734 140934 198372 -29337 305759 -37873 149015 -128446 157694
10321 118138 137636 392936 161166 196033 -32089 34830 155121 47881 207814 590717
10311 590717 404597 248580 -53119 182505 15008 -277584 -55107 76496 -117025 -46433
10300 136872 19401 -9165 71664 71009 -93455 -549214 -147744 -2009 53264 -299716 16639 -253551
10287 -354167 -223636 -360835 240409 318297 154672 49576 109297 -175474 -60335 -100236
10277 -100236 72843 -306198 -13753 -115852 -250671 310564 -154824 -269674 56580 -332935
10266 -64856 184031 -131344 112351 188960 50242 31257 127874 80759 66980 277832 205366
10255 205366 236883 62205 311741 141148 125598 161582 -65843 198920 79264 -225472 -59919
10243 -243976 -49285 36970 218314 234829 -96951 -38183 -159659 -80959 88522 173963 253193
10232 253193 3903 18954 -181624 -45190 -384230 -57638 141886 121810 17357 152192 16209
10220 -115083 239611 -258564 -137818 -306730 -344016 -269011 77691 -100967 -62234 -478304
10210 -478304 26942 -7132 -189118 331038 -90261 252360 -191506 -93410 -243858 -307781 118151
10198 -281739 2148 -118965 -118848 -275087 44474 -87385 -95664 -549433 -206080 -263307 -24426
10186 -160865 -14606 -9547 108900 74303 2871 -60078 -231047 43019 -196103 -246952 53121
10174 57257 -119439 -93336 -185671 -155945 -192367 -223739 -333091 20974 166237 157843 -395877
10162 67168 -133612 -59791 -17817 -53932 160999 -280419 -333100 -323352 125723 -54625 -185944
10151 -185944 -47001 -231657 -33544 97406 -129898 -8172 20733 204375 156882 146115 -94077
10139 -235895 30622 -198940 -80921 -32963 -346888 33478 44488 172261 67847 -186538 167221
10127 333263 -129458 -374820 -54481 214421 -214298 82712 134588 -417683 -20378 29972
10116 181086 -501824 -147417 14756 -63577 202418 48411 101757 -103930 -22942 72408 161121
10105 161121 -33504 -236510 -72676 191779 80602 27569 363048 172164 126179 -78032 -9894
10093 -231724 264389 -73275 93018 312762 -460336 71893 24057 79919 -71883 -69811 20349
10081 -19431 77128 -80097 -192736 42089 3870 95506 -290100 -177094 -231936 -197330 -22801
10069 -333125 -208326 -33280 -208804 -54944 -107356 -10975 -77072 -158916 79944 67361 -86754
10057 -18666 -8391 -335118 -285171 -84496 -43535 -43934 48444 -2949 -157678 80323 68940 -34998
10044 -233510 229608 45183 7041 -403700 115506 16406 -230516 -59294 -183748 -346694
10034 -346694 -95416 -44715 -200948 -68425 212574 -199903 -139277 -211308 44971 362735 121491
10022 86916 -147131 -94019 -241390 187972 99656 -161853 -168704 -8325 -45083 134011 -205962
10010 34689 -437744 142224 -135729 93403 -264668 -11068 -147330 46384 -73751 -311974
10000 -311974 217353 97140 450575 76751 -117736 -213736 125292 -316500 -292045 -45848
9989 -237888 111532 -113479 -363912 -331049 -220761 -111985 -47341 -160641 74898 32416
9978 -113602 72662 96385 11072 -289191 -255707 -40362 88667 -170775 -63568 77802 -18204
9966 -9197 -18567 43710 -108521 -301214 -171128 -156571 -89621 -12461 -310071 -191905 -90469
9954 -127132 115764 -135585 -142258 -29932 -122731 11279 188028 326208 -71197 -227202 -168326
9943 -168326 -310114 92423 139292 -83752 -77311 142719 -343230 108192 14769 186505 115422
9932 115422 79027 -89860 66901 -396575 -2235 112492 -21966 -12321 88861 -134630 -200159
9921 -200159 -240128 -5974 597 -88212 243361 -57350 112087 -55705 -358863 129464 -211597
9909 -78282 -39340 41071 165736 15130 -100906 -14086 -38839 -160543 -374188 204888 -331144
9897 208196 -169353 -352105 73380 -138961 62215 -130230 -62294 -156347 243259 -262375
9886 -109841 -47711 40692 -29799 -92102 -143991 -187689 170156 -128043 33912 -164937 101441
9874 -139228 -13398 -9911 65203 -131832 -249603 -158982 -176098 -45277 -93352 2663 98471 -107709
9861 -193713 69012 -81640 234838 -189044 -324112 232011 -253347 -146225 -177263 31330
9850 18362 -304274 256071 -127659 -296308 205897 58996 5207 -21637 91711 136655 -69041
9838 -108892 -198004 -140266 -549706 56378 -256880 -147045 185508 204137 135214 -177050 -15539
9826 101429 -145351 -229720 12709 -289433 -244296 -57645 283518 -34612 -94639 -260865 -311844
9815 -311844 -217507 4007 -203797 387 215135 -14129 -117282 -154397 75959 -425779 238125
9803 -426386 -162751 -199055 -60663 -77229 -420264 -367568 -68858 -223333 29567 184387 -324871
9791 -54516 -109545 -835 56416 -90135 18618 87985 -137480 -85684 300277 -189338 -151712 183435
9778 -340152 177310 -4138 -530379 -42272 -280864 -13647 126914 -210576 -186419 -115789 87359
9766 -2324 13873 -435905 -148664 -14779 -127935 -299194 124492 429570 -172110 74385 11015
9754 -165316 -338341 -194827 256283 534471 -194801 -161828 -172670 82775 376027 -169755
9743 -132484 71410 -191266 -287266 48099 43678 88741 201364 29442 346143 -244056 14008
9731 -217174 49570 -175810 -120441 -218940 72451 -18306 376458 -145124 190427 -72996 -44469
9720 -44469 -56180 -183870 -153030 346141 -314135 8751 -65753 -278533 -110537 -172536 -173058
9709 -173058 -381763 -288853 23150 -71295 79461 -26661 -80611 86136 -128790 196765 -183787
9697 93556 -192361 -504599 -167800 -251475 86241 158440 436660 -22557 228045 -188623 -37781
9685 -50084 327291 172615 -230346 81769 -385648 -82605 32654 37915 29001 80598 -233819
9673 -428096 -251800 109349 -149090 -147263 -11445 -254858 34091 -227079 143483 -31210 -309238
9662 -309238 228736 -268616 -350270 226016 -150607 -253091 -140773 -153242 -332967 -124492
9651 -119305 -190861 -54288 -173394 -479886 -280975 -89376 -251234 -66582 -93697 -224676 -151186
9640 -151186 258864 102272 125702 -440507 -218418 -91091 -87220 -397057 -239009 -94926 28030
9628 -216509 -20177 223625 326623 -182700 -136273 14144 43123 -247547 49554 18432 -160441
9616 173911 -181700 98829 -270347 -149426 459502 -104601 137120 168698 36551 -56374
9605 -118501 -40643 265866 309404 45696 112754 -230862 47590 83512 195392 -104230 8881
9593 -428226 291998 3699 34763 67447 -117243 -184655 -121104 -394877 353263 -353804 -94439
9581 66115 131687 -107173 7441 -124556 -206773 -170006 102092 -30538 -140912 -101926 50997
9569 17715 20125 -24641 -79031 -50722 -63852 -39177 -105702 -190755 -21843 -11198 -228397 133153
9556 50108 125489 52416 144794 137047 95444 -104057 -130344 58096 -198381 -220584 170851
9544 -137674 -266589 134358 160261 -520815 -212549 -357739 122956 171666 -315499 -208128
9534 -208128 69780 -50690 -83628 -24265 -88100 364884 -168199 -112423 -164993 -480284 -17261
9522 -64103 -390735 20230 -420601 -40702 -161494 26853 89127 64714 -179278 -1274 101191
9510 206798 276647 -198745 -263350 -55477 373015 -246100 142523 -167461 -107572 117700
9499 40425 -31378 -216284 -170722 -260474 89005 275574 8357 -238325 238044 -142817 -147841
9488 -147841 -192281 110142 -441879 -15518 -139640 -93734 -137424 -266044 -67131 -14249 105500
9476 -120181 -248866 -268185 -107530 64050 205645 -13091 -165791 150695 112451 -306914
9465 -87492 199920 -236092 -93025 91845 -79243 -132600 -84592 -154795 46740 -96254 -95809 -398556
9453 -398556 -251545 44963 -126261 -289797 24670 -301850 -300371 -189929 -72777 -15200 -271848
9442 -271848 -252275 -22623 -142668 -295657 10719 -71682 -222523 222737 -97359 -203276 49880
9430 2785 56614 -237993 -84401 -106281 -15323 -70592 -19794 -512301 -153918 171376 -13086
9418 51314 -519426 238862 28231 277319 -113226 26434 -26005 60920 -132814 20672 66002
9407 66002 160510 -133286 -126118 44805 59334 -89047 -74517 -24437 -1166 43456 -66197 44810
9394 44064 25954 47061 -28424 -52836 -63109 5813 -44328 -187900 -215465 -17547 233692 31836
9381 -311485 -108691 -226337 -261245 -109022 -279497 -237918 -133574 -439661 -98427 -37704
9370 -337647 -15391 -293322 -121505 132802 149538 93885 -252629 -85793 -15004 35077 -95811
9358 107900 -442498 -54393 219735 -27200 116763 -82729 65233 -162403 13246 218937 -204703
9346 -197389 -53327 45242 -256375 -72523 -46007 237155 97590 128028 -6051 -121444 -52595
9334 6142 -255723 233664 -420555 130925 -174886 -35474 -111 114046 -133115 -78290 -132050
9323 -132050 -270859 184976 165771 -22671 -144267 88249 161856 -175190 -56082 169248 106122
9312 106122 -219910 -158712 178786 -3612 -260898 51104 -46412 -23200 175950 -229731 15446
9300 43302 8476 -98514 75610 -75804 -195995 -227263 -4572 -261949 -262523 -601 -110803 -220281
9288 -220281 -440789 -198809 154307 -44005 19857 -315561 -143910 -173095 -86498 -1374 -56533
9277 -56533 53555 306508 153905 -64059 175365 -40738 -281220 103652 -287076 -50999 -10170
9265 -440414 -230061 -245962 -70582 -269676 68024 -90909 -332600 228163 -111519 -197895 -154431
9254 -154431 -301823 118860 -39303 -319026 41840 79546 -102520 -40831 -147490 15853 -84722
9242 -115937 -292607 171801 6582 164686 -252325 -110151 155051 -41712 30095 -126525
9231 252783 -96301 -290481 -282591 -47757 -156243 -201602 -265841 65109 -275310 -261660 59500
9219 18142 142034 -133750 66673 182003 -2691 45016 -125711 -128108 -206971 12449 -275072
9207 -102707 373309 -179183 185325 33617 -172277 273874 -50534 336691 37228 -154572
9196 33588 -272641 12640 50644 184722 -251183 5717 -212428 -263120 -46491 304380 -29751
9184 -268138 -55691 18953 -104643 -293239 -9326 -16707 -188421 -121985 -319922 -331714 49992
9172 149750 -215257 152141 -270427 -67769 -158973 63576 -58043 -107011 -260321 -52953 213205
9160 -31607 -125104 -75015 -23780 -237909 -75425 -102634 -156232 43644 -194288 -47365 60793
9148 197047 126586 -64671 -271052 63060 -39610 -41221 18050 -151173 123022 -240405 88156
9136 -209865 84536 -62557 -89721 -61809 175970 -104749 -166526 -38075 -308127 -198367 -24362
9124 146167 -297713 29663 110312 -332722 -293752 -155164 -170478 -226366 -96801 -70805 -303326
9113 -303326 -124432 -172058 -242039 -173148 -234059 -33359 -91197 -149904 -88300 -104652 20233
9101 322858 149186 -48093 -94656 89030 88587 -423666 207289 -194649 296339 229770 -214914
9089 93559 -132390 -64950 -48784 -52418 -249986 108941 -177763 -353683 -312973 -129478 -115056
9078 -115056 18688 134187 114976 -143499 133350 45862 -264477 -116613 70444 97305 -106727
9066 -158404 4584 -243346 -334437 203062 -28641 -231363 -144220 -345630 -148615 -134617 -174860
9055 -174860 -78773 -184484 -3212 -88085 39090 28473 -17267 83028 -101389 -211220 113947
9043 137371 -190990 118028 223244 120099 7425 -166742 14165 -301476 -231771 145566
9032 139642 -200081 -34675 -219957 -40845 -294363 -293880 -176967 -70574 -159865 171134 75045
9020 -54845 -190272 -16975 197916 125802 -33855 -90163 152312 -437351 -88330 -92947 44293
9008 -40625 -47722 -62354 141339 109908 -88267 -148087 -74916 -100408 -117248 -31144 -449567 -20467
8995 -82748 -9857 366142 -66691 235514 121449 17594 -33111 -25761 -90893 -243554 183672
8983 -182171 303582 89949 -209506 20073 120498 -68602 178800 9367 -194423 -149516 -319110
8972 -319110 -191061 -121687 -60766 -165327 -43073 121593 34233 -1223 -99046 -65096 250770
8960 -69418 -173862 -225577 -78132 -142954 -41978 88382 243493 -98136 56156 -283921 131905
8948 155305 157883 -146739 32396 219026 188841 -291216 -113901 -398255 147461 237518 33930
8936 -35344 -187222 -377836 26249 -278355 12999 -154110 -406133 -258423 84115 -163953
8925 -226546 -6131 135861 362399 144622 365013 296992 -29746 177129 125445 -243151 8421
8913 -101136 33016 -31892 -106679 -34759 74963 122205 -164731 -55499 -132528 -317977 -173501
8902 -173501 -11362 156385 -138484 -106116 13552 135784 165353 9493 -33667 -199239 -264055
8891 -264055 24794 -224963 16408 -15396 98632 -76658 85567 166156 -152886 207643 -260258
8879 -260007 7379 -86882 31612 -228667 -116406 -216636 245823 154864 -66449 303256 -135565
8867 -323190 234759 133870 -254354 75401 30162 -154745 257243 114964 -69052 80284
8856 -62313 118231 -36247 235751 134614 22599 -181994 -89600 -293049 -110151 -412172
8846 -412172 38885 -64030 -192008 -197760 66758 -177136 -168219 29270 -114192 236288 24339
8834 128436 88754 -73416 -237450 -51914 126641 67797 -433671 -136730 -365539 -91067 63209
8822 -223733 -196011 116189 -193910 -272759 -296368 -51015 -146916 -19580 -33216 -268880 106529
8810 -137032 -165703 185374 -94169 -96922 -178138 -58913 -329068 178034 -81852 -96800 -206425
8799 -206425 -85349 63078 411625 -312 -214850 241155 118393 -127103 131588 -45401 -153537
8788 -153537 -51606 -250356 -319341 67085 -139416 285494 405072 -24303 72819 -305504 -29513
8776 -208048 21216 -226019 19406 -91418 -45018 20218 -186595 34101 -83224 38123 -47953
8764 229806 -8813 -4232 -284167 -132082 63759 -356327 35900 76199 47330 71001 -54371
8752 -107968 137543 -179401 -147395 7317 -183997 -94050 -43286 -107461 -111742 -282790 -220643
8741 -220643 8869 -131717 -226545 45122 178633 -32845 35393 99771 -115898 135373 -1770
8729 73711 17705 152758 -183740 13711 -81917 -263586 17156 -82019 -359831 8350 -52220
8717 35638 -123905 -207995 134238 136185 265819 -124804 -348003 -130367 -43438 72648 -115449
8705 -89075 99681 200237 160224 33278 17932 8592 20506 -141968 49772 -82989 156700
8693 40903 -214241 -468427 132662 157459 -281190 195415 -349453 74382 -163023 -114459
8683 -114459 -4858 89618 -231068 -72776 283991 240502 -41143 -288141 -125264 -69012 170079
8671 -252444 -179599 261267 63433 163560 -294741 -395372 -273415 51029 -189423 -38118
8660 -232252 -102542 -318537 15388 -15369 -74010 -141286 -13122 -131051 97813 -129677 288791
8648 -104642 -170764 -88455 -79059 -5164 171587 -232135 -70125 -53080 151631 -43571 286274
8636 -15206 50667 -301443 -146816 103596 -238471 -116606 -350979 118009 -225009 354191
8625 8658 2746 -202779 3388 193240 283454 8288 226198 -49362 147499 153916 -151648 -232533
8613 -232533 -204447 138248 -179372 388922 -195138 -138639 -50854 -134778 -113640 -113709 41549
8601 46538 24711 61828 -85267 -114619 -239223 -240130 104046 -134181 -130525 66833 -158195 -858
8588 229193 -321179 -53877 -337647 -61573 132327 -133966 -72039 -262081 58034 -243341
8577 -206841 -126482 -1835 232816 -420806 -173315 12336 -37992 -23926 298808 -181735 -10961
8565 -387899 127910 -88477 -93798 126028 -77085 -111561 257971 31661 317639 96140 -170981
8553 102568 -293544 64482 -285990 -111707 -193122 -187790 -126129 -239189 -210474 42439 28694
8542 28694 -203904 296968 -184898 -162697 259178 149120 -153472 -269077 -178513 -255606
8532 -255606 17665 -20055 -406298 -110578 113006 -154267 162375 1005 -11747 -12339 -284520
8521 -284520 22927 -236441 231936 -231186 -91478 -397023 122136 94393 264288 -250547
8510 133104 -400602 406976 -67979 107583 -50143 -136424 -493773 128256 -25643 -116806 195624
8498 -74236 -109312 -63008 -77055 -247333 273962 -339385 -189114 11657 -209229 -154497 -106468
8487 -106468 -262119 102126 50759 -180145 -1957 34555 -252327 -214271 -460500 -270624 -242535
8476 -242535 -310829 266389 -385453 480843 286289 -348558 44493 -141828 -214035 -302518
8466 -302518 -194447 43643 -9256 -107940 -63981 -30236 198372 -134157 267953 -3362 -46577
8455 -46577 493 -102733 -131900 -36942 28534 -134605 -152838 -15563 -19712 -56318 -213094 322745
8442 184153 108845 -30872 -137673 -148645 -105104 -7573 -2198 -43691 -220196 -65150 -270574
8431 -270574 -228376 132529 70409 202640 16781 71738 -111919 -365153 -39454 -206847 -79890
8419 -139698 -385326 -284947 -210877 131447 -125611 104317 -277635 -204212 131290 64610
8408 57293 -227796 -182969 -102714 -233450 -114060 385505 -67860 -155999 198088 -197070 126845
8396 49080 -25312 106897 -194501 15151 -183888 -59543 -14640 24611 20235 -324861 187082
8384 -96655 124111 299354 208236 -94166 162839 139625 117977 -87170 -45330 79240 131100
8373 131100 -45773 -66873 -73105 248799 -148735 -198 -159915 -262110 -361702 77134 96976
8362 96976 -74585 6523 -163024 -4522 15734 59844 73281 -311653 -170021 -143829 110984
8350 215610 -116178 -119338 3002 -156104 -131212 -100456 -106703 -169247 -188391 21744 -271976 78973
8337 -208310 -74194 80305 -78329 213190 132667 109776 -180371 70120 -98341 3523 -512126
8325 -153527 -45328 111422 358980 -184385 196575 -244337 253075 350842 -91522 16887
8314 -152078 -117411 155356 -289572 45613 16027 -163351 189096 -8139 -43151 -128756 129736
8302 273508 -203223 -332669 -8166 -229154 85022 -38263 343514 145544 7854 361218 255476
8291 255476 61845 98010 39891 71799 50951 -123079 -58439 -326569 8291 87033 213680
8280 213680 -191552 -182121 48211 -205977 142705 -104609 -90465 -98475 149504 -269189 134134
8268 139043 234508 157482 -99946 -355631 -307085 -54546 -59438 -254279 309229 91669 -89242
8256 -34817 21368 -303609 169722 76190 -96651 -35749 232511 -102195 -4302 167877 -199310
8244 200771 104342 -81343 -64262 -280878 -139996 -193802 -23906 -329276 89651 -64795 -10409
8232 65508 -76931 479116 166252 47162 45603 -140517 -42748 -267903 -46744 -275271 52814
8220 87491 -32256 224707 151780 -260619 2166 -275948 -118054 19690 156838 -406050 -232569
8209 -232569 81183 179887 -373742 169877 -194720 -147893 -168698 -87807 -365007 138078 60540
8197 -207879 -103790 -306905 -49094 242283 -206156 102008 -178655 15777 -149273 116509
8186 -145963 -109235 -166698 -213649 29069 170740 53032 -70418 -145634 79137 -43587 -41787 -17885
8173 -85794 -114949 -290381 106452 111026 188534 -131754 -232897 4485 69352 -93215 -147343
8162 -147343 -30587 101261 -259006 -473953 -321685 -56500 -240723 -148822 16190 -74426 327294
8150 124768 -49275 -403325 22350 140739 -291292 -324162 110224 80395 117745 -188391 -232153
8139 -232153 -55025 -76860 -240948 -128577 -66752 326618 394 -52099 -317946 15314 129264
8128 129264 -79176 192667 -156303 -36433 19098 -20065 -131759 -8210 194207 -179376 70150
8116 -70356 125997 -110314 -146583 -42476 -149089 -105293 -234568 80103 -85110 -86654 -388820
8105 -388820 223664 -214550 -340062 -196471 -245204 106637 -385295 266098 -158759 -19005
8094 -45797 -95082 -62782 13734 26600 14392 -152858 106569 -247490 133886 185880 -206154
8082 246873 -33801 -282732 21585 -20584 226518 -78065 -325771 -186889 -300968 -83557 102294
8070 120163 42414 -40013 45576 157220 -12198 -17713 -85455 733 -35726 91076 -212727 -340277
8058 -340277 181748 -119646 -35147 207255 -58648 19353 -306169 -113388 15714 -102272
8047 103070 47472 -175178 -21569 -236313 -218549 -74564 95954 100790 453253 90811 -77158
8035 -339883 69714 -308442 -144098 132032 49063 -39366 -492759 -86708 121809 14505 63581
8024 63581 -43800 -207681 -119639 -182155 -93498 -20560 237318 185020 -150154 -372133 -349705
8013 -349705 47294 -305150 122963 88584 -9368 -97514 -182289 -102910 145061 50284 7309
8001 -179800 196849 -34689 -93511 45307 151219 10370 250221 244081 70395 265802 106125
7989 -201991 -277602 -201865 130856 -181677 -114303 -87103 64703 -16204 -405975 -190644 97218
7977 169229 -153751 262560 59107 -26651 -104580 103251 97033 111816 -192623 -199682 36986
7965 12337 -262113 40584 -176070 -145326 54099 -175978 -141174 -150044 -11830 -87025 139080
7953 -22092 -248312 68862 -154641 27761 -205188 -80185 -111415 30038 -119020 -49985 -116000
7942 -116000 -131997 -35551 171342 -248515 -134042 -140839 -24695 170506 112918 -80806 -90771
7931 -90771 -180567 -131411 2435 13723 -103722 -350174 305633 -67816 85985 -189481 -190018 -92641
7918 -199929 -24729 -144735 68014 9510 73038 -4359 104577 -73073 -16645 -26543 -157748 185556
7905 160337 179278 -110805 85823 144837 -13277 149794 -85593 -23075 264642 -285415 3847
7893 -178082 -229455 144968 140703 88654 -496 -273881 -186548 89907 -227752 -52630 -140633 -164247
7881 -164247 -232988 -2212 -240461 -11338 -61580 88766 -154233 -200833 -70349 -29843 222522
7869 -203352 -223710 55400 26995 -362237 -135497 163467 50652 -238418 108885 -50113 250526
7857 -14292 -355677 -272321 88389 557920 -45777 -5271 65544 192944 -52541 -19155 94785
7845 191587 -88080 -58740 9069 -145977 -49025 248785 -6385 78708 -135651 26331 -137592
7833 88970 5352 -148905 -293701 -227013 -93227 -10994 -6210 79308 227707 -173445 -187794
7822 -187794 -330919 5689 -129384 14765 199853 37667 -47060 -207821 -211552 -325935 -203735
7811 -203735 13505 64754 -12021 69597 189723 -150165 317359 100863 97500 177511 -374287
7799 206367 -76186 147304 -311754 119203 78920 139557 383177 191588 69459 368150
7789 368150 35476 235919 -156047 -171840 -163479 74935 140721 -123338 -50213 6145 135568
7778 135568 -290020 -40563 63094 173030 32262 -56189 47736 -140522 -59497 283798 138719
7766 98727 35299 -39327 -157492 -218238 -120208 -107536 7506 89578 341014 -102142 -315570
7755 -315570 -10305 64799 -62426 91447 68961 -128549 181453 -166154 -23377 -316167 -205068
7744 -205068 -209824 245930 235771 29937 124923 179448 -32804 -112043 7157 -38845 -46127 -213307
7732 -213307 -4303 210777 85895 -135329 -204036 -216865 -197816 11678 187138 333617 91553
7720 107446 97324 -24369 -125410 -19249 283673 83250 236909 -59668 -324266 58167 3453
7708 -55641 -287449 309046 200120 -87230 -71160 -186677 123315 -127679 219038 -14997
7697 155504 -63655 -69330 83844 39124 47988 -65088 -62743 -323326 -111654 99200 -79971 9934
7684 -56066 -129876 26819 -176968 133252 -38218 -169274 -8991 317883 -166590 69016 -35311
7672 268791 -182633 15788 -27768 180400 150054 21009 -304250 -104267 -43943 -27012 58201
7660 -176490 171992 -278753 -274996 -20233 45767 -91437 -152801 114300 74893 -132707 -22351
7648 240112 -37012 -212988 -149333 -13208 -9252 143036 -56101 -189441 184439 -263539 150462
7636 -279687 39590 5937 83559 -18135 188056 20045 -218966 -182426 -92359 -348217 223078
7624 -247568 123184 172055 128254 -30872 -204979 -156726 104582 -43363 -191490 152664 84636
7613 84636 -505891 -179770 116200 -67188 -36614 96496 -21250 93829 -97889 -58505 86887
7601 -4208 -90375 -25462 24579 -58466 -49893 -203702 -147669 -180767 -28181 53698 40977 -28469
7588 148567 61215 -184315 119646 238402 -1740 -235461 -269990 -51581 85157 -70444 -274796
7577 -274796 181710 -50358 -112149 -93527 126534 -279604 -248512 66957 -139090 140419 -143371
7565 158999 -51075 -182066 -158766 -214604 145647 -208869 -25946 -121204 -69899 -60404 128494
7553 61704 11579 -285453 -219770 32528 -65234 -12192 93940 -80978 -14586 -36987 -178502
7542 -178502 299747 -79419 -2609 -158194 148785 -248521 -4687 -217949 260380 -282099 2463
7530 203622 -297275 -131491 177117 181783 -104921 156414 124789 146600 -21056 -29321 -12984
7518 -276018 -247020 -165687 -167415 -32333 120267 35214 -101790 21176 -22704 -274094 -86134
7506 -58451 -149999 65381 -18310 127375 -81187 -75990 -223469 230696 100485 79677 -157989
7494 103921 -48881 -8150 117908 -343498 -10904 73326 -20068 -250125 19949 40102 -4803
7482 101993 -130764 -29605 -70558 -224178 102920 178360 -126159 -353145 -24462 -6047 66395
7470 -53230 -134753 -217477 -79328 -154245 61699 -19917 -231935 195668 272693 -77013 -103653
7459 -103653 87461 -161316 90470 -4726 148286 309315 -249756 106075 39196 98941 91082
7448 91082 135045 -161142 -36569 -189620 -86427 222183 31110 -3987 -29137 -245542 -114953
7436 -157433 26292 67285 25548 -161009 -377460 -31527 -19100 42960 23873 63289 -15539
7424 74109 250258 -65506 -258002 -121158 163979 -255620 -30274 -23369 46203 21836 -80355
7412 -271200 91234 109463 108355 -36018 -160414 -249634 -35224 -167020 -135460 10398 -72404
7400 -7715 289733 282636 451069 36583 -74536 -156432 -41657 -65260 86954 -34240 -187163 23837
7387 -168040 -164769 85010 -166991 20658 -172892 136610 -100594 -237477 -53544 -14072 -16172
7376 -16172 8861 -102067 -157029 20399 222003 77827 -79278 -252838 -15692 5502 -27940 -294278
7364 -294278 -23658 -108786 -41616 140683 -132799 -57558 234260 -28198 170668 34494 -96518
7352 -249757 -262869 11068 106724 -66782 -13256 -23366 56740 76432 -301121 -91464 -37796
7340 -274748 -262332 239889 153202 -64020 -33182 240843 469598 -68183 115337 238188 -242830
7328 341952 236846 -13823 -261230 22120 -117564 -324703 -185337 176989 -73075 193037
7317 12335 -78542 93386 12558 -89674 -211365 -230970 60495 -1711 -103752 -359797 37548
7305 -267166 142866 -78239 171060 -154196 -41300 204378 -99488 103656 137273 -216175
7294 194388 -112714 109100 44670 -267078 140930 261104 172733 31183 -210839 -38629
7283 40653 -62895 -52233 -3930 109700 13390 233207 -65556 -92700 185803 -98502 -33150
7271 -251450 -54089 159015 74646 -107082 -189389 191929 -195817 -327580 -57231 -251451
7261 -251451 -290550 29527 63211 -249289 -94520 184152 122364 -130650 200504 135646 51082
7249 -217340 240194 -70301 -127190 150858 231399 -105621 63144 -231123 70667 -32114 20491
7237 -426186 -282647 -172934 -100240 220453 122129 58223 51570 191286 -21201 3824 242698
7226 242698 164357 28628 -60462 -258916 162863 -101846 80428 43309 7739 206977 109239
7215 109239 44947 -48487 -57443 -38544 -14856 -14167 108209 -169678 -307513 -15464 -347488
7204 -347488 -129452 -46190 22577 -3364 -42300 -93 376832 -185508 -4603 -947 -205256 -12491
7191 -246184 85506 39248 178795 10425 127321 -157038 330609 -261641 -267428 172244 351168
7180 351168 -216901 56502 82013 26550 -269305 29988 -192239 -100905 -81409 -14240 180342
7168 -4139 64149 -248412 190936 141070 -116976 -70330 36834 -78883 -215153 59994 -152975
7156 -294370 29703 -356594 -181763 -178739 89468 13987 -67554 117165 50255 -34190 -46879
7145 -46879 -142582 -360205 -117636 230348 -42571 36270 -148783 308633 114113 177439 -71658
7133 -73980 -494313 -179335 -131592 217819 -68975 38011 -194783 85688 103402 131655 122712
7122 122712 -298879 -144487 -62050 -114662 -22653 -48469 -98263 40121 -382334 220481 1651
7110 -48275 -79772 55949 -157667 20083 14859 -195831 -117616 -10861 78787 29387 -31562 52759
7097 189295 152459 -53342 -146409 -370002 249873 76093 204423 228798 -18976 138683 -326522
7085 101259 -16437 73666 -186419 170903 299544 64427 -121741 -215790 1445 -172325 216689
7073 203121 -240097 -104187 153081 123088 -223118 103905 122252 153925 94608 -12888 117926
7061 -106918 -126001 105396 -180525 21821 -291746 170013 -232604 -43500 799 -328057 225115
7049 -79083 -16597 -203906 127443 168108 201524 111652 -97014 229633 92277 -305065 -399765
7038 -399765 10146 -61645 -91449 -173404 81444 -43875 77694 -134354 -70234 297765 153988
7027 153988 -11311 -98398 -219013 -79158 -103176 -82381 -79035 -143387 -111022 405999 287478
7016 287478 -203647 -335593 52404 109062 -171827 8820 73839 39746 -19595 -77873 -231303
7005 -231303 309436 150260 8505 -76623 -184563 -292237 2468 -4287 85591 -127809 44323
6993 185653 14431 -202074 14088 -427941 -344025 -47699 110293 84312 -92211 132017 11962
6981 -76821 -177735 -210313 -22274 -211545 92820 122490 25924 -23427 -228149 54921 171969
6970 171969 88547 -72321 111257 -362553 -140007 92427 -251932 -90130 -11690 104048 -227947
6958 172636 225365 93077 -53630 172211 -227768 -327789 137556 67768 -58336 -98365 -91444
6947 -91444 -154642 -242239 -77402 -282185 227073 -18320 -10796 -17171 20942 -136241 5946 66111
6935 66111 -4252 -288220 56357 -177741 142563 -7702 -103064 199772 -68420 118914 10832
6923 419624 -113946 12903 -2544 -121164 73100 -6191 7997 -287413 409035 -395675 -337190
6912 -337190 -294741 196629 30023 -143914 -180886 295712 384459 -107179 -95156 -119101 -2353
6900 -32279 -124104 -126102 119088 196440 -5858 -48118 -159136 3458 -121183 -67075 -239938 87190
6887 -116580 -126398 -205273 -133288 -183245 -234013 -128222 169154 -100854 64521 42560 9310
6875 -288287 117133 31825 -91551 45200 -13837 -176390 -253925 133001 -155572 250540 -32478
6863 43433 93110 113125 -191358 47362 -97094 80342 -13376 191354 172077 -355176 50658
6851 296603 -199756 -332231 -70225 70912 204915 96219 -258595 198649 88973 105134 -66553
6839 187444 188884 172391 -326353 333493 -116307 -121474 87931 -75370 -123723 -50132 -66587
6828 -66587 249555 216847 -399707 81533 -115456 -200780 83207 -206371 28877 223381 127396
6817 127396 9539 222604 -274467 224007 -379604 -7477 -17783 288797 -188679 42970 -399270
6805 37785 -36058 -187212 196950 107901 -317206 70389 553469 -205406 -197437 9229 -7286
6793 -175952 150997 -355426 33437 203253 -130149 -337383 -11651 388300 55860 -286816
6782 19297 -68314 141369 214579 197561 49258 3676 -19697 21480 125035 -24869 -193912
6771 -193912 76435 -74165 -351060 62790 -326899 29743 -171211 125158 -321089 211046
6760 -67521 -429257 199717 7013 -104019 -161120 52023 -12233 -30641 193160 -145568 140367
6748 -169970 -274393 -951 -278506 24746 -70735 41032 131593 -298053 162360 -151010 244930
6736 51083 -199440 -6341 -94679 44605 -145653 -177516 -77607 19143 -25681 97452 -83301 -169852
6724 -169852 -110964 -158924 -107568 290699 30701 280177 -168315 -14167 -94054 57722 -2781
6712 -15871 -157271 81624 -439205 -128727 -96326 -53346 -191511 -2364 -125914 -179783 -150025
6701 -150025 -35029 245126 339388 37185 17867 29173 -306719 7410 169660 147656 -236341
6689 -92683 -377135 27531 -298551 41351 29890 -122072 -146365 151629 28460 164645 -182471
6677 51968 331152 127356 84107 93491 -183164 -6172 522086 209033 -214640 -225708 -101161
6665 246137 52149 -144656 75880 -289333 -18427 268752 -13166 -6223 -52067 47840 -98455
6653 101066 -23323 -266909 90180 82434 57217 -15629 -37865 40289 36960 -164066 22124 58835
6641 58835 -185840 10004 60201 -154289 144921 -185434 168083 -306706 5142 64708 -51472
6629 59469 -133461 -15037 317280 43320 222448 -78500 76675 140897 70635 -31679 -47726
6618 -47726 -166789 32497 71147 83734 161265 6468 3814 -131988 118273 165038 -140663
6606 -311601 52983 -171771 -58261 -96924 -38141 24391 187299 -217396 11286 -121195 -209262
6595 -209262 50294 366615 183142 -269469 41937 -291769 321531 -267518 22692 -85246
6584 57659 -61852 228159 22605 -168197 -99715 46599 124932 146467 -129457 -6753 27140
6572 105648 157080 -88085 21008 -67619 26480 -269702 -30205 -50952 136018 -75244 57699
6560 -80184 -15793 -138366 120851 79742 -180628 -259751 80685 202865 119089 104468 347904
6549 347904 96922 -52072 19076 -87683 -253655 184217 -213096 37803 -318563 158170 445031
6538 445031 33020 155827 -183367 -186775 36656 63263 464892 180100 42443 -135969 -215219
6527 -215219 -204886 -124817 41649 -110678 -32758 -65953 60925 -256714 77665 -64957 176650
6515 35781 -102264 -299482 181198 5057 -372992 194198 -4905 294126 51052 -500616 -1601
6503 416095 93422 -83255 164386 -173191 -126851 -168116 -314884 -106500 27616 241545 -67677
6491 -87143 -237470 349883 16760 -315440 -692 -117097 -39528 88377 43135 -252591 -189661
6480 -189661 278538 36456 -209897 -68309 -46537 -506205 196120 147132 45568 315603 -189047
6468 165070 -36563 -96595 -268504 -204691 96173 202988 -80612 71111 36016 405809 173910
6456 255591 -105507 -45073 -48454 -213517 -73149 42421 82475 -78349 125482 -151524 -139063
6445 -139063 -235836 -84431 -23408 208320 154229 27014 64544 -297518 -276875 72394 -56894
6433 276772 158379 215373 51450 183511 106987 225996 -113185 -138412 -87991 -39552 53186
6421 84405 332929 107507 -53187 -84579 -125364 53541 -251017 -410658 -189548 57935 -61437
6409 266014 131499 -31635 318249 -49680 234822 -160471 62416 283406 190138 40002 -28668
6397 -179922 -260694 60562 -235404 -87671 -346359 167390 254127 86567 -38951 -49165 -37301
6386 -37301 111840 183679 204540 46811 89787 -25028 -123714 -248349 59338 350663 -107384
6374 91182 -126045 -317792 213132 -81408 20517 106100 275905 -197339 -138382 37528 -115807
6362 -178923 -215936 -86878 170157 75099 14458 9888 110050 -105426 -142998 176904 225837
6351 225837 84455 29264 -85539 23481 -405440 -93846 409 -261746 132408 210525 22032
6339 173133 -256396 217437 -159606 -116896 -57909 172130 -14844 33105 -4053 -294747 189626
6327 -99783 -297046 241505 -13205 -52364 190822 40037 -201372 -44249 13697 -193800 -169406
6316 -169406 -110468 -55059 -156545 54862 166184 -12604 -342543 -249075 -90769 -130069 131228
6304 -236896 -170462 72061 -107871 515673 122729 161791 -89403 -74457 385758 -88979 70501
6292 -42142 -65610 247439 -34987 -229984 -120834 81500 294802 -61364 -255280 94047 303825
6281 303825 43714 184378 -232811 252586 137233 135316 -132906 131622 75306 315836
6271 315836 9046 71784 177740 18376 97948 -287048 -270044 115810 -171338 -18111 -38840
6260 -38840 -255925 -459499 -185554 -6683 -192036 -310416 325923 -284672 -215875 57215 179170
6249 179170 101840 -128079 80618 95010 6108 -145297 -36804 -13866 -228127 -85992 6791
6237 55887 131707 -366060 138401 -4742 182168 -262603 -789 -10816 42570 -106078 238244
6225 274613 -169787 2246 -111727 -122313 -273706 278275 -30074 -201217 -226815 -443727 114650
6213 -85110 105851 -71420 -55183 43348 -152291 130610 58945 283926 307411 -251114 215914
6201 149111 475154 203673 96787 -142992 -10787 334759 -11044 -43970 140579 388099
6191 388099 -104811 -151044 -348318 12491 330948 53103 -13550 47742 242858 157523 -17999
6179 192125 -135391 -302404 -26248 111248 59921 252653 -275471 312607 -337294 -231774
6169 -231774 80744 -114140 -134423 -121058 309951 -39366 185198 65454 -394850 114315 -402483
6157 -38573 377439 49707 -100810 80136 -71219 61962 -265499 1934 -13663 4046 -97396 26512
6144 68866 82849 -17555 60977 -72460 156134 -89576 143410 67456 133541 -3526 -87415 87309
6131 63796 307059 -15167 217186 -391156 244839 -129697 147655 -3505 -55040 200265 -212519
6119 -171318 -242423 -107850 216457 -422201 111510 -167575 -15705 -37777 -206571 107966
6108 -126282 66592 -101008 129732 134951 -109956 48501 -43113 255805 -451051 -259846 -224005
6097 -224005 110756 -70186 -365457 -212643 -172629 102847 72177 36106 -148537 140097
6086 66631 -165493 45951 -18651 201675 7695 80164 -43706 -182951 242371 99981 -51055
6074 276561 157584 159355 -117255 -22823 -85220 91876 -266096 17478 -259265 178472 -147953
6062 -157953 261453 -197388 -305241 -250520 -55946 -281187 -216824 -147456 9917 -10649 -232890
6051 -232890 126010 -195039 24146 46952 959 -118053 -172489 -144799 112557 75563 -34957
6039 243092 -36143 -175181 359440 111061 260745 -153931 116522 112190 -69677 85714 -231704
6027 114223 -64052 61898 -151808 -47606 -88580 50521 -77419 48226 -7454 28722 38058 202778
6015 202778 -54851 189380 510263 -144244 73584 -37562 -207204 -8204 336581 114306 -70514
6003 351730 -98617 35875 -62690 -75046 -184977 -26074 312014 -238121 125376 -152827 7907
5991 -68523 -94943 -298511 -199788 9913 199391 48520 242508 87511 -62468 99234 120897
5980 120897 117994 158059 74396 126905 -129873 -158205 62512 -167741 -179293 247363 -164363
5968 -179587 -237208 -264213 513435 12283 -21908 233283 119852 126839 205135 -247910 36088
5956 -179523 10479 242915 -127368 292056 65002 -16811 -123297 -325628 13432 -90812 -213524
5945 -213524 -49725 8628 -129992 -50968 175209 137104 39541 39874 -324219 146245 213491
5934 213491 -143296 -154728 52823 193427 -114280 223780 198398 7222 143029 43639 -291882
5922 -244716 -117783 -40221 -75796 38248 -200383 103017 40470 86612 -63640 -75824 -54371
5911 -54371 -178277 -23244 71223 -112493 -139632 76722 -283020 203095 -261867 202915 14175
5899 284079 23913 22719 33441 -150990 -140993 310642 -207862 -89663 -303116 -211677 320998
5887 -27066 -95454 420399 -215364 -457925 -252242 -18553 -229854 -16498 -83461 175888 136208
5876 136208 -168655 261490 198900 -93765 -28397 -150331 333049 75226 -8999 -55834 -25256
5864 295473 -161296 117370 -165151 185269 -353025 152948 120234 61511 313134 58085
5853 242094 281896 170351 -151078 -156079 -276800 72961 -277141 -3770 -58414 -116873 -173760
5842 -173760 -100997 -171572 170086 4722 -154199 197546 227579 -52284 196171 -70836 19116
5830 108928 -84590 -36048 -131117 343250 -16648 84086 46807 -508 228222 107226 132692
5819 132692 51504 -214822 -59377 -56927 57476 -547882 -85682 331098 -172164 2021 -184314
5807 -170706 201827 -39739 65261 330270 -101747 -108627 26827 -57144 64314 -175031 68594
5795 170344 -239017 286102 -36115 115628 -76430 -125236 284741 -384436 -223933 -81814
5784 -107694 -73554 -30916 16543 433628 33373 300863 377013 -280724 55047 -85496 -165417
5773 -165417 -73577 183024 145039 224446 -121942 -168199 -115472 115 173236 37093 -97049
5761 -321109 -51567 -52168 -92127 -119610 10205 -12872 -212731 -6398 -13091 37097 81604 -30418
5748 27457 -591177 -64017 -153513 -370726 -168066 -200647 -65102 -197157 180374 274253 243050
5737 243050 -11750 -170181 -95536 20271 161106 63980 45100 184528 96311 -111441 -230545
5726 -230545 -114851 175752 35505 -270880 -225312 60306 173218 12928 59035 423552 122000
5714 -69838 -7074 -127863 129964 -226514 179785 -359550 97330 -124573 111420 87152 156866
5703 156866 15958 -119933 36418 201607 256422 237329 -190878 10265 -220939 58548 192380
5692 192380 -159377 -84410 -50835 85683 127263 -154628 34470 57267 68035 -119339 151500
5680 -119301 97928 -23614 291740 -121602 1527 -213883 57124 12669 -398617 -183892 -70140
5668 126990 -110595 -200260 81658 -198962 58460 174945 -383114 227252 200040 -49570 -348464
5657 -348464 -66100 -224249 -337071 -118499 246921 128687 65786 -89451 -378682 166718
5646 -91364 -102363 18252 17180 69750 325959 -23013 -189025 242220 52238 134387 72792
5635 72792 272162 -77152 -105603 -52719 262058 268300 192842 106074 -101070 -58724 397887
5623 -147596 119975 288196 -413635 86245 -151553 -6909 -75003 -34981 272805 -7315 -219884
5612 -219884 -25597 102121 86274 77395 38415 235066 131771 139665 -6996 -238419 192899
5600 -51085 -59295 419212 108410 104535 -25985 221749 -45338 -284683 -145674 -74189 -25109
5588 -42922 49392 2350 72285 -130961 -409292 -181710 -178739 -6230 -171874 103747 73997
5577 73997 -232533 -149693 91252 -40096 15808 25174 -104291 228745 99079 -113706 151496
5565 19354 53566 214869 -108094 -170116 198791 -227616 363871 56612 116495 361270 946
5553 -207551 244631 230236 186577 875 102541 100840 176329 13335 -238876 28460 -73954 92849
5540 119880 -293609 -279145 -125211 9770 -78976 287212 -151966 104186 -133194 -51521 -356112
5529 -356112 -90425 43069 70644 74315 -127068 14883 -63873 179401 -74616 -228173 -168432
5518 -168432 -3164 -107049 -125520 -104546 31276 161185 -35451 348989 169636 82516 38012
5506 -135435 450502 -66536 -9115 72270 -259388 131638 192236 -38272 40766 -220781 -168174
5495 -168174 24819 282198 -5109 168080 -277921 376959 -229862 -83212 -221807 -458997
5485 -458997 204191 50256 -32268 -69013 -79387 25262 282681 12849 -144320 -127814 385625
5473 108937 94787 -85515 20241 298222 139663 -42885 -142253 120401 -140576 121297 179965
5462 179965 -86408 -74511 -282865 -355368 -44262 22161 134880 -53841 220536 85446 209730
5451 209730 -113992 247989 -209708 63263 -204661 -24082 4479 15200 176256 232774 163184
5440 163184 -12216 74902 -200674 477955 -34002 -90843 2109 -166793 -88989 212261 -42869
5428 -168563 -197912 -145421 -350139 99842 191179 -193578 45300 -5168 -355634 -161032 89383
5416 131809 -110350 -30262 -83424 -142447 126648 134897 -270491 273129 47208 -81767 -106291
5405 -106291 -339888 50997 -136936 64361 -265906 -103615 247139 77364 85439 -36818 268803
5393 32530 254557 58564 262882 16268 280684 -189212 22687 26697 -45506 -122173 -301196
5382 -301196 101915 -112003 158607 166859 -8936 77727 86289 -156286 -169864 285184 222586
5371 222586 -2091 -46644 92515 90053 160059 26146 -418665 -131055 142602 74646 -168158
5359 7138 169534 -35419 9663 -151129 -60501 225554 -24549 -96532 119284 42142 -71305
5347 -216527 -300400 22532 -44970 -219965 203214 31041 18338 43883 -68961 -364 488 215438
5335 215438 -7498 -141547 -321641 -154673 -155583 40922 100728 -76992 72372 -124556 -61772
5323 31548 303222 -246499 337765 65433 -167010 -64782 16806 107483 71520 8822 -287432
5311 -49734 -26031 -109769 -87593 -199745 -183482 -125278 52553 -769 189507 31332 -52091 4434
5298 1853 -39669 -123084 -319700 -281143 68295 -59903 112657 -245950 49068 96764 -173571
5286 -151328 -141417 17418 154155 62721 -12554 124038 -60784 -205824 168530 17557 -401324
5274 -238800 -113106 301171 18290 -226537 14 69034 -76688 -81137 1521 178284 -224951 -174322
5262 -174322 253934 -5840 -127554 240418 80788 -102610 -36414 257245 -294581 -161048
5252 -161048 -168146 33669 -26683 105156 -27328 222444 84874 -92126 -122988 115160 58041
5241 58041 -70667 139016 -7600 -165894 121358 -18333 -80303 -32909 -334146 -153421 -142498
5230 -142498 -136027 71305 -33899 -241858 144881 167648 236357 -94114 -294620 22323 178832
5219 178832 -104660 -236093 -110318 236064 215592 -25066 121836 -162521 -243228 222953
5208 -140974 111788 -123692 95599 -52758 -31870 -46081 -228340 136394 266668 -26707 -40371
5197 -40371 91733 27794 147239 312576 -51732 -56905 -84059 40320 -14544 98435 -158522
5185 -263572 -170192 160892 184446 76251 81422 -108051 158195 9357 45788 149154 -164027
5173 76725 19198 284750 -167871 65792 -120488 -162544 -125522 -52409 -130335 54511 -12414
5161 -83097 -282445 -15707 16120 -233329 342189 5223 329715 -31838 -21910 209181 136915
5150 136915 70451 140332 71810 144258 262161 -262034 201590 32907 23690 17412 83219
5139 83219 -22047 -13485 43370 -130906 35922 -49396 -14516 43759 -132270 120288 29170
5127 54696 162372 -3536 10813 -133518 15599 44139 -15599 66551 -149622 161995 63915
5115 142603 293838 -111942 333007 32627 -103039 -109557 -292494 137302 -287955 -141632
5104 -18021 304669 396824 133864 208408 79068 59333 233160 5628 144366 -184307 99452
5092 -45949 -126160 -134394 145061 -61410 95462 97245 133861 -170935 121344 196910 53995 -215547
5079 -207982 47533 -22378 263319 -22601 -45793 51668 8687 243265 3683 -92282 -153752 26978
5066 -113593 -95325 -13963 7462 92737 43813 145730 -334109 -43269 147918 69267 -65297
5054 -17684 76063 -73924 -224275 -89204 -93543 -265643 186586 101542 105778 -57302 -8398 -5837
5042 -5837 -14594 -75234 91944 -298850 -176930 -66530 312204 -70361 88549 167684 -34429 82026
5029 -400923 -251604 -16482 -7406 68543 12473 4802 253397 -272979 141654 180222 -7913
5017 -28341 209334 -165219 -136464 -7051 365939 86885 60915 70625 254738 -250871 196188
5005 231532 -250008 -22670 118659 10741 15855 49851 92561 -38466 24444 340092 112605
4993 -134474 -206273 -20526 -12700 51182 82679 -172026 456865 -296183 14840 -184445 -113017
4982 -113017 -94730 -57814 -109198 -22994 -297088 -223751 -16963 66869 188738 -118327 -496189
4971 -496189 409502 -223973 -205572 -61944 -10676 -91280 96711 290466 -40100 92771 35482
4959 -294219 -467930 -170506 -17449 19783 104089 31980 -297142 334859 69410 136643 -148949
4947 266308 108528 91728 105678 -190170 -44012 506227 26738 -258351 -21426 147101 -9911
4935 46906 -155608 -100675 -27551 189350 244146 -211569 -189438 -142220 -545327 -137906 -12198
4923 -155739 -140155 266778 -84185 148805 -101957 29067 109438 195205 -315703 -203281 70577
4911 196775 68770 105330 243189 -219437 -262058 338718 -74225 -57583 37136 159546 15075
4899 134090 -377185 25023 -154576 157353 -72186 -309668 121323 43636 -67175 66881 17966
4887 358260 -330853 63507 238933 9344 -339334 55999 -19474 140318 -88704 -16172 214841
4875 107829 -114589 71039 12079 249751 -40822 -119787 65349 -80889 194256 74446 180364
4864 180364 195673 56435 348038 198812 -137124 42173 -170876 31202 45756 -193547 138558
4852 421093 58894 5520 148042 -228581 -114101 -141460 -355630 -25873 -6716 360677 -71254
4840 7831 -28180 26568 -114534 -22482 -149906 165874 -16004 200262 95462 -203732 117329
4828 -81671 195931 11543 -62166 319256 158907 -56647 139898 106328 -201434 199226 143713
4817 143713 -81131 5190 -142363 -28916 -102254 -132166 195388 325260 173004 169123 281814
4806 281814 212124 -201999 -9743 186965 -213755 -80377 192209 207355 179562 -53622 285518
4794 253898 68208 -149477 -247023 95592 249433 270374 76258 -14874 124920 -118551 -13683
4782 24925 -96957 -42810 173678 26571 -23306 177036 -160454 -200064 322768 -72726 108104
4770 127283 148561 37154 36085 -8650 45999 -34890 -193039 41057 -127682 -143458 -229014 20593
4757 265324 -64459 -271526 -47205 131055 -60855 280997 -230092 -41335 -163880 -82871 -33056
4745 -23788 -203931 126110 -222781 -30692 165046 -58239 -33825 239721 -9966 71160 204848
4734 204848 -90656 64340 134676 -166630 114366 -103005 -41494 -244699 -118316 -101069 -46149
4722 401920 125476 4515 300799 -9031 -31712 -417699 -286909 65048 -18172 -596 -128702
4711 -128702 -109141 -177995 135494 -90238 -67602 250727 165853 246463 17381 -104070 -103470
4700 -103470 -98132 99043 -275226 240964 -76116 33586 -168513 36133 -42812 -172785 -193350
4689 -193350 298243 -167177 95280 -54185 260287 -166084 -112760 -164250 113639 64296 -20509
4677 -48340 271098 -24559 30888 23300 249697 -51472 2057 -132271 23456 215725 -71883
4665 -128652 50877 -33471 72327 58425 120070 91318 -36259 -101471 -148133 -320362 -177102
4654 -177102 -142735 -226497 211166 48758 226688 -195691 -34352 18706 277648 -176280 112869
4642 -92686 103218 -5987 144848 218471 -111862 -26712 -303906 -111489 -344077 354904 -68379
4630 107905 44910 -54212 -87162 74801 -182930 -213011 238110 115702 74838 -46520 -170761
4619 -170761 -147143 -38877 -156821 -196399 -36274 241573 145027 53481 201095 -167812 -161229
4608 -161229 -199788 428106 -79779 -104417 76766 39147 -28891 -122616 131256 55903 28107
4597 28107 271475 -237779 -30182 -214663 -155547 9728 50979 139659 39499 -119285 69395
4585 112031 27339 2833 316921 217639 -43690 -230495 97157 130571 14712 -100401 87518
4573 -94955 19768 -8777 -66376 101420 -156882 -41950 282006 -222276 -118095 -90559 -112670
4562 -112670 258246 43992 -248821 -13244 -78721 -44617 254247 -51704 -79793 -43023 -18094
4550 282896 -52186 5197 157320 234261 -126810 -81157 3528 235879 -83560 169159 -99500
4538 104595 78221 55511 166755 -28076 152311 105058 35480 49341 10498 113520 -249342
4526 -142890 358705 256592 -193398 67332 -135061 -29847 13197 -38967 -10023 -334828 -279443
4515 -279443 19002 158303 -29969 193448 144500 203196 -158189 68648 -54586 148585 121954
4504 121954 -476606 39450 31551 117528 4293 -43796 -337811 122518 208292 172901 -36435
4492 485578 31625 -33403 86203 189905 46177 104380 177800 185104 -255566 77235 59499
4481 59499 262374 50353 -69633 -1052 -152692 82331 -153088 -160567 -41705 40946 -54724 826
4468 51317 -304068 42106 111650 -115283 -210194 63802 -143266 -6561 394342 -73948 -110159
$$ [...]
##END NTUPLES=NMR SPECTRUM
##END=
