##TITLE=AC1736_SEN00009_9276107_yGntWwyj9m
##JCAMPDX= 6.0         $$ Bruker NMR JCAMP-DX V2.0
##DATA TYPE= NMR SPECTRUM
##DATA CLASS= NTUPLES
##ORIGIN= BRUKER
##OWNER= Administrator
$$ 1.72 TOPSPIN		Version 2.1
$$ 2015-07-14 19:11:20.385 -0700  Administrator@X
$$ Compression mode = diff/dup
##.OBSERVE FREQUENCY= 400.02188249412
##.OBSERVE NUCLEUS= ^1H
##.ACQUISITION MODE= SIMULTANEOUS (DQD)
##.ACQUISITION SCHEME= undefined
##.AVERAGES= 64
##.DIGITISER RES= 22
##SPECTROMETER/DATA SYSTEM= spect
##.PULSE SEQUENCE= noesygpps1d.comp
##.SOLVENT NAME= COFFEE_meoh
##.SHIFT REFERENCE= INTERNAL, COFFEE_meoh, 1, 14.961
##AUDIT TRAIL= $$ (NUMBER, WHEN, WHO, WHERE, PROCESS, VERSION, WHAT)
$$ ##TITLE= Audit trail, TOPSPIN		Version 2.1
$$ ##JCAMPDX= 5.01
$$ ##ORIGIN= Bruker BioSpin GmbH
$$ ##OWNER= Administrator
$$ $$ E:\/data/COFFEE/nmr/AC1736_SEN00009_9276107_yGntWwyj9m/12/pdata/1/auditp.txt
$$ ##AUDIT TRAIL=  $$ (NUMBER, WHEN, WHO, WHERE, PROCESS, VERSION, WHAT)
(   1,<2015-07-14 19:11:14.197 -0700>,<Administrator>,<X>,<go>,<TOPSPIN 2.1>,
      <created by zg
	started at 2015-07-14 18:59:44.604 -0700,
	POWCHK enabled, PULCHK disabled,
       configuration hash MD5:
       21 0F 79 D6 B3 7B B4 F6 88 20 88 DB 03 48 BD 9F
       data hash MD5: 64K
       F3 BB 49 3A E4 0E 6E 2A 0E 71 85 BB 3A ED 59 95>)
(   2,<2015-07-14 19:11:17.635 -0700>,<Administrator>,<X>,<proc1d>,<TOPSPIN 2.1>,
      <Start of raw data processing
       efp LB = 0.3 FT_mod = 6 PKNL = 1 PHC0 = 0 PHC1 = 0 SI = 128K 
       data hash MD5: 128K
       29 20 1A F5 56 96 E9 D0 BC 81 BF 53 89 1E 6E 8A>)
(   3,<2015-07-14 19:11:18.588 -0700>,<Administrator>,<X>,<proc1d>,<TOPSPIN 2.1>,
      <pk PHC0 = -87.67639 PHC1 = 0 
       data hash MD5: 128K
       EC F1 95 2F 6C 29 AA EE D7 84 D6 66 14 E1 2A DB>)
(   4,<2015-07-14 19:11:19.338 -0700>,<Administrator>,<X>,<proc1d>,<TOPSPIN 2.1>,
      <abs ABSG = 1 
       data hash MD5: 128K
       E3 B8 4C B5 B5 48 B2 4C C6 36 8A D2 CF 34 54 F7>)
(   5,<2015-07-14 19:11:19.557 -0700>,<Administrator>,<X>,<proc1d>,<TOPSPIN 2.1>,
      <abs ABSG = 2 
       data hash MD5: 128K
       C2 3A ED 4B D5 5C 07 A3 58 DA 35 87 E1 54 CF 26>)
(   6,<2015-07-14 19:11:19.697 -0700>,<Administrator>,<X>,<proc1d>,<TOPSPIN 2.1>,
      <abs ABSG = 3 
       data hash MD5: 128K
       78 EA E0 88 1B 94 E3 31 2A F4 7D 60 41 F8 8B 04>)
(   7,<2015-07-14 19:11:19.807 -0700>,<Administrator>,<X>,<proc1d>,<TOPSPIN 2.1>,
      <abs ABSG = 4 
       data hash MD5: 128K
       44 F6 3F D5 3E EA 75 53 2A B8 C2 3D 83 B1 06 8B>)
(   8,<2015-07-14 19:11:20.025 -0700>,<Administrator>,<X>,<proc1d>,<TOPSPIN 2.1>,
      <abs ABSG = 5 
       data hash MD5: 128K
       E7 AA 79 96 6A B2 B6 71 9F DF EB CE 64 80 5E 74>)
$$ ##END=
$$ 
$$ $$ hash MD5
$$ $$ B5 34 40 8D 57 DF 86 CB 78 A9 13 1F 16 29 0E D3
##$RELAX= 
##$RELAX= 
##$RELAX= 
##$RELAX= 
##$RELAX= 
##$RELAX= 
##$RELAX= 
##$RELAX= 
$$ Bruker specific parameters
$$ --------------------------
##$DU= <E:\>
##$EXPNO= 12
$$ [...]
150 150 150 150 150 150 150 150
##$TP07= 0
##$TPNAME0= <>
##$TPNAME1= <>
##$TPNAME2= <>
##$TPNAME3= <>
##$TPNAME4= <>
##$TPNAME5= <>
##$TPNAME6= <>
##$TPNAME7= <>
##$TPOAL= (0..7)
0.5 0.5 0.5 0.5 0.5 0.5 0.5 0.5
##$TPOFFS= (0..7)
0 0 0 0 0 0 0 0
##$TUNHIN= 0
##$TUNHOUT= 0
##$TUNXOUT= 0
##$USERA1= <user>
##$USERA2= <user>
##$USERA3= <user>
##$USERA4= <user>
##$USERA5= <user>
##$V9= 5
##$VALIST= <valist>
##$VCLIST= <CCCCCCCCCCCCCCC>
##$VD= 0
##$VDLIST= <DDDDDDDDDDDDDDD>
##$VPLIST= <PPPPPPPPPPPPPPP>
##$VTLIST= <TTTTTTTTTTTTTTT>
##$WBST= 2048
##$WBSW= 25
##$XGAIN= (0..3)
0 0 0 0
##$XL= 0
##$YL= 0
##$YMAX_a= 7086887
##$YMIN_a= -13488080
##$ZGOPTNS= <>
##$ZL1= 120
##$ZL2= 120
##$ZL3= 120
##$ZL4= 120
##$ABSF1= 14.961
##$ABSF2= -5.597181
##$ABSG= 5
##$ABSL= 3
##$ALPHA= 0
##$AQORDER= 0
##$ASSFAC= 0
##$ASSFACI= 0
##$ASSFACX= 0
##$ASSWID= 0
##$AUNMP= <proc_prof1d_extract.lims>
##$AXLEFT= 0
##$AXNAME= <>
##$AXNUC= <1H>
##$AXRIGHT= 0
##$AXTYPE= 0
##$AXUNIT= <>
##$AZFE= 0.1
##$AZFW= 0.1
##$BCFW= 0
##$BC_mod= 0
##$BYTORDP= 0
##$COROFFS= 0
##$CY= 15
##$DATMOD= 1
##$DC= 0
##$DFILT= <>
##$DTYPP= 0
##$F1P= 0
##$F2P= 0
##$FCOR= 0.5
##$FTSIZE= 131072
##$FT_mod= 6
##$GAMMA= 0
##$GB= 0
##$INTBC= 1
##$INTSCL= 1
##$ISEN= 128
##$LB= 0.3
##$LEV0= 0
##$LPBIN= 0
##$MAXI= 10000
##$MC2= 0
##$MEAN= 0
##$ME_mod= 0
##$MI= 0
##$NCOEF= 0
##$NC_proc= -2
##$NLEV= 6
##$NOISF1= 0
##$NOISF2= 0
##$NSP= 0
##$NTH_PI= 0
##$NZP= 0
##$OFFSET= 14.961
##$PC= 1
##$PHC0= -87.67639
##$PHC1= 0
##$PH_mod= 1
##$PKNL= yes
##$PPARMOD= 0
##$PPDIAG= 0
##$PPIPTYP= 0
##$PPMPNUM= 2147483647
##$PPRESOL= 1
##$PSCAL= 4
##$PSIGN= 0
##$PYNMP= <proc.py>
##$REVERSE= no
##$SF= 400.020009636244
##$SI= 131072
##$SIGF1= 0
##$SIGF2= 0
##$SINO= 400
##$SIOLD= 131072
##$SPECTYP= <>
##$SREGLST= <1H.CDCl3>
##$SSB= 0
##$STSI= 131072
##$STSR= 0
##$SW_p= 8223.68421052631
##$SYMM= 0
##$S_DEV= 0
##$TDeff= 65536
##$TDoff= 0
##$TI= <>
##$TILT= no
##$TM1= 0
##$TM2= 0
##$TOPLEV= 0
##$USERP1= <user>
##$USERP2= <user>
##$USERP3= <user>
##$USERP4= <user>
##$USERP5= <user>
##$WDW= 1
##$XDIM= 131072
##$YMAX_p= 366007249
##$YMIN_p= -11452
##$CURPLOT= <Network HP LaserJet P1505>
##$CURPRIN= <$Network HP LaserJet P1505>
##$DFORMAT= <normdp>
##$LAYOUT= <+/1D_H.xwp>
##$LFORMAT= <normlp>
##$PFORMAT= <normpl>
##$SURQMSG= 1
$$ End of Bruker specific parameters
$$ ---------------------------------
##NTUPLES= NMR SPECTRUM
##VAR_NAME=  FREQUENCY,     SPECTRUM/REAL,   SPECTRUM/IMAG
##SYMBOL=    X,             R,               I
##VAR_TYPE=  INDEPENDENT,   DEPENDENT,       DEPENDENT
##VAR_FORM=  AFFN,          ASDF,            ASDF
##VAR_DIM=   131072,        131072,          131072
##UNITS=     HZ,            ARBITRARY UNITS, ARBITRARY UNITS
##FACTOR=    0.0627417313425164, 1,          1
##FIRST=     8223.62146879497, -430,         -64156
##LAST=      0,             1981,            -64416
##MIN=       0,             -11452,          0
##MAX=       8223.62146879497, 366007249,    0
$$ Real data points
##PAGE= N=1
##DATA TABLE= (X++(R..R)), XYDATA
$$ [...]
$$ plain form
63857 1145406 1181452 1216665 1250408 1282032 1311132 1337437 1360505 1379782 1395007 1406326 1413797
63846 1413797 1416851 1414474 1406025 1391740 1372343 1348227 1319268 1285427 1247417 1206536 1163866 1119725
63834 1119725 1073951 1026726 979064 932392 887646 844892 803884 764801 728226 694457 663188
63823 663188 633918 606468 580971 557602 536498 517665 500746 485014 469918 455602 442673
63812 442673 431474 421761 413013 404806 396869 389113 381728 375111 369564 365111 361542 358475 355397 351909
63798 351909 347994 343907 339732 335310 330675 326269 322485 319134 315637 311648 307296 302901 298732 295051
63784 295051 292156 290163 288808 287565 286022 284148 282226 280513 278984 277428 275732 274014 272481 271328
63770 271328 270779 271032 272034 273388 274612 275430 275750 275512 274742 273681 272649 271711 270639 269230 267627 266264
$$ packed form
63857A145406L6046L5213L3743L1624K9100K6305K3068J9277J5225J1319P471
63846A413797L054k377q449j4285j9397k4116k8959l3841l8010m0881m2670m4141
63834A119725m5774m7225m7662m6672m4746m2754m1008l9083l6575l3769l1269
63823F63188k9270k7450k5497k3369k1104j8833j6919j5732j5096j4316j2929
63812D42673j1199r713q748q207p937p756p385o617n547m453l569l067l078l488
63798C51909l915m087m175m422m635m406l784l351l497l989m352m395m169l681
63784B95051k895j993j355j243j543j874j922j713j529j556j696j718j533j153
63770B71328n49K53J002J354J224Q18L20k38p70j061j032r38j072j409j603j363
$$ plain form
63754 266264 265569 265696 266431 267311 267953 268384 269012 270163 271628 272813 273468 274090 275330 277046 278432 279284 280606
63737 280606 283399 287173 290409 292528 294540 297510 301148 304459 307141 309634 312195 314769 317575 321038
63723 321038 325086 329251 333506 338358 343976 349821 355328 360320 364582 367677 369551 370784 371782 372225 371714
63708 371714 370543 369227 367710 365633 363192 361057 359509 358231 356972 355931 355414 355561 356453 358128 360377
63693 360377 362857 365426 368054 370385 371814 372156 371955 371920 372314 372989 373745 374435 374927 375125 374945 374241 372984
63676 372984 371580 370762 370927 371735 372569 373267 374203 375764 377954 380468 382899 384798 385742 385551 384497 383152
63660 383152 381942 380860 379653 378161 376279 373680 369970 365305 360568 356676 353835 351654 349724 347824
63646 347824 345805 343721 341957 340799 339983 339136 338609 339266 341373 344254 347246 350464 354297 358684 363305
$$ packed form
63754B66264o95J27P35Q80O42M31O28J151J465J185O55O22J240J716J386Q52J322
63737B80606K793L774L236K119K012K970L638L311K682K493K561K574K806L463
63723C21038M048M165M255M852N618N845N507M992M262L095J874J233R98M43n11
63708C71714j171j316j517k077k441k135j548j278j259j041n17J47Q92J675K249
63693C60377K480K569K628K331J429L42k01l5L94O75P56O90M92J98j80p04j257
63676C72984j404q18J65Q08Q34O98R36J561K190K514K431J899R44j91j054j345
63660C83152j210j082j207j492j882k599l710m665m737l892k841k181j930j900
63646C47824k019k084j764j158q16q47n27O57K107K881K992L218L833M387M621
$$ plain form
63631 363305 368106 373088 377909 382246 386460 391361 397304 403857 410420 416825 423329 430357 438364 447684
63617 447684 458358 470249 483338 497791 513737 531184 550218 571092 594013 618896 645346
63606 645346 672807 700671 728310 755032 780001 802239 820792 834921 844299 849167 850308 848657
63594 848657 844837 839162 832006 823882 815086 805591 795427 784762 773360 760339 744931 727356 708589
63581 708589 689432 670215 651220 632869 615510 599432 585159 573273 563835 556368 550500 546289
63569 546289 543802 542762 542840 543984 546227 549368 553063 557059 561199 565419 569900 575042 581068 587863 595411
63554 595411 604177 614836 627741 642925 660558 681116 705025 732334 762792 796106 831919 869373
63542 869373 906671 941250 970676 993527 1009433 1018506 1021069 1017901 1010340 999822 987478 974247
$$ packed form
63631C63305M801M982M821M337M214M901N943O553O563O405O504P028Q007R320
63617D47684J0674J1891J3089J4453J5946J7447J9034K0874K2921K4883K6450
63606F45346K7461K7864K7639K6722K4969K2238J8553J4129R378M868J141j651
63594H48657l820n675p156q124q796r495j0164j0665j1402j3021j5408j7575j8767
63581G08589j9157j9217j8995j8351j7359j6078j4273j1886r438p467n868m211
63569E46289k487j040P8J144K243L141L695L996M140M220M481N142O026O795P548
63554E95411Q766J0659J2905J5184J7633K0558K3909K7309L0458L3314L5813L7454
63542H69373L7298L4579K9426K2851J5906R073K563l168p561j0518j2344j3231
$$ plain form
63530 974247 961074 948660 937062 925667 913535 899749 883662 864975 843597 819488 792862
63519 792862 764488 735414 706307 677427 649337 623068 599206 577309 556796 538047 521970
63508 521970 508661 497199 486767 477260 468666 460548 452540 444841 437826 431496 425651 420305 415555
63495 415555 411330 407640 404849 403209 402292 401349 400193 399256 398775 398430 398030 398088 399363 402001 405472 409211
63479 409211 413040 417003 421143 425497 430084 434747 439099 442685 445108 446049 445411 443587 441427 439647 438245
63464 438245 436595 434142 430958 427651 424830 422634 420691 418599 416532 415284 415541 417156 419305 421270
63450 421270 422884 424335 425971 428343 432002 436939 442550 448441 455063 463194 472994 484009 496021 509495
63436 509495 525223 543940 566246 592315 621320 651477 681030 709055 735135 758527 778071
$$ packed form
63530I74247j3173j2414j1598j1395j2132j3786j6087j8687k1378k4109k6626
63519G92862k8374k9074k9107k8880k8090k6269k3862k1897k0513j8749j6077
63508E21970j3309j1462j0432r507q594q118q008p699p015o330n845n346m750
63495D15555m225l690k791j640r17r43j156r37m81l45m00N8J275K638L471L739
63479D09211L829L963M140M354M587M663M352L586K423R41o38j824k160j780j402
63464D38245j650k453l184l307k821k196j943k092k067j248K57J615K149J965
63450D21270J614J451J636K372L659M937N611N891O622Q131R800J1015J2012J3474
63436E09495J5728J8717K2306K6069K9005L0157K9553K8025K6080K3392J9544
$$ plain form
63425 778071 792935 803230 809900 814284 817791 821808 827684 836662 849621 866759 887634 911636 938235
63412 938235 966484 994397 1019302 1039124 1053281 1062270 1066664 1066732 1062856 1055830 1046624 1036009 1024500
63399 1024500 1012387 999524 985143 968220 948265 925738 901604 876505 850413 823095 794789
63388 794789 766334 738662 712251 687152 663457 641559 621919 604687 589710 576842 566123
63377 566123 557627 551288 546921 544396 543783 545376 549457 555851 563736 572116 580625 589736 600203 612480
63363 612480 626734 643055 661394 681470 703088 726520 752299 780640 811234 843509 876816
63352 876816 910309 942884 973260 1000084 1022129 1038761 1050231 1057234 1060187 1059239 1054871 1047976 1039190
63339 1039190 1028689 1016869 1004613 992250 978673 962253 942653 921058 898469 874495 848244
$$ packed form
63425G78071J4864J0295O670M384L507M017N876Q978J2959J7138K0875K4002K6599
63412I38235K8249K7913K4905J9822J4157Q989M394O8l876p026r206j0615j1509
63399A024500j2113j2863j4381j6923j9955k2527k4134k5099k6092k7318k8306
63388G94789k8455k7672k6411k5099k3695k1898j9640j7232j4977j2868j0719
63377E66123q496o339m367k525o13J593M081O394P885Q380Q509R111J0467J2277
63363F12480J4254J6321J8339K0076K1618K3432K5779K8341L0594L2275L3307
63352H76816L3493L2575L0376K6824K2045J6632J1470P003K953r48m368o895q786
63339A039190j0501j1820j2256j2363j3577j6420j9600k1595k2589k3974k6251
$$ plain form
63328 848244 820055 791744 765264 741547 720642 702510 687367 675466 666822 661172 657953 656199
63316 656199 654556 651601 646226 637776 625926 610655 592455 572414 551910 532138 513900 497696
63304 497696 483778 472061 462190 453880 447187 442272 438889 436249 433528 430437 427218 424151 421303 418700
63290 418700 416417 414284 411720 408173 403705 398922 394385 390366 387079 384767 383368 382440 381602 380875 380454
63275 380454 380405 380853 382136 384385 387052 389222 390437 390946 391218 391497 391890 392613 394022 396491 400193 404803
63259 404803 409452 413317 416340 419199 422558 426573 431143 436290 442140 448745 456093 464055 472196 479893
63245 479893 486963 494075 502283 512152 523413 535421 547821 560920 575512 592257 611122 631531
63233 631531 653161 676393 701820 729525 759125 790323 822983 856608 890125 922481 953397
$$ packed form
63328H48244k8189k8311k6480k3717k0905j8132j5143j1901q644n650l219j754
63316F56199j643k955n375q450j1850j5271j8200k0041k0504j9772j8238j6204
63304D97696j3918j1717r871q310o693m915l383k640k721l091l219l067k848k603
63290D18700k283k133k564l547m468m783m537m019l287k312j399r28q38p27m21
63275C80454m9M48J283K249K667K170J215N09K72K79L93P23J409K469L702M610
63259D04803M649L865L023K859L359M015M570N147N850O605P348P962Q141P697
63245D79893P070P112Q208R869J1261J2008J2400J3099J4592J6745J8865K0409
63233F31531K1630K3232K5427K7705K9600L1198L2660L3625L3517L2356L0916
$$ plain form
63222 953397 983402 1013178 1042926 1072404 1101487 1130577 1160346 1191139 1222762 1254723 1286307
63211 1286307 1316290 1343014 1365106 1382040 1393790 1400149 1400579 1394510 1381468 1361201 1334128 1301566
63199 1301566 1265040 1225491 1183573 1140519 1098012 1057151 1018236 981691 948557 919709 895220
63188 895220 874856 858670 846685 838548 834074 833665 837558 844984 854748 866406 880131 895606 911865
63175 911865 928256 944787 961369 977393 992375 1006523 1020410 1034419 1048599 1062533 1075182
63164 1075182 1085363 1092637 1097313 1099404 1098173 1092992 1084031 1071626 1055548 1035484 1011871 985581
63152 985581 957097 926658 895059 863614 833332 804693 778122 753983 732050 711623 692473
63141 692473 675179 660338 647877 637307 628222 620230 612923 606356 601276 598355 597305 597104 597055 597275
$$ packed form
63222I53397L0005K9776K9748K9478K9083K9090K9769L0793L1623L1961L1584
63211A286307K9983K6724K2092J6934J1750O359M30o069j3042k0267k7073l2562
63199A301566l6526l9549m1918m3054m2507m0861l8915l6545l3134k8848k4489
63188H95220k0364j6186j1985q137m474m09L893P426R764J1658J3725J5475J6259
63175I11865J6391J6531J6582J6024J4982J4148J3887J4009J4180J3934J2649
63164A075182J0181P274M676K091j231n181q961j2405j6078k0064k3613k6290
63152I85581k8484l0439l1599l1445l0282k8639k6571k4139k1933k0427j9150
63141F92473j7294j4841j2461j0570r085p992p307o567n080k921j050k01m9K20
$$ plain form
63127 597275 598186 599930 602422 605723 610078 615588 621957 628600 634951 640670 645670 650055 654045 657831
63113 657831 661430 664783 668019 671416 675008 678420 681297 683713 685887 687706 688866 689353 689348 688742 687274
63098 687274 685288 683827 683659 684523 685612 686581 687799 689804 692757 696277 699570 701875 703019 703541 704168
63083 704168 705293 706995 709290 712142 715388 718938 722912 727453 732489 737841 743504 749693 756718 764814
63069 764814 773959 783914 794729 807112 821782 838364 855652 873300 892625 915176 941050 969366
63057 969366 999958 1033737 1071516 1113392 1159290 1209309 1263320 1320978 1382367 1447957 1517663
63046 1517663 1590556 1665838 1743402 1822973 1903323 1983003 2061485 2138920 2215054 2289133 2360866
63035 2360866 2430823 2499721 2567714 2634537 2699963 2763727 2825028 2882270 2933377 2976420 3009899
$$ packed form
63127E97275R11J744K492L301M355N510O369O643O351N719N000M385L990L786
63113F57831L599L353L236L397L592L412K877K416K174J819J160M87no06j468
63098F87274j986j461j68Q64J089R69J218K005K953L520L293K305J144N22O27
63083G04168J125J702K295K852L246L550L974M541N036N352N663O189P025Q096
63069G64814R145R955J0815J2383J4670J6582J7288J7648J9325K2551K5874K8316
63057I69366L0592L3779L7779M1876M5898N0019N4011N7658O1389O5590O9706
63046A517663P2893P5282P7564P9571Q0350P9680P8482P7435P6134P4079P1733
63035B360866O9957O8898O7993O6823O5426O3764O1301N7242N1107M3043L3479
$$ plain form
63024 3009899 3032350 3041900 3036664 3015734 2979456 2928646 2864048 2787023 2700332 2607450 2510970 2412180
63012 2412180 2312337 2213837 2119753 2032441 1952924 1881541 1818787 1765342 1721437 1686533 1659735
63001 1659735 1640444 1628418 1623343 1624582 1631352 1642884 1658335 1676803 1697590 1720264 1744429 1769625
62989 1769625 1795523 1821886 1848218 1873851 1898558 1922643 1945995 1967454 1985593 1999865 2010324
62978 2010324 2016345 2016318 2008708 1992956 1969271 1938152 1900420 1857267 1809818 1758757 1704475 1647442
62966 1647442 1588386 1528429 1469129 1412032 1357995 1307113 1259369 1214943 1173757 1135191 1098616
62955 1098616 1063970 1031467 1000950 971927 944108 917537 892251 868126 845111 823343 802952
62944 802952 783887 766044 749473 734392 720944 708874 697508 686298 675436 665773 657983 651930
$$ packed form
63024C009899K2451R550n236k0930l6278n0810o4598p7025q6691r2882r6480r8790
63012B412180r9843r8500r4084q7312p9517p1383o2754n3445m3905l4904k6798
63001A659735j9291j2026n075J239O770J1532J5451J8468K0787K2674K4165K5196
62989A769625K5898K6363K6332K5633K4707K4085K3352K1459J8139J4272J0459
62978B010324O021k7p610j5752k3685l1119l7732m3153m7449n1061n4282n7033
62966A647442n9056n9957n9300n7097n4037n0882m7744m4426m1186l8566l6575
62955A098616l4646l2503l0517k9023k7819k6571k5286k4125k3015k1768k0391
62944H02952j9065j7843j6571j5081j3448j2070j1366j1210j0862r663p790o053
$$ plain form
62932 651930 646868 642083 637297 632757 629039 626466 624529 622234 619215 616117 613537 611083 608085 604897
62918 604897 602628 601567 600670 598884 596352 593904 591850 589766 587201 584136 580856 577777 575298 573458
62904 573458 571773 569708 567310 565122 563486 562207 560955 559724 558728 558090 557822 557972 558544 559250 559612 559408
62888 559408 558922 558602 558538 558461 558258 558273 558920 560181 561700 563304 565133 567185 569042 570229 570707 570799 570729 570426
62870 570426 569683 568313 566234 563656 561176 559374 558253 557281 556136 555076 554425 554045 553746 553985 555500 558131
62854 558131 560654 562113 562922 564172 566155 568140 569448 570116 570430 570401 569983 569376 568800 568280 567919 568031 568653
62837 568653 569200 569043 568289 567617 567470 567770 568294 568900 569488 570169 571436 573722 576766 579890 582933 586408 590581
62820 590581 594969 599032 602873 606883 611070 615249 619623 624643 630356 636297 642023 647434 652654 657912
$$ packed form
62932F51930n062m785m786m540l718k573j937k295l019l098k580k454k998l188
62918F04897k269j061q97j786k532k448k054k084k565l065l280l079k479j840
62904E73458j685k065k398k188j636j279j252j231r96o38k68J50N72P06L62k04
62888E59408m86l20o4p7k03J5O47J261J519J604J829K052J857J187M78R2p0l03
62870E70426p43j370k079k578k480j802j121r72j145j060o51l80k99K39J515K631
62854E58131K523J459Q09J250J983J985J308O68L14k9m18o07n76n20l61J12O22
62837E68653N47j57p54o72j47L00N24O06N88O81J267K286L044L124L043L475M173
62820E90581M388M063L841M010M187M179M374N020N713N941N726N411N220N258
$$ plain form
62806 657912 663534 669732 676355 683111 690011 697354 705325 713918 723282 733781 745541 758218 771393
62793 771393 785092 799789 816068 834447 855453 879697 907799 940242 977265 1018941 1065428
62782 1065428 1117149 1174676 1238515 1309085 1386786 1471835 1564013 1662742 1767393 1877367 1991825
62771 1991825 2109474 2228597 2347146 2462799 2573165 2675888 2768357 2847380 2909646 2952833
62761 2952833 2976112 2979456 2962829 2926421 2871409 2799953 2714425 2617024 2510231 2397083 2280617
62750 2280617 2163189 2046575 1932537 1822765 1718235 1619022 1524998 1436513 1354204 1278393
62740 1278393 1209009 1145910 1088877 1037346 990628 948502 911121 878111 848277 820637 795391
62729 795391 773340 754565 738263 723740 710920 699847 690390 682681 677251 674317 673271 673231 673786
$$ packed form
62806F57912N622O198O623O756O900P343P971Q593R364J0499J1760J2677J3175
62793G71393J3699J4697J6279J8379K1006K4244K8102L2443L7023M1676M6487
62782A065428N1721N7527O3839P0570P7701Q5049R2178R8729J04651J09974J14458
62771A991825J17649J19123J18549J15653J10366J02723R2469P9023O2266M3187
62761B952833K3279L344j6627l6408n5012p1456q5528r7401j06793j13148j16466
62750B280617j17428j16614j14038j09772j04530r9213r4024q8485q2309p5811
62740A278393o9384o3099n7033n1531m6718m2126l7381l3010k9834k7640k5246
62729G95391k2051j8775j6302j4523j2820j1073r457p709n430k934j046m0N55
$$ plain form
62716 673786 674910 676543 678743 682009 686968 693825 702518 713275 726573 742561 760975 781676 804850
62703 804850 830607 858795 889449 923103 960362 1001318 1045620 1093111 1144168 1199365 1258783
62692 1258783 1321689 1386903 1453474 1520822 1588123 1653773 1715753 1772383 1822304 1863769 1894538
62681 1894538 1912838 1918212 1911172 1892274 1861930 1821033 1771278 1714599 1652476 1585910 1515996 1444303
62669 1444303 1372671 1302695 1235463 1171646 1111711 1055996 1004697 957901 915534 877191 842132
62658 842132 809661 779608 752334 728217 707231 688941 672719 657858 643753 630242 617701
62647 617701 606582 596754 587515 578385 569805 562770 557668 553669 549508 544852 540615 537913 536952 537065
62633 537065 537471 537625 537062 535500 533225 531033 529599 529031 529018 529099 528769 527766 526566 526261 527605 530320 533597
$$ packed form
62716F73786J124J633K200L266M959O857Q693J0757J3298J5988J8414K0701K3174
62703H04850K5757K8188L0654L3654L7259M0956M4302M7491N1057N5197N9418
62692A258783O2906O5214O6571O7348O7301O5650O1980N6630M9921M1465L0769
62681A894538J8300N374p040j8898l0344m0897m9755n6679o2123o6566o9914p1693
62669A444303p1632o9976o7232o3817n9935n5715n1299m6796m2367l8343l5059
62658H42132l2471l0053k7274k4117k0986j8290j6222j4861j4105j3511j2541
62647F17701j1119r828r239r130q580p035n102l999m161m656m237k702r61J13
62633E37065M06J54n63j562k275k192j434n68j3Q1l30j003j200l05J344K715L277
$$ plain form
62616 533597 537081 541019 545615 550696 556045 561661 567558 573666 580118 587404 596010 606008 617177 629387
62602 629387 642749 657506 674065 693033 714927 739779 767229 797167 830181 867203 908782
62591 908782 954793 1004734 1058058 1114141 1172050 1230502 1288055 1343372 1395364 1443065 1485274
62580 1485274 1520368 1546690 1563229 1569731 1566083 1551948 1527372 1493599 1452862 1407204 1357682 1304773
62568 1304773 1249286 1192765 1137111 1083833 1033454 985648 940097 897226 857859 822241 789829
62557 789829 760117 733233 709409 688270 669126 651757 636458 623318 611906 601767 592892 585432
62545 585432 579120 573229 567203 561282 556335 552991 550983 549519 548156 547002 546056 544891 543247 541556
62531 541556 540486 540159 540263 540733 541894 543993 547030 551105 556587 563886 573285 584861 598277 612834
$$ packed form
62616E33597L484L938M596N081N349N616N897O108O452P286Q606R998J1169J2210
62602F29387J3362J4757J6559J8968K1894K4852K7450K9938L3014L7022M1579
62591I08782M6011M9941N3324N6083N7909N8452N7553N5317N1992M7701M2209
62580A485274L5094K6322J6539O502l648j4135k4576l3773m0737m5658m9522n2909
62568A304773n5487n6521n5654n3278n0379m7806m5551m2871l9367l5618l2412
62557G89829k9712k6884k3824k1139j9144j7369j5299j3140j1412j0139q875p460
62545E85432o312n891o026n921m947l344k008j464j363j154r46j165j644j691
62531E41556j070l27J04M70J161K099L037M075N482P299R399J1576J3416J4557
$$ plain form
62517 612834 628274 645456 665676 689243 715295 743156 773254 806359 842491 881071 921728
62506 921728 964340 1008394 1052817 1096326 1137588 1175164 1207869 1235297 1257729 1275421 1288255
62495 1288255 1296127 1299483 1299377 1297127 1293955 1290796 1288366 1287305 1288126 1291033 1296141 1304090 1316069 1332779
62481 1332779 1353440 1376167 1399228 1421531 1442005 1459154 1471479 1477975 1477883 1470332 1454629 1430800
62469 1430800 1399540 1361667 1317888 1269050 1216384 1161389 1105539 1050006 995508 942434 891285
62458 891285 842990 798636 758872 723735 693048 666728 644600 626178 610887 598447 588753 581466
62446 581466 576104 572556 571086 571599 573284 575385 578046 581875 586815 592081 597198 602361 607453 611400
62432 611400 613088 612619 611057 609143 606772 603521 599008 592794 584623 575027 565174 555923 547364 539459
$$ packed form
62517F12834J5440J7182K0220K3567K6052K7861L0098L3105L6132L8580M0657
62506I21728M2612M4054M4423M3509M1262L7576L2705K7428K2432J7692J2834
62495A288255P872L356j06k250l172l159k430j061Q21K907N108P949J1979J6710
62481A332779K0661K2727K3061K2303K0474J7149J2325O496r2p551j5703k3829
62469A430800l1260l7873m3779m8838n2666n4995n5850n5533n4498n3074n1149
62458H91285m8295m4354l9764l5137l0687k6320k2128j8422j5291j2440r694p287
62446E81466n362l548j470N13J685K101K661L829M940N266N117N163N092L947
62432F11400J688m69j562j914k371l251m513o214q171r596r853r251q559p905
$$ plain form
62418 539459 532523 526739 521606 516420 511104 506151 501860 498056 494515 491294 488499 485907 482985 479323
62404 479323 475214 471759 470089 470190 470726 470318 468874 467399 466795 467326 469053 472083 476122 480356 484136
62389 484136 487539 490974 494501 497899 501125 504308 507396 510294 513413 517596 523276 529914 536555 542805
62375 542805 549025 555682 562812 570212 577880 586086 595100 605047 616018 628097 641258 655428 670846
62362 670846 688278 708708 732791 760658 792146 827038 865100 906098 949916 996484 1045345
62351 1045345 1095223 1144155 1190138 1231714 1268034 1298591 1323074 1341388 1353532 1359314 1358312 1350413
62339 1350413 1336399 1317749 1295704 1270581 1242097 1210275 1175965 1140595 1105595 1071896 1039771
62328 1039771 1009093 979879 952561 927616 904961 883839 863261 842445 820973 798849 776482
$$ packed form
62418E39459o936n784n133n186n316m953m291l804l541l221k795k592k922l662
62404D79323m109l455j670J01N36m08j444j475o04N31J727L030M039M234L780
62389D84136L403L435L527L398L226L183L088K898L119M183N680O638O641O250
62375E42805O220O657P130P400P668Q206R014R947J0971J2079J3161J4170J5418
62362F70846J7432K0430K4083K7867L1488L4892L8062M0998M3818M6568M8861
62351A045345M9878M8932M5983M1576L6320L0557K4483J8314J2144N782j002p899
62339A350413j4014j8650k2045k5123k8484l1822l4310l5370l5000l3699l2125
62328A039771l0678k9214k7318k4945k2655k1122k0578k0816k1472k2124k2367
$$ plain form
62317 776482 754366 732651 711220 690256 670424 652368 636235 621854 609085 597716 587265
62306 587265 577355 568227 560492 554292 549058 544246 539990 536850 535115 534664 535325 537002 539328 541538 542964
62291 542964 543710 544599 546307 548627 550749 552245 553546 555370 557931 560892 563900 566789 569387 571524 573384
62276 573384 575506 578180 581073 583717 586267 589495 594081 600186 607720 616709 627227 639198 652566
62263 652566 667669 685183 705620 729052 755458 785218 819005 857200 899617 945833 995522
62252 995522 1048237 1102976 1158142 1211860 1262239 1307513 1346268 1377654 1401247 1416756 1424041 1423292
62240 1423292 1414910 1399176 1376301 1346783 1311356 1270526 1224690 1175003 1123721 1073124 1024185
62229 1024185 976735 930846 887588 848275 813353 782259 754137 728465 705139 684249 665913
$$ packed form
62317G76482k2116k1715k1431k0964j9832j8056j6133j4381j2769j1369j0451
62306E87265r910r128p735o200n234m812m256l140j735m51O61J677K326K210J426
62291E42964P46Q89J708K320K122J496J301J824K561K961L008K889K598K137J860
62276E73384K122K674K893K644K550L228M586O105P534Q989J0518J1971J3368
62263F52566J5103J7514K0437K3432K6406K9760L3787L8195M2417M6216M9689
62252I95522N2715N4739N5166N3718N0379M5274L8755L1386K3593J5509P285p49
62240A423292q382j5734k2875k9518l5427m0830m5836m9687n1282n0597m8939
62229A024185m7450m5889m3258l9313l4922l1094k8122k5672k3326k0890j8336
$$ plain form
62218 665913 650175 636886 625517 615188 605171 595566 587270 580988 576423 572698 569418 566872 565261
62205 565261 564258 563586 563535 564556 566616 569405 573009 577911 584344 592068 600871 610961 622663 635975
62191 635975 650572 666132 682506 699675 717713 736698 756482 776584 796452 815850 834829
62180 834829 853206 870165 884531 895535 903307 908667 912480 915309 917577 919862 922830 926953 932451
62167 932451 939590 948977 961503 978016 998974 1024226 1052913 1083592 1114596 1144467 1172139 1196846
62155 1196846 1217977 1235042 1247597 1255113 1256990 1252926 1243341 1229278 1211786 1191407 1168301 1142738
62143 1142738 1115332 1086868 1058132 1030011 1003558 979721 958887 940735 924622 910160 897477
62132 897477 886960 878787 872711 868262 865064 862960 861910 861887 862902 865015 868237 872423 877343 882987
$$ packed form
62218F65913j5738j3289j1369j0329j0017r605q296o282m565l725l280k546j611
62205E65261j003o72n1J021K060K789L604M902O433P724Q803J0090J1702J3312
62191F35975J4597J5560J6374J7169J8038J8985J9784K0102J9868J9398J8979
62180H34829J8377J6959J4366J1004P772N360L813K829K268K285K968M123N498
62167I32451P139R387J2526J6513K0958K5252K8687L0679L1004K9871K7672K4707
62155A196846K1131J7065J2555P516J877m064r585j4063j7492k0379k3106k5563
62143A142738k7406k8464k8736k8121k6453k3837k0834j8152j6113j4462j2683
62132H97477j0517q173o076m449l198k104j050k3J015K113L222M186M920N644
$$ plain form
62118 882987 889766 898318 908951 921188 933849 945671 955953 964822 972994 981207 989658 997816 1004779
62105 1004779 1009854 1012852 1013937 1013393 1011638 1009330 1007372 1006727 1008130 1011722 1016882 1022565 1027967 1032814
62091 1032814 1037013 1040274 1042293 1043195 1043563 1044051 1045058 1046654 1048623 1050688 1052899 1055754 1059763 1065012 1071413
62076 1071413 1079253 1089132 1101331 1115548 1131262 1147969 1164965 1181344 1196647 1211366 1226556 1242931
62064 1242931 1260436 1278544 1296774 1314958 1333145 1351247 1368767 1384951 1399169 1410932 1419566
62053 1419566 1424286 1424878 1422007 1416457 1408148 1396247 1380195 1360290 1337194 1311182 1282130 1250086
62041 1250086 1215602 1179504 1142417 1104646 1066488 1028576 991848 957135 924772 894546 866029
62030 866029 839065 814086 791843 772673 756121 741434 728300 716792 706674 697248 687982 678953
$$ packed form
62118H82987O779Q552J0633J2237J2661J1822J0282Q869Q172Q213Q451Q158O963
62105A004779N075K998J085n44j755k308j958o45J403L592N160N683N402M847
62091A032814M199L261K019R02L68M88J007J596J969K065K211K855M009N249O401
62076A071413P840R879J2199J4217J5714J6707J6996J6379J5303J4719J5190J6375
62064A242931J7505J8108J8230J8184J8187J8102J7520J6184J4218J1763Q634
62053A419566M720N92k871n550q309j1901j6052j9905k3096k6012k9052l2044
62041A250086l4484l6098l7087l7771l8158l7912l6728l4713l2363l0226k8517
62030H66029k6964k4979k2243j9170j6552j4687j3134j1508j0118r426r266r029
$$ plain form
62018 678953 670470 662631 655425 648918 642934 636899 630397 623803 618009 613573 610446 608406 607413 607471 608465
62003 608465 610233 612685 615815 619650 624111 628850 633337 637213 640382 642737 644041 644221 643409 641413 637546
61988 637546 631349 623268 614208 604660 594630 584097 573031 561298 549204 537963 528825 521708 515338
61975 515338 508771 502134 495871 490146 485201 481467 478836 476481 473845 471256 469131 467171 464944 462744
61961 462744 461224 460504 460215 460148 460224 460177 459943 460208 461880 465028 468942 473227 478183 484063 490637 497808 506137
61944 506137 516376 528682 542603 557682 573864 591288 609812 628807 647612 666232 685319
61933 685319 705222 725250 744230 761595 777554 792356 805852 817714 827574 834968 839637 841978
61921 841978 842673 841771 838679 833294 826589 819714 813012 806443 800614 796747 795656 797263 801171 807286 815745
$$ packed form
62018F78953q483p839p206o507n984o035o502o594n794m436l127k040r93N8R94
62003F08465J768K452L130L835M461M739M487L876L169K355J304J80q12j996l867
61988F37546o197q081r060r548j0030j0533j1066j1733j2094j1241r138p117o370
61975E15338o567o637o263n725m945l734k631k355k636k589k125j960k227k200
61961D62744j520p20k89o7P6m7k34K65J672L148L914M285M956N880O574P171Q329
61944E06137J0239J2306J3921J5079J6182J7424J8524J8995J8805J8620J9087
61933F85319J9903K0028J8980J7365J5959J4802J3496J1862R860P394M669K341
61921H41978O95r02l092n385o705o875o702o569n829l867j091J607L908O115Q459
$$ plain form
61906 815745 826493 839083 852752 866549 879497 890768 899801 906337 910352 911888 910855 907048 900432
61893 900432 891356 880467 868525 856312 844458 833128 821962 810611 799314 788747 779226 770221
61881 770221 760807 750535 739738 728970 718262 707082 695028 682467 670357 659521 650169 642079
61869 642079 635007 628880 623774 619822 617057 615306 614393 614499 616150 619692 624919 631424 639253 649045 661538
61854 661538 677104 695648 716700 739510 763358 788001 813780 841023 869357 897737 925234
61843 925234 951531 976463 999223 1018458 1033253 1043742 1050459 1053372 1051960 1046231 1037291 1026859
61831 1026859 1016521 1007480 1000532 995971 993740 993948 996992 1002861 1010673 1019304 1028298 1037515 1045973 1051760
61817 1051760 1053399 1050829 1044644 1034807 1020667 1002083 980003 955898 930945 905767 880628 855731
$$ packed form
61906H15745J0748J2590J3669J3797J2948J1271R033O536M015J536j033l807o616
61893I00432r076j0889j1942j2213j1854j1330j1166j1351j1297j0567r521r005
61881G70221r414j0272j0797j0768j0708j1180j2054j2561j2110j0836r352q090
61869F42079p072o127n106l952k765j751r13J06J651L542N227O505P829R792J2493
61854F61538J5566J8544K1052K2810K3848K4643K5779K7243K8334K8380K7497
61843I25234K6297K4932K2760J9235J4795J0489O717K913j412n729q940j0432
61831A026859j0338r041o948m561k231K08L044N869P812Q631Q994R217Q458N787
61817A051760J639k570o185r837j4140j8584k2080k4105k4953k5178k5139k4897
$$ plain form
61805 855731 831503 808605 787501 768088 750030 733450 718860 706338 695244 685047 676070 668986
61793 668986 663768 659611 655808 652240 649000 645989 643095 640470 638326 636571 634834 632799 630466 628136
61779 628136 626137 624414 622450 619782 616628 613750 611609 609910 608081 605897 603495 601077 598905 597394
61765 597394 596813 596905 597042 596825 596457 596571 597707 599803 602147 603988 605208 606156 606844 606820 606048 605238 604753 603758
61747 603758 601240 597588 594245 591849 589637 586768 583316 579649 575781 571880 568658 566492 564740 562732
61733 562732 561008 560691 561886 563599 565222 567152 569733 572435 574586 576376 578564 581491 584847 588274
61719 588274 591704 595082 598125 600588 602586 604477 606392 607986 608842 609033 609024 608893 607960 605460 601386 596345
61703 596345 590798 584906 579032 573773 569349 565472 562006 559250 557279 555521 553499 551583 550409 549744
$$ packed form
61805H55731k4228k2898k1104j9413j8058j6580j4590j2522j1094j0197q977p084
61793F68986n218m157l803l568l240l011k894k625k144j755j737k035k333k330
61779F28136j999j723j964k668l154k878k141j699j829k184k402k418k172j511
61765E97394n81R2J37k17l68J14J136K096K344J841J220R48O88k4p72q10m85r95
61747F03758k518l652l343k396k212k869l452l667l868l901l222k166j752k008
61733E62732j724l17J195J713J623J930K581K702K151J790K188K927L356L427
61719E88274L430L378L043K463J998J891J915J594Q56J91rj31r33k500m074n041
61703E96345n547n892n874n259m424l877l466k756j971j758k022j916j174o65
$$ plain form
61689 549744 548567 546321 543510 540958 538961 537329 535831 534264 532383 530090 527610 525342 523619 522723
61675 522723 522861 523851 524952 525247 524252 522127 519417 516705 514341 512314 510428 508697 507432 506796 506447 505853
61659 505853 504827 503553 502237 501024 500186 499977 500268 500603 500742 500899 501413 502378 503660 505030 506273 507443
61643 507443 509057 511681 515133 518473 520945 522642 523947 524721 524473 523140 521254 519416 517923 516827 515899
61628 515899 514617 512593 510104 507825 505997 504235 502201 500036 497976 496029 494343 493504 493910 495025 495729
61613 495729 495427 494392 492953 490776 487192 481979 475488 468140 460263 452444 445574 440071 435261 429955
61599 429955 423746 417434 412095 408080 405022 402390 399671 396369 392330 388090 384514 382058 380525 379415
61585 379415 378197 376435 374074 371607 369601 368034 366358 364136 361314 358028 354615 351748 350013 349333
$$ packed form
61689E49744j177k246k811k552j997j632j498j567j881k293k480k268j723q96
61675E22723J38R90J101K95r95k125k710k712k364k027j886j731j265o36l49n94
61659E05853j026j274j316j213q38k09K91L35J39J57N14R65J282J370J243J170
61643E07443J614K624L452L340K472J697J305P74k48j333j886j838j493j096r28
61628E15899j282k024k489k279j828j762k034k165k060j947j686q39M06J115P04
61613D95729l02j035j439k177l584n213o491p348p877p819o870n503m810n306
61599D29955o209o312n339m015l058k632k719l302m039m240l576k456j533j110
61585C79415j218j762k361k467k006j567j676k222k822l286l413k867j735o80
$$ plain form
61571 349333 349249 349658 350611 351427 350918 348867 346512 345091 344517 344020 343448 343193 343325 343556 343880 344520 345391 346193
61553 346193 346913 347764 348777 349953 351533 353553 355350 356212 356360 356609 357168 357560 357682 358110 359174 360539
61537 360539 361953 363732 366128 368792 371259 373489 375565 377253 378178 378162 377230 375642 374033 372962 372145
61522 372145 370699 368411 366114 364442 362928 360907 358722 357253 356640 356257 355705 355089 354478 353827 353368 353350
61506 353350 353367 352682 351313 350124 349634 349357 348667 347745 347233 347333 347739 348226 348830 349517 350110 350568 351093 351814
61488 351814 352559 353064 353344 353706 354347 355003 355198 354882 354630 355038 356099 357418 358939 361031 363784 366604 368770
61471 368770 370202 371404 372750 374101 375143 375801 376228 376516 376667 376805 377240 378169 379420 380609 381523 382200
61455 382200 382705 383040 383294 383628 384068 384582 385441 387125 389582 391902 393208 393729 394539 396304 398739 401342
$$ packed form
61571C49333q4M09R53Q16n09k051k355j421n74m97n72k55J32K31L24O40Q71Q02
61553C46193P20Q51J013J176J580K020J797Q62J48K49N59L92J22M28J064J365
61537C60539J414J779K396K664K467K230K076J688R25j6r32j588j609j071q17
61522C72145j446k288k297j672j514k021k185j469o13l83n52o16o11o51m59j8
61506C53350J7o85j369j189m90k77o90r22n12J00M06M87O04O87N93M58N25P21
61488C51814P45N05K80L62O41O56J95l16k52M08J061J319J521K092K753K820K166
61471C68770J432J202J346J351J042O58M27K88J51J38M35R29J251J189R14O77
61455C82200N05L35K54L34M40N14Q59J684K457K320J306N21Q10J765K435K603
$$ plain form
61439 401342 404100 407260 410785 414394 417867 421075 423929 426570 429396 432543 435493 437549 438644 439415
61425 439415 440459 441809 443118 444093 444633 444828 444910 445068 445195 445021 444548 444160 444155 444353 444322 443809 442783 441260
61407 441260 439332 437275 435308 433335 431210 429145 427506 426178 424630 422780 421353 421045 421625 422221 422297
61392 422297 422046 422002 422593 423894 425434 426391 426450 426349 427153 429005 431120 433002 435043 437761 441042 444483
61376 444483 447975 451578 455185 458750 462489 466389 469792 471986 473083 473836 474685 475427 475778 475810 475778 475898
61360 475898 476401 477510 479284 481663 484679 488441 492930 498024 503706 510045 517047 524675 532936 541740
61346 541740 550797 559867 568909 577683 585487 591710 596503 600426 603527 605321 605673 605152 604423 603769 603234
61331 603234 602709 601735 599732 596637 592891 588709 583972 578975 574590 571321 568848 566999 566505 568080 571185
$$ packed form
61439D01342K758L160L525L609L473L208K854K641K826L147K950K056J095P71
61425D39415J044J350J309R75N40J95Q2J58J27j74m73l88nJ98l1n13j026j523
61407D41260j928k057j967j973k125k065j639j328j548j850j427l08N80N96P6
61392D22297k51m4N91J301J540R57N9j01Q04J852K115J882K041K718L281L441
61376D44483L492L603L607L565L739L900L403K194J097P53Q49P42L51L2l2J20
61360D75898N03J109J774K379L016L762M489N094N682O339P002P628Q261Q804
61346E41740R057R070R042Q774P804O223M793L923L101J794L52n21p29o54n35
61331F03234n25r74k003l095l746m182m737m997m385l269k473j849m94J575L105
$$ plain form
61316 571185 574559 577774 581518 586437 592421 599157 606680 615164 624680 635433 647826 661978 677394
61303 677394 693414 709760 726349 742612 757290 769117 777677 783411 786724 787275 784446 778404 770228
61290 770228 760892 750599 739398 727932 717056 706980 697394 688258 679919 672508 665858 660113 655892
61277 655892 653662 653274 654267 656271 659019 662314 666137 670507 675166 679734 684207 688923 693872 698516 702509
61262 702509 706258 710516 715795 722462 730972 741479 753321 765263 776224 785547 792797 797706 800276
61249 800276 800601 798616 794266 787954 780505 772667 764826 757182 749928 743119 736608 730312 724506 719754
61235 719754 716504 714745 714035 713845 713925 714384 715501 717572 720880 725635 731894 739609 748708 758906 769493
61220 769493 779645 789165 798585 808290 817784 826146 833059 839048 844857 851032 857968 865789 873945 881350
$$ packed form
61316E71185L374L215L744M919N984O736P523Q484R516J0753J2393J4152J5416
61303F77394J6020J6346J6589J6263J4678J1827Q560N734L313N51k829o042q176
61290G70228r336j0293j1201j1466j0876j0076r586r136q339p411o650n745m221
61277F55892k230l88R93K004K748L295L823M370M659M568M473M716M949M644L993
61262G02509L749M258N279O667Q510J0507J1842J1942J0961R323P250M909K570
61249H00276L25j985m350o312p449p838p841p644p254o809o511o296n806m752
61235G19754l250j759p10j90Q0M59J117K071L308M755O259P715R099J0198J0587
61220G69493J0152R520R420R705R494Q362O913N989N809O175O936P821Q156P405
$$ plain form
61206 881350 887279 891955 896117 900303 904789 909995 916549 924939 935313 947579 961518 976842 993415
61193 993415 1011475 1031433 1053247 1076049 1098408 1118982 1136949 1152017 1164137 1173271 1179411 1182789
61181 1182789 1183934 1183388 1181387 1177943 1173147 1167156 1159850 1150735 1139368 1125815 1110564 1094102 1076681
61168 1076681 1058342 1038993 1018542 997193 975616 954568 934274 914323 894231 874002 854108
61157 854108 835098 817346 801084 786640 774575 765482 759432 755737 753577 752903 754345 758072 763035
61144 763035 767557 770425 771216 769915 766658 761766 755684 748895 742063 736026 731304 727781 725241 724091
61130 724091 725143 728801 734961 743634 755051 769054 785007 802614 822356 844759 869630 896400
61118 896400 924898 955336 987678 1021462 1056200 1091625 1127508 1163372 1198393 1231604 1262390
$$ packed form
61206H81350N929M676M162M186M486N206O554Q390J0374J2266J3939J5324J6573
61193I93415J8060J9958K1814K2802K2359K0574J7967J5068J2120R134O140L378
61181A182789J145n46k001l444m796n991p306r115j1367j3553j5251j6462j7421
61168A076681j8339j9349k0451k1349k1577k1048k0294j9951k0092k0229j9894
61157H54108j9010j7752j6262j4444j2065r093o050l695k160o74J442L727M963
61144G63035M522K868P91j301l257m892o082o789o832o037m722l523k540j150
61130G24091J052L658O160Q673J1417J4003J5953J7607J9742K2403K4871K6770
61118H96400K8498L0438L2342L3784L4738L5425L5883L5864L5021L3211L0786
$$ plain form
61107 1262390 1290883 1317558 1342311 1364250 1382621 1397585 1409684 1418734 1423671 1423365 1417269 1405379
61095 1405379 1388016 1365710 1339130 1309075 1276527 1242423 1207183 1170855 1134040 1098262 1064802
61084 1064802 1033449 1003095 973471 945493 919886 896282 874013 853080 833853 816380 800552
61073 800552 786555 774488 763824 753888 744867 737761 733214 730797 729585 729066 729338 730714 733381 737284
61059 737284 742067 747231 752548 758288 764997 773155 783217 795700 810780 827702 845113 862372 880384
61046 880384 900761 924228 950130 977360 1005279 1033735 1062740 1092444 1122985 1154058 1184898
61035 1184898 1214983 1244480 1273707 1302547 1330809 1358813 1387066 1415616 1444262 1473214 1502884
61024 1502884 1533111 1563374 1593956 1626264 1661696 1700614 1742614 1787356 1834875 1885435 1939441
$$ packed form
61107A262390K8493K6675K4753K1939J8371J4964J2099R050M937l06o096j1890
61095A405379j7363k2306k6580l0055l2548l4104l5240l6328l6815l5778l3460
61084A064802l1353l0354k9624k7978k5607k3604k2269k0933j9227j7473j5828
61073H00552j3997j2067j0664r936r021p106m547k417j212n19K72J376K667L903
61059G37284M783N164N317N740O709Q158J0062J2483J5080J6922J7411J7259J8012
61046H80384K0377K3467K5902K7230K7919K8456K9005K9704L0541L1073L0840
61035A184898L0085K9497K9227K8840K8262K8004K8253K8550K8646K8952K9670
61024A502884L0227L0263L0582L2308L5432L8918M2000M4742M7519N0560N4006
$$ plain form
61013 1939441 1997400 2060002 2128513 2205047 2292018 2391265 2504082 2631971 2776910 2941207
61003 2941207 3128205 3343506 3594838 3890529 4238875 4649056 5131636 5698417 6364030
60994 6364030 7149034 8080372 9188812 10509184 12082798 13946515 16097008 18450740
60986 18450740 20843456 23086593 25040511 26644194 27888905 28783974 29360077 29693191
60978 29693191 29894184 30048482 30158217 30146106 29915017 29400753 28574995 27419279 25917986
60969 25917986 24083414 21982048 19730703 17464625 15302378 13325931 11577448 10066198
60961 10066198 8779585 7693949 6782049 6016884 5373591 4830709 4370723 3979547 3645338
60952 3645338 3357555 3106977 2886452 2691216 2518039 2364105 2226857 2104451 1995491
$$ packed form
61013A939441N7959O2602O8511P6534Q6971R9247J12817J27889J44939J64297
61003B941207J86998K15301K51332K95691L48346M10181M82580N66781O65613
60994F364030P85004R31338J108440J320372J573614J863717K150493K353732
60986A8450740K392716K243137J953918J603683J244711Q95069N76103L33114
60978B9693191K00993J54298J09735j2111k31089n14264q25758j155716j501293
60969B5917986j834572k101366k251345k266078k162247j976447j748483j511250
60961A0066198j286613j085636r11900p65165o43293n42882m59986l91176l34209
60952C645338k87783k50578k20525j95236j73177j53934j37248j22406j08960
$$ plain form
60943 1995491 1898244 1810704 1731401 1659394 1593367 1531542 1472796 1417035 1364090 1313042 1263300
60932 1263300 1215634 1171356 1130907 1093945 1060352 1030223 1003083 978088 955020 934324 916041
60921 916041 899409 883669 868696 854615 841357 828897 817460 807142 797621 788572 780147 772813
60909 772813 766772 761789 757491 753690 750359 747403 744567 741688 738911 736388 733798 730541 726601 722760
60895 722760 719605 716766 713609 710274 707354 704825 702152 699439 697614 697291 698169 699811 702262 705521 709075
60880 709075 712450 715701 718844 721465 723570 726271 730699 736454 742133 747352 753315 761180 770776 781385
60866 781385 792950 805754 819384 832902 845976 859131 872814 886821 900987 915931 932623
60855 932623 951271 970993 990603 1009534 1027960 1046235 1064393 1082202 1099545 1116616 1133648
$$ packed form
60943A995491r7247q7540p9303p2007o6027o1825n8746n5761n2945n1048m9742
60932A263300m7666m4278m0449l6962l3593l0129k7140k4995k3068k0696j8283
60921I16041j6632j5740j4973j4081j3258j2460j1437j0318r521r049q425p334
60909G72813o041m983m298l801l331k956k836k879k777k523k590l257l940l841
60895G22760l155k839l157l335k920k529k673k713j825l23Q78J642K451L259L554
60880G09075L375L251L143K621K105K701M428N755N679N219N963P865R596J0609
60866G81385J1565J2804J3630J3518J3074J3155J3683J4007J4166J4944J6692
60855I32623J8648J9722J9610J8931J8426J8275J8158J7809J7343J7071J7032
$$ plain form
60844 1133648 1150463 1166456 1181007 1193787 1204526 1212701 1217752 1219603 1218629 1214982 1208290 1198292 1185556
60831 1185556 1171122 1155434 1138039 1118519 1097476 1076300 1056046 1036645 1017169 996756 975387
60820 975387 953947 933575 914833 897407 880548 863759 847093 830924 815566 801049 787199
60809 787199 773889 761168 749119 737680 726867 717171 709377 703686 699180 694522 689196 683795 679138
60796 679138 675434 672424 669933 667913 666046 663677 660199 655451 649765 643761 638023 632782 627866 623073
60782 623073 618490 614239 610028 605320 600067 594918 590429 586302 581733 576359 570520 564665 558970 553555
60768 553555 548642 544160 539576 534476 529186 524484 520795 518005 515987 514834 514425 514178 513516 512368 510987
60753 510987 509485 507802 505997 504289 502893 502088 502298 503649 505451 506554 506437 505663 505128 505125 505299 505148 504308
$$ packed form
60844A133648J6815J5993J4551J2780J0739Q175N051J851r74l647o692r998j2736
60831A185556j4434j5688j7395j9520k1043k1176k0254j9401j9476k0413k1369
60820I75387k1440k0372j8742j7426j6859j6789j6666j6169j5358j4517j3850
60809G87199j3310j2721j2049j1439j0813r696p794n691m506m658n326n401m657
60796F79138l704l010k491k020j867k369l478m748n686o004n738n241m916m793
60782F23073m583m251m211m708n253n149m489m127m569n374n839n855n695n415
60768E53555m913m482m584n100n290m702l689k790k018j153m09k47o62j148j381
60753E10987j502j683j805j708j396q05K10J351J802J103j17p74n35lJ74j51q40
$$ plain form
60736 504308 502608 500261 497826 495681 493682 491597 489621 488030 486591 484917 483242 482143 481444 480223
60722 480223 478143 475978 474351 472600 469647 465542 461378 457842 454638 451302 447876 444589 441403 438134
60708 438134 434725 431309 428269 426219 425457 425390 424921 423559 421797 420282 419033 417730 416382 415377 415083
60693 415083 415571 416560 417506 417977 418093 418365 418968 419518 419755 420093 421152 422999 425199 427457 429883 432738 436191
60676 436191 440287 444888 449672 454377 459047 463899 469010 474202 479112 483307 486506 488862 490906 493119
60662 493119 495644 498376 501078 503362 504959 506221 507967 510576 513497 515947 517794 519501 521473 523775
60648 523775 526120 527802 528056 526981 525723 525123 524441 522166 517900 512665 507391 501969 496041 489878 484062
60633 484062 478829 474205 470370 467419 465067 463030 461491 460821 460980 461511 462022 462342 462319 461773 460778 459783 459311
$$ packed form
60736E04308j700k347k435k145j999k085j976j591j439j674j675j099o99j221
60722D80223k080k165j627j751k953m105m164l536l204l336l426l287l186l269
60708D38134l409l416l040k050p62o7m69j362j762j515j249j303j348j005k94
60693D15083M88R89R46M71J16K72O03N50K37L38J059J847K200K258K426K855L453
60676D36191M096M601M784M705M670M852N111N192M910M195L199K356K044K213
60662D93119K525K732K702K284J597J262J746K609K921K450J847J707J972K302
60648E23775K345J682K54j075j258o00o82k275m266n235n274n422n928o163n816
60633D84062n233m624l835k951k352k037j539o70J59N31N11L20k3n46r95r95m72
$$ plain form
60616 459311 459446 459590 458869 456966 454546 452647 451655 451127 450572 450029 449755 449707 449625 449467 449462 449792 450355 450851 451033
60597 451033 450958 451021 451614 452753 454118 455404 456475 457305 458033 459041 460649 462690 464715 466600 468578 470592
60581 470592 472101 472758 472907 473157 473782 474807 476310 478274 480362 482296 484379 487328 491616 497211 503910
60566 503910 511671 520599 530757 542054 554259 567143 580538 594122 607195 618987 629214 638009
60554 638009 645216 650075 651875 650642 647049 641879 635766 629119 622104 614999 608762 604798 603721 604700
60540 604700 606471 608815 612630 618875 627950 639870 654320 670458 687193 703818 720124 735879
60528 735879 750544 763483 774083 781668 785686 786100 783400 778323 771845 765202 759294 753959 748329 742031
60514 742031 735649 729909 724895 720322 716167 712726 710312 709201 709596 711443 714442 718498 723957 731252
$$ packed form
60616D59311J35J44p21j903k420j899r92n28n55n43k74m8q2j58nL30N63M96J82
60597D51033p5O3N93J139J365J286J071Q30P28J008J608K041K025J885J978K014
60581D70592J509O57J49K50O25J025J503J964K088J934K083K949M288N595O699
60566E03910P761Q928J0158J1297J2205J2884J3395J3584J3073J1792J0227Q795
60554F38009P207M859J800j233l593n170o113o647p015p105o237l964j077R79
60540F04700J771K344L815O245R075J1920J4450J6138J6735J6625J6306J5755
60528G35879J4665J2939J0600P585M018M14k700n077o478o643n908n335n630o298
60514G42031o382n740n014m573m155l441k414j111L95J847K999M056N459P295
$$ plain form
60500 731252 740540 751851 765387 781533 800831 824151 852481 886170 924522 966473 1011497 1059518
60488 1059518 1110064 1161865 1213179 1262068 1306350 1343744 1372415 1391307 1399963 1398204 1386041 1363671
60476 1363671 1331468 1290250 1241711 1188370 1132743 1076546 1020775 966437 914882 867384 824628
60465 824628 786705 753364 724080 698001 674264 652511 632991 616074 601708 589391 578517
60454 578517 568693 559782 551809 544759 538437 532575 527114 522226 517961 514017 510065 506169 502613 499367
60440 499367 496033 492444 489007 486225 484019 481862 479570 477677 476846 477074 477788 478683 480082 482300 484891
60425 484891 486897 487796 487884 487717 487520 487224 486716 485842 484460 482776 481388 480776 480947 481880 483932 487336 491472
60408 491472 495172 497733 499186 499631 498981 497574 496392 496182 496622 496779 496247 495559 495617 497019 499756 503183
$$ packed form
60500G31252R288J1311J3536J6146J9298K3320K8330L3689L8352M1951M5024M8021
60488A059518N0546N1801N1314M8889M4282L7394K8671J8892Q656j759j2163k2370
60476A363671l2203m1218m8539n3341n5627n6197n5771n4338n1555m7498m2756
60465H24628l7923l3341k9284k6079k3737k1753j9520j6917j4366j2317j0874
60454E78517r824q911p973p050o322n862n461m888m265l944l952l896l556l246
60440D99367l334l589l437k782k206k157k292j893q31K28P14Q95J399K218K591
60425D84891K006Q99Q8j67j97k96n08q74j382j684j388o12J71R33K052L404M136
60408D91472L700K561J453M45o50j407j182k10M40J57n32o88N8J402K737L427
$$ plain form
60392 503183 506312 508521 510070 511730 513843 515963 517500 518519 519719 521702 524423 527349 530011 532322
60378 532322 534480 536705 539156 541952 545147 548605 551981 554857 556961 558326 559277 560162 561050 561794 562484
60363 562484 563641 565695 568372 570860 572706 574248 576059 578202 580264 581977 583530 585280 587435 590109
60349 590109 593473 597618 602334 607237 612194 617415 623056 628902 634698 640578 646743 652673 657146 659344
60335 659344 659597 658691 656699 652993 647346 640481 633434 626682 620111 613589 607337 601865 597641 594780 592929
60320 592929 591447 589754 587555 584979 582606 581149 580809 581036 581154 581171 581703 583269 585975 589800 594736 600632
60304 600632 607366 615342 625499 638679 655164 674732 696672 719649 742032 762613 780725 795572
60292 795572 805964 811053 810919 806083 796838 783459 766815 748274 729157 710527 693185 677376
$$ packed form
60392E03183L129K209J549J660K113K120J537J019J200J983K721K926K662K311
60378E32322K158K225K451K796L195L458L376K876K104J365R51Q85Q88P44O90
60363E62484J157K054K677K488J846J542J811K143K062J713J553J750K155K674
60349E90109L364M145M716M903M957N221N641N846N796N880O165N930M473K198
60335F59344K53r06j992l706n647o865p047o752o571o522o252n472m224k861j851
60320E92929j482j693k199k576k373j457l40K27J18J7N32J566K706L825M936N896
60304F00632O734P976J0157J3180J6485J9568K1940K2977K2383K0581J8112J4847
60292G95572J0392N089j34m836r245j3379j6644j8541j9117j8630j7342j5809
$$ plain form
60280 677376 662710 648807 635953 624696 614913 605798 596745 587828 579414 571741 564973 559253 554526
60267 554526 550579 547336 544871 543039 541454 539947 538767 538183 538096 538236 538516 538984 539545 539940 540015 539879 539810
60250 539810 539954 540105 539869 539179 538602 538883 540113 541509 542121 541672 540697 540019 540123 540874 541695 542050 541860 541487
60232 541487 541380 541770 542685 544124 546152 548840 552120 555783 559758 564371 570003 576459 583029 589359 595888
60217 595888 603002 610136 616338 621588 626865 632862 639341 645997 653217 661481 670448 679204 687165 694293
60203 694293 700722 706710 712755 719104 725115 729689 732454 734113 735441 736427 736583 735698 733878 731132 727375
60188 727375 722794 717849 712844 707698 702209 696411 690546 684779 679022 673099 667114 661597 657109 653666
60174 653666 650690 647666 644720 642423 641099 640522 640231 639929 639556 639104 638474 637488 636064 634439 633157 632678
$$ packed form
60280F77376j4666j3903j2854j1257r783r115r053q917q414p673o768n720m727
60267E54526l947l243k465j832j585j507j180n84q7J40K80M68N61L95P5j36o9
60250E39810J44J51k36o90n77K81J230J396O12m49r75o78J04P51Q21L55j90l73
60232E41487j07L90R15J439K028K688L280L663L975M613N632O456O570O330O529
60217E95888P114P134O202N250N277N997O479O656P220Q264Q967Q756P961P128
60203F94293O429N988O045O349O011M574K765J659J328R86J56q85j820k746l757
60188G27375m581m945n005n146n489n798n865n767n757n923n985n517m488l443
60174F53666k976l024k946k297j324n77k91l02l73m52o30r86j424j625j282m79
$$ plain form
60158 632678 632985 633652 634256 634670 635013 635523 636439 637801 639367 640972 643002 646272 651222 657391 663795 669697
60142 669697 674958 679951 685353 691859 699742 708621 717732 726401 734266 741284 747765 754256 761137 768276
60128 768276 775188 781404 786588 790448 792778 793568 793035 791668 790289 789637 789613 789239 787807 785838 784469 784036
60112 784036 783714 782467 779908 776299 772282 768571 765327 761771 757002 751281 745856 741382 737254 732874
60098 732874 728721 725449 722531 718768 714034 709697 707179 706655 707313 708393 709730 711572 714187 717607 721634
60083 721634 726044 730671 735232 739261 742408 744687 746258 747075 746894 745512 742765 738423 732350 724708 715882
60068 715882 706295 696370 686450 676566 666544 656575 647462 639919 633766 628213 622872 618109 614427 611908
60054 611908 610267 609125 608141 607223 606732 607259 609050 611834 615269 619347 624208 629728 635494 641145 646626
$$ packed form
60158F32678L07O67O04M14L43N10R16J362J566J605K030L270M950O169O404N902
60142F69697N261M993N402O506P883Q879R111Q669P865P018O481O491O881P139
60128G68276O912O216N184L860K330P90n33j367j379o52k4l74j432j969j369m33
60112G84036l22j247k559l609m017l711l244l556m769n721n425m474m128m380
60098G32874m153l272k918l763m734m337k518n24O58J080J337J842K615L420M027
60083G21634M410M627M561M029L147K279J571Q17j81j382k747m342o073p642q826
60068G15882r587r925r920r884j0022r969r113p543o153n553n341m763l682k519
60054F11908j641j142r84r18m91N27J791K784L435M078M861N520N766N651N481
$$ plain form
60039 646626 652045 657331 662048 665620 667696 668304 667749 666484 664943 663199 660744 656865 651299 644334 636296
60024 636296 627343 617757 607949 598009 587715 577282 567573 559218 551927 545166 539060 534117 530378 527447
60010 527447 525116 523403 522170 521263 520837 520973 521249 521373 522004 524096 527448 530739 533097 534845 536544 538169
59994 538169 539688 541733 545085 549773 555139 560586 566000 571597 577513 583403 588482 592288 595316 598398
59980 598398 601441 603359 603390 601927 599869 597708 595573 593676 592285 591509 591310 591479 591563 591245 590930 591490 593342
59963 593342 596284 600228 605316 611115 616558 621124 625365 629761 633790 636742 638774 640400 641521 641774
59949 641774 641387 640811 639796 637728 634690 631356 627934 624066 619713 615316 610983 606239 600779 594857 588836
59934 588836 582930 577554 573353 570593 568955 568045 567707 567714 567711 567751 568477 570441 573476 576916 580249 583450 586948
$$ packed form
60039F46626N419N286M717L572K076O08n55j265j541j744k455l879n566o965q038
60024F36296q953r586r808r940j0294j0433r709q355p291o761o106m943l739k931
60010E27447k331j713j233r07m26J36K76J24O31K092L352L291K358J748J699J625
59994E38169J519K045L352M688N366N447N414N597N916N890N079L806L028L082
59980E98398L043J918L1j463k058k161k135j897j391p76j99J69Q4l18l15N60J852
59963E93342K942L944N088N799N443M566M241M396M029K952K032J626J121K53
59949F41774l87n76j015k068l038l334l422l868m353m397m333m744n460n922o021
59934E88836n906n376m201k760j638r10l38PlM0P26J964L035L440L333L201L498
$$ plain form
59917 586948 591424 597357 604561 612280 619860 627196 634598 642474 651172 660813 671071 681256 690655 698691
59903 698691 704889 709043 711464 712736 713066 712073 709284 704742 699140 693519 688761 685117 682254 679937 678529
59888 678529 678471 679469 680731 682020 683954 687072 691086 695318 699537 704048 709183 714920 720881 726475 731202
59873 731202 734983 738037 740404 741753 741767 740507 738304 735514 732433 729178 725494 720926 715375 709317 703404
59858 703404 698016 693280 689206 685619 682182 678660 675033 671298 667440 663730 660771 659060 658752 659959
59844 659959 662823 667000 671529 675837 680724 687698 697262 708247 718943 728442 736767 744183 750826 756866
59830 756866 762574 768136 773483 778337 782292 784843 785487 783902 780036 774028 766051 756290 745032 732754
59816 732754 720133 707913 696652 686490 677233 668825 661685 656392 653008 650886 649226 647580 645764
$$ packed form
59917E86948M476N933P204P719P580P336P402P876Q698R641J0258J0185R399Q036
59903F98691O198M154K421J272L30r93k789m542n602n621m758l644k863k317j408
59888F78529n8R98J262J289J934L118M014M232M219M511N135N737N961N594M727
59873G31202L781L054K367J349J4j260k203k790l081l255l684m568n551o058n913
59858G03404n388m736m074l587l437l522l627l735l858l710k959j711l08J207
59844F59959K864M177M529M308M887O974R564J0985J0696R499Q325P416O643O040
59830G56866N708N562N347M854L955K551O44j585l866o008p977r761j1258j2278
59816G32754j2621j2220j1261j0162r257q408p140n293l384k122j660j646j816
$$ plain form
59803 645764 643559 640797 637578 634174 630805 627680 625003 622553 619431 614730 608519 601849 595712 590359
59789 590359 585607 581310 577283 573206 568981 564978 561633 558953 556632 554491 552565 550888 549474 548408
59775 548408 547755 547407 547214 547196 547496 548203 549360 551101 553624 556959 560818 564640 567931 570785 573947 578030
59759 578030 582701 587132 591375 596620 603686 611832 619744 627323 635621 645138 655083 664501 673291 681717
59745 681717 689587 696539 702680 708365 713546 717870 721248 723831 725510 725968 725269 723929 722390 720803 719415
59730 719415 718627 718435 718262 717670 716880 716211 715369 713876 712060 710944 711008 711572 711735 711535 711757 712773 713996
59713 713996 714535 714118 713234 712558 712419 712787 713583 714817 716405 718056 719518 720866 722411 724383 726843 729815
59697 729815 733190 736536 739399 741887 744599 747775 750878 753288 755040 756494 757566 757887 757610 757388 757418
$$ packed form
59803F45764k205k762l219l404l369l125k677k450l122m701o211o670o137n353
59789E90359m752m297m027m077m225m003l345k680k321k141j926j677j414j066
59775E48408o53l48j93j8L00P07J157J741K523L335L859L822L291K854L162M083
59759E78030M671M431M243N245P066Q146P912P579Q298R517R945R418Q790Q426
59745F81717P870O952O141N685N181M324L378K583J679M58o99j340j539j587j388
59730G19415p88j92j73n92p90o69q42j493j816j116O4N64J63k00K22J016J223
59713G13996N39m17q84o76j39L68P96J234J588J651J462J348J545J972K460K972
59697G29815L375L346K863K488K712L176L103K410J752J454J072L21k77k22L0
$$ plain form
59682 757418 757015 755456 752893 750096 747468 744653 741053 736434 730891 724452 717078 709156 701780 696041
59668 696041 691939 688320 684102 679285 674570 670379 666786 664055 662581 662280 662665 663574 665206 667305 668984
59653 668984 669751 670228 671474 673895 677117 680441 682975 683771 682479 679808 676852 674001 670817 666840 662119
59638 662119 656994 651822 646958 642694 639100 636052 633438 631261 629634 628762 628665 628770 628098 626162 623371
59623 623371 620261 616773 612872 609376 607220 605952 603989 600645 597062 594681 593502 592520 591294 590277
59609 590277 589843 589808 589992 590638 591983 593808 595653 597334 599019 600862 602637 603780 603824 602778 601039 599007
59593 599007 596962 595185 593850 592749 591567 590622 590768 592215 593854 594327 593490 592205 590961 589458 587474
59578 587474 585278 582982 580288 577288 574785 573228 571851 569612 566686 564298 563160 562760 562255 561405 560398
$$ packed form
59682G57418m03j559k563k797k628k815l600m619n543o439p374p922p376n739
59668F96041m102l619m218m817m715m191l593k731j474l01L85R09J632K099J679
59653F68984P67M77J246K421L222L324K534P96j292k671k956k851l184l977m721
59638F62119n125n172m864m264l594l048k614k177j627q72r7J05o72j936k791
59623F23371l110l488l901l496k156j268j963l344l583k381j179r82j226j017
59609E90277m34l5J84O46J345J825J845J681J685J843J775J143M4j046j739k032
59593E99007k045j777j335j101j182r45J46J447J639M73q37j285j244j503j984
59578E87474k196k296k694l000k503j557j377k239k926k388j138m00n05q50j007
$$ plain form
59563 560398 559305 558173 557343 557239 557795 558354 558238 557355 556234 555482 555251 555368 555911 557434 560411 564631 569329
59546 569329 573757 577468 580319 582715 585779 590735 597968 607027 617645 630265 645279 662063 679117
59533 679117 694982 708799 720208 729072 735316 738890 739991 739444 738671 738962 740719 743417 746147 748090
59519 748090 748832 748588 748085 747882 747574 745799 741150 733277 723212 712564 702201 691698 680282 668159
59505 668159 656514 646234 637161 628807 621180 614529 608772 603766 599799 597166 595447 593853 592247 591247
59491 591247 591293 592130 593296 594569 595823 596943 598121 599923 602799 606706 611289 616197 621199 626274 631629
59476 631629 637446 643576 649722 655836 661993 667985 673431 678208 682373 685738 688094 689847 691815 694267
59462 694267 696762 699112 701892 705725 710717 716943 724857 734610 745427 756306 767085 778252 789933
$$ packed form
59563E60398j093j132q30j04N56N59j16q83j121p52k31J17N43J523K977M220M698
59546E69329M428L711K851K396L064M956P233R059J0618J2620J5014J6784J7054
59533F79117J5865J3817J1409Q864O244L574J101n47p73K91J757K698K730J943
59519G48090P42k44n03k03l08j775m649p873j0065j0648j0363j0503j1416j2123
59505F68159j1645j0280r073q354p627o651n757n006l967k633j719j594j606j000
59491E91247M6Q37J166J273J254J120J178J802K876L907M583M908N002N075N355
59476F31629N817O130O146O114O157N992N446M777M165L365K356J753J968K452
59462F94267K495K350K780L833M992O226P914R753J0817J0879J0779J1167J1681
$$ plain form
59449 789933 801594 812647 822742 831448 838006 841577 841614 838140 831845 823707 814227 803192 790425
59436 790425 776558 762740 749812 738101 727802 719111 712054 706601 702902 701080 700867 701870 704176
59423 704176 708317 714597 722759 732401 743486 756390 771582 789129 808353 828183 848168 868816
59411 868816 890326 911052 927898 938501 942627 941321 935333 924885 910635 894273 878150 864573
59399 864573 855238 850662 849741 850040 848993 845117 838217 828592 816267 801099 783372 763993 744154
59386 744154 725066 707970 693902 683133 675085 669014 664604 661766 660229 659757 660491 662577 665557 668597
59372 668597 671372 674316 677937 682214 686807 691525 696469 701971 708459 716147 724721 733579 742555 752212
59358 752212 763289 776015 790091 805231 821507 839149 858084 877786 897705 917890 938988
$$ packed form
59449G89933J1661J1053J0095Q706O558L571L7l474o295q138r480j1035j2767
59436G90425j3867j3818j2928j1711j0299q691p057n453l699j822k13J003K306
59423G04176M141O280Q162R642J1085J2904J5192J7547J9224J9830J9985K0648
59411H68816K1510K0726J6846J0603M126j306n988j0448j4250j6362j6123j3577
59399H64573r335m576r21K99j047l876o900r625j2325j5168j7727j9379j9839
59386G44154j9088j7096j4068j0769q048o071m410k838j537m72P34K086K980L040
59372F68597K775K944L621M277M593M718M944N502O488P688Q574Q858Q976R657
59358G52212J1077J2726J4076J5140J6276J7642J8935J9702J9919K0185K1098
$$ plain form
59347 938988 961439 984829 1008287 1031277 1053630 1074865 1093970 1109977 1122389 1130962 1135439 1135711
59335 1135711 1131953 1124446 1113559 1099973 1084492 1067356 1048118 1026583 1003591 980459 957882 935835
59323 935835 914408 894172 875706 859250 844944 832932 822975 814334 806411 799239 793105 787912 783364
59310 783364 779642 777396 776906 777583 778452 778957 779188 779584 780620 782548 785198 788140 791169 794515 798443 802897
59294 802897 807810 813580 820851 829947 840865 853670 868340 884144 899610 913258 924099 931425
59282 931425 934727 934061 930057 923323 914293 903936 894023 886185 881019 878598 879385 883891 891630 901161
59268 901161 911155 920815 929357 935932 940303 942938 944011 942763 938277 930538 920310 908290 894789
59255 894789 880085 864589 848669 832636 817026 802636 790159 779846 771559 765100 760427 757556
$$ packed form
59347I38988K2451K3390K3458K2990K2353K1235J9105J6007J2412Q573M477K72
59335A135711l758p507j0887j3586j5481j7136j9238k1535k2992k3132k2577k2047
59323I35835k1427k0236j8466j6456j4306j2012r957q641p923p172o134n193m548
59310G83364l722k246m90O77Q69N05K31L96J036J928K650K942L029L346L928M454
59294H02897M913N770P271R096J0918J2805J4670J5804J5466J3648J0841P326
59282I31425L302o66m004o734r030j0357r913p838n166k421P87M506P739R531
59268I01161R994R660Q542O575M371K635J073j248m486p739j0228j2020j3501
59255H94789j4704j5496j5920j6033j5610j4390j2477j0313q287o459m673k871
$$ plain form
59243 757556 756271 756025 756243 756813 758212 761093 765728 771812 778733 785968 793244 800347 806821 811943 815018
59228 815018 815646 813733 809373 802838 794580 785179 775258 765385 755816 746362 736737 727175 718483 711340
59214 711340 705757 701396 698170 696275 695780 696452 697927 699884 702144 704732 707682 710740 713572 716374 719840
59199 719840 724211 728781 732745 736152 739472 742668 745371 747747 750353 753165 755575 757519 759863 763369
59185 763369 767772 772160 775790 778323 779784 780710 781920 783814 786148 788701 791802 795905 800966 806585
59171 806585 812514 818756 825435 832879 841564 851607 862442 873262 883659 893585 902895 911252 918379
59158 918379 924004 927637 928703 927055 923153 917648 910891 902945 893946 884234 874030 863218 851741
59145 851741 840210 829721 820820 812995 805427 797937 790763 783748 776398 768699 761222 754348 747936 741935
$$ packed form
59243G57556j285k46K18N70J399K881M635O084O921P235P276P103O474N122L075
59228H15018O28j913m360o535q258r401r921r873r569r454r625r562q692p143
59214G11340n583m361l226j895m95O72J475J957K260K588K950L058K832K802L466
59199G19840M371M570L964L407L320L196K703K376K606K812K410J944K344L506
59185G63369M403M388L630K533J461R26J210J894K334K553L101M103N061N619
59171H06585N929O242O679P444Q685J0043J0835J0820J0397R926R310Q357P127
59158I18379N625L633J066j648l902n505o757p946q999r712j0204j0812j1477
59145H51741j1531j0489q901p825p568p490p174p015p350p699p477o874o412o001
$$ plain form
59131 741935 736761 732798 729876 727523 725491 723881 723021 723265 724629 726613 728827 731789 736593 743607 751978
59116 751978 760631 769283 778213 787544 797117 806732 816167 825192 833767 841944 849498 856041 861644 866790
59102 866790 871520 875221 877567 879041 880040 880060 878397 875291 871746 868517 865783 863507 861526 859494 857221
59087 857221 854925 852722 850186 846864 842813 838114 832251 824739 816097 807357 798723 789501 779370 768922
59073 768922 758841 749301 740420 732570 725864 719842 714093 708774 704189 700168 696264 692360 688719 685551
59059 685551 682826 680446 678357 676472 674644 672818 671151 669890 669041 668243 667144 665879 664964 664699 664954
59044 664954 665597 666682 668080 669328 670187 670942 671799 672358 672180 671624 671627 672864 675553 679768 685299 691447 697630
59027 697630 704201 712104 721800 733085 745807 759980 775113 790145 804301 817448 829417 839530
$$ packed form
59131G41935n174l963k922k353k032j610q60K44J364J984K214K962M804P014Q371
59116G51978Q653Q652Q930R331R573R615R435R025Q575Q177P554O543N603N146
59102H66790M730L701K346J474R99K0j663l106l545l229k734k276j981k032k273
59087H57221k296k203k536l322m051m699n863p512q642q740q634r222j0131j0448
59073G68922j0081r540q881p850o706o022n749n319m585m021l904l904l641l168
59059F85551k725k380k089j885j828j826j667j261q49p98j099j265r15k65K55
59044F64954O43J085J398J248Q59P55Q57N59j78n56LJ237K689M215N531O148O183
59027F97630O571P903R696J1285J2722J4173J5133J5032J4156J3147J1969J0113
$$ plain form
59015 839530 846985 851271 852116 849658 844940 839611 834755 830398 826389 823182 821440 821376 822930 826178 831112
59000 831112 837369 844564 852543 860942 868923 875862 881977 887775 893123 897420 900445 902382 903175 902538 900683
58985 900683 898466 896569 894932 893167 891174 889239 887872 887775 889615 893570 899199 906010 914034 923687 935141
58970 935141 948011 961594 975343 989126 1003124 1017470 1031973 1046120 1059246 1070649 1079718 1086173
58958 1086173 1090187 1092003 1091434 1087946 1081281 1071669 1059302 1044003 1025776 1005468 984401 963402 942662
58945 942662 922545 903979 887743 873751 861400 850359 840684 832438 825659 820531 817100 814804 812800
58932 812800 810797 809199 808382 808229 808429 808729 808713 807829 805954 803563 801061 798275 794907 791146 787463 784102
58916 784102 781210 779163 778358 778801 780361 783217 787665 793577 800540 808417 817292 826971 837062 847605
$$ packed form
59015H39530P455M286Q45k458m718n329m856m357m009l207j742o4J554L248M934
59000H31112O257P195P979Q399P981O939O115N798N348M297L025J937P93o37j855
58985I00683k217j897j637j765j993j935j367r7J840L955N629O811Q024R653J1454
58970I35141J2870J3583J3749J3783J3998J4346J4503J4147J3126J1403R069O455
58958A086173M014J816n69l488o665r612j2367j5299j8227k0308k1067k0999k0740
58945I42662k0117j8566j6236j3992j2351j1041r675q246o779n128l431k296k004
58932H12800k003j598q17j53K00L00j6q84j875k391k502k786l368l761l683l361
58916G84102k892k047q05M43J560K856M448N912O963P877Q875R679J0091J0543
$$ plain form
58902 847605 859101 871812 885464 899829 915124 931599 948953 966446 983417 999646 1015521
58891 1015521 1032004 1050208 1070693 1093122 1116609 1140269 1163473 1185822 1206955 1226248 1242690
58880 1242690 1255278 1263572 1267662 1267620 1263269 1254635 1242326 1227266 1210181 1191498 1171623 1151144 1130714
58867 1130714 1110778 1091457 1072765 1054989 1038592 1023523 1008898 993809 978393 963638 950056
58856 950056 937084 924037 911157 899276 888766 879386 871023 863928 857981 852214 845411 837070 827523
58843 827523 817281 806637 795893 785550 775974 766970 757907 748211 737729 726840 716481 707842
58831 707842 701583 697278 693957 691191 689310 688518 688375 688499 689365 691905 696425 702274 708512 714604 720515
58816 720515 726384 732212 737780 742900 747660 752148 755952 758319 759044 758782 758206 757249 755539 753220 750761
$$ packed form
58902H47605J1496J2711J3652J4365J5295J6475J7354J7493J6971J6229J5875
58891A015521J6483J8204K0485K2429K3487K3660K3204K2349K1133J9293J6442
58880A242690J2588Q294M090m2m351q634j2309j5060j7085j8683j9875k0479k0430
58867A130714j9936j9321j8692j7776j6397j5069j4625j5089j5416j4755j3582
58856I50056j2972j3047j2880j1881j0510r380q363p095n947n767o803q341r547
58843H27523j0242j0644j0744j0343r576r004r063r696j0482j0889j0359q639
58831G07842o259m305l321k766j881p92j43J24Q66K540M520N849O238O092N911
58816G20515N869N828N568N120M760M488L804K367P25k62n76r57j710k319k459
$$ plain form
58801 750761 748110 744659 740107 734874 729556 724293 718814 712912 706804 701124 696501 693056 690415 688273
58787 688273 686706 685873 685795 686678 688966 692707 697197 701724 706347 711474 716987 722349 727315 731886 735696
58772 735696 738046 738479 736751 732463 725457 716623 707603 699477 692197 685376 679078 673772 669944 667901
58758 667901 667494 667962 668460 668839 669532 670675 671770 672237 671921 671068 670246 670236 671509 673798 676600 679993 684386
58741 684386 689621 695097 700849 707719 716138 725268 733712 740705 746423 751524 756580 761751 766965 772510
58727 772510 779033 786456 793273 797787 799935 801147 802501 804022 805751 808307 811933 815891 819367 822370
58713 822370 825362 828597 832073 835440 837636 837412 834583 830128 824733 818019 809514 799476 788236 775599
58699 775599 761602 747087 732751 718301 703328 688413 674522 661815 649939 639091 629849 622159
$$ packed form
58801G50761k651l451m552n233n318n263n479n902o108n680m623l445k641k142
58787F88273j567q33p8Q83K288L741M490M527M623N127N513N362M966M571L810
58772G35696K350M33j728m288p006q834r020q126p280o821o298n306l828k043
58758F67901m07M68M98L79O93J143J095M67l16q53q22j0J273K289K802L393M393
58741F84386N235N476N752O870Q419R130Q444O993N718N101N056N171N214N545
58727G72510O523P423O817M514K148J212J354J521J729K556L626L958L476L003
58713H22370K992L235L476L367K196k24k829m455n395o714q505j0038j1240j2637
58699G75599j3997j4515j4336j4450j4973j4915j3891j2707j1876j0848r242p690
$$ plain form
58687 622159 615369 609169 603736 599015 594586 590301 586419 583045 579915 576872 574165 572140 570886 570239
58673 570239 570022 570325 571617 574465 579074 585255 592807 601622 611485 622180 633773 646242 658775 669992
58659 669992 678928 685189 688264 687665 684023 678934 673176 665948 656513 645749 635337 626111 618046 611135
58645 611135 605384 600454 596228 593357 592398 592776 593443 594202 595579 597733 600381 603522 607304 611248 614414
58630 614414 616294 616978 616693 615828 615119 615036 615219 615228 615617 617433 620856 625211 630220 636314 643659 651738 660071
58613 660071 668664 677556 686513 695283 703654 711235 717657 723015 727624 731367 733758 734607 734146 732575 730039
58598 730039 727003 724104 721600 719377 717465 716119 715477 715541 716427 718312 721324 725792 732268 740871 750997
58583 750997 762141 774517 788284 802542 815863 827466 837254 845192 851558 857408 863795 870744 877853
$$ packed form
58687F22159o790o200n433m721m429m285l882l374l130l043k707k025j254o47
58673E70239k17L03J292K848M609O181P552Q815R863J0695J1593J2469J2533J1217
58659F69992Q936O261L075n99l642n089n758p228r435j0764j0412r226q065o911
58645F11135n751m930m226k871r59L78O67P59J377K154K648L141L782L944L166
58630F14414J880O84k85q65p09q3J83RL89J816L423M355N009O094P345Q079Q333
58613F60071Q593Q892Q957Q770Q371P581O422N358M609L743K391Q49m61j571k536
58598G30039l036k899k504k223j912j346o42O4Q86J885L012M468O476Q603J0126
58583G50997J1144J2376J3767J4258J3321J1603R788P938O366N850O387O949P109
$$ plain form
58570 877853 885617 895087 906477 919249 933460 949840 968543 989087 1011599 1036753 1063969 1090889
58558 1090889 1115257 1136410 1154414 1168745 1178678 1184287 1186240 1185003 1180898 1174596 1166997 1158814 1150543
58545 1150543 1142470 1134365 1125514 1115424 1104173 1091790 1077644 1060840 1041085 1018936 995441 971707
58533 971707 948599 926615 906027 887131 870263 855688 843623 834164 826961 821283 816696 813377
58521 813377 811386 810158 809306 809384 811004 813525 815625 816941 818107 819298 819863 819525 818798 817910 816432 814417
58505 814417 812892 812500 812449 811489 809395 806843 804295 801672 798872 796088 793691 792052 791314 791193 791285 791649
58489 791649 792794 795035 798316 802714 808614 816182 825128 835179 846503 859530 874620 891819 910472
58476 910472 929059 945928 960185 971494 979206 982387 980722 974813 965566 953950 941281 928953
$$ packed form
58570H77853P764R470J1390J2772J4211J6380J8703K0544K2512K5154K7216K6920
58558A090889K4368K1153J8004J4331R933N609J953j237m105o302p599q183q271
58545A150543q073q105q851j0090j1251j2383j4146j6804j9755k2149k3495k3734
58533I71707k3108k1984k0588j8896j6868j4575j2065r459p203n678m587l319
58521H13377j991j228q52P8J620K521K100J316J166J191N65l38p27q88j478k015
58505H14417j525l92n1r60k094k552k548k623k800k784k397j639p38j21R2L64
58489G91649J145K241L281M398N900P568Q946J0051J1324J3027J5090J7199J8653
58476I10472J8587J6869J4257J1309P712L181j665n909r247j1616j2669j2328
$$ plain form
58464 928953 917737 907989 900513 896344 895538 897097 900399 905895 914059 924443 936223 948949 962214
58451 962214 975136 986700 996260 1003324 1007249 1007461 1003716 996068 985058 972067 958882 946570 935170
58438 935170 924574 915178 907551 902115 899291 899321 901646 905159 909462 915401 924010 935377 948780 963386
58424 963386 978424 993102 1006818 1019276 1030191 1039118 1045616 1049394 1050332 1048665 1045024 1039921 1033387
58411 1033387 1025523 1017049 1008671 1000265 991477 982801 975117 968331 961536 954487 947952 942566 938321 935234
58397 935234 933499 932886 932951 933880 936135 939282 942322 945178 948591 952468 955757 958259 961104 964940 969061
58382 969061 972933 977252 982680 988752 994903 1001550 1009243 1017620 1026033 1034434 1042903 1051096 1058893 1066851
58368 1066851 1075411 1084417 1094020 1105194 1118598 1133689 1149626 1166294 1183661 1200810 1216436 1229926
$$ packed form
58464I28953j1216r748p476m169q06J559L302N496Q164J0384J1780J2726J3265
58451I62214J2922J1564R560P064L925K12l745p648j1010j2991j3185j2312j1400
58438I35170j0596r396p627n436k824L0K325L513M303N939Q609J1367J3403J4606
58424I63386J5038J4678J3716J2458J0915Q927O498L778R38j667l641n103o534
58411A033387p864q474q378q406q788q676p684o786o795p049o535n386m245l087
58397I35234j735o13O5R29K255L147L040K856L413L877L289K502K845L836M121
58382I69061L872M319N428O072O151O647P693Q377Q413Q401Q469Q193P797P958
58368A066851Q560R006R603J1174J3404J5091J5937J6668J7367J7149J5626J3490
$$ plain form
58356 1229926 1241483 1251665 1261075 1269804 1276868 1280973 1282192 1282124 1282153 1282499 1283227 1284962 1288078 1292322 1297842
58341 1297842 1305593 1316086 1328728 1342998 1359175 1377304 1396545 1416236 1436488 1457054 1476786
58330 1476786 1495050 1512519 1529623 1545235 1557972 1567942 1576249 1583501 1589699 1594851 1598944 1601974 1604628
58317 1604628 1608151 1613044 1618828 1625602 1634620 1646573 1660420 1674807 1689636 1705401 1722024 1739201
58305 1739201 1757065 1775764 1795175 1815566 1837431 1860148 1882043 1902418 1922414 1943282 1965112
58294 1965112 1987783 2011606 2036307 2060882 2085328 2110977 2138261 2165694 2191985 2217634 2243561
58283 2243561 2269757 2296169 2323171 2350197 2375675 2399387 2423102 2447946 2473207 2498894 2527199
58272 2527199 2559965 2596817 2637417 2683391 2736234 2795268 2859373 2928684 3002728 3079089 3156098
$$ packed form
58356A229926J1557J0182R410Q729P064M105J219o8K9L46P28J735L116M244N520
58341A297842P751J0493J2642J4270J6177J8129J9241J9691K0252K0566J9732
58330A476786J8264J7469J7104J5612J2737R970Q307P252O198N152M093L030K654
58317A604628L523M893N784O774R018J1953J3847J4387J4829J5765J6623J7177
58305A739201J7864J8699J9411K0391K1865K2717K1895K0375J9996K0868K1830
58294A965112K2671K3823K4701K4575K4446K5649K7284K7433K6291K5649K5927
58283B243561K6196K6412K7002K7026K5478K3712K3715K4844K5261K5687K8305
58272B527199L2766L6852M0600M5974N2843N9034O4105O9311P4044P6361P7009
$$ plain form
58261 3156098 3234945 3316960 3400571 3483123 3563958 3643669 3722108 3799408 3877326 3957449 4039513
58250 4039513 4123281 4210296 4301989 4398136 4498970 4606523 4721853 4843310 4969691 5102649
58240 5102649 5243840 5392418 5547704 5711499 5885226 6067749 6258730 6461019 6676922
58231 6676922 6905395 7146092 7402716 7678958 7974519 8288755 8624634 8985364 9370895
58222 9370895 9781896 10223387 10700334 11213743 11765583 12363219 13014471 13723313 14495832
58213 14495832 15345548 16287613 17333615 18498361 19805949 21283081 22954107 24851550
58205 24851550 27026068 29540342 32464058 35886053 39922117 44698333 50334806 56957768
58197 56957768 64721040 73813563 84474041 97022235 111859673 129427158 150192528
$$ packed form
58261C156098P8847Q2015Q3611Q2552Q0835P9711P8439P7300P7918Q0123Q2064
58250D039513Q3768Q7015R1693R6147J00834J07553J15330J21457J26381J32958
58240E102649J41191J48578J55286J63795J73727J82523J90981K02289K15903
58231F676922K28473K40697K56624K76242K95561L14236L35879L60730L85531
58222I370895M11001M41491M76947N13409N51840N97636O51252P08842P72519
58213A4495832Q49716R42065J046002J164746J307588J477132J671026J897443
58205B4851550K174518K514274K923716L421995M036064M776216N636473O622962
58197E6957768P763272R092523J0660478J2548194J4837438J7567485K0765370
$$ plain form
58190 150192528 174652726 203117962 235132168 268895899 301367464 329219848 349960231
58183 349960231 362345642 366007249 360969597 347634210 327088932 301231596 272470168
58176 272470168 243195279 215345756 190229918 168565644 150593578 136143110 124669000
58169 124669000 115375742 107458901 100318391 93590823 87037327 80458408 73723259 66839771
58161 66839771 59961022 53316388 47124359 41534233 36609005 32340898 28679711 25554680
58153 25554680 22887034 20601438 18635702 16940915 15474872 14199870 13085538 12108224
58145 12108224 11246684 10481360 9796831 9180929 8621878 8109595 7638732 7206596 6808777
58136 6808777 6440218 6099399 5787399 5503312 5244068 5008006 4794721 4601542 4423553
$$ packed form
58190A50192528K4460198K8465236L2014206L3763731L2471565K7852384K0740383
58183C49960231J2385411L661607n037652j3335387k0545278k5857336k8761428
58176B72470168k9274889k7849523k5115838k1664274j7972066j4450468j1474110
58169A24669000r293258p916841p140510o727568o553496o578919o735149o883488
58161F6839771o878749o644634o192029n590126m925228m268107l661187l125031
58153B5554680k667646k285596j965736j694787j466043j275002j114332r77314
58145A2108224q61540p65324o84529o15902n59051n12283m70863m32136l97819
58136F808777l68559l40819l12000k84087k59244k36062k13285j93179j77989
$$ plain form
58127 4423553 4257125 4100620 3952014 3808870 3670489 3537411 3409020 3284098 3163205
58118 3163205 3047985 2938692 2834815 2737451 2648327 2566921 2491111 2420238 2355122 2295570 2240434
58107 2240434 2189643 2143705 2101551 2061342 2023032 1987653 1954192 1919607 1881917 1841247 1798111
58096 1798111 1752889 1706849 1661440 1616480 1570927 1525326 1481611 1440655 1401946 1365531 1332326
58085 1332326 1302463 1275090 1249824 1226743 1205011 1183167 1160765 1138343 1115990 1093475 1071528
58074 1071528 1051314 1032712 1014543 996350 978608 961502 944929 929399 915529 902962 891093
58063 891093 880334 871248 863024 854438 845820 838417 832265 826341 820259 814090 806962 797901 787846 778940
58049 778940 771853 765450 758942 752525 745995 738649 730798 723744 717981 712777 707550 702324 696907 691064
$$ packed form
58127D423553j66428j56505j48606j43144j38381j33078j28391j24922j20893
58118C163205j15220j09293j03877r7364q9124q1406p5810p0873o5116n9552n5136
58107B240434n0791m5938m2154m0209l8310l5379l3461l4585l7690m0670m3136
58096A798111m5222m6040m5409m4960m5553m5601m3715m0956l8709l6415l3205
58085A332326k9863k7373k5266k3081k1732k1844k2402k2422k2353k2515k1947
58074A071528k0214j8602j8169j8193j7742j7106j6573j5530j3870j2567j1869
58063H91093j0759r086q224q586q618p403o152n924o082o169p128r061j0055q906
58049G78940p087o403o508o417o530p346p851p054n763n204n227n226n417n843
$$ plain form
58035 691064 685287 679972 674104 666416 657588 649520 642509 635136 626967 619367 613200 607611 601664 595596
58021 595596 589860 584363 579178 574680 570488 565598 560023 555023 551218 547747 543857 540168 537714 536675
58007 536675 536528 536623 536297 535266 534174 533955 534566 535266 536065 537758 540468 543297 545651 547807 550075 552473
57991 552473 555329 559028 563010 566159 568307 570128 571505 571414 569685 567465 565519 563381 560655 557803 555079
57976 555079 551924 548151 544666 542242 540533 538947 537593 536711 535931 534813 533515 532367 531361 530501 530080
57961 530080 530241 530768 531546 532655 533875 534766 535369 536192 537411 538780 540255 541931 543502 544851 547030 551401
57945 551401 557669 564090 569857 575926 583116 590857 598571 606962 616948 628207 639736 651125 662475
57932 662475 673655 684349 694339 703106 709718 713626 715172 714926 713026 709480 704462 697938 689631 679777
$$ packed form
58035F91064n777n315n868p688q828q068p011p373q169p600o167n589n947o068
58021E95596n736n497n185m498m192m890n575n000l805l471l890l689k454j039
58007E36675j47R5l26j031j092k19O11P00P99J693K710K829K354K156K268K398
57991E52473K856L699L982L149K148J821J377r1j729k220j946k138k726k852k724
57976E55079l155l773l485k424j709j586j354q82p80j118j298j148j006q60m21
57961E30080J61N27P78J109J220Q91O03Q23J219J369J475J676J571J349K179M371
57945E51401O268O421N767O069P190P741P714Q391R986J1259J1529J1389J1350
57932F62475J1180J0694R990Q767O612L908J546k46j900l546n018o524q307r854
$$ plain form
57918 679777 669275 658739 647992 636785 625423 614364 603900 594492 586736 580645 575603 571272
57906 571272 567822 565109 562521 559938 557906 556481 554891 552830 551105 550327 549856 548865 547720 547473 548520
57891 548520 550504 553122 556351 560136 564336 568660 572430 574868 575931 576337 576597 576596 576234 575547 573940 570367
57875 570367 564832 558751 553113 547266 540340 532986 526662 521774 517603 513692 510332 507908 506520 506119
57861 506119 506397 506762 506982 507625 509435 512571 516876 522382 528959 535911 542539 548812 554971 560907 566474
57846 566474 571964 577499 582316 585354 586399 586069 584943 583382 581909 580952 580159 578657 576124 573184 570701
57831 570701 569070 568241 568063 568460 569426 570934 572817 574886 577165 579871 583159 587147 592094 598037 604195
57816 604195 609281 612658 614772 616247 617051 616852 615704 613979 611953 609737 607378 604827 602087 599395 596854
$$ packed form
57918F79777j0502j0536j0747j1207j1362j1059j0464r408p756o091n042m331
57906E71272l450k713k588k583k032j425j590k061j725p78m71r91j145k47J047
57891E48520J984K618L229L785M200M324L770K438J063M06K60jl62o87j607l573
57875E70367n535o081n638n847o926p354o324m888m171l911l360k424j388m01
57861E06119K78L65K20O43J810L136M305N506O577O952O628O273O159N936N567
57846E66474N490N535M817L038J045l30j126j561j473r57p93j502k533k940k483
57831E70701j631q29j78L97R66J508J883K069K279K706L288L988M947N943O158
57816F04195N086L377K114J475Q04j99j148j725k026k216k359k551k740k692k541
$$ plain form
57801 596854 593891 589672 584107 577873 571463 564975 558891 554010 550281 546677 542745 539391 537484 536573
57787 536573 535795 535330 536076 538366 541828 546146 551281 557296 564531 573497 584031 595029 605584 615848
57773 615848 626128 635780 643908 650723 657257 663859 669737 673868 675732 675349 673257 670308 666941 662826
57759 662826 657646 651838 645967 639759 632579 624680 617246 611211 606591 602931 599903 597486 595951 595545
57745 595545 595920 596106 595460 594333 593542 593517 594248 595529 596790 597269 596982 597024 598309 600464 602618 604739 607357
57728 607357 610366 613001 614849 616150 617245 618351 619656 621048 622000 622320 622664 623733 625371 627107 629075
57713 629075 631533 633931 635464 636223 636879 637470 637482 636863 635986 634812 633147 631536 630763 630584 630092 629375 629588
57696 629588 631285 633831 636709 640156 644071 647428 649449 650550 651510 652401 652894 653053 653283 653966 655547 658587
$$ packed form
57801E96854k963m219n565o234o410o488o084m881l729l604l932l354j907r11
57787E36573p78m65P46K290L462M318N135O015P235Q966J0534J0998J0555J0264
57773F15848J0280R652Q128O815O534O602N878M131J864l83k092k949l367m115
57759F62826n180n808n871o208p180p899p434o035m620l660l028k417j535m06
57745E95545L75J86o46j127p91k5P31J281J261M79k87M2J285K155K154K121K618
57728F07357L009K635J848J301J095J106J305J392R52L20L44J069J638J736J968
57713F29075K458K398J533P59O56N91J2o19q77j174j665j611p73j79m92p17K13
57696F29588J697K546K878L447L915L357K021J101R60Q91M93J59K30O83J581L040
$$ plain form
57680 658587 663406 670113 679157 691264 706570 724412 744353 766956 793368 824766 862466 907802
57668 907802 961126 1021007 1084393 1147052 1203812 1249466 1280379 1295178 1293717 1276099 1243368 1198750
57656 1198750 1147362 1094465 1044010 998283 958157 923514 893793 868471 847242 829943 816415
57645 816415 806259 798673 792741 787957 784384 782297 781762 782441 783634 784708 785700 787208 789426 791723 793665
57630 793665 795959 799557 804104 808266 811500 814473 817604 820270 821846 822674 823509 824701 826329 828438 830630
57615 830630 832070 832486 832712 833787 836007 839192 843214 847717 851904 855364 858730 862855 867623 872160 875912
57600 875912 878955 881524 883824 886123 888474 890513 892009 893428 895436 898054 900817 903587 906568 909619
57586 909619 912220 914235 916216 918855 922454 926962 932061 937099 941358 944643 947429 950343 953652 957231
$$ packed form
57680F58587M819O707R044J2107J5306J7842J9941K2603K6412L1398L7700M5336
57668I07802N3324N9881O3386O2659N6760M5654L0913J4799j461j7618l2731m4618
57656A198750n1388n2897n0455m5727m0126l4643k9721k5322k1229j7299j3528
57645H16415j0156p586n932m784l573k087n35O79J193J074R92J508K218K297J942
57630G93665K294L598M547M162L234K973L131K666J576Q28Q35J192J628K109K192
57615H30630J440M16K26J075K220L185M022M503M187L460L366M125M768M537L752
57600H75912L043K569K300K299K351K039J496J419K008K618K763K770K981L051
57586I09619K601K015J981K639L599M508N099N038M259L285K786K914L309L579
$$ plain form
57572 957231 960735 963762 966105 968040 970280 973502 977903 983067 988211 992648 996252 999541 1003288 1008064
57558 1008064 1014030 1020908 1028036 1034800 1041207 1047864 1055159 1062762 1070230 1077850 1086354 1095866 1105589 1114684
57544 1114684 1123033 1130990 1138703 1146053 1153083 1160096 1167192 1173958 1179884 1185066 1190258 1196152 1202868 1210289
57530 1210289 1218649 1228303 1238986 1249772 1259947 1269574 1279019 1288287 1297178 1305821 1314635 1323801 1333120
57517 1333120 1342393 1351719 1361361 1371445 1381783 1391930 1401516 1410601 1419589 1428689 1437662 1446269 1454788
57504 1454788 1463778 1473420 1483391 1493314 1503034 1512459 1521479 1530126 1538539 1546623 1554002 1560529 1566706 1573421
57490 1573421 1581327 1590589 1601020 1612169 1623350 1633955 1643964 1653973 1664570 1675761 1687134 1698488
57478 1698488 1710085 1722298 1735166 1748334 1761319 1773809 1785846 1797721 1809651 1821578 1833392
$$ packed form
57572I57231L504L027K343J935K240L222M401N164N144M437L604L289L747M776
57558A008064N966O878P128O764O407O657P295P603P468P620Q504R512R723R095
57544A114684Q349P957P713P350P030P013P096O766N926N182N192N894O716P421
57530A210289Q360R654J0683J0786J0175R627R445R268Q891Q643Q814R166R319
57517A333120R273R326R642J0084J0338J0147R586R085Q988R100Q973Q607Q519
57504A454788Q990R642R971R923R720R425R020Q647Q413Q084P379O527O177O715
57490A573421P906R262J0431J1149J1181J0605J0009J0009J0597J1191J1373J1354
57478A698488J1597J2213J2868J3168J2985J2490J2037J1875J1930J1927J1814
$$ plain form
57467 1833392 1845207 1857200 1869303 1881463 1894142 1908015 1922975 1937926 1951978 1965479 1979427
57456 1979427 1994236 2009637 2025517 2042022 2058803 2074932 2089973 2104633 2119885 2135757 2151441
57445 2151441 2166482 2181430 2197235 2214283 2232181 2250365 2268687 2287241 2305770 2323627 2340523
57434 2340523 2357129 2374637 2393751 2414177 2434901 2454755 2473056 2490208 2507642 2526661 2547186
57423 2547186 2567973 2588083 2607749 2627716 2648230 2668973 2689664 2710342 2731157 2752175 2773342
57412 2773342 2794503 2815529 2836529 2857876 2879928 2902812 2926429 2950533 2974757 2998780 3022546
57401 3022546 3046191 3069798 3093480 3117692 3143016 3169446 3196178 3222439 3248318 3274521 3301508
57390 3301508 3329251 3357665 3386768 3416256 3445381 3473687 3501723 3530628 3560911 3591922 3622632
$$ packed form
57467A833392J1815J1993J2103J2160J2679J3873J4960J4951J4052J3501J3948
57456A979427J4809J5401J5880J6505J6781J6129J5041J4660J5252J5872J5684
57445B151441J5041J4948J5805J7048J7898J8184J8322J8554J8529J7857J6896
57434B340523J6606J7508J9114K0426K0724J9854J8301J7152J7434J9019K0525
57423B547186K0787K0110J9666J9967K0514K0743K0691K0678K0815K1018K1167
57412B773342K1161K1026K1000K1347K2052K2884K3617K4104K4224K4023K3766
57401C022546K3645K3607K3682K4212K5324K6430K6732K6261K5879K6203K6987
57390C301508K7743K8414K9103K9488K9125K8306K8036K8905L0283L1011L0710
$$ plain form
57379 3622632 3652645 3682170 3711280 3739746 3767628 3795554 3824087 3853089 3881929 3910205 3938061
57368 3938061 3965963 3994272 4022905 4051345 4079251 4107127 4136082 4166749 4198782 4231516 4264644
57357 4264644 4297981 4331190 4364294 4398006 4432844 4468173 4502785 4536350 4569655 4603587 4638522
57346 4638522 4674594 4711807 4749797 4788059 4826468 4865115 4903692 4941803 4979909 5019204 5060253
57335 5060253 5102312 5144226 5185413 5225779 5265319 5304282 5343236 5382590 5422287 5462171 5502243
57324 5502243 5542336 5581999 5621063 5659954 5699148 5738622 5778123 5817669 5857457 5897493 5937534
57313 5937534 5977289 6016618 6055765 6095353 6135817 6176881 6218001 6259222 6300981 6343108 6384792
57302 6384792 6425742 6466628 6508100 6550088 6592455 6635510 6679262 6722811 6765248 6806730 6848030
$$ packed form
57379C622632L0013K9525K9110K8466K7882K7926K8533K9002K8840K8276K7856
57368C938061K7902K8309K8633K8440K7906K7876K8955L0667L2033L2734L3128
57357D264644L3337L3209L3104L3712L4838L5329L4612L3565L3305L3932L4935
57346D638522L6072L7213L7990L8262L8409L8647L8577L8111L8106L9295M1049
57335E060253M2059M1914M1187M0366L9540L8963L8954L9354L9697L9884M0072
57324E502243M0093L9663L9064L8891L9194L9474L9501L9546L9788M0036M0041
57313E937534L9755L9329L9147L9588M0464M1064M1120M1221M1759M2127M1684
57302F384792M0950M0886M1472M1988M2367M3055M3752M3549M2437M1482M1300
$$ plain form
57291 6848030 6889426 6930715 6972083 7014210 7057587 7102137 7147438 7192968 7238361 7283792 7329776
57280 7329776 7376255 7422284 7467101 7511135 7555352 7599921 7644201 7687817 7730989 7773813 7815951
57269 7815951 7857206 7897898 7938391 7978554 8017853 8055801 8092341 8127972 8163448 8199170 8234938
57258 8234938 8270429 8305656 8340732 8375443 8409436 8442674 8475374 8507584 8539020 8569121 8597049
57247 8597049 8621989 8643883 8663646 8682337 8700310 8717430 8733680 8749067 8763342 8776494 8789330
57236 8789330 8802854 8817134 8831378 8845087 8858547 8872197 8886209 8900759 8916038 8931699 8946821
57225 8946821 8960825 8974196 8988003 9002906 9018767 9034985 9051001 9066599 9081853 9096870 9111592
57214 9111592 9125854 9139425 9151854 9162499 9170983 9177423 9181989 9184503 9184780 9183067 9179656 9174287 9166515
$$ packed form
57291F848030M1396M1289M1368M2127M3377M4550M5301M5530M5393M5431M5984
57280G329776M6479M6029M4817M4034M4217M4569M4280M3616M3172M2824M2138
57269G815951M1255M0692M0493M0163L9299L7948L6540L5631L5476L5722L5768
57258H234938L5491L5227L5076L4711L3993L3238L2700L2210L1436L0101K7928
57247H597049K4940K1894J9763J8691J7973J7120J6250J5387J4275J3152J2836
57236H789330J3524J4280J4244J3709J3460J3650J4012J4550J5279J5661J5122
57225H946821J4004J3371J3807J4903J5861J6218J6016J5598J5254J5017J4722
57214I111592J4262J3571J2429J0645Q484O440M566K514K77j713l411n369p772
$$ plain form
57201 9166515 9156544 9145148 9132772 9119275 9104547 9088777 9071984 9053919 9034631 9014590 8993959
57190 8993959 8972186 8948601 8922994 8895332 8865376 8833104 8799144 8764287 8728589 8691306 8651665
57179 8651665 8609435 8564838 8518217 8469794 8419597 8367645 8314304 8260239 8205801 8150661 8094372
57168 8094372 8037137 7979600 7921920 7863502 7803754 7742626 7680130 7615713 7548617 7478786 7407047
57157 7407047 7334371 7261246 7187764 7114063 7040645 6968544 6899280 6834390 6774801 6720764 6672320
57146 6672320 6629550 6592290 6559967 6531866 6507220 6484799 6462711 6438951 6412006 6380778 6344276
57135 6344276 6301812 6253377 6199536 6141052 6078792 6013785 5947178 5880422 5815712 5755794 5702878
57124 5702878 5657879 5620832 5591368 5568335 5549526 5532502 5515395 5496420 5473273 5444137 5409387
$$ packed form
57201I166515r971j1396j2376j3497j4728j5770j6793j8065j9288k0041k0631
57190H993959k1773k3585k5607k7662k9956l2272l3960l4857l5698l7283l9641
57179H651665m2230m4597m6621m8423n0197n1952n3341n4065n4438n5140n6289
57168H094372n7235n7537n7680n8418n9748o1128o2496o4417o7096o9831p1739
57157G407047p2676p3125p3482p3701p3418p2101o9264o4890n9589n4037m8444
57146F672320m2770l7260l2323k8101k4646k2421k2088k3760k6945l1228l6502
57135F344276m2464m8435n3841n8484o2260o5007o6607o6756o4710n9918n2916
57124E702878m4999l7047k9464k3033j8809j7024j7107j8975k3147k9136l4750
$$ plain form
57113 5409387 5372051 5337148 5311121 5300992 5312560 5349166 5412677 5505219 5629518 5788871 5988637
57102 5988637 6237908 6549061 6936656 7418136 8014521 8748200 9639933 10709304 11977318
57093 11977318 13466834 15201412 17205406 19502568 22108773 25023081 28224554 31671529
57085 31671529 35295173 38992571 42632222 46065450 49120985 51585685 53214553 53800749
57077 53800749 53270220 51726236 49408294 46599901 43545235 40408190 37274304 34180453
57069 34180453 31150655 28216739 25417616 22789578 20361278 18153707 16179074 14438200
57061 14438200 12919616 11600602 10449763 9433179 8522967 7701498 6957856 6282552 5667062
57052 5667062 5106107 4597182 4137877 3725020 3355543 3026385 2733902 2474635 2246112
$$ packed form
57113E409387l7336l4903k6027j0129J1568L6606O3511R2542J24299J59353J99766
57102E988637K49271L11153L87595M81480N96385P33679Q91733J069371J268014
57093A1977318J489516J734578K003994K297162K606205K914308L201473L446975
57085C1671529L623644L697398L639651L433228L055535K464700J628868N86196
57077E3800749n30529j543984k317942k808393l054666l137045l133886l093851
57069C4180453l029798k933916k799123k628038k428300k207571j974633j740874
57061A4438200j518584j319014j150839j016584r10212q21469p43642o75304o15490
57052E667062n60955n08925m59305m12857l69477l29158k92483k59267k28523
$$ plain form
57043 2246112 2045733 1869595 1713771 1576159 1455887 1351508 1260984 1182696 1115081 1055812
57033 1055812 1002739 955358 914130 878704 847927 821225 798771 780622 766825 758151 755570 759189
57021 759189 768751 785029 809872 845245 893102 955370 1032096 1119040 1208008 1289795 1356351 1400852
57009 1400852 1417786 1404395 1362047 1296156 1214871 1127092 1040276 959268 886878 824788 773202
56998 773202 730245 693056 659715 629623 602394 577404 554378 533424 514349 496760 480908
56987 480908 467630 457242 449087 442236 435946 429447 422003 413361 403490 391818 377502 360647 342556
56974 342556 324530 307012 290178 274705 261509 251140 243725 239159 237023 236647 237640 240268 245143
56961 245143 252737 263295 276918 293301 311286 328775 343415 353681 359351 360734 357505 348872
$$ packed form
57043B246112k00379j76138j55824j37612j20272j04379r0524p8288o7615n9269
57033A055812n3073m7381m1228l5426l0777k6702k2454j8149j3797q674k581L619
57021G59189R562J6278K4843L5373M7857O2268P6726Q6944Q8968Q1787O6556M4501
57009A400852J6934j3391m2348o5891q1285q7779q6816q1008p2390o2090n1586
56998G73202m2957l7189l3341l0092k7229k4990k3026k0954j9075j7589j5852
56987D80908j3278j0388q155o851o290o499p444q642r871j1672j4316j6855j8091
56974C42556j8026j7518j6834j5473j3196j0369p415m566k136l76R93K628M875
56961B45143P594J0558J3623J6383J7985J7489J4640J0266N670J383l229q633
$$ plain form
56949 348872 335058 318049 300390 283559 267966 254105 243008 235545 231731 230809 231842 234477 239349
56936 239349 247540 259481 274714 292849 313921 337242 360473 380690 396104 406153 410316 407802
56924 407802 398373 382798 362532 339490 315873 293377 272448 252808 234566 218270 204003 191164
56912 191164 179186 167979 157687 148527 140770 134436 129177 124912 122228 121507 122017 122686 123473 125041
56898 125041 127255 129178 130596 132467 135602 139908 145289 152392 161868 173650 187415 203103 220321
56885 220321 237703 253428 266205 275500 281228 283572 282879 279500 273884 266816 259177 251495 244306 238865
56871 238865 236691 238079 241864 247145 254645 265826 281198 300246 322718 349153 379975 414330
56859 414330 449804 483070 510971 531480 543865 548093 544308 532951 515204 493084 469142 445974
$$ packed form
56949C48872j3814j7009j7659j6831j5593j3861j1097p463l814r22J033K635M872
56936B39349Q191J1941J5233J8135K1072K3321K3231K0217J5414J0049M163k514
56924D07802r429j5575k0266k3042k3617k2496k0929j9640j8242j6296j4267j2839
56912A91164j1978j1207j0292r160p757o334n259m265k684p21N10O69P87J568
56898A25041K214J923J418J871L135M306N381P103R476J1782J3765J5688J7218
56885B20321J7382J5725J2777R295N728K344o93l379n616p068p639p682p189n441
56871B38865k174J388L785N281P500J1181J5372J9048K2472K6435L0822L4355
56859D14330L5474L3266K7901K0509J2385M228l785j1357j7747k2120k3942k3168
$$ plain form
56847 445974 425637 409290 397356 390064 387733 390714 399383 414211 435601 463706 498704 541138
56835 541138 591370 648238 708256 766284 817100 856717 882747 893910 889461 869405 835433 791219
56823 791219 741310 689790 640031 594965 556606 525341 500390 481193 467961 461103 460836 467475
56811 467475 481492 503122 532155 567800 607809 647696 681821 705927 718411 719212 708382 686164
56799 686164 653775 613515 568409 521929 477388 436971 401566 371689 348031 330718 318768
56788 318768 311006 307222 307901 313180 322747 336481 354258 374916 395924 414360 428029 435707 436829
56775 436829 431280 419367 401780 379582 354219 327319 300270 273993 249220 226918 208131 193200
56763 193200 181272 170925 161320 152515 144746 137897 131769 126357 121569 117188 113479 111264 110786 110930
$$ packed form
56847D45974k0337j6347j1934p292k331K981Q669J4828K1390K8105L4998M2434
56835E41138N0232N6868O0018N8028N0816L9617K6030J1163m449k0056l3972m4214
56823G91219m9909n1520m9759m5066l8359l1265k4951j9197j3232o858k67O639
56811D67475J4017K1630K9033L5645M0009L9887L4125K4106J2484Q01j0830k2218
56799F86164l2389m0260m5106m6480m4541m0417l5405k9877k3658j7313j1950
56788C18768p762l784O79N279R567J3734J7777K0658K1008J8436J3669P678J122
56775D36829n549j1913j7587k2198k5363k6900k7049k6277k4773k2302j8787j4931
56763A93200j1928j0347r605q805p769o849o128n412m788m381l709k215m78J44
$$ plain form
56749 110930 110223 108321 105875 103367 100946 99112 98443 98574 98385 97422 96352 95839 95815 96090 96838 97999 98884
56732 98884 98815 97794 96271 94809 94158 94950 96944 99126 100903 102664 104856 107123 108798 109736 110252 110672
56716 110672 111377 112763 114756 116675 117935 118589 118984 119368 120061 121419 123267 124868 125758 126120 126127 125576 124560
56699 124560 123769 123584 123507 123025 122428 122128 121840 121186 120629 120906 121810 122282 121549 119655 117190 115087 114306 114946
56681 114946 115915 116129 115790 115847 116511 117177 117612 118275 119385 120483 121132 121477 121889 122529 123400 124412 125284 125770
56663 125770 126042 126493 127174 127844 128538 129633 131285 133290 135617 138580 142236 145926 148814 150825 152849
56648 152849 155866 159854 163657 166131 167380 168563 170435 172526 173994 174737 175204 175490 175275 174509 173582 172801
56632 172801 172158 171653 171400 171323 171044 170222 168866 167280 165832 164638 163416 161792 159870 158204 157092 156257
$$ packed form
56749A10930p07j902k446k508k421j834o69J31j89r63j070n13k4K75P48J161Q85
56732I8884o9j021j523j462o51P92J994K182J777J761K192K267J675R38N16M20
56716A10672P05J386J993J919J260O54L95L84O93J358J848J601Q90L62Pn51j016
56699A24560p91j85p7m82n97l00k88o54n57K77R04M72p33j894k465k103p81O40
56681A14946R69K14l39N7O64O66M35O63J110J098O49L45M12O40Q71J012Q72M86
56663A25770K72M51O81O70O94J095J652K005K327K963L656L690K888K011K024
56648A52849L017L988L803K474J249J183J872K091J468P43M67K86k15p66r27p81
56632A72801o43n05k53p7k79q22j356j586j448j194j222j624j922j666j112q35
$$ plain form
56616 156257 155473 155010 154972 154644 153214 150999 149272 148834 149251 149555 149221 148353 147364 146710 146672 147185 147925 148556
56598 148556 148826 148622 148227 148385 149694 151893 153990 155134 155247 154840 154428 154143 153809 153423 153472 154494 156243
56581 156243 157739 158363 158568 159144 160187 161282 162410 164046 166346 168765 170641 171827 172677 173625 174914
56566 174914 176643 179031 182534 187532 193895 201199 209409 218894 229492 240049 249316 257033 263728 269692
56552 269692 274572 277734 278682 277332 274298 270746 267556 264732 261900 259099 256697 254700 252587 249754
56538 249754 245946 241526 237552 235128 234194 233276 230955 227357 223704 220696 217966 214963 211717 208677 206257
56523 206257 204608 203554 202770 202205 202095 202328 202189 201160 199615 198252 197167 196007 194676 193305 191791
56508 191791 190038 188479 187681 187552 187474 187086 186356 185105 183180 180999 179291 178279 177694 177435 177588 177831 177540
$$ packed form
56616A56257p84m63l8l28j430k215j727m38M17L04l34q68r89o54l8N13P40O31
56598A48556K70k04l95J58J309K199K097J144J13m07m12k85l34l86M9J022J749
56581A56243J496O24K05N76J043J095J128J636K300K419J876J186Q50R48J289
56566A74914J729K388L503M998O363P304Q210R485J0598J0557R267P717O695N964
56552B69692M880L162R48j350l034l552l190k824k832k801k402j997k113k833
56538B49754l808m420l974k424r34r18k321l598l653l008k730l003l246l040k420
56523B06257j649j054p84n65j10K33j39j029j545j363j085j160j331j371j514
56508A91791j753j559p98j29p8l88p30j251j925k181j708j012n85k59J53K43k91
$$ plain form
56491 177540 176614 175646 175218 175464 176304 177617 179196 180936 182977 185262 187215 188331 188838 189192 189258 188706 187948
56474 187948 187807 188357 188946 189354 190077 191374 192807 193961 194932 195953 197041 198125 199035 199373 198932 198118 197464
56457 197464 196860 195962 195097 194972 195645 196612 197771 199325 200834 201476 201336 201434 202290 203408 204307 205045 205495 205254
56439 205254 204651 204779 206037 207517 208311 208523 208571 208426 208124 208130 208550 208738 208289 207688 207447 207316 207025 207058 207996
56420 207996 209689 211679 213803 215787 216952 217057 216881 217211 217836 218220 218596 219502 220672 221264 221007 220403 219997
56403 219997 220038 220642 221712 222821 223634 224180 224441 224172 223632 223944 225968 229135 232016 233790 234606 234889 235018
56386 235018 235412 236214 236959 237187 237262 238007 239586 241306 242523 243246 243817 244366 244720 244682 244393 244425 245275 246734
56368 246734 248137 249328 250805 252722 254374 255133 255307 255629 256357 257365 258545 259537 259611 258590 257491 257508
$$ packed form
56491A77540r26r68m28K46Q40J313J579J740K041K285J953J116N07L54O6n52p58
56474A87948j41N50N89M08P23J297J433J154R71J021J088J084R10L38m41q14o54
56457A97464o04q98q65j25O73R67J159J554J509O42j40R8Q56J118Q99P38M50k41
56439B05254o03J28J258J480P94K12M8j45l02OM20J88m49o01k41j31k91L3R38
56420B07996J693J990K124J984J165J05j76L30O25L84L76R06J170N92k57o04m06
56403B19997M1O04J070J109Q13N46K61k69n40L12K024L167K881J774Q16K83J29
56386B35018L94Q02P45K28P5P45J579J720J217P23N71N49L54l8k89L2Q50J459
56368B46734J403J191J477J917J652P59J74L22P28J008J180R92P4j021j099J7
$$ plain form
56352 257508 258608 259828 260663 261432 262499 263958 266001 268812 272031 274943 277319 279581 282113 284882 287723
56337 287723 290533 293105 295231 297038 298931 301193 303928 307352 311712 316818 321917 326228 329600 332644
56323 332644 336156 340222 343931 346235 347069 347270 347468 347638 347725 347932 348157 347957 347514 347881 349690 352248 354546
56306 354546 356558 358845 361501 364304 367434 371178 375285 379483 384274 390229 396701 402230 406268 409647
56292 409647 413246 417030 420615 424085 427915 432540 438211 444970 452591 460704 468991 477153 484953 492572
56278 492572 500618 509467 518886 528653 539091 550553 562850 575785 589804 605429 622392 640115
56266 640115 658761 678977 700886 724229 749451 777715 809779 845706 885769 930870 981843
56255 981843 1038979 1102412 1172454 1249383 1333503 1425550 1526549 1637051 1756879 1885618 2022810
$$ packed form
56352B57508J100J220Q35P69J067J459K043K811L219K912K376K262K532K769K841
56337B87723K810K572K126J807J893K262K735L424M360N106N099M311L372L044
56323C32644L512M066L709K304Q34K01J98J70Q7K07K25k00m43L67J809K558K298
56306C54546K012K287K656K803L130L744M107M198M791N955O472N529M038L379
56292D09647L599L784L585L470L830M625N671O759P621Q113Q287Q162P800P619
56278D92572Q046Q849R419R767J0438J1462J2297J2935J4019J5625J6963J7723
56266F40115J8646K0216K1909K3343K5222K8264L2064L5927M0063M5101N0973
56255I81843N7136O3433P0042P6929Q4120R2047J00999J10502J19828J28739J37192
$$ plain form
56244 2022810 2167486 2317805 2471249 2624864 2775417 2919759 3055065 3178366 3286084
56235 3286084 3374615 3441366 3484843 3503989 3498269 3468442 3416595 3345146 3256256 3152275 3036147
56224 3036147 2911068 2780018 2645782 2511013 2378013 2248550 2123872 2004737 1891467
56215 1891467 1784229 1683208 1588455 1499841 1417422 1341541 1272282 1209102 1151316 1098579 1050572
56204 1050572 1006669 966372 929614 896136 865086 835870 808884 784654 762742 742448 724112
56193 724112 708650 696008 685194 675708 667811 661330 655376 649560 644476 640578 637417 634463 631941
56180 631941 630367 629750 629684 629831 629995 630073 630156 630465 631111 632230 634264 637666 642252 647292 652277 657289 662691
56163 662691 668847 676047 684266 693074 702125 711598 721793 732639 744096 756687 771029 787126 804769
$$ packed form
56244B022810J44676J50319J53444J53615J50553J44342J35306J23301J07718
56235C286084Q8531O6751M3477J9146n720k9827n1847p1449q8890j03981j16128
56224C036147j25079j31050j34236j34769j33000j29463j24678j19135j13270
56215A891467j07238j01021r4753q8614q2419p5881o9259o3180n7786n2737m8007
56204A050572m3903m0297l6758l3478l1050k9216k6986k4230k1912k0294j8336
56193G24112j5462j2642j0814r486p897o481n954n816n084l898l161k954k522
56180F31941j574o17o6J47J64P8Q3L09O46J119K034L402M586N040M985N012N402
56163F62691O156P200Q219Q808R051R473J0195J0846J1457J2591J4342J6097J7643
$$ plain form
56150 804769 824317 846378 871072 898456 929428 965310 1006706 1053627 1106690 1167353 1237069
56139 1237069 1316930 1407926 1510575 1624214 1747270 1877926 2013650 2150436 2283728 2410268
56129 2410268 2528417 2637086 2735527 2824032 2903494 2974053 3034992 3085837 3126443 3156088 3173740
56118 3173740 3179324 3173599 3156651 3127609 3085886 3031561 2964466 2884195 2791270 2687211 2573381
56107 2573381 2451068 2322949 2193235 2065999 1944441 1831681 1730623 1642408 1566182 1500789
56097 1500789 1445520 1399087 1359601 1326268 1299711 1279828 1264640 1252079 1241723 1233937 1228465 1224753
56085 1224753 1222679 1222030 1222120 1222708 1224484 1228009 1232977 1239084 1246676 1255954 1266421 1277699 1289970 1303101
56071 1303101 1316365 1329631 1343871 1359907 1377573 1396547 1416866 1438037 1458771 1478342 1497261
$$ packed form
56150H04769J9548K2061K4694K7384L0972L5882M1396M6921N3063O0663O9716
56139A237069P9861R0996J02649J13639J23056J30656J35724J36786J33292J26540
56129B410268J18149J08669R8441Q8505P9462P0559O0939N0845M0606K9645J7652
56118C173740N584n725j6948k9042m1723n4325o7095q0271r2925j04059j13830
56107B573381j22313j28119j29714j27236j21558j12760j01058q8215p6226o5393
56097A500789n5269m6433l9486l3333k6557j9883j5188j2561j0356p786n472l712
56085A224753k074o49R0N88J776L525M968O107P592R278J0467J1278J2271J3131
56071A303101J3264J3266J4240J6036J7666J8974K0319K1171K0734J9571J8919
$$ plain form
56060 1497261 1516044 1534376 1552045 1569574 1587273 1604779 1622170 1640396 1659938 1680117 1700345
56049 1700345 1720957 1742208 1763661 1785156 1807214 1829917 1852651 1875476 1899348 1924359 1949153
56038 1949153 1972676 1995006 2015985 2034904 2052418 2070982 2092415 2116757 2144447 2177589 2217709
56027 2217709 2264008 2315153 2371062 2431545 2495016 2560204 2627626 2697830 2769683 2841925 2914924
56016 2914924 2989451 3065290 3142506 3222438 3305828 3391547 3478718 3568530 3662485 3760594 3862739
56005 3862739 3969884 4082245 4198325 4317701 4442854 4576290 4717732 4866008 5021577
55996 5021577 5185176 5356167 5534557 5722694 5922814 6134989 6359543 6599015 6855418
55987 6855418 7128178 7417251 7725550 8055762 8407846 8782748 9185427 9620898 10090456
$$ packed form
56060A497261J8783J8332J7669J7529J7699J7506J7391J8226J9542K0179K0228
56049A700345K0612K1251K1453K1495K2058K2703K2734K2825K3872K5011K4794
56038A949153K3523K2330K0979J8919J7514J8564K1433K4342K7690L3142M0120
56027B217709M6299N1145N5909O0483O3471O5188O7422P0204P1853P2242P2999
56016B914924P4527P5839P7216P9932Q3390Q5719Q7171Q9812R3955R8109J02145
56005C862739J07145J12361J16080J19376J25153J33436J41442J48276J55569
55996E021577J63599J70991J78390J88137K00120K12175K24554K39472K56403
55987F855418K72760K89073L08299L30212L52084L74902M02679M35471M69558
$$ plain form
55978 10090456 10595415 11141348 11735086 12381242 13086025 13861061 14719314 15671445 16731033
55969 16731033 17919317 19260094 20775618 22494595 24460615 26728588 29361498 32440220
55961 32440220 36070131 40367829 45446820 51425874 58446583 66680262 76340769 87713902
55953 87713902 101163533 117095358 135942088 158183244 184211880 213857677 245783015
55946 245783015 277355669 305344280 327009739 340761892 346030338 342789442 331364661
55939 331364661 312627182 288179095 260186297 230919542 202302239 175673954 151777361
55932 151777361 130872444 112888337 97564160 84560154 73532869 64173041 56214035
55925 56214035 49428480 43626024 38650575 34372525 30681312 27484581 24708901 22294737
$$ packed form
55978A0090456N04959N45933N93738O46156P04783P75036Q58253R52131J059588
55969A6731033J188284J340777J515524J718977J966020K267973K632910L078722
55961C2440220L629911M297698N078991N979054P020709Q233679R660507J1373133
55953H7713902J3449631J5931825J8846730K2241156K6028636K9645797L1925338
55946B45783015L1572654K7988611K1665459J3752153N268446l240896j1424781
55939C31364661j8737479k4448087k7992798k9266755k8617303k6628285k3896593
55932A51777361k0904917j7984107j5324177j3004006j1027285r359828p959006
55925E6214035o785555n802456m975449m278050l691213l196731k775680k414164
$$ plain form
55917 22294737 20189688 18347674 16731344 15310355 14057202 12947056 11960186 11081018
55909 11081018 10294988 9588544 8951293 8375438 7853397 7377965 6943990 6547665 6184709
55900 6184709 5851016 5544167 5262240 5001940 4759872 4534815 4326641 4133657 3953067
55891 3953067 3783439 3624703 3476139 3336362 3204974 3082346 2967919 2860323 2759022
55882 2759022 2664368 2576326 2494479 2418960 2349955 2286624 2227902 2174075 2126224 2084327 2047122
55871 2047122 2013478 1982559 1952801 1922026 1888670 1852123 1812267 1769621 1725581 1681504 1637799
55860 1637799 1594608 1552644 1512294 1472513 1431824 1390075 1348160 1306512 1264949 1223602 1182868
55849 1182868 1142785 1103514 1066020 1031179 998589 967351 937577 909976 884372 859900 836479
$$ packed form
55917B2294737k105049j842014j616330j420989j253153j110146r86870q79168
55909A1081018p86030p06444o37251n75855n22041m75432m33975l96325l62956
55900F184709l33693l06849k81927k60300k42068k25057k08174j92984j80590
55891C953067j69628j58736j48564j39777j31388j22628j14427j07596j01301
55882B759022r4654q8042q1847p5519o9005o3331n8722n3827m7851m1897l7205
55871B047122l3644l0919k9758l0775l3356l6547l9856m2646m4040m4077m3705
55860A637799m3191m1964m0350l9781m0689m1749m1915m1648m1563m1347m0734
55849A182868m0083l9271l7494l4841l2590l1238k9774k7601k5604k4472k3421
$$ plain form
55838 836479 814886 795478 777962 762228 748344 735791 723761 712165 701446 691594 682237 673520
55826 673520 665846 658866 651675 643980 636225 628721 621505 614788 608613 602276 595092 587533 580686 574838
55812 574838 569647 565361 562576 560920 559348 557824 557471 558811 561098 563641 566581 569996 573361 576472
55798 576472 579793 583189 585192 584303 580471 574644 567392 558660 548516 537477 526200 515272 505258
55785 505258 496669 489805 484609 480558 476790 472596 467695 461876 454720 446130 436912 428209 420435 413225
55771 413225 406311 399869 394204 389670 386814 385807 385643 384623 381878 377945 373803 369881 366122 362467
55757 362467 359008 355983 353647 351822 349762 346997 344150 342228 341150 339704 337029 333365 329257 324839
55743 324839 320202 315622 310951 305496 299084 292708 287473 283330 279501 275811 272822 270677 268583 265723
$$ packed form
55838H36479k1593j9408j7516j5734j3884j2553j2030j1596j0719r852r357q717
55826F73520p674o980p191p695p755p504p216o717o175o337p184p559o847n848
55812E74838n191m286k785j656j572j524l53J340K287K543K940L415L365L111
55798E76472L321L396K003q89l832n827p252q732j0144j1039j1277j0928j0014
55785E05258q589o864n196m051l768m194m901n819p156q590r218q703p774p210
55771D13225o914o442n665m534k856j007j64j020k745l933m142l922l759l655
55757C62467l459l025k336j825k060k765k847j922j078j446k675l664m108m418
55743C24839m637m580m671n455o412o376n235m143l829l690k989k145k094k860
$$ plain form
55729 265723 262262 259031 256402 253906 251031 247983 245290 242868 240076 236816 233968 232365 231736 231191 230426
55714 230426 229881 229843 229980 229794 229148 228346 228071 229133 231865 235735 239777 243229 245571 246394 245847 244910 244483
55697 244483 244313 243452 241647 239471 237213 234546 231497 228804 226876 225197 223341 221956 222033 223567 225674
55682 225674 227878 230657 234604 239529 244598 249079 252705 255480 257494 259060 260704 262620 264234 264794
55668 264794 264454 264246 264822 265714 266196 266227 266035 265395 264112 262823 262448 263001 263717 264176 264506 264600 264029 262749
55650 262749 261055 258733 255123 250235 245023 240245 235726 231000 226057 221140 216349 211683 207063 202205
55636 202205 197016 192129 188349 185569 183022 180628 179113 178534 177812 176299 174842 174516 175073 175471 175268 174690
55620 174690 173789 172441 170933 169764 169015 168433 167912 167362 166457 165104 163835 163072 162329 160840 158747 156860
$$ packed form
55729B65723l461l231k629k496k875l048k693k422k792l260k848j603o29n45p65
55714B30426n45l8J37j86o46q02k75J062K732L870M042L452K342Q23n47r37m27
55697B44483j70q61j805k176k258k667l049k693j928j679j856j385P7J534K107
55682B25674K204K779L947M925N069M481L626K775K014J566J644J916J614N60
55668B64794l40k08N76Q92M82L1j92o40j283j289l75N53P16M59L30R4n71j280
55650B62749j694k322l610m888n212m778m519m726m943m917m791m666m620m858
55636B02205n189m887l780k780k547k394j515n79p22j513j457l26N57L98k03n78
55620A74690r01j348j508j169p49n82n21n50r05j353j269p63p43j489k093j887
$$ plain form
55604 156860 155357 153545 151041 148472 146690 145850 145511 145286 145019 144589 143915 143152 142671 142670 142800 142392 141199
55587 141199 139804 138976 138755 138592 138337 138521 139565 141250 143204 145312 147364 148973 150261 152016 154617
55572 154617 157430 159911 162744 167020 172733 179012 185531 192587 199783 205758 209594 211663 212661 212508 210705
55557 210705 207259 202700 197465 191779 186037 180836 176547 173019 169776 166494 163313 160704 158987 158051
55543 158051 157590 157487 157820 158644 159954 161747 163835 165686 166753 166982 166759 166375 165773 164798 163410 161602
55527 161602 159362 156837 154368 152231 150354 148418 146312 144445 143344 142715 141247 137894 133304 129307
55513 129307 126895 125462 124258 123613 123959 124473 123862 122180 120688 119975 119279 117926 116405 115587 115618 116096 116805
55496 116805 117747 118784 119659 120143 119974 119012 117672 116797 116728 116860 116412 115340 114159 113252 112778 113019 114256
$$ packed form
55604A56860j503j812k504k569j782q40l39k25k67m30o74p63m81jJ30m08j193
55587A41199j395q28k21j63k55J84J044J685J954K108K052J609J288J755K601
55572A54617K813K481K833M276N713O279O519P056P196N975L836K069R98j53j803
55557B10705l446m559n235n686n742n201m289l528l243l282l181k609j717r36
55543A58051m61j03L33Q24J310J793K088J851J067K29k23l84o02r75j388j808
55527A61602k240k525k469k137j877j936k106j867j101o29j468l353m590l997
55513A29307k412j433j204o45L46N14o11j682j492p13o96j353j521q18L1M78P09
55496A16805R42J037Q75M84j69r62j340q75o9J32m48j072j181r07m74K41J237
$$ plain form
55479 114256 116261 118275 119604 120077 119976 119672 119314 118772 117892 116825 115940 115386 114947 114390 113716 112966 112057
55462 112057 111022 110175 109763 109598 109248 108483 107421 106415 105941 106289 107125 107677 107651 107701 108551 109890 110732 110797
55444 110797 110887 111737 113048 114034 114458 114620 114565 113891 112486 111032 110478 111078 112120 112648 112431 112219 112970 114822
55426 114822 116880 118028 117813 116502 114614 112759 111705 111964 113080 113872 113735 113399 114004 115712 117731 119472
55410 119472 121007 122385 123234 123309 122916 122446 121921 121334 120977 120973 120813 119921 118523 117423 117046 117138 117318 117432 117378
55391 117378 117087 116785 116867 117377 117933 118257 118464 118728 119013 119231 119336 119128 118322 116992 115683 114812 114237 113624
55373 113624 112988 112548 112204 111544 110426 109280 108714 108879 109285 109302 108814 108371 108629 109711 111097 112037 111966 110792
55355 110792 109087 107900 107941 108865 109606 109473 108635 107562 106432 105283 104382 104057 104326 104901 105530 106124 106643
$$ packed form
55479A14256K005K014J329M73j01l04l58n42q80j067q85n54m39n57o74p50r09
55462A12057j035q47m12j65l50p65j062j006m74L48Q36N52k6N0Q50J339Q42O5
55444A10797R0Q50J311R86M24J62n5o74j405j454n54O00J042N28k17k12P51J852
55426A14822K058J148k15j311j888j855j054K59J116P92j37l36O05J708K019J741
55410A19472J535J378Q49P5l93m70n25n87l57mj60q92j398j100l77R2J80J14n4
55391A17378k91l02Q2N10N56L24K07K64K85K18J05k08q06j330j309q71n75o13
55373A13624o36m40l44o60j118j146n66J65M06J7m88m43K58J082J386R40p1j174
55355A10792j705j187M1R24P41j33q38j073j130j149r01l25K69N75O29N94N19
$$ plain form
55338 106643 106990 107008 106578 105832 105179 104908 104789 104384 103790 103700 104580 106132 107749 109095 110026 110337 110061 109736
55320 109736 109873 110301 110403 109903 109070 108267 107711 107559 107752 107846 107446 106856 106810 107522 108466 109209 109895 110669 111184
55301 111184 111147 110974 111313 112078 112515 112202 111483 110860 110429 110124 110110 110567 111243 111570 111189 110239 109167 108439 108351
55282 108351 108897 109778 110656 111418 112123 112722 113031 112965 112632 112208 111842 111710 111902 112183 112152 111786 111614 112067 112880
55263 112880 113453 113705 114133 114953 115623 115506 114797 114384 114835 115769 116409 116570 116851 117827 119346 120809 121975 123076
55245 123076 124145 124691 124370 123648 123325 123519 123524 122678 121006 118961 116925 115126 113747 112896 112601 112919 113847
55228 113847 115046 115962 116337 116408 116465 116478 116359 116312 116594 117097 117456 117507 117394 117292 117276 117408 117712 118041 118140 117869 117261
55207 117261 116433 115626 115240 115571 116440 117271 117611 117541 117576 118249 119692 121393 122413 122161 121057 120207 120243 120705
$$ packed form
55338A06643L47J8m30p46o53k71j19m05n94r0Q80J552J617J346R31L11k76l25
55320A09736J37M28J02n00q33q03n56j52J93R4m00n90m6P12R44P43O86P74N15
55301A11184l7j73L39P65M37l13p19o23m31l05j4M57O76L27l81r50j072p28q8
55282A08351N46Q81Q78P62P05N99L09o6l33m24l66j32J92K81l1l66j72M53Q13
55263A12880N73K52M28Q20O70j17p09m13M51R34O40J61K81R76J519J463J166J101
55245A23076J069N46l21p22l23J94Nq46j672k045k036j799j379q51k95L18R28
55228A13847J199R16L75P1N7J3j19m7K82N03L59N1j13j02j6J32L04L29R9k71o08
55207A17261q28q07l86L31Q69Q31L40p0L5O73J443J701J020k52j104q50L6M62
$$ plain form
55189 120705 120771 120337 119987 120017 119998 119444 118431 117272 115993 114591 113478 112994 112624 111525 109956 109354 110532
55172 110532 112504 113773 114168 114557 115161 115288 114761 114480 115148 116307 117159 117752 118762 120472 122516 124334
55156 124334 125488 125786 125554 125482 125817 125959 125302 124198 123543 123576 123672 123269 122483 121753 121413 121724 122829 124442
55138 124442 125885 126719 127145 127588 128053 128133 127604 126766 126125 125806 125457 124738 123799 123078 122711 122412 121919 121306 120776
55119 120776 120445 120404 120682 121004 120949 120525 120241 120411 120804 121266 122138 123563 124849 125248 125053 125235 126099 127045 127593
55100 127593 127909 128262 128695 129376 130566 131934 132595 132216 131597 131685 132445 133161 133503 133743 134095 134373 134400 134394 134815
55081 134815 135894 137368 138677 139453 139807 140031 140097 139718 138828 137685 136482 135240 134159 133650 133808 134179 134359
55064 134359 134543 135158 136142 136907 137012 136603 136164 135937 135647 134814 133363 131830 130835 130503 130553 130757 130970 130943 130600
$$ packed form
55189A20705O6m34l50L0j9n54j013j159j279j402j113m84l70j099j569o02J178
55172A10532J972J269L95L89O04J27n27k81O68J159Q52N93J010J710K044J818
55156A24334J154K98k32p2L35J42o57j104o55L3R6m03p86p30l40L11J105J613
55138A24442J443Q34M26M43M65Q0n29q38o41l19l49p19r39p21l67k99m93o13n30
55119A20776l31m1K78L22n5m24k84J70L93M62Q72J425J286L99j95J82Q64R46N48
55100A27593L16L53M33O81J190J368O61l79o19Q8P60P16L42K40L52K78K7oM21
55081A34815J079J474J309P76L54K24O6l79q90j143j203j242j081n09J58L71J80
55064A34359J84O15R84P65J05m09m39k27k90q33j451j533r95l32N0K04K13k7l43
$$ plain form
55045 130600 130360 130603 130875 130361 129201 128497 128722 128979 128400 127480 127269 127852 128547 129241 130444 132079 133139
55028 133139 132850 131483 129828 128350 127113 126089 125286 124778 124749 125269 126009 126486 126598 126586 126513 126178 125637 125361
55010 125361 125678 126375 126957 127060 126540 125523 124573 124422 125322 126778 128137 129210 130203 131279 132476 133862
54994 133862 135486 137159 138485 139208 139478 139799 140591 141734 142616 142792 142488 142272 142342 142471 142571 142878 143481 144089
54976 144089 144413 144428 144087 143193 141949 141346 142402 144993 147803 149580 150218 150514 151100 151882 152456 152695 152703 152367
54958 152367 151424 150022 148838 148299 148053 147645 147479 148429 150472 152333 152777 151777 150160 148562 147206 146322
54942 146322 146186 146727 147488 148067 148374 148522 148705 149143 149963 151186 152938 155481 158813 162378 165541 168289
54926 168289 171179 174588 178347 182138 185947 190025 194599 199680 205012 210051 214159 216864 217956 217453
$$ packed form
55045A30600k40K43K72n14j160p04K25K57n79r20k11N83O95O94J203J635J060
55028A33139k89j367j655j478j237j024q03n08k9N20P40M77J12j2p3l35n41k76
55010A25361L17O97N82J03n20j017r50j51R00J456J359J073R93J076J197J386
54994A33862J624J673J326P23K70L21P92J143Q82J76l04k16P0J29J00L07O03O08
54976A44089L24J5l41q94j244o03J056K591K810J777O38K96N86P82N74K39Ql36
54958A52367r43j402j184n39k46m08j66R50K043J861M44j000j617j598j356q84
54942A46322j36N41P61N79L07J48J83M38Q20J223J752K543L332L565L163K748
54926A68289K890L409L759L791L809M078M574N081N332N039M108K705J092n03
$$ plain form
54912 217453 215655 213098 210131 206516 201804 196202 190711 186216 182650 179313 175795 172243 168879 165677
54898 165677 162625 160019 158194 157087 156273 155506 155024 155208 156051 157184 158398 159879 161772 163836 165849
54883 165849 168172 171424 175571 179855 183858 188154 193490 199636 205612 210816 215247 218619 220059 219072
54869 219072 216221 212375 207730 202140 196068 190404 185431 180730 176174 172287 169299 166542 163286 159760
54855 159760 156789 154784 153573 152932 152634 152148 151006 149506 148418 147895 147236 145928 144373 143291 142868 142841
54839 142841 143019 143268 143305 142962 142543 142496 142803 143010 142839 142523 142540 143191 144349 145445 145757 144904 143051 140646
54821 140646 138159 136137 135143 135309 136175 137230 138384 139645 140693 141259 141708 142706 144338 146010 147185 147753
54805 147753 147769 147357 146975 147223 148212 149470 150538 151286 151605 151361 150786 150370 150167 149751 149092 148841 149373 150143
$$ packed form
54912B17453j798k557k967l615m712n602n491m495l566l337l518l552l364l202
54898A65677l052k606j825j107q14p67m82J84Q43J133J214J481J893K064K013
54883A65849K323L252M147M284M003M296N336O146N976N204M431L372J440r87
54869B19072k851l846m645n590o072n664m973m701m556l887k988k757l256l526
54855A59760k971k005j211o41k98m86j142j500j088n23o59j308j555j082m23k7
54839A42841J78K49L7l43m19m7L07K07j71l16J7O51J158J096L12q53j853k405
54821A40646k487k022r94J66Q66J055J154J261J048N66M49R98J632J672J175N68
54805A47753J6m12l82K48R89J258J068P48L19k44n75m16k03m16o59k51N32P70
$$ plain form
54787 150143 150543 150808 151399 151967 151874 151535 152221 154380 156994 158938 160265 161724 163535 165314 166936 168920
54771 168920 171892 176026 181113 186903 193244 199894 206388 212210 217161 221475 225411 228748 230818 231046
54757 231046 229347 226045 221614 216540 211268 206120 201220 196450 191549 186424 181496 177551 175017 173520
54743 173520 172367 171302 170481 169874 169180 168298 167396 166461 165353 164417 164472 165792 167600 169132 170844 173885
54727 173885 178527 183722 188302 192133 195919 200275 205191 210131 214420 217644 219793 220930 220778 218880
54713 218880 215221 210408 205165 199921 194940 190437 186298 182042 177475 173196 169989 167811 165825 163463
54699 163463 161037 159186 158202 158090 158793 159890 160384 159412 157186 154794 153026 151853 151056 150771 151088 151527
54683 151527 151472 150933 150494 150565 151069 151756 152454 152940 152960 152507 151892 151476 151459 151875 152513 152908 152722 152193 151870 151894
$$ packed form
54787A50143M00K65N91N68r3l39O86K159K614J944J327J459J811J779J622J984
54771A68920K972M134N087N790O341O650O494N822M951M314L936L337K070K28
54757B31046j699l302m431n074n272n148m900m770m901n125m928l945k534j497
54743A73520j153j065q21o07o94q82r02r35j108r36N5J320J808J532J712L041
54727A73885M642N195M580L831L786M356M916M940M289L224K149J137j52j898
54713B18880l659m813n243n244m981m503m139m256m567m279l207k178j986k362
54699A63463k426j851r84j12P03J097M94r72k226k392j768j173p97k85L17M39
54683A51527n5n39m39P1N04O87O98M86K0m53o15m16j7M16O38L95j86n29l23K4
$$ plain form
54663 151894 151914 151749 151675 151846 151898 151440 150575 149589 148500 147330 146501 146413 146811 147088 147154 147468 148236 149074 149576 149760
54643 149760 149824 149863 149985 150400 151139 151943 152567 153005 153309 153442 153449 153580 154070 154892 155795 156397 156265 155224 153708
54624 153708 152548 152225 152500 152872 153113 153251 153292 153263 153312 153605 154166 154935 155723 156069 155459 153971 152435 151689 151848
54605 151848 152483 153225 153896 154296 154299 154067 153818 153520 153102 152816 153001 153597 154257 154855 155451 155885 155948 155932 156398 157236
54585 157236 157509 156569 154932 153711 153500 154123 155118 155979 156164 155420 154177 153236 152951 152981 152922 152902 153322 154257 155391
54566 155391 156503 157763 159350 160969 162033 162386 162540 163016 163630 163766 163194 162276 161351 160377 159349 158702 158978
54549 158978 160265 162207 164398 166512 168221 169300 169823 170052 170155 170178 170256 170595 171277 172220 173378 174791 176420
54532 176420 178054 179414 180304 180654 180493 179864 178775 177333 175914 174992 174672 174562 174226 173569 172662 171470 170040
$$ packed form
54663A51894K0j65p4J71N2m58q65r86j089j170q29q8L98K77O6L14P68Q38N02J84
54643A49760O4L9J22M15P39Q04O24M38L04J33PJ31M90Q22R03O02j32j041j516
54624A53708j160l23K75L72K41J38M1k9M9K93N61P69P88L46o10j488j536p46J59
54605A51848O35P42O71M00Lk32k49k98m18k86J85N96O60N98N96M34O3j6M66Q38
54585A57236K73r40j637j221k11O23R95Q61J85p44j243r41k85L0n9k0M20R35J134
54566A55391J112J260J587J619J064L53J54M76O14J36n72r18r25r74j028o47K76
54549A58978J287J942K191K114J709J079N23K29J03K3P8L39O82R43J158J413J629
54532A76420J634J360Q90L50j61o29j089j442j419r22l20j10l36o57r07j192j430
$$ plain form
54515 170040 168693 167675 166832 166074 165916 166930 168639 169626 169007 167348 165901 165420 165985 167366 168998 169945
54499 169945 169618 168434 167345 166770 166459 166260 166326 166526 166290 165383 164373 163921 163960 163969 163852 164006 164577 165124 165195
54480 165195 164920 164804 165098 165593 165984 166260 166696 167611 169147 171173 173311 175090 176199 176602 176423 175784 174886
54463 174886 174119 173855 174001 173987 173339 172172 171010 170259 170087 170644 171978 173661 174867 175155 175051 175545 177000
54446 177000 178747 179831 179930 179406 178642 177689 176598 175760 175551 175751 175697 175041 174064 173147 172367 171798 171753 172262 172633
54427 172633 172156 171180 170854 171698 172969 173681 173739 173764 174236 175256 176811 178739 180525 181538 181566 180920 180095 179554
54409 179554 179650 180409 181420 182169 182435 182200 181411 180228 179366 179665 181160 183002 184436 185554 186870 188440
54393 188440 189713 190200 190009 189684 189594 189607 189422 189119 189143 189631 190074 189910 189255 188660 188287 187777 186946 186110 185584
$$ packed form
54515A70040j347j018q43p58j58J014J709R87o19j659j447m81N65J381J632R47
54499A69945l27j184j089n75l11j99O6K00k36r07j010m52L9Rj17J54N71N47P1
54480A65195k75j16K94M95L91K76M36R15J536K026K138J779J109M03j79o39q98
54463A74886p67k64J46j4o48j167j162p51j72N57J334J683J206K88j04M94J455
54446A77000J747J084R9n24p64r53j091q38k09K00n4o56r77r17p80n69m5N09L71
54427A72633m77r76l26Q44J271P12N8K5M72J020J555J928J786J013K8o46q25n41
54409A79554R6P59J011P49K66k35p89j183q62K99J495J842J434J118J316J570
54393A88440J273M87j91l25r0J3j85l03K4M88M43j64o55n95l73n10q31q36n26
$$ plain form
54374 185584 185256 184851 184380 184094 184239 184977 186287 187807 188990 189571 189762 189923 190280 190962 191931 192789 193051 192801
54356 192801 192748 193441 194772 196402 198227 200164 201926 203420 204923 206470 207534 207859 208204 209513 211643
54341 211643 213696 215476 217679 220545 223204 224769 225454 226153 227296 228525 229143 228579 226632 223652 220389
54326 220389 217450 214989 212922 211150 209467 207593 205501 203467 201636 199832 197983 196367 195144 193988
54312 193988 192548 191069 190173 190168 190873 191926 192859 193024 191957 189934 187844 186406 185679 185313 184995 184592 184136
54295 184136 183874 184172 185212 186744 188155 188798 188372 187138 185726 184628 183865 183238 182749 182610 182922 183516 184062
54278 184062 184201 183673 182604 181590 181218 181450 181760 181912 182308 183440 185251 187236 188920 190081 190717 191135
54262 191135 191911 193409 195321 196941 197895 198338 198475 198321 198052 198174 198951 199919 200412 200435 200542 200918 201143 201028
$$ packed form
54374A85584l28m05m71k86J45P38J310J520J183N81J91J61L57O82R69Q58K62k50
54356A92801n3O93J331J630J825J937J762J494J503J547J064L25L45J309K130
54341B11643K053J780K203K866K659J565O85O99J143J229O18n64j947k980l263
54326B20389k939k461k067j772j683j874k092k034j831j804j849j616j223j156
54312A93988j440j479q96nP05J053R33J65j067k023k090j438p27l66l18m03m56
54295A84136k62K98J040J532J411O43m26j234j412j098p63o27m89j39L12N94N46
54278A84062J39n28j069j014l72K32L10J52L96J132J811J985J684J161O36M18
54262A91135P76J498J912J620R54M43J37j54k69J22P77R68M93K3J07L76K25j15
$$ plain form
54244 201028 201065 201583 201922 201077 199069 197067 196069 195953 195993 195835 195650 195669 195960 196497 197140 197590 197610 197250 196715
54225 196715 196086 195353 194632 194185 194228 194849 195943 197120 197806 197720 197185 196688 196208 195285 193794 192308 191493 191353
54207 191353 191311 190948 190414 190145 190348 190850 191328 191610 191769 191936 192070 191967 191520 190944 190568 190422 190174 189646 189257
54188 189257 189660 190915 192346 193368 194162 195219 196425 197039 196563 195253 193746 192571 192069 192259 192543 191973
54172 191973 190291 188424 187567 187911 188661 189111 189214 189165 189022 188905 189087 189539 189667 188896 187463 186328 186247 187039
54154 187039 187791 187707 186738 185469 184490 183931 183548 183144 182815 182848 183449 184562 185848 186880 187363 187194 186398 185222
54136 185222 184274 184239 185228 186611 187704 188445 189170 189938 190484 190769 191100 191631 192059 192000 191391 190422 189327 188462
54118 188462 188396 189600 191980 194833 197333 199085 200232 201063 201615 201772 201729 202013 202825 203611 203638 202943 202398 202782
$$ packed form
54244B01028L7N18L39q45k008k002r98j16M0j58j85J9K91N37O43M50K0l60n35
54225A96715o29p33p21m47M3O21J094J177O86q6n35m97m80r23j491j486q15j40
54207A91353m2l63n34k69K03N02M78K82J59J67J34j03m47n76l76j46k48n28l89
54188A89257M03J255J431J022P94J057J206O14m76j310j507j175n02J90K84n70
54172A91973j682j867q57L44P50M50J03m9j43j17J82M52J28p71j433j135q1P92
54154A87039P52q4r69j269r79n59l83m04l29L3O01J113J286J032M83j69p96j176
54136A85222r48l5R89J383J093P41P25P68N46K85L31N31M28n9o09r69j095q65
54118A88462o6J204K380K853K500J752J147Q31N52J57m3K84Q12P86K7o95n45L84
$$ plain form
54100 202782 204057 205556 206655 207211 207546 207995 208361 207968 206506 204660 203488 203280 203516 203864 204535 205475 205919
54083 205919 205258 203945 203022 203039 203850 205175 206808 208438 209825 211209 213057 215334 217394 218722 219447 220003
54067 220003 220570 221077 221551 222190 223080 224042 224859 225593 226576 228019 229773 231633 233771 236540 239809 242878
54051 242878 245289 247541 250765 255843 263034 272213 283010 294751 306546 317546 327057 334537 339729
54038 339729 342775 344002 343701 342291 340513 339043 337906 336667 335317 334641 335516 338020 341420 344895 348085
54023 348085 351051 353946 356843 359784 362834 365897 368478 369869 369809 368906 368178 368090 368118 367264 364924 361313
54007 361313 357159 353022 348819 344016 338263 331773 325056 318496 312290 306549 301241 296200 291434 287272
53993 287272 283940 281153 278443 275768 273431 271463 269547 267582 265846 264469 263116 261409 259411 257451
$$ packed form
54100B02782J275J499J099N56L35M49L66l93j462j846j172k08K36L48O71R40M44
54083B05919o61j313r23J7Q11J325J633J630J387J384J848K277K060J328P25N56
54067B20003N67N07M74O39Q90R62Q17P34R83J443J754J860K138K769L269L069
54051B42878K411K252L224N078P191R179J0797J1741J1795J1000R511P480N192
54038C39729L046J227l01j410j778j470j137j239j350o76Q75K504L400L475L190
54023C48085K966K895K897K941L050L063K581J391o0r03p28q8K8q54k340l611
54007C61313m154m137m203m803n753o490o717o560o206n741n308n041m766m162
53993B87272l332k787k710k675k337j968j916j965j736j377j353j707j998j960
$$ plain form
53979 257451 255725 254286 253218 252530 251972 251165 249907 248300 246680 245465 244920 244921 245023 244854 244362 243764 243370
53962 243370 243450 243983 244539 244696 244658 245118 246363 247831 248813 249358 250196 251904 254394 257133 259639 261880 264331
53945 264331 267518 271365 275147 278329 281285 284940 289840 295825 302528 309752 317336 324962 332259 338975
53931 338975 344980 350249 354950 359406 363827 368104 371931 375203 378269 381721 385898 390587 395246 399383
53917 399383 402697 405170 407363 410389 415070 421053 427262 433316 439887 447492 455586 463330 470639 477789
53903 477789 484412 489724 493528 496217 497890 498369 498144 498373 499558 500908 501464 501300 501118 501195 501345 501720 503084
53886 503084 506214 511207 517097 521995 523948 522133 517108 509718 500047 487782 473205 457291 440980
53873 440980 424862 409482 395381 382700 371127 360388 350508 341581 333637 326751 320946 315885 310990
$$ packed form
53979B57451j726j439j068o88n58q07j258j607j620j215n45JJ02j69m92n98l94
53962B43370Q0N33N56J57l8M60J245J468R82N45Q38J708K490K739K506K241K451
53945B64331L187L847L782L182K956L655M900N985O703P224P584P626P297O716
53931C38975O005N269M701M456M421M277L827L272L066L452M177M689M659M137
53917C99383L314K473K193L026M681N983O209O054O571P605Q094P744P309P150
53903D77789O623N312L804K689J673M79k25K29J185J350N56j64j82P7J50L75J364
53886E03084L130M993N890M898J953j815n025p390r671j2265j4577j5914j6311
53873D40980j6118j5380j4101j2681j1573j0739r880q927p944o886n805n061m895
$$ plain form
53860 310990 306008 301177 296732 292574 288532 284629 280884 277174 273586 270672 268934 268101 267187 265400 262889
53845 262889 260581 259305 259013 258829 257920 256342 254911 254286 254415 254876 255426 255960 256231 255966 255208 254263 253332
53828 253332 252393 251394 250402 249587 249215 249544 250502 251641 252697 254038 256169 258784 260838 261699 261844 262240 263410
53811 263410 265333 267821 270509 272762 274145 274999 276129 277979 280468 283616 287744 292798 297974 302486
53797 302486 306592 311447 317849 325376 332819 339339 345074 350632 356121 360878 364255 366484 368433 370478
53783 370478 372037 372429 371834 371043 370462 369832 368867 367640 366168 364036 360755 356309 351079 345403 339462 333472
53767 333472 327670 322118 316756 311634 306888 302462 298148 293969 290266 287180 284274 280965 277278 273892
53753 273892 271361 269553 267928 266169 264357 262705 261361 260410 259783 259155 258152 256750 255326 254230 253527
$$ packed form
53860C10990m982m831m445m158m042l903l745l710l588k914j738q33r14j787k511
53845B62889k308j276k92j84r09j578j431o25J29M61N50N34K71k65p58r45r31
53828B53332r39r99r92q15l72L29R58J139J056J341K131K615K054Q61J45L96J170
53811B63410J923K488K688K253J383Q54J130J850K489L148M128N054N176M512
53797C02486M106M855O402P527P443O520N735N558N489M757L377K229J949K045
53783C70478J559L92n95p91n81o30r65j227j472k132l281m446n230n676n941n990
53767C33472n802n552n362n122m746m426m314m179l703l086k906l309l687l386
53753B73892k531j808j625j759j812j652j344r51o27o28j003j402j424j096p03
$$ plain form
53738 253527 253191 253289 253758 254165 254016 253231 252128 251047 250263 250113 250800 252008 253109 253873 254668 255845 257302
53721 257302 258883 260772 263057 265205 266493 266895 267049 267369 267706 267964 268563 269985 272228 274983 278062 281266
53705 281266 284041 285829 286810 287910 289870 292509 295032 296888 298155 299246 300536 302312 304831 308190
53691 308190 312171 316300 320087 323194 325457 326949 328016 329013 329885 330120 329346 327866 326414 325382 324572
53676 324572 323715 322980 322744 323064 323596 324015 324307 324618 324991 325365 325729 326138 326516 326573 326108 325385 324960 325002 324950 324139
53656 324139 322654 321219 320272 319614 319144 319414 320936 323140 324658 324728 323909 323195 322823 322325 321447 320521 319870
53639 319870 319379 318950 319070 320411 322860 325437 327395 329033 331105 333668 336079 338000 339742 341503 342892
53624 342892 343652 344387 345971 348437 351011 353189 355222 357469 359843 362184 364723 367770 371125 374226 376864
$$ packed form
53738B53527l36R8M69M07j49p85j103j081p84j50O87J208J101P64P95J177J457
53721B57302J581J889K285K148J288M02J54L20L37K58N99J422K243K755L079L204
53705B81266K775J788R81J100J960K639K523J856J267J091J290J776K519L359
53691C08190L981M129L787L107K263J492J067R97Q72K35p74j480j452j032q10
53676C24572q57p35k36L20N32M19K92L11L73L74L64M09L78N7m65p23m25M2n2q11
53656C24139j485j435r47o58m70K70J522K204J518P0q19p14l72m98q78r26o51
53639C19870m91m29J20J341K449K577J958J638K072K563K411J921J742J761J389
53624C42892P60P35J584K466K574K178K033K247K374K341K539L047L355L101K638
$$ plain form
53609 376864 379480 382641 386374 390147 393470 396419 399455 402783 406093 409058 411836 414784 417771 420151
53595 420151 421544 422334 423244 424600 426194 427686 428956 430076 431069 431713 431624 430679 429319 428283 427999 428401
53579 428401 429283 430543 432003 433353 434498 435692 437116 438563 439811 441113 442965 445441 447976 449719
53565 449719 449948 448371 445361 441769 438211 434648 430937 427558 425272 424138 423431 422635 421956 421707 421780 422104
53549 422104 423147 425353 428299 430953 432741 433979 435268 436905 438921 441225 443575 445731 447844 450401
53535 450401 453559 456853 459897 463165 467668 473891 481418 489596 498129 506900 515637 524113 532500 541235
53521 541235 550649 560982 572558 585535 599506 613781 628161 643145 659294 676726 695346 715145
53509 715145 735972 757338 778838 800611 823029 846051 869262 892455 915722 938977 961802
$$ packed form
53609C76864K616L161L733L773L323K949L036L328L310K965K778K948K987K380
53595D20151J393P90R10J356J594J492J270J120R93O44q9r45j360j036k84M02
53579D28401Q82J260J460J350J145J194J424J447J248J302J852K476K535J743
53565D49719K29j577l010l592l558l563l711l379k286j134p07p96o79k49P3L24
53549D22104J043K206K946K654J788J238J289J637K016K304K350K156K113K557
53535D50401L158L294L044L268M503O223P527Q178Q533Q771Q737Q476Q387Q735
53521E41235R414J0333J1576J2977J3971J4275J4380J4984J6149J7432J8620J9799
53509G15145K0827K1366K1500K1773K2418K3022K3211K3193K3267K3255K2825
$$ plain form
53498 961802 983909 1005429 1026533 1047136 1067204 1087147 1107557 1128595 1149791 1170405 1189860
53487 1189860 1207972 1225043 1241780 1258952 1276958 1295634 1314406 1332626 1349930 1366478 1382862
53476 1382862 1399684 1417073 1434496 1450948 1465439 1477516 1487432 1495716 1502493 1507313 1509601 1509157 1506125
53463 1506125 1500747 1493311 1484232 1473937 1462791 1451302 1440222 1429967 1419898 1408589 1395115 1379853
53451 1379853 1363764 1347125 1329395 1310314 1290647 1271589 1253647 1236368 1219004 1201226 1183305
53440 1183305 1165970 1150142 1136511 1125122 1115431 1106856 1099194 1092490 1086741 1081961 1078426 1076535 1076323
53427 1076323 1077267 1078699 1080418 1082863 1086720 1092376 1099669 1108141 1117515 1127956 1139859 1153416 1168373
53414 1168373 1184184 1200441 1217319 1235606 1256132 1278990 1303435 1328672 1354624 1381721 1410058
$$ packed form
53498I61802K2107K1520K1104K0603K0068J9943K0410K1038K1196K0614J9455
53487A189860J8112J7071J6737J7172J8006J8676J8772J8220J7304J6548J6384
53476A382862J6822J7389J7423J6452J4491J2077R916Q284O777M820K288m44l032
53463A506125n378p436r079j0295j1146j1489j1080j0255j0069j1309j3474j5262
53451A379853j6089j6639j7730j9081j9667j9058j7942j7279j7364j7778j7921
53440A183305j7335j5828j3631j1389r691q575p662o704n749m780l535j891k12
53427A076323R44J432J719K445L857N656P293Q472R374J0441J1903J3557J4957
53414A168373J5811J6257J6878J8287K0526K2858K4445K5237K5952K7097K8337
$$ plain form
53403 1410058 1439113 1468445 1498413 1530041 1564256 1601401 1641326 1683679 1728062 1774054 1821322
53392 1821322 1869738 1919321 1970010 2021555 2073658 2126156 2178927 2231683 2284042 2335756 2386612
53381 2386612 2436037 2483122 2527220 2568339 2606778 2642644 2675991 2707045 2735769 2761392 2782969
53370 2782969 2800377 2814147 2824319 2830166 2831281 2828064 2820432 2806713 2784947 2755338 2720537 2683125
53358 2683125 2643463 2600468 2553962 2505483 2456821 2408545 2360294 2312087 2264722 2218922 2174611
53347 2174611 2131284 2088803 2047495 2007534 1968540 1929876 1891202 1852723 1815004 1778531 1743400
53336 1743400 1709484 1676972 1646552 1618880 1593930 1571143 1550154 1531063 1514005 1498723 1484628
53325 1484628 1470999 1457173 1442861 1428405 1414347 1400663 1386694 1371969 1356730 1341513 1326574
$$ packed form
53403A410058K9055K9332K9968L1628L4215L7145L9925M2353M4383M5992M7268
53392A821322M8416M9583N0689N1545N2103N2498N2771N2756N2359N1714N0856
53381B386612M9425M7085M4098M1119L8439L5866L3347L1054K8724K5623K1577
53370B782969J7408J3770J0172N847J115l217p632j3719k1766k9609l4801l7412
53358B683125l9662m2995m6506m8479m8662m8276m8251m8207m7365m5800m4311
53347B174611m3327m2481m1308l9961l8994l8664l8674l8479l7719l6473l5131
53336A743400l3916l2512l0420k7672k4950k2787k0989j9091j7058j5282j4095
53325A484628j3629j3826j4312j4456j4058j3684j3969j4725j5239j5217j4939
$$ plain form
53314 1326574 1311981 1297948 1284783 1272750 1262205 1253605 1247086 1242311 1238967 1237119 1236771 1237421 1238529
53301 1238529 1240181 1242839 1246638 1251416 1257261 1264469 1273083 1283052 1294844 1309235 1326309 1345201 1365053
53288 1365053 1385769 1407617 1430536 1454150 1478069 1501812 1524672 1546064 1565929 1584464 1601522
53277 1601522 1616539 1629058 1639221 1647661 1654853 1660459 1663368 1662622 1658364 1651676 1643430 1633546 1621427
53264 1621427 1606779 1589856 1571164 1551178 1530129 1507847 1483984 1458613 1432421 1406021 1379320
53253 1379320 1351939 1324166 1297019 1271247 1246573 1222133 1197451 1172827 1148938 1126240 1104645
53242 1104645 1083536 1062143 1040093 1017728 995750 974522 953868 933589 913969 895490 878259
53231 878259 862083 847091 833804 822416 812327 802717 793318 784343 775918 767886 759913 751315 741076
$$ packed form
53314A326574j4593j4033j3165j2033j0545q600o519m775l344j848l48O50J108
53301A238529J652K658L799M778N845P208Q614R969J1792J4391J7074J8892J9852
53288A365053K0716K1848K2919K3614K3919K3743K2860K1392J9865J8535J7058
53277A601522J5017J2519J0163Q440P192N606K909p46m258o688q246r884j2119
53264A621427j4648j6923j8692j9986k1049k2282k3863k5371k6192k6400k6701
53253A379320k7381k7773k7147k5772k4674k4440k4682k4624k3889k2698k1595
53242A104645k1109k1393k2050k2365k1978k1228k0654k0279j9620j8479j7231
53231H78259j6176j4992j3287j1388j0089r610r399q975q425q032p973q598j0239
$$ plain form
53218 741076 728656 714779 700819 687333 673688 659179 643878 628173 612139 595875 580013
53207 580013 565322 551974 539668 528283 517982 508743 500192 491915 483663 475314 466863 458397 449898
53194 449898 441151 432011 422681 413614 405305 398197 392408 387310 381829 375592 369442 364312 359964 355504
53180 355504 350902 347131 344762 343226 341666 339805 337652 335085 332221 329666 327813 326291 324622 323053
53166 323053 322063 321317 319899 317630 315420 314101 313425 312575 311278 310022 309306 309051 308735 307930 306669 305300
53150 305300 304005 302485 300322 297645 295228 293760 293176 292878 292471 292055 291789 291482 290786 289682 288588 287934
53134 287934 287734 287677 287583 287624 288021 288638 289079 289209 289442 290375 292106 293973 294969 294513 292958 291405 290892 291677
53116 291677 293255 295015 296695 298200 299323 299908 300098 300103 299781 298806 297235 295586 294227 293036 291811 290701
$$ packed form
53218G41076j2420j3877j3960j3486j3645j4509j5301j5705j6034j6264j5862
53207E80013j4691j3348j2306j1385j0301r239q551q277q252q349q451q466q499
53194D49898q747r140r330r067q309p108n789n098n481o237o150n130m348m460
53180C55504m602l771k369j536j560j861k153k567k864k555j853j522j669j569
53166C23053r90p46j418k269k210j319o76q50j297j256p16k55l16q05j261j369
53150C05300j295j520k163k677k417j468n84k98m07m16k66l07o96j104j094o54
53134B87934k00n7r4M1L97O17M41J30K33R33J731J867R96m56j555j553n13P85
53116B91677J578J760J680J505J123N85J90Nl22r75j571j649j359j191j225j110
$$ plain form
53100 290701 289941 289424 288865 288283 287918 287708 287272 286531 286012 286253 287125 288006 288593 289218 290222 291232 291334 290082
53082 290082 288130 286697 286448 287037 287701 288020 288060 288048 288080 288007 287459 286174 284487 283332 283465 284750 286364 287588
53064 287588 288193 288261 287964 287509 287035 286605 286452 286997 288275 289497 289777 289276 289128 290102 291851 293602 295075
53047 295075 296371 297421 298038 298284 298355 298206 297603 296517 295285 294391 294161 294448 294551 293778 292257 290900 290346
53030 290346 290300 290183 290056 290411 291392 292736 294274 295941 297406 298275 298628 298816 298752 298005 296699 295679 295495
53013 295495 295759 295870 295948 296574 297817 299073 299828 300227 300835 301984 303389 304288 304064 302910 301776 301500 301970
52996 301970 302331 301966 301162 300726 301127 302079 302963 303506 303981 304754 305826 306914 307873 308820 309866 310972 312162
52979 312162 313712 315900 318599 321267 323391 324920 326202 327524 328825 329886 330726 331594 332572 333371 333662
$$ packed form
53100B90701p60n17n59n82l65k10m36p41n19K41Q72Q81N87O25J004J010J02j252
53082B90082j952j433k49N89O64L19M0j2L2p3n48j285j687j155J33J285J614J224
53064B87588O05O8k97m55m74m30j53N45J278J222K80n01j48R74J749J751J473
53047B95075J296J050O17K46P1j49o03j086j232q94k30K87J03p73j521j357n54
53030B90346m6j17j27L55R81J344J538J667J465Q69L53J88o4p47j306j020j84
53013B95495K64J11P8O26J243J256P55L99O08J149J405Q99k24j154j134k76M70
52996C01970L61l65q04m36M01R52Q84N43M75P73J072J088R59R47J046J106J190
52979C12162J550K188K699K668K124J529J282J322J301J061Q40Q68R78P99K91
$$ plain form
52964 333662 333476 333185 333177 333605 334311 334871 334939 334694 334726 335245 335664 335295 334262 333270 332561 331670 330261 328664 327326
52945 327326 326242 325283 324719 324885 325474 325663 325020 323959 323158 322773 322416 321773 320979 320333 319836 319223 318385 317519
52927 317519 316801 316128 315346 314561 313959 313463 312803 311887 310885 310044 309603 309744 310325 310798 310783 310573 310645 310748 310129
52908 310129 308685 307282 306665 306633 306667 306819 307425 308313 308893 308926 308696 308470 308183 307612 306619 305296 304162 304016
52890 304016 305186 306978 308188 308211 307389 306412 305678 305173 304678 304056 303489 303349 303649 303927 303924 304095 304935 306045
52872 306045 306539 306304 306215 307008 308591 310565 312747 314838 316245 316756 317008 317820 319323 321151 323098 325087
52856 325087 326736 327575 327592 327086 326005 323938 320834 317293 314047 311393 309166 306901 303965 299914 294994
52841 294994 290129 286237 283647 282114 281162 280338 279408 278474 277805 277468 277342 277426 277858 278538 279108 279424 279735 280143
$$ packed form
52964C33662j86k91qM28P06N60O8k45L2N19M19l69j033r92p09q91j409j597j338
52945C27326j084r59n64J66N89J89o43j061q01l85l57o43p94o46m97o13q38q66
52927C17519p18o73p82p85o02m96o60r16j002q41m41J41N81M73j5k10P2J03o19
52908C10129j444j403o17l2L4J52O06Q88N80L3k30k26k87n71r93j323j134j46
52890C04016J170J792J210K3q22r77p34n05m95o22n67j40L00K78lJ71Q40J110
52872C06045M94k35q9P93J583J974K182K091J407N11K52Q12J503J828J947J989
52856C25087J649Q39J7n06j081k067l104l541l246k654k227k265k936m051m920
52841B94994m865l892k590j533r52q24r30r34o69l37j26Q4M32O80N70L16L11M08
$$ plain form
52823 280143 280270 279786 278997 278484 278379 278418 278568 279039 279680 279884 279312 278339 277645 277714 278838 281162 284359 287551
52805 287551 289933 291327 291922 291737 290740 289266 287785 286277 284302 281798 279355 277451 275772 273667 271145
52790 271145 269013 268004 268012 268305 268329 268060 267682 267208 266605 266108 266135 266840 267932 268977 269763 270403 271265 272822
52772 272822 275166 277506 278502 277471 275165 273091 272228 272572 273630 274842 275642 275720 275370 275212 275444 275705 275761
52755 275761 275888 276392 277089 277549 277597 277357 277034 276888 277205 278020 279068 280197 281675 283819 286453 288993 291017
52738 291017 292533 293737 294708 295381 295689 295751 295929 296594 297728 298881 299608 299868 299983 300375 301351 302906 304583
52721 304583 305757 306219 306317 306444 306653 306821 306824 306359 305078 303220 301690 301092 300984 300590 299959 299795 300319 300888
52703 300888 300771 299777 298129 296229 294593 293549 292941 292552 292695 293823 295566 296888 297360 297549 297936 298210
$$ packed form
52823B80143J27m84p89n13j05L9J50M71O41K04n72r73o94O9J124K324L197L192
52805B87551K382J394N95j85r97j474j481j508j975k504k443j904j679k105k522
52790B71145k132j009QK93K4k69l78m74o03m97K7P05J092J045P86O40Q62J557
52772B72822K344K340R96j031k306k074q63L44J058J212Q00P8l50j58K32K61N6
52755B75761J27N04O97M60M8k40l23j46L17Q15J048J129J478K144K634K540K024
52738B91017J516J204R71O73L08O2J78O65J134J153P27K60J15L92R76J555J677
52721C04583J174M62R8J27K09J68Lm65j281j858j530n98j08l94o31j64N24N69
52703C00888j17r94j648j900j636j044o08l89J43J128J743J322M72J89L87K74
$$ plain form
52687 298210 298132 298337 299541 301446 303183 304570 306098 307837 309132 309492 309115 308421 307664 307220 307649 309053
52671 309053 310724 311809 312140 312181 312328 312541 312529 312055 311165 310284 309980 310376 310915 310938 310447 310067 310270 310880 311449
52652 311449 311932 312842 314764 317766 321192 324054 325710 326259 326251 325995 325288 323778 321475 318767 316096 313757
52636 313757 311965 310912 310714 311324 312496 313785 314760 315380 316091 317322 318962 320512 321740 322882 324189
52621 324189 325592 326881 327804 327787 325998 322194 317379 313200 310642 309526 309112 308792 308273 307615 307253 307649
52605 307649 308677 309614 309911 309759 309740 310134 310786 311426 311920 312298 312827 313915 315677 317623 319054 319841 320568
52588 320568 321776 323232 324176 324240 323926 324022 324697 325409 325695 325726 325924 326282 326469 326517 326994 328321 330173 331712
52570 331712 332290 331814 330631 329232 327994 327020 326193 325422 324715 324033 323263 322425 321760 321463 321403 321231 320657 319647
$$ packed form
52687B98210p8K05J204J905J737J387J528J739J295L60l77o94p57m44M29J404
52671C09053J671J085L31M1J47K13j2m74q90q81l04L96N39K3m91l80K03O10N69
52652C11449M83R10J922L002L426K862J656N49qk56p07j510k303k708k671k339
52636C13757j792j053j98O10J172J289R75O20P11J231J640J550J228J142J307
52621C24189J403J289R23j7j789l804m815m179k558j116m14l20n19o58l62L96
52605C07649J028R37K97j52j9L94O52O40M94L78N29J088J762J946J431P87P27
52588C20568J208J456R44O4l14R6O75P12K86L1J98L58J87M8M77J327J852J539
52570C31712N78m76j183j399j238r74q27p71p07o82p70q38o65k97o0j72n74j010
$$ plain form
52552 319647 318485 317699 317705 318374 319146 319653 319987 320243 320157 319529 318744 318406 318521 318441 317661 316366 315204 314829 315620
52533 315620 317428 319431 320564 320377 319380 318475 318216 318590 319214 319590 319431 318957 318698 318870 319202 319512 320096 321270
52515 321270 322865 324636 326951 330457 335082 339886 344023 347382 350083 351925 352746 352926 352951 352626 351267
52500 351267 348658 345316 341763 338031 334123 330516 327784 325936 324472 323046 321734 320724 320064 319810 320118
52485 320118 321005 322155 323103 323567 323604 323563 323964 325240 327344 329655 331487 332776 334115 336046 338441 340762
52469 340762 342778 344741 346844 348851 350488 351961 353756 356033 358522 360953 363174 364764 364947 363248
52455 363248 360053 356306 352737 349540 346555 343469 339966 336020 332082 328762 326317 324582 323276 322121
52441 322121 320754 318909 316768 314872 313543 312597 311733 310987 310649 310831 311273 311522 311296 310748 310415 310797 311893
$$ packed form
52552C19647j162p86OO69P72N07L34K56q6o28p85l38J15q0p80j295j162l75P91
52533C15620J808K003J133j87r97r05k59L74O24L76j59m74k59J72L32L10N84J174
52515C21270J595J771K315L506M625M804M137L359K701J842Q21J80K5l25j359
52500C51267k609l342l553l732l908l607k732j848j464j426j312j010o60k54L08
52485C20118Q87J150R48M64L7m1M01J276K104K311J832J289J339J931K395K321
52469C40762K016J963K103K007J637J473J795K277K489K431K221J590J83j699
52455C63248l195l747l569l197k985l086l503l946l938l320k445j735j306j155
52441C22121j367j845k141j896j329r46q64p46l38J82M42K49k26n48l33L82J096
$$ plain form
52424 311893 313212 314232 314788 315089 315457 316036 316641 316928 316873 317030 318131 320373 323280 326235 328997 331754
52408 331754 334899 338809 343601 349039 354851 361152 368311 376382 384888 393245 401135 408304 414261 418375
52394 418375 420193 419575 416654 411797 405528 398453 391237 384524 378643 373451 368755 364800 362053 360567
52380 360567 359924 359802 360164 360867 361632 362547 364086 366373 368991 371747 375077 379270 383867 388322 392692 397005
52364 397005 400460 402095 402029 401197 400053 398410 396555 395500 395812 396957 398175 399334 400527 401484 401986 402465
52348 402465 403566 405307 407183 408994 411027 413482 416120 418605 420899 423190 425628 428246 431048 434074
52334 434074 437403 441202 445761 451470 458586 466956 476009 485192 494399 503950 514265 525636 538112
52321 538112 551312 564476 576979 588777 600094 610886 621116 631492 643206 656684 671171
$$ packed form
52424C11893J319J020N56L01L68N79O05K87n5J57J101K242K907K955K762K757
52408C31754L145L910M792N438N812O301P159Q071Q506Q357P890P169N957M114
52394D18375J818o18k921m857o269p075p216o713n881n192m696l955k747j486
52380C60567o43j22L62P03P65R15J539K287K618K756L330M193M597M455M370M313
52364C97005L455J635o6q32j144j643j855j055L12J145J218J159J193R57N02M79
52348D02465J101J741J876J811K033K455K638K485K294K291K438K618K802L026
52334D34074L329L799M559N709P116Q370R053R183R207R551J0315J1371J2476
52321E38112J3200J3164J2503J1798J1317J0792J0230J0376J1714J3478J4487
$$ plain form
52310 671171 686020 701920 720254 741444 764505 788206 812109 836374 861074 886041 911181
52299 911181 936677 962851 989796 1016959 1043096 1066913 1087982 1106905 1124475 1140789 1155339
52288 1155339 1167782 1178345 1187539 1195725 1203065 1209609 1215249 1219707 1222816 1224773 1225935 1226389 1225920 1224396
52274 1224396 1221943 1218736 1214895 1210657 1206363 1202055 1197449 1192611 1188425 1185904 1185107 1185195 1185606 1186748 1189352
52259 1189352 1193526 1198777 1204812 1211989 1220951 1232020 1245030 1259666 1275780 1293261 1311643 1330117
52247 1330117 1348043 1365288 1381840 1397314 1411156 1423207 1433733 1442979 1451058 1458201 1464664 1470299
52235 1470299 1474621 1477336 1478470 1477959 1475677 1472027 1467823 1463138 1456779 1447492 1435424 1421853 1407715
52222 1407715 1392999 1377541 1361688 1345918 1330225 1314227 1297734 1281045 1264784 1249557 1235699
$$ packed form
52310F71171J4849J5900J8334K1190K3061K3701K3903K4265K4700K4967K5140
52299I11181K5496K6174K6945K7163K6137K3817K1069J8923J7570J6314J4550
52288A155339J2443J0563R194Q186P340O544N640M458L109J957J162M54m69j524
52274A224396k453l207l841m238m294m308m606m838m186k521p97Q8M11J142K604
52259A189352M174N251O035P177Q962J1069J3010J4636J6114J7481J8382J8474
52247A330117J7926J7245J6552J5474J3842J2051J0526R246Q079P143O463N635
52235A470299M322K715J134n11k282l650m204m685o359r287j2068j3571j4138
52222A407715j4716j5458j5853j5770j5693j5998j6493j6689j6261j5227j3858
$$ plain form
52211 1235699 1223249 1212140 1202322 1193649 1185886 1178973 1173167 1168644 1165112 1162191 1160155 1159902 1161941 1165675
52197 1165675 1169862 1173703 1177331 1181408 1186490 1192757 1200095 1208195 1216494 1224171 1230414 1234862 1237761 1239599
52183 1239599 1240561 1240370 1238593 1234991 1229643 1222866 1215106 1206861 1198661 1190973 1183941 1177212 1170216 1162786
$$ packed form
52211A235699j2450j1109r818q673p763o913n806m523l532k921k036k53K039L734
52197A165675M187L841L628M077N082O267P338Q100Q299P677O243M448K899J838
52183A239599R62j91j777l602n348o777p760q245q200p688p032o729o996p430
$$ [...]
##END NTUPLES=NMR SPECTRUM
##END=
