##TITLE=AC1736_SEN00009_9276107_yGntWwyj9m
##JCAMPDX= 6.0         $$ Bruker NMR JCAMP-DX V2.0
##DATA TYPE= NMR SPECTRUM
##DATA CLASS= NTUPLES
##ORIGIN= BRUKER
##OWNER= Administrator
$$ 1.72 TOPSPIN		Version 2.1
$$ 2015-07-15 03:06:44.744 -0700  Administrator@X
$$ Compression mode = diff/dup
##.OBSERVE FREQUENCY= 400.02188249412
##.OBSERVE NUCLEUS= ^1H
##.ACQUISITION MODE= SIMULTANEOUS (DQD)
##.ACQUISITION SCHEME= undefined
##.AVERAGES= 64
##.DIGITISER RES= 22
##SPECTROMETER/DATA SYSTEM= spect
##.PULSE SEQUENCE= noesygpps1d.comp
##.SOLVENT NAME= COFFEE_meoh
##.SHIFT REFERENCE= INTERNAL, COFFEE_meoh, 1, 14.96108
##AUDIT TRAIL= $$ (NUMBER, WHEN, WHO, WHERE, PROCESS, VERSION, WHAT)
$$ ##TITLE= Audit trail, TOPSPIN		Version 2.1
$$ ##JCAMPDX= 5.01
$$ ##ORIGIN= Bruker BioSpin GmbH
$$ ##OWNER= Administrator
$$ $$ E:\/data/COFFEE/nmr/AC1736_SEN00009_9276107_yGntWwyj9m/12/pdata/1/auditp.txt
$$ ##AUDIT TRAIL=  $$ (NUMBER, WHEN, WHO, WHERE, PROCESS, VERSION, WHAT)
(   1,<2015-07-15 03:06:39.854 -0700>,<Administrator>,<X>,<go>,<TOPSPIN 2.1>,
      <created by zg
	started at 2015-07-15 02:55:09.994 -0700,
	POWCHK enabled, PULCHK disabled,
       configuration hash MD5:
       21 0F 79 D6 B3 7B B4 F6 88 20 88 DB 03 48 BD 9F
       data hash MD5: 64K
       07 73 98 E6 E3 1A E5 49 7B 2E 6A 2B E2 60 DC D4>)
(   2,<2015-07-15 03:06:42.994 -0700>,<Administrator>,<X>,<proc1d>,<TOPSPIN 2.1>,
      <Start of raw data processing
       efp LB = 0.3 FT_mod = 6 PKNL = 1 PHC0 = 0 PHC1 = 0 SI = 128K 
       data hash MD5: 128K
       0F DD 7C 4A 52 90 D7 D4 F5 3A 4A F8 C9 3A 7B B7>)
(   3,<2015-07-15 03:06:43.885 -0700>,<Administrator>,<X>,<proc1d>,<TOPSPIN 2.1>,
      <pk PHC0 = -88.85742 PHC1 = 0 
       data hash MD5: 128K
       BC 97 0F 66 81 ED D5 23 19 FB 87 A9 40 C1 30 2D>)
(   4,<2015-07-15 03:06:44.244 -0700>,<Administrator>,<X>,<proc1d>,<TOPSPIN 2.1>,
      <abs ABSG = 1 
       data hash MD5: 128K
       CF 9F A8 03 A7 F0 DD 6E 25 B9 C2 73 F1 0F 0F CA>)
(   5,<2015-07-15 03:06:44.338 -0700>,<Administrator>,<X>,<proc1d>,<TOPSPIN 2.1>,
      <abs ABSG = 2 
       data hash MD5: 128K
       E3 53 49 CE 06 DA 0F 54 27 F3 73 09 0F 09 99 0A>)
(   6,<2015-07-15 03:06:44.416 -0700>,<Administrator>,<X>,<proc1d>,<TOPSPIN 2.1>,
      <abs ABSG = 3 
       data hash MD5: 128K
       50 5B 10 1B B7 9A 19 9D AC C7 2F DF 49 BF 95 E3>)
(   7,<2015-07-15 03:06:44.494 -0700>,<Administrator>,<X>,<proc1d>,<TOPSPIN 2.1>,
      <abs ABSG = 4 
       data hash MD5: 128K
       7E D9 1A BF 31 3F 08 B4 4B 3B 69 FC 01 47 35 B9>)
(   8,<2015-07-15 03:06:44.572 -0700>,<Administrator>,<X>,<proc1d>,<TOPSPIN 2.1>,
      <abs ABSG = 5 
       data hash MD5: 128K
       92 E8 DB D3 76 22 85 48 A1 D4 8F C5 5C A8 D3 1D>)
$$ ##END=
$$ 
$$ $$ hash MD5
$$ $$ D4 A9 99 40 5E 9E 73 51 73 DF 00 95 19 11 ED 7F
##$RELAX= 
##$RELAX= 
##$RELAX= 
##$RELAX= 
##$RELAX= 
##$RELAX= 
##$RELAX= 
##$RELAX= 
$$ Bruker specific parameters
$$ --------------------------
##$DU= <E:\>
##$EXPNO= 12
$$ [...]
##$TP07= 0
##$TPNAME0= <>
##$TPNAME1= <>
##$TPNAME2= <>
##$TPNAME3= <>
##$TPNAME4= <>
##$TPNAME5= <>
##$TPNAME6= <>
##$TPNAME7= <>
##$TPOAL= (0..7)
0.5 0.5 0.5 0.5 0.5 0.5 0.5 0.5
##$TPOFFS= (0..7)
0 0 0 0 0 0 0 0
##$TUNHIN= 0
##$TUNHOUT= 0
##$TUNXOUT= 0
##$USERA1= <user>
##$USERA2= <user>
##$USERA3= <user>
##$USERA4= <user>
##$USERA5= <user>
##$V9= 5
##$VALIST= <valist>
##$VCLIST= <CCCCCCCCCCCCCCC>
##$VD= 0
##$VDLIST= <DDDDDDDDDDDDDDD>
##$VPLIST= <PPPPPPPPPPPPPPP>
##$VTLIST= <TTTTTTTTTTTTTTT>
##$WBST= 2048
##$WBSW= 25
##$XGAIN= (0..3)
0 0 0 0
##$XL= 0
##$YL= 0
##$YMAX_a= 7034280
##$YMIN_a= -13250095
##$ZGOPTNS= <>
##$ZL1= 120
##$ZL2= 120
##$ZL3= 120
##$ZL4= 120
##$ABSF1= 14.96108
##$ABSF2= -5.597102
##$ABSG= 5
##$ABSL= 3
##$ALPHA= 0
##$AQORDER= 0
##$ASSFAC= 0
##$ASSFACI= 0
##$ASSFACX= 0
##$ASSWID= 0
##$AUNMP= <proc_prof1d_extract.lims>
##$AXLEFT= 0
##$AXNAME= <>
##$AXNUC= <1H>
##$AXRIGHT= 0
##$AXTYPE= 0
##$AXUNIT= <>
##$AZFE= 0.1
##$AZFW= 0.1
##$BCFW= 0
##$BC_mod= 0
##$BYTORDP= 0
##$COROFFS= 0
##$CY= 15
##$DATMOD= 1
##$DC= 0
##$DFILT= <>
##$DTYPP= 0
##$F1P= 0
##$F2P= 0
##$FCOR= 0.5
##$FTSIZE= 131072
##$FT_mod= 6
##$GAMMA= 0
##$GB= 0
##$INTBC= 1
##$INTSCL= 1
##$ISEN= 128
##$LB= 0.3
##$LEV0= 0
##$LPBIN= 0
##$MAXI= 10000
##$MC2= 0
##$MEAN= 0
##$ME_mod= 0
##$MI= 0
##$NCOEF= 0
##$NC_proc= -2
##$NLEV= 6
##$NOISF1= 0
##$NOISF2= 0
##$NSP= 0
##$NTH_PI= 0
##$NZP= 0
##$OFFSET= 14.96108
##$PC= 1
##$PHC0= -88.85742
##$PHC1= 0
##$PH_mod= 1
##$PKNL= yes
##$PPARMOD= 0
##$PPDIAG= 0
##$PPIPTYP= 0
##$PPMPNUM= 2147483647
##$PPRESOL= 1
##$PSCAL= 4
##$PSIGN= 0
##$PYNMP= <proc.py>
##$REVERSE= no
##$SF= 400.020009605853
##$SI= 131072
##$SIGF1= 0
##$SIGF2= 0
##$SINO= 400
##$SIOLD= 131072
##$SPECTYP= <>
##$SREGLST= <1H.CDCl3>
##$SSB= 0
##$STSI= 131072
##$STSR= 0
##$SW_p= 8223.68421052631
##$SYMM= 0
##$S_DEV= 0
##$TDeff= 65536
##$TDoff= 0
##$TI= <>
##$TILT= no
##$TM1= 0
##$TM2= 0
##$TOPLEV= 0
##$USERP1= <user>
##$USERP2= <user>
##$USERP3= <user>
##$USERP4= <user>
##$USERP5= <user>
##$WDW= 1
##$XDIM= 131072
##$YMAX_p= 410965451
##$YMIN_p= -11688
##$CURPLOT= <Network HP LaserJet P1505>
##$CURPRIN= <$Network HP LaserJet P1505>
##$DFORMAT= <normdp>
##$LAYOUT= <+/1D_H.xwp>
##$LFORMAT= <normlp>
##$PFORMAT= <normpl>
##$SURQMSG= 1
$$ End of Bruker specific parameters
$$ ---------------------------------
##NTUPLES= NMR SPECTRUM
##VAR_NAME=  FREQUENCY,     SPECTRUM/REAL,   SPECTRUM/IMAG
##SYMBOL=    X,             R,               I
##VAR_TYPE=  INDEPENDENT,   DEPENDENT,       DEPENDENT
##VAR_FORM=  AFFN,          ASDF,            ASDF
##VAR_DIM=   131072,        131072,          131072
##UNITS=     HZ,            ARBITRARY UNITS, ARBITRARY UNITS
##FACTOR=    0.0627417313425164, 1,          1
##FIRST=     8223.62146879497, 32,           -62030
##LAST=      0,             740,             -62014
##MIN=       0,             -11688,          0
##MAX=       8223.62146879497, 410965451,    0
$$ Real data points
##PAGE= N=1
##DATA TABLE= (X++(R..R)), XYDATA
$$ [...]
63822F31213k8302k5392k2678k0315j8691j7701j6578j4810j2797j1120r691q203
$$ 631213 602911 577519 554841 534526 515835 498134 481556 466746 453949 442829 433138 424935
63810D24935o972o544o799p113p210p146o674n494m114l552m014m534m272l551
$$ 424935 417963 411419 404620 397507 390297 383151 376477 370983 366869 363317 359303 354769 350497 346946
63796C46946l232l550m000m105l901l737l810l939l737l122k518k422k807l251
$$ 346946 343714 340164 336164 332059 328158 324421 320611 316672 312935 309813 307295 304873 302066 298815
63782B98815l497l581l481l053k327j528p70n4L97K50m01j008j227j284j429j434
$$ 298815 295318 291737 288256 285203 282876 281348 280578 280524 280921 281171 280770 279762 278535 277251 275822 274388
63766B74388r66k57M3l45r93j296j167r93j071j228j116o85k26PK3oQ1L56O92
$$ 274388 273422 273165 273208 272863 271870 270574 269407 268414 267343 266115 264999 264314 264088 264095 264118 264112 264193 264549 265241
63747B65241P58L96L7L47J380K472L095L370L526L376K791K204K053K068J757
$$ 265241 265999 266395 266432 266779 268159 270631 273726 277096 280622 283998 286789 288993 291046 293114 294871
63732B94871J374J700K893M154M633M191L299K667K919M057N214N457M916M544
$$ 294871 296245 297945 300838 304992 309625 313816 317115 319782 322701 326758 331972 337429 342345 346889
63718C46889M729M838M311L491K915K364J333k3j031j452j652j869j844j427j056
$$ 346889 351618 356456 360767 364258 367173 369537 370870 370847 369816 368364 366712 364843 362999 361572 360516
63703C60516j301k007k243j289M08J546J326L19k10L10J420K448L150L421K991
$$ 360516 359215 357208 354965 353676 354084 355630 356956 357275 357065 357375 358795 361243 364393 367814 370805
63688C70805J885Q07N29R81J326R62J27n46p89q29r12q78k70J007K234K304R25
$$ 370805 372690 373497 374026 375007 376333 377295 377422 376876 376087 375258 374346 373468 373198 374205 376439 378743 379668
63671C79668q42j538p18Q62K369L586M400M221K612K29j560k075j940k123k838
$$ 379668 378826 377288 376570 377432 379801 383387 387787 392008 394620 394849 393289 391214 389274 387151 384313
63656C84313l593l990m122m320m794n380n519m722l295k275k265k601k166q30
$$ 384313 380720 376730 372608 368288 363494 358114 352595 347873 344578 342303 340038 337437 335271 334441
63642C34441M97J150J409J757K164K415K653L116L671M006M148M373M721M979
$$ 334441 334938 336088 337497 339254 341418 343833 346486 349602 353273 357279 361427 365800 370521 375500
63628C75500N048N078N221N524O008O729P648Q579R311R757J0040J0433J1163
$$ 375500 380548 385626 390847 396371 402379 409108 416756 425335 434646 444403 454443 464876 476039
63615D76039J2284J3750J5484J7298J8892K0184K1497K3172K5096K6836K8103
$$ 476039 488323 502073 517557 534855 553747 573931 595428 618600 643696 670532 698635
63604F98635K8752K8500K7050K4435K0900J6560J1591O528J854k463o391r075
$$ 698635 727387 755887 782937 807372 828272 844832 856423 862951 864805 862342 855951 846876
63592H46876r655q767q140q525r159r609j0815j3555j6885j9220k0221k0651k0911
$$ 846876 837221 828454 820314 811789 802630 793021 782206 768651 751766 732546 712325 691674 670763
63579F70763k0717j9857j8358j6163j3480j1118r658q522o699m169j813j51J034
$$ 670763 650046 630189 611831 595668 582188 571070 561412 552890 546191 542022 540209 540058 541092
63566E41092J947K560L028L569L991M013L989M498N377N939O120O585P686R190
$$ 541092 543039 545599 548627 552196 556187 560200 564189 568687 574064 580003 586123 592708 600394 609584
63552F09584J0991J3265J5818J8170K0462K3427K7299L1550L5871M0349M4224
$$ 609584 620575 633840 649658 667828 688290 711717 739016 770566 806437 846786 891010
63541H91010M5417M2084L4218K3356J1311k45r614j5441j7463j6601j4395j2336
$$ 891010 936427 978511 1012729 1036085 1047396 1047151 1037537 1022096 1004633 988032 973637 961301
63529I61301j1289j1165j1285j1322j1712j3218j6231k0481k5030k8645l0613
$$ 961301 950012 938847 927562 916240 904528 891310 875079 854598 829568 800923 770310
63518G70310l1250l1228l0562k8887k6555k4573k3229k1649j9128j6153j3611
$$ 770310 739060 707832 677270 648383 621828 597255 574026 552377 533249 517096 503485
63507E03485j1672j0068q924q506q425p866o607n297m672m823n171m986m035k924
$$ 503485 491813 481745 472821 464315 455890 448024 441417 436120 431448 426625 421454 416468 412433 409509
63493D09509k529k901l062k249j009m72p46p58K08J494K003J674J444J903K639
$$ 409509 406980 404079 401017 398768 397759 397287 396541 395783 395991 397485 399488 401162 402606 404509 407148
63478D07148L114L519M284N115N275M738M283M241L895K545O19q64j553j874k243
$$ 407148 410262 413781 418065 423180 428455 433193 437476 441717 445612 448157 448776 447912 446359 444485 442242
63463D42242k700l191l610l668l209k516j988j677j463j359j223o18N33J578K045
$$ 442242 439542 436351 432741 429073 425864 423348 421360 419683 418220 416861 415638 415020 415553 417131 419176
63448D19176K428L377M566N263N638O413P544Q309Q606R026R756J0550J1794J4380
$$ 419176 421604 424981 429547 434810 440448 446861 454405 462714 471320 480346 490102 500652 512446 526826
63434E26826J8360K2903K7737L3192L8407M0830L8447L1745K2958J4231P015K162
$$ 526826 545186 568089 595826 629018 667425 708255 746702 778447 801405 815636 822651 824813
63422H24813l25j133p05J122M337Q423J3137J8603K4244K8602L0797L1231L0257
$$ 824813 824488 823355 822650 823772 828109 836532 849669 868272 892516 921118 951915 983146 1013403
63409A013403K7262K1780J4550O701j106p912j2055j2881j2041j1744j2317j2690
$$ 1013403 1040665 1062445 1076995 1083696 1082590 1074678 1062623 1049742 1037701 1025957 1013640 1000950
63397A000950j2627j3089j4677j7173k0427k4396k8243l0620l1101l0468k9542
$$ 1000950 988323 975234 960557 943384 922957 898561 870318 839698 808597 778129 748587
63386G48587k8464k7131k5524k3539k1190j8909j6963j4777j1688q228n665m244
$$ 748587 720123 692992 667468 643929 622739 603830 586867 572090 560402 552174 546509 542265
63374E42265k870o98J849L923N309O297P222Q450J0279J2409J3965J4462J4460
$$ 542265 539395 538697 540546 544469 549778 556075 563297 571747 582026 594435 608400 622862 637322
63361F37322J5061J6884J9684K2760K5615K8216L0718L2961L4573L5504L5928
$$ 637322 652383 669267 688951 711711 737326 765542 796260 829221 863794 899298 935226
63350I35226L5414L2853K7785K1227J4572Q167J792l980p976r923j0789j1512
$$ 935226 970640 1003493 1031278 1052505 1067077 1075244 1077036 1073056 1065080 1055157 1044368 1032856
63338A032856j2200j2691j3204j4124j5672j7882k0563k3268k5683k7853k9589
$$ 1032856 1020656 1007965 994761 980637 964965 947083 926520 903252 877569 849716 820127
63327H20127l0042k8584k5880k3195k0804j8009j4606j1150p615l162K080N962
$$ 820127 790085 761501 735621 712426 691622 673613 659007 647857 640242 637080 639160 645122
63315F45122N942J444n868j3564j9630k2889k3257k1782j9868j8256j6794j4994
$$ 645122 651064 652508 646640 633076 613446 590557 567300 545518 525650 507394 490600 475606
63303D75606j2648j0054p798o240n147m009k748j859j781k385l189l800m087m068
$$ 475606 462958 452904 445106 438866 433719 429710 426962 425103 423322 420937 417748 413948 409861 405793
63289D05793l858l584l302l062k918k788k495k140k178k763l231k761j440j82
$$ 405793 401935 398351 395049 391987 389069 386281 383786 381646 379468 376705 373474 370713 369273 369091
63275C69091M12O41J076J761K234K062J314O70Q97J980K964L011K463K342K983
$$ 369091 369503 370144 371220 372981 375215 377277 378591 379261 380158 382138 385102 388113 390576 392918 395901
63260C95901L735L964L752L575L768M395N190N615N387M953M957N367N662N807
$$ 395901 399636 403600 407352 410927 414695 419090 424280 429895 435282 440235 445192 450559 456221 462028
63246D62028O296P165P797P938Q191R137J0570J2018J3425J4944J6454J7832J9389
$$ 462028 468324 475489 483286 491224 499415 508552 519122 531140 544565 559509 575963 593795 613184
63233F13184K1478K3952K6330K8390L0172L1564L2312L2396L2189L2090L2139
$$ 613184 634662 658614 684944 713334 743506 775070 807382 839778 871967 904057 936196
63222I36196L2020L1447L0574K9884K9620K9502K9221K8983K9164K9614K9777
$$ 936196 968216 999663 1030237 1060121 1089741 1119243 1148464 1177447 1206611 1236225 1266002
63211A266002K9395K8576K7072K4138J9350J3165O370p26q302j6455k4843l2765
$$ 1266002 1295397 1323973 1351045 1375183 1394533 1407698 1414068 1413342 1405040 1388585 1363742 1330977
63199A330977l9394m4124m6809m7739m7309m5807m3359l9968l5661l0789k5943
$$ 1330977 1291583 1247459 1200650 1152911 1105602 1059795 1016436 976468 940807 910018 884075
63188H84075k1428j7028j2539q239m472r96K727O736J0483J3473J5582J6863J7489
$$ 884075 862647 845619 833080 824841 820369 819373 822100 828836 839319 852792 868374 885237 902726
63175I02726J7807J8070J8142J7803J7138J6298J5226J4006J3131J2768J2186
$$ 902726 920533 938603 956745 974548 991686 1007984 1023210 1037216 1050347 1063115 1075301
63164A075301J0645Q481O506M551J635k562p311j1875j6046j9671k2671k5521
$$ 1075301 1085946 1094427 1100933 1105484 1107119 1104557 1097246 1085371 1069325 1049654 1026983 1001462
63152A001462k8695l1532l2767l2253l1100k9956k8397k6289k4345k2756k0640
$$ 1001462 972767 941235 908468 876215 845115 815159 786762 760473 736128 713372 692732
63141F92732j7648j4853j3124j1758r794p688o427n775m732l196j875r22J26J298
$$ 692732 675084 660231 647107 635349 625555 617867 611440 605665 600933 597737 595862 594940 595066 596364
63127E96364K232L051M106M991M893M056L715M422N340N532N168N006N306N678
$$ 596364 598596 601647 605753 610744 615637 619693 623408 627830 633170 638702 643870 648876 654182 659860
63113F59860N625M984M027L322L216L416L276K460J122l36j427j713j247p43q68
$$ 659860 665485 670469 674496 677818 681034 684450 687726 690186 691308 690972 689545 687832 686585 685842 684974
63098F84974j412j611j141l60L21Q33J234J537J831K206K607L030L644M359M538
$$ 684974 683562 681951 680810 680450 680771 681604 682838 684375 686206 688412 691019 694049 697693 702052 706590
63083G06590L707K345J386J092J091J370K379L955N089N193N019N734P450R184
$$ 706590 710297 712642 714028 715120 716211 717581 719960 723915 729004 734197 739216 744950 752400 761584
63069G61584J0050J0079J0036J0711J2358J4542J6611J8383K0232K2436K4806
$$ 761584 771634 781713 791749 802460 814818 829360 845971 864354 884586 907022 931828
63058I31828K7129K9668L2782L6329L9835M3211M6882N1091N5547N9865O4030
$$ 931828 958957 988625 1021407 1057736 1097571 1140782 1187664 1238755 1294302 1354167 1418197
63047A418197O8183P2163P5567P8125P9724Q0237P9708P8668P7791P7028P5527
$$ 1418197 1486380 1558543 1634110 1712235 1791959 1872196 1951904 2030572 2108363 2185391 2260918
63036B260918P2791O9587O7339O6616O6638O6223O4907O2974O0588N7101N1293
$$ 2260918 2333709 2403296 2470635 2537251 2603889 2670112 2735019 2797993 2858581 2915682 2966975
63025B966975M2393L0781J7522L188j2396k9174m6132o1998p6178q8444r8127
$$ 2966975 3009368 3040149 3057671 3060859 3048463 3019289 2973157 2911159 2834981 2746537 2648410
63014B648410j04446j07480j07986j06216j01798r4850q6400p7343o7693n7368
$$ 2648410 2543964 2436484 2328498 2222282 2120484 2025634 1939234 1861891 1794198 1736830
63004A736830m7001l7438k8815k0632j2542m680K523Q601J3327J6961K0008K2574
$$ 1736830 1689829 1652391 1623576 1602944 1590402 1585722 1588245 1596846 1610173 1627134 1647142 1669716
62992A669716K4368K5386K6184K7212K8309K9051K9198K8590K7166K5346K3803
$$ 1669716 1694084 1719470 1745654 1772866 1801175 1830226 1859424 1888014 1915180 1940526 1964329
62981A964329K2415J9962J5462R328K681m096j1506j9898k8917l7847m5968n2541
$$ 1964329 1986744 2006706 2022168 2031496 2034177 2030081 2018575 1998677 1969760 1931913 1885945 1833404
62969A833404n7061n9625o0832o1216o0911n9806n7856n5253n2290m9076m5501
$$ 1833404 1776343 1716718 1655886 1594670 1533759 1473953 1416097 1360844 1308554 1259478 1213977
62958A213977m1732l8494l6341l4827l3048l0933k9215k8023k6526k4352k2393
$$ 1213977 1172245 1133751 1097410 1062583 1029535 998602 969387 941364 914838 890486 868093
62947H68093k1495k1208k0587j9588j8672j7675j6050j4044j2518j1679j0817
$$ 868093 846598 825390 804803 785215 766543 748868 732818 718774 706256 694577 683760
62936F83760r478q102p349p237p166o534n295m064l527l607l508k741j665p70
$$ 683760 674282 666180 658831 651594 644428 637894 632599 628535 625008 621401 617893 615152 613487 612717
62922F12717m9M89L73o20j782k268k160k068k131k155k276k658k863k490k043
$$ 612717 612668 613157 613530 612910 611128 608860 606700 604632 602501 600346 598070 595412 592549 590059 588016
62907E88016k251k801k772k158j824k010k031j574j173j137j041o62m49n74m19
$$ 588016 585765 582964 580192 578034 576210 574200 572169 570595 569422 568285 567244 566582 566133 565559 565140
62892E65140M33J297J170k8j476k370k499k111j606j098l02R65K212K672K298
$$ 565140 565573 566870 568040 568012 566536 564166 561667 559556 557950 556852 556550 557515 559727 562399 564697
62877E64697J831J783J872J573P82k28j043j257q36l82n79j302j809j757j489
$$ 564697 566528 568311 570183 571756 572538 572310 571267 570010 569174 568792 568213 566911 565102 563345 561856
62862E61856j301j142j034j045q67j74M87J81p90r02M70J978K143J376J124J673
$$ 561856 560555 559413 558379 557334 556467 556293 556780 556961 556171 555269 555739 557717 559860 561236 562360 564033
62846E64033J979J452P03M43M97L30j38n89q91j219j637j812j287j01J001J233
$$ 564033 566012 567464 568167 568610 569107 569437 569299 568710 567819 566600 564963 563151 561864 561763 562764 563997
62830E63997O30km4L92R19J446K022K516K772K962L431M293N268N893N839N249
$$ 563997 564627 564625 564581 564973 565892 567338 569360 571876 574648 577610 581041 585334 590602 596495 602334 607583
62814F07583M678M502M475M230M055M565N605O278O242O171O574O985O961P148
$$ 607583 612261 616763 621238 625468 629523 634088 639693 645971 652213 658384 664958 671943 678904 686052
62800F86052Q455J0558J2132J2491J2187J2029J2286J2971J4208J5991J8047K0245
$$ 686052 694507 705065 717197 729688 741875 753904 766190 779161 793369 809360 827407 847652
62788H47652K2864K6193L0146L4400L8774M3284M8012N3089N8703O4994P1998
$$ 847652 870516 896709 926855 961255 1000029 1043313 1091325 1144414 1203117 1268111 1340109
62777A340109P9603Q7486R5102J01932J07846J13087J17818J21661J23786J23376
$$ 1340109 1419712 1507198 1602300 1704232 1812078 1925165 2042983 2164644 2288430 2411806
62767B411806J20048J13795J04509R1733P5074N4992L2912J0403j1687l3122n3545
$$ 2411806 2531854 2645649 2750158 2841891 2916965 2971957 3004869 3015272 3003585 2970463 2916918
62756B916918p2153q8164j01291j11579j18924j23013j23851j22154j19046j15255
$$ 2916918 2844765 2756601 2655310 2543731 2424807 2301794 2177943 2055789 1936743 1821488
62746A821488j10711j04979r8040r0501q3086p6120o9491o2973n6501n0279m4741
$$ 1821488 1710777 1605798 1507758 1417257 1334171 1258051 1188560 1125587 1069086 1018807 974066
62735I74066m0236l6659l3347k9596k5340k1302j8345j6635j5447j3859j1637
$$ 974066 933830 897171 863824 834228 808888 787586 769241 752606 737159 723300 711663
62724G11663r385p799o878n931m396k514j090n45l53M58K238M433O337P817R154
$$ 711663 702278 694479 687601 681670 677274 674760 673670 673125 672772 673230 675468 679901 686238 694055 703209
62709G03209J0560J2188J4275J6816J9346K1495K3599K6259K9421L2635L5967
$$ 703209 713769 725957 740232 757048 776394 797889 821488 847747 877168 909803 945770
62698I45770L9805M3814M7080M9593N2520N6557O0938O4627O7525O9770P0736
$$ 945770 985575 1029389 1076469 1126062 1178582 1235139 1296077 1360704 1428229 1497999 1568735
62687A568735O9756O7086O3121N7216M8519L7506K5498J2863j001j5920l0400
$$ 1568735 1638491 1705577 1768698 1825914 1874433 1911939 1937437 1950300 1949299 1933379 1902979
62676A902979m3036n3496o1876o8139p2415p5110p6329p5818p3659p0434o6564
$$ 1902979 1859943 1806447 1744571 1676432 1604017 1528907 1452578 1376760 1303101 1232667 1166103
62665A166103o2183n7600n3150m8565m3373l8055l3814l0972k8519k5656k2776
$$ 1166103 1103920 1046320 993170 944605 901232 863177 829363 798391 769872 744216 721440
62654G21440k0534j8809j7226j5855j4763j3542j1917j0303r130q160p050o072
$$ 721440 700906 682097 664871 649016 634253 620711 608794 598491 589361 581201 574151 568079
62642E68079n615n444n040m338l542k587j392l13K17K51P0l52j079j739j897j676
$$ 568079 562464 557020 551980 547642 544100 541513 540121 539808 540025 540276 540346 539994 538915 537176 535279 533603
62626E33603j504j459j322j133j115j185r45j91R86K400L834M968N597N813N758
$$ 533603 532099 530640 529318 528185 527070 525885 524940 524749 525735 528135 531969 536937 542534 548347 554105
62611E54105N463N108N153N843O864P833Q815R943J0898J1408J2050J3852J6975
$$ 554105 559568 564676 569829 575672 582536 590369 599184 609127 620025 631433 643483 657335 674310
62598F74310K0378K3063K5280K8131L2161L6671M0593M3813M7296N1680N6182
$$ 674310 694688 717751 743031 771162 803323 839994 880587 924400 971696 1023376 1079558
62587A079558N9297O0537O0752O0600N9338N5684M9364M1219L1962K1576J0062
$$ 1079558 1138855 1199392 1260144 1320744 1380082 1435766 1485130 1526349 1558311 1579887 1589949
62576A589949j816j3000k3130l2589m1461m8872n3787n6263n7375n7827n7355
$$ 1589949 1588133 1575133 1552003 1519414 1477953 1429081 1375294 1319031 1261656 1203829 1146474
62565A146474n5768n3796n2113n0084m6540m1613l6693l2559k8665k4588k1029
$$ 1146474 1090706 1036910 984797 934713 888173 846560 809867 777308 748643 724055 703026
62554G03026j8712j7175j5483j3587j2115j1212j0361r221q029p112o448n813
$$ 703026 684314 667139 651656 638069 625954 614742 604381 595160 587131 580019 573571 567758
62542E67758n048m115l064j972r81m20o50j530k242k112j420r04o69k83K40N10
$$ 567758 562710 558595 555531 553559 552578 552158 551508 549978 547736 545624 544204 543300 542631 542348 542588 543098
62526E43098P85J933M045O118P523Q872J0863J3148J4988J6349J7641J9028K0662
$$ 543098 543883 545816 549861 555979 563502 572374 583237 596385 611373 627722 645363 664391 685053
62513F85053K2993K6138K9452L2350L5060L7933M0630M2666M4219M5513M5923
$$ 685053 708046 734184 763636 795986 831046 868979 909609 952275 996494 1042007 1087930
62502A087930M4611M1670L7769L2998K6996K0088J3308P249J768l094o629q265
$$ 1087930 1132541 1174211 1211980 1244978 1271974 1292062 1305370 1312619 1314387 1311293 1304664 1296399
62490A296399q306p540o329m307r34L639Q435J2607J6381K0572K5106K8653K9835
$$ 1296399 1288093 1280553 1274224 1269917 1268983 1272622 1281057 1293664 1310045 1330617 1355723 1384376 1414211
62477A414211K8129K3523J6328P863K58n452j0532j7094k5853l5867m5655n3711
$$ 1414211 1442340 1465863 1482191 1490054 1490312 1484860 1474328 1457234 1431381 1395514 1349859 1296148
62465A296148n8703o0495o0625o0719o0541n8635n4646m9855m5395m1049l6106
$$ 1296148 1237445 1176950 1116325 1055606 995065 936430 881784 831929 786534 745485 709379
62454G09379l0603k5284k0834j7355j4378j1322q185n595l947k822j589j82J143
$$ 709379 678776 653492 632658 615303 600925 589603 581418 575823 571876 569054 567465 567283 568426
62441E68426K278L091L368L469M312N992P122O550M945L568K193k68l449n557
$$ 568426 570704 573795 577163 580632 584944 590936 598058 604608 609553 613121 615314 615046 611597 606040
62427F06040n820n517o152p755r354j0153r859q656p258o359n837n097m236m022
$$ 606040 600220 594703 588551 580796 571442 561289 551430 542774 535516 529157 523320 518223 513987 509965
62413E09965m661n380n438m856l990l107k517k477k733k756k466k151j766j041
$$ 509965 505304 499924 494486 489630 485640 482533 480016 477539 474806 472050 469584 467433 465667 464626
62399D64626k08K28M09R26J750K236K306K599L324L885L870L545L171K734K525
$$ 464626 464418 464646 465055 465981 467731 469967 472273 474872 478196 482081 485951 489496 492667 495401 497926
62384D97926L062M091M632M400M286N029O191O971P243P314P273P093O829O433
$$ 497926 500988 505079 509711 514111 518397 523426 529617 536588 543831 551145 558418 565511 572340 578773
62370E78773N898N728O590Q332J0130J1762J3770J6144J8072J9422K1366K4675
$$ 578773 584671 590399 596989 605321 615451 627213 640983 657127 675199 694621 715987 740662
62358G40662K8444L1500L4298L8191M3288M8131N1401N2963N3154N1861M8645
$$ 740662 769106 800606 834904 873095 916383 964514 1015915 1068878 1122032 1173893 1222538
62347A222538M3413L6728K9376K1730J3664N349k214q049j2485j6836k1696k6300
$$ 1222538 1265951 1302679 1332055 1353785 1367449 1372798 1370584 1362535 1350050 1333214 1311518 1285218
62335A285218k9799l2329l4397l5936l6590l6407l5577l3961l1372k8168k5092
$$ 1285218 1255419 1223090 1188693 1152757 1116167 1079760 1044183 1010222 978850 950682 925590
62324I25590k2671k1095k0405k0507k1104k1842k2381k2424k1984k1456k1100
$$ 925590 902919 881824 861419 840912 819808 797966 775585 753161 731177 709721 688621
62313F88621k0556j9358j7692j5995j4138j1817r577q318p848p063n690m619m233
$$ 688621 668065 648707 631015 615020 600882 589065 579488 571170 563322 556259 550569 545950 541717
62300E41717l729k592j501j000n00N66J597J844J673J803K055J860J451J456J781
$$ 541717 537988 535396 533895 532895 532395 532961 534558 536402 538075 539878 541933 543793 545244 546700 548481
62285E48481J897J829K005K356K502K529K779L083K994K623K537K918L392L618
$$ 548481 550378 552207 554212 556568 559070 561599 564378 567461 570455 573078 575615 578533 581925 585543
62271E85543L617L697M322N774P661R259J0571J2393J5019J7718J9965K2328K5351
$$ 585543 589160 592857 597179 602953 610614 619873 630444 642837 657856 675574 695539 717867 743218
62258G43218K8559L1503L4953L9809M5382N0080N3416N6053N8085N8495N6403
$$ 743218 771777 803280 838233 878042 923424 973504 1026920 1082973 1141058 1199553 1255956
62247A255956N1807M5029L6470K7034J7851R323J077p052j4719k1748k8415l4896
$$ 1255956 1307763 1352792 1389262 1416296 1434147 1443470 1444547 1437495 1422776 1401028 1372613 1337717
62235A337717m1043m6638n1331n4402n5309n4473n2822n0582m7263m2792l7880
$$ 1337717 1296674 1250036 1198705 1144303 1088994 1034521 981699 931117 883854 841062 803182
62224H03182l3141k8664k4536k1059j8210j5606j3277j1736j1033j0409r288q046
$$ 803182 770041 741377 716841 695782 677572 661966 648689 636953 625920 615511 606223 598177
62212E98177p312o988o441n444m400l719l212k242m50J655L009L096K619K755
$$ 598177 590865 583877 577436 571992 567592 563873 560661 558419 557969 559624 562633 565729 568348 571103
62198E71103L900N491O941Q206R397J0447J1391J2631J4510J6753J8628J9660
$$ 571103 575003 580494 587435 595641 605038 615485 626876 639507 654017 670770 689398 709058
62186G09058K0110K0613K1391K1932K1642K0582J9301J7977J6166J3426R790N653
$$ 709058 729168 749781 771172 793104 814746 835328 854629 872606 888772 902198 911988 917641
62174I17641J693j072j904j297n49p4J104L762P306J0843J4617J9297K4428K8748
$$ 917641 919334 918262 916358 915061 914512 914438 915542 919304 926610 937453 952070 971367 995795 1024543
62160A024543L1705L3665L4749L4459L2418K8646K3160J6127Q447J409m337q910
$$ 1024543 1056248 1089913 1124662 1159121 1191539 1220185 1243345 1259472 1267919 1269328 1264991 1256081
62148A256081j2537j5479j8466k2189k6265k9485l1223l1857l1746l0664k8435
$$ 1256081 1243544 1228065 1209599 1187410 1161145 1131660 1100437 1068580 1036834 1006170 977735
62137I77735k5425k2058j8487j4897j1623q807o464m924m505m686m310k878j022
$$ 977735 952310 930252 911765 896868 885245 876438 869974 865050 860545 855859 851549 848671 847649
62124H47649M88J593K668M036N908Q209J0243J1245J1415J1699J2338J2459J1467
$$ 847649 848137 849730 852398 856434 862342 870551 880794 892039 903454 915153 927491 939950 951417
62111I51417J0033R074Q564P993P455P343P268O069L086j007m636o432o036m067
$$ 951417 961450 970524 979088 987081 994536 1001879 1009147 1015216 1018302 1017295 1012659 1006227 1000191 996124
62097I96124j312K007N832R243J0623R224O123L103J036k66j013j080n11K86J044
$$ 996124 994812 996819 1002651 1011894 1022517 1031741 1037864 1040967 1042003 1041737 1040724 1039644 1039133 1039419 1040463
62082A040463J847K713L352L550L611M166N648Q007J0812J3495J5534J6703J7254
$$ 1040463 1042310 1045023 1048375 1051925 1055536 1059702 1065350 1073357 1084169 1097664 1113198 1129901 1147155
62069A147155J7717J8324J8726J8450J7596J6785J6406J6357J6621J7527J9055
$$ 1147155 1164872 1183196 1201922 1220372 1237968 1254753 1271159 1287516 1304137 1321664 1340719
62058A340719K0245J9971J8030J5017J1321O893J936k830o790r876j2394j4839
$$ 1340719 1360964 1380935 1398965 1413982 1425303 1432196 1434132 1431302 1424512 1414636 1402242 1387403
62046A387403j7909k2063k6825l1045l4044l6130l7728l8663l8653l8080l7598
$$ 1387403 1369494 1347431 1320606 1289561 1255517 1219387 1181659 1142996 1104343 1066263 1028665
62035A028665l7155l6056l4024l1634k9460k7226k4250k0589j7179j4783j3242
$$ 1028665 991510 955454 921430 889796 860336 833110 808860 788271 771092 756309 743067
62024G43067j1966j0800r954r424r025q809q853q753q038p043o597o720o541n742
$$ 743067 731101 720301 710347 700923 691898 683089 674236 665483 657445 650402 643805 637085 630544 624802
62010F24802n134n247n288m261k416o78P01K044L230L795L816L797L894L916L866
$$ 624802 619668 614421 609133 604872 602456 601778 602479 604523 607753 611548 615364 619161 623055 626971 630837
61995F30837L747L203K066Q57n5j284l409n650o799p139q081r933j1445j1732
$$ 630837 634584 637787 639853 640710 640655 639371 635962 630312 623513 616374 608293 598360 586915 575183
61981E75183j1366j1188j1208j1059j0592r654q109o369n115m338l535k827k779
$$ 575183 563817 552629 541421 530362 519770 510116 502007 495638 490523 486185 482650 479823 477044
61968D77044l081k711j692j284j937k455j949j231j338j816j608p35J04Q32J772
$$ 477044 473963 471252 469560 468276 466339 463884 461935 460704 459366 457550 455942 455207 455311 456143 457915
61953D57915K652K989L062L545M442N306O208P586R307J0750J1746J2745J4081
$$ 457915 460567 463556 466618 470163 474605 479911 486119 493705 503012 513762 525508 538253 552334
61940E52334J5618J7106J8451J9687K0935K2160K2837K2313K0754J9156J8077
$$ 552334 567952 585058 603509 623196 644131 666291 689128 711441 732195 751351 769428
61929G69428J7013J5484J3920J2755J1381Q909N516K150p62l453n938p867r108
$$ 769428 786441 801925 815845 828600 839981 848890 854406 856556 855794 852341 846403 838536 829428
61916H29428r787r862r249q127o561m162p51L054O617J0116J3758J6567J7225
$$ 829428 819641 809779 800530 792403 785842 781680 780929 783983 790600 800716 814474 831041 848266
61903H48266J5939J4319J3263J2057R767O530L012n15m019p196r663j1380j2554
$$ 848266 864205 878524 891787 903844 913611 920141 923153 922638 918619 911423 901760 890380 877826
61890H77826j3353j3869j4060j3655j2522j1135j0303j0273j0528j0566j0442
$$ 877826 864473 850604 836544 822889 810367 799232 788929 778656 768128 757562 747120
61879G47120j0404j0468j0563j0788j1211j1655j1830j1576j0868r772q426o961
$$ 747120 736716 726248 715685 704897 693686 682031 670201 658625 647757 637985 629559 622598
61867F22598n448m099l313l149k900j627Q04L582N893P633R174J0820J2682J4739
$$ 622598 617150 613051 609738 606589 603689 602062 602866 606448 612341 619974 629148 639968 652650 667389
61853F67389J6826J8683K0230K1692K3431K5645K8120L0155L0979L0484K9330
$$ 667389 684215 702898 723128 744820 768251 793896 822016 852171 883150 913634 942964
61842I42964K7973K5910K2390J7698J2948Q566L822j749p106j0648j2051j2402
$$ 942964 970937 996847 1019237 1036935 1049883 1058449 1062271 1060522 1053416 1042768 1030717 1018315
61830A018315j2560j2066j0006o371k051K240O341R926J2149J2528J1742J0857
$$ 1018315 1005755 993689 983683 977312 975261 977501 983842 993768 1005917 1018445 1030187 1041044
61818A041044R850P562L226k525q401j3638j8162k2015k5177k7611k9153k9511
$$ 1041044 1050894 1058456 1061682 1059157 1050756 1037118 1018956 996941 971764 944153 915000 885489
61806H85489k8668k7075k5174k3027k0667j8438j6550j4646j2323r896q066p034
$$ 885489 856821 829746 804572 781545 760878 742440 725890 711244 698921 689025 680959 673925
61794F73925o419n907n486n075m498l852l408l050k335j201k80k32j048k117k851
$$ 673925 667506 661599 656113 651038 646540 642688 639280 636230 633895 632694 632414 632182 631134 629017 626166
61779F26166l068k963k816k696k535k399k467k641k495j865j169q28p11m83j88
$$ 626166 623098 620135 617319 614623 612088 609689 607222 604581 602086 600221 599052 598224 597513 597030 596842
61764E96842PL08R22J436J254O33M83J106J840K099K009J743R87m28j912k754
$$ 596842 596849 597157 598079 599515 600769 601402 601885 602991 604831 606930 608939 610682 611669 611241 609329 606575
61748F06575l033l255l482l384l109l284m050m635m269l152k178j906k109k272
$$ 606575 603542 600287 596805 593421 590312 587028 582978 578343 574074 570922 568744 566838 564729 562457
61734E62457k157j799j314p84k38M75J573K939M010M334M118L915L882L744L405
$$ 562457 560300 558501 557187 556403 556165 556640 558213 561152 565162 569496 573614 577529 581411 585155 588560
61719E88560L134L070K974K696K458K463K517K330J855J103m8j586l080m035m363
$$ 588560 591694 594764 597738 600434 602892 605355 607872 610202 612057 613160 613112 611526 608446 604411 600048
61704F00048m344m304m479m899n228n032m403l896l656l131k045j110j160j975
$$ 600048 595704 591400 586921 582022 576794 571762 567359 563463 559807 556676 554631 553521 552361 550386
61690E50386k634k744k620k480k122j483q75n77o19r49j449j807j828j723j749
$$ 550386 547752 545008 542388 539908 537786 536303 535428 534851 534232 533283 531834 530027 528199 526476 524727
61675E24727j692j231o03l67n85q55j025j272j529j523j416j646k079k051j442
$$ 524727 523035 521804 521201 520834 520249 519394 518369 517097 515568 514045 512629 510983 508904 506853 505411
61660E05411r51r95j125r05o84r23j264r52J34J412K293K511J973Q65j67m09K57
$$ 505411 504460 503465 502340 501435 500751 499828 498564 497612 497746 499158 501451 503962 505935 506800 506633 506224 506481
61643E06481J291K078K378K317K189K154K005J333J22j005j402j152r29j189j761
$$ 506481 507772 509850 512228 514545 516734 518888 520893 522226 522348 521343 519941 518789 517860 516671 514910
61628E14910k280k637k892k965k720k329k286k810l391l182j936k76R81J535J487
$$ 514910 512630 509993 507101 504136 501416 499087 496801 493991 490600 487418 485482 485206 486187 487722 489209
61613D89209R27n1j172k214l296m519n551o062o375p045p823p767o622n357m906
$$ 489209 490136 490085 488913 486699 483403 478884 473333 467271 460896 453851 446028 438261 431639 426282 421376
61598D21376m992m725l996l535l809m438m807m730m355l787l060k277j653j390
$$ 421376 416384 411659 407663 404128 400319 395881 391074 386344 381989 378202 375142 372865 371212 369822
61584C69822j523j832j980j863j746j893k165k193j915j634j490j173m39L19L85
$$ 369822 368299 366467 364487 362624 360878 358985 356820 354627 352712 351078 349588 348415 347976 348295 348680
61569C48680l93j307j599j266q91p92p07l31J98M89M07J69M2J28L89P34J043J204
$$ 348680 348287 346980 345381 344115 343224 342432 341725 341394 341592 342081 342488 342657 342699 342827 343216 343950 344993 346197
61551C46197J163R55P03N84O71Q37Q36N93L12K95O24J044J127P01J52J59R07J817
$$ 346197 347360 348315 349018 349602 350273 351110 351946 352539 352851 353146 353770 354814 355941 356642 356794 356953 357860 359677
61533C59677K319K605L213M001M232L674K910K305J406k31k123l378l763l738
$$ 359677 361996 364601 367814 371815 376047 379721 382631 384936 386342 386111 383988 380610 376847 373109
61519C73109l631l331k721j919j183q33j069j623j790j254o13o65j354j863j675
$$ 373109 369478 366147 363426 361507 360324 359491 358422 356799 355009 353755 353142 352477 351123 349260 347585
61504C47585j013l79j03l22r17j360j065J1J270K049K061J429O06J49K51M45J14
$$ 347585 346572 346193 346090 345768 344851 343491 342426 342437 343707 345756 347817 349246 349852 350001 350252 350697 350811
61487C50811p11j340j203m30M12R03J065J188J394J449J172R44J363K329L026
$$ 350811 350100 348760 347557 347127 347539 348442 349507 350695 352089 353538 354710 355654 357017 359346 362372
61472C62372L007K704K509K010Q51k66l25N57J285J260Q71N77L25%k34k56j10
$$ 362372 365379 368083 370592 372602 373453 373187 372862 373419 374704 375964 376835 377412 377737 377737 377503 377247 377137
61455C77137K93J064J913K362K399K396K371J998J363J030J145J203R35P81J167
$$ 377137 377430 378494 380407 382769 385168 387564 389935 391933 393296 394326 395471 396674 397609 398390 399557
61440C99557J825K227K275K210K222K457L045L834M324M182L537K642J506J87
$$ 399557 401382 403609 405884 408094 410316 412773 415818 419652 423976 428158 431695 434337 435843 436030
61426D36030q83j170n89L89J110J216Q18L45J29K30N82J083J381J015L7q43j146
$$ 436030 435147 433977 433388 433777 434887 436103 436921 437266 437395 437625 438207 439290 440671 441686 441723 440880 439734
61409D39734j250j689k207k190j722j427j458j440j338j502j835j795j319r73
$$ 439734 438484 436795 434588 432398 430676 429249 427791 426351 425013 423511 421676 419881 418562 417589
61395D17589r68q71m65j27k5K79J042J750J845J470J165J183J475J923K284K279
$$ 417589 416621 415750 415285 415158 415133 415412 416454 418204 420049 421519 422684 423867 425342 427265 429549 431828
61379D31828K000J884K164K676L265L883M248M026L388K848K488K013J599J791
$$ 431828 433828 435712 437876 440552 443817 447700 451948 455974 459362 462210 464698 466711 468310 470101
61365D70101K416K517J709P70L85K29j78m53N2J229K467L501M421N197N811O548
$$ 470101 472517 475034 476743 477513 477898 478127 477949 477496 477548 478777 481244 484745 489166 494363 500174 506722
61349E06722P622Q784R660J0220J0567J0587J0045Q812O954M923L589L411L576
$$ 506722 514344 523128 532788 543008 553575 564162 574207 583019 589973 594896 598485 601896 605472
61336F05472K838J270J39j22o22k085l581l980l667l681m056m189m113m191m074
$$ 605472 608310 609580 609719 609597 608975 606890 603309 599329 595662 591981 587925 583736 579623 575432 571358
61321E71358l161j731n12N16J833L201L929M129M575N381N948O214O871Q180R603
$$ 571358 568197 566466 565954 566470 568303 571504 575433 579562 584137 589518 595466 601680 608551 616731 626334
61306F26334J0834J2268J4145J6010J7418J8441J9089J8782J6911J3608R582N383
$$ 626334 637168 649436 663581 679591 697009 715450 734539 753321 770232 783840 793422 798805
61294G98805J052l480p792j0933j2248j2253j2151j2389j2306j1470j0477r830
$$ 798805 799857 796377 788585 777652 765404 753151 741000 728611 716305 704835 694358 684528
61282F84528q933p164n244m286l967k972j090N32J281J882K995M160M673M624
$$ 684528 675595 668431 663187 658901 654934 651962 650872 651404 652685 654567 657562 661722 666395 671019
61268F71019M503M484M533M594M421L776L091L261M549O346Q227J0368J2588J3863
$$ 671019 675522 680006 684539 689133 693554 697330 700421 703682 708231 714577 722804 733172 745760 759623
61254G59623J3460J1889J0026P882M931J304k122m698o437p629q444q961r230
$$ 759623 773083 784972 794998 802880 807811 809115 806993 802295 795858 788229 779785 770824 761594
61241G61594r253r046q634p898o632m838k796q23P94J667J573R80Q15J522K719
$$ 761594 752341 743295 734661 726763 720131 715293 712497 711674 712468 714135 715708 716688 717503 719025 721744
61226G21744L955N322P023Q826J0324J1387J2023J2039J1297J0023Q638P436O641
$$ 721744 725699 731021 738044 746870 757194 768581 780604 792643 803940 813963 822601 830037 836678
61213H36678O416O535O436O004N863O475P183O878N464L982L325L377L664M229
$$ 836678 843094 849629 856065 862069 867932 874407 881590 888468 893932 897914 901239 904616 908280 912509
61199I12509N506P612J0177J2787J5242J7405J9117K0422K1680K3152K4498K4821
$$ 912509 918015 925627 935804 948591 963833 981238 1000355 1020777 1042457 1065609 1090107 1114928
61187A114928K3385K0144J5637J0540N546J401j329k691l313l841m508n247o085
$$ 1114928 1138313 1158457 1174094 1184634 1190180 1191581 1190252 1187561 1184248 1180407 1175899 1170652 1164567
61174A164567p326r344j2141j5110j7404j8716j9466k0131k0675k0953k1295k2114
$$ 1164567 1157241 1147897 1135756 1120646 1103242 1084526 1065060 1044929 1024254 1003301 982006 959892
61162I59892k3053k3237k2392k1166k0146j9159j7821j6211j4560j2690j0299
$$ 959892 936839 913602 891210 870044 849898 830739 812918 796707 782147 769457 759158
61151G59158p595n152l157j232J061L690O062P325O880M872K084q32l815o882
$$ 759158 751563 746411 743254 742022 743083 746773 752835 760160 767040 771912 773996 773164 769349 762467
61137G62467r456j0609r935p884n307k899r64O89K648N385Q660J1701J4062J6068
$$ 762467 753011 742402 732467 724583 719276 716377 715413 716102 718750 724135 732795 744496 758558 774626
61123G74626J8274K0714K2914K4555K5944K7668K9892L2080L3517L4041L4131
$$ 774626 792900 813614 836528 861083 887027 914695 944587 976667 1010184 1044225 1078356
61112A078356L4255L4350L4073L3277L2055L0445K8398K5966K3238K0176J6700
$$ 1078356 1112611 1146961 1181034 1214311 1246366 1276811 1305209 1331175 1354413 1374589 1391289
61101A391289J2983R278N504J258l657q987j4368j9634k4696k9350l3315l6355
$$ 1391289 1404272 1413550 1419054 1420312 1416655 1407668 1393300 1373666 1348970 1319620 1286305 1249950
61089A249950l8297l9146l9198l8779l7795l5872l3050l0016k7522k5786k4497
$$ 1249950 1211653 1172507 1133309 1094530 1056735 1020863 987813 957797 930275 904489 879992
61078H79992k3063k0840j7694j4527j2620j2073j1461r572o919m904l983l454
$$ 879992 856929 836089 818395 803868 791248 779175 767714 758142 751223 746319 742336 738882
61066G38882k665j550j28J554L025L770M039M547N394O112O753P954R780J1446
$$ 738882 736217 734667 734539 736093 739118 742888 746927 751474 756868 762980 769733 777687 787467 798913
61052G98913J2501J3397J4557J5776J6929J8413K0379K2303K3841K5396K7304
$$ 798913 811414 824811 839368 855144 872073 890486 910865 933168 957009 982405 1009709
61041A009709K9168L0445L1145L1457L1367L1109L1194L1600L1661L1172L0720
$$ 1009709 1038877 1069322 1100467 1131924 1163291 1194400 1225594 1257194 1288855 1320027 1350747
61030A350747L0561L0187K9531K9407L0065L0486L0044K9704L0622L2657L5324
$$ 1350747 1381308 1411495 1441026 1470433 1500498 1530984 1561028 1590732 1621354 1654011 1689335
61019A689335L8993M3807M8531N1888N4162N6247N8198O0197O3806P0587Q0410
$$ 1689335 1728328 1772135 1820666 1872554 1926716 1982963 2041161 2101358 2165164 2235751 2316161
61008B316161R2551J07287J24660J43016J60836J79009J99606K24138K55180K97410
$$ 2316161 2408712 2515999 2640659 2783675 2944511 3123520 3323126 3547264 3802444 4099854
60998D099854L53956M23508N04316N98489P08413Q32747R73123J142384J357671
$$ 4099854 4453810 4877318 5381634 5980123 6688536 7521283 8494406 9636790 10994461
60989A0994461J626980J951035K328238K724468L020524L022469K584686J755464
$$ 10994461 12621441 14572476 16900714 19625182 22645706 25668175 28252861 30008325
60981C0008325P88306j3785m73358n76472l90922r190M19509O65371N10157r6206
$$ 30008325 30796631 30782846 30309488 29733016 29342094 29332904 29752413 30417784 30927941 30831735
60971C0831735r77443j843535k468239k777825k815685k665481k407677k108376
$$ 30831735 29854292 28010757 25542518 22764693 19949008 17283527 14875850 12767474
60963A2767474j812018j537431j288382j068234q81407p26482n97030m89166m02784
$$ 12767474 10955456 9418025 8129643 7061409 6180002 5453520 4856490 4367324 3964540
60954C964540l36096k84288k43655k12632j88751j68576j50859j36283j24002
$$ 3964540 3628444 3344156 3100501 2887869 2699118 2530542 2379683 2243400 2119398
60945B119398j11796r9516q8840p9668p0289o1293n5605n3916n3535n2623n2170
$$ 2119398 2007602 1908086 1819246 1739578 1669289 1607996 1552391 1498475 1444940 1392317 1340147
60934A340147n2677n2152m9046m4581m0477l6654l2619k9011k6296k3687k0696
$$ 1340147 1287470 1235318 1186272 1141691 1101214 1064560 1031941 1002930 976634 952947 932251
60923I32251j8172j6679j5445j3971j3011j2923j2708j1730j0829j0658j0477
$$ 932251 914079 897400 881955 867984 854973 842050 829342 817612 806783 796125 785648
60912G85648r593q527p763o799n513m937n548o087n320l751k603k162k142k570
$$ 785648 776055 767528 759765 752966 747453 742516 736968 730881 725561 721810 719207 717045 714903 712333
60898G12333l341l802l687l529l549l168k242j542j365r65l2O25O32R34K177L515
$$ 712333 708992 705190 701503 697974 694425 691257 689015 687473 686108 685143 685111 685736 686368 687302 689479 692994
60882F92994M011M095M587N363N927O260O333N754M773M500N420O681P539Q300
$$ 692994 697005 701100 705687 711050 716977 723237 729570 735324 740097 744597 750017 756698 764237 772537
60868G72537R152R426Q965Q901J0039J1633J2696J3404J4223J4878J5197J5874
$$ 772537 781689 791115 800080 808981 819020 830653 843349 856753 870976 885854 901051 916925
60856I16925J7257J8513J8996J9330K0155K0868K0729K0037J9248J8053J6431
$$ 916925 934182 952695 971691 991021 1011176 1032044 1052773 1072810 1092058 1110111 1126542
60845A126542J5334J5204J5017J4032J3103J2903J2117R106M335m32m493q172
$$ 1126542 1141876 1157080 1172097 1186129 1199232 1212135 1224252 1233358 1237693 1237261 1232768 1224596
60833A224596j1354j3702j5739j8117k0309k1373k1447k1269k0932k0424k0540
$$ 1224596 1213242 1199540 1183801 1165684 1145375 1124002 1102555 1081286 1060354 1039930 1019390
60822A019390k1710k2681k2059k0518j9846k0189k0049j8795j7414j6709j6205
$$ 1019390 997680 974999 952940 932422 912576 892387 872338 853543 836129 819420 803215
60811H03215j5146j3496j1737j0485j0178j0477j0238q855p196o436o482o409
$$ 803215 788069 774573 762836 752351 742173 731696 721458 712603 705407 698971 692489 686080
60799F86080n874n141m324l555l334l740l974l538l117l353l676l464l330l935
$$ 686080 680206 675065 670741 667186 663852 660112 656138 652600 649483 646130 642454 638990 635660 631725
60785F31725m552m305l836m094m399l625k587l122n116o590o599o136o129o333
$$ 631725 627173 622868 619032 614938 610539 606914 604327 601205 596089 589499 582900 576764 570635 564302
60771E64302o482o813p143o817n806m740l837k915k284k313k319j349J27P38L00
$$ 564302 557820 551007 543864 537047 531241 526501 522664 519749 517465 515152 512833 511484 511611 512349 512649
60756E12649j48k13m32p49m66K06J79p08j483j802k176k319j128J150K537J874
$$ 512649 512501 512288 511856 511107 510641 510847 511026 510318 508835 507033 504857 502538 501410 502560 505097 506971
60740E06971K35q82j387j865k353k649k840k762j997q82m26p27p17k6J97r02k471
$$ 506971 507206 506324 504937 503072 500719 498070 495230 492468 490471 489589 489163 488436 487719 487693 487890 486988 484517
60723D84517l202k950k304j616j288j994l585m652m248l293l234l947m195l665
$$ 484517 481315 478365 476061 474445 473157 471163 467578 462926 458678 455385 452151 448204 444009 440344
60709D40344l306l716m275m135l319k481j997j612r33j18J54m64j365j579q96
$$ 440344 437038 433322 429047 424912 421593 419112 417115 415503 414570 414452 414606 414142 412777 411198 410302
60694D10302l3L52K70O5n1jK66P12J276J971K718L258L452L412L163K566J923
$$ 410302 410269 410621 410891 410956 410905 410904 411170 411882 413158 415129 417847 421105 424557 427969 431132 433698 435621
60677D35621K002K941L770L793L761M713O195O814O215N300M668M076L410L030
$$ 435621 437623 440564 444334 448127 451888 456601 462796 469610 475825 481125 485793 489869 493279 496309
60663D96309K908K541J818J237J075J117J236J449J542J370J374J957K616K619
$$ 496309 499217 501758 503576 504813 505888 507005 508241 509690 511232 512602 513976 515933 518549 521168
60649E21168K238K265K576K346J455M47o34k096l481m095m457n653p254p594o281
$$ 521168 523406 525671 528247 530593 532048 532495 531861 529765 526284 522189 517732 512079 504825 497231 490950
60634D90950m782m156l860l300k850k716k290j451j086j479j511m09Q73J015Q7
$$ 490950 486168 482012 478152 474852 472002 469286 466996 465545 464459 462980 461469 461060 461933 462948 463035
60619D63035q92j359j303q20k85k37n75n47k3R5p29j758k027j469n19N09J169
$$ 463035 462143 460784 459481 458661 458376 458139 457564 457017 456994 457089 456360 454602 452575 451106 450587 451096 452265
60602D52265R49J07m28l72l93p70q75m15N5L38J017K062K395J740J460K529L823
$$ 452265 453214 453321 452893 452521 452128 451358 450483 450068 450123 450461 451478 453540 455935 457675 459135 461664 465487
60585D65487L760K570J645J392J080L12n44j042r45j87P65J085P37P83J885L322
$$ 465487 469247 471817 473462 474854 475934 476246 475702 474660 473715 473528 474293 475378 476115 476898 478783 482105
60569D82105M263N064O356P699Q315Q503R150J0379J1707J3115J4811J6231J6385
$$ 482105 486368 491432 497788 505487 513802 522305 531455 541834 553541 566656 581467 597698 614083
60556F14083J5022J2731J0028P055L867M27l349o974r317r741q881p655o137m135
$$ 614083 629105 641836 651864 658919 662786 663213 659864 652890 643573 633832 624951 617296 611159 607024
60542F07024k125o69O28K504M788O678Q079R703J2007J4714J7287J9243K0149
$$ 607024 604899 604230 604858 607362 612150 618828 626907 636610 648617 663331 680618 699861 720010
60529G20010J9877J8667J6538J3071Q227K960j565m936p161q027p541o516n914
$$ 720010 739887 758554 775092 788163 796390 799350 797785 792849 785688 777661 770120 763604 757690
60516G57690n830n814n817o034o185n706m582l336k290j332k90Q83K184L513M795
$$ 757690 751860 746046 740229 734195 728010 722304 717722 714386 712096 710764 710474 711357 713541 717054 721849
60501G21849O271Q244J0458J2354J4103J6609K0199K4247K8472L3472L9363M4940
$$ 721849 728120 736364 746822 759176 773279 789888 810087 834334 862806 896278 935641 980581
60489I80581M9136N2350N5249N7097N6454N2914M7024L9073K9073J7544N141q054
$$ 980581 1029717 1082067 1137316 1194413 1250867 1303781 1350805 1389878 1418951 1436495 1441636 1433582
60477A433582k1809l4733m5231n3142n9237o3352o4415o2357n8594n4385m9764
$$ 1433582 1411773 1377040 1331809 1278667 1219430 1156078 1091663 1029306 970712 916327 866563
60466H66563m4538l9289l4768l0976k7366k3649k0000j6710j3945j1734j0106
$$ 866563 822025 782736 747968 716992 689626 665977 645977 629267 615322 603588 593482
60455E93482r204r086r344r255q524p596p023o809o617o180n287l880k407j616
$$ 593482 584278 575192 565848 556593 548069 540473 533450 526641 520024 513844 508557 504677 502270 500654
60441E00654j616j714j488j403j894k498k476j828j100o43n36p42q21r2J390K528
$$ 500654 499038 497324 495836 494433 492539 490041 487565 485737 484637 483994 483458 482716 481895 481803 483193 485721
60425D85721K400J298J13p28j218j350j311j489j709j161L90J957K563K327J827
$$ 485721 488121 489419 489532 488804 487586 486236 484925 483436 481727 480566 480956 482913 485476 487803 489630
60410D89630J151L19k27l16m76r27r98k86N29Q74J217J864J974J010J10N29J670
$$ 489630 490781 491100 490873 490557 490081 489154 488156 487870 488399 489273 490490 492354 494328 495338 495448 495977 497647
60393D97647K191K241K804L562L314K215J659K018K318K191K402L135L424K772
$$ 497647 499838 502079 504883 508445 511759 513974 515633 517651 519969 522160 524562 527697 531121 533893
60379E33893J988J880K207K404K388K255K023J933K227K540K259J550J131J122
$$ 533893 535881 537761 539968 542372 544760 547015 549038 550971 553198 555738 557997 559547 560678 561800
60365E61800J036R15J310K093K370J912J580K006K729L049K918K586K083J532
$$ 561800 562836 563751 565061 567154 569524 571436 573016 575022 577751 580800 583718 586304 588387 589919
60351E89919J404J996K964L655L734L456L524M531O217P597Q089Q100Q102P695
$$ 589919 591323 593319 596283 599938 603672 607128 610652 615183 621400 628997 637086 645186 653288 660983
60337F60983O284M078J641j025m014o605p926q169q228q275p798o758n733n004
$$ 660983 667267 671345 672986 671961 667947 661342 653416 645247 637019 628744 620946 614188 608455 603451
60323F03451m385l861l535l153k554k230k579k983k613j757j194p67J54J226J617
$$ 603451 599066 595205 591670 588517 585963 583733 581154 578171 575558 573801 572607 571840 571994 573220 574837
60308E74837J707K730M749O569P773R286J1580J3858J5578J7511K0535K4279K7450
$$ 574837 576544 579274 584023 590592 598365 607651 619231 633089 648667 666178 686713 710992 738442
60295G38442K8791K7432K3219J6993R918K398n615j3356j9318k2725k3982k3680
$$ 738442 767233 794665 817884 834877 844795 847193 841578 828222 808904 786179 762197 738517
60283G38517k2161k0057j8142j6436j4431j2273j0723r918r257q582q288q189
$$ 738517 716356 696299 678157 661721 647290 635017 624294 614376 605119 596537 588249 580060
60271E80060p505o227n274n019m792m157l504l015k245j134l87l56m98l22K8M01
$$ 580060 572555 566328 561054 556035 551243 547086 543582 540567 538322 537188 536801 536445 535947 535625 535653 536054
60255E36054Q55J057M83n06q74m70k14n05n63J85J200J729J583P37p27j965j891
$$ 536054 536909 537966 538449 537943 537069 536599 536385 535880 535317 535502 536702 538431 540014 540751 540024 538059 536168
60238E36168p90j71o21j081o95K6N25J245K474L410L440L316L984N147N943O222
$$ 536168 535378 535207 534586 533505 532810 532836 533361 534606 537080 540490 543930 547246 551230 556377 562320 568542
60222E68542O270N956N160M397M149M122L922L903M620N899P108P954Q464Q601
$$ 568542 574812 580768 585928 590325 594474 598596 602518 606421 611041 616940 624048 632002 640466 649067
60208F49067Q398Q056P648P196P097P758Q651Q642P549O327N514M557L107J738
$$ 649067 657465 665521 673169 680365 687462 695220 703871 712513 720062 726389 731903 736460 739567 741305
60194G41305P76l51j886k999l174l321m429n996o809o647o179n771n387n248n586
$$ 741305 742081 741730 739844 736845 733671 730350 725921 719925 713116 706469 700290 694519 689132 683884 678298
60179F78298o038o012n472m800m172l516k813k079j393j063j233j293m88P04Q96
$$ 678298 672260 666248 660776 655976 651804 648288 645475 643396 642003 640940 639707 638414 637926 638630 639526
60164F39526k15j184q22K64Q01O43N31P91J122J190P91j19j033j107j82R48J628
$$ 639526 639311 638127 637305 637569 638370 639013 639544 640335 641457 642647 643438 643319 642286 641179 640997 641945 643573
60147F43573K015K382K657L037M092N717O887P060O919P220P813Q384R164J0182
$$ 643573 645588 647970 650627 653664 657756 663473 670360 677420 684339 691559 699372 707756 716920 727102
60133G27102J0781J0576R983R249P966O183M854M346L598J698p07k468l372l613
$$ 727102 737883 748459 758442 767691 775657 781840 786694 791040 794638 796336 795629 793161 789789 786176
60119G86176k947j528n05o03r31m19M65O23M6o47j519k808l831l880l615m069
$$ 786176 783229 781701 781196 780593 779662 779243 779708 780331 780377 779730 778211 775403 771572 767692 764077 760008
60103G60008m817m682l899l981n375o741o752n536m107l213k853k446j381J64
$$ 760008 755191 750509 746610 742629 737254 730513 723761 718225 714118 710905 708052 705606 704225 704389
60089G04389J341J858K439L520M331M100L363L173L612M118M515M730M208K744
$$ 704389 705730 707588 710027 713547 717878 721978 725341 728514 732126 736244 740759 745489 749697 752441
60075G52441J185J22j323m047p071q673q927r355j0392j0919j0354r433q729p876
$$ 752441 753626 753748 752425 748378 741307 732634 723707 714352 703960 693041 682687 673254 664525 656649
60061F56649o745o002n954n872n101l951l074k573k142j596r75m72k86k66J04
$$ 656649 649904 643902 637948 632076 626975 623024 619950 617377 615235 613639 612664 612192 611906 611640 611744
60046F11744R97J895K431L094M379N797O602O983P515P824O925M792K425M62j331
$$ 611744 612741 614636 617067 620161 624540 630337 636939 643922 651437 659261 666186 670978 673403 673865 672534
60031F72534l137m678n749o421o622o351o203o901q255r347r665r458r079q650
$$ 672534 669397 664719 658970 652549 645927 639576 633373 626472 618217 608870 599205 589747 580668 572018
60017E72018q332q157p761o877n829m986m064k730j391n59J36J249K245K127J093
$$ 572018 563686 555529 547768 540891 535062 530076 526012 523282 521891 521332 521468 522717 524962 527089 528182
60002E28182L67M89Q90J103J254J322J104J015J831L374M477M534M228M440N189
$$ 528182 528549 529038 529928 531031 532285 533607 534711 535726 537557 540931 545408 549942 554170 558610 563799
59987E63799N912O124N646M763M148M112L987K978J356Lr41j990l001l214k677
$$ 563799 569711 575835 581481 586244 590392 594504 598491 601469 602825 602828 601887 599897 596896 593682 591005
59972E91005k416k880l195k494j050K99J164J626J862K192L003M235N431O342
$$ 591005 588589 585709 582514 580020 578970 579269 580433 582059 583921 586113 589116 593351 598782 605124
59958F05124P109P701P786P272O436N354L713J473p68k266k766k520k046j845
$$ 605124 612233 619934 627720 634992 641428 646782 650495 651968 651200 648934 646168 643648 641602 639757
59944F39757k112k622l150l795m686n600o161o252n928n290m650m389m365l986
$$ 639757 637645 635023 631873 628078 623392 617792 611631 605379 599451 594161 589511 585122 580757 576771
59930E76771l178k547k195j300M46J908K052J583J884K980L814M045M254M676
$$ 576771 573593 571046 568851 567551 567997 569905 571957 573540 575424 578404 582218 586263 590517 595193
59916E95193N022N423O303P397Q036Q314Q910R811J0310J0189R843R315Q222O629
$$ 595193 600215 605638 611941 619338 627374 635688 644598 654409 664719 674908 684751 694066 702288 708917
59902G08917M952L125R08j198k455l181m266n472n622m527l374k908k489j439
$$ 708917 713869 716994 717902 716704 714249 711068 706802 701330 695708 691181 687807 684899 682410 680971
59888F80971j18Q02J255J576K064L022M453N591N597M789M333M626M978M914M711
$$ 680971 680853 681655 682910 684486 686550 689572 694025 699616 705213 710002 714335 718961 723939 728853 733564
59873G33564M439L613K188R04K09l74j367k611l697m540n188n623n879n910n380
$$ 733564 738003 741616 743804 744708 744917 744543 743176 740565 736868 732328 727140 721517 715638 709728 704348
59858G04348m214l162l058l683m160m231m231m082l449k682k393k202j211L74
$$ 704348 700134 696972 693914 690231 686071 681840 677609 673527 670078 667396 665003 662801 661590 661964
59844F61964J490K087L241N163O707P397Q372J0560J3052J4227J3451J1060P582
$$ 661964 663454 665541 668782 673945 680652 688049 696421 706981 720033 734260 747711 758771 766353
59831G66353L832J036jN78K253M527O484O780M724Q37l910q766j2918j5488j6286
$$ 766353 770185 771221 771220 771798 774051 778578 785062 791842 796566 797403 793493 784727 771809 756321 740035
59816G40035j5928j4841j2916j0338p995o540n682m790l654k425j314o14n20q11
$$ 740035 724107 709266 696350 686012 678017 671477 665795 661005 657351 654926 653612 652998 652478 651667
59802F51667j163j674k559l532m227m926n924o554n940m671m321n276o235o084
$$ 651667 650504 648830 646271 642739 638512 633586 627662 621108 615168 610497 606176 600900 594665 588581
59788E88581n092m030l242k910l185l708l817l366k585j350L61J524J037m21j022
$$ 588581 583489 579459 576217 573307 570122 566414 562597 559231 556646 555296 555657 557181 558218 557797 556775
59773E56775l31L68M03N80J328J773J391J036J462K206K721L307M147M705M842
$$ 556775 556444 556812 557215 557795 559123 560896 562287 563323 564785 566991 569712 573019 577166 581871 586713
59758E86713N354O532P482P600P547P906Q135P805P635Q277R093R178Q717Q359
$$ 586713 592067 598599 606081 613681 621228 629134 637269 645074 652709 660986 670079 679257 687974 696333
59744F96333Q136P825P524P075N808L668J723P26J19p67j519j542j237j246j323
$$ 696333 704469 712294 719818 726893 732701 736369 738092 738818 738937 738170 736651 735109 733872 732626 731303
59729G31303r25k54J09L3l37r61j478j263m01J56j8k57j15j18n58p09j12M78L46
$$ 731303 730378 730124 730233 730266 729929 728968 727490 726227 725826 725982 725964 725707 725592 725474 724916 724207 724095 724573 724919
59710G24919L4K93P80Q51P09Q78J246J522J933K602L040L060L239L748L749K875
$$ 724919 724953 725246 726026 726877 727586 728464 729710 731232 733165 735767 738807 741867 745106 748854 752603 755478
59694G55478K286L136M805N728N241L633J234j432l299l700l169k548j938j218
$$ 755478 757764 760900 765705 771433 776674 780307 781541 780109 776810 773110 769941 767393 765455 764237
59680G64237p39p13p56p93j500k980m101m174m217n448p429q853r248q746p256
$$ 764237 763498 762785 762029 761236 759736 756756 752655 748481 744264 738816 731387 722534 713286 704540 697284
59665F97284n080l500l324l565k902j673j096j250j263r31o66k89P51K222L397
$$ 697284 692204 688704 685380 681815 678913 677240 676144 674894 673631 672700 672034 671745 672496 674718 678115
59650F78115M130M607M523L532K109Q12p54l082n427o530o321n803n560n482n465
$$ 678115 682245 686852 691375 694907 697016 697828 697074 693992 688565 682035 675714 669911 664351 658869 653404
59635F53404n339m566k991j471p80n09l2J81m96j363j343r04j511l377n107n532
$$ 653404 648065 643499 640508 639037 638257 637748 637716 637897 637401 636038 634695 633791 632280 628903 623796 618264
59619F18264m709l237j716p95p94j259j607j905k345k462j777o93J39Q41J804
$$ 618264 613555 610318 608602 607807 607013 605754 604147 602242 599897 597435 595658 594965 595104 595945 597749
59604E97749K739L156L175K987K226Q54k28n03q39j951k799k079n04J15m73r55
$$ 597749 600488 603644 606819 609806 612032 612886 612658 612155 611316 609365 606566 604487 603983 604098 603625 602670
59588F02670p44n33o95p22l11K11N68O37J22q63j411j081q93j845l176l538l171
$$ 602670 601926 601393 600698 599976 599665 599876 600444 601081 601203 600340 598929 597848 596955 595110 591934 588396 585225
59571E85225l206l463k877j679j176j468j394p46n22q56n99N64J387J042L21J98
$$ 585225 582019 578556 575679 574000 572824 571356 569962 569216 568694 567838 567239 567803 569190 570232 570553 570751
59555E70751N12P21Q78J165J345J200Q80N95N94J304K772M130M577M632N357O656
$$ 570751 571263 571984 572862 574027 575372 576572 577452 578047 578641 579945 582717 586847 591424 596056 601413 608069
59539F08069P540P888Q727J0846J4249J8588K2718K4060K0356J2478M143j548
$$ 608069 615609 623497 632224 643070 657319 675907 698625 722685 743041 755519 759662 758114
59527G58114m224m915m218k309L92L274N646O623N746L772J954N48j131l340n606
$$ 758114 753890 748975 744757 742448 742840 746114 751760 758383 764129 767901 769855 770403 769272 765932 760326
59512G60326p672r677j1389j2325j2559j2505j2082j1126j0231r981r692q292
$$ 760326 752654 742977 731588 719263 706704 694199 682117 670991 660760 650779 641087 632795
59500F32795o223m904m509l814k307q10J19Q52J540J782J730K136K976L421L323
$$ 632795 626572 621668 617159 613345 611038 610228 610347 611199 612739 614521 616251 618387 621363 624784 628107
59485F28107L472M071M461M583N225O427P121O934O957Q077R742J1014J1753J2140
$$ 628107 631579 635650 640111 644694 649919 656346 663467 670401 677358 685435 695177 706191 717944 730084
59471G30084J1993J1117R486O871L142p65l284l933l618l067k002j61K004M054
$$ 730084 742077 753194 762680 769551 772693 771928 768644 764711 761093 758026 756024 755863 757867 761921
59457G61921O067Q106J0058J2097J4382J6275J6918J6571J6313J6394J6139J5422
$$ 761921 767988 776094 786152 798249 812631 828906 845824 862395 878708 895102 911241 926663
59445I26663J4771J3858J1374O836J209m533j0214j5503j9415k1307k1328j9698
$$ 926663 941434 955292 966666 973502 974711 970178 959964 944461 925046 903739 882411 862713
59433H62713j6734j3647j1963j1777j1788j1259j0657j0134q889o424l188L97
$$ 862713 845979 832332 820369 808592 796804 785545 774888 764754 755865 749441 746253 746650
59421G46650M257P849J0366J2055J3963J6195J7886J8948K0237K1870K3228K4637
$$ 746650 750907 758756 769122 781177 795140 811335 829221 848169 868406 890276 913504 938141
59409I38141K6688K7375K2595J0933l832j6387k4276k7658k6951k2814j6910j0442
$$ 938141 964829 992204 1014799 1025732 1021900 1005513 981237 953579 926628 903814 886904 876462
59397H76462k819O249J3910J5500Q915l368j6397k5933l0133k9715k6912k3722
$$ 876462 873643 879892 893802 909302 918217 914849 898452 872519 842386 812671 785759 762037
59385G62037k0786j7897j4973j2199r695p497n532l561j537M7P47J046J817L011
$$ 762037 741251 723354 708381 696182 686487 678990 673458 669897 668360 668407 669154 670200 672017 675028
59371F75028L846M201M682N366N722N814O298P063P286P065P520Q954J0344J1085
$$ 675028 678874 683075 687757 693123 698845 704659 710957 718020 725306 732371 739891 748845 759189 770274
59357G70274J1741J2660J3344J3730J4603J6166J7630J8836K0719K3431K5641
$$ 770274 782015 794675 808019 821749 836352 852518 870148 888984 909703 933134 958775
59346I58775K6476K6604K6547K5590K3413K1217J9864J8233J4798R762M384q14
$$ 958775 985251 1011855 1038402 1063992 1087405 1108622 1128486 1146719 1161517 1171279 1175663 1174849
59334A174849n896j0523j4365j7844k1346k4306k5998k6559k6489k5832k4507
$$ 1174849 1168953 1158430 1144065 1126221 1104875 1080569 1054571 1028012 1001523 975691 951184
59323I51184k2813k0953j8864j6818j5314j4029j2086r699q193p832p216n518
$$ 951184 928371 907418 888554 871736 856422 842393 830307 820608 812415 804583 797367 791849
59311G91849l797l140k934k114q52J50Q96J587J881J685J674K199K682K886L510
$$ 791849 788052 784912 781978 779864 779012 779162 780058 781645 783526 785211 786885 789084 791766 794652 798162
59296G98162M743N553N384N213N930P049Q076R798J2945J6761K0017K2128K2228
$$ 798162 802905 808458 813842 819055 824985 832034 840110 849908 862853 879614 899631 921759 943987
59283I43987J8606J0688O23q404j4568j7417j6988j4238j0973p967m260N98N091
$$ 943987 962593 973281 973904 965500 950932 933515 916527 902289 891316 883349 879089 879687 884778
59270H84778P885R809J2013J3586J3007J0711Q271N915K843p65m026p017j0339
$$ 884778 892663 902472 914485 928071 941078 951789 960060 965975 968818 968053 964027 957010 946671
59257I46671j3529j5590j6603j7370j7877j7546j6455j5019j3092j0740q997q402
$$ 946671 933142 917552 900949 883579 865702 848156 831701 816682 803590 792850 783853 775451
59245G75451p674n532k912j532r97N61L431O041P536Q557R371R221P973O766O320
$$ 775451 767777 762245 759333 757801 756804 757365 760796 766837 774373 782930 792301 801522 809495 816261 822581
59230H22581N827M120J166k035m508o065p347r068j1000j2151j2167j1762j1349
$$ 822581 828408 832528 833694 831659 827151 821086 813739 804671 793671 781520 769353 757591 746242
59217G46242j0265q041n522l788k826k161j848j903j637n96O61J587K557L835
$$ 746242 735977 727936 722414 718626 715800 713639 711791 709888 708251 707655 708316 709903 712460 716295
59203G16295M685M592M327M704N243N162M677M182L314K018J299J627J839J087
$$ 716295 720980 725572 729899 734603 739846 745008 749685 753867 757181 759199 760498 762125 763964 765051
59189G65051M99J313K607K797K264K534L674M443M396M017L388K417J789K030
$$ 765051 765550 766863 769470 772267 774531 777065 780739 785182 789578 793595 796983 799400 801189 803219
59175H03219K309J728J063J567K881L901M904O914R575J1562J2614J3389J3810
$$ 803219 805528 807256 808319 809886 812767 816668 821572 828486 838061 849623 862237 875626 889436
59162H89436J3322J2243J1208R830P494M785K516J40l068o243q221r644j1662
$$ 889436 902758 915001 926209 936039 943533 948318 950834 950974 947906 941663 933442 923798 912136
59149I12136j3449j3462j2298j1815j1908j0882q707p262p320p716p658p565p455
$$ 912136 898687 885225 872927 861112 849204 838322 829615 822353 815033 807317 799659 792094 784639
59136G84639o728n731n490n767n379m467m286m710m210k537j188q44m41P28J954
$$ 784639 777911 772180 766690 760923 755544 751077 746791 742081 737871 735334 734146 733302 732861 733589 735543
59121G35543K657L203L776M113M663O298Q617J0227J0869J1464J2037J1569J0104
$$ 735543 738200 741403 745179 749292 753955 760253 768870 779097 789966 801430 813467 825036 835140
59108H35140Q944Q388P373N775M941N303N441M367K936K109J405kj973l932n503
$$ 835140 844084 852472 859845 865620 870561 875864 881305 885672 888608 890717 892122 892120 890147 886215 880712
59093H80712o191n572m299l565l387k686j278l30n06j198j961l270n313p330q636
$$ 880712 874521 868949 864650 861085 857698 855012 853734 853404 852898 851700 849739 846469 841156 833826 825190
59078H25190r220r172q606q225q712r532r543q706p873p182o099m830m062l604
$$ 825190 815970 806798 798192 789967 781255 771723 762180 753474 745601 738419 732320 727490 723428 719824
59064G19824k904k538l312m249l631j853r60j422j744j357j293j695j257R6N49
$$ 719824 716920 714382 711070 706821 703190 701337 700377 698955 697211 695854 694561 692866 691609 691705 692254
59049F92254o11j618r97L31R09Q03O29K17n34r20o59n37r17r36k3J064J534J718
$$ 692254 691643 690025 689028 689359 690268 691071 691700 691917 691383 690463 689804 689267 688350 687414 687391 688455 689989 691707
59031F91707K236L226M835P238R726J1118J1534J2352J4076J5711J6500J6670
$$ 691707 693943 697169 702004 709242 718968 730086 741620 753972 768048 783759 800259 816929
59019H16929J6169J4455J1975R977Q439N957K229j308l821o030q075q670p308
$$ 816929 833098 847553 859528 869505 877944 883901 886130 884822 881001 874971 866896 858226 850918
59006H50918n373l939k312J14K402L784N090P137R108R890R716R235Q251O555
$$ 850918 845545 841606 839294 839408 841810 845594 850684 857821 866929 876819 886535 895770 904021 910576
58992I10576M867L796K895J692O38J18l93j366k413l181l913m485m098k591q38
$$ 910576 915443 919239 922134 923826 924464 924582 924189 922823 920410 917229 913316 908831 904733 902142 901304
58977I01304P00K612N116P389Q958J0384J2005J3293J4098J5047J6134J6398J5665
$$ 901304 902004 904616 909732 917121 926079 936463 948468 961761 975859 990906 1007040 1023438 1039103
58964A039103J5030J4970J4530J3136J1519J0037P762M157J92l287o807j0929
$$ 1039103 1054133 1069103 1083633 1096769 1108288 1118325 1126087 1130244 1130436 1127149 1120342 1109413
58952A109413j4986j8181k0656k2593k3516k3294k2578k1558j9589j6776j4357
$$ 1109413 1094427 1076246 1055590 1032997 1009481 986187 963609 942051 922462 905686 891329
58941H91329j2854j1273q964o708n204l966k608j693j402r37o3K48l67q16m53
$$ 891329 878475 867202 858238 851530 846326 842360 839752 838059 836657 835720 835657 835905 835538 834722 834269
58926H34269k58j042j961j952j410j284j639k022k197j890q74K42O02O82J763
$$ 834269 834011 832969 831008 829056 827646 826362 824723 822701 820504 818614 817740 817982 818584 819266 821029
58911H21029L644M765M895N568P303Q727R220J0024J1701J2857J2738J2836J4420
$$ 821029 824673 829438 834333 839901 847204 855931 865151 875175 886876 899733 912471 925307 939727
58898I39727J6457J7526J7949J8430J8375J7197J5711J4852J4463J4577J6156
$$ 939727 956184 973710 991659 1010089 1028464 1045661 1061372 1076224 1090687 1105264 1121420
58887A121420J9236K2033K3216K3387K3114K1486J8049J4173J0889P146J934l650
$$ 1121420 1140656 1162689 1185905 1209292 1232406 1253892 1271941 1286114 1297003 1304149 1306083 1302433
58875A302433q191j2122j6281j9871k1746k2368k2754k2723k1798k0565j9610
$$ 1302433 1294242 1282120 1265839 1245968 1224222 1201854 1179100 1156377 1134579 1114014 1094404
58864A094404j8375j6514j5038j4713j4684j4114j3661j3976j4198j3485j2503
$$ 1094404 1076029 1059515 1044477 1029764 1015080 1000966 987305 973329 959131 945646 933143
58853I33143j1926j1006r161p480p048p241p131p167p922q690q812r075j0274
$$ 933143 921217 910211 901050 893570 886522 879281 872150 864983 857061 848371 839559 830484 820210
58840H20210j1744j2540j2700j2280j0833q964q400r275r439p709n618m491l305
$$ 820210 808466 795926 783226 770946 760113 751149 742749 733474 724035 716326 710708 706217 702912
58827G02912j207M23N42P09K388M218M464M117M898O102O150N594N860O439O001
$$ 702912 701705 702128 702670 703379 705767 709985 714449 718566 723464 729566 735716 741310 747170 753609 759610
58812G59610N028M757M727L764K205R68k95j963k877k243j613k645m404n239n702
$$ 759610 764638 769395 774122 777886 780091 781059 780764 778801 775924 773681 772068 769423 765019 759780 754078
58797G54078o986q122p510o006n598o094n831m638l564k614j229p6O6J93J590
$$ 754078 747092 738970 731460 725454 719856 713762 707931 703293 699729 697115 695886 695810 695876 696069 697659
58782F97659L500M488M902N706O255N667M998N535O270N572L939K522N06l118
$$ 697659 701159 705647 710549 716255 722510 728177 733175 738710 744980 750552 754491 757013 757519 754401
58768G54401o641p693p072p347q713r297q657p823o711m586k430j758j735m20
$$ 754401 747760 740067 732995 725648 716935 707638 698981 691158 684447 679861 677431 675673 673938 673518
58754F73518J752K650K014J411J151K72q47p05O67J853K520L366M257M749N634
$$ 673518 675270 677920 679934 681345 682496 682768 681921 681216 681883 683736 686256 689622 693879 698628 704262
58739G04262P484Q711P779O239O564Q025P965O352N587O302O760O189N529M947
$$ 704262 711746 720457 728236 734475 741039 749064 757029 763381 768968 775270 782030 788219 793748 798695
58725G98695L684K320K298L206L293K478K189K496K252J777K576M429N445M982
$$ 798695 802379 804699 806997 810203 813496 815974 818163 820659 822911 824688 827264 831693 837138 842120
58711H42120M016K910J219n82j604k407m017n838o880q050j0607j3365j4344j4196
$$ 842120 846136 849046 850265 849683 848079 845672 841655 835817 828937 820887 810280 796915 782571 768375
58697G68375j4937j6222j6154j4910j4199j3917j2735j1258j1030j1061r045n571
$$ 768375 753438 737216 721062 706152 691953 678036 665301 654043 643013 631952 622907 617336
58685F17336l453l216k985k486l281n063n566m412l438l094j958l1J028J135J896
$$ 617336 613883 610667 607682 605196 601915 596852 591286 586874 583436 580342 578384 578353 579381 580516 582412
58670E82412L350M028M168N460P596Q730R296J1593J5268J7091J5643J2669R396
$$ 582412 585762 589790 593958 599418 607014 615744 625040 636633 651901 668992 684635 697304 706700
58657G06700N218N37k819m725o906r430j0470r970r950j0698j0190p964n993n099
$$ 706700 711918 712455 709636 704911 698005 688575 678105 668135 658185 647487 637297 629333 623340 618241
58643F18241l960k337j734k162j668J60J544J971K875M376M754L831L373L564
$$ 618241 614281 611944 610210 608048 606380 606540 608084 610055 612930 617306 622060 625891 629264 632828
58629F32828K604M13q73p47j008j980j739J23J628K127L248N304O478O473P291
$$ 632828 635432 635845 634972 634225 633217 631237 629498 629621 631249 633376 636624 641928 648406 654879 662170
58614F62170R461J1017J1123J1112J1169R740P059N512N500M720K464P67L95l73
$$ 662170 671631 682648 693771 704883 716052 725792 732851 738363 743863 748583 751047 751814 752209 751836
58600G51836j870k059n83J23r05j697j319j413k458k469q10N71J099K734N847
$$ 751836 749966 747907 747324 747447 746542 744845 743526 742113 739655 737186 736376 736947 738046 740780 746627
58585G46627P974Q234Q946J1218J2931J2790J2463J2941J2644J0836R185Q310
$$ 746627 754601 762835 771781 782999 795930 808720 821183 834124 846768 857604 866789 875099
58573H75099O657M312L853N779P286P313Q533J2313J6062J7838J9451K2546K5550
$$ 875099 881756 886068 889921 895700 902986 910299 918832 931145 947207 965045 984496 1007042 1032592
58560A032592K6908K7608K8156K6722K2573J7777J3458Q063J361l824o036p368
$$ 1032592 1059500 1087108 1115264 1141986 1164559 1182336 1195794 1203857 1205218 1201394 1195358 1187990
58548A187990r124r399p292n450n802o733o920q085j1401j4984j7504k0405k4142
$$ 1187990 1178866 1169467 1162175 1156725 1150923 1144190 1137270 1129185 1117784 1102800 1085296 1064891 1040749
58535A040749k6207k5506k4610k5035k4409k1104j7511j5656j3681r867o256m894
$$ 1040749 1014542 989036 964426 939391 914982 893878 876367 860711 847030 837163 830907 826013
58523H26013m141j976L60J209J557K407K415R84K72J396K169J192M82J373J786
$$ 826013 821872 819896 820256 821465 823022 825429 827844 828828 829100 830496 832665 833857 834339 835712 837498
58508H37498L57p29P5O21p32j955j405j031k416l599l044k651l657l778j707j54
$$ 837498 837855 837126 837201 837822 837090 835135 833730 832699 830283 826684 823640 820989 817332 813554 811847 811693
58492H11693r55j431P40L315L860M053N765P162O656O622R038J1563J2045J2777
$$ 811693 810738 809307 810047 813362 817222 821275 827040 834202 840858 847480 856518 868081 880126 892903
58478H92903J6074J9678K0812K0785K1217J9847J4704Q539M458R17m425r575j1692
$$ 892903 908977 928655 949467 970252 991469 1011316 1026020 1034559 1039017 1039934 1035509 1025934 1014242
58465A014242j2021j2769j2612r837o411m449k268J781N407O711Q241J2110J5329
$$ 1014242 1002221 989452 976840 967003 960592 956143 953875 955656 961063 967774 976015 988125 1003454
58452A003454J4901J3309J3628J3508R544L684m88m088r677j5254j7379j7133
$$ 1003454 1018355 1031664 1045292 1058800 1068344 1072028 1071540 1067452 1057775 1042521 1025142 1008009
58440A008009j7294j6817j3714j0086q597p155k891J835L231K809M396P389Q819
$$ 1008009 990715 973898 960184 950098 941501 934346 931455 933290 936521 939330 943726 951115 959934
58427I59934R313J1136J3088J3030J2753J4720J6697J5214J1513Q681N925J249
$$ 959934 969247 980383 993471 1006501 1019254 1033974 1050671 1065885 1077398 1086079 1092004 1093253
58415A093253l347n028n467p435r297q547p366q808j0896j0435r126r825j0366
$$ 1093253 1089906 1084878 1079411 1071976 1062679 1054132 1046766 1037958 1027062 1016627 1007501 997676 987310
58402I87310p545l687k642k766n84K178K102J176L196O353O645N440O361P815
$$ 987310 979765 976078 973436 970670 970086 972264 974366 975542 978738 985091 991736 997176 1003537 1011352
58388A011352O085K961K694M077L111R13J447L855M449L838M797N690L442L94
$$ 1011352 1017437 1020398 1023092 1027169 1030280 1031193 1032640 1036495 1040944 1044782 1049579 1055269 1058711 1059105
58374A059105Q70L514M319M363P037J0620J1309J0667J2327J4404J3140J0871
$$ 1059105 1059975 1063489 1067808 1072171 1079208 1089828 1101137 1111804 1124131 1138535 1151675 1162546
58362A162546J2188J5291J5563J4409J5938J8087J6142J2012J0778J0979P749
$$ 1162546 1174734 1190025 1205588 1219997 1235935 1254022 1270164 1282176 1292954 1303933 1311682
58351A311682K812J592K997J859p83K28L892M795L263M101P053Q145Q492J2135
$$ 1311682 1314494 1316086 1319083 1320942 1320159 1320387 1324279 1329074 1332337 1336438 1343491 1351636 1360128 1372263
58337A372263J7054J8135J6930J8768K2440K2722K0712K1346K3071K0652J5868
$$ 1372263 1389317 1407452 1424382 1443150 1465590 1488312 1509024 1530370 1553441 1574093 1589961
58326A589961J4524J5160J1865O044M061N299M100J462K929O826O721L923N275
$$ 1589961 1604485 1619645 1631510 1637554 1641615 1646914 1651014 1652476 1655405 1662231 1668952 1672875 1678150
58313A678150J0113J1762J0444J2144J6143J6424J4165J5900K0567K1353J9051
$$ 1678150 1688263 1700025 1710469 1722613 1738756 1755180 1769345 1785245 1805812 1827165 1846216
58302A846216K0404K4501K4432K1080K1469K4685K3643J9619K0407K5066K5534
$$ 1846216 1866620 1891121 1915553 1936633 1958102 1982787 2006430 2026049 2046456 2071522 2097056
58291B097056K2408K3784K9175L0301K7414K8738L3917L4418L0416L0687L5436
$$ 2097056 2119464 2143248 2172423 2202724 2230138 2258876 2292793 2327211 2357627 2388314 2423750
58280B423750L6094L2689L4210M0956M3949M2770M6334N4792N8629N7107N9397
$$ 2423750 2459844 2492533 2526743 2567699 2611648 2654418 2700752 2755544 2814173 2871280 2930677
58269B930677O5998O7533O3674O4317P0166P1445O7821O9872P8419Q2374P9665
$$ 2930677 2996675 3064208 3127882 3192199 3262365 3333810 3401631 3471503 3549922 3632296 3711961
58258C711961Q0108Q5116Q5209Q0216Q0747Q6992Q7724Q2895Q4763R4010R8069
$$ 3711961 3792069 3877185 3962394 4042610 4123357 4210349 4298073 4380968 4465731 4559741 4657810
58247D657810R6076J01178J14669J22941J23902J30716J45153J53787J55210J63582
$$ 4657810 4753886 4855064 4969733 5092674 5216576 5347292 5492445 5646232 5801442 5965024
58237E965024J80232J89987J91157K00039K19667K34198K40542K54428K78387
$$ 5965024 6145256 6335243 6526400 6726439 6946106 7180304 7420846 7675274 7953661
58228G953661K95982L04994L23074L52885L76488L91969M19181M60803M96152
$$ 7953661 8249643 8554637 8877711 9230596 9607084 9999053 10418234 10879037 11375189
58219A1375189N22577N62575O20179O72957P17913P80210Q64885R47621J025975
$$ 11375189 11897766 12460341 13080520 13753477 14471390 15251600 16116485 17064106 18090081
58210A8090081J129181J263725J403467J548710J737022J979600K250031K553996
$$ 18090081 19219262 20482987 21886454 23435164 25172186 27151786 29401817 31955813
58202C1955813K942179L435556M013559M696703N555044O609558P820184R199169
$$ 31955813 34897992 38333548 42347107 47043810 52598854 59208412 67028596 76227765
58194G6227765J0828429J2739543J4918085J7474102K0643927K4549560K9109662
$$ 76227765 87056194 99795737 114713822 132187924 152831851 177381411 206491073
58187B06491073L4146029L9081692M2176859M0540967L1869227J6659604j483729
$$ 206491073 240637102 279718794 321895653 362436620 394305847 410965451 409481722
58180D09481722j7988138k9816752l6259598l8125128l6733077l3398627k9171483
$$ 409481722 391493584 361676832 325417234 287292106 250559029 217160402 187988919
58173A87988919k4681954k0224979j5970685j2049422q587193n856397m307269
$$ 187988919 163306965 143081986 127111301 115061879 106474686 100618289 96311020
58166I6311020m207283n228315o568988p531483p883187p714003p170330o400033
$$ 96311020 92103737 86875422 80306434 72774951 64891764 57177761 50007431 43607398
58158D3607398n573739m807860m111116l466095k903309k450715k079860j755799
$$ 43607398 38033659 33225799 29114683 25648588 22745279 20294564 18214704 16458905
58150A6458905j487335j284584j117804r60132q26636p33759o61128n87391n25045
$$ 16458905 14971570 13686986 12569182 11609050 10782414 10048655 9387527 8800136 8275091
58141H275091m87679m58676m21954l89986l73493l55538l22037k87700k66806
$$ 8275091 7787412 7328736 6906782 6516796 6143303 5787765 5465728 5178028 4911222
58132D911222k47363k17753j90719j77712j66323j45741j29122j28739j32968
$$ 4911222 4663859 4446106 4255387 4077675 3911352 3765611 3636489 3507750 3374782
58123C374782j28811j24261j28122j30052j20526j09699j07391j04487r2347q0863
$$ 3374782 3245971 3121710 2993588 2863536 2743010 2633311 2525920 2421433 2329086 2248223
58113B248223p9315p8380o8763n9266n9163o0303n3689m6793m7904m9557m3719
$$ 2248223 2168908 2090528 2021765 1962499 1903336 1843033 1789344 1742551 1694647 1645090 1601371
58102A601371l7806l9830m2652l8224l2925l3992l5024k9384k4081k6159k8922
$$ 1601371 1563565 1523735 1481083 1442859 1409934 1375942 1340918 1311534 1287453 1261294 1232372
58091A232372k5448k2212k5667k8716k4211j8860k0060k1758j7078j2466j5349
$$ 1232372 1206924 1184712 1159045 1130329 1106118 1087258 1067198 1045440 1028362 1015896 1000547
58080A000547j9664j7529j3974j6322j9831j7553j4193j6636k0444j8828j5735
$$ 1000547 980883 963354 949380 933058 913227 895674 881481 864845 844401 825573 809838
58069H09838j7234j9013j5114j0272j1154j3641j0968o450o317p778n717l517
$$ 809838 792604 773591 758477 748205 737051 723410 712442 705992 699675 691897 686180 682663
58057F82663n979q936p088m650p378j1359j0521p965r062j0523p154k669l007
$$ 682663 676684 667748 660660 656010 648632 637273 626752 618787 609725 599202 592048 589379 586372
58044E86372n400m446k631m497o841m929k383m603q418q182o255p509r336p119
$$ 586372 580972 576526 573895 569398 562557 557628 555245 550642 542224 534042 527787 520278 510942 503823
58030E03823l952n019p689o943n245p285j0190q731n343n304o794n173k491l250
$$ 503823 499871 494852 487163 480220 474975 467690 457500 448769 443426 438122 431328 426155 423664 420414
58016D20414n207l703q76j417l357k140L04n25k773k023n9j089l109j762J000
$$ 420414 415207 411504 410628 409211 405854 403714 404018 403493 400720 398697 398638 397549 394440 392678 393678
58001C93678O49j132O2K741K745J522K825M727L259N87J279L698L394J636K391
$$ 393678 394327 393195 393257 395998 398743 400265 403090 407817 411076 411663 412942 416640 420034 421670 424061
57986D24061M019K329j093j843r81k349m524l661j491k271m424l402l86q8k048
$$ 424061 428080 430409 429316 427473 426492 424143 419619 415958 414467 412196 407772 404370 403984 403896 401848
57971D01848k161o29p29j635k36J967J236j062q17J168J119k98K50J783J086l98
$$ 401848 399687 399058 398329 396694 396458 398425 399661 398599 397782 398950 400069 399771 400021 401804 402890 402492
57955D02492Q91L358K894O24O20K030J070j092k02K994M222L635M747O971O826
$$ 402492 403383 406741 409635 410259 410879 412909 413979 412887 412685 415679 419901 423536 428283 435254 442080
57940D42080N330O522R725J0745R731J0438J2577J2459J0469J0468J2181J1484
$$ 442080 447410 453932 463657 474402 484133 494571 507148 519607 530076 540544 552725 564209
57928E64209P970N287M150J806j859m249n672q623j2017j2622j1496j2452j4830
$$ 564209 572179 577466 581616 583422 581563 577314 571642 563019 551002 538380 526884 514432 499602
57915D99602j4599j1939j0814j1476j0459p705o645p210n768k264n53j271j009
$$ 499602 485003 473064 462250 450774 440315 432610 425965 418755 412987 410723 410170 408899 407890
57902D07890J006J855R56Q53J578N92j418j006J460K103P80J413M494N985M622
$$ 407890 408896 410751 411707 412560 414138 414730 413312 412306 413766 415869 416649 418062 422556 428541 433163
57887D33163L819N046N587M292L486L730K490m25j775p47n12k461m206m627n683
$$ 433163 436982 442028 447615 451907 455393 459123 461613 461188 459413 458666 458154 455693 451487 446860 441177
57872D41177p714q175o535n487n895n434l534k753l833m189k675j248o76P85L231
$$ 441177 433463 425288 418753 413266 407371 401937 398403 395650 391817 387628 384953 383705 383029 383814 387045
57857C87045M308L679L796N164N520M671N316P841R123P861O449O159N164K789
$$ 387045 391353 395032 398828 403992 409512 414183 419499 427340 436463 444324 450773 456932 462096 464885
57843D64885J262J535J549K01r55j251k116l648l988l143l342m623m270j579R03
$$ 464885 466147 467682 469231 469432 468477 467226 465110 461462 457474 454331 450989 446366 442096 440517 441420
57828D41420J903K871M129L963K557K478M116M884L930L353L822L508K292K415
$$ 441420 443323 446194 450323 454286 456843 459321 463437 468321 472251 475604 479426 482934 485226 487641
57814D87641L845L630J180m78p4m6j667k862k453k110k436j657J18j06l097n721
$$ 487641 491486 495116 496296 495818 495744 495698 494031 491169 488716 486606 484170 482513 482631 482525 479428 473707
57798D73707o186o555q127q835p429n925n590m637k213o45j248j758l63J333J742
$$ 473707 467521 460966 452839 444004 436575 430650 425060 420423 418210 417565 416317 414559 414196 415529 417271
57783D17271K102L552M758M795N138O744Q184Q530Q931R747R514Q225Q081R356
$$ 417271 419373 422925 427683 432478 437616 444360 452544 461074 470005 479752 489266 497491 505572 514928
57769E14928R263O669M115L283K397J32j766k113k779n089p193p456p232p951
$$ 514928 524191 530860 534975 538258 540655 540787 539021 536908 534129 529040 521847 514391 507159 499208
57755D99208q589q213p890q051p136m862l526m071m229k559r00p28o41M26R06
$$ 499208 490619 482406 474516 466465 459329 454467 450941 446870 442641 440082 439182 438454 437813 438239 439145
57740D39145j25q86l11j52j395k062r63n2o96j056J90J114K45n04N84J792J330
$$ 439145 439020 438134 437823 437671 436276 434214 433251 433199 432503 431447 431637 432751 432996 432492 433076 434868 436198
57723D36198O67J520K523K004J171J578K158J634J145J644J564p5j151JJ370O08
$$ 436198 436865 438385 440908 442912 444083 445661 447819 449453 450598 452242 453806 453731 452580 452581 453951 454559
57707D54559j135j783j946k790l009j346L70N7r74m99P13P48K73J006K351K685
$$ 454559 453424 451641 449695 446905 443896 442550 442920 442977 442003 441504 442217 442965 443238 444244 446595 449280
57691D49280K376K530K410R84n93p83k96l67k06J269L002L714M405O391Q718J0159
$$ 449280 451656 454186 456596 457580 456987 456204 455908 455541 455335 456604 459606 463320 467725 474116 482834 492993
57675D92993J1823J5179J9341K2943K6831L2293L8615M4974N2744O2977P3117
$$ 492993 504816 519995 539336 562279 589110 621403 660018 704992 757736 820713 893830
57664H93830P8618P6152O3473L9268O494k6335n0818o4610o9923o8780o2783n4932
$$ 893830 972448 1048600 1112073 1151341 1157835 1131500 1080682 1016072 946149 877369 814586 759654
57652G59654m7743m0798l3076k5981k1163j7418j2972q960p236o582m646k053
$$ 759654 711911 671113 638037 612056 590893 573475 560503 551543 544307 537725 533079 531026
57640E31026j020j256q00K58M35J11P89K020K313K117K760L470K664J185J038
$$ 531026 530006 528750 527950 528208 528643 528754 529543 531563 533876 535993 538753 542223 544887 546072 547110
57625E47110J837J692P73O68J081M28q67r00L48J166J176J386J743J407R20J357
$$ 547110 548947 550639 551412 552080 553161 553589 552722 551822 552170 553336 554512 555898 557641 559048 559968 561325
57609E61325J953J289J58L69J515J798J384J880L059L176K196J740K027J747Q09
$$ 561325 563278 564567 564725 565094 566609 568407 569791 571671 574730 577906 580102 581842 583869 585616 586425
57594E86425M30O48L86j69J88J163J243L17l00k38j77M7J046K012J669P18R07
$$ 586425 586855 587503 587889 587720 587908 589071 590314 590631 590331 590093 589916 589963 591009 593021 594690 595408 596315
57577E96315K044K367J600J110J307J347J243J829K739K754K089K081K692K579
$$ 596315 598359 600726 602326 603436 604743 606090 607333 609162 611901 614655 616744 618825 621517 624096
57563F24096J594J036J442K139K850L843M589M234L208K739L000L402M053N216
$$ 624096 625690 626726 628168 630307 633157 637000 641589 645823 649031 651770 654770 658172 662225 667441
57549F67441O053N776N313N860O711O500N721N710O032N336M057L830M724N469
$$ 667441 673494 679270 684583 690443 697154 703654 709375 715085 721117 726453 730510 734340 739064 744533
57535G44533N859O579P175O549N115M230L992L589L245L642M201M120M273N710
$$ 744533 750392 756971 764146 770695 775810 780040 784032 787621 790866 794508 798709 802829 807102 812812
57521H12812P265P105N843N484O143O479O498P167P955P619O798O955P489O857
$$ 812812 820077 827182 833025 838509 844652 851131 857629 864796 872751 880370 887168 894123 901612 908469
57507I08469N806O321P917Q289P302O974P678P703O615N773N385M262K760K759
$$ 908469 914275 920596 928513 936802 944104 951078 958756 966459 973074 978847 984232 988494 991254 994013
57493I94013M279N178M652M155M388M292L533L308M036M771N245O084O804O285
$$ 994013 998292 1003470 1008122 1012277 1016665 1020957 1024490 1027798 1031834 1036605 1041850 1047934 1054738 1061023
57479A061023N341O076Q386R911R740R295R214Q418O827O118O921P879Q152Q407
$$ 1061023 1066364 1072440 1080826 1090737 1100477 1109772 1118986 1127404 1134231 1140349 1147270 1155149 1163301 1171708
57465A171708Q779Q513Q064Q882J0581J1079J0106R725J0700J1236J0272R195
$$ 1171708 1180487 1189000 1197064 1205946 1216527 1227606 1237712 1247437 1258137 1269373 1279645 1288840
57453A288840R186R520R574J0054J1092J1486J0887J0552J0966J0954R998R274
$$ 1288840 1298026 1307546 1317120 1327174 1338266 1349752 1360639 1371191 1382157 1393111 1403109 1412383
57441A412383R506J0003J0501J1685J3235J3675J2894J2440J2704J2360J1194
$$ 1412383 1421889 1431892 1442393 1454078 1467313 1480988 1493882 1506322 1519026 1531386 1542580
57430A542580J0850J1865J2716J2766J3310J4603J4769J3144J1916J2673J3863
$$ 1542580 1553430 1565295 1578011 1590777 1604087 1618690 1633459 1646603 1658519 1671192 1685055
57419A685055J3545J2485J2532J3706J4781J5191J4951J4073J3316J3925J5641
$$ 1685055 1698600 1711085 1723617 1737323 1752104 1767295 1782246 1796319 1809635 1823560 1839201
57408A839201J6595J6131J5840J6841J8005J8127J7768J7715J7451J6583J6051
$$ 1839201 1855796 1871927 1887767 1904608 1922613 1940740 1958508 1976223 1993674 2010257 2026308
57397B026308J6545J7243J7370J7491J8146J8724J8707J8561J8525J8131J7656
$$ 2026308 2042853 2060096 2077466 2094957 2113103 2131827 2150534 2169095 2187620 2205751 2223407
57386B223407J8240J9813K0801K0731K1079K2551K3685K3327K2458K2238K2135
$$ 2223407 2241647 2261460 2282261 2302992 2324071 2346622 2370307 2393634 2416092 2438330 2460465
57375B460465K1466K0931K1203K1534K1143K0618K0651K0819K0600K0312K0119
$$ 2460465 2481931 2502862 2524065 2545599 2566742 2587360 2608011 2628830 2649430 2669742 2689861
57364B689861J9620J9105J9583K0918K1702K1620K2006K3329K4299K4342K4616
$$ 2689861 2709481 2728586 2748169 2769087 2790789 2812409 2834415 2857744 2882043 2906385 2931001
57353B931001K5620K6079K5445K5266K6557K7966K7987K7140K6570K6341K6378
$$ 2931001 2956621 2982700 3008145 3033411 3059968 3087934 3115921 3143061 3169631 3195972 3222350
57342C222350K7174K8286K8237K7046K6779K8215K9426K9075K8632K9501L0513
$$ 3222350 3249524 3277810 3306047 3333093 3359872 3388087 3417513 3446588 3475220 3504721 3535234
57331C535234L0382L0374L2016L4102L4547L3780L3748L4703L5390L5445L5496
$$ 3535234 3565616 3595990 3628006 3662108 3696655 3730435 3764183 3798886 3834276 3869721 3905217
57320C905217L5564L5218L4718L4567L4613L4778L5627L7143L8119L7873L7310
$$ 3905217 3940781 3975999 4010717 4045284 4079897 4114675 4150302 4187445 4225564 4263437 4300747
57309D300747L7264L7244L6914L7128L8220L9034L8893L8927M0042M1295M1681
$$ 4300747 4338011 4375255 4412169 4449297 4487517 4526551 4565444 4604371 4644413 4685708 4727389
57298D727389M1725M1934M1583M0580M0503M2018M3276M2764M1835M2360M3749
$$ 4727389 4769114 4811048 4852631 4893211 4933714 4975732 5019008 5061772 5103607 5145967 5189716
57287E189716M4469M4760M5553M6274M6092M5896M6772M7836M7843M7574M8310
$$ 5189716 5234185 5278945 5324498 5370772 5416864 5462760 5509532 5557368 5605211 5652785 5701095
57276E701095M9294M9156M8687M9581N1344N2015N1304N0709N1001N1694N2582
$$ 5701095 5750389 5799545 5848232 5897813 5949157 6001172 6052476 6103185 6154186 6205880 6258462
57265F258462N3809N4844N5170N5483N6652N8148N9024N9553O0439O1312O1644
$$ 6258462 6312271 6367115 6422285 6477768 6534420 6592568 6651592 6711145 6771584 6832896 6894540
57254F894540O2149O3600O5267O6225O7132O8955P0971P1926P2185P2945P4228
$$ 6894540 6956689 7020289 7085556 7151781 7218913 7287868 7358839 7430765 7502950 7575895 7650123
57243G650123P5408P6724P8510P9944Q0220P9944P9685P8437P5350P1671O8885
$$ 7650123 7725531 7802255 7880765 7960709 8040929 8120873 8200558 8278995 8354345 8426016 8494901
57232H494901O6289O2560N8513N5920N4715N3657N2824N2970N3320N2492N0876
$$ 8494901 8561190 8623750 8682263 8738183 8792898 8846555 8899379 8952349 9005669 9058161 9109037
57221I109037M9753M8713M6330M2756L9296L5988L2045K8131K5845K5235K5069
$$ 9109037 9158790 9207503 9253833 9296589 9335885 9371873 9403918 9432049 9457894 9483129 9508198
57210I508198K5057K5633K6096K5373K4277K4574K6050K6862K6559K6461K7129
$$ 9508198 9533255 9558888 9584984 9610357 9634634 9659208 9685258 9712120 9738679 9765140 9792269
57199I792269K7776K8229K9225L0668L1567L1794L2050L2141L1185K9422K7886
$$ 9792269 9820045 9848274 9877499 9908167 9939734 9971528 10003578 10035719 10066904 10096326 10124212
57188A0124212K6452K4124K1117J8674J6800J4239J0758P532N050K529l27k777
$$ 10124212 10150664 10174788 10195905 10214579 10231379 10245618 10256376 10263908 10268958 10271487 10271160 10268383
57176A0268383m598o600r303j2403j5649j9012k2025k4224k6171k8743l1588l3529
$$ 10268383 10263785 10257185 10247882 10235479 10219830 10200818 10178793 10154569 10128398 10099655 10068067 10034538
57164A0034538l4248l4315l3909l2827l1478l0562l0096k9837l0115l1126l2173
$$ 10034538 10000290 9965975 9932066 9899239 9867761 9837199 9807103 9777266 9747151 9716025 9683852
57153I683852l2846l3995l6160l8133l8820l9496m2165m6333m9406m9921m8877
$$ 9683852 9651006 9617011 9580851 9542718 9503898 9464402 9422237 9375904 9326498 9276577 9227700
57142I227700m8524n1132n7696o6127p1974p3114p2513p4132p7515p9136p7940
$$ 9227700 9179176 9128044 9070348 9004221 8932247 8859133 8786620 8712488 8634973 8555837 8477897
57131H477897p6172p5337p4724p4176p5174p8458q2899q7264r1074r3496r3414
$$ 8477897 8401725 8326388 8251664 8177488 8102314 8023856 7940957 7853693 7762619 7669123 7575709
57120G575709r0968q7276q2635p6678o9994o3599n7031m8948l9482k9976k0761
$$ 7575709 7484741 7397465 7314830 7238152 7168158 7104559 7047528 6998580 6959098 6929122 6908361
57109F908361j1159j207R090K2002M1030O7387R9726J37504J82526K37051L02774
$$ 6908361 6897202 6895995 6905085 6927087 6968117 7035504 7135230 7272734 7455260 7692311 7995085
57098G995085L82208M79266N97727P40213R08408J102771J322238J565633J833093
$$ 7995085 8377293 8856559 9454286 10194499 11102907 12205678 13527916 15093549 16926642
57089A6926642K124507K436313K759824L080794L378418L624385L782082L805304
$$ 16926642 19051149 21487462 24247286 27328080 30706498 34330883 38112965 41918269
57081D1918269L642604L256711K651795J881575J024425J49439o93431j461443
$$ 41918269 45560873 48817584 51469379 53350954 54375379 54524818 53831387 52369944
57073E2369944k115173k632293l016366l284893l451240l520279l495554l384717
$$ 52369944 50254771 47622478 44606112 41321219 37869979 34349700 30854146 27469429
57065B7469429l200304k959792k684147k393218k102411j823849j567611j339725
$$ 27469429 24269125 21309333 18625186 16231968 14129557 12305708 10738097 9398372
57057I398372j140966r69695q24450p02961o01233n15585m44033l84637l34604
$$ 9398372 8257406 7287711 6463261 5760300 5159067 4643482 4199449 3814812 3480208
57048C480208k92152k56980k27819k01887j77897j57142j40287j25540j11426
$$ 3480208 3188056 2931076 2703257 2501370 2323473 2166331 2026044 1900504 1789078
57039A789078r8834q8672p9892p1491o4246n8679n3478m7633m2192l8165l4620
$$ 1789078 1690244 1601572 1521680 1450189 1385943 1327264 1273786 1226153 1183961 1145796 1111176
57028A111176l0464k6294k2856j9386j4888r517l556L302J0812J8268K6515L7703
$$ 1111176 1080712 1054418 1031562 1012176 997288 987771 984215 987517 998329 1016597 1043112 1080815
57016A080815N2312O8775Q6010J02429J11201J01396O7793J7729l4347p7121j05822
$$ 1080815 1133127 1201902 1287912 1390341 1501542 1602938 1670731 1688460 1654113 1576992 1471170
57005A471170j19623j20380j12760j01748q9625p6844o4529n4055m5336l7674
$$ 1471170 1351547 1231167 1118407 1016659 927034 850190 785661 731606 686270 648596
56995F48596l1363k6739k2835j8785j5344j3340j1850r546o671m090j656R74L252
$$ 648596 617233 590494 567659 548874 533530 520190 508340 498794 492123 488033 486377 487351 490603
56982D90603M774N873N849K547m477j2122j6962j8754j9045j8206j5982j3314
$$ 490603 495377 501250 507099 509646 505169 493047 476085 457331 438286 420080 404098 390784
56970C90784j1302r462p023m657l132j615P71L115M448N821Q634J2188J5082J7654
$$ 390784 379482 370020 362997 358340 355208 353593 354364 357479 361927 367748 376382 388570 403652 421306
56956D21306K0706K2840K1379J5381O066m710j4716k1358k3622k3262k2407k1038
$$ 421306 442012 464852 486231 501612 507678 502968 488252 466894 443272 420010 397603 376565
56944C76565j8275j4777j1847r315o295l002n7L004O701J0310J3248J6537K1136
$$ 376565 358290 343513 331666 322351 316056 313054 312997 316001 322702 333012 346260 362797 383933
56931C83933K6092K9874L1940L1175K4913J2263l008j5537k3357k7672k9334k8425
$$ 383933 410025 439899 471839 503014 527927 540190 537182 521645 498288 470616 441282 412857
56919D12857k6289k4809k3894k2113j9395j6867j4627j1979r368p827p000n716
$$ 412857 386568 361759 337865 315752 296357 279490 264863 252884 243516 235689 228689 222973
56907B22973m105l114k566j757j166j533j918q85J002K020J958J921K175K415
$$ 222973 218868 215754 213188 211431 210265 208732 206814 205929 206931 208951 210909 212830 215005 217420
56893B17420L312N550P904Q742Q830J0318J3485J6815J9685K2293K3361K0709
$$ 217420 220732 226282 234186 242928 251758 262076 275561 292376 312061 334354 357715 378424
56881C78424J4349O674m46o621j1184j2967j2185j0481q798o820m491k247J86
$$ 378424 392773 399447 399001 392380 381196 368229 356044 345563 336765 329945 325454 323207 323393
56868C23393L388O749R180J1125J4138J8641K3888K9768L6659M3502M7760M7266
$$ 323393 326781 333530 342710 353835 367973 386614 410502 440270 476929 520431 568191 615457
56856F15457M0807K7780R554r345k3794l2095l5934l6835l4819l0167k4104j7487
$$ 615457 656264 684044 693598 684253 660459 628364 592430 555595 520776 490609 466505 449018
56844D49018j0588m185J008N850J1817J8744K5304L1499L8670M7311N6736O6380
$$ 449018 438430 434245 435253 441103 452920 471664 496968 528467 567137 614448 671184 737564
56832G37564P4876P7970P0186M9739K0465j1051l8784n8407o8223p0017o7342
$$ 737564 812440 890410 960596 1010335 1030800 1019749 980965 922558 854335 784318 716976
56821G16976o2310n5084m6110l6846k8165j9847j1990n178R29P508J4837K2111
$$ 716976 654666 599582 553472 516626 488461 468614 456624 451446 452375 459883 474720 496831
56809D96831K9162L6779M4958N1934N4971N1170L8360J7133p935l0626m6826n5531
$$ 496831 525993 562772 607730 659664 714635 765805 804165 821298 813363 782737 735911 680380
56797F80380n7451n4389m9087m3421l7050k9316k1584j5748j1320o425r96L444
$$ 680380 622929 568540 519453 476032 438982 409666 388082 372334 361014 354589 353593 357037
56785C57037O707J0125J4151J8187K2434K7278L0859K9843K2890J1456k393j6570
$$ 357037 363744 373869 388020 406207 428641 455919 486778 516621 539511 550967 548574 532004
56773E32004k7870l3477l4035l2853l1726k9793k6417k2553j8892j5229j2129
$$ 532004 504134 470657 436622 403769 372043 342250 315833 293280 274388 259159 247030
56762B47030j0805j0854j0339q608o856n679m334k792k141k508k656k131j732
$$ 247030 236225 225371 215032 206424 199568 193889 189555 186763 184622 182114 179458 177327 175595
56749A75595j613j041k49l38j094j143m01j45o00p44n35q72j332n83Q39J002l5
$$ 175595 173982 172941 172692 172354 171260 170117 169716 169571 168971 168227 167692 166820 165488 164905 165744 166746 166711
56732A66711k15Q22J078j62j159r06n51o91j69J276J997J306Q08J585K496K475
$$ 166711 166496 167318 168396 168234 167075 166169 165618 164927 164758 166034 168031 169337 170145 171730 174226 176701
56716A76701K155K138J858J223J152J545J069k20n39N23J159N86L78J353J929
$$ 176701 178856 180994 182852 184075 185227 186772 187841 187621 187082 187605 188764 189350 189728 191081 193010
56701A93010J018K5L38J133J150N92o6j078k078j911q23n42j273j184R8M32j079
$$ 193010 194028 194053 194391 195524 196674 197266 197200 196122 194044 192133 191310 190768 189495 188311 188409 188841 187762
56684A87762k280j586n70r08j509q73R2o0o57m14J87J15k58k23k02n75o39j82
$$ 187762 185482 183896 183326 182418 180909 180036 180128 180068 179411 178997 179184 179299 179041 178818 178616 178041 177402 177220
56666A77220j84p06j85J749L016K260J008R24J324J242J583L038M049L200J707
$$ 177220 177036 176330 176145 177894 180910 183170 184178 185102 186426 187668 189251 192289 196338 199538 201245
56651B01245J293J513J267J144J922K608K139J453J712K125J662J134J401J340
$$ 201245 202538 204051 205318 206462 208384 210992 213131 214584 216296 218421 220083 221217 222618 223958
56637B23958o5j362q89K29r3j455j886j084k75J24M68M78j09m80k03n18k296m049
$$ 223958 223893 222531 221642 221871 221778 220323 218437 217353 217078 217202 217670 218148 218039 217559 217356 216838 214542 210493
56619B10493m006k811k117j812q95J65K41l07m60m73r32j075j47O70k7j310j301
$$ 210493 206487 203676 201559 199747 198852 199017 199258 198951 198491 198018 197086 196011 195864 196534 196507 195197 193896
56602A93896j94K95k39p80q85q43m60M28R98O26K07O81J256Q23OJ9M99M31J86
$$ 193896 193702 193997 193758 192978 192093 191250 190790 191218 192216 192842 193049 193730 194986 195809 195815 195834 196333 196764 196950
56583A96950P05J532J535Q12J95k58o64k45J426L124L516L011K577K007R63L89
$$ 196950 197655 199187 200722 201534 201729 201471 200807 200562 201988 205112 208628 211639 214216 216223 217186 217575
56567B17575J055J954J957J805K660L963M638N118O381Q107R526J0701J1304R784
$$ 217575 218630 220584 222541 224346 227006 230969 235607 240725 247106 255213 264739 275440 286744 296528
56553B96528N760J615l39p57j273j516n20N57k2j572k178j820j804k177k145k086
$$ 296528 302288 303903 303564 302807 301534 300018 299498 300055 300033 298461 296283 294463 292659 290482 288337 286251
56537B86251k788l602l595l456m112m657l900k641k149j754m18Q04L95q02j060
$$ 286251 283463 279861 276266 272810 268698 264041 260141 257500 255351 253597 253179 253983 254378 253576 252516
56522B52516p69j291k136k050j685k311l033k232p10m91j418j774j327j011o24
$$ 252516 251747 250456 248320 246270 244585 242274 239241 237009 236299 235808 234390 232616 231289 230278 229654
56507B29654L72Q35l83j872j666o13p57j598j238j05m7p08l53N66K50p90n58M99
$$ 229654 230026 230861 230478 228606 226940 226327 225570 223972 222734 222629 222582 221874 221521 222087 222337 221547 220989 221488
56489B21488J77j321j618m15J33o57j208q82o32m74M86J549J108j82j33J168J581
$$ 221488 221665 220344 218726 218311 218444 217787 216579 215697 215065 214591 215077 216626 217734 217552 217419 218587 220168
56472B20168Q31P41J574J596N38Q8N86N61j55k7J040J384O86L45M59l19j714j837
$$ 220168 220999 221740 223314 224910 225448 225536 226122 226683 226528 226501 227541 228925 229611 229956 230415 230096 228382 226545
56454B26545o77k64r72r12M42J310R75Q52J552J896J517J498J808J109l49o90
$$ 226545 225868 225604 224632 223720 224162 225472 226447 227299 228851 230747 232264 233762 235570 236679 236330 235640
56438B35640J86K47j012j701r53q9K81J196K580K729J403M63O02M23m22m27O24
$$ 235640 235826 236073 235061 233360 232407 232318 232599 233795 236375 239104 240507 240970 241572 241995 241573 241146 241770
56421B41770P86o04j610r87M5L95P16J327J249L86J04P08Q53K55K85J143J239
$$ 241770 242556 241952 240342 239355 239400 239795 240511 241838 243087 243473 243577 244285 245138 245393 245678 246821 248060
56404B48060J98l69J54M58J31N12J769K140J043J57M48Q73Q84J369K223J926M96
$$ 248060 248258 247889 248043 248501 248632 249144 250913 253053 254096 254253 254701 255574 256458 257827 260050 261976 262472
56387B62472j54M22M87l77l59R99J663Q16L81J445K345J881J352J719J719N48
$$ 262472 262318 262740 263227 262850 262491 263490 265153 265969 266350 267795 270140 272021 273373 275092 276811 277359
56371B77359l93m4M80K26M7N30P21K15N1M40K31m20L32K632M058L382K231J806
$$ 277359 276966 276922 277402 277628 277675 278205 278926 279141 279192 279632 279863 279443 279775 282407 286465 289847 292078 293884
56353B93884J073m45j144k30P12O36O91J566J937J098M08O95R05N96R56K158K559
$$ 293884 294957 294512 293368 293138 293850 294486 295177 296743 298680 299778 300186 300881 301786 302382 303338 305496 308055
56336C08055J806J687K761L215K333J874K619K875J838J108J467J543J068J886
$$ 308055 309861 311548 314309 317524 319857 321731 324350 327225 329063 330171 331638 333181 334249 336135
56322C36135M081M864L167J661K171K829J929R77J424J909J331J277K842M050
$$ 336135 340216 345080 348247 349908 352079 354908 356837 357814 359238 361147 362478 363755 366597 370647
56308C70647L173J594R98O89R4P58L338N591N967O262Q141R937R500P582N910
$$ 370647 373820 375414 376412 377101 377195 377953 381291 386882 392849 399111 407252 417189 426689 434271 440181
56293D40181M494L132K847L700L865K917K993M870O183N614N279O665P858P374
$$ 440181 444675 447807 450654 454354 458219 461136 464129 468999 475182 480796 486075 492740 500598 507972
56279E07972P095Q604J0115R994R851J1217J2498J2269J2261J3982J5714J5935
$$ 507972 515067 523671 533786 543780 553631 564848 577346 589615 601876 615858 631572 647507
56267F47507J6422J8778K1196K1920K2645K5220K8175K9927L2155L6621M1829
$$ 647507 663929 682707 703903 725823 748468 773688 801863 831790 863945 900566 942395
56256I42395M6185N1294N8642O6296P2486P9236Q8738R9263J08439J17384J27793
$$ 942395 988580 1039874 1098516 1164812 1237298 1316534 1405272 1504535 1612974 1730358 1858151
56245A858151J37992J45772J52112J58201J61802J60509J55666J49087J38967
$$ 1858151 1996143 2141915 2294027 2452228 2614030 2774539 2930205 3079292 3218259
56236C218259J23094J03126Q1591N7622K9925J076k5530n0165p3977r4694j09685
$$ 3218259 3341353 3444479 3526070 3583692 3613617 3614693 3589163 3538998 3465021 3370327 3260642
56225C260642j20676j30677j38723j42125j41701j40188j37639j32678j26223
$$ 3260642 3139966 3009289 2870566 2728441 2586740 2446552 2308913 2176235 2050012
56216B050012j19842j12679j03877r5592q9633q3901p6155o8410o3326n9326n3755
$$ 2050012 1930170 1817491 1713614 1618022 1528389 1444488 1368333 1299923 1236597 1177271 1123516
56205A123516m7875m4091m1174l7035l3222l1771l0517k6576k1678j8999j7583
$$ 1123516 1075641 1031550 990376 953341 920119 888348 857831 831255 809577 790578 772995
56194G72995j5065j2818j2941j3160j0472p053o629p745o709m592m875o418n435
$$ 772995 757930 745112 732171 719011 708539 701486 694857 687112 680403 675811 670936 664518 659083
56181F59083k622j810k932k670q76k01m54P53K706K699J369J556K933L130K728
$$ 659083 656461 654651 651719 649049 648173 647972 647518 648271 650977 653676 655045 656601 659534 662664 665392
56166F65392L932N739N806N372O940Q955Q487P129Q371J1040J1528J0672J2107
$$ 665392 669324 675063 680869 686241 693181 702136 710623 717752 726123 737163 748691 759363 771470
56153G71470J5396J7160J7571J9381K2002K2910K3530K7244L2951L6996M0194
$$ 771470 786866 804026 821597 840978 862980 885890 909420 936664 969615 1006611 1046805
56142A046805M6364N5209O3177P0284P9475R0460J00653J11119J24749J39453
$$ 1046805 1093169 1148378 1211555 1281839 1361314 1451774 1552427 1663546 1788295 1927748
56132A927748J49441J52229J48504J37166J17620R5416P8320O7717O0205N5371
$$ 1927748 2077189 2229418 2377922 2515088 2632708 2728124 2806444 2874161 2934366 2989737
56122B989737N4380N2816M3557K6350P183j0657k7417m0517m6225m7476n1932
$$ 2989737 3044117 3096933 3140490 3166840 3174023 3163366 3135949 3095432 3049207 3001731 2949799
56111B949799o2294p5683r1307j10369j28993j39929j41685j38584j32237j20783
$$ 2949799 2887505 2811822 2720515 2610146 2481153 2341224 2199539 2060955 1928718 1807935
56101A807935j05835r1993p9617o5854n2137m2717l6630k9417k1795j8053j6977
$$ 1807935 1702100 1610107 1530490 1464636 1412499 1369782 1333152 1303735 1281940 1263887 1246910
56090A246910j3425p991n760o238m177J36J335m71L20M193N887M655N275Q404
$$ 1246910 1233485 1225494 1219734 1213496 1209319 1209455 1210790 1210319 1210639 1214832 1220719 1225374 1230649 1239053
56076A239053R681Q887J0243J3342J3524J1463J2448J6125J7105J5582J6824K0376
$$ 1239053 1248734 1257621 1267864 1281206 1294730 1306193 1318641 1334766 1351871 1367453 1384277 1404653
56064A404653K0718J8421J9315K2676K2070J7958J7244K0084J9743J6032J5790
$$ 1404653 1425371 1443792 1463107 1485783 1507853 1525811 1543055 1563139 1582882 1598914 1614704
56053A614704J9287J9534J6299J7071K2513K4808K2465K2744K7135K8602K5799
$$ 1614704 1633991 1653525 1669824 1686895 1709408 1734216 1756681 1779425 1806560 1835162 1860961
56042A860961K5700K9308K9271K4825K4439L0154L3996L3479L5753M2563M6234
$$ 1860961 1886661 1915969 1945240 1970065 1994504 2024658 2058654 2092133 2127886 2170449 2216683
56031B216683M4768M5814N1436N4153N2345N3839N9977O2141N8667N8747O4746
$$ 2216683 2261451 2307265 2358701 2412854 2465199 2519038 2579015 2641156 2699823 2758570 2823316
56020B823316O7547O4532O4874P1421P5037P2815P4066Q1938Q7122Q6280Q8335
$$ 2823316 2890863 2955395 3020269 3091690 3166727 3239542 3313608 3395546 3482668 3568948 3657283
56009C657283R6055J00281R9019J02688J13573J20234J19481J22941J34380J42324
$$ 3657283 3753338 3853619 3952638 4055326 4168899 4289133 4408614 4531555 4665935 4808259
55999D808259J43178J48967J63496J74218J77090J85234K03038K16769K21439
$$ 4808259 4951437 5100404 5263900 5438118 5615208 5800442 6003480 6220249 6441688
55990F441688K31082K51080K67310K74798K89107L16247L40425L55457L78052
$$ 6441688 6672770 6923850 7191160 7465958 7755065 8071312 8411737 8767194 9145246
55981I145246M15102M49523M74522N08793N60600O11396O53374P06952P81493
$$ 9145246 9560348 10009871 10484393 10993186 11553786 12165182 12818556 13525508 14307001
55972A4307001Q57260R27405J017008J137658J267053J398428J563415J779127
$$ 14307001 15164261 16091666 17108674 18246332 19513385 20911813 22475228 24254355
55964B4254355K023816K295142K637395L078340L600495M211779M975222N925023
$$ 24254355 26278171 28573313 31210708 34289048 37889543 42101322 47076544 53001567
55956E3001567P029587Q286749R768281J1517186J3515830J5836996J8698729
$$ 53001567 60031154 68317903 78086184 89603370 103119200 118956196 137654925
55949A37654925K2261375K6493679L1276276L6228167L9977572L9863888L3266755
$$ 137654925 159916300 186409979 217686255 253914422 293891994 333755882 367022637
55942C67022637J9880548K609377j4074560k6743325l4255085l7177163l6710917
$$ 367022637 386903185 389512562 375438002 348694677 314439592 277262429 240551512
55935B40551512l4120084l0510618k6629250k2820331j9240067j6038199j3310923
$$ 240551512 206431428 175920810 149291560 126471229 107231162 91192963 77882040
55928G7882040j1028126r115512p545668o294243n284690m442725l752196l208027
$$ 77882040 66853914 57738402 50192734 43898491 38613801 34171076 30418880 27210853
55920B7210853k765563k381543k057828j802309j588046j388813j215738j082775
$$ 27210853 24445290 22063747 20005919 18203610 16615564 15226751 14011013 12928238
55912A2928238r71159q60930p64044o94638o37203n74045n15711m75894m42893
$$ 12928238 11957079 11096149 10332105 9637467 9000264 8426219 7910508 7434614 6991721
55903F991721m02713l65366l42618l23133k94108k65469k49264k36087k14303
$$ 6991721 6589008 6223642 5881024 5557891 5263783 4998314 4749050 4512963 4298660
55894D298660j92756j82627j75634j61000j46228j41023j37601j26274j14315
$$ 4298660 4105904 3923277 3747643 3586643 3440415 3299392 3161791 3035517 2921202
55885B921202j10757j08205r7792q6969q4762q3971p5355o5454o3298o2800n5129
$$ 2921202 2810445 2702240 2604448 2517479 2432717 2348746 2273391 2207937 2144639 2081839 2026710
55874B026710m5739m2808m0890l2279k3241k3271k8769l2198l6786m7514n7680
$$ 2026710 1980971 1938163 1897273 1864994 1841753 1818482 1789713 1757515 1720729 1673215 1615535
55863A615535n8984n5777n5596n5009m8139l9923l7381l6461l0536k3555k2144
$$ 1615535 1556551 1500774 1445178 1390169 1342030 1302107 1264726 1228265 1197729 1174174 1152030
55852A152030k2853j9735j6601j9487k4564k5381k4690k7603l0420k7712k3218
$$ 1152030 1129177 1109442 1092841 1073354 1048790 1023409 998719 971116 940696 912984 889766
55841H89766k2639k2820j8977j5210j6752j9029j5725j0736j0856j3334j1989
$$ 889766 867127 844307 825330 810120 793368 774339 758614 747878 737022 723688 711699
55830G11699r218j0484j2912j0739o619o426q059o297l663n624r685r911p920
$$ 711699 702481 691997 679085 668346 661727 655301 647242 640945 637282 631658 621973 612062 604142
55817F04142r004j1505j0296o945o508p816o468l870m011m922k353J587K338J660
$$ 604142 595138 583633 573337 566392 559884 552068 545600 541730 537719 532797 530444 532031 534369 536029
55803E36029L787O612N692L296M425P238O402K720O20q20n312j0754j2100j0434
$$ 536029 539816 546428 552120 555416 559841 567079 573481 576201 576821 576001 570689 559935 547835 537401
55789E37401j0693j2622j2222j0033r715j0405q343m289k085j739r77j188m779
$$ 537401 526708 514086 501864 491831 482116 471711 463368 459079 456994 455255 454278 453090 448311
55776D48311r049r807q519q938r590o924l031k464l973l066m83l56k145k133r83
$$ 448311 439262 429455 420936 411998 402408 395484 392453 389989 386016 382950 382467 382111 379966 377833 376850
55761C76850k210m874n268m230n352p588o968m156l017l196j350J548J481j241
$$ 376850 374640 369766 364498 360268 354916 347328 340360 336204 333187 329991 328641 330189 331670 330429
55747C30429k827l123m988p791q390p475q183r525q070m968m408n995n607l005
$$ 330429 327602 324479 319491 311700 303310 295835 287652 278127 270057 265089 260681 254686 249079 246074
55733B46074j712k020r93J095J067p90j128Qm99k543l061k090k380l514k706q22
$$ 246074 244362 242342 241349 242444 243511 242721 241593 241601 241102 238559 235498 233408 231028 227514 224808 223986
55717B23986j246l249k988o37N7j025l52K146K729Q57%J010J087p2M65K744L191
$$ 223986 222740 219491 216503 215866 215923 214898 214546 216692 219421 220278 220278 221288 222375 222303 222768 225512 228703
55700B28703J004o43o09j260l096l594k423k284l557l485j571n33j022o15J057
$$ 228703 229707 229064 228455 227195 224099 220505 218082 215798 212241 208756 207185 206652 205630 205015 206072
55685B06072J435K02J05J704K393J621J950L926M892M038L664M331L681J280k26
$$ 206072 207507 207709 207814 209518 211911 213532 215482 219408 224300 228338 232002 236333 240014 241294 241068
55670B41068P1l9j304j684o28q0k80Q26K979L228J238K02J242J682L24l44J087
$$ 241068 241139 241100 239796 238112 237484 237404 237124 237950 240929 244157 245395 245597 246839 248521 248845 248501 249588
55653B49588K441K037J181Q70n6j955l185l320l984n425n897n311n679p043p036
$$ 249588 252029 254066 255247 256117 256061 254106 250921 247601 243617 238192 232295 226984 221305 214262 207226
55638B07226n320m337m718m163k025p24j323j828j196r57j570j233L02P67m67
$$ 207226 201906 197569 192851 188688 186663 185939 184616 182788 181592 180635 179065 177832 178134 178901 178434
55623A78434j205o70q26k181k463r89j72j067j455j11J021O12R2K81l03j997k674
$$ 178434 177229 176559 175733 173552 171089 170100 169928 168861 167406 167295 168316 168928 169020 169301 168998 167001 164327
55606A64327j566p22j054p74O16Q45q36j944j338j367l238m328k716n74k87p47
$$ 164327 162761 162039 160985 160211 160827 161672 160836 158892 157554 156187 152949 148621 145905 145331 145044 144297
55590A44297k38K66m44j110n10R2m60q52J7P08No53J43J169J061R08J975L183
$$ 144297 144059 144325 143881 142771 142261 142353 141893 141041 141058 141766 141771 141118 141261 142430 143491 144399 146374 149557
55572A49557L240L030L676M364M187M109N064O096O216O105O253N561L464J321
$$ 149557 152797 155827 159503 163867 168054 172163 177227 183323 189539 195644 201897 207458 210922 212243
55558B12243J41r48k539l641l879m533n876o121m525k947k639k251p40N00K97
$$ 212243 212384 211436 208897 205256 201377 196844 190968 184847 180322 177375 174736 172485 171745 172245 172542
55543A72542j48K28L17o82j337n87J90k38p53l11r4j047j725q74J31l20j332j465
$$ 172542 172394 172622 172939 172257 170920 170333 170523 170285 169532 169221 169127 168080 166355 165481 165612 165292 163960 162495
55525A62495j331k002k818k900l004l805m218l374k344k065j547n4J006M17p00
$$ 162495 161164 159162 156344 153444 150440 146635 142417 139043 136699 134634 133087 133033 134039 134456 133756
55510A33756j084j541k856l649k609r48l41k37N69J448J252N46L83L71j47n67
$$ 133756 132672 131131 128275 124626 122017 121069 120728 120491 121060 122508 123760 124306 124689 125060 124913 124346
55494A24346m45p16j761k100r11K16j43q88o49k45p04r14L00J603J199j09m09
$$ 124346 123901 123185 121424 119324 118413 118629 118486 117598 116949 116704 116000 115086 115386 116989 118188 118079 117670
55477A17670K59O55P43J080J130L82j22M85J022J52j201j430r06r17j282j074
$$ 117670 117929 118584 119327 120407 121537 121919 121797 122282 123304 123456 122255 120825 119919 119002 117720 116646
55461A16646n49l57q6N68N35q04j933j289K99J177J390J712J670O69l02k03Q1
$$ 116646 116097 115740 115654 116222 116757 115953 114020 112731 113030 114207 115597 117309 118979 119648 119346 119143 119224
55444A19224o38j572j387n77l47l77K21Q81O40O3J46M16M0l71L3N89M43L02R67
$$ 119224 118586 117014 115627 115050 114703 114326 114547 115428 116068 116131 116277 116693 116733 116362 116395 116984 117427 117729 118696
55425A18696J516R05N8K59Q74O98K37M95R00N34J11N23Q55Q4o61O1J313J375P18
$$ 118696 120212 121117 121175 121434 122308 123006 123243 123738 124638 125172 125283 125806 126661 126745 126084 126145 127458 128833 129551
55406A29551Q02J132K54j278j723j189j200j868j980j380r23n73K45R34N62k26
$$ 129551 130353 131485 131739 130461 128738 127549 126349 124481 122501 121121 120198 119625 119870 120804 121366 121140
55390A21140j99K66Po31n30J9pk22L79J268J225O17O02Q14J52q96j030n90q74
$$ 121140 120941 121207 121214 120583 120053 120072 120065 119843 120222 121490 122715 123332 123934 124748 124900 124004 122974 122384 121510
55371A21510j599j487q20r31j603j412l82Q2k59l42Nm5l89p5P83J179J088J176
$$ 121510 119911 118424 117604 116673 115070 113658 113276 113358 113099 112757 112762 112717 112328 112253 113036 114215 115303 116479
55353A16479R92l67k086k327j013J95N84R65J614J761J288J013J098Q86M01L82
$$ 116479 117471 117104 115018 112691 111678 111873 112457 113422 115036 116797 118085 119098 120196 121082 121483 121865
55337A21865P90Q24L89Q0j42p47j423j480j142j053r13j63N85L85k99l63K4p7
$$ 121865 122655 123479 123868 123948 123806 123059 121636 120156 119014 117961 117048 116885 117470 117855 117556 117193 117217 117140
55319A17140n44n91l75m68m40K57P35k9j068p49M11N13o14j297p74R1O61J036
$$ 117140 116596 116005 115630 115162 114722 114979 115714 115685 114617 113868 114279 114792 114178 112881 112107 112198 112859 113895
55301A13895R00j26j149q71L92J233J353J426J343N95j56J29Q82Q47L57O20J242
$$ 113895 114795 114669 113520 112649 113041 114274 115627 117053 118396 118991 118835 118964 119846 120693 121050 121670 122912
55284A22912Q47k63n13J38J70p42j351j144q81p80l53P6k69q09l37O26M74o45
$$ 122912 123759 123496 122983 123121 123291 122549 121198 120054 119173 118393 118040 118116 117847 117038 116701 117327 117801 117156
55266A17156r91j96L41N2j03K41L49K00O08J290R48m04j238q96k41J72O30R43
$$ 117156 116165 115969 116310 116362 116259 116500 116849 117049 117657 118947 119895 119491 118253 117357 117116 117288 117918 118861
55248A18861N05k21j97L40L92K03O23J012J74j098j061k38o19j889j682K51J467
$$ 118861 119366 119145 118948 119288 119680 119883 120506 121518 121692 120594 119533 119295 118676 116787 115105 115356 116823
55231A16823R31M08R13J032q1r79o38k04o35r82m47M0k54m53J57Q07Q88J044J565
$$ 116823 117754 118162 119075 120107 120026 119047 118409 118205 117570 116588 116141 116181 115927 115474 115631 116438 117326 118370 119935
55212A19935J570Q45N35R99R49j71r78m52L78L14k20m36n90r28p96Q7Q20P77M55
$$ 119935 121505 122350 122885 123884 124833 124662 123684 123232 123610 123924 123704 123268 122678 121750 120954 121041 121861 122638 123093
55193A23093K73l5k35L71J183N98j288k259j230K46O53N64Q22P76j96j204j323
$$ 123093 123366 123331 123096 123467 124650 125248 123960 121701 120471 120717 121370 121934 122756 123532 123336 122132 120809
55176A20809j084j166j115n50r2m4L85J457K028J368L38j69m19o20k41N64O48
$$ 120809 119725 118559 117444 116894 116802 116758 117143 118600 120628 121996 122334 122165 121746 121126 120885 121449 122097
55159A22097m9n0J088J763J064L39O74R30k9j193j317j116j621j977r25Q68J851
$$ 122097 122048 121998 123086 124849 125913 126252 126926 127856 127827 126634 125317 124201 122580 120603 119678 120546 122397
55142A22397J820J419O43m27o61N11J641J175j37n14J87P76Q64R25R20M92jp7
$$ 122397 124217 125636 126279 125852 125191 125702 127343 128518 128381 127867 128054 128830 129694 130619 131539 132031 132030 131953
55124A31953j68q20j499j407q34n35m86l38k97m97l38L99P07j80j326j352l89
$$ 131953 131785 130965 129466 128059 127225 126690 126204 125866 125569 125072 124734 125133 125840 125660 124334 122982 122593
55107A22593M76R11J212J239P16J56L18J079J671J711J318P75N44R49J432J066
$$ 122593 123069 123980 125192 126431 127147 127303 127621 128700 130371 132082 133400 134175 134719 135668 137100 138166
55091A38166R7j49O60J276R01L44L66M55J04j80j51o05j787k438j611j63O70Q84
$$ 138166 138263 138114 138774 140050 140951 141295 141661 142116 142220 142040 141889 141284 139497 137059 135448 135285 135955 136839
55073A36839R18O74L27N91J192O95r93j810n86R99J060K79J73L66k67j187j177
$$ 136839 137757 138431 138758 139349 140541 141236 140243 138433 137847 138846 139906 140185 140358 140724 140457 139270 138093
55056A38093n94n26p05k95J92k36j087j216q01o82n54K32R45M96m86n62K32P64
$$ 138093 137499 136973 136268 135973 136165 135929 134842 133626 132825 132143 131589 131821 132766 133262 132776 132214 132446 133210
55038A33210Q31R14O42m64j305l76J704K762J957M37o53j152j161q81r36j482
$$ 133210 134041 134955 135597 135133 133828 133452 135156 137918 139875 140312 139659 138507 137346 136465 135529 134047
55022A34047j529m32O58M25l83j69Q19R92O9q17j247j645j653m67J189J560M19
$$ 134047 132518 132086 132744 133169 132786 132617 133436 134428 134497 133680 132433 130788 129135 128668 129857 131417 131836
55005A31836o70p49l32J63J017J980K192J658J363J567J439O43m9k2M27Q30R70
$$ 131836 131166 130417 130085 130248 131265 133245 135437 137095 138458 140025 141464 142107 142058 142036 142463 143293 144263
54988A44263N58m03j050n58N41J051Q84Q25Q55K88n61m71P04J669J561R52O45
$$ 144263 144821 144418 143368 142810 143351 144402 145286 146111 146966 147254 146693 146222 146926 148595 150156 151108 151753
54971A51753O69P52Q31P91N35L10L54L58R5R0P14J146M79n95o75J52M62k12q32
$$ 151753 152422 153174 154005 154796 155331 155641 155995 156353 156448 156538 157252 158398 158877 158282 157607 157759 158221 158009 157177
54952A57177o03N7M74M85J19m48o69l31k04r55j761j331M5Q75P33N79R59J348
$$ 157177 156574 156631 157105 157590 157709 157261 156592 156261 156057 155102 153341 152010 152055 152930 153663 154242 155201 156549
54934A56549J439J614J942J975J722J673J790J637J523K259L722M877N307N560
$$ 156549 157988 159602 161544 163519 165241 166914 168704 170341 171864 174123 177845 182722 188029 193589
54920A93589N901N976N771N649N347M056J763n89k373l730m746n273n556n965
$$ 193589 199490 205466 211237 216886 222233 226289 228052 227463 225090 221360 216614 211341 205785 199820
54906A99820o140n486m414l907l995l905l498l299l122k194p14J41k0l49k95k36
$$ 199820 193680 188194 183780 179873 175878 171973 168475 165176 162054 159860 159146 159287 159267 158918 158623 158387
54890A58387l52j05P22J579K114K594L143L461L510L605L805M030M673O112P699
$$ 158387 158035 157930 158652 160231 162345 164939 168082 171543 175053 178658 182463 186493 191166 197278 204977
54875B04977Q330P855O870N388K946j06k788m875o785q229q420p603o930o691
$$ 204977 213307 221162 228032 233420 236366 236260 233472 228597 221812 213583 205163 197560 190630 183939
54861A83939o089m851l661k792j794p20k99o32r72r77r54q56m18k04r64j926j548
$$ 183939 177850 172999 169338 166546 164752 164032 163733 163101 162129 161152 160198 159342 158924 158720 157756 155830 154282
54844A54282j41K10j171k401j834l28L48j39r62j559j725j213k18N39P49Q75J087
$$ 154282 154141 154351 153180 150779 148945 148617 148965 148826 147864 146305 144580 143367 143149 143688 144437 145312 146399
54827A46399Q88J64m14n12o34j021j110n97l6J37K12L94L20q7k88n0J57P9J08
$$ 146399 147287 147451 147037 146525 145891 144870 143760 143163 143127 143264 143476 143870 144190 144103 143815 143765 143922 144001 144109
54808A44109M38P41R61J432J974J911J233P00N49K71j28O3Q46J240Q73N41P47
$$ 144109 144547 145288 146249 147681 149655 151566 152799 153499 154048 154319 154191 154254 155100 156340 157213 157754 158501
54791A58501R10N86K03M8l18r92j304r58n18k48L08J083J199O05O25K025L743
$$ 158501 159411 159997 160200 160248 159930 158938 157634 156676 156158 155910 156218 157301 158500 159105 159730 161755 165498
54774A65498M423M092L524L017K719L160M472N862O699P298Q012Q368P852O689
$$ 165498 169921 174013 177537 180554 183273 186433 190905 196767 203466 210764 218776 227144 234996 241685
54760B41685N193L126M62k046l698m625n247n695o106o632o862o213n106m636
$$ 241685 246878 250004 250466 248420 244722 240097 234850 229155 223049 216417 209555 203342 198236 193600
54746A93600m770m237k637j220q70q42l42K8m15r55n22O25J474J693J543J069
$$ 193600 188830 184593 181956 180736 179866 179024 178682 178710 178295 177340 176818 177443 178917 180610 182153 183222
54730A83222L61j0L76J224K152L192M197M676M756N287O378O834N777L754J621
$$ 183222 183583 183573 183949 185173 187325 190517 194714 199390 204146 209433 215811 222645 228422 232176 233797
54715B33797n76k852m550n301n672o050n908n048m456m849n414n096m138l313
$$ 233797 233221 230369 225819 220518 214846 208796 202888 197840 193384 188535 183121 178025 173887 170574
54701A70574k551j551p89p17p06l0P69O78j48o83n68l26m27q97j482j629q76K36
$$ 170574 168023 166472 165683 164966 164260 164230 164999 165677 165529 164846 164278 163952 163525 162628 161146 159517 158641 158877
54683A58877M42m56j102n68K67K10m53p65o70o16m63jJ74m19r88m83P43J401J033
$$ 158877 159319 158863 157761 157193 157460 157670 157217 156452 155782 155166 154703 154702 154876 154457 153469 152986 153729 155130 156163
54664A56163K38l88o63n25j78j07l05j19N38P12j24j054j083n70k95r0M37P79
$$ 156163 156401 156013 155350 154825 154647 154540 154235 154116 154654 155366 155242 154188 153105 152535 152240 152150 152587 153366
54646A53366L74j43J07P75R50O88N89M73k12j143j543j403j193q24l4O91P55M91
$$ 153366 153740 153597 153704 154479 155429 156117 156706 157179 156967 155824 154281 152878 151685 150861 150827 151518 152273 152764
54628A52764M98N28Q6m32l94q0kK41J122J903J573N53mm8k58l58M79J761K030
$$ 152764 153262 153790 153876 153444 153050 152970 152968 153209 154331 156234 157807 158360 158356 158308 158050 157692 158171 159932 161962
54609A61962J085K90M40P38K64p06j303j112m17O4l11j289j684q57L00O05K42
$$ 161962 163047 163337 163777 164515 164779 164073 162770 161658 161241 161305 160994 159705 158021 157164 157464 158069 158311
54592A58311J99O50J018J180J339J146K10q36j049o33m64n21j61L53Q0r60j685
$$ 158311 158510 159160 160178 161358 162697 163843 164053 163217 162168 161535 161071 160550 160389 160742 160822 159862 158177
54575A58177j509q24k9P10Q99K47m16n1Q54Q05m35j527j542r43m08LK72K35J97
$$ 158177 156668 155844 155815 156525 157424 157671 157255 157204 158058 158863 158428 156901 155359 154416 154008 154011 154283 154518 154715
54556A54715O73J348J357O99K63L76M47J95J10M03O35N80N37O35P50J090J930
$$ 154715 155388 156736 158093 158792 159055 159431 159878 160073 160183 160586 161221 161801 162338 162973 163723 164813 166743
54539A66743K693K464J411N80L26J01j60J40R04J182O81J75N6k16q39j079n99
$$ 166743 169436 171900 173311 173891 174217 174318 174158 174298 175202 176384 177065 177240 177296 177080 176241 175162 174563
54522A74563j48k96n10k10J82Nn93j057j298j546j800j829j401l59J070K028J817
$$ 174563 174415 174119 173609 173399 173581 173586 172993 171936 170638 169092 167292 165463 164062 163703 164773 166801 168618
54505A68618Q56J48j45o32j259j198l81J02l74j028r18j97M59Q52J006O78j72
$$ 168618 169474 169622 169477 168845 167586 166388 166007 166109 165735 164707 163789 163592 164051 164903 165909 166587 166415
54488A66415r24r39l11M20Q92J017Q81P96R99J211R82N13M84R91J397J371J285
$$ 166415 165491 164552 164241 164661 165553 166570 167451 168247 169246 170457 171439 171952 172436 173427 174824 176195 177480
54471A77480J353J219P07K65K46L66K52Rp7L0K38M37L39l10j210j657j304l91
$$ 177480 178833 180052 180759 181024 181270 181636 181888 181897 181820 181850 182088 182525 182864 182554 181344 179687 178383 177992
54453A77992O88J548J741J174M69K54K58q5m34m8O86M61r48k135j982j059n78
$$ 177992 178680 180228 181969 183143 183612 183866 184124 184039 183605 183557 184243 184704 183756 181621 179639 178580 178002
54436A78002p88j081j048q01n68m19j89L79J150J455Q99J22J5M23N06K07L21J111
$$ 178002 177214 176133 175085 174284 173716 173297 173108 173487 174637 176092 176991 177113 177128 177551 178057 178264 178585 179696
54418A79696J909K251K292J998R86m96j484j581j391j333j031k60M18N60N24P60
$$ 179696 181605 183856 186148 188146 189132 188636 187152 185571 184180 182847 181816 181556 181974 182534 183058 183818
54402A83818J129J343J384J187O13J9M6N78P30K04k50p2L18L68K25J51K2j58Q
$$ 183818 184947 186290 187674 188861 189474 189493 189539 190117 190847 191051 190801 190729 191047 191415 191640 191791 191813 191655 191663
54383A91663N44P93L68k81o61q74j030q75m43k36k67K56J604K717K428R67m61
$$ 191663 192207 193000 193368 193087 192426 191552 190522 189647 189204 188968 188701 188957 190561 193278 195706 196673 196212
54366A96212j053p90jP90J051P77N45O99R10Q63P74Q46P98L34l62r63j311j162
$$ 196212 195159 194369 194368 195158 196209 196986 197531 198230 199140 200003 200777 201623 202421 202755 202393 201430 200119 198957
54348A98957l21P94J351J207J073J323J492J329J458K339L409L940M037M130M009
$$ 198957 198636 199430 200781 201988 203061 204384 205876 207205 208663 211002 214411 218351 222388 226518 230527
54333B30527L154J609o4j395k155k334k315k670l398l853l665l155k567j674n24
$$ 230527 233681 235290 235226 233831 231676 229342 227027 224357 220959 217106 213441 210286 207719 206045 205521
54318B05521J48j61j008j706k153k449k354j699q53j97L19P14N81k27j028j047
$$ 205521 205669 205508 204500 202794 200641 198192 195838 194139 193286 193089 193408 194122 194703 194476 193448 192401
54302A92401m02J52J49k98q33j132j083r23r18q84m92L7J76M3K59Q41J112R09
$$ 192401 191999 192151 192300 192002 191169 190037 188954 188031 187113 186229 185737 185774 185950 185993 186252 187093 188205 189114
54284A89114Q75J201J146L35m59m61M4L77M71N84O88P30Q81J047P84J28k50j11
$$ 189114 189989 191190 192336 192671 192212 191751 191795 192172 192643 193227 193915 194645 195526 196573 197357 197485 197235 197124
54266A97124m9l41m12O9M61L16K81R76J799J755R15R3l25m58l03J10M00L08J86
$$ 197124 197075 196734 196322 196391 196852 197168 197449 198425 200224 201979 202894 202987 202662 202204 201901 202011 202411 202719 202905
54247B02905L77O10M91J46j96o92j405j922j967j894k036k142j864j249m02O54
$$ 202905 203282 203892 204383 204529 204333 203641 202236 200314 198347 196453 194417 192275 190411 189162 188760 189414
54231A89414J463J300L04m26l11R9L88R51J807J969R80l3J22J019J500J311Q31
$$ 189414 190877 192177 192481 192055 191744 191843 192231 193182 194989 196958 197938 197905 198027 199046 200546 201857 202688
54214B02688Q8q95j451j154o23n11m50k1J97l13p65k53N37K86q54j519j105j73
$$ 202688 202776 201881 200430 199276 198653 198142 197692 197671 197868 197555 196790 196537 197074 197360 196506 194987 193882 193709
54196A93709P23J363J413P81J81K06L19j84p72m95L34O35L32J85K16k35j066j441
$$ 193709 194432 195795 197208 197989 198170 198376 198695 198511 197739 197244 197578 198213 198545 198730 198946 198711 197645 196204
54178A96204j168q02n05l7K89m1n52l29L47K54q26j770j835j473j218r99p86q37
$$ 196204 195036 194234 193729 193692 193981 193940 193388 193059 193406 193660 192834 191064 189229 187756 186538 185539 184753 183916
54160A83916j087j173j100j020n04P92J950J662K74m57J37Q64P46M07P26J347
$$ 183916 182829 181656 180556 179536 179032 179824 181774 183436 183710 183253 183390 184254 185000 185407 186133 187480
54144A87480J385P78J64pK92Q13J051O49%j31L13N89K89k18n00m93j26O76J405
$$ 187480 188865 189643 189807 189800 190092 190905 191956 192605 192605 192474 192787 193376 193665 193447 192947 192454 192328 193004 194409
54125A94409J284L83k98j05N92J155J360J190O91K83M89J175J624J518J213J039
$$ 194409 195693 196076 195778 195673 196265 197420 198780 199970 200661 200944 201433 202608 204232 205750 206963 208002
54109B08002R74J018J143Q95o4j082j117k54L32Q1l45l40j62j30n2P9j87q22j004
$$ 208002 208976 209994 211137 212032 211968 210886 209769 209515 209847 209928 209583 209243 209081 208951 208899 208978 208791 207969 206965
54090B06965l10N32O55J77k39l72m58o37q79j017o78L70J593K041J525Q39O51
$$ 206965 206655 207187 207842 208019 207780 207408 206950 206313 205434 204417 203739 204109 205702 207743 209268 210107 210758
54073B10758Q41J150J646K172K158J534J141J629K479K682K022J149P59J042J697
$$ 210758 211599 212749 214395 216567 218725 220259 221400 223029 225508 228190 230212 231361 232120 233162 234859
54058B34859K051J531L38n76m33P20K315L844N020N830O570P457Q189Q478Q950
$$ 234859 236910 238441 238779 238203 237770 238490 240805 244649 249669 255499 262069 269526 277715 286193 295143
54043B95143J0655J3378J5142J3999R880M371q19m698o858p267o243m338k176
$$ 295143 305798 319176 334318 348317 358197 362568 361749 357051 350193 342926 336683 332345 330169
54030C30169l11J001J993K988L864M222M067L875L871L775L305K515J583O96K19
$$ 330169 329858 330859 332852 335840 339704 343926 347993 351868 355739 359514 362819 365334 366917 367613 367832
54015C67832M90J270J793J509M57j065k744m224n282o067o752p057o643n880n524
$$ 367832 368322 369592 371385 372894 373351 372286 369542 365318 360036 353969 347217 340160 333517 327637 322113
54000C22113n662n646n129m482m038l652l232k983k947k778k351j993j919j846
$$ 322113 316451 310805 305676 301194 297156 293504 290272 287289 284342 281564 279213 277220 275301 273455
53986B73455j480r67o54p07j083j621k087k392k647k756k279j121l4K19j49m33
$$ 273455 271975 271008 270354 269647 268564 266943 264856 262464 259817 257061 254782 253661 253627 253846 253697 253264
53970B53264n52q52j128q59k86j35m14n05m03o52r74l16J402K770K704J704Q05
$$ 253264 252712 251860 250732 249873 249587 249452 249038 248533 248130 247478 246504 246188 247590 250360 253064 254768 255573
53953B55573L08J40M78J301K018K216K194K301K413K501K952L878M782N401O118
$$ 255573 255881 256021 256499 257800 259818 262034 264228 266529 268942 271443 274395 278273 283055 288456 294574
53938B94574O999P346O799O110O074O407O463O395O695P068O744N638M374L272
$$ 294574 301573 308919 315718 321828 327902 334309 340772 347167 353862 360930 367674 373312 377686 380958
53924C80958K101Q05j90n16k33L71J100J936K974M286N679O735P184P190P226
$$ 380958 383059 383864 383674 383158 382925 383296 384396 386332 389306 393592 399271 406006 413190 420380 427606
53909D27606P699Q540R093Q701P615O887O961O950N903M172K706J500pj456j863
$$ 427606 435305 443845 452938 461639 469254 476141 483102 490052 495955 500127 502833 504333 504326 502870 501007
53894E01007j293q21p34k66O60R85M18K96J727M085O156P573Q125O724K422m065
$$ 501007 499714 498893 498159 497893 498553 499538 499956 500252 501979 506064 512220 519793 527918 534642 537064 532999
53878E32999j0758j6035j9239k0377k0043j9156j8049j6283j3750j1307r744q771
$$ 532999 522241 506206 486967 466590 446547 427391 409342 393059 379309 368002 358258 349487
53866C49487p761o809o331o186n979n765n762n734n297m499l638k882k423k475
$$ 349487 341726 334917 328586 322400 316421 310656 304894 299160 293863 289364 285726 282844 280421 277946
53852B77946k784k745k353k276k631k547j508k53L09J87k43j045k074k435j540
$$ 277946 275162 272417 270064 267788 265157 262610 261102 260849 261158 261345 261102 260057 257983 255548 254008
53837B54008r1Q38J126J187R83L40l21n33n11o11n32M6O96Q96R05J115J176P45
$$ 254008 253917 254755 255881 257068 258051 258391 258070 257537 257026 256415 255883 255929 256625 257521 258426 259541 260717 261462
53819B61462L91P63J385J377Q77O61Q23R33J014J280J341Q23M24J075K396L169
$$ 261462 261853 262616 264001 265378 266255 266916 267739 268672 269686 270966 272307 273130 273554 274629 277025 280194
53803B80194L126L060L322L561L843M672N787O221N781N346N428N562N394N274
$$ 280194 283320 286380 289702 293263 297106 301778 307565 313786 319567 324913 330341 335903 341297 346571
53789C46571N405N344M842M266L807L033J744N45q0n69j517k577k823k093j317
$$ 346571 351976 357320 362162 366428 370235 373268 375012 375557 375477 374908 373391 370814 367991 365898 364581
53774C64581j398k225k993l331l669m424n238n470n240n247n559n415m522l699
$$ 364581 363183 360958 357965 354634 350965 346541 341303 335833 330593 325346 319787 314372 309850 306151
53760C06151l712m186m288l923l543l299l085k986k993k699j940j308j327j625
$$ 306151 302439 298253 293965 290042 286499 283200 280115 277129 274136 271437 269497 268189 266862 265237
53746B65237j572j301j304j501j502j340j186p72QM66L7o54o83k58j43j59M22
$$ 265237 263665 262364 261060 259559 258057 256717 255531 254759 254767 255233 255270 254616 253933 253675 253532 253373 253795
53729B53795J329J550J034P25Q49O33q3l11N08J584J970J745J464J276J123J135
$$ 253795 255124 256674 257708 258433 259282 259915 259832 259521 260029 261613 263583 265328 266792 268068 269191 270326
53713B70326J351J489J413J321J320J269J215J425J870K159K064J623Q55n2l65
$$ 270326 271677 273166 274579 275900 277220 278489 279704 281129 282999 285158 287222 288845 289700 289648 289283
53698B89283N56K219L446L816L973M371M600M238L528K869K242J497P25Q3k97
$$ 289283 289839 292058 295504 299320 303293 307664 312264 316502 320030 322899 325141 326638 327363 327446 327149
53683C27149k23L31R19J069R05P90N25k86j227j338n02L14M12R1j00j08q4m4r8
$$ 327149 326926 327257 328176 329245 330150 330940 331465 331179 329952 328614 328112 328426 328838 328929 328829 328721 328637 328593 328495
53664C28495l85o88o15k64n2J0J61J30n35j424j561r04m03m50m17n7j03q63j417
$$ 328495 328110 327422 326807 326543 326491 326501 326662 326792 326257 324833 323272 322368 321965 321515 321098 321041 320938 320075 318658
53645C18658j001k01M8j03O0N60R52J298J917K547K616K186J883J962K100K034
$$ 318658 317657 317456 317504 317401 317461 318021 318973 320271 322188 324735 327351 329537 331420 333382 335482 337516
53629C37516J831J528J059N79M47Q16J420J846J839J432R57Q49J325K204L094
$$ 337516 339347 340875 341934 342513 342960 343776 345196 347042 348881 350313 351270 352119 353444 355648 358742
53614C58742L701L984M083M080L799L086K290K105K628L086K871K461K689L494
$$ 358742 362443 366427 370510 374590 378389 381475 383765 385870 388498 391584 394455 396916 399605 403099
53600D03099M066M003L566L015K426K062K153K341K095J533J198J093Q04M34M48
$$ 403099 407165 411168 414734 417749 420175 422237 424390 426731 428826 430359 431557 432650 433454 433888 434336
53585D34336P00N96K32K35M96K04o14q37N2J158J523J292J002P47O74J240K271
$$ 434336 435036 435632 435864 436099 436595 436799 436185 435348 435400 436558 438081 439373 440375 441122 441796 443036 445307
53568D45307K648J728K96o80j388k431l529l888l455k754j960r99k66l21r72j423
$$ 445307 447955 449683 449979 449299 447911 445480 441951 438063 434608 431854 429894 428895 428629 428308 427336 425913
53552D25913j259p25j46L93Q74J287J706K091K217K055J942K101K282K218K053
$$ 425913 424654 423929 423783 424176 425050 426337 428043 430134 432351 434406 436348 438449 440731 442949 445002
53537D45002K102K453L073L919M724N123N240N654O495P178P342P443P962Q666
$$ 445002 447104 449557 452630 456549 461273 466396 471636 477290 483785 490963 498305 505748 513710 522376
53523E22376R170R634J0305J0900J1133J1391J2191J3321J4223J4875J5629J6469
$$ 522376 531546 541180 551485 562385 573518 584909 597100 610421 624644 639519 655148 671617
53511F71617J7124J7680J8441J9360K0226K1198K2543K3945K4736K4759K4419
$$ 671617 688741 706421 724862 744222 764448 785646 808189 832134 856870 881629 906048
53500I06048K4015K3514K2949K2503K2132K1553K0675J9756J9111J8874J9002
$$ 906048 930063 953577 976526 999029 1021161 1042714 1063389 1083145 1102256 1121130 1140132
53489A140132J9250J9273J8957J8553J8305J8226J8330J8679J8970J8560J7405
$$ 1140132 1159382 1178655 1197612 1216165 1234470 1252696 1271026 1289705 1308675 1327235 1344640
53478A344640J6475J6617J7335J7367J6321J4968J3992J3182J1990J0260Q139
$$ 1344640 1361115 1377732 1395067 1412434 1428755 1443723 1457715 1470897 1482887 1493147 1501286
53467A501286N761L394J436p7j792m405p687j0538j2092j2590j2893j3360j3583
$$ 1501286 1507047 1510441 1511877 1511800 1510008 1505603 1497916 1487378 1475286 1462696 1449803 1436443 1422860
53454A422860j3308j3081j3599j4778j5914j6687j7443j8478j9516k0007j9639
$$ 1422860 1409552 1396471 1382872 1368094 1352180 1335493 1318050 1299572 1280056 1260049 1240410
53443A240410j8563j7406j6963j7422j7876j7092j4794j1814r043o751m872l366
$$ 1240410 1221847 1204441 1187478 1170056 1152180 1135088 1120294 1108480 1099437 1092686 1087814 1084448
53431A084448k133j138o66r42j473j288K3K035M162N973P037P283P559Q903J1158
$$ 1084448 1082315 1081177 1080511 1079569 1078096 1076808 1076831 1078866 1083028 1089001 1096038 1103321 1110880 1119783 1130941
53416A130941J3183J4562J5957J7563J8488J8341J8200J9166K0905K2545K4126
$$ 1130941 1144124 1158686 1174643 1192206 1210694 1229035 1247235 1266401 1287306 1309851 1333977
53405A333977K6164K8422L0182L1279L1973L2294L2452L3381L5849L9239M2213
$$ 1333977 1360141 1388563 1418745 1450024 1481997 1514291 1546743 1580124 1615973 1655212 1697425
53394A697425M4387M6474M8848N0916N2034N2298N2281N2417N2775N3087N2987
$$ 1697425 1741812 1788286 1837134 1888050 1940084 1992382 2044663 2097080 2149855 2202942 2255929
53383B255929N2405N1593N0593M9058M6845M4370M2002L9507L6562L3360L0267
$$ 2255929 2308334 2359927 2410520 2459578 2506423 2550793 2592795 2632302 2668864 2702224 2732491
53372B732491K7212K3900K0198J6079J1612P288L677K60m481j1197j8648k5345
$$ 2732491 2759703 2783603 2803801 2819880 2831492 2838780 2842457 2842717 2838236 2827039 2808391 2783046
53360B783046l1304l7227m2691m6595m8864n0391n1416n1377n0364m9379m8894
$$ 2783046 2751742 2714515 2671824 2625229 2576365 2525974 2474558 2423181 2372817 2323438 2274544
53349B274544m8213m6658m4474m2173l9899l7860l6713l6838l7700l8346l8322
$$ 2274544 2226331 2179673 2135199 2093026 2053127 2015267 1978554 1941716 1904016 1865670 1827348
53338A827348l7740l6755l5315l3402l1294k9430k7892k6139k3556k0377j7514
$$ 1827348 1789608 1752853 1717538 1684136 1652842 1623412 1595520 1569381 1545825 1525448 1507934
53327A507934j5386j3526j1659j0443j0505j1351j2086j2724j3904j5593j6927
$$ 1507934 1492548 1479022 1467363 1456920 1446415 1435064 1422978 1410254 1396350 1380757 1363830
53316A363830j7294j6777j5597j3905j2153j0960j0437j0100r358p812n363k537
$$ 1363830 1346536 1329759 1314162 1300257 1288104 1277144 1266707 1256607 1247249 1239437 1234074 1231537
53304A231537m10M45O93J284K188K801L240M286O159Q307J0360J2383J4256J5669
$$ 1231537 1231127 1231572 1232265 1233549 1235737 1238538 1241778 1246064 1252223 1260530 1270890 1283273 1297529 1313198
53290A313198J6878J8555K0717K2582K3664K4211K4431K4036K2944K1673K0681
$$ 1313198 1330076 1348631 1369348 1391930 1415594 1439805 1464236 1488272 1511216 1532889 1553570
53279A553570J9780J8558J6938J5116J3241J1385R489P314M664J656j498m760
$$ 1553570 1573350 1591908 1608846 1623962 1637203 1648588 1658077 1665391 1670055 1671711 1670213 1665453
53267A665453p978j0651j2529j4149j6155j8369k0209k1707k3291k4782k5600
$$ 1665453 1657475 1646824 1634295 1620146 1603991 1585622 1565413 1543706 1520415 1495633 1470033
53256A470033k5862k6318k7138k7744k7889k7916k7799k6995k5533k4268k3624
$$ 1470033 1444171 1417853 1390715 1362971 1335082 1307166 1279367 1252372 1226839 1202571 1178947
53245A178947k3067k2238k1716k1982k2435k2230k1516k1080k1120k1082k0519
$$ 1178947 1155880 1133642 1111926 1089944 1067509 1045279 1023763 1002683 981563 960481 939962
53234I39962j9533j8485j7628j6985j6318j5305j3902j2341j0806r323q026p138
$$ 939962 920429 901944 884316 867331 851013 835708 821806 809465 798659 789336 781310 774172
53222G74172o726o800p619r365j1479j2943j3372j3419j3909j4977j6240j7277
$$ 774172 767446 760646 753027 743662 732183 719240 705868 692449 678540 663563 647323 630046
53210F30046j7693j7190j5866j4243j2802j1662j0753j0002r363q899q746q741
$$ 630046 612353 595163 579297 565054 552252 540590 529837 519835 510472 501573 492827 484086
53198D84086q376p516o897p325q604r836j0431j0241r075p135n580n491o276o363
$$ 484086 475710 468194 461297 453972 445368 435532 425101 414860 405785 398650 393070 387579 381303 374940
53184C74940n488m932n279n468m689l709l377l046j798k74J57n29j133j129j145
$$ 374940 369452 364520 359241 353773 349084 345375 341998 338952 337154 336880 337037 336508 335375 334246 333101
53169C33101j539j783j543j352j707k168j980j238q48j358k230k436j666o31j64
$$ 333101 331562 329779 328236 326884 325177 323009 321029 319791 318943 317585 315355 312919 311253 310622 310458
53154C10458l12n98q82j369j856j737r50l09n26j265j676j481j167j231j625j887
$$ 310458 310146 309548 308666 307297 305441 303704 302754 302445 301919 300654 298978 297497 296330 295099 293474 291587
53138B91587j614q19Q3O52Q03O79L79M5k2K49L73r6p43p09J09R87J506J994K598
$$ 291587 289973 289154 289237 289889 290692 291371 291750 291795 291773 292022 292395 292299 291556 290847 290956 291943 293449 295443 298041
53119B98041K762K058R42J96N1K17L65K26l19r25r61l14L01J51p32j768k418k429
$$ 298041 300803 302861 303803 303999 304050 304267 304632 304858 304539 303614 302653 302339 302640 302791 302059 300291 297873 295444
53101B95444j934j536j771k289k101r00M55J041Q99O15M74M48N31N82L38m5j3
$$ 295444 293510 291974 290203 287914 285813 284913 285368 286409 287308 287923 288397 288845 289376 289958 290296 290251 290238
53084B90238N01P40K12n49q33q26j121j594j556p82K28R00R39L27n10p64J0J215
$$ 290238 290739 291479 291691 291142 290309 289483 288362 286768 285212 284430 284658 285558 286497 286824 286314 285550 285560 286775
53066B86775J827J532R11O27Q15J121J026L18n43p81l10J3m62j221j231k97Q18
$$ 286775 288602 290134 291045 291672 292487 293608 294634 294952 294409 293628 293318 293331 292869 291648 290417 290120 290938
53049B90938J351J194P15M12N97J107J454J457J430J466J040j73j498j914j294
$$ 290938 292289 293483 294198 294610 295207 296314 297768 299225 300655 302121 303161 302988 301490 299576 298282
53034B98282m27op4l67n94m70N0N82P35O43P89J326J884J896R61p85k388k671
$$ 298282 297855 297849 297775 297408 296814 296344 296394 296976 297711 298354 299143 300469 302353 304249 305210 304425 302037 299366
53016B99366j502j29L03Q0J65N97N80l1m05m5M87N56L97O07J140J388J081O62
$$ 299366 297864 297735 298038 298118 298283 298880 299460 299429 299024 298979 299466 300022 300419 301026 302166 303554 304635 305297
52998C05297O80J087J280Q64K30J20N69O94j76j456j930j265l63j51m88n36J35
$$ 305297 305977 307064 308344 309208 309438 309558 310127 310821 310645 309189 307259 305994 305631 305480 304992 304456 304591
52981C04591J147J915K320K626K879K690J824P82L83P81J362J605J628J702J720
$$ 304591 305738 307653 309973 312599 315478 318168 319992 320774 321157 321938 323300 324905 326533 328235 329955
52966C29955J492J168J027J081J176J194R74M12p9K71J485K375J784L6j497k071
$$ 329955 331447 332615 333642 334723 335899 337093 338067 338479 338400 338671 340156 342531 344315 344351 342854 340783
52950C40783k157k381k614k346j535p50n93j064j566j511r37l59n9J27K58J17
$$ 340783 338626 336245 333631 331285 329750 329000 328407 327343 325777 324266 323329 322970 322911 323038 323296 323413
52934C23413k66m31k47k46p26j125r22o58j149k015k071j132l64o06j199j055
$$ 323413 323147 322716 322469 322223 321497 320372 319450 318792 317643 315628 313557 312425 312061 311455 310256 309201
52918C09201j74N42N57J99m6j00j55k78m08n38p18q34o07L0O06M93l56j148r94
$$ 309201 309027 309569 310126 310325 310279 310179 310024 309746 309338 308800 308082 307248 306641 306671 307277 307770 307414 306266 305272
52899C05272K12J637K186J360l00j620j842j268o67k54L27J082J429J056L96J
$$ 305272 305484 307121 309307 310667 310367 308747 306905 305637 304970 304716 305043 306125 307554 308610 309006 309007
52883C09007j36k73m46n99p33o82k01M31M72k12p98o85l67m69n93JJ034J506J200
$$ 309007 308871 308598 308152 307553 306820 306138 305937 306368 306840 306628 305830 305145 304778 304309 303716 303717 304751 306257 307457
52864C07457R47J426K439L347L674L254K417J898J993J974R68p08j835j925j747
$$ 307457 308404 309830 312269 315616 319290 322544 324961 326859 328852 330826 331794 331086 329251 327326 325579
52849C25579k168l191m334n216n535n046l992l065k596k223j581r32p09q03q02
$$ 325579 323411 320220 315886 310670 305135 300089 296097 293032 290436 288213 286632 285700 284991 284188 283386
52834B83386o75p85j224j522j201l55M78R62J169J145O63k76j021r42m10m15j142
$$ 283386 282711 281926 280702 279180 277979 277624 278102 279064 280233 281378 282041 281765 280744 279802 279392 278977 277835
52817B77835j647j176j61N32P12P60R66J516K595L877M406L684K454J723J396
$$ 277835 276188 275012 274851 275383 276095 276855 277821 279337 281932 285809 290215 293899 296353 298076 299472
52802B99472O41p55k207l202l593l242k266j438j481j981j928j200o72p66r28
$$ 299472 300113 299358 297151 293949 290356 287114 284848 283410 281929 279948 278020 276820 276148 275382 274454
52787B74454p31n76q52j160r68m97m23q87j267q39M74K015L045L423L449L083
$$ 274454 273723 273147 272295 271135 270167 269670 269247 268360 267093 266254 266728 268743 271788 275211 278660 281743
52771B81743J919K25q05m96K23J01o14p48j76Q6k47k86L38O86N2q64j100q11p26
$$ 281743 283662 283887 283082 282586 282809 282910 282296 281548 281372 281458 281211 280925 281263 281949 282001 281137 280037 279226 278500
52752B78500q82q23n45l54j15N22J312J598J384J482K378L378L367K201R60O84
$$ 278500 277618 276795 276250 275896 275781 276303 277615 279213 280597 282079 284457 287835 291202 293403 294363 295047
52736B95047J216J575J283P95N90N42M44N02P53P09K38J82J175K311K157Q09k61
$$ 295047 296263 297838 299121 299916 300506 301048 301492 301994 302747 303456 303694 303876 305051 307362 309519 310328 310067
52719C10067l53k74p20j176r77l86lJ09J01j89q82j607j916j719j125k80L84L89
$$ 310067 309714 309440 308720 307544 306567 306181 306178 306287 306388 306199 305317 303710 301794 300075 298950 298670 299054 299443
52701B99443o5k66j15l14j066j484q77J57O04L91J14j4j01Q5Q72J921K488K384
$$ 299443 299378 299112 298997 298683 297617 296133 295256 295413 296017 296408 296522 296508 296407 296492 297364 299285 301773 304157
52683C04157K041J750J374Q26L14J1j52l05m47m95l53l6J85j3n56r39q08l82j45
$$ 304157 306198 307948 309322 310148 310462 310473 310321 310016 309569 309074 308721 308685 308870 308857 308301 307362 306554 306172 306027
52664C06027l50q56j190p58N39J847K056J153L03L60Q51Q99N36N49J374K661L755
$$ 306027 305677 304821 303631 302873 303412 305259 307315 308468 308771 309131 309982 310881 311417 311966 313340 316001 319756
52647C19756M050L198J479j72r37r05p68r42j312j671j993k227k206j810j114
$$ 319756 323806 327004 328483 328311 327374 326469 325701 324759 323447 321776 319783 317556 315350 313540 312426
52632C12426l19L66Q78J303J652J771J653J673K073K324J595r1j721k520k652
$$ 312426 312107 312473 313351 314654 316306 318077 319730 321403 323476 325800 327395 327304 325583 323063 320411
52617C20411k558k205j487p15k79j01Q5K46K02Jk23m26m65q3O00J025R10O41N51
$$ 320411 317853 315648 314161 313446 313167 313066 313151 313397 313599 313600 313377 312951 312486 312403 313003 314028 314938 315579 316130
52598C16130L48k10n90r5J083K074K385K139J473M32n56q04j76O57J056J049J000
$$ 316130 316478 316268 315678 315583 316666 318740 321125 323264 324737 325169 324613 323809 323633 324290 325346 326395 327395
52581C27395Q99L86n52j295j165k61O03Q94R60J351J856J753R01m8n91q87j165
$$ 327395 328294 328680 328128 326833 325668 325407 326010 326904 327864 329215 331071 332824 333725 333677 333086 332199 331034
52564C31034j231r51o95q65j347j689j556q60J64Q66O45k74j007j162j207j479
$$ 331034 329803 328852 328157 327292 325945 324256 322700 321840 322004 322870 323515 323241 322234 321072 319865 318386
52548C18386j533r18K1P29J194J563J517Q20K9j50J01N1l52m25J06O46N09l21
$$ 318386 316853 315935 315956 316685 317879 319442 320959 321779 321808 321658 321759 321810 321458 321033 321139 321785 322294 321973
52530C21973j322j875j525k71J257K134J881P94l29p72l83L86R86J345J692J979
$$ 321973 320651 318776 317251 316980 318237 320371 322252 323046 322717 321945 321562 321948 322934 324279 325971 327950
52514C27950J967J880K292L154L704L618L496L720L567K304M86p24j146j586k454
$$ 327950 329917 331797 334089 337243 340947 344565 348061 351781 355348 357652 358138 357414 356268 354682 352228
52499C52228l291l642l634l538l349k992k507k018j705j722j866j606p72Q9M45
$$ 352228 348937 345295 341661 338123 334774 331782 329275 327257 325552 323830 321964 320358 319586 319675 320120
52484C20120M74N66N76K24r2K58J074J508J236Q19Q31J286J957K721L431L885
$$ 320120 320594 321160 321736 321960 321868 322126 323200 324708 325944 326763 327594 328880 330837 333558 336989 340874
52468C40874L970L629K810J785J266J656K474K949K945K662J902M27j206k139
$$ 340874 344844 348473 351283 353068 354334 355990 358464 361413 364358 367020 368922 369349 368143 366004
52454C66004k479l106m201m913m709m049l410k657j797j475j980k451j940q32
$$ 366004 363525 360419 356218 351305 346596 342547 339137 336480 334683 333208 331228 328777 326837 326005
52440C26005l44q24j323r43P4P78O87J97o4j2j39p96j632j939j505q39m45k35
$$ 326005 325661 324837 323514 322571 322645 323423 324110 324307 324243 324231 324092 323296 321664 319725 318220 317381 316936 316701
52422C16701J66P18R45O48K89M64J126J679J792J788K001K187J977J649J847K617
$$ 316701 316867 317585 318530 319178 319467 319931 321057 322736 324528 326316 328317 330504 332481 334130 335977 338594
52406C38594L406L988M727N735O625P393Q746J0838J2398J1937R471O252L061
$$ 338594 342000 345988 350715 356450 363075 370468 379214 390052 402450 414387 423858 430110 433171
52393D33171l00l971p242r117r233q094o692n776n273m513l254k147j800j791
$$ 433171 432871 428900 421658 412541 403308 395214 388522 382746 377473 372960 369706 367559 365759 363968
52379C63968j226kJ111J579J662J879K417L125L727M052M258M684N222N141L967
$$ 363968 362742 362740 363851 365430 367092 368971 371388 374513 378240 382292 386550 391234 396456 401597 405564
52364D05564K166N34p57j892k650k582j846j131q01o62m54k8P41J683K200K023
$$ 405564 407730 408264 407507 405615 402965 400383 398537 397406 396605 395943 395489 395461 396202 397885 400085 402108
52348D02108J716J855K042J602Q83Q89J750K590K898K989L098L042K974L441M421
$$ 402108 403824 405679 407721 409323 410206 411095 412845 415435 418333 421322 424420 427462 430436 433877 438298
52333D38298N199N476N757O349O880P191P886R370J1081J2201J2662J2913J3153
$$ 438298 443497 448973 454730 461079 467959 475150 483036 492406 503487 515688 528350 541263 554416
52320E54416J3238J3047J2583J1982J1542J1453J1447J1242J1227J2074J3669
$$ 554416 567654 580701 593284 605266 616808 628261 639708 650950 662177 674251 687920
52309F87920J5184J6298J7555J9271K1016K2457K3836K5202K6005K6057K6048
$$ 687920 703104 719402 736957 756228 777244 799701 823537 848739 874744 900801 926849
52298I26849K6524K7027K6969K6602K6279K5366K2927J9264J5876J3868J3005
$$ 926849 953373 980400 1007369 1033971 1060250 1085616 1108543 1127807 1143683 1157551 1170556
52287A170556J2314J1048R136P115N630M752L893K571J030k19j093j808k387k712
$$ 1170556 1182870 1193918 1203054 1210169 1215799 1220551 1224444 1227015 1228045 1227826 1226733 1224925 1222538 1219826
52273A219826k885l081l248l334l610m343n205n434m577k861r13O59J522J819
$$ 1219826 1216941 1213860 1210612 1207278 1203668 1199325 1194120 1188686 1184109 1181248 1180335 1180994 1182516 1184335
52259A184335K086K828M140N829P751R921J2347J4855J7014J8341J8733J8599
$$ 1184335 1186421 1189249 1193389 1199218 1206969 1216890 1229237 1244092 1261106 1279447 1298180 1316779
52247A316779J8351J7865J6837J5434J4084J2771J1200R652Q859Q805Q456P094
$$ 1316779 1335130 1352995 1369832 1385266 1399350 1412121 1423321 1432973 1441832 1450637 1459093 1466187
52235A466187N233L778K753J494m34k954n779q461j0489j1784j2809j3889j4769
$$ 1466187 1471420 1475198 1477951 1479445 1479011 1476057 1470278 1461817 1451328 1439544 1426735 1412846 1398077
52222A398077j5218j5552j6081j6481j6342j5920j5728j5659j5271j4594j3941
$$ 1398077 1382859 1367307 1351226 1334745 1318403 1302483 1286755 1271096 1255825 1241231 1227290
52211A227290j3052j1356r072p283o578o271n295l457j426O5P43O92K77M9M28
$$ 1227290 1214238 1202882 1193810 1186527 1179949 1173678 1168383 1164926 1163500 1163565 1164308 1165000 1165277 1165326 1165754
52196A165754J406K703M176N867P587Q724Q751P849O742N895N097L980K583J227
$$ 1165754 1167160 1169863 1174039 1179906 1187493 1196217 1204968 1212817 1219559 1225454 1230551 1234531 1237114 1238341
52182A238341Kj262k761m595o655q361q943q453q082q752r748r481p606n447m287
$$ 1238341 1238343 1237081 1234320 1229725 1223070 1214709 1205766 1197313 1189231 1180479 1170731 1161250 1153644 1148197 1143910
52167A143910m073l984l543k700j544k99P82J793K961L923L919K903J739J032
$$ 1143910 1139837 1135853 1132310 1129610 1128066 1127767 1128549 1130342 1133303 1137226 1141145 1144048 1145787 1146819
$$ [...]
##END NTUPLES=NMR SPECTRUM
##END=
