##TITLE=AC1737_SEN00010_9276275_QPXx5LwaLv
##JCAMPDX= 6.0         $$ Bruker NMR JCAMP-DX V2.0
##DATA TYPE= NMR SPECTRUM
##DATA CLASS= NTUPLES
##ORIGIN= BRUKER
##OWNER= Administrator
$$ 1.72 TOPSPIN		Version 2.1
$$ 2015-07-14 22:37:07.494 -0700  Administrator@X
$$ Compression mode = diff/dup
##.OBSERVE FREQUENCY= 400.02188249412
##.OBSERVE NUCLEUS= ^1H
##.ACQUISITION MODE= SIMULTANEOUS (DQD)
##.ACQUISITION SCHEME= undefined
##.AVERAGES= 8
##.DIGITISER RES= 22
##SPECTROMETER/DATA SYSTEM= spect
##.PULSE SEQUENCE= zg30
##.SOLVENT NAME= COFFEE_meoh
##.SHIFT REFERENCE= INTERNAL, COFFEE_meoh, 1, 14.98509
##AUDIT TRAIL= $$ (NUMBER, WHEN, WHO, WHERE, PROCESS, VERSION, WHAT)
$$ ##TITLE= Audit trail, TOPSPIN		Version 2.1
$$ ##JCAMPDX= 5.01
$$ ##ORIGIN= Bruker BioSpin GmbH
$$ ##OWNER= Administrator
$$ $$ E:\/data/COFFEE/nmr/AC1737_SEN00010_9276275_QPXx5LwaLv/10/pdata/1/auditp.txt
$$ ##AUDIT TRAIL=  $$ (NUMBER, WHEN, WHO, WHERE, PROCESS, VERSION, WHAT)
(   1,<2015-07-14 22:37:00.104 -0700>,<Administrator>,<X>,<go>,<TOPSPIN 2.1>,
      <created by zg
	started at 2015-07-14 22:35:54.291 -0700,
	POWCHK enabled, PULCHK disabled,
       configuration hash MD5:
       21 0F 79 D6 B3 7B B4 F6 88 20 88 DB 03 48 BD 9F
       data hash MD5: 64K
       F0 28 66 49 4F D8 61 D3 EC B9 4C 16 2C 9E 9C 7D>)
(   2,<2015-07-14 22:37:03.197 -0700>,<Administrator>,<X>,<proc1d>,<TOPSPIN 2.1>,
      <Start of raw data processing
       efp LB = 0 FT_mod = 6 PKNL = 1 PHC0 = 0 PHC1 = 0 SI = 32K 
       data hash MD5: 32K
       B6 E2 E0 79 E8 48 08 54 F5 BC DA 97 8A A8 31 3F>)
(   3,<2015-07-14 22:37:03.447 -0700>,<Administrator>,<X>,<proc1d>,<TOPSPIN 2.1>,
      <pk PHC0 = 89.78027 PHC1 = 0 
       data hash MD5: 32K
       D1 1B 3B C2 F1 E4 61 2C 45 DB A4 F6 50 47 09 4D>)
(   4,<2015-07-14 22:37:03.729 -0700>,<Administrator>,<X>,<proc1d>,<TOPSPIN 2.1>,
      <abs ABSG = 1 
       data hash MD5: 32K
       4B A2 9E 77 6B 76 EE 48 F9 87 93 CA 48 A1 9C DF>)
(   5,<2015-07-14 22:37:03.791 -0700>,<Administrator>,<X>,<proc1d>,<TOPSPIN 2.1>,
      <abs ABSG = 2 
       data hash MD5: 32K
       D1 DB 88 56 63 22 58 69 DD C1 04 49 49 97 36 55>)
(   6,<2015-07-14 22:37:03.869 -0700>,<Administrator>,<X>,<proc1d>,<TOPSPIN 2.1>,
      <abs ABSG = 3 
       data hash MD5: 32K
       3F 02 3A D6 EE 39 B9 E4 36 D4 28 E6 24 CC BC 26>)
(   7,<2015-07-14 22:37:03.932 -0700>,<Administrator>,<X>,<proc1d>,<TOPSPIN 2.1>,
      <abs ABSG = 4 
       data hash MD5: 32K
       55 0D A0 78 23 43 4A 09 B7 A5 33 8B BA 2B FD 87>)
(   8,<2015-07-14 22:37:03.994 -0700>,<Administrator>,<X>,<proc1d>,<TOPSPIN 2.1>,
      <abs ABSG = 5 
       data hash MD5: 32K
       7A F1 DC 58 AB 60 4D 3A E2 01 D3 5E 3C C7 89 8B>)
$$ ##END=
$$ 
$$ $$ hash MD5
$$ $$ A0 0D 3E 32 09 C1 FF 5A 58 59 E8 EF D3 C4 A8 95
##$RELAX= 
##$RELAX= 
##$RELAX= 
##$RELAX= 
##$RELAX= 
##$RELAX= 
##$RELAX= 
$$ Bruker specific parameters
$$ --------------------------
##$DU= <E:\>
##$EXPNO= 10
##$NAME= <AC1737_SEN00010_9276275_QPXx5LwaLv>
$$ [...]
150 150 150 150 150 150 150 150
##$TP07= 0
##$TPNAME0= <>
##$TPNAME1= <>
##$TPNAME2= <>
##$TPNAME3= <>
##$TPNAME4= <>
##$TPNAME5= <>
##$TPNAME6= <>
##$TPNAME7= <>
##$TPOAL= (0..7)
0.5 0.5 0.5 0.5 0.5 0.5 0.5 0.5
##$TPOFFS= (0..7)
0 0 0 0 0 0 0 0
##$TUNHIN= 0
##$TUNHOUT= 0
##$TUNXOUT= 0
##$USERA1= <user>
##$USERA2= <user>
##$USERA3= <user>
##$USERA4= <user>
##$USERA5= <user>
##$V9= 5
##$VALIST= <valist>
##$VCLIST= <CCCCCCCCCCCCCCC>
##$VD= 0
##$VDLIST= <DDDDDDDDDDDDDDD>
##$VPLIST= <PPPPPPPPPPPPPPP>
##$VTLIST= <TTTTTTTTTTTTTTT>
##$WBST= 2048
##$WBSW= 25
##$XGAIN= (0..3)
0 0 0 0
##$XL= 0
##$YL= 0
##$YMAX_a= 596756
##$YMIN_a= -514886
##$ZGOPTNS= <>
##$ZL1= 120
##$ZL2= 120
##$ZL3= 120
##$ZL4= 120
##$ABSF1= 14.98509
##$ABSF2= -5.573092
##$ABSG= 5
##$ABSL= 3
##$ALPHA= 0
##$AQORDER= 0
##$ASSFAC= 0
##$ASSFACI= 0
##$ASSFACX= 0
##$ASSWID= 0
##$AUNMP= <proc_prof1d_extract_pilot.lims>
##$AXLEFT= 0
##$AXNAME= <>
##$AXNUC= <1H>
##$AXRIGHT= 0
##$AXTYPE= 0
##$AXUNIT= <>
##$AZFE= 0.1
##$AZFW= 0.1
##$BCFW= 0
##$BC_mod= 0
##$BYTORDP= 0
##$COROFFS= 0
##$CY= 15
##$DATMOD= 1
##$DC= 0
##$DFILT= <>
##$DTYPP= 0
##$F1P= 0
##$F2P= 0
##$FCOR= 0.5
##$FTSIZE= 32768
##$FT_mod= 6
##$GAMMA= 0
##$GB= 0
##$INTBC= 1
##$INTSCL= 1
##$ISEN= 128
##$LB= 0
##$LEV0= 0
##$LPBIN= 0
##$MAXI= 10000
##$MC2= 0
##$MEAN= 0
##$ME_mod= 0
##$MI= 0
##$NCOEF= 0
##$NC_proc= -8
##$NLEV= 6
##$NOISF1= 0
##$NOISF2= 0
##$NSP= 0
##$NTH_PI= 0
##$NZP= 0
##$OFFSET= 14.98509
##$PC= 1
##$PHC0= 89.78027
##$PHC1= 0
##$PH_mod= 1
##$PKNL= yes
##$PPARMOD= 0
##$PPDIAG= 0
##$PPIPTYP= 0
##$PPMPNUM= 2147483647
##$PPRESOL= 1
##$PSCAL= 4
##$PSIGN= 0
##$PYNMP= <proc.py>
##$REVERSE= no
##$SF= 400.02
##$SI= 32768
##$SIGF1= 0
##$SIGF2= 0
##$SINO= 400
##$SIOLD= 32768
##$SPECTYP= <>
##$SREGLST= <1H.CDCl3>
##$SSB= 0
##$STSI= 32768
##$STSR= 0
##$SW_p= 8223.68421052631
##$SYMM= 0
##$S_DEV= 0
##$TDeff= 65536
##$TDoff= 0
##$TI= <>
##$TILT= no
##$TM1= 0
##$TM2= 0
##$TOPLEV= 0
##$USERP1= <user>
##$USERP2= <user>
##$USERP3= <user>
##$USERP4= <user>
##$USERP5= <user>
##$WDW= 1
##$XDIM= 32768
##$YMAX_p= 438797709
##$YMIN_p= -805527
##$CURPLOT= <Network HP LaserJet P1505>
##$CURPRIN= <$Network HP LaserJet P1505>
##$DFORMAT= <normdp>
##$LAYOUT= <+/1D_H.xwp>
##$LFORMAT= <normlp>
##$PFORMAT= <normpl>
##$SURQMSG= 1
$$ End of Bruker specific parameters
$$ ---------------------------------
##NTUPLES= NMR SPECTRUM
##VAR_NAME=  FREQUENCY,     SPECTRUM/REAL,   SPECTRUM/IMAG
##SYMBOL=    X,             R,               I
##VAR_TYPE=  INDEPENDENT,   DEPENDENT,       DEPENDENT
##VAR_FORM=  AFFN,          ASDF,            ASDF
##VAR_DIM=   32768,         32768,           32768
##UNITS=     HZ,            ARBITRARY UNITS, ARBITRARY UNITS
##FACTOR=    0.250966925370066, 1,           1
##FIRST=     8223.43324360094, -69250,       166490
##LAST=      0,             139987,          -251542
##MIN=       0,             -805527,         0
##MAX=       8223.43324360094, 438797709,    0
$$ Real data points
##PAGE= N=1
##DATA TABLE= (X++(R..R)), XYDATA
$$ [...]
19582a46285C1264J2595G443a70582d0981A73836h9643k11456A05560a72487k4009
19571a96496a5293k26194A42118a74704n0873J06411n0253B05331F4702g7099
19560a59838K1932A02460b96962M3532L3608F8036d5749p595o1752k5897A40606
19548b31747B65355c13898A85395a58106j0898m2972A1465b33476j3926b6563
19537E548f6119l82642B29962i0858j66103b6367j69916J0755e2770F408a60381
19525a38503j61799i270A97576a97939D8562b60201a24317b5822j68485j08740
19515c03047f2419l82465K17213i7507H8182i468j32444k36736e5492l7034A81964
19503b39484f0516o2910A60005f995A29135c43298J51662g2109A02038b33410
$$ y = [-146285, 31264, 43859, 7443, -170582, -40981, 173836, -89643, -301099, 105560, -172487, -196496, -15293, -241487, 142118, -174704, -225577, -119166, -169419, 205331, 64702, -77099, -159838, -137906, 102460, -296962, -253430, -219822, 68036, -45749, -53344, -115096, -140993, 140606, -231747, 265355, -313898, 185395, -158106, -169004, -211976, 11465, -233476, -247402, -26563, 5548, -66119, -448761, 229962, -90858, -256961, -26367, -196283, -185528, -52770, 6408, -160381, -138503, -300302, -9270, 197576, -197939, 48562, -260201, -124317, -25822, -194307, -303047, -62419, -444884, -227671, -97507, 88182, -9468, -141912, -378648, -55492, -92526, 181964, -239484, -60516, -123426, 160005, -6995, 129135, -343298, -191636, -72109, 102038, -233410]
19492a53261p606a5480m36032a96084C33484G8208e42566a05590m8510N0042c8901
19480d4907p5425A80962C2258a32708C25034b48168k7821f8821L2028m3244n2337
19469a32374B5888g8895C7935a6761k08435a08782c6691C1629Q5861k0673c7430
19457c57866A6286K89646d3921I2908c36603a07514j02056D5468a4368D561c73010
19445b99198I5304a29149r8907c5180k60950B9693K52160G4934c8035j72275i7522
19433a6277D7614c98249C68368I2290J09360D2426J51192A4787N7272g2271j04222
19422a76493r7262N75h3277j13639A4883K19958d56143i3253A54096a99548H0493
19410E8342L54742I1993c46785j38010c2066j29397D13133k00410A3892J83386
$$ y = [-153261, -160867, -15480, -451512, -196084, 333484, 78208, -542566, -105590, -154100, -104058, -38901, -44907, -120332, 180962, 32258, -132708, 325034, -248168, -275989, -68821, -36793, -80037, -132374, 25888, -78895, 37935, -16761, -225196, -108782, -36691, 31629, 117490, 96817, -37430, -357866, 16286, 305932, -43921, 92908, -336603, -107514, -209570, 45468, -14368, 4561, -373010, -299198, 95304, -129149, -228056, -35180, -296130, 29693, 281853, 74934, -38035, -210310, -97522, -16277, 47614, -398249, 368368, 92290, 201650, 42426, 193618, 14787, 72059, -72271, -176493, -273755, -273180, -83277, -196916, 14883, 234841, -456143, -93253, 154096, -199548, 80493, 58342, 413084, 91993, -346785, -484795, -32066, -161463, 413133, 212723, 13892, 197278]
19400A97278c17681R9053O4312c8626D4945b51007c5850n4640G512a66385F6871
19388h0865K3870K4820j9546l5128r0494h6458k62178R7977C7481j0604c14069
19376a8802E1909d5536I7874J6178c5428B82693h151A45679E9578c2562H1237
19364b06509B44249b79706a9187k08884H950b84962E8263Q7566c17925a55708
19353a18199m3616F4605O0548b65327B4234b49041K7932B66074a04872o3292a2165
19341i3080l21231A6073i4056C2487b70307j4482J07502C50821a86911r407n1980
19330b48298A80837a98950i0631d0640D3377c2026C4767d6916A24585J39237a33845
19318b77579b8734m7907O727A0618a29343K0679C3221K63022i9690A0416a10894
$$ y = [197278, -317681, -218628, -154316, -38626, 44945, -251007, -35850, -90490, 7512, -166385, 66871, -80865, -56995, -32175, -51721, -86849, -177343, -86458, -348636, -250659, 37481, 26877, -314069, -18802, 51909, -45536, 97874, 114052, -35428, 282693, -8151, 145679, 59578, -32562, 81237, -206509, 244249, -279706, -19187, -228071, 8950, -284962, 58263, 145829, -317925, -155708, -118199, -161815, 64605, 125153, -265327, 24234, -249041, -221109, 266074, -104872, -168164, -12165, -93080, -414311, 16073, -94056, 32487, -270307, -284789, -177287, 350821, -186911, -196318, -248298, 180837, -198950, -90631, -40640, 43377, -32026, 34767, -46916, 124585, 263822, -133845, -277579, -28734, -76641, -69914, 10618, -129343, -108664, 33221, 296243, -99690, 10416, -110894]
19306b0559A76180G2205d63636a39695n4372c9011k45669K1650H4583O4726J8366
19295A67675F3292K23402a94336E5339b08339d4520J4598j46885C5094b20924
19284h6557j4770j22459A25582l1665k8700N5058b62953E1286J56603a6260j30205
19273a46465A88879E7986b06728c8048k53395a33572k4336b4975j08815C9218
19262B77288a53203B03749e5588K0495j30410c6516C25035b10384O8791m4111
19252a85704j50709Q2353A79890a02788L5636J284f953A38790g185B9666b67454
19240b04156B55134g7500k98562A13368J91529b1447j93953G2686b62828b1339
19229a13477K2225b098q5731j10390h4546F9316b8380C26128a27354L2344A69226
$$ y = [-20559, 176180, 72205, -463636, -139695, -194067, -39011, -284680, -263030, 84583, 149309, 167675, 63292, 286694, -194336, 55339, -208339, -44520, -29922, -176807, 35094, -220924, -86557, -101327, -223786, 125582, 93917, 65217, 120275, -262953, 51286, 207889, -16260, -146465, 188879, 57986, -206728, -38048, -291443, -133572, -157908, -24975, -133790, 39218, 277288, -153203, 203749, -55588, -35093, -165503, -36516, 325035, -210384, -141593, -185704, -336413, -254060, 179890, -102788, -67152, -65868, -6953, 138790, -7185, 29666, -267454, -204156, 255134, -77500, -376062, 113368, 304897, -21447, -215400, 72686, -262828, -21339, -113477, -91252, -2098, -87829, -198219, -84546, 69316, -28380, 326128, -127354, -95010, 169226]
19217c7780n8076B2818a09297c9164k58515H9860a26392l2064B2328b63870d7059
19205a42743J1333F3108a63046k02855C4105a11593l0296j5951C83007F806e104
19193a09901p8293e2473M682j86134J15878q3318M4690E6484a07382B69795a66544
19181c05791L8684d4584j56598d4827r6555k5939B23800C8249a46970j00894H101
19169a6974r207k65782I0018k043M1338K47752A6141J26887d5723k1918l66265
19158d33906J91488E6366d0724p5730A12111g2071m3945j9860F4753b33553a4774
19146b63m2922l8778j21927d0388D0761j005N5491m5617J8586a89684A77339b26196
19133a55375k81042C88172a49846c6975j48150h7131H27e3089J8599j80716P0156
$$ y = [-37780, -95856, 22818, -109297, -39164, -297679, 89860, -126392, -158456, 22328, -263870, -47059, -142743, -131410, 63108, -163046, -365901, 34105, -111593, -141889, -157840, 383007, 6806, -5104, -109901, -188194, -52473, -47791, -233925, -118047, -201365, -156675, 56484, -107382, 269795, -166544, -305791, -267107, -44584, -201182, -44827, -141382, -167321, 223800, 38249, -146970, -247864, 8101, -16974, -26181, -291963, 90018, 87975, 129313, 377065, 16141, 143028, -45723, -67641, -433906, -242418, 56366, -40724, -116454, 112111, -72071, -116016, -135876, 64753, -233553, -14774, -263, -43185, -81963, -203890, -40388, 40761, 39756, 95247, 49630, 68216, -189684, 177339, -226196, -155375, -436417, 388172, -149846, -36975, -185125, -87131, 827, -53089, -34490, -215206, -145050]
19122a45050m1046f7756D22972a92265a5661p5277l7443O2544i673A071P458a14625
19109B96750A26520b92504g0849j06540l6128B56328b63928P4932j5715A50477
19098c02396J04832A85432k1279d40439a79713K1604P348j66576J09501m4312
19088b52148C125J3796j875a49473e1228j77760g6517C3318L8543A752R2397b39977
19075c29471a38272A23761E0744b10726q120K8716B21276G8080b49103N4612A91397
19063C53840a89951O1842j90666a52281A06618c01915A3285b24261P8107j55918
19053c02072h1634G388a01925k4876b4534C1496b42482J14921C3093d04554a33612
19041b13032A0461L9061b10470j36185A38569D3873K3416O9033k2586a27865p0879
$$ y = [-145050, -186096, -67756, 422972, -192265, -15661, -90938, -128381, -65837, -9673, 1071, 8529, -114625, 296750, 126520, -292504, -70849, -177389, -213517, 256328, -263928, -188996, -204711, 150477, -302396, -197564, 185432, 164153, -440439, -179713, -158109, -150761, -317337, -207836, -252148, 3125, 16921, 15046, -149473, -51228, -228988, -76517, 33318, 71861, 1752, 94149, -239977, -329471, -138272, 123761, 50744, -210726, -218846, -190130, 221276, 78080, -249103, -194491, 191397, 353840, -189951, -128109, -318775, -152281, 106618, -301915, 13285, -224261, -146154, -302072, -81634, 7388, -101925, -126801, -24534, 31496, -242482, -127561, 33093, -404554, -133612, -213032, 10461, 49522, -210470, -346655, 138569, 43873, 67289, 136322, 113736, -127865, -198744]
19030a98744A86726b03103B0266F793b15987p8767A48364L5804p0534P5653c1361
19018A56898M4459d2627A71334m3032a08158e2306A52660D0652i5523D1999J34972
19007A76971M5829f8633m4539N5150j02311k923j56214R3460C3000C328a57703
18995A71931c58991I7237b19463A6992a06610H2189c24453C8523J16782h9925
18984E4229M4340d20411d3961A30082a0208k5351o4957L197B2000L7851c75949
18972e5485D1801c5218j64315l310A38546a43455e3192H7039a9435A71602m393
18961A67209J63765f0327A39730a00936F6538K0852m2672O2158J0489Q8268a52185
18949H9964f7120k154R996B52114f5226k10092a08224B1715R0550L61a93048Q3054
$$ y = [-198744, 186726, -203103, 20266, 6793, -215987, -294754, 148364, 184168, 113634, 189287, -31361, 156898, 201357, -42627, 171334, 128302, -108158, -52306, 152660, 40652, -95523, 41999, 176971, 222800, -68633, -113172, -58022, -160333, -163256, -319470, -226010, 33000, 3328, -157703, 171931, -358991, 97237, -219463, 16992, -106610, 82189, -324453, 38523, 155305, -89925, 54229, 98569, -420411, -43961, 130082, -10208, -35559, -100516, -97319, 22000, 59851, -375949, -55485, 41801, -35218, -199533, -202843, 138546, -143455, -53192, 87039, -19435, 171602, 167209, 330974, -60327, 139730, -100936, 66538, 87390, 44718, 106876, 117365, 205633, -152185, 89964, -67120, -69274, -59278, 252114, -65226, -275318, -108224, 21715, 112265, 112626, -193048, -109994]
18937a09994e4463A03913B7431b42319j31611c1572k8818D7646C823g9469A13503
18925b6777l2303o592j15389A53841C0644J05897c8581q8361n0506A5561f7314
18913a5121j3841a278k59235A76193a90710P9912j01066A07881c59883q5221g9286
18901b10648B2747J49794B0634J20000g0201K8816k72826B8066b74944G8566a79600
18889I755J58529d0357r940A8323j29e2205N817k38212d8983N392j23557b9975
18876c48319K3673h3364j1867I3663c53020J69744e012n639m01753J58498J9186
18865b34720c6661k79209A95700d090k21881I929a03829A03572i6555L4988j9572
18854h1139H7922L525L3800a27694B50153e3934A65940a69538A75315m1458a41663
$$ y = [-109994, -54463, 103913, 27431, -242319, -373930, -31572, -60390, 47646, 3823, -79469, 113503, -26777, -59080, -65672, -181061, 153841, 30644, 136541, -38581, -126942, -177448, 15561, -67314, -15121, -28962, -1278, -260513, 176193, -190710, -110798, -211864, 107881, -359883, -445104, -79286, -210648, 22747, 172541, 20634, 140634, -70201, -41385, -314211, 28066, -274944, 78566, -179600, 9755, 168284, -40357, -50297, 18323, 18194, -52205, -46388, -284600, -48983, -43591, -167148, -29975, -348319, -324646, -83364, -95231, 93663, -353020, -183276, -5012, -10651, -412404, -253906, -234720, -36661, -315870, 195700, -4090, -225971, 9929, -103829, 103572, -96555, -61567, -81139, 87922, 91447, 125247, -127694, 250153, -53934, 165940, -169538, 175315, 133857, -141663]
18842F3275N1344a92093P1168e7701A7694L9846g7391I6495a40525A5950c46324
18830b85890A87803A8984J34949o2013b21966c8751B17658f4391A74436c38149
18819a03023d2831l9316E22124o7365I0489b94296a35867I8171P4651q2829Q3999
18808A73992q6428R3482c4001j75044e6391A34421a9601n3016j03881C33399c38688
18796e7524j06219L4445B93075E9455O0298d4877a9264r8162n3131N2269k7416
18785a45704j17039J19504o4216B312J1110L3814f535j45851b0466j92273B6727
18773a13518J9739R495h616k45376a6854m3688B1830g9498A747c62252C3600J338
18761C4938c93303J06399A22026i2754d2376l38722G0997i8124r3694P8589d3801
$$ y = [63275, 114619, -192093, -120925, -57701, 17694, 57540, -77391, 96495, -140525, 15950, -346324, -285890, 187803, 18984, 153933, 91920, -221966, -38751, 217658, -64391, 174436, -338149, -103023, -42831, -82147, 522124, 454759, 90489, -294296, -135867, 98171, 172822, 89993, 173992, 87564, 181046, -34001, -209045, -56391, 134421, -19601, -72617, -176498, 333399, -338688, -57524, -163743, -129298, 293075, 59455, 119753, -44877, -19264, -117426, -170557, -118288, -145704, -262743, -143239, -207455, 2312, 13422, 47236, -6535, -152386, -20466, -212739, 26727, -113518, -93779, -84284, -8616, -253992, -16854, -60542, 21830, -79498, 1747, -362252, 33600, 34938, -393303, -286904, 122026, -92754, -42376, -381098, 70997, -98124, -191818, -113229, -43801]
18749A45835a84405B11978a1595G783a83067I2358l0651I307a18820k2520a5342
18737a66824A16984c15927e3276j36196E555b98337D6171g9089L2987B8954I851
18725b27105j1699c4609b097I8079c41266f8020k7180H3839a4475A12331a83753
18713B32230c18808B82818F8799a38359F74J7940a25771b810A57440b60909J24219
18702a36690o1054c1281B10167k9055b18158j808J7447a01042c5819k04656a10114
18690G1620c46604M6649e8782I345J8289J07361k4641j4338J03780c85087h9190
18678d1073j74112F9046d23914E9044K1048c53292A60347a02662I0103A2637b07620
18666b29781a382E3095J71722a13132B7663d8089r7073D4023J50622f8896n6078
$$ y = [145835, -184405, 211978, -11595, 7783, -183067, 92358, 61707, 9307, -118820, -141340, -15342, -166824, 116984, -315927, -53276, -189472, 5555, -298337, 46171, -79089, -46102, 28954, 9851, -227105, -238804, -34609, -2097, 98079, -341266, -68020, -95200, 83839, -14475, 112331, -183753, 232230, -318808, 282818, 68799, -138359, 674, 18614, -125771, -2810, 157440, -260909, -136690, -197744, -31281, 210167, 181112, -218158, -219966, -202519, -101042, -35819, -240475, -110114, 71620, -346604, -299955, -58782, 9345, 27634, 134995, 110354, 96016, 199796, -385087, -89190, -41073, -215185, 69046, -423914, 59044, 80092, -353292, 160347, -102662, 90103, 12637, -207620, -229781, -1382, 53095, 224817, -113132, 27663, -48089, -145162, 44023, 194645, -68896, -124974]
18655a24974n0835c0683O199A94368b07325D1532Q2736i768B59024G1168a04696
18643G3534L6244c2846m7481C37095H0433i6215l8364r639B04258D9314A9979
18631i4369A63311b15060M4812K5783D0918J99412b15929I1527f7205G1360C2958
18619b5879j42263k66125A2299b22792K1271j6742K2361A05633a47514A40689
18608c1624B84594o1727J84049c1737j75982e0760n7766C1457J55195j6229d4418
18596b16821b1536l03479G7069b17080C8147a36817B7326b55829J12097j19647
18586b63379E3659J75733A13180b01303J291h3666j14535i5232A20963K6307O3389
18575B10659a18983o1010O9548C05243a6355n1847j68320o2001C5628P8634A9413
$$ y = [-124974, -175809, -30683, -24484, 194368, -207325, 41532, 124268, -9768, 259024, 71168, -104696, 73534, 109778, -32846, -80327, 337095, 80433, -96215, -134579, -144218, 204258, 49314, 19979, -94369, 163311, -215060, -170248, -144465, 40918, 240330, -215929, 91527, -67205, 71360, 32958, -25879, -168142, -434267, 12299, -222792, -201521, -218263, -195902, 105633, -147514, 140689, -31624, 284594, 222867, 406916, -31737, -207719, -50760, -108526, 31457, 186652, 170423, -44418, -216821, -21536, -325015, 77069, -217080, 38147, -136817, 27326, -255829, -143732, -263379, 53659, 229392, 113180, -201303, -200012, -83666, -198201, -95232, 120963, 147270, 210659, -118983, -179993, -110445, 305243, -16355, -68202, -236522, -298523, 35628, 114262, 19413]
18563a54269B43581I1607c94623a15718j28291f2522D3074f3067l8776I5105b19815
18551A10989m1114R2148K6725K09903A2181b54650k9523A50254d62449b5265k31230
18540b56495h9651E8350k1558a54161B2376a84853A78200D5355a93328A42963
18529b5761k64414R0150A16832A1201c34622a00107j27858e2940B02500a7560
18518b65139H7645b77070C4570q030i0750o3598m787a2928n0710D664N8918b31026
18505b34457B39954c33310B34525b21049c4281k49676H6085c42408e292A01050
18494g4746o8207O9061A07237c52936B7637a13491d743C6174c6855m3539j19102
18483a99496l6176e5018F2972p969d9359J1720j26065l8858k2172B9056a49877
$$ y = [-154269, 243581, 91607, -394623, -115718, -244009, -62522, 43074, -63067, -101843, 95105, -219815, 110989, 69875, 162023, 188748, 398651, 12181, -254650, -284173, 150254, -462449, -25265, -256495, -89651, 58350, 36792, -154161, 22376, -184853, 178200, 45355, -193328, 142963, -25761, -290175, -200025, 116832, 11201, -334622, -100107, -227965, -52940, 202500, -17560, -265139, 87645, -277070, 34570, 26540, -90750, -154348, -159135, -12928, -63638, 4664, 63582, -231026, -234457, 239954, -333310, 234525, -221049, -34281, -283957, 86085, -342408, -5292, 101050, -74746, -142953, -73892, 107237, -352936, 27637, -113491, -4743, 36174, -36855, -80394, -199496, -235672, -55018, 62972, 55003, -49359, -37639, -163704, -202562, -224734, 29056, -149877]
18471B05317a01381A3980d19095a83701k8154b7062A17915n7837d9833j7899A00643
18459b56642i3814A8096c34325J1552a23698c2611r9370k19106B0429a54054r9337
18448b53391R7908C5725i7478b539j22867F9972a34337E06410a57501A06629b59348
18436G2492N7593g3781I8659P9730a03518C92821f6231A72561O987b12328A15628
18424b64620P3053C88554i3449o7255c7171k3957a3089p7036p4186a7963g061
18412h5779j72008g3510m4377n2271A8461J41509l433L8209a60168A7018G520
18400d3707k5305j28119M820Q0757B9685a89985C8661K7770J40311J11163G6844
18388A84136e9936A81352m4670a61791M1617k74411A16385c14116a40290B61522
$$ y = [205317, -101381, 13980, -419095, -183701, -211855, -27062, 117915, 60078, -49833, -67732, 100643, -256642, -93814, 18096, -334325, -322773, -123698, -32611, -131981, -351087, 20429, -154054, -253391, -155483, 35725, -97478, -2539, -125406, 69972, -134337, 506410, -157501, 106629, -259348, 72492, 130085, -73781, 98659, 178389, -103518, 392821, -66231, 172561, 179548, -212328, 115628, -264620, -191567, 388554, -93449, -160704, -37171, -61128, -13089, -90125, -164311, -17963, -7061, -85779, -257787, -73510, -117887, -170158, 18461, 159970, 156537, 194746, -160168, 17018, 7520, -43707, -69012, -197131, -192311, -111554, 29685, -189985, 38661, 66431, 206742, 317905, 76844, 184136, -59936, 181352, 136682, -161791, -120174, -394585, 116385, -314116, -140290, 261522]
18377b37702o1071A52272b5879I0664a26434B72525b77582B11994G3750g3464
18366c04415a08464p8065o5331C143O5986a5858d268A12597J60039I5010a26182
18354a8062N292F2524b31747A6978g7566K9230j24104C1621J05663A4158L9078
18343E3236J4483j8781g636C1202f6211r0016j6694c4669C1457Q8796a17232A87094
18330b39872a332j40239A36827b25621J07030A15669K54373h1520A81191j14b57388
18318a18470B4883a73591c5272G9926Q4480A9740G613j455b45627J08744j5221
18307a52104N92F9723a9235j96435a05192e1190C25915b20841M4092d1402l5602
18296g7004n6033d3867A38032D7122J7185e1612J4637B00672H7810O6552a24261
$$ y = [-237702, -298773, 152272, -25879, 90664, -126434, 272525, -277582, 211994, 73750, -73464, -304415, -108464, -186529, -251860, 3143, 69129, -15858, -4268, 112597, 272636, 95010, -126182, -18062, -12770, 62524, -231747, 16978, -77566, -48336, -172440, 31621, 137284, 14158, 53236, 67719, 48938, -7636, 31202, -66211, -156227, -172921, -34669, 31457, 120253, -117232, 187094, -239872, -1332, -141571, 136827, -225621, -118591, 115669, 370042, -81520, 181191, 181077, -257388, -118470, 24883, -173591, -35272, 79926, 164406, 19740, 7613, 6158, -245627, -136883, -152104, -151512, 69723, -19235, -215670, -105192, -51190, 325915, -220841, -176749, -41402, -77004, -133037, -43867, 138032, 47122, 64307, -51612, -36975, 200672, 87810, 154362, -124261]
18284A6922e5775n2490b0442A19080a62799h586k41331F0528i5504j0415k24002
18273c29921A41429d2483m81290a03353G6725J9086g3892j347B4871j1752J96700
18262B09819a13576o0622Q7048n7938j21308J03784B21096E6554M8035b16163
18251A77000a09967a5241k78065a10151k93672a30664k41127F2606a94255O3322
18241a30933O4871G6103R8436b25574D0630a55236p7159a10018H4712b36006J10090
18230a25916k24026D0199J87199a6492k72219j2968A59262C1294K75124a31945
18219D1485P275b21120k05734a54662H9415a99950O6838l344a7148B01588d9524
18207B17689A6058c25033A40986p234d41408b6213j37622L4696A45804a83545
$$ y = [16922, -55775, -108265, -20442, 119080, -162799, -8586, -249917, 60528, -95504, -105919, -329921, 141429, -42483, -523773, -103353, 76725, 95811, -73892, -75239, 24871, 13119, 209819, -113576, -174198, -87150, -145088, -266396, -162612, 221096, 56554, 104589, -216163, 177000, -109967, -15241, -293306, -110151, -403823, -130664, -371791, 62606, -194255, -130933, -66062, 76103, 174539, -225574, 40630, -155236, -232395, -110018, 84712, -236006, -125916, -349942, 40199, 227398, -16492, -288711, -301679, 159262, 31294, 306418, -131945, 41485, 48760, -221120, -426854, -154662, 89415, -199950, -133112, -136456, -17148, 201588, -49524, 217689, 16058, -325033, 140986, 133752, -441408, -26213, -163835, -129139, 145804, -183545]
18196F5634d4018q0266q1920C0762E186c5617n1869k22820E6268d437n3016k5862
18184h3315B20998a27921D0937d6172B95461a60375j50294H4661F623J62744O5184
18173B34551b81441O0959L803C28435a01978A36609a0989r740m3641a2237C6843
18161C9349e5655b5056m8396C0426K01161H8216a51328k1427f854j07016j10255
18150b24125d533k9934C68019a75423G8144K97167A1456P6026a80923M8891C31273
18138a21113M5166l1067o751A90605K0252a74023A14216l4293a57053F2959A5595
18126a96668A71267g4603j05615C4348b51648J06540A19820m8710b15301B72554
18115A72269a13697j63547B12460h6k08752n7673J09002L9526B0832b56032A01657
$$ y = [65634, -44018, -124284, -206204, 30762, 5186, -35617, -87486, -310306, 56268, -4437, -57453, -83315, 220998, -127921, 40937, -46172, 295461, -160375, -310669, 84661, 6623, 169367, 234551, -281441, -220482, -216679, 328435, -101978, 136609, -10989, -20729, -64370, -12237, 36843, 39349, -55655, -25056, -73452, 30426, 231587, 88216, -151328, -172755, -6854, -113870, -224125, -4533, -34467, 368019, -175423, 78144, 375311, 11456, 87482, -180923, -132032, 331273, -121113, -75947, -107014, -113765, 190605, 210857, -174023, 114216, 79923, -157053, 62959, 15595, -196668, 171267, -74603, -180218, 34348, -251648, -145108, 119820, 71110, -215301, 272554, 172269, -113697, -277244, 212460, -86, -208838, -266511, -157509, -117983, 20832, -256032, 101657]
18103C4085i2989l4986K2034j38805A51832D7215R1630b48321A50254d0715A34761
18091g2662j21245D3057a97779g0260J7837o0378j18213M6112A50623a70599A18512
18079i8064j81951J31988N4266G098R6267J44254a70434j81390G4142K92056F3779
18067a8540C09467a0762M141D18879j83847h2418k38096J14340A54482h6233B0172
18055A13705E4925i2746j13626C5704J66021A5421d4750k38405A35420a60212
18044b06691O4804O2050F1146h4118l7009d7453A93988k401m0919D3905c7590
18032I4650a27798B91967b65851A7870a81021b265j22845J7267I8521c14880a04130
18020e33208b56817e4720E8547e0654A22529H776J08790h8125A73783J7467A4629
$$ y = [34085, -92989, -127975, -105941, -244746, 151832, 47215, 138845, -248321, 150254, -40715, 134761, -72662, -193907, 43057, -197779, -70260, -52423, -112801, -231014, -184902, 150623, -170599, 118512, -98064, -280015, -148027, -93761, 7098, 103365, 247619, -170434, -351824, 74142, 366198, 63779, -18540, 309467, -10762, -6621, 418879, 235032, -82418, -320514, -206174, 154482, -86233, 20172, 113705, 54925, -92746, -206372, 35704, 201725, 15421, -44750, -283155, 135420, -160212, -206691, -141887, -79837, 61146, -84118, -121127, -47453, 193988, 191587, 150668, 43905, -37590, 94650, -127798, 291967, -265851, 17870, -181021, -2265, -125110, -107843, 98521, -314880, -104130, -533208, -256817, -54720, 58547, -50654, 122529, 8776, 117566, -88125, 173783, 191250, 14629]
18008A79982e2433j73561h3295l7191I279K77920A28350n7910a65302A5076J68030
17997A83106b9407C08960b36020A05335b9680B96200b40528B66945b01711F4829
17986a59264A2057c71881A84172K2913b04110A47594G35a71190J5054L6243M7450
17975g2443A01862a34319H1964J658Q2007a11457m3761D3646J55229C9938G045
17963A76824b40389a7624l8743F1483e8509B9301P3160a17693J5288A1917O9684
17952H1601n417a6269k13119M9156A79275J0309q0347c01545B9910f097A15864
17940A93801p625J9406b20348H3199a24985D764P6278a15165b0649m713l02429
17929c27791B0952b80929A47031K01917b3396B47434a04474B8197f0791l045B9053
$$ y = [179982, -52433, -225994, -83295, -120486, 9279, 287199, 128350, 70440, -165302, 15076, 183106, -29407, 308960, -236020, 105335, -29680, 296200, -240528, 266945, -201711, 64829, -159264, 12057, -371881, 184172, 207085, -204110, 147594, 735, -171190, -156136, -119893, -72443, 101862, -134319, 81964, 83622, 165629, -111457, -155218, 43646, 198875, 39938, 7045, 176824, -240389, -17624, -56367, 61483, -58509, 29301, 102461, -117693, -102405, 11917, 81601, 76184, -16269, -229388, -180232, 179275, 189584, 109237, -301545, 29910, -6097, 115864, 193801, 186176, 205582, -220348, 83199, -124985, 4764, 81042, -115165, -20649, -25362, -327791, 20952, -280929, 147031, 348948, -23396, 247434, -104474, 28197, -60791, -63836, 29053]
17917B7916b72993A91848c15498b177j09023j92102K44E7035M9213b55670h4546
17905A67259k3904n0232g1633n4596C3122N0368b65733G5461a07095e1273k69039
17894c20312i5724b5748j62539D28878c80939A71395J2960a90848C6766a0966
17883E4708k6984d7901H841N0487J19507R0148b42810A28675F3461J25829B5396
17871B65575j10992R31a30457A1184a33076f5463b8260B94133F4122g885k11254
17860b19139H7530c16668G9106a61624A48348J87332a40204D3623J65629i8684
17849f3394H3608K12428G4531f4868A00393e485B7305d2473o8864K0060q765D9833
17836a41503A05624a8932r065E9511q277R478c127I3323b66026E6068K81841A46438
$$ y = [27916, -272993, 191848, -315498, -2177, -111200, -303302, -303058, 57035, 106248, -255670, -84546, 167259, 143355, 93123, -71633, -126229, 33122, 83490, -265733, 75461, -107095, -51273, -320312, -95724, -25748, -188287, 428878, -380939, 171395, 184355, -190848, 36766, -10966, 54708, 27724, -47901, 8841, 59328, 178835, 268983, -242810, 128675, 63461, 189290, 25396, 265575, 154583, 155514, -130457, 11184, -133076, -65463, -28260, 294133, 64122, -7885, -219139, 87530, -316668, 79106, -161624, 148348, 335680, -140204, 43623, 209252, -98684, -63394, 83608, 296036, 74531, -64868, 100393, -5485, 27305, -42473, -111337, -91277, -100042, 49833, -141503, 105624, -18932, -27997, 59511, 51234, 60712, -3127, 93323, -266026, 56068, 337909, 146438]
17823b02241A96881K735a96534I6738R0694g8706I271a49508A43955B25e0878
17811b16600B5517i6937C9825b49085M9700b6478j3165A65135I985M4623b87121
17799b63880c0020p9871j343B9550N09420C3285K22357j16097F5837J08703q5444
17788H9096a15922F8198c11508A01432J98761j08573c2679j14976m7674r2514
17778b87843a09688D4197b81832L6854B61075F4836b14531J04899K7647A46565
17767d7865J8818n0492B11505c4088B7004a2070j5557H0789j2598a9525l5319
17756e4844A04661h9854r0261e8283j2022G7576a80060g3277L0824A9991q763
17745A1228c60043a01231k8474n0646f3065j83182A70610p0602i531l89873A4572
$$ y = [-202241, 196881, 199616, -196534, 96738, 187432, -78706, 9271, -149508, 143955, 225, -50878, -216600, 25517, -96937, 39825, -249085, -199385, -26478, -39643, 165135, 9985, 54608, -287121, -263880, -30020, -109891, -111234, 29550, 538970, 33285, 255642, 139545, 65837, 174540, 89096, -115922, 68198, -311508, 101432, 300193, 191620, -32679, -147655, -195329, -287843, -109688, 44197, -281832, -244978, 261075, 64836, -214531, -109632, -81985, 146565, -47865, -29047, -79539, 211505, -34088, 27004, -12070, -27627, 80789, 68191, -19525, -54844, 104661, -89854, -180115, -58283, -70305, 77576, -180060, -73277, -42453, 19991, 11228, -360043, -101231, -129705, -180351, -63065, -246247, 170610, 100008, -9531, -399404, 14572]
17733b17815H4121a64412j63183i2375B04426a55057D4935c09414A23587b25953
17722A19589a21718A7039a14058A85696l8849a02240B77130q9399a11661C6724
17711A24550f6506j28641A6529R3037N5767N5378f2052A71396c78419C16795o038
17700C10757j7304a64878B19145f7669H2772h327k8744F3666b00730g1185B5423
17688D2054Q3471h652B0772J28731a23466B03771J4772b75407D3498n984b23310
17676A85866G4102K58587B7251b21424A18562a6354j5071j45945A69001f9516
17665a69668G6357L2612K90167j91990b71685b4806p4793j349K866B46927j6708
17654B30219d8016j69401A07910N6986f3098b0184A84996c9163A59341f197A0398
$$ y = [-217815, 84121, -164412, -327595, -92375, 204426, -155057, 44935, -309414, 123587, -225953, 119589, -121718, 17039, -114058, 185696, 146847, -102240, 277130, 187731, -111661, 36724, 124550, -66506, -195147, 16529, 109566, 165333, 220711, -62052, 171396, -378419, 316795, 310757, 293453, -164878, 219145, -67669, 82772, -8327, -37071, 63666, -200730, -71185, 25423, 42054, 125525, -8652, 20772, 149503, -123466, 203771, 218543, -275407, 43498, 37514, -223310, 185866, 74102, 332689, 27251, -221424, 118562, -16354, -31425, -177370, 169001, -69516, -169668, 76357, 108969, 399136, 207146, -271685, -24806, -99599, -100948, -98082, 246927, 230219, -48016, -217417, 107910, 164896, -63098, -20184, 184996, -39163, 159341, -6197, 10398]
17642A85612D098K69026G68M6360j5528a67522A38058f4192B46923A10270C4646
17630B23189a92954A85507M2500C6372J36836a70151q1118f2009C86815j37449
17620B49366a7401C90564h4720p5289r1436d5369p2498C46268a01424B06544F6996
17608D6538a34641e9991h984A68455E9699e8341o4190j34862a461j20161A2101
17596D4157j3479J84489e1404A26146l9578a08614B62900i509A50246a38342A680
17584B67866q8950N774E7830Q021a26095M6026F5834b04306A34983J04542a14351
17572b23685a08794b5098C1152c14332J39507l2153A86771Q2884I644a95255J3060
17561a82195J1223A24301m7320a99966B59750a89023b0872A5049P7873Q7147N6283
$$ y = [185612, 4098, 273124, 768, 47128, 31600, -167522, 138058, -64192, 246923, 110270, 34646, 223189, -192954, 185507, 228007, 36372, 173208, -170151, -251269, -62009, 386815, 249366, -17401, 390564, -84720, -160009, -251445, -45369, -117867, 346268, -101424, 206544, 66996, 46538, -134641, -59991, -8984, 168455, 59699, -58341, -122531, -257393, -1461, -121622, 12101, 44157, 30678, 215167, -51404, 126146, 86568, -108614, 262900, -9509, 150246, -138342, 1680, 267866, 178916, 184690, 57830, 65851, -126095, -80069, 65834, -204306, 134983, 239525, -114351, -223685, -108794, -25098, 31152, -314332, -174825, -206978, 186771, 269655, 9644, -195255, -182195, -170972, 124301, 76981, -199966, 259750, -189023, -20872, 15049, 92922, 180069, 236352]
17550B36352E7915Q8059o2211a59788B8727e2613j09988j13383D02209j85836
17540B16373P0049o3471b49014I1102I955M44249A09105c26189F6190n217d8449
17528A15568c2426B01895o8656o5158B7235M5468N14128B72938A621d8335E8672
17516A70031G9321i7641A84586K7854d1524A49215h4669B84562a54674A5453a13850
17504A25570f8384g072n2752G6799J03597b29430a05117I2046j9083q012K69866
17493C34817B0405K11889P6333D6186c5923j01447I803a25575G6308K08929f0837
17481C63188b917A69090j7370L5086C8378J4449i4104e580A66177m2000J97075
17470C21252K57180A25380M2602G0703d0376B61181J25885l4381j28062L0170
$$ y = [236352, 57915, 145974, 83763, -159788, 28727, -52613, -162601, -275984, 402209, 216373, 286422, 222951, -249014, 91102, 9955, 454204, 109105, -326189, 66190, 60973, -48449, 115568, -32426, 201895, 133239, 68081, 27235, 72703, 586831, 272938, 1621, -48335, 58672, 170031, 79321, -97641, 184586, 212440, -41524, 149215, -84669, 284562, -154674, 15453, -113850, 125570, -68384, -7072, -59824, 76799, 180396, -229430, -105117, 92046, 72963, 64951, 334817, 20405, 232294, 308627, 46186, -35923, -137370, 9803, -125575, 76308, 285237, -60837, 363188, -2917, 169090, 151720, 186806, 38378, 52827, -94104, -5580, 166177, 124177, 321252, 578432, 125380, 167982, 70703, -40376, 261181, 387066, 352685, 224623, 254793]
17460B54793j16884A380K1190K18010b3251A43253M22869A96700M5632r2412K25848
17449C75768j38122M32933B63851L1549m2461E2272L42460J54882D7949J11576
17439A59525j8991b90447H3860J67675J65499j89309p3875J38851L59131I5918
17428C325J32142a1646D79040A92765p6590J54440H7810K54416J03745A79906
17417A51808k075B1839J36113K03872J49263B35473J66249D6902e8921D71415
17406A40636b45313D09218j51491n0872j0740F7671J80442c3574H6100J30890
17396B16990b25562A25571J69898r9072J38186A17099N3697C6307N6830M24775
17386E17912J3275D2618L4873M20673e8478D23506A71010a89645F1113a78085
$$ y = [254793, 137909, 1380, 22570, 240580, -23251, 143253, 566122, 196700, 242332, 149920, 375768, 237646, 670579, 263851, 295400, 252939, 52272, 394732, 549614, 47949, 159525, 140534, -290447, 83860, 251535, 417034, 227725, 153850, 292701, 651832, 95918, 3325, 135467, -11646, 479040, 192765, 116175, 270615, 87810, 342226, 445971, 179906, 151808, 149733, 21839, 157952, 361824, 511087, 235473, 401722, 46902, -58921, 471415, 140636, -245313, 409218, 257727, 206855, 196115, 67671, 248113, -33574, 86100, 216990, -225562, 125571, 295469, 196397, 334583, 117099, 170796, 36307, 93137, 517912, 531187, 42618, 77491, 498164, -58478, 423506, 171010, -189645, 61113, -178085]
17375D7870a4982A07300E2135L43869I3521e1036A00710L35511A00150b9950C06667
17363A79004l5631a21329C45783C2239O6437a69248A48052O9221J15523p3952
17353B58844j1416J61635j30077j0277A05960K21229h3536A94816I1715b31579
17342E81417A43575a47511B17385a54909g0377a0146p7039B7974O6605H01J37042
17331A37843k9645J7153N8087J28284F408J95011H1421K22813B9936K5874J74511
17320B30321F594J69963h1976b2241l9892J5382j16255B82384a44970C94255q9269
17309C04986j27121d1494A34275a3176A64272G8200Q0948d9475A29429J37894
17299B67323A02792J48245M4240J27494n2547h7503B48736o981M9912A5044J24170
$$ y = [47870, -14982, 107300, 52135, 396004, 93521, -51036, 100710, 436221, 100150, -29950, 306667, 179004, 143373, -121329, 345783, 32239, 98676, -169248, 148052, 217273, 332796, 258844, 247428, 409063, 278986, 268709, 105960, 327189, -83536, 194816, 91715, -231579, 581417, 143575, -147511, 217385, -154909, -70377, -10146, -87185, 27974, 94579, 801, 137843, 108198, 125351, 183438, 311722, 6408, 201419, 81421, 304234, 29936, 55810, 230321, 6594, 176557, -81976, -22241, -62133, -46751, -163006, 282384, -144970, 394255, 304986, 177865, -41494, 134275, -13176, 164272, 78200, 159148, -49475, 129429, 267323, 102792, 251037, 295277, 422771, 370224, -87503, 248736, 241755, 291667, 15044, 139214]
17288A39214q460L65176a74486b8046q7717J020J3819d7885I1481J7619J88329
17277B97429f265A14177D5272a03369I0266J32128h8140D57496g1549a6298A18199
17265D29750A16449E0261J5022J31361F1126K95514a1013A91522i6532h60B51318
17253E8820E785c6463C14694A21861K27466E2991K4408K96589A712N9106Q8642
17242A49460C6676L43984A86060m7065L37096I7699J55088R877g4106C14965c9725
17230b94050A87526L1326P9797q0880L2176G6709d498B70232H9196K74613A54001
17218A5469O5100L53798l6450j07087k8604B2660O8282j4047J13315Q0741n3485
17207B17466a94108B46535J2230J54815j29074K17267B32289J99274j13837o4435
$$ y = [139214, 130754, 495930, -174486, -28046, -115763, -114743, -100924, -47885, 91481, 109100, 297429, -6265, 114177, 45272, -103369, 90266, 222394, -88140, 457496, -71549, -16298, 118199, 429750, 116449, 50261, 65283, 196644, 61126, 356640, -11013, 191522, -96532, -860, 251318, 58820, 5785, -36463, 314694, 121861, 349327, 52991, 77399, 373988, 1712, 60818, 149460, 36676, 380660, 186060, 138995, 476091, 97699, 252787, 262664, -74106, 314965, -39725, -294050, 187526, 218852, 298649, 217769, 249945, 76709, -4498, 270232, 89196, 363809, 154001, 15469, 80569, 434367, 397917, 290830, 262226, 22660, 90942, 76895, 190210, 270951, 217466, -194108, 246535, 258765, 413580, 284506, 501773, 232289, 431563, 317726, 253291]
17197B53291K10814j16167A50149J34999r2225a17956D37704j50218K04454r7882
17187C94058j08245j10338n280j3428J80032K281J3524m7658J25749a31868B64371
17175B56117l8944J13761J25201j39638N6517K9564j45533r9610J29822K2863
17165C10120J32475a27896B51756g4940B02127K66195n7977c8423B4402J18407
17155A42809K24398j00738m6159M0373K81048H0760L64792A62095J33815O8935
17145C64845j72544l4841j6249L86697A74301J00478J0494Q2872j12100I4984
17134B64887L7879J3758M94312C33931j33260P6128K31823B38806L60160I663
17123A44689K17472A73531K99951k21603M8964K97346B69685P2187J37427F3579
$$ y = [253291, 464105, 347938, 150149, 285148, 192923, -117956, 437704, 287486, 491940, 394058, 285813, 175475, 170195, 156767, 336799, 339080, 352604, 304946, 430695, -131868, 264371, 256117, 217173, 330934, 456135, 316497, 373014, 402578, 257045, 157435, 287257, 310120, 442595, -127896, 251756, -74940, 202127, 468322, 410345, -38423, 24402, 142809, 367207, 266469, 220310, 260683, 541731, 80760, 445552, 162095, 295910, 364845, 192301, 157460, 141211, 527908, 174301, 274779, 285273, 368145, 256045, 94984, 264887, 302766, 316524, 810836, 333931, 200671, 276799, 508622, 238806, 598966, 9663, 144689, 362161, 173531, 473482, 251879, 300843, 598189, 269685, 341872, 479299, 63579]
17112E53477H895N36355A67733M35328B71925K88141A0717M86221o096r9188j71296
17101B20358H2259J80592P2489K17571j60597K7357H5477J90304K53559j66296
17091C63044R5784m9919K04754A77784J25468p5100L91669q1249A47715M86351
17081F34066G5772O53359k17778j77116A44635J21342L21342A04949L43345K15787
17071F64081k42672K32280j49940j03061H2948O4524K51591K46827k87122k7485
17061C31283j09518K43448K36111j53558r0165j19293J07484p8975K04612m1424
17051E30005j66266K34707k59304J25526J23887j01151L29545k69303P477A87683
17040B18585O87994m32436Q7331K62189k90465p4304q4572P7697J30394j32477
$$ y = [553477, 8895, 545250, 167733, 603061, 271925, 560066, 10717, 496938, 490842, 391654, 220358, 82259, 262851, 335340, 552911, 392314, 419671, 85477, 275781, 529340, 363044, 458828, 408909, 613663, 177784, 303252, 228152, 619821, 538572, 147715, 634066, 75772, 729131, 511353, 334237, 144635, 265977, 587319, 104949, 448294, 664081, 421409, 653689, 503749, 400688, 82948, 147472, 399063, 645890, 358768, 331283, 221765, 465213, 701324, 547766, 457601, 338308, 445792, 366817, 571429, 530005, 363739, 598446, 339142, 464668, 588555, 487404, 816949, 547646, 555123, 187683, 218585, 906579, 474143, 561474, 823663, 533198, 458894, 374322, 452019, 582413, 449936]
17030D49936J88193k74142O1493J19200J94742k75823P6685L3758K16975J96181
17020I87198j62249N8124k55638R4732J34267k87837J68060j85593j76311L44937
17010G19690j43736M11442D81042M23722o9152l47111M7945m3876L17523l13194
17000D96899N335K15887j05531J390M6651R0794N9481K04764j96937L2918p7064
16989G74587L5696Q2871q9096j5054j75478K72376R3539k98792m5870j13562M05660
16978I26877K16288k82790j28663m6811K11825Q5715j81691J85852J637L68082
16968A356321j39747k69497L4442J67523j34851k21242J6428J59836O6743k1047
16958A014909j32521J20465j06328K22972j97923K08001k20246J89614j69891
$$ y = [449936, 638129, 363987, 425480, 544680, 739422, 463599, 540284, 574042, 791017, 987198, 824949, 883073, 627435, 722167, 856434, 568597, 736657, 551064, 374753, 719690, 575954, 987396, 481042, 904764, 835612, 488501, 536446, 492570, 810093, 496899, 502234, 718121, 612590, 613980, 660631, 751425, 810906, 1015670, 818733, 851651, 774587, 810283, 893154, 804058, 789004, 613526, 885902, 979441, 680649, 634779, 521217, 926877, 1143165, 860375, 731712, 684901, 896726, 982441, 800750, 986602, 988239, 1356321, 1216574, 947077, 981519, 1149042, 1014191, 792949, 809377, 969213, 1035956, 1014909, 882388, 1002853, 896525, 1119497, 921574, 1129575, 909329, 1098943, 929052]
16949I29052L41372k45932R1405j13247M0185J00135j45608N5265m0526L50780
16939A362881k0321r0288m3941J9995j0821k10002J73033J2844L74461k69206
16929A298635Q5590K04580m82995r9949M04616N2484k343j44624K32910l07581
16919A241323j25697J71359K45003K18086j71697m28696L52367k43308K46412
16910A505152J50210j69134j28145L37753k37366n8841J15835M38378j71803J73063
16900A955102l20277l63515O32110j81598R7036j72984J88599J54997j88104k66595
16890A534771M44600O3452l08714J41629L02781m9359K95132k50439j16276P4871
16880B132448q4740J44065j33171N7925P3230J45271K46110L0032k59615J75655
$$ y = [929052, 1270424, 1024492, 1115897, 1002650, 1042835, 1142970, 997362, 1052627, 1012101, 1362881, 1342560, 1252272, 1208331, 1228326, 1217505, 1007503, 1180536, 1193380, 1567841, 1298635, 1384225, 1588805, 1105810, 1005861, 1410477, 1462961, 1460618, 1315994, 1548904, 1241323, 1115626, 1286985, 1531988, 1750074, 1578377, 1149681, 1502048, 1258740, 1505152, 1655362, 1486228, 1358083, 1695836, 1458470, 1399629, 1515464, 1953842, 1782039, 1955102, 1634825, 1271310, 1903420, 1721822, 1818858, 1645874, 1834473, 1989470, 1801366, 1534771, 1979371, 2042823, 1734109, 1875738, 2178519, 2129160, 2424292, 2173853, 2057577, 2132448, 2047708, 2191773, 2058602, 2116527, 2189757, 2335028, 2581138, 2611170, 2351555, 2527210]
16870B527210j58784J33538l5752M1926J13568q8987J83131J860J74668N595j22693
16859B775280j16209q6427L91704M64790l64845j8321q2243K80939k3372N1340
16849C272636j37922L37949j05065R4273K35586r0252J3685j34978L34102M55979
16839D275993m42086J4974J84248P3540k6316J89760K63639k1770K64074n20378
16829D255678L17385N8705J77590k46442J55030K3938M63367j98369K90062J16916
16819E413860K28501L30406m57712L09284k7136L85513J8385J58392J40590j18864
16809F381219O3162N47246j54393L48441o9842M28902l29705L35680L74913K23140
16799H148763K59456J05974L70969j54414J74176N98001J74553j20764P24185
$$ y = [2527210, 2368426, 2501964, 2466212, 2508138, 2621706, 2532719, 2715850, 2717710, 2892378, 2897973, 2775280, 2659071, 2572644, 2964348, 3429138, 3064293, 3045972, 2963729, 3244668, 3221296, 3272636, 3134714, 3472663, 3367598, 3461871, 3697457, 3607205, 3620890, 3485912, 3820014, 4275993, 3833907, 3848881, 4033129, 4106669, 4080353, 4270113, 4533752, 4511982, 4776056, 4255678, 4573063, 4631768, 4809358, 4562916, 4717946, 4741884, 5205251, 5006882, 5296944, 5413860, 5642361, 5972767, 5515055, 5824339, 5797203, 6182716, 6201101, 6359493, 6500083, 6381219, 6444381, 6991627, 6837234, 7185675, 7115833, 7544735, 7215030, 7550710, 7925623, 8148763, 8408219, 8514193, 8885162, 8730748, 8904924, 9502925, 9677478, 9556714, 10280899]
16790A0280899M8311J43718J85104K04765L32653P07670M48742J70569K56698
16781A2779129J69887M64149L78695Q76976L60433K17503O36908J86697P18420
16772A6788797M14227O03116P13528P12294O79239R46667N05560Q39100N75986
16763B2778514R87370J229061M51512J447373J087194J215117J148739J453115
16755C1797995R63050J509257J827118R61253J949859J807725J875569K447351
16747D5139177J963535K469669K601743K606267K593207L544122K699067L451172
16739F7067959L968083M069163L826754M261738M712914M787458N022122N643960
16731A03360151N144118O083676N878951N703974N921251N965000O028817N557831
$$ y = [10280899, 10329210, 10472928, 10658032, 10862797, 11195450, 11903120, 12351862, 12522431, 12779129, 12949016, 13413165, 13791860, 14668836, 15029269, 15246772, 15883680, 16070377, 16788797, 17203024, 17806140, 18519668, 19231962, 19911201, 20857868, 21363428, 22202528, 22778514, 23765884, 24994945, 25446457, 26893830, 27981024, 29196141, 30344880, 31797995, 32761045, 34270302, 36097420, 37058673, 39008532, 40816257, 42691826, 45139177, 47102712, 49572381, 52174124, 54780391, 57373598, 60917720, 63616787, 67067959, 71036042, 75105205, 78931959, 83193697, 87906611, 92694069, 97716191, 103360151, 108504269, 114587945, 120466896, 126170870, 132092121, 138057121, 144085938, 149643769]
16723A49643769N033372M974898L669463L220350K171147J996560J46489l96992
16715A70459056j566066k350562l115248m095590m635901n338655n464266o117564
16707A37775204o325115n818053o176823n925336n757113o038785n353115n257507
16699I1123357n297557m440279m525925m238240m166906l505018l347699l605458
16691E7996275k972187k606507k549804k506759k641968k196523j877758j937240
16683C8707529j747535j599109j709286j646287q67162j676018j239927j214464
16675B7007741j006644j020552j277384p67656q56055n37990r61726q16788n73750
16666A9189196n61806q89211p99950m57309l37672n89514k06253j176052n0067
$$ y = [149643769, 154677141, 159652039, 163321502, 166541852, 168712999, 170709559, 170856048, 170459056, 168892990, 166542428, 163427180, 159331590, 154695689, 149357034, 143892768, 137775204, 131450089, 125632036, 119455213, 113529877, 107772764, 101733979, 96380864, 91123357, 85825800, 81385521, 76859596, 72621356, 68454450, 64949432, 61601733, 57996275, 55024088, 52417581, 49867777, 47361018, 44719050, 42522527, 40644769, 38707529, 36959994, 35360885, 33651599, 32005312, 31138150, 29462132, 28222205, 27007741, 26001097, 24980545, 23703161, 22935505, 22079450, 21541460, 20579734, 19762946, 19189196, 18627390, 17738179, 16938229, 16480920, 16143248, 15553734, 15347481, 14171429, 14121362]
16657A4121362k55937n84759l08204o44203j17338m72685l18717n57599k55234
16648A0606686k93044k01888k79704J7517m05647l46094k34395k82470P2242k40137
16638H413066n85108K03599m45568j26033j66236m78422M4177k87132R4599p0291
16628F596651k09358k18067J58187n57246r6715J8382j90117p0827j73755r9592
16618E157543Q5053L8626m06475n4798n7577q4900j05005O0656q77969M81198
16608D236352o7486M0136l17917L6990j94554J48470j83024J29140m14042m8113
16598C365952j32470L36391m68962k3861J63669p9317k62142L21854j21874j4968
16588C084272l79725K15470K27268n02610O075O6894o5420L0029k58826R0491
$$ y = [14121362, 13865425, 13280666, 12972462, 12328259, 12210921, 11738236, 11419519, 10861920, 10606686, 10313642, 10111754, 9832050, 9849567, 9443920, 9097826, 8863431, 8580961, 8653203, 8413066, 7827958, 8031557, 7585989, 7459956, 7293720, 6815298, 6859475, 6572343, 6666942, 6596651, 6387293, 6169226, 6327413, 5770167, 5673452, 5691834, 5501717, 5430890, 5257135, 5157543, 5242596, 5281222, 4874747, 4819949, 4762372, 4677472, 4572467, 4633123, 3755154, 4236352, 4168866, 4209002, 3891085, 3928075, 3733521, 3881991, 3698967, 3828107, 3414065, 3365952, 3233482, 3569873, 3100911, 3077050, 3240719, 3161402, 2899260, 3221114, 3099240, 3084272, 2704547, 2920017, 3147285, 2644675, 2650750, 2717644, 2652224, 2682253, 2423427, 2513918]
16578B513918N3059j38677j79705L54405k44750m5312K7962j09054j229P1088
16568B301705j39020P3182K5279p5467O3913P9039o04152L73891k22980L1977
16558A907367N9872j53200J38534j263m26554K82346j21279K41169j43015o9547
16548A714430q4496j74830J18366L34111m60078p9415N3032J14972k05315M21293
16538A752070k46424m909M7219K03862l99067L7987q5749j83456K84959r4721
16528A311771n8085j07730K69503l6077j73409Q112Q5823O1690l58315L88048
16518A391331J005n56670N99926m16684j09861j81447J92162K38667j81107M7346
16508A024668Q4249j06491L06136k68963j64549j44307L14605J73853j79403q5977
$$ y = [2513918, 2566977, 2428300, 2248595, 2603000, 2358250, 2312938, 2340900, 2231846, 2230617, 2301705, 2162685, 2235867, 2261146, 2185679, 2249592, 2328631, 1724479, 2098370, 1875390, 1907367, 1967239, 1814039, 1952573, 1951310, 1524756, 1807102, 1685823, 1926992, 1783977, 1714430, 1629934, 1455104, 1573470, 1907581, 1447503, 1368088, 1421120, 1536092, 1330777, 1752070, 1505646, 1500737, 1547956, 1751818, 1352751, 1390738, 1304989, 1121533, 1406492, 1311771, 1253686, 1145956, 1415459, 1379382, 1205973, 1214085, 1299908, 1361598, 1003283, 1391331, 1392336, 835666, 1435592, 1018908, 909047, 727600, 919762, 1158429, 977322, 1024668, 1108917, 1002426, 1308562, 1039599, 875050, 730743, 1045348, 1219201, 1039798, 953821]
16498I53821K09996l00840l63499M25956m1633K19256l80503L35511r3605k05720
16488G58740R1097k74213K72050K0727q3906Q3571K16185m80652M8447p0848K42754
16477H23952j10190K27498j22585P5176n2216l04389K30755J27105j24521k16279
16467E54306M71576k46432K00614l19961J98679j71971l21296K41225K51811l31881
16457E26670A23130L21173K3000L36825k47908J44240j13794J30632k70783j71963
16447B74552N8933K18542B12142K09964K07119n032j93684O254Q3657j37426K26008
16436F09002k06595J49692O2481K97734l43821j59340K11929L6269C21763L66444
16426F88207k77611q7049R975q4893l0658K55651M2211p5144K2083j35093J35281
$$ y = [953821, 1163817, 862977, 499478, 925434, 883801, 1103057, 722554, 1058065, 964460, 758740, 849837, 575624, 847674, 868401, 784495, 868066, 1084251, 603599, 652046, 581198, 823952, 713762, 941260, 818675, 893851, 841635, 537246, 768001, 895106, 770585, 554306, 1025882, 779450, 980064, 660103, 858782, 686811, 365515, 606740, 858551, 526670, 123130, 444303, 467303, 804128, 556220, 700460, 586666, 717298, 446515, 274552, 333485, 552027, 212142, 422106, 629225, 624193, 430509, 436763, 520420, 382994, 609002, 402407, 552099, 614580, 912314, 568493, 409153, 621082, 657351, 321763, 688207, 410596, 323547, 333522, 248629, 217971, 473622, 515833, 440689, 462772, 327679, 462960]
16415D62960M0853J55721k97613j9612J20904M75819l50558l4346j17792j84812
16405B51524k4670K38770k27997J56239J55064k13210J56361A53057b139E03333
16394C44735L51156k99032p4289P5316P5064p4697k9186L24355B54239l0345J4040
16383B37934J80016I8439J251J33674K00354K75383A32551L31532j34866J83126
16373E12343m4144m1953j60300H2910J3123J88859n5619K11621o4095J95603A50465
16361C66302P8301j02202j68232N7848O4846L2728A28329K09307J65394E8254
16350G7427C6210K78357C2590K54963A13150J40738n6208P2184f5430B13794k4743
16339A89051a09786E19536B28839J01098j6105Q1747A27307f7736C70698b10128
$$ y = [462960, 503813, 659534, 361921, 342309, 463213, 939032, 588474, 554128, 436336, 251524, 226854, 465624, 237627, 393866, 548930, 335720, 492081, 153057, -2139, 503333, 344735, 695891, 396859, 322570, 397886, 472950, 398253, 369067, 693422, 254239, 223894, 237934, 417950, 98439, 99690, 233364, 433718, 709101, 132551, 464083, 329217, 512343, 468199, 426246, 265946, 82910, 96033, 284892, 229273, 440894, 376799, 572402, 150465, 366302, 444603, 342401, 174169, 232017, 296863, 329591, 128329, 337636, 503030, 58254, 77427, 36210, 314567, 32590, 287553, 113150, 253888, 197680, 269864, -65430, 213794, 189051, -109786, 519536, 228839, 329937, 313832, 395579, 127307, -67736, 370698, -210128]
16328D86501A73695K96655k20042E3791O8578a7546B93932A24980J71095Q7307
16318C83382j47006J13663j5062J0809G4317K72638A57158J75619L5328a1459
16307a11649B79991L1598b5214B48647K44071B12021L9486p6288H2056a32189
16296d9867l6958C52041H9504J21770J50167g8638G7745j7383J76246F8649M676
16285G3325j2115g0227D638J80458O3432n2498L76c07821J04995A02584B8968
16273B10173E594b3905C06288F0939K29376P173e1364B0997J4545J63792n1273
16262A48061J92113a52547A87569D4815A4961J127K51397n6960N1552R3535e0983
16250E0544N6797J04485a91353A74175f7129F5315j9964a68106C35095A55701
$$ y = [486501, 173695, 470350, 250308, 53791, 122369, -17546, 293932, 124980, 296075, 383382, 236376, 350039, 334977, 345786, 74317, 346955, 157158, 332777, 368105, -11459, -111649, 279991, 311589, -25214, 248647, 492718, 212021, 251507, 175219, 82056, -132189, -49867, -86825, 352041, 89504, 211274, 361441, -78638, 77745, 60362, 236608, 68649, 73325, 61210, -70227, 4638, 185096, 248528, 196030, 196406, -307821, -202826, 102584, 28968, 210173, 5594, -23905, 306288, 60939, 290315, 297488, -51364, 20997, 35542, 199334, 148061, 340174, -152547, 187569, 44815, 14961, 16088, 267485, 210525, 262077, 355612, -50983, 50544, 107341, 211826, -191353, 174175, -67129, 65315, 45351, -168106, 335095, 155701]
16239E9416a77218I70K04728p502E4380l359R5656i731D424b465C405f8828A8056
16225D0390d447A93232J95336F9508N27056k20113d37A23705n5686J25948K064
16214A96031E9495c38929A77261G3975a84563h4925k11305B93323r9017N8673
16204B52979e4789G4181K24319b95466f6390j63180A54850E4537a10228C74479
16193E3189D227a85065I9122b06106A9618L60228j74822d7530r4736a4761B0553
16181c1422I7967e6895B86531d2982A79421R8587q5476J68369b94594A50207c1616
16169a34954A44551b1018j06763H7146K15150g5476B01278g2143m1939E77193
16158A34725a05355L9704D22978I7964L6548f2441j75169h3977J5456O185j90065
$$ y = [59416, -177218, 970, 205698, 198196, 54380, 51021, 146677, -9731, 4424, -2465, 3405, -68828, 18056, 40390, -4447, 193232, 388568, 69508, 596564, 376451, -437, 123705, 68019, 193967, 196031, 59495, -338929, 177261, 73975, -184563, -84925, -296230, 293323, 194306, 252979, -54789, 74181, 298500, -295466, -66390, -229570, 154850, 54537, -110228, 374479, 53189, 4227, -185065, 99122, -206106, 19618, 379846, 205024, -47530, -142266, -14761, 20553, -31422, 97967, -56895, 286531, -42982, 179421, 278008, 192532, 360901, -294594, 150207, -31616, -134954, 144551, -21018, -127781, 87146, 302296, -75476, 201278, -72143, -114082, 577193, 134725, -105355, -65651, 422978, 97964, 134512, -62441, -237610, -83977, -68521, -62336, -252401]
16147b52401K6164A65129d6323l035k1501l17189A20132a16563A70045b3029A09555
16135D0356a20484K7090B31097a32144B9206N9183b48563B52978g4558o8566B7155
16123i3040B94148a04077d9212C5555C572g0607L2736B9827J12365K6487b41905
16111A97249i6444L0763l62583B80282a42992C44924G6216a75360A19315K9321
16101A48636o1225a11001A62469A0401c00109A64727a17411A7705K48995E0924
16090b51578e9819J8221q5801C46865C217e3630A21909J22272E8051h8976H0843
16078F5237f9920A82870G7981J48898b59834A3076J49985F9581b43900A20307
16067B98666I062J12654n1721A2321R1916a139n1093E2721A3438J1549c3846j74842
$$ y = [-252401, -226237, 165129, -46323, -49358, -70859, -388048, 120132, -116563, 170045, -23029, 109555, 40356, -120484, -93394, 231097, -132144, 29206, 88389, -248563, 252978, -74558, -143124, 27155, -93040, 294148, -104077, -49212, 35555, 3572, -70607, -37871, 29827, 142192, 168679, -241905, 197249, -96444, -65681, -428264, 280282, -142992, 344924, 76216, -175360, 119315, 148636, 87411, -111001, 162469, 10401, -300109, 164727, -117411, 17705, 266700, 50924, -251578, -59819, -41598, -127399, 346865, 3217, -53630, 121909, 244181, 58051, -88976, 80843, 65237, -69920, 182870, 77981, 226879, -259834, 13076, 163061, 69581, -243900, 120307, 298666, 9062, 121716, 69995, 12321, 104237, -1139, -52232, 52721, 13438, 24987, -33846, -208688]
16055b08688R7233A46676E6139O1527c4345A9267b7448p4438a0074q4736N424
16044h9386B08420k0113P4759c39581B5119b70857j60931b1347k34389B5921a85109
16032a05162C5897A2751d5722A14772B5606g6136c1161l8057r3959O9332B831
16020h4856N95k5502H3550K14705e0446A82414B6327c65788f3932p2821j18303
16009b55056L0383k2974D4991L4597c77117d3841j11423O4190A7882b40973A91460
15997a94918K7625K3055A39170B0675O0637f7390q3140H8433j5863j5802a69558
15985A81334m0814a30355D11383j35594L06235k41097j55826J67566G0621b18729
15974D15685B8964J49640b40507m2268J17682d2101k01118c5874r575q0793F485
$$ y = [-208688, -111455, 146676, 56139, 117666, -34345, 19267, -27448, -101886, -10074, -94810, -89386, 208420, 188307, 263066, -339581, 25119, -270857, -431788, -21347, -255736, 25921, -185109, -105162, 35897, 12751, -45722, 114772, 25606, -76136, -31161, -69218, -163177, -93845, 2831, -84856, -84261, -109763, 83550, 298255, -50446, 182414, 26327, -365788, -63932, -136753, -255056, -224673, -247647, 44991, 79588, -377117, -43841, -155264, -91074, 17882, -240973, 191460, -194918, -167293, -144238, 139170, 20675, 81312, -67390, -150530, 88433, 72570, 56768, -169558, 181334, 140520, -130355, 411383, 275789, 582024, 340927, 185101, 352667, 70621, -218729, 415685, 28964, 178604, -240507, -282775, -165093, -42101, -243219, -35874, -45449, -126242, 6485]
15962H8145D0807e4824A58668g5279F848c17794A23633a77242K1533A45729Q310
15951A54039b26694H8352D3836J15396a42468O5488D8762a02995H8289K7566c0942
15939a00337E7821K40734c65955A98267b86531F5608J34228c27061J25400A46576
15928C5983a10211O581A63221f8558A94978a46774f3850A49140O8543H336N82644
15917E90980A5852J11010h6379l7489a8020j40188j54271e4138j69811m6102a7034
15905a19929r5574H1570e7204o43k8688j25468A07491l3072a5576k83890B08555
15893A03079a6423k37003B11859d6342j0102a4130A91310n6278b45092Q1766A39589
15881A09527b84479f9522l9267Q934D1068j7613a73575j30872J6540f8790J5916
$$ y = [88145, 40807, -54824, 158668, -75279, 6848, -317794, 123633, -177242, -155709, 145729, 154039, -226694, 88352, 43836, 159232, -142468, -76980, 48762, -102995, 88289, 115855, -30942, -100337, 57821, 298555, -365955, 198267, -286531, 65608, 199836, -327061, -201661, 146576, 35983, -110211, -103630, 163221, -68558, 194978, -146774, -63850, 149140, 217683, 8336, 590980, 15852, 126862, -86379, -123868, -18020, -158208, -312479, -54138, -223949, -270051, -17034, -119929, -215503, 81570, -57204, -57847, -86535, -212003, 107491, 74419, -15576, -299466, 208555, 103079, -16423, -253426, 211859, -46342, -56444, -14130, 191310, 135032, -245092, -163326, 139589, 109527, -284479, -69522, -108789, -99855, 41068, 23455, -173575, -304447, -287907, -68790, -52874]
15870e2874j48403c6512l64214A02646b85950Q0475h2764p6745A50084f8506l4853
15859a03359A62581M7761a55897D214K12320B0100c17706f8718j3841L3681B54798
15847B2948J44833C3718b15163B0776J83227E1772a12208A48911a13504o2198
15837a75702f7627k1511A63181k4107h7498j32832e6568A0368J41999d67320a42115
15825G4519M129b32787d9901A80487b09293L8676c3535j52714O7916j96361C8895
15813a90259A22733f484p5835l2568A26673f6930A53364i867I7282a405F1474
15801d5389k64140A01855A7662J61448F7244a76760A38170C0116J00924a30230
15790a78154C8640R6208g9382L9220B6885a45510f1787K6546j58219h0874A66621
$$ y = [-52874, -201277, -36512, -400726, 102646, -285950, -205475, -82764, -159509, 150084, -68506, -103359, 162581, 210342, -155897, 4214, 216534, 20100, -317706, -68718, -82559, -48878, 254798, 22948, 167781, 33718, -215163, 20776, 204003, 51772, -112208, 148911, -113504, -175702, -67627, -89138, 163181, 139074, -87498, -220330, -56568, 10368, 152367, -467320, -142115, 74519, 78648, -232787, -49901, 180487, -209293, -170617, -33535, -186249, -118333, -314694, 38895, -190259, 122733, -6484, -82319, -114887, 126673, -66930, 153364, -9867, 97282, -1405, 61474, -45389, -309529, 101855, 17662, 179110, 67244, -176760, 138170, 30116, 131040, -130230, -178154, 38640, 134848, -79382, -40162, 26885, -145510, -61787, -35241, -193460, -80874, 166621]
15778c50976a70289a99m7460E17631b57772A65828b35352D6908d01795B88411
15767A05453h4403B23579a96318g614B57456b21572a2385H0255b37392Q1632D4566
15755A91107A5793N3055b2457j68198G1687n420L33307c3774A8795L3033a25232
15743A12923j2665Q3328k3841C7274J7706J0787J81671b35830a0607B83248j14451
15732A68797J18156i9485I2492b53433d2598A30396g0333l918P393i683k35037
15721b44720B15221C7480a8941j13916C6417a1556A62013a2204j89824M2684B02588
15709B25464a16008J2196B5836a51074j57419b7517C395h7535C13520i9253j6504
15698a15757e0749A78436e7537F5381b31704b3347j14453m3118C09486j38897
$$ y = [-350976, -170289, -199, -47659, 517631, -257772, 165828, -235352, 46908, -401795, 288411, 105453, -84403, 223579, -196318, -7614, 257456, -221572, -12385, 80255, -237392, -155760, 44566, 191107, 15793, 68848, -22457, -190655, 71687, 66267, 399574, -33774, 18795, 51828, -125232, 112923, 100258, 183586, 159745, 37274, 54980, 65767, 247438, -235830, -10607, 283248, 168797, 286953, -99485, 92492, -253433, -42598, 130396, -70333, -74251, -66858, -9683, -244720, 215221, 37480, -18941, -132857, 36417, -11556, 162013, -12204, -202028, -159344, 202588, 225464, -116008, -103812, 25836, -151074, -308493, -27517, 3395, -87535, 313520, -99253, -115757, -50749, 178436, -57537, 65381, -231704, -23347, -137800, -180918, 309486, 170589]
15688A70589O5623A13763G318a01521D79442a5120k03786I2977J82804B8706g1950
15676i5218K2268a9742p9826A00563C6824f7309I970J81670c19975A1636h0506
15664g3344I3383P5866g0351j98544g9558D6902j4406b65009H2300d0131b847
15652c01506D5909I626b86673B25981g6246E2202a77830k94435a41158G3509c3328
15640a29086A31601b8873l26335b309p7929A24137c57855h051A09287d8866F247
15628a13047A0872b09418I9153K23286j01333a38628o1316Q1734d2388B98645
15617d17169F4535b08614H9945A5550N9245C7008Q9686m2849a10134J7567J0974
15606h1593C1239b4045j64351d7327m9722A64684i6941m4392A6641c18102h8220
$$ y = [170589, 236212, 113763, 7318, -101521, 479442, -15120, -218906, 92977, 275781, 28706, -71950, -95218, -72950, -19742, -99568, 100563, 36824, -67309, 9970, 191640, -319975, 11636, -80506, -73344, 93383, 169249, -70351, -268895, -79558, 46902, 32496, -265009, 82300, -40131, -2847, -301506, 45909, 9626, -286673, 225981, -76246, 52202, -177830, -472265, -141158, 73509, -33328, -129086, 131601, -28873, -355208, -2309, -80238, 124137, -357855, -8051, 109287, -48866, 6247, -113047, 10872, -209418, 99153, 322439, 221106, -138628, -199944, -118210, -42388, 298645, -417169, 64535, -208614, 89945, 15550, 74795, 37008, 126694, 83845, -110134, -92567, -81593, 31239, -24045, -188396, -47327, -97049, 164684, -96941, -141333, 16641, -318102, -88220]
15594h5288c4561B33339a52828j23052g3318r278j06811O7080A32337K35385f9622
15582b26934c0685B68457i798A11342J8313O8121b42690C47993G3445J086a18186
15570F169a1222A62663f459l0279J334J046B66016k1351A10155d62800a84280
15558c18538J8323D6473a17303J4117k24195G3181J06256b22449A6495c0189B523
15546b26228b7705A74144k7692i3330A60433A7298f0655E0696N1478J03673D9538
15534H0931l7039K43953e7510C49464n4096b7220j36820P5110B7613J65527a40219
15522D7892a7777A82259a14337a3851I9842a49767A60912Q5871q1638J78409A12407
15510A76908a26777B5472M4718c09831A07276K45943p6448a44639a6128m1738
$$ y = [-85288, -34561, 233339, -152828, -275880, -73318, -82596, -189407, -122327, 132337, 367722, -69622, -226934, -30685, 268457, -9798, 111342, 129655, 197776, -242690, 347993, 73445, 74531, -118186, 6169, -11222, 162663, -6459, -36738, -35404, -34358, 266016, 244665, 110155, -462800, -184280, -318538, -300215, 46473, -117303, -103186, -327381, 73181, 179437, -222449, 16495, -30189, 2523, -226228, -27705, 174144, 146452, -93330, 160433, 17298, -60655, 50696, 102174, 205847, 49538, 80931, 43892, 287845, -57510, 349464, 295368, -27220, -164040, -88930, 27613, 193140, -140219, 47892, -17777, 182259, -114337, -13851, 99842, -149767, 160912, 246783, 165145, 343554, 112407, 176908, -126777, 25472, 70190, -309831, 107276, 353219, 276771, -144639, -16128, -57866]
15500e7866G1270J35758a27063j7828e7099A88121A7318f5633B13181c5249j00096
15489a35345k4510b8812Q792j33706I8213K9856h0573E0665Q0816G148J05495
15478A12643l0328O831l484K68921E2673K9872A0930c757j30940b8549j5496J0150
15466c3895B62420e7558A23698J10572H3972j6308Q9867E8146a42691j12773b9409
15454C37476b33916K8323R8675A231b2791j55768e4075A67304g3261A67818a82951
15442B50336p9066H3468a4216B17168b9300C0756Q3362n1612f5101C07534b30142
15430b41791f1922j48873k75019b8306A26206b39013a06768a6425q4535F4861
15419C75581A8209f2378B5849d7912j13661h0417C07362c89548c1260k4901j92771
$$ y = [-57866, 71270, 207028, -127063, -144891, -57099, 188121, 17318, -65633, 213181, -35249, -135345, -159855, -28812, -20020, -153726, 98213, 128069, -80573, 50665, 131481, 7148, 112643, 82315, 89146, 85662, 354583, 52673, 82545, 10930, -3757, -134697, -28549, -44045, -33895, 262420, -57558, 123698, 234270, 83972, 67664, 157531, 58146, -142691, -255464, -29409, 337476, -233916, -205593, -106918, 1231, -22791, -178559, -54075, 167304, -73261, 167818, -182951, 250336, 171270, 83468, -14216, 217168, -29300, 30756, 114118, 62506, -65101, 307534, -230142, -241791, -61922, -210795, -485814, -28306, 126206, -239013, -106768, -16425, -100960, 64861, 375581, 18209, -62378, 25849, -47912, -161573, -80417, 307362, -389548, -31260, -56161, -248932]
15408b48932G5166a75382M3016D62224a35005H07d07098P7008J43119A7515M0026
15397E7541a99374l5665L622B2113c12321C3603K04049g7886B39608c28709B911
15385a87769D23633A65083P1297n8008i1870F02890A80605b44300C0285c8504
15374A18550e0069C6992h3559F9934b61005e1815B64682e27656e1363j14886c5893
15362h8993b4589C45166e9676j58704A50100p1749O7792A3580a68057d103H3815
15350d5279a6520j39562A91205c90515H5079L65071b4214k9377B75928c1661G2400
15338F1107b78394f3393o708G5859b63282I7950k1823a27957j80229D9121J53645
15327B02766J14091j00017c12838e5153A36698d1057j0715n2020q3181A13175
$$ y = [-248932, 75166, -175382, -132366, 462224, -135005, 807, -407098, -330090, -186971, 17515, 57541, -199374, -235039, -231417, 22113, -312321, 33603, 237652, -77886, 239608, -328709, 2911, -187769, 423633, 165083, 236380, 178372, -91870, 602890, 180605, -244300, 30285, -38504, 118550, -50069, 36992, -83559, 69934, -261005, -51815, 264682, -527656, -51363, -166249, -35893, -88993, -24589, 345166, -59676, -218380, 150100, 78351, 146143, 13580, -168057, -4103, 83815, -45279, -16520, -156082, 191205, -390515, 85079, 450150, -24214, -53591, 275928, -31661, 72400, 61107, -278394, -63393, -70101, 75859, -263282, 97950, 76127, -127957, -308186, 49121, 202766, 316857, 216840, -312838, -55153, 136698, -41057, -51772, -103792, -186973, 113175]
15316e1927B96538d4947o3585k4151C8487F230c00473E2574i7162b4039k33111
15305b57150H4124a22596p918A05637g7495j71727D394J73371f7876j1332A46115
15293H0784c01834B17245a20047d3993j67061B8015J87861J86962A22564N992
15283A28556a26678A75075n4344B4602N0676M9322f1777a7605A79643e043p3411
15272g8454m0480G3336a41559A86316B7489R6324c94488J62798E1582b0137o1706
15261h1843D39898A25755K4921p2769f6098B02549J0348a00839A25698f3952c517
15249A57031L26463j79126R83437k62619N1824O01163E69540k32946A02854a18322
15238b86284c1605A05781J98486b9257G1427K10009b20958A07385K01337c3818
$$ y = [-51927, 296538, -44947, -108532, -132683, 38487, 6230, -300473, 52574, -97162, -24039, -257150, 84124, -122596, -130514, 105637, -77495, -249222, 4394, 177765, -67876, -79208, 146115, 80784, -301834, 217245, -120047, -43993, -211054, 28015, 215876, 402838, 122564, 128556, -126678, 175075, 120731, 24602, 75278, 124600, -61777, -17605, 179643, -5043, -78454, -118934, 73336, -141559, 186316, 27489, 123813, -394488, -231690, 51582, -20137, -81843, 439898, 125755, 150676, 77907, -66098, 202549, 212897, -100839, 125698, -63952, -3517, 157031, 483494, 304368, 1287805, 1025186, 1077010, 1678173, 569540, 336594, 102854, -118322, -286284, -31605, 105781, 304267, -29257, 71427, 281436, -220958, 107385, 308722, -33818]
15227H9825J38928c00862g5753f353E2035B5306K5774B3425J18648b02038B79712
15215A87544a86938f860j5065B86093P488F9652J51053J60527j43441K0797i7849
15203B15637f372B03889r0068a51041C08701a6687k11459L3867E445e6879C2754
15191b04345d8414F1847J17758f0319p0470j06048B21365P9139G4572f9906D55974
15179b7189A6462J70674J22586A23966O5940i0114B17114B946a9494E9618J31455
15168A91073O4181K3987A6003d7103A11670P1738E1115J6138M1841L0222a95432
15156a04739j91779C9406J08587L78499a04446A59114d8551A89677e5159A41294
15145A13684L72768A17579J57256g8259q6785P0384m0294f1214B13290a80903
$$ y = [89825, 228753, -300862, -75753, -6353, 52035, 25306, 51080, 23425, 142073, -202038, 279712, 187544, -186938, -6860, -21925, 286093, 293581, 69652, 220705, 381232, 237791, 258588, -97849, 215637, -6372, 203889, 113821, -151041, 308701, -16687, -228146, -194279, 5445, -56879, 32754, -204345, -48414, 61847, 179605, -60319, -130789, -236837, 221365, 300504, 74572, -69906, 455974, -27189, 16462, 187136, 309722, 123966, 189906, -90114, 217114, 2946, -19494, 59618, 191073, 255254, 279241, 16003, -47103, 111670, 183408, 51115, 67253, 109094, 139316, -195432, -104739, -296518, 39406, 147993, 526492, -104446, 159114, -48551, 189677, -55159, 141294, 113684, 486452, 117579, 274835, -78259, -165044, -94660, -134954, -61214, 213290, -180903]
15134b5055H979L90806a23535j70720C86494c59896A53152a23381A88010A5748
15123a52611H9332b85599b702A9563J90917a30779G999a73434B45371p0254J60882
15112C35999a79683C4759K75399A47490h0576A87690E1644L29946G2149J63906
15102B36055j250b7642B13218l6689J98554f7563C50199J10183A00997f7631b4042
15090C91634j86989A01657c8497j66904P6347A56945J69012q5236b4115H2363
15079D1388f7015A32255A4231M59687j47147m5866O6285b08156p0651I175J76329
15068A85504j597a05071B85847J09018A45230J43593M6827p1818a6694B52702
15057B92010J32235I0325d1189B57506a9560l9107B41915E3218J75190j05634
$$ y = [-25055, 8979, 399785, -123535, -294255, 386494, -359896, 153152, -123381, 188010, 15748, -152611, 89332, -285599, -2702, 19563, 210480, -130779, 7999, -173434, 245371, 175117, 335999, -179683, 34759, 310158, 147490, -80576, 187690, 51644, 381590, 72149, 236055, 234805, -27642, 213218, 176529, 375083, -67563, 350199, 460382, 100997, -67631, -24042, 391634, 204645, 101657, -38497, -205401, -129054, 156945, 325957, 240721, -24115, 82363, 41388, -67015, 132255, 14231, 473918, 326771, 280905, 347190, -208156, -278807, 9175, 185504, 183907, -105071, 285847, 394865, 145230, 288823, 335650, 263832, -16694, 252702, 292010, 424245, 90325, -41189, 257506, -19560, -58667, 241915, 53218, 228408, 122774]
15047A22774B8002J18632k8633J74637i6027c2217B05022p6937a78237m7964a9407
15035B49283r2186H079N09661A71415O6134F4611l0000J19650a46469A44619N8130
15024B02749G0678K50975j37353F8089j8419K83942J50021H2381J97655J12842
15014C92878a47963B95842B1591J06282m8141M8464k1639l8237L78087B21778
15003I6562J35464a33783B36004o1742J36587A46421N8880K42256A59541k8656
14993A30885N1395O4365l5054D8457J85621J27167i0912B22164H4214b764A24500
14981B72863M1683G0791J73627R776M6335r8603N6459J663J3294q595i1721D08003
14968B06521g2411E22488n7678A73642J42074m9668H2575N8006J5386K61432F976
$$ y = [122774, 28002, 146634, 118001, 292638, -96027, -32217, 205022, 128085, -178237, -226201, -19407, 249283, 157097, 8079, 517740, 171415, 237549, 64611, 34611, 154261, -146469, 144619, 202749, 70678, 321653, 184300, 68089, 49670, 333612, 483633, 82381, 280036, 392878, -147963, 295842, 21591, 127873, 79732, 128196, 106557, 68320, 446407, 221778, 96562, 232026, -133783, 236004, 174262, 310849, 146421, 205301, 447557, 159541, 130885, 182280, 246645, 211591, 48457, 234078, 361245, -90912, 222164, 84214, -2764, 124500, 272863, 314546, 70791, 244418, 254194, 300529, 201926, 258385, 260048, 273342, 264747, -91721, 408003, 206521, -72411, 522488, 464810, 173642, 315716, 266048, 82575, 140581, 155967, 417399, 6976]
14956G1252J33713L12940A9810M67175A13075j9243K07834F4187a5729j66851
14946a82580C00717A03228O462Q4557b9416C75455A37170K43862j25915J42776
14936C97893o1280A49856O6916J44291o080j07114A22408k1991M7429R8349R6721
14925C42916Q4897I8568J19814Q4932K5101J45331A32066m9684L15716N4392A28843
14913H9225L73795j01388m2998J95670I6330K33477K78585B66376P7869A64610
14902B26047J01288o6184a6198D08926A84710L59495A67043F6745J73429J26006
14892C66180A29387M42122A59988K09172O2887L09663l48421J39942B29293N17677
14882G46970l50034j80001K62426A89420J95579j20153j24315l3412P805J27024
$$ y = [71252, 204965, 517905, 19810, 486985, 113075, 93832, 301666, 64187, -15729, -182580, 300717, 103228, 109690, 194247, -29416, 375455, 137170, 381032, 255117, 397893, 336613, 149856, 216772, 361063, 354983, 247869, 122408, 100417, 147846, 246195, 342916, 427813, 98568, 218382, 303314, 328415, 473746, 132066, 82382, 398098, 452490, 128843, 89225, 463020, 361632, 318634, 514304, 96330, 329807, 608392, 266376, 344245, 164610, 226047, 327335, 261151, -16198, 408926, 184710, 544205, 167043, 66745, 240174, 366180, 129387, 571509, 159988, 369160, 432047, 741710, 393289, 533231, 229293, 746970, 396936, 216935, 479361, 189420, 384999, 264846, 140531, 107119, 114924, 241948]
14872B41948P8096N6069J91414k03247A56146o0661k7437J86903K18567l4103
14862D39415O5183K27231j56995k52539A14597M48818B05762K92588j7556j37845
14852C42949J2265J75815j74983D6615f1061A76359N66412j71650k63566K9083
14842C36638O9226J21681r6573o7076A29187c1906C95807j78599K88123p9466
14832D25865k8103K11878k99107K77517j11759j28569J55068N999A84321L1958
14822B16279J96396K05873J04793l32883J28222k10378N7022J12340k34497J02812
14812C45979N9096L2928j88387Q8977J42360n7002j05523k6089P4982R2971l5521
14801D24771K79201j99142J09240j76098K0655O5835J35836j77586o1876K1598
$$ y = [241948, 320044, 376113, 567527, 364280, 156146, 95485, 68048, 254951, 473518, 439415, 504598, 731829, 574834, 322295, 114597, 563415, 205762, 498350, 480794, 342949, 355214, 531029, 356046, 46615, -61061, 176359, 742771, 571121, 307555, 336638, 405864, 527545, 430972, 363896, 129187, -31906, 395807, 217208, 505331, 425865, 397762, 609640, 310533, 588050, 476291, 347722, 502790, 508789, 184321, 216279, 412675, 618548, 723341, 390458, 518680, 308302, 365324, 477664, 243167, 345979, 405075, 438003, 249616, 338593, 480953, 423951, 318428, 292339, 367321, 460292, 424771, 703972, 504830, 614070, 437972, 458627, 524462, 660298, 482712, 420836, 442434]
14791D42434J33362n1640L30995k58484k43090M54092j06893J08252k96789p19
14781E11520j37922L45379o8280j93841j46661Q4016R1844B19828M42039l01009
14771C60858L7651L07108J57044C69368L55335l04032J0631K06082l8722k12850
14761C85812K11099L17598l79577n7597R317K55457j36209m0398N75285E33839
14750H18796k58660K19166j3736j37314K54210m1503R044J6237j8431k89379N0155
14739F08585j29181J97870j97935O4347K2831J39820q452R1200j95087M9618J98962
14728H42578N967k50694L2587j0338Q4540j74030K41775q0267l1282j14770Q6292
14717F32358L25669m51518K66483k17945L132J58934J80852j10446R9901j63883
$$ y = [442434, 575796, 524156, 855151, 596667, 353577, 807669, 700776, 809028, 512239, 511520, 373598, 718977, 650697, 456856, 310195, 394211, 486055, 219828, 661867, 360858, 398509, 705617, 862661, 369368, 724703, 420671, 431302, 637384, 598662, 385812, 596911, 914509, 534932, 477335, 486652, 742109, 605900, 565502, 1140787, 533839, 818796, 560136, 779302, 765566, 628252, 882462, 840959, 850003, 866240, 847809, 558430, 608585, 479404, 677274, 479339, 543686, 566517, 706337, 697885, 789085, 593998, 643616, 842578, 848545, 597851, 630438, 620100, 704640, 530610, 772385, 692118, 660836, 546066, 632358, 958027, 506509, 772992, 555047, 558179, 717113, 897965, 787519, 887420, 723537]
14707G23537j92921L60052l13006K93949j26161n6641n4922J71884J38013l84328
14697E59456K84417q841k96619M12152p8401j58619p0581L11773k87704J91100
14687H58133j24413K73603q584j90335j23244L05953j48102n8271J48633p7071
14677H56302J19518j91682P9734L0930l342j12096J21288K47410l18021l8J74225
14666A004228k72034K80206J1677K63130l27130Q6162J9571l24339K90116j60156
14656H71431J13752K75893k48191L70190j36865o2476j63562p8201L14107K49309
14646A505387j75907l19576o8092M4217L51392o1750j76102l4240M3027j52895
14636I55461K74143j01451N8388J12958p7752P7635l82683J03903J20735L43166
$$ y = [723537, 530616, 890668, 577662, 871611, 745450, 688809, 633887, 805771, 943784, 559456, 843873, 835032, 538413, 950565, 872164, 713545, 642964, 954737, 667033, 858133, 733720, 1007323, 998739, 808404, 685160, 991113, 843011, 784740, 933373, 856302, 975820, 784138, 863872, 894802, 891460, 779364, 900652, 1148062, 830041, 830003, 1004228, 732194, 1012400, 1024077, 1287207, 960077, 1046239, 1065810, 741471, 1031587, 871431, 985183, 1261076, 1012885, 1383075, 1246210, 1183734, 1020172, 941971, 1256078, 1505387, 1329480, 1009904, 941812, 986029, 1337421, 1275671, 1099569, 1065329, 1108356, 955461, 1229604, 1128153, 1186541, 1299499, 1221747, 1299382, 916699, 1020602, 1141337, 1484503]
14626A484503n73417M71148j71474j79560p335K02591K87914K1470k67846N6871
14616A324865K13679k29328l524j91386O23599k21096k53309m7285K06188N6086
14606A478489k19618O0591L60066n54198M19139j67277J54858j44430j09821J44729
14596A422528J21037Q2562m0603J06311j48843k60993O12085J4552l64587O3361
14586A607410q4135O3348L47714p0718l11263L89005k73815J33514O1692J80578
14576B043330P8915n12659L47944L41034l09965J79436l325k38414P8868L24211
14566B329375l25145J1313L67614o4491Q8910J6682l4346j94095L37484M14033
14556B947334k39064M89109R7541K90826M67093K69071J149869J922720L933272
$$ y = [1484503, 911086, 1382234, 1210760, 1031200, 1023865, 1226456, 1514370, 1535840, 1267994, 1324865, 1538544, 1309216, 1305692, 1114306, 1737905, 1516809, 1263500, 1216215, 1422403, 1478489, 1258871, 1319462, 1679528, 1125330, 1544469, 1377192, 1532050, 1387620, 1277799, 1422528, 1543565, 1626127, 1585524, 1691835, 1542992, 1281999, 1894084, 1908636, 1544049, 1607410, 1523275, 1586623, 1934337, 1863619, 1552356, 1941361, 1667546, 1801060, 1862752, 2043330, 2122245, 1609586, 1957530, 2298564, 1988599, 2168035, 2164710, 1926296, 2005164, 2329375, 2004230, 2015543, 2383157, 2318666, 2407576, 2424258, 2389912, 2195817, 2533301, 2947334, 2708270, 3197379, 3294920, 3585746, 4052839, 4321910, 5471779, 7394499, 11327771]
14547A1327771P413819J7252217M750459A9846842q023901E285232j820505r52208
14539B512519l7080l20262J28432k01024l80984J02127J15695J69876j19910o7223
14529A902166M5641j31751K44061n332k17308M73317k81375M65046k27481J38666
14519B405650k13579P7721K76135K91717m57294j62338J38001K21107r2304K69847
14509B754663o5778q1707K78102j36778j0043J48571q8105J36403k75566L73908
14499C033670Q4747L84474l42196N1293o1755j92756M96833j16098j20727J2400
14489C229885L32167l10083o947J30761N6776Q4927k57003J91838J47518k25021
14479C374818L74933j9462k724L48877l84075o6324K31399q9749K92251j3097
$$ y = [11327771, 18741590, 35993807, 40744266, 19846842, 11822941, 5285232, 3464727, 2512519, 2475439, 2155177, 2283609, 2082585, 1701601, 1803728, 1919423, 2089299, 1969389, 1902166, 1947807, 1816056, 2060117, 2054785, 1837477, 2310794, 2029419, 2494465, 2266984, 2405650, 2192071, 2269792, 2545927, 2837644, 2380350, 2218012, 2356013, 2577120, 2484816, 2754663, 2688885, 2607178, 2885280, 2748502, 2738459, 2887030, 2798925, 2935328, 2659762, 3033670, 3118417, 3502891, 3160695, 3211988, 3150233, 2957477, 3454310, 3338212, 3217485, 3229885, 3562052, 3251969, 3245022, 3375783, 3432559, 3517486, 3260483, 3452321, 3599839, 3374818, 3749751, 3730289, 3727565, 4076442, 3692367, 3626043, 3857442, 3767693, 4059944, 4046847]
14469D046847L54730k78790J31305J21024j02462K35384k4399j65604N1727M72360
14459D842122n39855K78340L53368j38481r1156m8123K58112o3284p5514L21552
14449E097081k04069J30728K60754K99483k18019k2588J76306p9092M48358q7127
14439E801815J99258j23938k18843M7665K37742K01768M9330L27790R0048k36356
14429F376279O2943K88449j0795L73773k34677L8348K96969J13970j28916K81340
14419G457683l08203Q53421n12310M64015K96368j61869J03327L19964J49977
14410H662373k90191K99526l5375Q93364m02064K41310O9934J18118M6452K88215
14400I891662P2081K71220J25048K25991p3006K09999K28335J44071J49813m8446
$$ y = [4046847, 4401577, 4122787, 4254092, 4375116, 4272654, 4508038, 4483639, 4318035, 4369762, 4842122, 4302267, 4580607, 4933975, 4795494, 4704338, 4656215, 4914327, 4851043, 4775529, 5097081, 4893012, 5023740, 5284494, 5583977, 5365958, 5343370, 5519676, 5440584, 5888942, 5801815, 6001073, 5877135, 5658292, 5705957, 5943699, 6145467, 6194797, 6522587, 6612635, 6376279, 6439222, 6727671, 6716876, 7090649, 6855972, 6894320, 7191289, 7305259, 7176343, 7457683, 7149480, 8002901, 7490591, 7954606, 8250974, 8089105, 8192432, 8512396, 8662373, 8372182, 8671708, 8636333, 9529697, 9127633, 9368943, 9438877, 9556995, 9603447, 9891662, 9963743, 10234963, 10360011, 10586002, 10512996, 10722995, 10951330, 11095401, 11245214, 11196768]
14390A1196768M96361L35742o8693O3203N99487P1981J40896M15819k3196M12538
14380A3640906k4165O66396O4792L75737k40636Q42028J84447O9803P71382M9500
14370A6400190J06836K32202N49103N89801K33163L06840N19334L54789N37789
14361A9830047L74496K62419N60706K77910R95866N0271R18856M95410L70424
14352B4136405N89264R29865N14397N68512M19187P33155P73913N27561O54274
14343B9846533J055354R37631O32625J059579P67488R24189J029774J171505J160246
14334C8584924J057038J499527R83634J345501J384003J319046J659098J333312
14326D9166083K033904J525271J732168J665345K344591K299324J928277J916404
$$ y = [11196768, 11693129, 12028871, 11960178, 12023381, 12622868, 12694849, 12835745, 13251564, 13228368, 13640906, 13616741, 14283137, 14347929, 14723666, 14483030, 15325058, 15509505, 15579308, 16350690, 16400190, 16507026, 16739228, 17288331, 17878132, 18111295, 18418135, 18937469, 19292258, 19830047, 20204543, 20466962, 21027668, 21305578, 22301444, 22351715, 23270571, 23765981, 24136405, 24725669, 25655534, 26169931, 26738443, 27157630, 27890785, 28664698, 29192259, 29846533, 30901887, 31839518, 32472143, 33531722, 34299210, 35223399, 36253173, 37424678, 38584924, 39641962, 41141489, 42125123, 43470624, 44854627, 46173673, 47832771, 49166083, 51199987, 52725258, 54457426, 56122771, 58467362, 60766686, 62694963, 64611367]
14318F4611367K513727K600452K753951K842246L079061L460562L254948L101755
14310H8218069L788893M039389M518715L981426M905229M666607N294755N301800
14302A24714883N771912N977745O524150O566109P232134P704695P962093Q517724
14294A80971445Q856832R412291J0183367J0644918J1273896J2070675J2099189
14287B55512613J2513046J3265206J3768110J3801994J3551326J4347717J4481541
14280C51241553J4241192J3946740J3584923J2516979J1351651J0145854P698749
14273D34727641L985801Q4267l38373K51439j203138n299578n657444n833340
14265D20717275q649617j0457322j1634438j2983815j3962189j4465845j4966216
$$ y = [64611367, 67125094, 69725546, 72479497, 75321743, 78400804, 81861366, 85116314, 88218069, 92006962, 96046351, 100565066, 104546492, 109451721, 114118328, 119413083, 124714883, 130486795, 136464540, 142988690, 149554799, 156786933, 164491628, 172453721, 180971445, 189828277, 199240568, 209423935, 220068853, 231342749, 243413424, 255512613, 268025659, 281290865, 295058975, 308860969, 322412295, 336760012, 351241553, 365482745, 379429485, 393014408, 405531387, 416883038, 427028892, 434727641, 438713442, 438797709, 438459336, 438710775, 437507637, 432208059, 426550615, 420717275, 412067658, 401610336, 389975898, 376992083, 363029894, 348564049, 333597833]
14258C33597833j4723262j5262313j4817853j4674728j2814569j2931263j2761259
14251B35612586j1739954j1627491j0682641j0133422r482877r002303q555776
14244A64388122p412260p626339p135591o745507o204228o109546n129545m507775
14236A13517331n760480m515028m692694l998349l664090l306706l353884l579563
14228H0646537l255780k920494k441816k787184k641636k638229k181679k265258
14220E9514461j480709j910401j857907j963888j871148j596680j062670j193466
14212D6577592j729429j204129j259598j495996j189206l00074j154167j382145
14204C6862848j164460j023645j001630q01535m70519o97261j254613r90469o46214
$$ y = [333597833, 318874571, 303612258, 288794405, 274119677, 261305108, 248373845, 235612586, 223872632, 212245141, 201562500, 191429078, 181946201, 172943898, 164388122, 156975862, 149349523, 142213932, 135468425, 129264197, 123154651, 118025106, 113517331, 107756851, 103241823, 98549129, 94550780, 90886690, 87579984, 84226100, 80646537, 77390757, 74470263, 72028447, 69241263, 66599627, 63961398, 61779719, 59514461, 58033752, 56123351, 54265444, 52301556, 50430408, 48833728, 47771058, 46577592, 44848163, 43644034, 42384436, 40888440, 39699234, 39399160, 38244993, 36862848, 35698388, 34674743, 33673113, 32871578, 32401059, 31703798, 30449185, 29458716, 28812502]
14195B8812502m17695j076729o08883l00941j110564k34027o98059l56773q73801
14186B3135030n27509o38313j49465o71955l33377m74839l21335k22206q20189
14177A8975842j47122o32155k00458k87108p02121l48942k70434J42537p76980
14168A5753059j33523l20665k98970j80469l01856k71201m33503n243j60944n52533
14158A3094152K6825m70693R0052n88411J3405k81414k07307k67046j95251k64804
14148A0949508k3955j61966j55740k70391j00944l90297n7921k49797J08293k39510
14138I407280q951l33034k11705N979k6450K4570k55451J51471l91914M0462k05026
14127H197231o49858L18876l007m17667l7642O6443o7704J3642j38858n9044m061
$$ y = [28812502, 28394807, 27318078, 26709195, 26408254, 25297690, 25063663, 24365604, 24008831, 23135030, 22607521, 21969208, 21819743, 21147788, 20814411, 20339572, 20018237, 19796031, 18975842, 18828720, 18196565, 17996107, 17708999, 17006878, 16657936, 16387502, 16530039, 15753059, 15619536, 15298871, 14999901, 14819432, 14517576, 14246375, 13812872, 13807629, 13646685, 13094152, 13120977, 12650284, 12740336, 12151925, 12165330, 11883916, 11676609, 11409563, 11214312, 10949508, 10925553, 10763587, 10607847, 10337456, 10236512, 9846215, 9788294, 9538497, 9646790, 9407280, 9398329, 9065295, 8853590, 8859569, 8833119, 8857689, 8602238, 8753709, 8361795, 8402257, 8197231, 7547373, 7866249, 7863242, 7445575, 7407933, 7474376, 7406672, 7420314, 7281456, 7222412, 7218351]
14116G218351m61000Q9411p1378q1714j52987k0397l25671M4125n95736O29007
14106F272011l93461K77933k94487j13675J78006j16899j26875k58271J01072
14097E525354J3874j96647L3964j20496k8049L58232m55779j28604J86359l50360
14087D837848J37275j52023j78411K10099k76643J8805m2314J74930o0776j64551
14077D504239j1259j35006K22900m36126k18427K48217K59938n73830j30192K45170
14067C975624J1882j04905J07994k81107J96315j14512J02358o2097j74895M4210
14057C700867R2882k51190J33078l90627J66497J3625o2494l29735J38962K5003
14047C236868M5499k93140P5687J15943p9743J35834l88817K18039J79187j00309
$$ y = [7218351, 6757351, 6846762, 6775384, 6693670, 6540683, 6520286, 6194615, 6238740, 5643004, 6272011, 5878550, 6156483, 5861996, 5748321, 5926327, 5809428, 5682553, 5424282, 5525354, 5539228, 5342581, 5376545, 5256049, 5228000, 5586232, 5130453, 5001849, 5188208, 4837848, 4975123, 4823100, 4644689, 4854788, 4578145, 4596950, 4554636, 4729566, 4668790, 4504239, 4492980, 4357974, 4580874, 4144748, 3926321, 4174538, 4434476, 3860646, 3730454, 3975624, 3987506, 3882601, 3990595, 3709488, 3905803, 3791291, 3893649, 3831552, 3656657, 3700867, 3793749, 3542559, 3675637, 3285010, 3451507, 3465132, 3402638, 3072903, 3211865, 3236868, 3282367, 2989227, 3064914, 3180857, 3101114, 3236948, 2848131, 3066170, 3245357, 3145048]
14037C145048k44076P8820j94478J67746j13300J86971k352m6637K08441m11988
14027B774195M58180o01898j91525J50118M7797j39748j1065L5637q0180k71724
14017B169787K98870p7269j02529L15092l34457k2764K15341k5649n5964j16177
14007B264281l68512L12511j64458K00517R1826l20154q8385K00838K36723m21411
13997A943776P1634k31255L59755J03643k14177n8656L50151L63298J158359K533099
13987F379627O053642J6032384J4471468j9057395j0117063n592283k343756j167555
13979D659069n42332n56881j64260n18578k57228j83889K0755J85759j05002K3342
13969B560755R8470k75109J32059J8611o29402L76267k70967O5265n0779N6469
$$ y = [3145048, 2900972, 2979792, 2785314, 2953060, 2839760, 3026731, 3024379, 2977742, 3186183, 2774195, 3232375, 2630477, 2438952, 2589070, 2636867, 2497119, 2486054, 2521691, 2441511, 2169787, 2468657, 2391388, 2288859, 2603951, 2269494, 2246730, 2462071, 2436422, 2380458, 2264281, 1895769, 2208280, 2043822, 2244339, 2336165, 2016011, 1927626, 2128464, 2365187, 1943776, 2015410, 1784155, 2143910, 2247553, 2033376, 1974720, 2324871, 2688169, 3846528, 6379627, 12433269, 28465653, 42937121, 23879726, 13762663, 8170380, 5826624, 4659069, 4116737, 3559856, 3395596, 2877018, 2619790, 2435901, 2456656, 2642415, 2537413, 2560755, 2659225, 2384116, 2516175, 2534786, 1905384, 2281651, 2010684, 2075949, 2025170, 2081639]
13959B081639o5785J23380j59680k63955J64545k0132J71140k59490L7583j27337
13949A681908M61728l22798l46377J70650p3057K07043j33821L70325l48913k12623
13939A454065K58146l73613L02134j50213J15709k9901l7211q2185j57323J60219
13929A459827m0129K14820L5080n6466J18990j91855M2346j82207L46241l98108
13919A348539N4398K38037m7567o2667j04518o360j2377j87442J12313K9525J45537
13908A507418l37249N2419K32699k01213L5R2914r4902Q8115L7006k91395O8786
13897A154633N9739r3382J20771j85946j90815L98797j24760O5361k98469N1561
13887I57490o1689O87661l60072l4882n2536p4071K62217k89957P6677K04572
$$ y = [2081639, 2015854, 2139234, 1979554, 1715599, 1880144, 1860012, 2031152, 1771662, 1809245, 1681908, 2143636, 1820838, 1474461, 1645111, 1572054, 1779097, 1645276, 2015601, 1666688, 1454065, 1712211, 1338598, 1640732, 1490519, 1606228, 1576327, 1539116, 1456931, 1299608, 1459827, 1419698, 1634518, 1669598, 1613132, 1732122, 1540267, 1582613, 1400406, 1746647, 1348539, 1402937, 1640974, 1593407, 1530740, 1426222, 1419862, 1407485, 1220043, 1332356, 1361881, 1507418, 1170169, 1222588, 1455287, 1254074, 1254109, 1347023, 1252121, 1340236, 1377242, 1085847, 1154633, 1214372, 1120990, 1241761, 1055815, 865000, 1263797, 1139037, 1204398, 905929, 957490, 895801, 1583462, 1223390, 1188508, 1135972, 1061901, 1324118, 1034161, 1110838, 1315410]
13877A315410n5543l65032L33543l31373L69895j71409N215k28547j03364m4001
13867G24794L49907j52658Q2319O6369J83041l3847l38528J51311M5813j38945
13857I39576L16023k44421k75178L53685l74313L43348p0846R6692q4962j80137
13847H19467J50867o3730K7745K04270m88988L44211k24579O8247J79687J51223
13837A168420j09335j99321j09936J80812k6159O6678j41348J24011j97289L03465
13827A059998k15668j02554p1856j90142L50013j73141L32397L5759k93233q1419
13817F50154J03277J77929l4690l57873L63806K65505m40947j8808K85344N0013
13807A043710j06665k76842M8195J05421l16742J83734J42667K37909O4603l37793
$$ y = [1315410, 1259867, 894835, 1228378, 897005, 1266900, 1095491, 1100706, 872159, 768795, 724794, 1074701, 922043, 1004362, 1070731, 1253772, 1219925, 881397, 1032708, 1078521, 939576, 1255599, 1011178, 736000, 1089685, 715372, 1058720, 987874, 1084566, 999604, 819467, 970334, 906604, 934349, 1138619, 649631, 993842, 769263, 837510, 1017197, 1168420, 1059085, 859764, 749828, 930640, 904481, 971159, 829811, 953822, 756533, 1059998, 844330, 741776, 669920, 479778, 829791, 656650, 989047, 1024806, 731573, 650154, 753431, 931360, 896670, 538797, 902603, 1168108, 727161, 708353, 993697, 1043710, 937045, 660203, 708398, 813819, 497077, 680811, 823478, 1061387, 1125990, 788197]
13797G88197m6079O0491n2572k49417M69502p0342l07133J14938k84054J91706
13787F15237J18377l7056k85369O39384m79403A65746M42672l1787M18101l21772
13777F72960K48997m00691o4521m34L14666k18874k9172J61381k02920L07192
13767G88584M4392C84679L93895k0549P5192j45686K4921B02786N35357K76146
13757A014289m10425m2905L6542K15427j17192C39786L65465k35470j00405L84120
13747G53496C42916N85811B22257K02082J41257L8418k3475J06006j37354K12317
13737G61508k19811j69568m6984L21594k57983M24760n6888k15204j49569L13707
13727G05562j77228l2413P0421P5264j67884L8853Q677j08370A76320M57667l674
$$ y = [788197, 742118, 802609, 750037, 500620, 970122, 899780, 592647, 707585, 423531, 615237, 733614, 696558, 411189, 1050573, 571170, 165746, 608418, 576631, 994732, 672960, 921957, 521266, 456745, 456311, 770977, 552103, 522931, 684312, 481392, 788584, 832976, 384679, 778574, 758025, 833217, 687531, 712452, 202786, 738143, 1014289, 603864, 560959, 597501, 812928, 695736, 339786, 705251, 469781, 369376, 753496, 342916, 928727, 222257, 424339, 565596, 604014, 580539, 686545, 549191, 761508, 541697, 372129, 325145, 646739, 388756, 813516, 756628, 541424, 391855, 705562, 528334, 495921, 566342, 641606, 473722, 512575, 521252, 412882, 176320, 633987, 630313]
13716F30313Q5310J8111j95213Q0767M9637j46158r7485K1416j96864K74870k07655
13705C17049K49013j49801J26571N0546j19383F6130O31516l19453N774P3752
13695D57719j59953M23562P767k68304k19122R9290K18479l2902J06927B99857
13684C10816K60930Q3111C16973L21180B15913K72288n115J4328M15317D08529
13673C25652J63546l8854K4744p1207N8298j31639L34031K18197m27217J21849
13663E77400k3092j32067N6396J66758j84958j06001L03150k59941J27610j96455
13653C28800L6987n5711K13306J71167k26810K2458J01116B61973P8068H9620
13642A38264L18837A40025N1112L0891K27461j35269j28087K75019B14139O2388
$$ y = [630313, 715623, 733734, 538521, 619288, 668925, 522767, 425282, 446698, 249834, 524704, 317049, 566062, 416261, 542832, 593378, 473995, 66130, 697646, 378193, 383967, 457719, 297766, 721328, 729095, 460791, 241669, 340959, 559438, 526536, 633463, 299857, 310816, 571746, 654857, 316973, 638153, 215913, 488201, 483086, 497414, 912731, 408529, 325652, 489198, 450344, 475088, 403881, 462179, 330540, 664571, 882768, 455551, 577400, 554308, 422241, 478637, 645395, 460437, 354436, 657586, 397645, 525255, 328800, 365787, 310076, 523382, 694549, 467739, 490197, 591313, 261973, 340041, 89620, 138264, 457101, 140025, 191137, 222028, 449489, 314220, 186133, 461152, 214139, 276527]
13632B76527L650Q5468A67426K34847K94448C01634J84704k1370P4407B20182
13621A66668J77372M9538j30346J14571j64143q0861K38686K04610j06985o3282
13611D05828q423A26952K88308H5788L77631M02077E9100L86549A89494J90334
13601C79828M0615j28972m1129K80246A06702L9418J32008I791O24111j96771
13591D37131A89283K52717A68716l3452k2243J34984P4318j07545Q6110A46585
13580A54206L15876j3188A84788J89552p0812L952a1043E58787j32045q3897C8408
13568C31373K15974j31750j5575M4591E9200N86220B83851j9015l8675J42025
13558C68186k846A77119c9834F46830j96307L6632B13619L2458k8022K10768A06264
$$ y = [276527, 280177, 365645, 167426, 402273, 696721, 301634, 486338, 464968, 539375, 220182, 166668, 344040, 393578, 263232, 377803, 213660, 132799, 371485, 576095, 469110, 405828, 397405, 126952, 415260, 85788, 463419, 865496, 59100, 445649, 189494, 379828, 420443, 291471, 250342, 530588, 106702, 146120, 278128, 9791, 633902, 437131, 189283, 442000, 168716, 135264, 113021, 248005, 322323, 214778, 300888, 146585, 154206, 470082, 456894, 184788, 374340, 303528, 307480, -11043, 558787, 426742, 342845, 38408, 331373, 547347, 415597, 400022, 444613, 59200, 645420, 283851, 264836, 226161, 368186, 365340, 177119, -39834, 646830, 450523, 487155, 213619, 246077, 218055, 428823, 106264]
13546B89843P1761M5719j04796Q2799e7787D91539j81376K63735k03559A53989
13535g7455A57779m226J50713j25653M5740I5695K36524n7419m176J5293M1530
13524C27447l5593F3077J04995K44596N5485j82590J86020B23580B6145K71703
13514B97848Q5181j24296A21009N00278B99493k6891K08854c4727A24222K68918
13504C93140k4544C3801Q0543K25927K40586a08648B26565K1528J85599F3409
13493E2450R0241M2598M0796A03594a403C01397O3199p3436j41584L85230B64240
13481B16219H1932l1074M22395j31456N0954P8718j71594j44307k9525j9120g8285
13469a3215B08455N8395L7403k9449Q8537j12841J35486P993d8674C29750D4000
$$ y = [289843, 361604, 407323, 302527, 385326, -57787, 491539, 310163, 573898, 370339, 153989, -77455, 157779, 153553, 304266, 178613, 224353, 95695, 332219, 274800, 270624, 285917, 327447, 291854, 63077, 168072, 412668, 468153, 285563, 471583, 223580, 26145, 297848, 383029, 258733, 121009, 621287, 299493, 272602, 481456, -34727, 124222, 393140, 368596, 33801, 114344, 340271, 580857, -108648, 226565, 248093, 433692, 63409, 52450, 142691, 185289, 226085, 103594, -1403, 301397, 364596, 291160, 149576, 534806, 264240, 216219, 81932, 50858, 473253, 341797, 392751, 471469, 299875, 155568, 126043, 106923, -78285, -13215, 208455, 266850, 304253, 274804, 363341, 250500, 385986, 393979, -48674, 329750, 44000]
13457D1867K85803A13649K74480j33533A20290L18389I3341K96225o9507H7662
13446g2319E67644d466r9031B67658j0404J87399J67954k58665F8774B7215K67537
13435B94752f2814C0566h6993C03412p9787l9571j4247P4733F057K02469e0426
13423g3157A70021e9598A11040K42681L39422B86395A03346k2586J26301J3852
13413B20913k3503K23955o5071A76876J42428B7312M58338A64446m9632J43272
13403B58086A2715O28797B83010J49348A14592L48740A5456M03038G0533J72804
13393B43337I3316K41107P5393F3937L23809C0579K27152a27718B2425R7446E0995
13381A9583b9542D02860J69227k07715G4902L8485K16425A18609M59875b5391
$$ y = [41867, 327670, 113649, 388129, 254596, 120290, 438679, 93341, 389566, 320059, 87662, -72319, 567644, -4466, -103497, 267658, 257254, 444653, 612607, 353942, 68774, 27215, 294752, -62814, 30566, -86993, 303412, 223625, 184054, 169807, 244540, 6057, 208526, -50426, -73157, 170021, -59598, 111040, 353721, 693143, 286395, 103346, 80760, 207061, 220913, 197410, 421365, 356294, 176876, 319304, 27312, 485650, 164446, 114814, 258086, 12715, 641512, 283010, 432358, 114592, 463332, 15456, 418494, 70533, 243337, 93316, 334423, 409816, 63937, 387746, 30579, 257731, -127718, 22425, 119871, 50995, 19583, -29542, 402860, 572087, 364372, 74902, 113387, 329812, 118609, 578484, -25391]
13370B77149n1868j1617J30875n5275E0934c1897B21987j8860j8384N1670Q7364
13359C23777a46350D19807j32456K22072H9273d3698D04916l5188e4242B70875
13348A51101L51248B7464C949J08845K39434A42299J49964J71167A37819E1150
13337C54173j02279i623B28399N1296F6789K09517J00494j40478m1843a37680
13326A34479C4417L39313A47512J035o3216J47383D9302K6407L67870j92556j05899
13315A45124K29875A37366C1622O3547J60687B323h0694B06102R1472P032A05875
13303B70048i8922c2555A15834M69500j46803a9922B91069Q2750L7759A42254
13292B343J25999J36556L6065H7548a68721A27953L85398k39963j21969b1336
$$ y = [277149, 225281, 213664, 344539, 289264, 50934, -31897, 221987, 203127, 184743, 236413, 323777, -146350, 419807, 287351, 509423, 89273, -43698, 404916, 369728, -54242, 270875, 151101, 502349, 27464, 3949, 112794, 352228, 142299, 292263, 463430, 137819, 51150, 354173, 251894, -9623, 228399, 279695, 66789, 276306, 376800, 236322, 194479, -137680, 134479, 34417, 373730, 147512, 148547, 85331, 232714, 49302, 75709, 443579, 251023, 145124, 374999, 137366, 31622, 95169, 255856, 2323, -80694, 206102, 297574, 304606, 105875, 270048, -98922, -32555, 115834, 585334, 438531, -19922, 291069, 373819, 411578, 142254, 2343, 128342, 264898, 300963, 87548, -168721, 127953, 513351, 273388, 151419, -21336]
13281F6135L07460b1092C4798g1589G8562a19345A98313a87176E8092J99228r0002
13270A67318j204b27199h577A69155g4453A43631N09719A78258B0892J48020N5003
13259B23915j5172A738O5119M19247A3871K9840a55260A99366b09819C39720a03689
13247B69152d4945D7253K41708F8875K49713g9671A65747i3831B27447Q5781j1079
13236C02149p327I7069K96888a90515P2696B72808p4830E1590K34670j2975d35113
13224B22371P2930A25189o2089C0808a18693A57194E6712J13449L6252H8160B0143
13212C26838A00214e61k2858k40718B38746J60583j18599o1746p1693J20094D9699
13200b1459A14555n2880a5145H2541b1575B35938L162D718L2932K42005H2870
$$ y = [66135, 373595, -21092, 34798, -71589, 78562, -119345, 198313, -187176, 58092, 257320, 167318, 166114, -227199, -8577, 169155, -74453, 143631, 653350, 178258, 20892, 168912, 223915, 208743, 1738, 66857, 486104, 13871, 43711, -155260, 199366, -209819, 339720, -103689, 269152, -44945, 47253, 288961, 68875, 318588, -79671, 165747, -93831, 227447, 313228, 302149, 294822, 97069, 393957, -190515, -117819, 272808, 197978, 51590, 286260, 273285, -435113, 222371, 295301, 125189, 63100, 30808, -118693, 157194, 56712, 170161, 206413, 88160, 20143, 326838, 100214, -561, -23419, -264137, 238746, 399329, 280730, 218984, 147291, 267385, 49699, -21459, 114555, 61675, -15145, 82541, -21575, 235938, 239100, 4718, 37650, 279655, 82870]
13188B5364f0388D21815A14129L8805d0989B5521K06619F5211J36139N3849n6146
13177A99053a52357H4470h3355j80771b8397k848B08843D7410J02732n1997k5819
13166G2326K22526A04892J75982k1130p5361B428J88930J64861e9005J1410F5078
13154A43453a96247B02083i5074B3785J14169D3282J86581f3210A1697a24217
13143F8789K21984A01084e4952F8593a14970H3502c26733o3402A4564K23658a77111
13131D0257c55258E2106a5074j0242n9871a4179A37917K21855H3400k8463P1496
13120A26433l6587Q4695G3343b8392C4627a31488a1604A91606a77362E7172K1598
13109G8770a18234B29107J27325A57564o6996J19119M3087J95797a13259C00319
$$ y = [25364, -60388, 421815, 114129, 152934, -40989, 25521, 232140, 65211, 201350, 255199, 199053, -152357, 84470, -83355, -264126, -28397, -31245, 208843, 47410, 150142, 98145, 72326, 294852, 104892, 280874, 259744, 184383, 2428, 191358, 356219, -59005, -47595, 65078, 143453, -196247, 202083, -95074, 23785, 137954, 43282, 229863, -63210, 11697, -124217, 68789, 290773, 101084, -54952, 68593, -114970, 83502, -326733, -390135, 14564, 238222, -177111, 40257, -355258, 52106, -15074, -25316, -85187, -14179, 137917, 359772, 83400, 54937, 126433, 89846, 174541, 73343, -28392, 34627, -131488, -11604, 191606, -177362, 57172, 78770, -118234, 229107, 356432, 157564, 90568, 209687, 252774, 448571, -113259, 300319]
13098E0242K13177E713K54685l5762M84j1126c7153E8703L0084M1599N5639e5933
13085C7328j2295J66294F1231f7875j03085A11764g1892D3652b0007B80691A22562
13073b5599P726J234C71160A75539o7887O0074b26730A49074K7229K3859q1208
13062A18954i8853A48162R8183A16621F571J15925K92348I890b97540A24720a53213
13050B32347r0722K29274j61485q5239J11202a9548G7028a11018d8258C34792
13039B08206o5789k9094P0622M7506B1597L0337K15344n3592M9278C7747C612
13027C65579j25289q9059k0514n7809Q7373J17521E0302J64919j04566J28537
13017B39192B0877J22412J53276K03540C7693P1038J43421N794D1092P9506b02320
$$ y = [50242, 263419, 5713, 260398, 224636, 225120, 213994, -37153, 58703, 88787, 130386, 186025, -55933, 37328, 25033, 191327, 61231, -67875, -170960, 111764, -71892, 43652, -20007, 280691, 122562, -25599, -17873, -16639, 371160, 175539, 107652, 167726, -226730, 149074, 176303, 200162, 118954, -98853, 148162, 246345, 116621, 6571, 122496, 414844, 9890, -297540, 124720, -153213, 232347, 141625, 370899, 209414, 124175, 235377, -19548, 77028, -111018, -48258, 334792, 208206, 142417, 113323, 183945, 231451, 21597, 51934, 267278, 213686, 262964, 37747, 3612, 365579, 240290, 151231, 130717, 72908, 160281, 277802, 50302, 215221, 110655, 239192, 20877, 143289, 296565, 500105, 37693, 108731, 252152, 257946, 41092, 120598, -202320]
13005I6035m3467b7332C982K87560p0094A00372j8836N6823K79383B01799p9471
12994A22328b25745A82803D9997K48353B0877i5904B55351a91824d0584A80930
12983B4285k391M4362a47775b7873B09375o5929K00705e1309r6918C53963I6946
12971A13456c8294r5655k0564B18662F7514J17329J44752a33525B05267G0719
12960A84178c8861C8526J6474b46918A03065B5122a26644L5943B11257r4773B382
12948b01935F4633K5963a8189k27190I1814B287R2987k6717k1006c2060k6173
12937e8233n24B29515o5141p1028a61033k8980B11612m4761M5663A6565h5029
12925C44014a81664K5863E6383c9769D85932G4225O0945a87540B7768K43306r1560
$$ y = [96035, 52568, -27332, 3982, 291542, 221448, 100372, 81536, 138359, 417742, 201799, 122328, -225745, 182803, 49997, 298350, 20877, -95904, 255351, -191824, -40584, 180930, 24285, 21894, 66256, -147775, -27873, 209375, 143446, 344151, -51309, -148227, 353963, 96946, 113456, -38294, -133949, -154513, 218662, 67514, 184843, 329595, -133525, 205267, 70719, 184178, -38861, 38526, 55000, -246918, 103065, 25122, -126644, -90701, 211257, 116484, 2382, -201935, 64633, 90596, -18189, -245379, 91814, 2287, 95274, 68557, 47551, -32060, -58233, -58757, 229515, 164374, 93346, -161033, -190013, 211612, 166851, 212514, 16565, -85029, 344014, -181664, -155801, 56383, -39769, 485932, 74225, 135170, -187540, 27768, 271074, 179514]
12914A79514b31647Q6538A91905a1942l06592A39428R425e4596B14360a6340j03885
12903a20225A68410a81229k14655D8185e2012A26966L6396J9831a06749H4525
12892c96098C6909g9150j06243b0671k9280E110a55782F2351R3337C5333J9163
12881E4496Q4480L6654I68c70840h0271C03247a32211G3854J27408N160n2508
12870A53914M9453Q2835p9465b08050c4157k3912A81058C6928a78315F6931J55383
12859B22314g3740c1872j34315c6935C29699a10495B01993I3298b4992k84561
12849c09553E2192J94166f8303A51006G3737L88370A7952L02086L0041A51994
12838A45774J94275b00481M6153A35110B8350J34842h1362A0856L11420o2015
$$ y = [179514, -231647, -145109, 191905, -11942, -318534, 139428, 148853, -54596, 214360, -16340, -120225, 168410, -181229, -395884, 48185, -52012, 126966, 163362, 183193, -106749, 84525, -396098, 36909, -79150, -185393, -20671, -49951, 5110, -155782, 62351, 155688, 35333, 54496, 138976, 175630, 968, -370840, -80271, 303247, -132211, 73854, 201262, 206422, 153914, 203367, 286202, 206737, -208050, -34157, -58069, 181058, 36928, -178315, 66931, 222314, -73740, -31872, -166187, -36935, 329699, -110495, 201993, 93298, -24992, -309553, 52192, 246358, -68303, 151006, 73737, 462107, 17952, 320038, 350079, 151994, 145774, 340049, -200481, -154328, 135110, 28350, 163192, -81362, 10856, 322276, 260261]
12828B60261E9706B4853L5233a96628i3130l69703a96434A07970J84607A29872
12817c1257k52774g2550k32892B62324g3128B07086D077b393F9341Q9148D0566
12805a41028P182K8898C14373a76205g0489A9808M4723a7880A31192j5745c26249
12793f95k19756I5657a19503E2944L55244a18922A29710a04980B67329E2617b07855
12781a13381A60997b3743A3668i7372C4767L06602I0618a04494B868a26880A59855
12769d8498C09699E8753J09515b87870d4446A5925c07121A13648f8087j50343
12759b18430a2411G5423a00972G8008d496o2579b0490A24025A4757L76511h6717
12747F7194K8262K42241F9979g206B40901b05916O5296C07650a81309B48900A3693
$$ y = [260261, 59706, 24853, 60086, -196628, -93130, -462833, -196434, 107970, 292577, 129872, -31257, -284031, -72550, -305442, 262324, -73128, 207086, 4077, -2393, 69341, 158489, 40566, -141028, -133846, -104948, 314373, -176205, -70489, 19808, 64531, -17880, 131192, 115447, -326249, -695, -220451, 95657, -119503, 52944, 408188, -118922, 129710, -104980, 267329, 52617, -207855, -113381, 160997, -23743, 13668, -97372, 34767, 341369, 90618, -104494, 2868, -126880, 159855, -48498, 309699, 58753, 168268, -287870, -44446, 15925, -307121, 113648, -68087, -218430, -12411, 75423, -100972, 78008, -4496, -67075, -20490, 124025, 14757, 391268, -86717, 67194, 95456, 337697, 69979, -7206, 240901, -205916, -140620, 307650, -181309, 248900, 13693]
12735A08406k2200M2298e2295C61654a80106f6560H1526J24360a45151E2079e6238
12723g449D12522d06139J3571A34299D7755j0032Q6312f6826B65789r4347D2663
12711b8456B55058N7926a39223C16488j58197M14437k62727n1914J56901G9751
12700D60551B27673a42219A30734M3401F7965J77127a77563D39773A70319a58180
12689H1450a2191k91783e2013I9076O5566f2531E2073J76280a1163k08476A94370
12677B88178d6074A68999J06923A27266J9138o0535L75470k18343A8604K44773
12667B63377b04836A14995B5504J58707D0825a81143B35936e3538l4542A77278
12656a92676Q7135F3632a60575B32625P3987L0238j58866f7951K1275J5353A41540
$$ y = [108406, 86206, 128504, -52295, 361654, -180106, -66560, 81526, 205886, -145151, 52079, -56238, -7449, 412522, -406139, -392568, 134299, 47755, 37723, 124035, -66826, 265789, 171442, 42663, -28456, 255058, 312984, -139223, 316488, 158291, 572728, 310001, 258087, 414988, 79751, 460551, 227673, -142219, 130734, 174135, 67965, 245092, -177563, 439773, 170319, -158180, 81450, -12191, -303974, -52013, 99076, 164642, -62531, 52073, 228353, -11163, -219639, 194370, 288178, -46074, 168999, 275922, 127266, 146404, 85869, 461339, 242996, 18604, 263377, -204836, 114995, 25504, 184211, 40825, -181143, 235936, -53538, -88080, 177278, -192676, -105541, 63632, -160575, 232625, 306612, 336850, 177984, -67951, -46676, -31323, 141540]
12644i0913l6319E4827B0314f2231f007D5394j5290Q9680a97986B70653b27541
12632B7335J93070a95075C34061j16007J64258A86390G0155K41440d30522B39656
12621b8161C699J98130K3983a22013C04900j40263P0362p4696J34771g4578A71779
12609C06993n1307E9859L37760H6040a53116A68147Q3149Q282a31793J160D14202
12597a90521A58707m0971M5095b02057f5218B43790K03282a44227j15132A44107
12586B57741c8241A77395A4021J30101a01352A00885a57112N6035j06351n7777
12576b65205C8597K0667a34977q9864A94076h9768D8818a2690A12815j01C1717
12564F1210a18760j28753E6939R4169F0282K21183A37133C236J82960i9946D1967
$$ y = [-90913, -127232, 54827, 20314, -62231, -6007, 45394, 30104, 119784, -197986, 270653, -227541, 27335, 220405, -195075, 334061, 218054, 382312, 186390, 70155, 311595, -430522, 239656, -28161, 3699, 201829, 225812, -122013, 304900, 164637, 234999, 160303, 295074, -74578, 171779, 306993, 255686, 59859, 397619, 86040, -153116, 168147, 251296, 259578, -131793, -130633, 414202, -190521, 158707, 117736, 162831, -202057, -65218, 243790, 447072, -144227, -259359, 144107, 257741, -38241, 177395, 14021, 144122, -101352, 100885, -157112, -101077, -207428, -265205, 38597, 59264, -134977, -224841, 194076, -89768, 48818, -12690, 112815, 112714, 31717, 61210, -118760, -247513, 56939, 151108, 60282, 281465, 137133, 3236, 186196, -99946, 41967]
12552a27169A26649J0845j7918k9603b32709J8778A44837J67899D6500a18901
12541F4016i640k1341H9975d4312i818D838b403C9542a77662Q5381B66801A29947
12528A58760E109K36453l3770A0509c85853B09663b8140j49552B5587K63039A00796
12516b9690m7074l8459F3707J2444A16O9575K6641k7641h3332A81939G7915a7061
12503d3612B6333g4352A14799J62920r3964N4763N5385a55603A7910b5535l8984
12492f4519B6016a00325A68463b78412A61394i576r2554L8575j7611j61415C84850
12480A31609b07150F4333B5571a39897M0342A12967A7830a36563A5463b43790
12469e9936j11663H0127J10115e7087H9036l6363h3088n3313b8543I162h4417
$$ y = [-127169, 126649, 137494, 119576, 89973, -232709, -213931, 144837, 312736, 46500, -118901, 64016, -9640, -30981, 89975, -44312, -9818, 4838, -2403, 39542, -177662, -92281, 266801, 129947, 158760, 5109, 241562, 207792, 10509, -385853, 209663, -28140, -177692, 25587, 288626, 100796, -29690, -76764, -115223, 63707, 76151, 116, 69691, 96332, 68691, -83332, 181939, 77915, -17061, -43612, 26333, -74352, 114799, 277719, 183755, 238518, 293903, -155603, 17910, -25535, -64519, 26016, -100325, 168463, -278412, 161394, -9576, -102130, -63555, -81166, -242581, 384850, 131609, -207150, 64333, 25571, -139897, -99555, 112967, 17830, -136563, 15463, -243790, -59936, -171599, 80127, 190242, -57087, 89036, 52673, -83088, -136401, -28543, 9162, -84417]
12457A24661f40F335N5774B5713a52101r5889g399o1489C1064a92199b8705G6712
12444B14023d4050A08399a35204B3278A1208L5846a14465f617D2107a8606A33577
12432a34594j52669H9522f9467E8172b15758A66442J03301E8048c36020E0271
12421B23236f2386A38198A4642a43373f5971A05060l3192i2528m6761A59077B2177
12409d220k38702E698J97018a25559k1183e2165l8218A5021J14426g7181A4656
12397f0872l85018a35130c8637B40662I846J84015a65255d0433f90I1864K62431
12386C54295j37147I4416a08263B96017n4014m5881o0370O9337I0875B5485b5705
12374A48717D3563A3869K41588a37250B63087D3494K2327g9535A27667a72094
$$ y = [124661, -640, 6335, 62109, 25713, -152101, -247990, -7399, -68888, 31064, -192199, -28705, 76712, 214023, -44050, 108399, -135204, 23278, 11208, 47054, -114465, -6617, 42107, -18606, 133577, -134594, -287263, 89522, -69467, 58172, -215758, 166442, 269743, 58048, -336020, 50271, 223236, -62386, 138198, 14642, -143373, -65971, 105060, 71868, -92528, -139289, 159077, 22177, -4220, -242922, 5698, 202716, -125559, -146742, -52165, -90383, 15021, 129447, -77181, 14656, -60872, -445890, -135130, -38637, 240662, 9846, 193861, -165255, -40433, -690, 91864, 354295, 217148, 94416, -108263, 296017, 242003, 196122, 135752, 205089, 90875, 25485, -25705, 148717, 43563, 13869, 255457, -137250, 263087, 43494, 65821, -79535, 127667, -172094]
12363c52174C8798j0146O6560M1739F2756a36341g168A91218a40004A15180e4514
12351i2431C638O9494N8140b4969k25968d6318E5118a49407a9476k22466A06330
12339a23381j92731J33019B00061F3201P1126a00744d7331n3367A04366K7754
12329A32120a70117P5951P897C44560j11041q1743F0840a81648M4021E7689K55738
12318C13427b07964B96902j47922G202J32924J23495b6266l60648a0108A08923
12307e0421d929B5024P4295c03319D9107a03773J6139A82357J74467j29274h7319
12295F3917d5920B90372c8332p5422C48567m8080A27759a04552A49378J46481
12285B95859A2375b48122a319D1827J18895l5153a54147C9909a3157D10760n2929
$$ y = [-352174, 38798, 28652, 95212, 136951, 62756, -136341, -7168, 191218, -140004, 115180, -54514, -92431, 3638, 73132, 131272, -24969, -250937, -46318, 55118, -149407, -19476, -241942, 106330, -123381, -316112, -183093, 200061, 63201, 134327, -100744, -47331, -100698, 104366, 132120, -170117, -94166, -86269, 344560, 233519, 151776, 60840, -181648, -137627, 57689, 313427, -207964, 296902, 148980, 7202, 140126, 263621, -26266, -386914, -10108, 108923, -50421, -4929, 25024, 99319, -303319, 49107, -103773, -87634, 182357, 356824, 227550, -87319, 63917, -45920, 290372, -38332, -113754, 348567, 300487, 127759, -104552, 149378, 295859, 12375, -248122, -1319, 41827, 160722, 125569, -154147, 39909, -13157, 410760, 357831]
12274C57831h987l36262B91161c48740A87894b9749C44873I2020O1010L57452
12264E10482E0651O4691J39747G9045A9117b7380A17534K43653a12004l5543A09727
12252A97212c8763A28818B2692L69741F8683b21176f4873C17210j10958n7464
12242A48788a86618M9825H0168Q1095R3466A26892j5683N7677c1198A33477i7210
12230G8540l311J10031q3026J16613d048C55773j67083A4353J34111J12966B305
12218G9399J2647N3511J55105E3999L13148A72355a13222A67500J24684K7718
12208C19902b8816A4457L42699L19M5652A89014P4177j29200b9563I6964b90975
12196C11914A32116n6227N09682B14361F1249L17520l9302K5775A72170p8948
$$ y = [357831, -8987, -345249, 291161, -348740, 187894, -29749, 344873, 92020, 153030, 510482, 50651, 115342, 255089, 79045, 19117, -27380, 117534, 361187, -112004, -147547, 109727, 197212, -38763, 128818, 22692, 392433, 68683, -221176, -64873, 317210, 206252, 148788, -186618, -136793, 80168, 161263, 254729, 126892, 111209, 168886, -31198, 133477, -97210, 78540, 75229, 185260, 102234, 218847, -4048, 355773, 188690, 14353, 148464, 261430, 2305, 79399, 92046, 145557, 300662, 53999, 367147, 172355, -113222, 167500, 292184, 319902, -28816, 14457, 357156, 357475, 403127, 189014, 263191, 133991, -29563, 96964, -290975, 311914, 132116, 75889, 585571, 214361, 61249, 378769, 339467, 365242, 172170, 93222]
12186I3222g4497C8246j3924A0648J5097b6862H2439Q9569q922e20295A37469
12174E3252p629J08742p237J55J75542A55008J07113i9981F9500J64671n8075
12163A76096p0370J23464b751l2255B23741n3121R2278p2638R031M1811d6672
12151D7363d8632B28717b26019B30333D8363a67153r375j19090B09426o4540b92467
12139I8067f8927E7821J13597J41887A12895b95252a33821j45927A77943a00562
12128I2009Q7462b26120J7825n9353a01356j11137D4653a90413b6171q2432K5632
12117h2971B65702K3813G1603a490A3070b43312b2930E9653a28379A2059a42326
12105a5515E1144L994A312a61198q8175A34711g1913B8816L7428B1753N0672O6495
$$ y = [93222, -74497, 38246, 24322, 10648, 25745, -26862, 82439, 172008, 163086, -520295, 137469, 53252, 45623, 154365, 147128, 147283, 322825, 155008, 262121, -99981, 69500, 234171, 176096, 105726, 229190, -2751, -35006, 223741, 170620, 262898, 190260, 199291, 241102, -46672, 47363, -48632, 228717, -226019, 230333, 48363, -167153, -176528, -295618, 209426, 144886, -292467, 98067, -68927, 57821, 171418, 313305, 112895, -295252, -133821, -279748, 177943, -100562, 92009, 179471, -226120, -208295, -267648, -101356, -212493, 44653, -190413, -26171, -108603, -82971, 265702, 289515, 71603, -1490, 13070, -243312, -22930, 59653, -128379, 12059, -142326, -15515, 51144, 55138, 1312, -161198, -249373, 134711, -71913, 28816, 66244, 21753, 72425, 138920]
12093A38920D3924J67687c73096H0477a62946g0231r8908B83059F1246l0453r071
12082B1722P878b17660M0614P1080B85167a49850B90815P05701Q10498F23328
12071F08353b1594n6805A15378J6841K20634A4540M12400b07747B3274J87963
12061B11237K8377f2095A50017a61946d5828H6249d5362q0494I0138p873a09736
12049A13766C9561J5312c2599e298r2645j9181B26771D4417q116L42303I5908
12037a65752B95109d084l35363E96054A21401A1005J17070b79482J04831A74643
12026B95126p7788b47428j50386J15958h1366A21362g9374I8289k6544a04474
12015g7319B83967a70812B06763G6991k4203K61030a4135k0649j5765B1140f4531
$$ y = [138920, 43924, 211611, -373096, 80477, -162946, -70231, -169139, 283059, 61246, 30793, 21722, 29600, -217660, -177046, -105966, 285167, -149850, 290815, 996516, 1807014, 623328, 608353, -21594, -78399, 115378, 132219, 352853, 14540, 426940, -207747, 23274, 211237, 239614, -62095, 150017, -161946, -45828, 86249, -45362, -125856, 90138, 82265, -109736, 113766, 39561, 54873, -32599, -5298, -97943, -117124, 226771, 44417, 36301, 378604, 95908, -165752, 295109, -4084, -339447, 596054, 121401, 11005, 128075, -279482, -174651, 174643, 295126, 217338, -247428, -397814, -281856, -81366, 121362, -79374, 98289, 71745, -104474, -77319, 283967, -170812, 206763, 76991, 52788, 313818, -14135, -34784, -50549, 21140, -64531]
12003a13801A99622a35974B77672D0256a48348A4437M7188p145a53866D1738J24428
11992A66166b25261J6915G8563K21233C8125L2866N9252D6961c3806B27270k9400
11981A97870r6365f7628K5458K0745l22519a48992Q933C970N6876a60324J0841
11970a49483O0341o3684A25041m7589J45703A04156e0373A16944j2073N5614J93107
11959C53592c432C00379G5369b47472d9351j10532g3999A33853h5708j09215h9122
11947a13198B73905a96657C97476f1653A46602a76365K1327B81479A00029L4783
11937A34812E4482c16519a31783e0041r9618A79221a95140I5149b54162M3640
11927b10522f915A01651N1185i1092A57960i1940M5343A41222D6604J32515a46541
$$ y = [-113801, 199622, -135974, 277672, 40256, -148348, 14437, 61625, 54480, -153866, 41738, 166166, -225261, -208346, 78563, 299796, 38125, 70991, 130243, 46961, -33806, 227270, 197870, 101505, -67628, -42170, -21425, -343944, -148992, -140059, 3970, 60846, -160324, -149483, -89142, -152826, 125041, 77452, 223155, 104156, -50373, 116944, 104871, 160485, 353592, -3432, 300379, 75369, -247472, -49351, -159883, -73999, 133853, -85708, -194923, -89122, -113198, 273905, -196657, 397476, -61653, 146602, -176365, -155038, 281479, 100029, 134812, 54482, -316519, -131783, -50041, -149659, 179221, -195140, 95149, -254162, -210522, -6915, 101651, 152836, -91092, 157960, -91940, -46597, 141222, 46604, 179119, -146541]
11915C8645J33736e1487I8929D500a37878M3699G5315b69134D0379K28041a05620
11903A01011d8839k99642F0797N8926J12400A1598P7506M6070c89708J27493F5396
11891b71152A33460a26516k3467j37864e0230G9055J50920a12250c8357a6084
11880A7075b54948A20157J03753b6441A45196a42577A00673k3323J17759i6233
11869A76653f873C51563F4039P615f1956e250j85581q9890R1422A14034a94944
11857d09266D1989h7201j39050c9841A79228p3712K4097J8644e69864e9607A0214
11845E0535P754R2329f3092C44195b34372a5565F2063O7862k2316e4109j6804
11834g0913l3125Q508l27454B3012a91065A8172P2865i243A4843a20715A2676
$$ y = [38645, 172381, -51487, 98929, 4500, -137878, -94179, 75315, -269134, 40379, 268420, -105620, 101011, -48839, -348481, 60797, 119723, 232123, 11598, 89104, 135174, -389708, -262215, 65396, -271152, 133460, -126516, -149983, -287847, -50230, 79055, 229975, -112250, -38357, -16084, 17075, -254948, 120157, 223910, -26441, 145196, -142577, 100673, 77350, 195109, -96233, 176653, -6873, 351563, 64039, 71654, -61956, -5250, -190831, -280721, -189299, 114034, -194944, -409266, 41989, -87201, -226251, -39841, 179228, 105516, 129613, 148257, -569864, -59607, 10214, 50535, 58289, 150618, -63092, 344195, -234372, -15565, 62063, 129925, 107609, -54109, -70913, -104038, -95530, -422984, 23012, -191065, 18172, 91037, -9243, 14843, -120715, 12676]
11822A06356B218a97455A9828i3881l6342A0777J5007J81740a75066A54418b59201
11810a82802d9903B14476a04558a8968r904B01561c42958R8126I0501d0522r2648
11799a33170A18255b52641c4895k92669g0852r8533e5555A05047J03085g8808
11788i0439I4122A9074e4749A1143b64513J13838q0598A02459a02648d3868B19515
11776A86839O687d930M20k51231h6473B74769B143f4024r21A73914i2038n6741
11764a48779k4366B11942k2323G7915M2305l7686K3374a80286E5094K7024a31886
11752C7072d6437m74403J62691D946c11329J54954A49059c34920C18592a892o5985
11741f7877H3969b09551H4150a37483l9401c3015J5559C58475a36159j18732C7792
$$ y = [106356, 2218, -197455, 19828, -93881, -130223, 10777, 25784, 207524, -175066, 154418, -259201, -182802, -49903, 214476, -104558, -18968, -28872, 201561, -342958, -244832, 90501, -40522, -133170, 118255, -252641, -34895, -327564, -70852, -169385, -55555, 105047, 208132, -78808, -90439, 94122, 19074, -54749, 11143, -264513, -150675, -231273, 102459, -102648, -43868, 219515, 186839, 193526, -4930, -4510, -255741, -86473, 274769, 2143, -64024, -64945, 173914, -92038, -148779, -173145, 211942, 189619, 77915, 120220, 82534, 105908, -180286, 55094, 82118, -131886, 37072, -46437, -520840, -358149, 4946, -311329, -156375, 149059, -334920, 318592, -1892, -67877, 83969, -209551, 84150, -137483, -176884, -33015, -17456, 358475, -136159, -254891, 37792]
11729f3330C06029k4836b33279a06369j22908O2662B34479H3488b1530G2658l2301
11718D0357Q3994a04754G3817b36499a5188B0044L5628a98615c1355C90966A76242
11706E1969K20147k9814a808o9741r9308B46906l4128a770l3177m1969j99446
11695b76362F0200M0386K9890d3800G2206J15749R2526d8690A22935c43338c081
11683a29971a9412k5812D1152J41912H8503J07514B1299R8029g5588j5068r008
11672i9664F535a52987g1771A2129K9076J81029c08587B66493K242E4438c5983
11660A42396m4007r045J50461b3871B65047j12825b7542k6729A54992G1617J84718
11649B56335b12997A86522L85762A80181e133j0186B53652N341a05751A45465
$$ y = [-63330, 306029, 281193, -233279, -106369, -229277, -166615, 234479, 83488, -21530, 72658, 40357, 124351, -104754, 73817, -236499, -15188, 20044, 55672, -198615, -31355, 390966, 176242, 51969, 272116, 242302, -1808, -71549, -170857, 246906, 212778, -1770, -34947, -76916, -276362, 60200, 100586, 130476, -43800, 72206, 187955, 280481, -48690, 122935, -343338, -3081, -129971, -19412, -45224, 41152, 183064, 88503, 196017, 21299, 119328, -75588, -90656, -99664, 6535, -152987, -71771, 12129, 41205, 222234, -308587, 266493, 268735, 54438, -35983, 142396, 98389, 89344, 239805, -23871, 265047, 152222, -27542, -54271, 154992, 71617, 256335, -212997, 186522, 572284, 180181, -5133, -15319, 253652, 258993, -105751, 145465]
11638a10765F2821J35782P3117J965H4701C2512a01194C264J79156H5690Q730
11627I4420a72456B17653a06017C69105F1301K34985H06a02197d466j95587B40401
11615A26152b44607A37976f661D5908K09719k5253A10638A7856L5309a18504I8375
11603A43230c25986D13468A2627b49846E4492f5309l9168j28729B40120r1116
11593A49004a13167B2327b68169A5110b935A24997n017g5808A93982J38385j61123
11582A71244n4273L02826b9519C74025p6746E455K18248E8973O615b4457B963
11570A40040b03421Q928B22900r1822n5866B1516K70532f8537a4823j10509C40593
11558C0806M02685h969C91993g0854D2564J28477a26396E17662A6072J73241a85832
$$ y = [-110765, 62821, 198603, 271720, 273685, 84701, 32512, -101194, 3264, 182420, 85690, 94420, -172456, 217653, -106017, 369105, 61301, 296286, 806, -102197, -4466, -200053, 240401, 126152, -244607, 137976, -6661, 45908, 255627, 230374, 110638, 17856, 53165, -118504, 98375, 143230, -325986, 413468, 12627, -249846, 54492, -65309, -104477, -233206, 240120, 149004, -113167, 22327, -268169, 15110, -2935, 124997, 119980, -75808, 193982, 332367, 171244, 116971, 419797, -29519, 374025, 297279, 5455, 223703, 58973, 65588, -24457, 2963, 140040, -203421, -194493, 222900, 131078, 75212, 21516, 292048, -68537, -14823, -125332, 340593, 30806, 433491, -8969, 391993, -70854, 42564, 171041, -126396, 517662, 16072, 189313, -185832]
11546A31634K10161D4555L04762J9011a17931D8612d5873H9975J01688J52311
11536C43974j769D4749M4767a3857j2445E2803L45572j63082Q5110i6761B61552
11524B07812k3906E2135a4499E649K39998O8585A25812K3469m6683e5296G3682
11512E1186p168K2981c2116o4993A69584O7271F267J55634J87839n2945j9975
11501B76820I6104g2703A71920G5119a20145A80658a27536B51211g8361B42432
11490G0988b0371k2975j1831A37236o0333M7123c2212I8408J7678a26993B21409
11478a0418j65898B85543Q851j03723B8414K60205J1541A7370J65435D9736g0894
11466g7505D24736B06662D9809Q0319P0812d6827H2597L33314J5648j68834l2756
$$ y = [131634, 341795, 44555, 349317, 368328, -117931, 48612, -45873, 89975, 191663, 343974, 342205, 44749, 89516, -13857, -26302, 52803, 398375, 235293, 320403, -96761, 261552, 207812, 183906, 52135, -14499, 5649, 245647, 314232, 125812, 149281, 102598, -55296, 73682, 51186, 44018, 66999, -32116, -97109, 169584, 236855, 6267, 161901, 349740, 296795, 276820, 96104, -72703, 171920, 75119, -120145, 180658, -127536, 251211, -78361, 242432, 70988, -20371, -43346, -55177, 137236, 76903, 124026, -32212, 98408, 116086, -126993, 221409, -10418, -176316, 285543, 294394, 190671, 28414, 288619, 300160, 17370, 182805, 49736, -70894, -77505, 424736, 206662, 49809, 130128, 200940, -46827, 82597, 415911, 431559, 262725, 229969]
11455B29969G2089J65306r0634E3578L23653M1087g7492C34502A9520K05753C9013
11443c217A37729K29288a4269B92896A37539a5814I7177K72966a08256A05634
11432A83944E1022K7451L5272i1054m2629L9823A76681G7251b04034A91474C8501
11420e2662E29714k15379A31987C8683a75088A72617g7821c5814E6574R6711d0856
11408F97K84403b1436j14578C6558J66223a52637C03821G2802Q3892J45096G4356
11396C7803a55999A1569f1711A40685K41343A88089a99220b4076h999j97413E488
11384A26437j4393n587b00397B31710a91545A77605G1581M37886A40590L17715
11374D58305B02112e7333A73401N3062q4178a93655G3196h9599B6645c5308k90011
$$ y = [229969, 72089, 237395, 146761, 53578, 377231, 418318, -77492, 334502, 19520, 225273, 39013, -3217, 137729, 367017, -14269, 292896, 137539, -15814, 97177, 370143, -108256, 105634, 183944, 51022, 78473, 113745, -91054, -133683, -93860, 176681, 77251, -204034, 191474, 38501, -52662, 529714, 314335, 131987, 38683, -175088, 172617, -77821, -35814, 56574, 153285, -40856, 697, 285100, -21436, -136014, 36558, 202781, -152637, 303821, 72802, 156694, 301790, 74356, 37803, -155999, 11569, -61711, 140685, 382028, 188089, -199220, -24076, -8999, -206412, 5488, 126437, 112044, 106457, -200397, 231710, -191545, 177605, 71581, 509467, 140590, 458305, 202112, -57333, 173401, 226463, 142285, -193655, 73196, -89599, 26645, -35308, -325319]
11363c25319a18759b0028n0136M961I646O6089J13210a90637A61628b3298k49114
11352b72412C0700J17926c48781b1031A7555R3814P0050L3139m3538G9002J14804
11341A93806N6068a49626A31935L0615F831i7696C12401j22863n9867D0343g6902
11329a88393A03802J4225e4858B07806k8418b19001j00049B24274f3391A07620
11318a07721A5962J35685k8852L2778D9191J11190A7307a6662j10248m9629g2426
11306A20549B6469e4453k70774a03751A01139b8329G3515J48782q2860J62417
11296C01854b10966C62079c8815D8283e0950F7133a52497J9618B65557a81922
11285I4339b90986a25868A00299a10606J6046L8498A34237d14255B44317o0199
$$ y = [-325319, -118759, -20028, -70164, -65203, 9646, 75735, 188945, -190637, 161628, -23298, -272412, 30700, 148626, -348781, -21031, 17555, 111369, 181419, 214558, 171020, 79002, 193806, 249874, -149626, 131935, 162550, 6831, -97696, 312401, 189538, 129671, 40343, -76902, -188393, 103802, 118027, -54858, 207806, 179388, -219001, -319050, 224274, -63391, 107620, -107721, 15962, 151647, 122795, 155573, 49191, 160381, 17307, -16662, -126910, -176539, -72426, 120549, 26469, -54453, -325227, -103751, 101139, -28329, 73515, 222297, 139437, 301854, -210966, 362079, -38815, 48283, -50950, 67133, -152497, -132879, 265557, -181922, 94339, -290986, -125868, 100299, -110606, -94560, -56062, 134237, -414255, 244317, 184118]
11275A84118C678J63188C5087c3873C2716a96414A45416a49260E7387a90941e4081
11263d7552j53613K781C3480d4535J468k39784a6707A48157B6810a36069a5693
11251a28190A35104c41106a7051C54446A55397b78376D9642a59039C3211C666
11240a51903k0221A72793b89645b0247k11718J1471B22560e3239n8443o1622O0092
11229a13212k6267A45888A534i81E31185b68413O7861C7706a93015c1116B53489
11217b4509A45622d0765k41109A95284a19910B2534e3545k5430j9125B7422J75743
11206B03165b48952B14866b25440A09776A1980M0427M4148c7875j97799J13426
11196a22248B0270e8689A53630p3290f9232j60754j04118B28886a37776A19584
$$ y = [184118, 3678, 166866, 35087, -33873, 32716, -196414, 145416, -149260, 57387, -190941, -54081, -47552, -201165, -198384, 33480, -44535, -43067, -282851, -16707, 148157, 26810, -136069, -15693, -128190, 135104, -341106, -17051, 354446, 155397, -278376, 49642, -159039, 33211, 3666, -151903, -172124, 172793, -289645, -20247, -231965, -220494, 222560, -53239, -111682, -173304, -113212, -139479, 145888, 1534, -981, 531185, -268413, -200552, 37706, -193015, -31116, 253489, -24509, 145622, -40765, -281874, 195284, -119910, 22534, -53545, -78975, -98100, 27422, 203165, -248952, 214866, -225440, 109776, 11980, 52407, 96555, -37875, -235674, -122248, 20270, -58689, 153630, 80340, -69232, -229986, -334104, 228886, -137776, 119584]
11185A67689G9569a71451A00978c233q2044A67210a09112l61177K05197A56977
11174i7032B37217C730J2274c33063G7421a40018A25413a84118B653a4261j96176
11163b10437m8290j02449g5383C234a1905r0041l17121J00456I884J95184A4744
11151e8451F0698a49072B7629e1189J5595A30234b10539D9341K63652g8845A25131
11139D14319A66236F9129L45446C3798b9729b273B63641I7492N6510a82540d6306
11127c9846A2253a52925H5131k2889b52416B05489D4586J1985N8593J95049b64086
11115H6131K7771d2474j18519N6397A86085c430l2677A24273k58a05369B65930
11103C1463J38314A6164b46213A93056H0523j1033N2152J8881B0770p389J65736
$$ y = [167689, 79569, -171451, 100978, -3233, -85277, 167210, -109112, -470289, -265092, 156977, -97032, 237217, 3730, 16004, -333063, 77421, -140018, 125413, -184118, 2653, -14261, -210437, -258727, -361176, -75383, 3234, -11905, -101946, -419067, -318611, 9884, 205068, 14744, -58451, 60698, -149072, 27629, -51189, -35594, 130234, -210539, 49341, 312993, -78845, 125131, 414319, 166236, 69129, 414575, 33798, -29729, -2273, 263641, 97492, 154002, -182540, -46306, -39846, 12253, -152925, 85131, 62242, -252416, 205489, 44586, 56571, 115164, 310213, -264086, 86131, 113902, -42474, -160993, -104596, 186085, -3430, -36107, 124273, 124015, -105369, 265930, 31463, 169777, 16164, -246213, 193056, 80523, 69490, 121642, 140523, 20770, 13381, 179117]
11092A79117A9934K49113j5218j18459c7081B54932Q6669L2591m9713n9730K6079
11081B90828Q3960L1282A48124L85951K19540B77897j368J10376I8760J97486
11071B96246p7033J39006j1456e599E23081k47003J73626l8610J60158m9929J41029
11060F62352j66650B32431M97942R8241j61354P1993r3991J31372K4920q424K54808
11049A047938m66899K50679j5754N5352j21l70149K38071r3448L64283O7787k10596
11038H67143j40037K75477l07530R7008J74775k26459K32560k67782j7200J72203
11028H60158r8224J54011o5191J4486l07632O17073n68338L82022j75036J10060
11018I23389M295Q0113m58708M20681p7138l79042L01151l1926j01091L87604
$$ y = [179117, 19934, 269047, 253829, 135370, -37081, 254932, 341601, 374192, 324479, 264749, 290828, 374788, 406070, 148124, 534075, 753615, 277897, 276529, 386905, 98760, 296246, 219213, 358219, 346763, -5599, 523081, 276078, 449704, 411094, 571252, 521323, 662352, 495702, 232431, 730373, 828614, 667260, 739253, 645262, 776634, 801554, 793130, 1047938, 581039, 831718, 815964, 871316, 871195, 501046, 739117, 645669, 1009952, 1077739, 867143, 727106, 1002583, 695053, 792061, 966836, 740377, 972937, 705155, 687955, 860158, 761934, 915945, 850754, 865240, 557608, 1174681, 606343, 988365, 813329, 923389, 927684, 1007797, 549089, 969770, 892632, 513590, 814741, 782815, 681724, 1069328]
11008A069328C83424L77519O9801q5939J99725l25730L00069M3177j23227k36224
10998F02595L18020k54870K48312J22138l83283J71071K07304k97807L72460k19586
10988H86354O4878J42167m82739P85758r4155j39379r3656K65038K43965j93032
10978A385199K24991j2462J91815O71086o9551K83109K03872J79474M47718n5705
10968C449546m8696j2364m85336k33070m31348k89788K37161J50093k50478o5103
10958B020617K62603L9585j20536J53840k09203l55519j87462k84772l73129k31734
10948G14290N57959n53846l44579l6500J42509j25102A51665J62644J27160l539
10938D37930B08443H1974J47773A8748O9978K33659m7183e7226k9488A01399c9860
$$ y = [1069328, 383424, 760943, 830744, 744805, 944530, 618800, 918869, 962046, 838819, 602595, 920615, 665745, 914057, 1036195, 652912, 823983, 1031287, 733480, 1105940, 886354, 951232, 1093399, 610660, 1396418, 1302263, 1162884, 1069228, 1334266, 1578231, 1385199, 1610190, 1597728, 1789543, 2460629, 2391078, 2674187, 2878059, 3057533, 3505251, 3449546, 3400850, 3388486, 2903150, 2670080, 2238732, 1948944, 2186105, 2336198, 2085720, 2020617, 2283220, 2322805, 2202269, 2356109, 2146906, 1791387, 1603925, 1319153, 946024, 714290, 1272249, 718403, 373824, 337324, 479833, 354731, 151665, 314309, 441469, 437930, 208443, 81974, 229747, 18748, 88726, 322385, 275202, -57226, -86714, 101399, -39860]
10926B76044E1116c86679h103B50371R7194q0854c3623H5362a28193E187a32944
10914h1584B42754q5706b61299A8641g2908A78259L39172a28764B54698n1302
10904B03396l5892J8861E930d4152q1878o4744B93518A26408b49509B37829l2056
10893B05773a605r0022B98625a65184M8685D7925a15775c2554j78166p7752j9591
10882c08063f8678r2509m840a275B29852d9938k84400G7905f8846k600A76204
10870E4099d01956B2578K0948N6364K06023a22949k5980B67330G7493r787a46428
10858B8021i670A9358N861R4081m3483l5738J09592h4744A18052b59333n1438
10847c10771k2798G4850j1683a20056C7886J65757K7711c19508l5714a35342L4757
$$ y = [276044, 51116, -386679, -8103, 250371, 347565, 266711, -33623, 85362, -128193, 5187, -132944, -81584, 242754, 157048, -261299, 18641, -72908, 178259, 517431, -128764, 254698, 203396, 167504, 186365, 5930, -44152, -126030, -190774, 293518, 126408, -249509, 237829, 205773, -1605, -91627, 298625, -165184, -116499, 47925, -115775, -32554, -210720, -288472, -308063, -68678, -161187, -166027, -1275, 229852, -49938, -334338, 77905, -68846, -71446, 176204, 54099, -401956, 22578, 43526, 99890, 305913, -122949, -148929, 267330, 77493, 67706, -146428, 28021, -9670, 19358, 25219, 119300, 75817, 40079, 149671, -84744, 118052, -259333, -310771, -333569, 74850, 63167, -120056, 37886, 203643, 231354, -319508, -355222, -135342, -100585]
10836a00585D1431b31290d8565n7038r0650m764d4480q2844I2518j0523C1253
10824c5065j92910N263j91691A79924b34233M2150j65641A62815A8286a69545
10813A15359c66596J68784D5711K8148a20663a4296k1212B08648a99709R7182
10803a02527j36524D04951a14866e3432B58926E9515b3808A3024b40389f582H6361
10791a58849f9691j4278I5481q781L30903F6530b23517k88556K24332A90728a73332
10779b32021P1034E0609d5070A86530L4474a95956A46218b2672l56203a72455
10768b95634P0372A09090L92854i1073j93919A5696b51005M9629N208D2892e2044
10756a81397N8968d4507A55815A4867K2044J51856K55106B5596a34539A89704
$$ y = [-100585, 41431, -231290, -48565, -105603, -196253, -201017, -44480, -127324, 92518, 81995, 31253, -35065, -227975, -222712, -414403, 179924, -234233, -192083, -357724, 162815, 18286, -169545, 115359, -366596, -197812, 45711, 73859, -120663, -14296, -35508, 208648, -199709, -102527, -239051, 404951, -114866, -53432, 258926, 59515, -23808, 13024, -240389, -6582, 86361, -158849, -69691, -83969, 95481, 86700, 417603, 66530, -223517, -512073, -287741, 190728, -173332, -232021, -160987, 50609, -45070, 186530, 221004, -195956, 146218, -22672, -378875, -172455, -295634, -225262, 109090, 501944, -91073, -284992, 15696, -251005, -201376, -196168, 42892, -52044, -181397, -122429, -44507, 155815, 14867, 36911, 188767, 443873, 25596, -134539, 189704]
10745B33404l4943h162C05275A1882h4423p374K0782j31321A68265b39817A55199
10733F947a89606B21545b63881c5306F7709c34616G2856f1987C7743K07829b95900
10721c45260o603A80961b16928M3979p5977m3466Q4471O8671l92693d1973j69558
10710b11531j8675D2405K08497b51832H1418e8496B76897B1826a8235E4546N9559
10699A14105d34371J62194B52723r705f5309A9363K17270D4122b75167i2377A38392
10687e8834J9304j8944j33223K4477P3102j24297R8878C3472j317a59059F3941
10675C94308a96781A28252E5104c93133h406l38046Q8770P1350A4131R4456c6563
10663c16409A61021o4786a0767j14691f0433k97121C2023i4690l09085d4038j5719
$$ y = [233404, 198461, -8162, 305275, 11882, -84423, -91797, -71015, -202336, 168265, -239817, 155199, 6947, -189606, 221545, -263881, -35306, 67709, -334616, 72856, -61987, 37743, 245572, -295900, -345260, -351863, 180961, -216928, -172949, -248926, -292392, -207921, -139250, -531943, -41973, -211531, -230206, 42405, 250902, -251832, 81418, -58496, 276897, 21826, -18235, 54546, 114105, -434371, -272177, 252723, 243018, -65309, 19363, 236633, 44122, -275167, -92377, 138392, -58834, -39530, -58474, -191697, -167220, -94118, -218415, -119537, 33472, 32155, -159059, 63941, 394308, -196781, 128252, 55104, -393133, -8406, -346452, -257682, -186332, 14131, 108587, -36563, -316409, 161021, 96235, -10767, -125458, -60433, -357554, 32023, -94690, -403775, -44038, -59757]
10652e9757I008J2504f7215C39615b50152C25336G5896a28123j48392h5127A7539
10640C9621a08894D1528J52619a48975J2617E38a65023K3371A61638D49a07971
10628h0620A35615e6052k4285A41275K4036C6340Q1204m9580O4297a70427r8556
10617b68983c8276R809a3986A68695m2738N28g1756j20068A62500g1136A29235
10605I4107a54402A51501b91692Q9653g8915H2333g6697A36614c89291M1893P9695
10594b67703h416E9973N1319b59674e2973l1807k07410C55362g3447A9413b38866
10582E3601k4724K34675a00379m1695D6173b3459q0513L0695A01689b448k5946
10571b8394H0616l4381f0618G6049d03583P501B02713a09170C0815q158J2680
$$ y = [-59757, 9008, 21512, -67215, 339615, -250152, 325336, 75896, -128123, -276515, -85127, 17539, 39621, -108894, 41528, 194147, -148975, -136358, 538, -165023, -141652, 161638, 449, -107971, -80620, 135615, -56052, -80337, 141275, 165311, 36340, 117544, 67964, 132261, -170427, -268983, -38276, -28467, -13986, 168695, 125957, 126485, -71756, -191824, 162500, -71136, 129235, 94107, -154402, 151501, -291692, -202039, -78915, 82333, -76697, 136614, -389291, -347398, -267703, -8416, 59973, 111292, -259674, -52973, -84780, -292190, 355362, -73447, 19413, -238866, 53601, 28877, 263552, -100379, -142074, 46173, -23459, -103972, -73277, 101689, -2448, -28394, 80616, 46235, -60618, 76049, -403583, -396082, 202713, -109170, 30815, 22657, 35337]
10560C5337b02j60429O4014k49070E8063k7615g649r3586b539j00865C19394A47244
10547A61073i1042j83310n9286a23062r2418f3283K0179j58587j35462n7098a37947
10535a49225p7381A73593b01567B24604b19335L6052C7157n475K18103a19844
10524b73932O4220F0582a94691N5919D72432F8475i1929m4546I0457a73009A26947
10512A23196j9178l2923b23550K0297A0701a80038L3951I578b58618A1923J07373
10501A19296a88173g4918k25048c7463g791G7263h0875B19963b86124g484m75546
10490d83030a58925J0984A77547c44355I5171k2957k735J36458C9844K76656Q0576
10479C97076q4082L88333B71673k0211a8569C01067c01319D53298A52201a03654
$$ y = [35337, -202, -160631, -96617, -345687, 58063, 30448, -7649, -101235, -2539, -103404, 319394, 147244, 161073, -91042, -274352, -333638, -123062, -215480, -63283, -43104, -201691, -337153, -394251, -137947, -149225, -226606, 173593, -201567, 224604, -219335, -183283, 37157, 31682, 249785, -119844, -273932, -209712, 60582, -194691, -138772, 472432, 68475, -91929, -136475, 90457, -173009, 126947, 123196, 104018, 71095, -223550, -203253, 10701, -180038, -146087, 9578, -258618, 11923, 119296, -188173, -74918, -299966, -37463, -7791, 77263, -80875, 219963, -286124, -7484, -483030, -158925, -147941, 177547, -344355, 95171, 72214, 69479, 205937, 39844, 316500, 397076, 312994, 701327, 271673, 251462, -18569, 301067, -301319, 453298, 152201, -103654]
10468a48565H4882e7083C23773r8338A0016N2906A261O1229B8539c4732I6858
10456F9273g5268q0804P2402C5281b44325l1323P7378Q7886e0279k75856F5290
10444I4372J25554b46053M8429A66478J19674j5920o0586C9513e7990k04514Q0613
10433a81891e8007q8177h092j25726h195I2825d7526I6567M32347a56295m7655
10422b03950A63901a50968B10441a77A06300L32031a4223H6603h5559A55617l5590
10411A20027f0733B8288e4327q367j54203A45157h2359F234b5035C2673J2510
10400D5183B1290a08049A55627B8080O2492a0799F6708f3297A63397K87719A03549
10388A5749h19C39549A17239f7427B78500A05733D8757M1327K99609B2632K55143
$$ y = [-148565, 84882, -57083, 323773, 225435, 10016, 62922, 1261, 62490, 28539, -34732, 96858, 69273, -75268, -156072, -83670, 35281, -244325, -275648, -198270, -110384, -50279, -326135, 65290, 94372, 219926, -246053, -197624, 166478, 286152, 270232, 209646, 39513, -57990, -262504, -181891, -58007, -146184, -8092, -133818, -8195, 92825, -47526, 96567, 528914, -156295, -203950, 163901, -150968, 210441, -177, 106300, 438331, -14223, 86603, -85559, 155617, 120027, -60733, 28288, -54327, -62694, -216897, 145157, -82359, 6234, -25035, 32673, 45183, 21290, -108049, 155627, 28080, 90572, -10799, 66708, -63297, 163397, 451116, 103549, 15749, -819, 339549, 117239, -67427, 278500, 105733, 48757, 90084, 389693, 22632, 277775]
10377B77775L37289m2161A88729K48835A24263K50463N04242C48300L8008K15573
10367F01881n008A36889L55727J04978j297N4493j60926j24493A22059J8000J35986
10356B76045J3591K685A44743P1349J20061K34873L952j14852B20671M20815j39723
10345E01763A57599J95865K27325k82239J5416Q1802j89030M80043B45569n3725
10335A91844J16399l246A1825J47804l9199B1593a42846c7595a3276H775e0651
10323A76933J54174j3516J47586G1145M55125k19070o0497M4642A25058K55728
10313C80786b06766C26241A32479a91786C62835h8968A43399k9454O9172H5823
10302A76984a79591o418a1509j30941l7094h5403k84387B67297H141b55192A62300
$$ y = [277775, 615064, 572903, 188729, 437564, 124263, 374726, 878968, 348300, 386308, 601881, 596873, 136889, 492616, 597594, 596297, 650790, 489864, 365371, 122059, 140059, 276045, 289636, 292321, 144743, 216092, 336153, 571026, 574978, 460126, 220671, 641486, 501763, 157599, 353464, 580789, 298550, 313966, 395768, 206738, 686781, 245569, 191844, 308243, 304997, 11825, 159629, 120430, 21593, -142846, -37595, -13276, 8775, -50651, 176933, 331107, 317591, 465177, 71145, 526270, 307200, 246703, 291345, 125058, 380786, -206766, 326241, 132479, -191786, 362835, -88968, 143399, 113945, 183117, 85823, 176984, -179591, -186009, -11509, -142450, -179544, -85403, -369790, 267297, 8141, -255192, 162300]
10290d3587A78988e0036k4205A31893c31208h5800K0495K5435B05391C9337j5949
10279B3388J91175c51052H9287a29558A97690b11389d9888m72335f3838b2550
10268H764e3448F5421c2372l2936a9855l4242B57374i4062D39489j19997K54192
10257E73684k09008M70837m05600F8927a03531H9248D2288J33098c25206A32150
10246A41728f122A44757a91020G4239a18237B15701p1462A0566J0269a69807a275
10234b98492J12270j99909H4454A6327a60259p8018h463E8034a59563N0653A15694
10222b89906M7509B70131a6402j60426m3281D11511C8695a55370j56831a23969
10211a03061D0531J09278c42625e3985p8390M8375F7393K24522b4577A39986e4438
$$ y = [-43587, 178988, -50036, -74241, 131893, -331208, -85800, -65305, -39870, 205391, 39337, 23388, 214563, -351052, 89287, -129558, 197690, -211389, -49888, -522223, -63838, -22550, 8764, -53448, 65421, -32372, -65308, -19855, -54097, 257374, -94062, 439489, 319492, 573684, 364676, 835513, 429913, 68927, -103531, 89248, 42288, 175386, -325206, 132150, 141728, -6122, 144757, -191020, 74239, -118237, 215701, 144239, 10566, 20835, -169807, -1275, -298492, -186222, -386131, 84454, 16327, -160259, -238277, -8463, 58034, -159563, -108910, 115694, -289906, -242397, 270131, -16402, -176828, -220109, 411511, 38695, -155370, -312201, -123969, -103061, 40531, 149809, -342625, -53985, -132375, -84000, 67393, 291915, -24577, 139986, -54438]
10199A43502c06582a03156C391J25729C930J50556F8583b6060k4732m1712a8935
10187A7302Q4118f0835r4244r5109A47134g8071C36392n6988b68440c9128J670
10176c7458j22848B83232o7399d24646C232N314a9474E971j767K64040A00154
10164A22275k6051O944b43475g016E2224i8392m59199B8480a04030M33A59015
10152a53660N5272E6527N4169c08979B46872q2193h9846l1203B66686e31072B3013
10140a75375j11796a26185D7622c41525a58321P5344K6322l3526A07030i6403
10129a07749D7777b93008g8982A02561a84859B22301e119j96970C2786J50961
10119A83747c51564c0090j25367o4743O795J05141M614k14203B56257A27528n3205
$$ y = [143502, -306582, -103156, 3391, 129120, 3930, 154486, 68583, -26060, -50792, -92504, -18935, 17302, 101420, -60835, -155079, -250188, 147134, -78071, 336392, 279404, -268440, -39128, -37458, -160306, 283232, 215833, -424646, 3232, 8546, -19474, 5971, 4204, 268244, 100154, 122275, 96224, 103168, -243475, -7016, 52224, -98392, -557591, 28480, -104030, -103597, 159015, -153660, -98388, 56527, 110696, -308979, 246872, 164679, -89846, -121049, 266686, -531072, 23013, -175375, -287171, -126185, 47622, -341525, -158321, -82977, -56655, -90181, 107030, -96403, -107749, 47777, -293008, -78982, 102561, -184859, 222301, -5119, -202089, 32786, 183747, -351564, -30090, -155457, -220200, -213405, -108264, -103650, -317853, 256257, 127528, 74323]
10108G4323b9034l54768h4809h928j94194G7515b48524p1964G2551b98666c3139
10096f8517j43396d3700l33502h6660k57407C961N2969M9577J59310C5102i567
10084A47971h4084J9450k1912C0608K9476a9841k82518b0809k55009a06614H1622
10072a85515N9519h323j17668c3364r9097j48755b9749L549D3287M8218a32826
10060E8756b04987N215H7631P370h4787k07334Q4363B34306a76957A49994a30690
10048I6791f3155j86353h4199A89743h0855J7020j03097d6438k01442A48330a68068
10036b1535D33303g7171n4758A75027J12807B0588K6910b5611A05133a83720g7821
10024A91948h7960A70731b89689J37950e1493A4966b01679Q7377A6778P8666f4320
$$ y = [74323, -29034, -383802, -84809, -8928, -203122, 77515, -248524, -320488, 72551, -298666, -33139, -68517, -211913, -43700, -377202, -86660, -344067, 3961, 56930, 106507, 265817, 35102, -9567, 147971, -84084, -64634, -86546, 30608, 60084, -19841, -302359, -20809, -275818, -106614, 81622, -185515, -125996, -8323, -125991, -33364, -132461, -281216, -29749, -26200, 43287, 91505, -132826, 58756, -204987, -199772, 87631, 95001, -84787, -292121, -207758, 234306, -176957, 149994, -130690, 96791, -63155, -249508, -84199, 189743, -80855, -63835, -166932, -46438, -247880, 148330, -168068, -21535, 433303, -77171, -131929, 175027, 287834, 20588, 47498, -25611, 105133, -183720, -77821, 191948, -87960, 170731, -289689, -151739, -51493, 14966, -201679, -114302, 16778, 95444, -64320]
10012h7192k13479A8892b0405C55173a49334I2034h4590c2442A07266b25200b2988
10000i5326A06356a18864B97202f6558j29539i7971J7956L8478C8953a1672k3059
9989c4731D3104b27555M5380P4739j90159J06224H566i9936k12744A8845b22489
9977c2781k47520J11689A75591m1574Q5214h7971K0246o7253K7939k3278A41956
9965B5382J5812c55954J64755P5891j81774G8605a75224g6824n0907B14891Q4923
9954B99814a79089J4280l2751A15650a65996K4575A29320M432c82810a06513c3475
9942C1105a83112C6037R4134a87769G3349c4181l0098k29366B9591a09677j08325
9931b18002b0827r0164j9255N0366j83523g2558b0147A0728M49892k13415a66016
$$ y = [-87192, -300671, 18892, -20405, 355173, -149334, 92034, -84590, -32442, 107266, -225200, -22988, -95326, 106356, -118864, 297202, -66558, -196097, -97971, -80015, -41537, 38953, -11672, -34731, 43104, -227555, -182175, -107436, -297595, -191371, 8566, -99936, -312680, 18845, -222489, -32781, -280301, -168612, 175591, 134017, 219231, -87971, -67725, -134978, -107039, -130317, 141956, 25382, 41194, -355954, -191199, -115308, -297082, 78605, -175224, -76824, -127731, 214891, 299814, -179089, -164809, -197560, 115650, -165996, -141421, 129320, 133752, -382810, -106513, -33475, 31105, -183112, 36037, 130171, -187769, 73349, -34181, -64279, -293645, 29591, -109677, -218002, -20827, -110991, -130246, -79880, -263403, -72558, -20147, 10728, 460620, 247205, -166016]
9919c51914a18348j15459c4191j72562b4147j42297f1956j07663B39883B2179
9908c71797A80882b05387n086e542j33636K5446A81039i5983D2743a99119h1308
9896a52748j05188E9179j1873K7960c2845j760A3782a06205q2605B50780a48219
9884C23987c9554k30313A50708k7588b19467D52129G0142b80687g6754K2409B36527
9872a57956j23531A58848a96494R1359j50506A81511g1242E6876K19575f0146
9861h331n9359J9533C1661a22307A28600b6046j23397k01484J73310A92188a13458
9849c12535J01360A0408f0346G0132c16243b219B192R9583b14881I659J49348
9838A59007a5972G6300b36521M0853C5751c23295Q3319G2939b65700b5030l5242
$$ y = [-351914, -118348, -233807, -34191, -206753, -24147, -166444, -61956, -169619, 239883, 22179, -371797, 180882, -205387, -210473, -5542, -139178, -113732, 181039, -95983, 42743, -199119, -81308, -152748, -257936, 59179, 47306, 75266, -32845, -34605, 13782, -106205, -188810, 250780, -148219, 323987, -39554, -269867, 150708, 123120, -219467, 452129, 70142, -280687, -76754, -54345, 236527, -157956, -281487, 158848, -196494, -105135, -255641, 181511, -71242, 56876, 276451, -60146, -8331, -67690, -48157, 31661, -122307, 128600, -26046, -149443, -350927, -177617, 192188, -113458, -312535, -211175, 10408, -60346, 70132, -316243, -2219, 2192, 101775, -214881, 9659, 159007, -15972, 76300, -236521, -195668, 35751, -323295, -239976, 72939, -265700, -25030, -60272]
9827f0272m8172E8367a85061a2967A04788M766a9030k25679A0489J71577r0588
9816I1478a5284j22411j6904G8586i8088n2588A34133b30073J06786A9128a43057
9804A22352a43311M3554A6727M10350E6738a07561c1359A649J81252a28479l596
9793a32075O1747r8170M791A4357J63262A3703e23564A92267a02861B3988M9380
9782G3368J98594j01416a91451Q3503J3274j3982e0111I8867A7004c11821a42909
9770C2504L4188b8563k99569r7263J51320n6051a7889j68846K2304j63031G4038
9758a15033A8245J21716b64908a20369k4976j18308a4625o0923L7726A20555C1131
9746b49894A958a28612e6068f162A907P1657h7796k65314B77260c60349A19949
$$ y = [-60272, -108444, 58367, -185061, -12967, 104788, 109554, -19030, -244709, 10489, 182066, 91478, -15284, -137695, -154599, 78586, -98088, -150676, 134133, -230073, -123287, 19128, -143057, 122352, -143311, -99757, 16727, 427077, 56738, -107561, -31359, 1649, 182901, -128479, -132075, -70328, -168498, -163707, 14357, 177619, 13703, -523564, 192267, -102861, 23988, 73368, 271962, 170546, -191451, -107948, -94674, -108656, -50111, 98867, 17004, -311821, -142909, 32504, 66692, -28563, -328132, -425395, -274075, -330126, -17889, -186735, -164431, -327462, 74038, -115033, 18245, 139961, -264908, -120369, -145345, -263653, -14625, -75548, -37822, 120555, 31131, -249894, 1958, -128612, -56068, -6162, 1907, 73564, -87796, -353110, 277260, -360349, 119949]
9734a05591n8860b222r5119G326b14018C390L66119a10992d2087C9087J8807c8362
9721G2715b26290A7913h2773j4862j87756F8070g0653m23356F1628a54313E3144
9709c11238B244L0302a6783k32508g6495A78996d2987K100k79628f7064n7563
9698a24627C5853b64786g7850k74138J67613q6307a33452f1273j22332Q3790g165
9686A62870D1670L6304P8957I108d3952j53594A57590b17565j56963N4355a48929
9674B04389g4969O937F4249J99496a47758C21235G1080c13898D4278a18824F2507
9662f543k21125L8203a5390B9127a15790r4809c0374j07458M3955G6273a18964
9650b96786i9637c1770A11698C3948a41881B23310B9994a52663k1811P2939E2539
$$ y = [-105591, -164451, -2222, -97341, 7326, -214018, 3390, 369509, -110992, -42087, 39087, 57894, -38362, 72715, -226290, 17913, -82773, -97635, -285391, 68070, -70653, -494009, 61628, -154313, 53144, -311238, 2244, 32546, -16783, -249291, -76495, 178996, -42987, -40887, -320515, -67064, -124627, 35853, -264786, -77850, -351988, -184375, -270682, -133452, -61273, -183605, -99815, -7165, 162870, 41670, 77974, 156931, 9108, -43952, -197546, 157590, -217565, -374528, -320173, -148929, 204389, -74969, -68032, 64249, 263745, -147758, 321235, 71080, -313898, 44278, -118824, 62507, -6543, -227668, -189465, -15390, 29127, -115790, -210599, -30374, -137832, -93877, 76273, -118964, -296786, -99637, -31770, 111698, 33948, -141881, 223310, 29994, -152663, -174474, -101535, 52539]
9638b71954c0928H9170c4882A36683D3719i6996j94468G4662C2586Q504h8561
9626b84960A62808a2101l44850f1742K4255K232H2203k0144a10235j27051g9029
9614h8116E5530a58931A86893J17150i2965K7468o0594b3014m4501l83667b06127
9602B06580O9372i2698j99275A44660d6983H0101a02866A19168b83878a2257C04330
9590A51084n6344a835l939l07654B18433D5509d24978g3453D2740a1160j58007
9579a69167G2809M2688d78704A4881P0534a51966L1036C83649g6460H6433a90912
9567c54821h4655m36830a92928A01066a1402k06256g5964K9774A91913c53011
9556I4082b26911I4083b35155O9108M3244B45891a25788l83304A59344b00700
$$ y = [-271954, -30928, 89170, -34882, 136683, 43719, -96996, -291464, 74662, 32586, 41090, -88561, -284960, 162808, -12101, -356951, -61742, -37487, -35255, 82203, 62059, -110235, -237286, -79029, -88116, 55530, -158931, 186893, 304043, -92965, -65497, -126091, -23014, -67515, -451182, -206127, 206580, 275952, -92698, -291973, 144660, -46983, 80101, -102866, 119168, -283878, -12257, 304330, 151084, 94740, -1835, -5774, -313428, 218433, 45509, -424978, -73453, 42740, -11160, -169167, 72809, 115497, -478704, 14881, 85415, -151966, -120930, 383649, -76460, 86433, -190912, -354821, -84655, -521485, -192928, 101066, -11402, -217658, -75964, -46190, 191913, -353011, 94082, -226911, 94083, -235155, -166047, -122803, 245891, -125788, -509092, 159344, -200700]
9545A34299b17820J7920q5240E3687a07519a1361B67510A0385i2876h043k66993
9534b75036G4817J71382a58573B12443b73569A27081b43087B14924j3186h0421
9523g395j53685B00245H2432B4392J29273a29876A3844a05001q1475q6976N1058
9512b22394f4999k23298J35301C18088A19938h6883m3796j02697L4339b0605l4956
9501e5561o5663k13943a30202j34240Q1511e9355A05398N6502E8798K0193A4582
9489c92782g0877o45r5471P3482p0913e6328B29640a97607f7632A38010C6907
9477a08013D4636A7085J26536f6200m6801a1694k01354H1684a23260j852m9938
9466a75050p5294A5962J42417a80031A28919b31628B12673a83960H9824b24272
$$ y = [134299, -217820, -199900, -285140, 53687, -107519, -11361, 267510, 10385, -92876, -8043, -275036, 74817, 246199, -158573, 212443, -273569, 127081, -243087, 214924, 201738, -80421, -7395, -161080, 200245, 82432, 24392, 153665, -129876, 13844, -105001, -186476, -273452, -222394, -64999, -288297, -152996, 318088, 119938, -86883, -130679, -233376, -199037, -20605, -55561, -121224, -335167, -130202, -264442, -182931, -59355, 105398, 161900, 58798, 78991, 14582, -392782, -70877, -71522, -166993, -93511, -164424, -56328, 229640, -197607, -67632, 138010, 36907, -108013, 44636, 17085, 143621, -66200, -113001, -11694, -213048, 81684, -123260, -125112, -175050, -250344, 15962, 158379, -180031, 128919, -231628, 212673, -183960, 89824, -224272]
9455a20903A89934b89532A24135c19918R3371R4687B3037b40577C0832b11557
9444b30065h4064c525A39041a71514A82929k4222a4288K792l04430b7703A94374
9432H9702A525b04685p3675q1885A28268h3088B18130D6947a75928f8723j11944
9421a80667B9257b19290o5531D162b21030g3594A66343l6160B1384a18669e7648
9409e0759r4807j59069e5926A48540a90884I9752g4492G2694J00292b98122i7907
9397B8596J63646c10831d6171D0643D104c9511j73611a00092c7103r3105D2711
9385d5688C3022c96640a45382m2427j20209J37326B1708a81712J6401g4826k46095
9374c20921J58730A1655R4028a48857l50872A99912a38335j35910a31684N2832
$$ y = [-120903, 189934, -289532, 124135, -319918, -226547, -131860, 23037, -240577, 30832, -211557, -230065, -84064, -3525, 139041, -171514, 182929, 158707, -14288, -11496, -315926, -27703, 194374, 89702, 1525, -204685, -278360, -360245, 128268, -83088, 218130, 46947, -175928, -68723, -180667, 29257, -219290, -284821, 4162, -221030, -73594, 166343, 130183, 21384, -118669, -57648, -50759, -145566, -304635, -55926, 148540, -190884, 99752, -74492, 72694, 172986, -298122, -97907, 28596, 192242, -310831, -46171, 40643, 4104, -39511, -213122, -100092, -37103, -130208, 42711, -45688, 33022, -396640, -145382, -187809, -308018, -170692, 21708, -181712, -165311, -74826, -320921, -162191, 11655, 105683, -148857, -499729, 199912, -138335, -274245, -131684, -78852]
9364g8852D6656P1170f4846n7149B39739b7049j35564J650M17G2552Q7176B3703
9351C2605a79619I4572g7554c5170l97251B55479c4971E6841b06127E6381M5672
9340A02053j4281J7598h6043G7761i5235j16047b6755o7216C32004j63694o0426
9329A07884a48646b0950A0814b6613m69296A03425P6927j0107p7384g1582m3596
9318a15178H969J15491n8800a54844P2434B74908b41453h139r510A41859a11043
9306A72188A4258a01739H1385i7384B78065D0277A1619b57915n7943G2008B8128
9294b75247e0044a6214j08923n7070f758k76479J01795d2105q325k4184b9961
9282H126b48272h2913A6698b60892B99858c04268J51020N1465l5C3736a53103
$$ y = [-78852, 46656, 117826, -64846, -121995, 239739, -27049, -162613, -160963, -160546, 72552, 159728, 23703, 32605, -179619, 94572, -77554, -35170, -432421, 255479, -34971, 56841, -206127, 56381, 102053, 87772, 105370, -86043, 77761, -95235, -211282, -26755, -93971, 332004, 168310, 107884, -148646, -20950, 10814, -26613, -495909, 103425, 180352, 170245, 92861, -71582, -115178, 8969, 124460, 65660, -154844, -82410, 274908, -241453, -8139, -17649, 141859, -111043, 172188, 14258, -101739, 81385, -97384, 278065, 40277, 11619, -257915, -315858, 72008, 28128, -275247, -50044, -16214, -125137, -182207, -6758, -283237, -181442, -42105, -50430, -74614, -29961, 8126, -248272, -82913, 16698, -260892, 299858, -304268, -153248, -101783, -101818, 33736, -153103]
9270B03498a79286N9653d2504k25030A2469f4169G8815a1431M732j99967E5746
9258a04048C0766a10802A6079f9800E8274f7277A57019a31148F8210c00376j30359
9247d30735A99373I867L60730b27885j46516a49319m5353G3474P4719K05239a17844
9235d5614f636m8463j69669g5015k6541d644l91599A89991d13487B8368P9174
9224A07542O438n1591b02400d8124B1584i0805k28648J53389g3665d328q2428
9213h6756M879D5852d06545c5094j39936J6974p3376a6575I3842N566b82033b3699
9200c2675B1141J9708e1201p7920j85097P837I8187b30622A80095h4939J6040
9189f8899D818a5607B88408c0085r137j1629j8717A18644B6208a75282N3259n6742
$$ y = [203498, -179286, -119633, -42504, -267534, 12469, -64169, 78815, -11431, -6699, -206666, 55746, -104048, 30766, -110802, 16079, -69800, 58274, -67277, 157019, -131148, 68210, -300376, -430735, 199373, 9867, 370597, -227885, -374401, -149319, -194672, 73474, 148193, 353432, -117844, -45614, -6636, -55099, -224768, -75015, -101556, -4644, -396243, 189991, -413487, 28368, 107542, 113980, 62389, -202400, -48124, 21584, -90805, -319453, -166064, -73665, -4328, -86756, -81877, 45852, -406545, -35094, -175030, -158056, -231432, -16575, 93842, 99408, -282033, -23699, -32675, 21141, 40849, -51201, -129121, -314218, -306381, 98187, -230622, 180095, -84939, -68899, 4818, -15607, 288408, -30085, -39222, -50851, -69568, 118644, 26208, -175282, -122023, -178765]
9177a78765k3582B24266g7224A74195J4103c8456k12882A19477a44438G5729B2290
9165B42701a21545j01300e6206B56060E713h9241n1574l4956B53216b09180Q4813
9154a24367j68990i828B3885a47919D673b28637B60510c29690A40491a46649E3717
9142c6992j53830P8321C01625g5549j9588n395j707n5325j55738J04959A62766
9130a24906K2781j22461C471J00416J28123b20586I4824b06355E5214B2660a16394
9118b043B46826A6570f5202k70136I3048k8259c1120C22906b862k14781M808a5696
9105A52796h2137E2214d5292o0859A951g6950m1988R281E0900b69594e5198k0679
9093g5877A80964A0479b92679a933j07190E0548a8432j65613h1354E3593O7294
$$ y = [-178765, -202347, 224266, -77224, 174195, 188298, -38456, -251338, 119477, -144438, 75729, 22290, 242701, -121545, -222845, -56206, 256060, 5713, -89241, -140815, -175771, 253216, -209180, -124367, -293357, -9828, 23885, -147919, 4673, -228637, 260510, -329690, 140491, -146649, 53717, -36992, -190822, -112501, 301625, -75549, -95137, -100532, -102239, -157564, -313302, -208343, 162766, -124906, -102125, -224586, 3471, 103887, 232010, -220586, 94824, -206355, 55214, 22660, -116394, -2043, 246826, 16570, -65202, -335338, 93048, 64789, -31120, 322906, -2862, -217643, -212835, -15696, 152796, -82137, 52214, -45292, -106151, 1951, -76950, -118938, -109657, 50900, -269594, -55198, -75877, 180964, 10479, -292679, -1933, -109123, 50548, -18432, -184045, -81354, 53593, 120887]
9082A20887c95081J41662a09973A33252a45028B01722C6008b62370J13903A03852
9071a20135L0174j60012r9939B7495b4699j24774A70341a97452b7986A31672a11046
9059a21565A8348a42760j9864B3042a57072P2145c3189j12119a6716j10970O1043
9048f6643j333m9150k71811A20434l8073i0854B55213d09018e3506j91583A43388
9036B47042b14351j14444c6650G9094e4073a1088j94479J8424p4813A29248d2440
9024e9334D994P3649O231L37832d35970F6653a06311A46962E5244K64364a72931
9012B23736g7765G4565g2878j77590r5233a52179O7053A55999r729K30124A48703
9000d40210a45119o7406H3377f6858A15367d14187a13237H1217R9335c65493i811
$$ y = [120887, -395081, -253419, -109973, 133252, -145028, 201722, 36008, -262370, -148467, 103852, -120135, -89961, -249973, -349912, 27495, -24699, -149473, 170341, -197452, -27986, 131672, -111046, -121565, 18348, -142760, -162624, 23042, -157072, -84927, -33189, -145308, -16716, -127686, -66643, -67976, -117126, -388937, 120434, 82361, -90854, 255213, -409018, -53506, -245089, 143388, 247042, -214351, -328795, -36650, 79094, -54073, -11088, -205567, -187143, -261956, 129248, -42440, -59334, 4994, 78643, 84874, 422706, -435970, 66653, -106311, 146962, 55244, 319608, -172931, 223736, -77765, 74565, -72878, -250468, -345701, -152179, -85126, 155999, 146270, 376394, 148703, -440210, -145119, -212525, 83377, -66858, 115367, -414187, -113237, 81217, 180552, -365493, -9811]
8988A96073b5299l6714r986o7699J1186r495A65049C6203A4049n011O5995b54553
8975b8619j88431J02494j446Q024m1853F9069b85052I2656c22084a04829J3975
8964i0854E2994i4908j15358f7736k87932a69148l3628F8624h3290B88933F2422
8952a10972j42804D45804A97408a10284k9617b8048A5173b00731D843d3648A64784
8940A18255L5575A6762b94286E7034d58375h2231j78763h9890j3694c997o6084
8929g0081A64737a59499A35061j8773h5286A48560d3921E96995k38296A59101
8918d9496C92091E5222B2421N4591k2283J44819h9557o514D8008J99080d5547
8906e2256j0086C02732q8175b16214D8534K20906F63c20564a21438E8593M8099
$$ y = [196073, -25299, -62013, -71999, -139698, -128512, -138007, 165049, 36203, 14049, 9038, 75033, -254553, -28619, -217050, -114556, -116002, -107978, -149831, 69069, -285052, 92656, -322084, -104829, -90854, 52994, -94908, -210266, -67736, -355668, -169148, -202776, 68624, -83290, 288933, 62422, -110972, -253776, 445804, 197408, -110284, -139901, -28048, 15173, -200731, 4843, -43648, 164784, 118255, 153830, 16762, -294286, 57034, -458375, -82231, -260994, -89890, -103584, -3997, -70081, 164737, -159499, 135061, 116288, -85286, 148560, -43921, 596995, 358699, 159101, -49496, 392091, 55222, 22421, 77012, 54729, 199548, -89557, -96071, 48008, 247088, -45547, -52256, -62342, 302732, 214557, -216214, 48534, 269440, 663, -320564, -121438, 58593, 106692]
8895A06692h9141A85982c08053H2592b88938G8244a61652a7351k6034l7056j38158
8884b18599j2023i7812a3874k97720h5798L1701B41565H6306M2007L6959e48004
8872b3668r4117A2103a98993C7412d0728B31708d51360c3325j10256f5695I3218
8860h9079q4741P2823A34624l8567a12384l3004O3645C5391d7702j58200Q9658
8849a16244j24620g5535m9256N1575l3918a5771B75073A11417m3872b08941A05365
8837a09515j670A69450a33669e0349J1322n949B22179i1887a6133p5039o6201
$$ y = [106692, -89141, 185982, -308053, 82592, -288938, 78244, -161652, -17351, -43385, -80441, -218599, -230622, -97812, -13874, -311594, -85798, -54097, 241565, 86306, 128313, 165272, -548004, -23668, -117785, 12103, -198993, 37412, -40728, 231708, -451360, -33325, -143581, -65695, 93218, -89079, -173820, -100997, 134624, 96057, -112384, -145388, -81743, 35391, -47702, -205902, -116244, -240864, -75535, -124791, -73216, -107134, -15771, 275073, 111417, 67545, -208941, 105365, -109515, -111185, 169450, -133669, -50349, -39027, -44976, 222179, -91887, -16133, -91172, -157373]
$$ [...]
##END NTUPLES=NMR SPECTRUM
##END=
