##TITLE=AC1738_SEN00011_9276187_vwu7jyrfVx
##JCAMPDX= 6.0         $$ Bruker NMR JCAMP-DX V2.0
##DATA TYPE= NMR SPECTRUM
##DATA CLASS= NTUPLES
##ORIGIN= BRUKER
##OWNER= Administrator
$$ 1.72 TOPSPIN		Version 2.1
$$ 2015-07-14 23:13:42.713 -0700  Administrator@X
$$ Compression mode = diff/dup
##.OBSERVE FREQUENCY= 400.02188249412
##.OBSERVE NUCLEUS= ^1H
##.ACQUISITION MODE= SIMULTANEOUS (DQD)
##.ACQUISITION SCHEME= undefined
##.AVERAGES= 8
##.DIGITISER RES= 22
##SPECTROMETER/DATA SYSTEM= spect
##.PULSE SEQUENCE= zg30
##.SOLVENT NAME= COFFEE_meoh
##.SHIFT REFERENCE= INTERNAL, COFFEE_meoh, 1, 14.98509
##AUDIT TRAIL= $$ (NUMBER, WHEN, WHO, WHERE, PROCESS, VERSION, WHAT)
$$ ##TITLE= Audit trail, TOPSPIN		Version 2.1
$$ ##JCAMPDX= 5.01
$$ ##ORIGIN= Bruker BioSpin GmbH
$$ ##OWNER= Administrator
$$ $$ E:\/data/COFFEE/nmr/AC1738_SEN00011_9276187_vwu7jyrfVx/10/pdata/1/auditp.txt
$$ ##AUDIT TRAIL=  $$ (NUMBER, WHEN, WHO, WHERE, PROCESS, VERSION, WHAT)
(   1,<2015-07-14 23:13:35.354 -0700>,<Administrator>,<X>,<go>,<TOPSPIN 2.1>,
      <created by zg
	started at 2015-07-14 23:12:29.463 -0700,
	POWCHK enabled, PULCHK disabled,
       configuration hash MD5:
       21 0F 79 D6 B3 7B B4 F6 88 20 88 DB 03 48 BD 9F
       data hash MD5: 64K
       55 23 8A 58 2E 82 62 CC 1D CC FA 3A 8E 65 6C CA>)
(   2,<2015-07-14 23:13:38.463 -0700>,<Administrator>,<X>,<proc1d>,<TOPSPIN 2.1>,
      <Start of raw data processing
       efp LB = 0 FT_mod = 6 PKNL = 1 PHC0 = 0 PHC1 = 0 SI = 32K 
       data hash MD5: 32K
       F6 F0 73 C2 A3 C7 2E CF BA 64 37 D0 C0 C9 DD 6B>)
(   3,<2015-07-14 23:13:38.869 -0700>,<Administrator>,<X>,<proc1d>,<TOPSPIN 2.1>,
      <pk PHC0 = 87.97852 PHC1 = 0 
       data hash MD5: 32K
       AA 0B ED E7 73 DC 46 31 BC 0C 99 30 39 75 D8 70>)
(   4,<2015-07-14 23:13:38.979 -0700>,<Administrator>,<X>,<proc1d>,<TOPSPIN 2.1>,
      <abs ABSG = 1 
       data hash MD5: 32K
       27 C4 57 8F 83 A6 14 4B 45 71 A7 CD 30 2B 27 B4>)
(   5,<2015-07-14 23:13:39.057 -0700>,<Administrator>,<X>,<proc1d>,<TOPSPIN 2.1>,
      <abs ABSG = 2 
       data hash MD5: 32K
       53 EC 31 32 2D B5 CB 02 4A 37 D9 9C 81 4D 0A 17>)
(   6,<2015-07-14 23:13:39.119 -0700>,<Administrator>,<X>,<proc1d>,<TOPSPIN 2.1>,
      <abs ABSG = 3 
       data hash MD5: 32K
       DE 44 AB AD 40 18 A4 84 37 8C 4C 2C FE 3B C4 4F>)
(   7,<2015-07-14 23:13:39.182 -0700>,<Administrator>,<X>,<proc1d>,<TOPSPIN 2.1>,
      <abs ABSG = 4 
       data hash MD5: 32K
       E2 10 0D 4E E0 B2 75 F9 B0 64 00 69 21 3D 4C AB>)
(   8,<2015-07-14 23:13:39.260 -0700>,<Administrator>,<X>,<proc1d>,<TOPSPIN 2.1>,
      <abs ABSG = 5 
       data hash MD5: 32K
       17 40 95 09 9B 24 C8 BE F4 5E E0 3B E7 82 FB 69>)
$$ ##END=
$$ 
$$ $$ hash MD5
$$ $$ 73 82 24 BC C9 97 CE 82 EC 4D 37 F5 41 F2 A3 8D
##$RELAX= 
##$RELAX= 
##$RELAX= 
##$RELAX= 
##$RELAX= 
##$RELAX= 
##$RELAX= 
$$ Bruker specific parameters
$$ --------------------------
##$DU= <E:\>
##$EXPNO= 10
##$NAME= <AC1738_SEN00011_9276187_vwu7jyrfVx>
$$ [...]
150 150 150 150 150 150 150 150
##$TP07= 0
##$TPNAME0= <>
##$TPNAME1= <>
##$TPNAME2= <>
##$TPNAME3= <>
##$TPNAME4= <>
##$TPNAME5= <>
##$TPNAME6= <>
##$TPNAME7= <>
##$TPOAL= (0..7)
0.5 0.5 0.5 0.5 0.5 0.5 0.5 0.5
##$TPOFFS= (0..7)
0 0 0 0 0 0 0 0
##$TUNHIN= 0
##$TUNHOUT= 0
##$TUNXOUT= 0
##$USERA1= <user>
##$USERA2= <user>
##$USERA3= <user>
##$USERA4= <user>
##$USERA5= <user>
##$V9= 5
##$VALIST= <valist>
##$VCLIST= <CCCCCCCCCCCCCCC>
##$VD= 0
##$VDLIST= <DDDDDDDDDDDDDDD>
##$VPLIST= <PPPPPPPPPPPPPPP>
##$VTLIST= <TTTTTTTTTTTTTTT>
##$WBST= 2048
##$WBSW= 25
##$XGAIN= (0..3)
0 0 0 0
##$XL= 0
##$YL= 0
##$YMAX_a= 601304
##$YMIN_a= -525695
##$ZGOPTNS= <>
##$ZL1= 120
##$ZL2= 120
##$ZL3= 120
##$ZL4= 120
##$ABSF1= 14.98509
##$ABSF2= -5.573092
##$ABSG= 5
##$ABSL= 3
##$ALPHA= 0
##$AQORDER= 0
##$ASSFAC= 0
##$ASSFACI= 0
##$ASSFACX= 0
##$ASSWID= 0
##$AUNMP= <proc_prof1d_extract_pilot.lims>
##$AXLEFT= 0
##$AXNAME= <>
##$AXNUC= <1H>
##$AXRIGHT= 0
##$AXTYPE= 0
##$AXUNIT= <>
##$AZFE= 0.1
##$AZFW= 0.1
##$BCFW= 0
##$BC_mod= 0
##$BYTORDP= 0
##$COROFFS= 0
##$CY= 15
##$DATMOD= 1
##$DC= 0
##$DFILT= <>
##$DTYPP= 0
##$F1P= 0
##$F2P= 0
##$FCOR= 0.5
##$FTSIZE= 32768
##$FT_mod= 6
##$GAMMA= 0
##$GB= 0
##$INTBC= 1
##$INTSCL= 1
##$ISEN= 128
##$LB= 0
##$LEV0= 0
##$LPBIN= 0
##$MAXI= 10000
##$MC2= 0
##$MEAN= 0
##$ME_mod= 0
##$MI= 0
##$NCOEF= 0
##$NC_proc= -8
##$NLEV= 6
##$NOISF1= 0
##$NOISF2= 0
##$NSP= 0
##$NTH_PI= 0
##$NZP= 0
##$OFFSET= 14.98509
##$PC= 1
##$PHC0= 87.97852
##$PHC1= 0
##$PH_mod= 1
##$PKNL= yes
##$PPARMOD= 0
##$PPDIAG= 0
##$PPIPTYP= 0
##$PPMPNUM= 2147483647
##$PPRESOL= 1
##$PSCAL= 4
##$PSIGN= 0
##$PYNMP= <proc.py>
##$REVERSE= no
##$SF= 400.02
##$SI= 32768
##$SIGF1= 0
##$SIGF2= 0
##$SINO= 400
##$SIOLD= 32768
##$SPECTYP= <>
##$SREGLST= <1H.CDCl3>
##$SSB= 0
##$STSI= 32768
##$STSR= 0
##$SW_p= 8223.68421052631
##$SYMM= 0
##$S_DEV= 0
##$TDeff= 65536
##$TDoff= 0
##$TI= <>
##$TILT= no
##$TM1= 0
##$TM2= 0
##$TOPLEV= 0
##$USERP1= <user>
##$USERP2= <user>
##$USERP3= <user>
##$USERP4= <user>
##$USERP5= <user>
##$WDW= 1
##$XDIM= 32768
##$YMAX_p= 445999994
##$YMIN_p= -742097
##$CURPLOT= <Network HP LaserJet P1505>
##$CURPRIN= <$Network HP LaserJet P1505>
##$DFORMAT= <normdp>
##$LAYOUT= <+/1D_H.xwp>
##$LFORMAT= <normlp>
##$PFORMAT= <normpl>
##$SURQMSG= 1
$$ End of Bruker specific parameters
$$ ---------------------------------
##NTUPLES= NMR SPECTRUM
##VAR_NAME=  FREQUENCY,     SPECTRUM/REAL,   SPECTRUM/IMAG
##SYMBOL=    X,             R,               I
##VAR_TYPE=  INDEPENDENT,   DEPENDENT,       DEPENDENT
##VAR_FORM=  AFFN,          ASDF,            ASDF
##VAR_DIM=   32768,         32768,           32768
##UNITS=     HZ,            ARBITRARY UNITS, ARBITRARY UNITS
##FACTOR=    0.250966925370066, 1,           1
##FIRST=     8223.43324360094, -86545,       -58686
##LAST=      0,             -77111,          -55537
##MIN=       0,             -742097,         0
##MAX=       8223.43324360094, 445999994,    0
$$ Real data points
##PAGE= N=1
##DATA TABLE= (X++(R..R)), XYDATA
$$ [...]
19542h5661C7102e6183L985j82466i132B80751b00464B77445C6606e7595j94308
19531b51903R3586r5391p757H0891g9152a9480m7238p4084A04562B2696a37462
19519h5717E1992d03569a86781n189a860A21910D7555L9957k8243Q814K5352i9808
19506E2647a38135K3443A85587D14a4578k26382P0785d6096D0987Q3848c03427
19494D3782L1239B1673a23135q8309l4730g1413p7880M1717O016j71615A37522
19482B61675b43493G5743b67879b21k9538A08208K3980C8532J6789A5895M0145
19471E6040L33603a96455I632a35677D6561M7902a2840A89911b62151J09083k7170
19460a80238Q5786J3064a8312B7234i0844a3746A0413h6388c694I7140J23504
$$ y = [-85661, 37102, -56183, -52198, -234664, -9132, 280751, -200464, 277445, 36606, -57595, -251903, -158317, -253708, -261465, 80891, -79152, -19480, -66718, -140802, 104562, 22696, -137462, -85717, 51992, -403569, -186781, -191970, -1860, 121910, 47555, 87512, 59269, 68083, 93435, -99808, 52647, -138135, -114692, 185587, 414, -14578, -240960, -170175, -46096, 40987, 124835, -303427, 43782, 75021, 21673, -123135, -211444, -246174, -71413, -149293, -107576, -101560, -273175, 137522, 261675, -243493, 75743, -267879, -221, -29759, 108208, 132188, 38532, 55321, 15895, 56040, 389643, -196455, 9632, -135677, 46561, 94463, -12840, 189911, -262151, -153068, -180238, -94452, -81388, -18312, 27234, -90844, -13746, 10413, -86388, -3694, 97140, 220644]
19449B20644F7057c59635J09446A86038a1266A6421J34450k6517f537k33337A2621
19437H0756N6251i9715B28458j02516i1447j11609F1152a3987O699A58972n9771
19426I9201e4822n6385j40085E6712h5753A52691a32128A0543J98787a31910l9516
19415a71426H6122P479a69926l7296C11988o0481i6224M3928B38608a25797b1900
19403A4382J2509H481a56353b8003n6842k68242a53976F3555l1049a27904c9213
19391a23232p4023O1077j51504e1684l09797A79187F6445a31477c8088D9046J52273
19380B01319b0518p261C1009e81951e0350n03488a07778r7991h132j03114j29176
19369b40422A42531C9883b10013K543P9938n4779d0709A3567J90173a80073j26112
$$ y = [220644, 67057, -359635, -250189, 186038, -11266, 16421, 150871, 124354, -6537, -239874, 12621, 80756, 137007, -99715, 228458, 125942, -91447, -203056, 61152, -13987, -7288, 158972, 99201, -54822, -111207, -251292, 56712, -85753, 152691, -132128, 10543, 209330, -131910, -171426, 86122, 93601, -169926, -207222, 311988, 251507, -96224, -52296, 238608, -125797, -21900, 14382, 26891, 8481, -156353, -28003, -84845, -353087, -153976, 63555, 32506, -127904, -39213, -123232, -197255, -136178, -287682, -51684, -361481, 179187, 66445, -131477, -38088, 49046, 201319, -20518, -27779, 31009, -581951, -50350, -553838, -107778, -205769, -8132, -111246, -240422, 142531, 39883, -210013, -207470, -127532, -182311, -40709, 13567, 203740, -180073, -306185]
19358c06185J00747B03852c114l13911g9560n9247h125q6529l2355N640a6730
19346d0054r1197r5444f2916j51913a4354k49421d0819p5016C40544c62513J20807
19335b41706A09540a20195r1375J01263M9830J5822k24507D4719F081N9445B859
19323b75876C1886a21853A04794b32182R9583A08539a77986O078G1237A9907J3690
19312C3597J5950b71426A34407B9759P938e2455A72782a19001A43978a43504E3587
19300b83615a15122c6713J6247A39195b82959A14992b0983k93125a12852j09423
19290b22275b5341l17074a14119c9827k26701J8372B6787b87440g2534j73453
19280b45987A32608f3899b0372A65987a11558k0576g113k52004R2742M5905D2628
$$ y = [-306185, -205438, 203852, -3114, -317025, -79560, -138807, -8125, -94654, -127009, -121369, -16730, -40054, -131251, -226695, -62916, -214829, -14354, -263775, -40819, -115835, 340544, -362513, -241706, 109540, -120195, -211570, -110307, -60477, -44655, -269162, 44719, 6081, 65526, 2859, -275876, 31886, -121853, 104794, -232182, -132599, 108539, -177986, -171908, 71237, 19907, 33597, 49547, -271426, 134407, 29759, 37697, -52455, 172782, -119001, 143978, -143504, 53587, -283615, -115122, -36713, -20466, 139195, -282959, 114992, -20983, -314108, -112852, -222275, -25341, -342415, -114119, -39827, -266528, -248156, 26787, -287440, -72534, -245987, 132608, -63899, -20372, 165987, -111558, -132134, -7113, -259117, -166375, -120470, 42628]
19268I6033i22j28454j88406A58076a94516i943j1363k2031I4382c8587k67845
19257c06432J38683m111k2558B7945h6109B4012j0020e5007F119i2528J7481A9011
19244b59967d3998j42037P7412M6325C7052a64998j44191J4536c648E3490b19099
19232a11749o8132j89011A27838m5658a06160M5997E2427d62554c3188l47198
19222c80386G1178o068h6529k095j23780e4190I1570a08610A19711J2356i3212
19210a69035A57193a62255f7750I8766A6071e1793j61856M9343B07699h0819B09839
19198a15027F2903a9358A67539a6511j22397c3836D3963j953b14023D33473a35432
19186b05086d6059H0774F936a64198b7053b988j66214G5592c20932A31373a00001
$$ y = [96033, -922, -129376, -317782, 158076, -194516, -9943, -21306, -43337, 94382, -38587, -306432, -167749, -171860, -194418, 27945, -86109, 24012, 13992, -55007, 6119, -92528, -75047, 19011, -259967, -43998, -186035, -108623, -62298, 37052, -164998, -309189, -294653, -3648, 53490, -219099, -111749, -179881, -368892, 127838, 82180, -106160, -60163, 52427, -462554, -33188, -380386, 71178, 65110, -86529, -88624, -212404, -54190, 91570, -108610, 119711, 132067, -93212, -169035, 157193, -162255, -67750, 98766, 16071, -51793, -213649, -164306, 207699, -80819, 209839, -115027, 62903, -19358, 167539, -16511, -138908, -33836, 43963, 42010, -214023, 433473, -135432, -205086, -46059, 80774, 6936, -164198, -27053, -2988, -169202, 75592, -320932, 131373, -100001]
19174a94814G0843b75762M0828J5790c4492j51866Q5217D3825f8437l11147O0067
19163c19517a22209E8298a3669j59998D0309b1394B00924a76286j39747L4360
19153b81673A8197m168J3500a71834k18838I3727a56541E3933b36114Q286k3796
19142b51624J05218j09094a23056j95111f8060B5955a57413j82757m0542C63098
19131A0804L2692a45179k1687B9479R213M0882h57I3504a04313o0561b5893A69272
19118a4561A2815J87238a28051a3495m3564k2105B17434M9050F0918a27569a1240
19106I4313G764K92366a4000j87347M2341A35b74660a02354b8725j62222b6046
19094C50883c66311B76220a17590k494k0867K1415j58126j36747a97983A83858
$$ y = [-194814, 70843, -275762, -234934, -219144, -34492, -186358, -101141, 43825, -68437, -379584, -319517, -122209, 58298, -13669, -173667, 40309, -21394, 200924, -176286, -316033, -281673, 18197, 14029, 27529, -171834, -390672, 93727, -156541, 53933, -236114, -227828, -251624, -146406, -255500, -123056, -318167, -68060, 25955, -157413, -340170, -380712, 363098, 10804, 43496, -145179, -166866, 29479, 38692, 79574, -857, 93504, -104313, -164874, -25893, 169272, -14561, 12815, 200053, -128051, -13495, -57059, -79164, 217434, 266484, 60918, -127569, -11240, 94313, 7764, 300130, -14000, -201347, -159006, 135, -274660, -102354, -28725, -190947, -26046, 350883, -366311, 276220, -117590, -120084, -140951, -119536, -277662, -414409, -197983, 183858]
19083a5293j75724r6642A49420F9574a67182b3077l43611A94514F1943J10864
19073A72807M506l6989F754K33540b35324h8011j73235i675l70986K4435B82688
19061i4526A80565a95537j85491d8180B5667J63854e67322a0642l1335k00288
19051b42265a3355A5603d05319A52089l9635D1189f1909b242n2698H007O9340
19040G7347a24998J6763b0220m5233r9538O0758e1459j66486J00006D44839A2148
19028E6859i5118n0300B9353K75866r7990r9480J35800a49184j5974A09049h243
19016b3113j3043r8038p4703H1313a40422C18288q9043e3644H1880h2900C39598
19004b49413o6592f4739C592M817K64584k6837i6737A16763C1907a79023c5703
$$ y = [-15293, -191017, -287659, 149420, 69574, -167182, -23077, -366688, 194514, 61943, 172807, 177313, 140324, 6754, 240294, -235324, -88011, -261246, -9675, -380661, -356226, 282688, -94526, 180565, -195537, -381028, -48180, 25667, 189521, -567322, -10642, -41977, -242265, -13355, 15603, -405319, 152089, 112454, 41189, -61909, -2242, -54940, 8007, 77347, -124998, -108235, -20220, -65453, -164991, -104233, -51459, -217945, -117939, 444839, 12148, 56859, -95118, -145418, 29353, 305219, 207229, 107749, 243549, -149184, -165158, 109049, -8243, -23113, -36156, -134194, -208897, 81313, -140422, 318288, 229245, -53644, 81880, -82900, 339598, -249413, -316005, -64739, 3592, 8409, 272993, 246156, -96737, 116763, 31907, -179023, -35703]
18992g3668o6130F2416b4583B50923I9053a34549B0904d06071C23450F526L25826
18981C32352b42322h8307j452j60986g8095F5322J73620R7991A03399e16976E3349
18969g312C03928a36575B80221h3583c1025B7205E204h4569a806A01789b14707
18957a73556A07660b76222A8317N50151A43587d14180A87723a72746I4824b5662
18946h3722g465q1254b8873A13225e2820k9699A02282c46926f3361A37559n6873
18935H0686F019c32942B944O0466a52470a6556A17866b10109j4115i4329c391
18923A80189a63341A52108k0300B7028a39594r0150B19748i8417b5580p4633k93273
18912c93486A52620j6329c27028J48926J5635g5993b174j50976l1741B47733n9240
$$ y = [-73668, -139798, 62416, -24583, 250923, 99053, -134549, 20904, -406071, 323450, 6526, 332352, -242322, -88307, -89759, -250745, -78095, 65322, 238942, 336933, 103399, -516976, 53349, -7312, 303928, -136575, 280221, -83583, -31025, 27205, 5204, -84569, -1806, 101789, -214707, -173556, 107660, -276222, 18317, 568468, 143587, -414180, 187723, -172746, 94824, -25662, -83722, -7465, -88719, -28873, 113225, -52820, -82519, 102282, -346926, -63361, 137559, 80686, 6019, -332942, 2944, 63410, -152470, -16556, 117866, -210109, -224224, -94329, -3391, 180189, -163341, 152108, 131808, 27028, -139594, -229744, 219748, -98417, -25580, -100213, -393486, 152620, 136291, -327028, -178102, -162467, -75993, -2174, -153150, -184891, 247733, 188493]
18901A88493i958B9668e4154B31645c1637l1310B4857c90521d1308B10366B3491
18889h3643p0788b9972B4536e3406q6601I595g2657B3745b8607j78560A57084
18877I7281b06707Q8162m78047E7680f4372E062R3160B1600i1997A57927f2341
18865a17299m1338r8865i2116j36843j7813M0506F4609a23446C7340a34813m1912
18854a76725j7453k30878i8372H4151i2150j31458a1989A97599a29436a8651k77399
18843b96050l1738J23563m0841c722j34852E2248a11715C63022G9678b07588C7153
18831a44819A2729i1994c2852j50577A69905f0259G2097k9266b6745F7513c5914
18819B09848f8987q813B93928B3956J34171c8101A91779m0665a22029D5971J30830
$$ y = [188493, -9958, 29668, -54154, 231645, -31637, -62947, 24857, -390521, -41308, 210366, 23491, -83643, -154431, -29972, 24536, -53406, -140007, 9595, -72657, 23745, -28607, -207167, 157084, 97281, -206707, -118545, -596592, 57680, -64372, 5062, 98222, 21600, -91997, 157927, -62341, -117299, -158637, -257502, -92116, -228959, -246772, -206266, 64609, -123446, 37340, -134813, -176725, -194178, -425056, -98372, 84151, -92150, -223608, -11989, 197599, -129436, -18651, -296050, -327788, -204225, -245066, -3722, -138574, 52248, -111715, 363022, 79678, -207588, 37153, -144819, 12729, -91994, -32852, -183429, 169905, -60259, 72097, 42831, -26745, 67513, -35914, 209848, -68987, -77800, 293928, 23956, 158127, -38101, 191779, 151114, -122029, 45971, 176801]
18808A76801b42149A53429J03073b37516C63658F2498O9838P7459C5155f4231
18797a53106b5147A27460a08312a7817l67704A3460P7938K8990k4639e8426A36219
18785i0543B43R4224h1360l21873a41439j63495A28077b20779i5961B42310A7783
18773B32324b01920L0154N7056H9259a45986E319J12761i3939k01291A16562a0531
18761a58712M6050k62624a11396a6584F7854e9506d009j08845A39958a15697j9548
18750a35245H3170c30782g9848P988k59744a52390f4165A16448A5895b7547C4846
18738a4386A07851a35849A96768b09828j35344A57906f0701A3722a21171A29382
18727C02050b63898M0050I5004C1622b41311O6842j18512b2734A35351K48872
$$ y = [176801, -242149, 153429, 256502, -237516, 363658, 62498, 132336, 209795, 35155, -64231, -153106, -25147, 127460, -108312, -17817, -385521, 13460, 91398, 120388, 95749, -58426, 136219, -90543, 243, 94467, -81360, -403233, -141439, -304934, 128077, -220779, -95961, 242310, 17783, 232324, -201920, -171766, -114710, 89259, -145986, 5319, 118080, -93939, -295230, 116562, -10531, -158712, -112662, -375286, -111396, -16584, 67854, -59506, -4009, -112854, 139958, -115697, -135245, 83170, -330782, -79848, -71860, -331604, -152390, -64165, 116448, 15895, -27547, 34846, -14386, 107851, -135849, 196768, -209828, -345172, 157906, -60701, 13722, -121171, 129382, 302050, -263898, -223848, 95004, 31622, -241311, -174469, -292981, -22734, 135351, 384223]
18717C84223a75736N8656g294A31280b67581N8949F3943k0931e6103C5277a90298
18705a03762B03227h6484F5461c85091J36095P9445n0697B1754O5073b12311d9281
18693a05590q5356i1853j72970L4365o2235m1853C1672N9472d3349o6953q3495
18682a93797l2094h2322J1742n1141C4541b69A7219b15161M6775j51475J30913
18671a88948k30550a89083B58368A28650b96940P0537C28299E1344e22039b57102
18660c2030j26161j83547B20271i8021D0509M9771J74550j12336o5866O7792f8705
18648E6758c11994j12485A89018b722o740D6003c55259B14770O7178g0787b8781
18636H6781a76916M1218A38921l5563P7588R9481r1671r3686b01357k10146a70660
$$ y = [384223, -175736, -117080, -7294, 131280, -267581, -208632, 63943, 43012, -56103, 35277, -190298, -103762, 203227, -86484, 65461, -385091, -248996, -169551, -220248, 21754, 86827, -212311, -49281, -105590, -190946, -91853, -264823, -230458, -292693, -334546, 31672, 91144, -43349, -110302, -193797, -225891, -82322, -70580, -121721, 34541, -269, 17219, -215161, -168386, -319861, -188948, -419498, -189083, 258368, 128650, -296940, -226403, 328299, 51344, -522039, -257102, -32030, -158191, -341738, 220271, -98021, 40509, 90280, 264830, 152494, 86628, 154420, -68705, 56758, -311994, -424479, 189018, -2722, -9462, 46003, -355259, 214770, 281948, -70787, -28781, 86781, -176916, -135698, 138921, 103358, 180946, 280427, 188756, 95070, -201357, -411503, -170660]
18624a51499j48495N0406j05725b7065E1208K89499a42510N7265J8733j35813
18614b02325h6317r2904J6365j01727g2665C7220c0462j14904B75894i101I1633
18602B16549g2497A8517b5200p0630j93333a30941j26946h3103C9805B433d5991
18590i2106G7044b57507J27000N0630o8408N4212C63689D8472c0429j13835r1944
18579b36208P8439K222A76759N6978a0352j5821C6785a03928B46027F3489M1864
18568A05353h7621B03916a82691Q1875j1331A45364e7376j5278I2155a22955K9843
18557i3112M6314A82220c4931k88827A0802b14684r0220A25226a39066K1146a222
18545c58400a39098d5278a3613f033I7849a81812H3396e1528B9103c97794e5322
$$ y = [-151499, -299994, -249588, -355313, -27065, 51208, 340707, -142510, -85245, -66512, -202325, -86317, -179221, -162856, -264583, -72665, 37220, -30462, -145366, 275894, -9101, 91633, 216549, -72497, 18517, -25200, -95830, -289163, -130941, -257887, -83103, 39805, 2433, -45991, -92106, 77044, -257507, -130507, -79877, -148285, -94073, 363689, 48472, -30429, -144264, -236208, -157769, -155547, 176759, 233737, -10352, -26173, 36785, -103928, 246027, 63489, 105353, -87621, 203916, -182691, -100816, -112147, 145364, -57376, -72654, 92155, -122955, -93112, -46798, 182220, -34931, -323758, 10802, -214684, -304904, 125226, -139066, -117920, -1222, -358400, -139098, -45278, -13613, -6033, 97849, -181812, 83396, -51528, 29103, -397794, -55322]
18533b39406D1131a21397k64916a28865A76743a57691l3022d1142G7609L11591
18523C89200h9574A31142c27847c0024k05031A20157C8413L31063g1435n962l98774
18512d76171a85695B2382b46031g9903B10924g1324k88623A04272c41079B5218
18501e4216E6859A4143R5815D0321J01614a64274p7010p7972A85918g8662A37619
18489A15999g4830H1187b33450B9107c00872L9091D5514N5615g2776p1238o2184
18478b06198d6058j77974g3705L5298a4339k55291A26514h7015A61498b52529
18467a7052D6894i1793D8726a80830h699k57883L126A89285N9391b59943e4983
18455a81422r6444A81035M9611d07897A32336a26428k67940a32208d6635G0460
$$ y = [-239406, 41131, -121397, -386313, -128865, 176743, -157691, -190713, -41142, 77609, 389200, -89574, 131142, -327847, -30024, -235055, 120157, 38413, 369476, -71435, -77397, -476171, -185695, 22382, -246031, -79903, 210924, -71324, -359947, 104272, -341079, 25218, -54216, 56859, 14143, 109958, 40321, 141935, -164274, -241284, -319256, 185918, -78662, 137619, 115999, -74830, 81187, -233450, 29107, -300872, -261781, 45514, 101129, -72776, -144014, -206198, -46058, -224032, -73705, -38407, -14339, -269630, 126514, -87015, 161498, -252529, -17052, 46894, -91793, 48726, -180830, -8699, -266582, -263456, 189285, 248676, -259943, -54983, -181422, -277866, 181035, 230646, -407897, 132336, -126428, -394368, -132208, -46635, 70460]
18444A75915k021a06772A18433C0926p693c27568B81728i4196k30357c4141j08651
18433a42792A08964e327l13580a17377B50606a84840A02848c8979j74334L3388
18423a79925A59460l9825a89518M5250O6941F8402a71816d4737j19966j10594
18413b75297h0630k08329D1512H354L90173c5659n6138A05276k674a2765F694
18401F9620J38454a19515D5247L643N6140P781J9002A943g3386C05916b29489
18389a58485J4932k1274B7804M54341b24956B95003b51024N5018g9087K6051A8118
18377b44503a8954j87359h7790k30278N114B13342a24240C90759b12516B58783
18366c1831c59j01881D7399d3672B18316H9807h7139B26775I5327a5160q8850
$$ y = [175915, 173894, -106772, 118433, 30926, 23233, -327568, 281728, -94196, -324553, -34141, -142792, 108964, -5327, -318907, -117377, 250606, -184840, 102848, -38979, -213313, -179925, 159460, 119635, -189518, -144268, -77327, 68402, -171816, -44737, -164703, -275297, -80630, -288959, 41512, 8354, 398527, -35659, -91797, 105276, 102602, -12765, 6694, 69620, 208074, -119515, 45247, 48890, 105030, 112811, 131813, 1943, -73386, 305916, -229489, -158485, -143553, -164827, 27804, 482145, -224956, 295003, -251024, -196006, -79087, -53036, 18118, -244503, -18954, -206313, -87790, -318068, -312954, 213342, -124240, 390759, -212516, 258783, -31831, -359, -102240, 47399, -43672, 218316, 89807, -87139, 226775, 95327, -15160, -104010]
18355a04010B16848I962d1366q9947A2092J13438K9293B0018J83847C5024a41896
18343c03749H1692N8069a62454b9669A03848J70384A9945a31318a4688k05257
18333b19945I3180d42207c9482A26761a01595C25405b81257M1078B5653K7792
18323E3445c8298d050B1304b86414a20841j02515B16101b98225A87519b30560
18312b07727A21984a4397k67609J16981P7606A4412R7466k1352D4759l742j9784
18301B1233Q8473J69459f7271c0441q5959e491j54274c4423B49265i9126d3313
18289F0925H915b32672A42723n8563a23942q90C7777J05710h1454C4990c09438
18277b8074q4866j73497Q8547A01935a43079k9238c9459k79862J12491h0788B9300
$$ y = [-104010, 216848, 9962, -41366, -131313, 12092, 125530, 154823, 20018, 203865, 35024, -141896, -303749, 81692, 139761, -162454, -29669, 103848, 274232, 19945, -131318, -14688, -219945, 93180, -442207, -39482, 126761, -101595, 325405, -281257, -240179, 25653, 53445, -38298, -4050, 21304, -286414, -120841, -223356, 216101, -298225, 187519, -230560, -207727, 121984, -14397, -282006, -165025, -87419, 14412, 111878, 90526, 44759, 41017, 21233, 109706, 279165, -67271, -30441, -116400, -5491, -159765, -34423, 249265, -99126, -43313, 60925, 8915, -232672, 142723, 84160, -123942, -124832, 37777, 143487, -81454, 34990, -309438, -28074, -112940, -286437, -197890, 101935, -143079, -172317, -39459, -319321, -206830, -80788, 29300]
18265A60383a48653I5841a13186J2537q2912N3546j48390J30941A9781g2245A20481
18253B55724a81144b6434q0122C45322a71258C0315c6562A69976J65504b06144
18242b78976A42479F8311a72031B03169E434M3404k1861i2098c6776k46393B91688
18230b6877j43050g1408k02092M4772c3155A81644a46232F3573A7822O6950O5013
18219A49785g5841A02835b42326o750a09167j33623J09569j31034b8055l17774
18209c45829J67066A24600B6920J72382p1905K7071f5858j92853D823h5600o1411
18198a47011O2376D9061K16863a01146B75248a83408b7219j89851G3877h3723
18187A26252a0597k7496B5873a91357D5608a67862r9455D99752h8886G5245b09033
$$ y = [160383, -148653, 95841, -113186, -100649, -183561, -130015, -278405, -147464, 19781, -72245, 120481, 255724, -181144, -26434, -106556, 345322, -171258, 30315, -36562, 169976, 335480, -206144, -278976, 142479, 68311, -172031, 203169, 5434, 48838, 26977, -92098, -36776, -283169, 291688, -26877, -169927, -71408, -273500, -228728, -33155, 181644, -146232, 63573, 17822, 84772, 149785, -75841, 102835, -242326, -249076, -109167, -242790, -133221, -264255, -28055, -345829, -178763, 124600, 26920, 199302, 127397, 154468, -65858, -258711, 4823, -85600, -147011, -84635, 49061, 265924, -101146, 275248, -183408, -27219, -217070, 73877, -83723, 126252, -10597, -38093, 25873, -191357, 45608, -167862, -267317, 499752, -88886, 75245, -209033]
18175e38328A38935a77581B41611b22262j3774j21157G4011a24219B8159K36154
18165B64313g6058p7504H2173a9921j25170o8621A37932e6120G1211J14923a1861
18153g9939A0937J01476O4518c9975b002A73535H3297d14225Q8409a06131j24071
18142b30202C1340a51642B7216K91157D4240b60490B25323c0835p0281j62627
18132b63743R1366D213J03048F160P6846l1886b30684a0029m9355A24585J1094
18121A35679c02556A44446a5767j26925Q759N0810J0511k24473J25827F9237a46723
18109B9362d9921j58690R0074m5789m5738j19350c5280L780q6143p9635E43212
18097a54431b5756k6932H5959e8830m0036c3637A61508b27046K4025N7353C2041
$$ y = [-538328, 138935, -177581, 241611, -222262, -236036, -357193, 74011, -124219, 28159, 264313, -76058, -153562, 82173, -19921, -145091, -213712, 137932, -56120, 71211, 186134, -11861, -79939, 10937, 112413, 176931, -39975, -2002, 173535, 83297, -414225, -325816, -106131, -230202, 31340, -151642, 27216, 318373, 44240, -260490, 225323, -30835, -101116, -263743, -172377, 4213, 107261, 6160, 83006, 51120, -230684, -10029, -59384, 124585, 135679, -302556, 144446, -15767, -142692, -133933, -83123, -72612, -297085, -171258, 69237, -146723, 29362, -49921, -208611, -118537, -164326, -210064, -329414, -35280, -31500, -117643, -197278, 543212, -154431, -25756, -52688, 85959, -58830, -98866, -33637, 161508, -227046, -203021, -145668, 32041]
18085a14522j08021P5171D1427N2870e9101j43299b7426H9370D1898L25P273B0676
18072A06372a38904G5899b54253E2988g4603D6060a61544g3800j4047A52045f8620
18060C0679a38397c98k3052j60381B21111d92662b5007A78102q4685N6875L23738
18049D74030a35805c7611C18594b97221B17480h0899n945c8449k24136I0860M1311
18038A32171a86492H1771a17595G40c41545g3765j8494m5877C8972J26025j8345
18027A46652C0616d8252j04478e6698j67779L6429e5287j5835E3772e29101B13149
18015c42338I2450a1646B10072n3076f7536o8968C34710b11027B12507b8367k93098
18004c21465J37675M7691H5695c0173A2075e5799C5154R4296a24921E0649a94949
$$ y = [-114522, -222543, -147372, 41427, 94297, -59101, -202400, -27426, 89370, 41898, 42223, 49496, 20676, 106372, -138904, 75899, -254253, 52988, -74603, 46060, -161544, -73800, -87847, 152045, -68620, 30679, -138397, -398, -23450, -183831, 221111, -492662, -25007, 178102, 93417, 150292, 474030, -135805, -37611, 318594, -297221, 217480, -80899, -86844, -38449, -262585, 90860, 132171, -186492, 81771, -117595, 740, -341545, -73765, -92259, -138136, 38972, 164997, 146652, 30616, -48252, -152730, -56698, -224477, -188048, -55287, -71122, 53772, -529101, 213149, -342338, 92450, -11646, 210072, 156996, -67536, -136504, 334710, -211027, 212507, -28367, -321465, -183790, -136099, 85695, -30173, 12075, -55799, 35154, 129450, -124921, 50649, -194949]
17992b96179B2919b78441B89428a47086A21125a79259k4508k3649b7201l1964
17982e9165C3711N4445c36068F4097K6801l3324a1797o2112p6293J9382O3365
17971f7455D4717L53384d3941A02392b32250A34099a69593H7594i336B23168K70480
17960D93648D567K60678a87560h6969A21972c5834q0351k40669A8322K35059h8
17948a60797J8491J0854L7540I3139a66859e6247B95845a2255C8509a5663j91829
17937b07492C5862e1610j09238L4526G7411a858l7285H0816f9724J5142a707C9558
17924A4857b11511B4478R963M2360b16459B28487L4452a50462E1145a57963A2260
17912A26873a53636I7365a27228j46084J20147k53368B11280f6653F1797C290
$$ y = [-296179, 22919, -278441, 289428, -147086, 121125, -179259, -203767, -227416, -27201, -59165, 33711, 88156, -336068, 64097, 90898, 57574, -11797, -73909, -150202, -130820, -67455, 44717, 398101, -43941, 102392, -232250, 134099, -169593, 87594, -9336, 223168, 493648, 4567, 265245, -187560, -86969, 121972, -35834, -116185, -356854, 18322, 253381, -88, -160797, -142306, -131452, -93912, 93139, -166859, -56247, 295845, -12255, 38509, -15663, -207492, 35862, -51610, -160848, -126322, 77411, -1858, -39143, 80816, -69724, -54582, -1707, 39558, 14857, -211511, 24478, 34441, 76801, -216459, 228487, 262939, -150462, 51145, -157963, 12260, 126873, -153636, 97365, -127228, -273312, -153165, -406533, 211280, -66653, 61797, 3290]
17901D06535a77221G8860e895j4756D020a46708j50249e519A32868L8604Q5425
17890B56897f716r9783a3321B12363C17J30592K16515g1136j38232b920E7595
17878E4260K3331A3703a83754P5236A49147n2344b3166j93434E9862B4334l484
17867B0850a36039j25024C58630c2320F5073c73838i9807A00181a4954j39680
17857a54634A43828f4324k81426D1784d7775R401A23683R123e6083E1180J4868
17846F6048a2887A8053J48555b89725a31090J5963b7010C41701D2708M00456A79370
17834c6590j56408h6500j27861B9721b5446l12313J45136B63026b17756A77287
17823a02500E5332J26936n5291a02966B41043E284J84939a49876a3143j45511
$$ y = [406535, -177221, 78860, -5895, -20651, 4020, -146708, -296957, -5519, 132868, 171472, 256897, -6716, -106499, -13321, 212363, 317, 130909, 347424, -71136, -209368, -2920, 57595, 54260, 77591, 13703, -183754, -108518, 149147, 96803, -23166, -216600, 59862, 24334, 20850, -136039, -261063, 358630, -32320, 65073, -373838, -99807, 100181, -14954, -154634, 143828, -64324, -345750, 41784, -47775, -38374, 123683, 132806, -56083, 51180, 66048, -12887, 18053, 166608, -289725, -131090, -115127, -27010, 341701, 42708, 443164, 179370, -36590, -192998, -86500, -214361, 29721, -25446, -337759, -192623, 263026, -217756, 177287, -102500, 55332, 182268, 126977, -102966, 241043, 5284, 190223, -149876, -13143, -158654]
17813a58654k36452h005J130l8064H5864C0937c6454B00490a20761A51661i6910
17801D70810a75592A34974b08104A27232C4924J5176a02952A0265b83684d4418
17790B13002b42357A26276K7657a57396L526q6906B9J39622a54237B55033g9976
17778b28879e1557H8424P3443F0505c9975B7935K82125b54921B97607E9817k7348
17767C2469f7410j24706C73963a62979l71420J99783l7121C19966F1355J21945
17757A83300a4501C9514c9878r5375f1512A06432C745a90702E33110I3201i668
17745a85731J7802A58831a43638A0295J03157c54162A1091b0748k43697h4926
17734h110A56473Q9848a03133m7704b652n8422d506I1175a75717r1799I7607J05785
$$ y = [-158654, -395106, -8005, -6875, -44939, 85864, 30937, -36454, 200490, -120761, 151661, -96910, 470810, -175592, 134974, -208104, 127232, 34924, 50100, -102952, 10265, -283684, -44418, 213002, -242357, 126276, 153933, -157396, -153870, -240776, 29, 139651, -154237, 255033, -79976, -228879, -51557, 88424, 161867, 60505, -39975, 27935, 310060, -254921, 297607, 59817, 32469, -67410, -192116, 373963, -162979, -534399, -334616, -371737, 319966, 61355, 183300, -14501, 39514, -39878, -135253, -61512, 106432, 3745, -190702, 533110, 93201, -9668, -185731, -167929, 158831, -143638, 10295, 113452, -354162, 11091, -20748, -264445, -84926, -8110, 156473, 246321, -103133, -150837, -2652, -61074, -4506, 91175, -175717, -267516, 97607, 203392]
17722B03392c025k77906B08099O0764b840l9145Q811j93607G0830k5233J61404
17711B07001m5429k4263E0812J25536a81272A01460P9717b38884D4671f4607j13139
17700a77746C55921j50227e8083m0338b6890B48936C1859a17408k18594a34223
17689a46858A18508N4184J9352n4018m5268a28736A75386n2080b77615a07323
17678a2692E9899a24334B81714e5714A2832L43898f352F5069J5961J36442C0610
17666c25953B18766a60224b5256F8363c48795a3668j62350B67753A00989D3996
17655a3230b872A98144H6891c521m1115q8090B6466J15176b8488A00943b4822
17643B0725b99534G9984b5901H561d3793E0167g1555B34887d5260A8280J55924
$$ y = [203392, -3025, -280931, 208099, 268863, -2840, -41985, -33174, -226781, 70830, 45597, 207001, 161572, 137309, 50812, 176348, -181272, 101460, 181177, -238884, 44671, -64607, -177746, 355921, 205694, -58083, -98421, -26890, 248936, 31859, -117408, -336002, -134223, -146858, 118508, 172692, 192044, 138026, 92758, -128736, 175386, 123306, -277615, -107323, -12692, 59899, -124334, 281714, -55714, 12832, 356730, -6352, 65069, 81030, 217472, 30610, -325953, 218766, -160224, -25256, 68363, -348795, -13668, -176018, 267753, 100989, 43996, -13230, -2872, 198144, 86891, -3521, -44636, -132726, 26466, 141642, -28488, 100943, -24822, 20725, -299534, 79984, -25901, 8561, -43793, 50167, -71555, 234887, -45260, 18280, 174204]
17632A74204a34480A1405h4710F3867a25129A60352q164B2400K5776a35167D0773
17620f2565D7620J18168p2812e8476A25386J17253A05254C3249c5300A72575o2798
17609A09777O6571e2145C18892a05413A25533b6624j79077b9895A90344E6941
17598B27932F6165J04009A642O657a32752D6483K4163a38969k12362A21516H141
17586A36068d1466A56451D415K0639a61685k92236B62343c8406r5043A49031A6468
17574I7786b55087D72581A99150q2099C4452j5275a3629C6147a6231B69608c3813
17562A16469c12091a8062n6620C51084J5021a23974O0076b7107C53488j50289
17552B03199b93484C2839d2812A06842a88459L055m5317n528d4062o3663M5413
$$ y = [174204, -134480, 11405, -84710, 63867, -125129, 160352, 152188, 22400, 48176, -135167, 40773, -62565, 47620, 165788, 92976, -58476, 125386, 242639, 105254, 33249, -35300, 172575, 109777, 176348, -52145, 318892, -105413, 125533, -26624, -205701, -29895, 190344, 56941, 227932, 66165, 170174, 1642, 8299, -132752, 46483, 70646, -138969, -351331, 121516, 8141, 136068, -41466, 156451, 4415, 25054, -161685, -453921, 262343, -38406, -133449, 149031, 16468, 97786, -255087, 472581, 199150, 117051, 34452, 19177, -13629, 36147, -16231, 269608, -33813, 116469, -312091, -18062, -74682, 351084, 366105, -123974, -63898, -27107, 353488, 203199, -293484, 32839, -42812, 106842, -188459, -185404, -230721, -236249, -44062, -107725, -62312]
17541f2312B38306f0568o3697L6470A40063O0914O4358A22997a66321A39589j9297
17530A20292L3047d3860j56732A9777Q8293J44573b63561A65378k3347L58608
17520E00639k08719A04268r485J32664a76102d789B5568g1173G5900e2631C1899
17508A62780E7732a19666B89230r0757a37730A5349N8086M94647c5520C5555R4573
17497A30128r850C0466a27244A33364P9397j4459l9531N934G4651Q0958G573Q3570
17485I1143L23079j94963J58636j79737j3294q546K3679K10618j90831A07175
17474A83722F7353K67250J08373E2896N0778O6379F8972J34281e4825I7750P668
17463A05418b14355E0739b55163A83336m668k5471K2604c4493C0864K01791o838
$$ y = [-62312, 238306, -60568, -124265, -87795, 140063, 200977, 265335, 122997, -166321, 139589, 120292, 153339, -43860, -200592, 19777, 108070, 252643, -263561, 165378, 142031, 500639, 291920, 104268, 94783, 227447, -176102, -4789, 25568, -71173, 75900, -52631, 31899, 162780, 57732, -119666, 289230, 198473, -137730, 15349, 73435, 568082, -35520, 35555, 130128, 120278, 30466, -127244, 133364, 212761, 198302, 158771, 164705, 74651, 155609, 7573, 91143, 414222, 219259, 377895, 198158, 184864, 176318, 199997, 410615, 219784, 107175, 183722, 67353, 334603, 442976, 52896, 103674, 170053, 68972, 203253, -54825, 97750, 105418, -214355, 50739, -255163, 183336, 178668, 153197, 175801, -34493, 30864, 232655, 225817]
17452B25817J84375C4632M00381D8464R6749Q2463K27289P2681B53821k6647K0951
17441B48125A13797M237P8870E7924a7028B32181c3700B65859p4033J20864m0189
17430B72501J03643A7726K91260j11610O547L12582O8023A42018K77429G0204
17419A50171K09467E2031R2680O0252O9258I6634O8352F8865B1280J76267K08500
17408D06047j21784R733D8850K14964j22516M8272a48068c1171l0150I9481a5351
17396A76918l1357K28531Q2343A73597N8098L2317J69263J26270B47204M6015
17386B93219k9767J06088a92262C70614a10479C31896I0027O4244L2021J93430
17376C79722a14364B45398a35220C00127A36650b5559G4602R1585K96463b0338
$$ y = [225817, 410192, 34632, 435013, 48464, 145213, 227676, 454965, 527646, 253821, 227174, 248125, 113797, 118034, 196904, 57924, -17028, 232181, -33700, 265859, 191826, 312690, 272501, 376144, 17726, 308986, 197376, 203923, 516505, 584528, 142018, 419447, 70204, 150171, 359638, 52031, 144711, 204963, 274221, 96634, 164986, 68865, 21280, 197547, 406047, 284263, 293996, 48850, 263814, 141298, 189570, -148068, -31171, -61321, 99481, -15351, 176918, 145561, 374092, 456435, 173597, 231695, 264012, 433275, 559545, 247204, 293219, 263452, 369540, -192262, 370614, -110479, 331896, 90027, 154271, 186292, 379722, -114364, 245398, -135220, 300127, 136650, -25559, 74602, 166187, 462650, -20338]
17365f9310o6003n755F922O0514N8763k2375b6582B2052J85409J616B1573K09806
17353B31379F827K09338E4702J58717m4824D8701B0322N7592b62631C3336i1259
17341C24128n1280J82755B10768I0269j4978j441P8279a56075k7996C54092G6590
17329f6900B4049K18981C1594K76440j42310J02113k9718l4080l6237D7216J05077
17318A52293Q6047l2956A0867a12583I1317J68903b24877J09988G7343L1451J3480
17307A22274o486J17996R4950b08083C58755H2395p933J91555B8337K62228a00569
17295B11200a79556P3429H0068M779b8901B01519f4966B47387j0629K86682r8105
17284D25335J1849D1623b2534j7606A35499J07362k4266D2499J22752L3803J41667
$$ y = [-69310, -135313, -141068, 6922, 67436, 126199, 103824, -26582, 22052, 207461, 209077, 21573, 231379, 6827, 216165, 54702, 213419, 168595, 48701, 20322, 77914, -262631, 33336, -91259, 324128, 272848, 455603, 210768, 90269, 75291, 73850, 152129, -156075, -184071, 354092, 76590, -66900, 24049, 243030, 31594, 308034, 165724, 267837, 238119, 204039, 167802, 47216, 152293, 238340, 205384, 10867, -112583, 91317, 260220, -224877, -114889, 77343, 108794, 122274, 115788, 233784, 328734, -208083, 358755, 82395, 74462, 266017, 28337, 290565, -100569, 211200, -179556, -106127, 80068, 84847, -28901, 201519, -64966, 247387, 236758, 523440, 425335, 437184, 41623, -22534, -40140, 135499, 242861, 218595, 42499, 165251, 199054, 340721]
17273C40721F8467K45400j21460R8323j19658Q572C0592J36402i954A0963J35839
17262A46802J13639M710m6163P3416A8113O5152D423Q2389j8677B6360K02522
17251B28882q0447B9066J59837n0568L41246a03889B22844A4968g4073A9239N33835
17240E53074k41414F1482R2305M60082A8790K52643J33966g0198C08653j53047
17230A55606P824C9558K55742G9275K57303j17650K39042A56052J31164j16807
17220A70409l5469J13575J76554j87931C5218O18766A52447L620L10863j90551
17210B76379r5129K30624m1748j07457J13800j79902R8197K08905F7517g0461
17199B79108I9649K07088j07637K37263A91160I4811N11037B90777L42660B46992
$$ y = [340721, 68467, 313867, 192407, 290730, 171072, 179644, 30592, 166994, -9954, 10963, 146802, 260441, 265151, 218988, 292404, 18113, 83265, 4423, 86812, 68135, 26360, 228882, 148435, 29066, 188903, 138335, 479581, -103889, 222844, 14968, -74073, 19239, 553074, 311660, 61482, 153787, 613869, 18790, 271433, 405399, -70198, 308653, 155606, 163430, 39558, 295300, 79275, 336578, 218928, 457970, 156052, 287216, 170409, 134940, 248515, 425069, 237138, 35218, 653984, 152447, 156067, 466930, 276379, 181250, 411874, 370126, 262669, 376469, 196567, 294764, 503669, 67517, -70461, 279108, 99649, 306737, 199100, 436363, 191160, 94811, 605848, 290777, 633437, 246992]
17188B46041O4931A0121L48723C2973P4641L51510E6216L69354A33581J24846
17178B58427L85532B34326O0555K8827j3556j6583E6571b3908E16114j92701j3992
17167C09421J51935j28099A38271K29976j34278K17059C4281J00435M0095J04798
17157B79609O5425q2087J81960h7163C65533m2926J85721A59585K36031I4356
17146B98867m8794M7961J04219k5755A15545K25928j34691K86257f182C14782
17135E72871j64037J21764A11515K12602K47690p6753j50306k0476j08428p3467
17125A42377K47852K6653F7401L14775R4561B33268K88647j13708o3344m0674
17115C04189J82578F659L04472J21436A88949J90234J95013m2305n3997n031j5672
$$ y = [246041, 310972, 10121, 358844, 32973, 107614, 459124, 56216, 425570, 133581, 258427, 643959, 234326, 294881, 323708, 310152, 293569, 56571, -23908, 516114, 323413, 309421, 461356, 333257, 138271, 368247, 233969, 451028, 34281, 134716, 174811, 279609, 345034, 262947, 444907, -87163, 365533, 322607, 508328, 159585, 395616, 94356, 298867, 250073, 298034, 402253, 376498, 115545, 341473, 206782, 493039, -6182, 314782, 572871, 408834, 530598, 111515, 324117, 571807, 495054, 344748, 324272, 215844, 142377, 390229, 416882, 67401, 382176, 476737, 233268, 521915, 408207, 344863, 304189, 486767, 6659, 311131, 432567, 188949, 379183, 574196, 531891, 477894, 472863, 457191]
17104D57191l1369A14580O3954J73001K63963B04894n129M90953k16929B20855
17093D88542A39784K41621J15170j02575A63371p3662J14796L13015l1196m8971
17083D37353l33j69054L40746j39613B04938p6662J94399j52134L91504j1939
17073E50106k20641K29187j82124K9463O1091L5769J81261k21415j67240O0734
17063C56191J72706j14060A29524J83281M27668j99149m8402j71781p7163L22296
17053E66274j00221K25432k34773N0925j75904j32511K94457m7129j89898L56506
17043F13158k77419L20216J14527l40602K67768j8502l24809K32595j88321M33539
17033H32150l84258L88272B50049M08760r8992p8905j16164J90877J12267j43716
$$ y = [457191, 425822, 114580, 178534, 351535, 615498, 204894, 199765, 690718, 473789, 220855, 488542, 139784, 381405, 496575, 394000, 163371, 89709, 204505, 517520, 486324, 437353, 437020, 267966, 608712, 469099, 204938, 128276, 322675, 170541, 562045, 550106, 329465, 558652, 376528, 405991, 467082, 502851, 684112, 462697, 295457, 356191, 528897, 414837, 129524, 312805, 740473, 541324, 492922, 321141, 243978, 566274, 466053, 691485, 456712, 507637, 331733, 199222, 493679, 446550, 256652, 613158, 335739, 655955, 770482, 429880, 697648, 679146, 354337, 586932, 398611, 832150, 447892, 836164, 250049, 658809, 559817, 480912, 364748, 555625, 667892, 524176]
17023E24176N3856J6699K88213k35614J06221j09015J02595j63028M734j03889
17013D84948K27237j67636R9896L1644k45964Q3709N59168l95331o5827K74822
17003H86666n7022j40896j49634J50459P6214K1830k13202L50299J25957K94395
16993A345066F68724q3437K20307k66619R5620J30178r8123J43005J69967m46893
16983E32729L78457j12972M02125m21468q6104k70186L50753L61565J24982l26714
16973I33167L08545k95335j09588J13806m44766K36414j91010K13455J83117j95924
16963G51881M29817k65047L75604l77923j9212N69277l46545j3695k24327J81503
16953A061333j68298N27803k57612j32048J97400k01960P2656j12531m3959k61858
$$ y = [524176, 578032, 594731, 882944, 647330, 753551, 644536, 747131, 584103, 588837, 484948, 712185, 544549, 644445, 676089, 430125, 513834, 1073002, 677671, 611844, 886666, 829644, 688748, 539114, 689573, 765787, 787617, 574415, 924714, 1050671, 1345066, 668724, 585287, 805594, 538975, 634595, 764773, 666650, 809655, 979622, 532729, 911186, 798214, 1200339, 778871, 692767, 422581, 773334, 1134899, 1259881, 933167, 1241712, 946377, 836789, 950595, 505829, 742243, 551233, 764688, 947805, 751881, 1181698, 916651, 1292255, 914332, 895120, 1464397, 1117852, 1104157, 879830, 1061333, 893035, 1420838, 1163226, 1031178, 1228578, 1026618, 1099274, 986743, 942784, 680926]
16943F80926M59636r8673J49679l06480L76676M3855l63073M26208K20376k96476
16933A292654l17513J3667L06841O2087j84143K13417k07737L41414l72605J51640
16923A299722K11704J34847k87668K30717K83786o23383J10453r7426L5804L67522
16913A666078L8737k21694R6079J03478p7584l78950L13124l5292L4626K1927
16903A560529K05539l05476N8201K64754J35828r134l67242K04291j809N7446
16893A802927K31726N9509j04764K10629l33109K12652j08712j24520K19798o9042
16883A997094r9711L64648m1718j41984K53895K3444k75162L97957o6391j0433
16873B401639M9945j41371n8827K35137k32554M74015j18561q1408l801J21896
$$ y = [680926, 1140562, 1041889, 1191568, 885088, 1261764, 1305619, 942546, 1368754, 1589130, 1292654, 975141, 988808, 1295649, 1357736, 1173593, 1387010, 1179273, 1520687, 1148082, 1299722, 1511426, 1646273, 1358605, 1589322, 1873108, 1249725, 1360178, 1262752, 1298556, 1666078, 1704815, 1483121, 1579200, 1682678, 1605094, 1226144, 1539268, 1503976, 1538602, 1560529, 1766068, 1460592, 1518793, 1783547, 1919375, 1910241, 1542999, 1747290, 1745481, 1802927, 2034653, 2094162, 1989398, 2200027, 1866918, 2079570, 1970858, 1846338, 2066136, 1997094, 1897383, 2262031, 2220313, 2078329, 2332224, 2355668, 2080506, 2478463, 2412072, 2401639, 2451584, 2310213, 2251386, 2486523, 2253969, 2727984, 2609423, 2528015, 2524214, 2646110]
16863B646110P7760L2037K85149j32359J45844j90673o9010J92670L16284k71849
16853C031963M5725K32904r3261J83294J42221o666k11726O909K23004k13599
16843C340768K14896J91502m63370O58967k02296K02989o5241K37550q6073K32830
16833D262522j66971k0158L16916J32074j5583M95007k38819j6335L36737q6483
16823D998907M061J81827L99747l52518K79499m8684L53918R5080J13882j01102
16813E924617J50619L28030j56016j28845N28993J12440K08313L1689J10568Q8111
16803G198519N69583k53790J71305L20675J66694M54170q1507M15609J32636L28607
16793I422501k7630L82577K98835L51980L66933P4202K92789L67407L3991O96456
$$ y = [2646110, 2723870, 2755907, 3041056, 2908697, 3054541, 2863868, 2794858, 2987528, 3303812, 3031963, 3077688, 3310592, 3217331, 3400625, 3542846, 3536180, 3324454, 3331363, 3554367, 3340768, 3555664, 3747166, 3283796, 3942763, 3740467, 3943456, 3878215, 4115765, 4029692, 4262522, 4095551, 4075393, 4392309, 4524383, 4508800, 5003807, 4764988, 4748653, 5085390, 4998907, 5002968, 5184795, 5584542, 5232024, 5511523, 5462839, 5816757, 5911837, 6025719, 5924617, 6075236, 6403266, 6247250, 6118405, 6647398, 6759838, 6968151, 6999840, 7110408, 7198519, 7768102, 7514312, 7685617, 8006292, 8172986, 8627156, 8545649, 8961258, 9093894, 9422501, 9394871, 9777448, 10076283, 10428263, 10795196, 10869398, 11162187, 11529594, 11563585, 12260041]
16783A2260041K43440j58086Q65144M13629M70590K50271N69070N12916J41897
16774A5568912P52586L89330L74607O15361R84155p6436J163343N71854Q22347
16765B1166059R14133R01592P94306R05169Q56987R17276J079899R25239J318708
16756B9779368J361417J281254J481714J732558J584858J606780J864799K114414
16748D2807162J939105K309782J914404K547262L247051K709428K976641L555625
16740F4006460L200009L659365M201471M040309M694903M866182N079578N338218
16732I9086495N451573O105135N603714O361214O074404O205979O273369O468017
16724A47629900N914495N261188M779805M559473K928789L010691J528962Q16677
$$ y = [12260041, 12503481, 12345395, 13210539, 13624168, 14094758, 14345029, 14914099, 15427015, 15568912, 16321498, 16710828, 17085435, 17700796, 18684951, 18608515, 19771858, 20343712, 21166059, 22080192, 22981784, 23776090, 24681259, 25538246, 26455522, 27535421, 28460660, 29779368, 31140785, 32422039, 33903753, 35636311, 37221169, 38827949, 40692748, 42807162, 44746267, 47056049, 48970453, 51517715, 54764766, 57474194, 60450835, 64006460, 67206469, 70865834, 75067305, 79107614, 83802517, 88668699, 93748277, 99086495, 104538068, 110643203, 116246917, 122608131, 128682535, 134888514, 141161883, 147629900, 153544395, 158805583, 163585388, 168144861, 171073650, 174084341, 175613303, 176429980]
16716A76429980n82937j498628k019529l572013l938836m849361n668557n688959
16708A48611160o284023o194862o434115o214932o451888o302827n835546n516778
16700I9376189n581045n317500m506133m966952m059897m123830m167127l789580
16692F2864125k815616l159462l138559k576775k704820k501684k242895j964604
16684D1759710k195052j970083j637375j448980j572926j528070j218687j294763
16676B8893774j475219r81777p77618j119703r05436j206776m92586j105521p44215
16667B0084923q85092k65926j025327m23993n40166q96286n03459m49560k34436
16658A4860678q68256k08242l17811m56740o75162J15651p13969k37458m13878
$$ y = [176429980, 175847043, 174348415, 172328886, 168756873, 164818037, 159968676, 154300119, 148611160, 142327137, 136132275, 129698160, 123483228, 117031340, 110728513, 104892967, 99376189, 93795144, 88477644, 83971511, 79004559, 74944662, 70820832, 66653705, 62864125, 60048509, 56889047, 53750488, 51173713, 48468893, 45967209, 43724314, 41759710, 39564658, 37594575, 35957200, 34508220, 32935294, 31407224, 30188537, 28893774, 27418555, 26436778, 25659160, 24539457, 23634021, 22427245, 21934659, 20829138, 20084923, 19199831, 18933905, 17908578, 17484585, 16944419, 16048133, 15544674, 15095114, 14860678, 13992422, 13784180, 13466369, 13009629, 12334467, 12450118, 11736149, 11498691, 11084813]
16649A1084813p5047n58128j01017j66186n11184J8881l64142k26542k61976l76980
16639H462492k18471m29061P6019J9421k72295k15764l55290k24053J50545l21383
16629F672160l71459J56088l67318O7804l73874J42228l31406j1686k68214J28288
16619E442611k95649m6397m0778M2399j34142r9053m2113m41323J85514O3090
16609D634159j79751l97773N7626j78126M1728j14473o0264r1236J71693r3048
16599C790535k81782k22563M0179j22863J58913L55947m22291k16934L2384r1153
16589C020372k89937J08261K24699j96680J26879m90883J78838o2384j21852L00135
16579B797448k48074l3873Q8577k63862J40465q7627M4525j95106Q0908m8916
$$ y = [11084813, 11009766, 10451638, 10350621, 10184435, 9673251, 9692132, 9327990, 9101448, 8839472, 8462492, 8244021, 7814960, 7890979, 7910400, 7638105, 7422341, 7067051, 6842998, 6993543, 6672160, 6300701, 6456789, 6089471, 6157275, 5783401, 5925629, 5594223, 5582537, 5314323, 5442611, 5146962, 5100565, 5059787, 5102186, 4968044, 4868991, 4826878, 4385555, 4571069, 4634159, 4454408, 4056635, 4114261, 3936135, 3977863, 3863390, 3803126, 3711890, 3883583, 3790535, 3508753, 3286190, 3326369, 3203506, 3362419, 3718366, 3296075, 3079141, 3111525, 3020372, 2730435, 2838696, 3063395, 2866715, 2993594, 2502711, 2681549, 2619165, 2497313, 2797448, 2549374, 2515501, 2604078, 2340216, 2480681, 2393054, 2437579, 2242473, 2323381, 2274465]
16569B274465j3375N5645j44729K09400j83366N7905k45907j17195J80033m0459
16559B032417l67266L78566j65967J17113l63526J71849j75320L04892j55076
16550A777682j81894n4406j1776J02056P6219k70178L91263q5202k41360K5498
16540A527902k27555J93831L8754l67886L88484m10570K67145M43870m66586j05681
16530A281708O6053j57618J64280n4816J9100j7185K21283l22587L2933q4268
16520A148883N1336J17816k62184j07940K55373J61492j57389q9942j7103j8890
16510A081452Q7620l2144l11757P2670Q9810K41675m00019K79047J24980j63409
16500A069925j37136J05820j67113K70290m47333j4196K21193M15642n06820q3555
$$ y = [2274465, 2261090, 2316735, 2172006, 2381406, 2198040, 2255945, 2010038, 1892843, 2072876, 2032417, 1665151, 2043717, 1877750, 1994863, 1631337, 1803186, 1627866, 1932758, 1777682, 1595788, 1541382, 1529606, 1631662, 1707881, 1437703, 1828966, 1743764, 1502404, 1527902, 1300347, 1494178, 1532932, 1165046, 1553530, 1142960, 1410105, 1853975, 1387389, 1281708, 1347761, 1190143, 1354423, 1299607, 1318707, 1301522, 1522805, 1200218, 1233151, 1148883, 1200219, 1318035, 1055851, 947911, 1203284, 1364776, 1207387, 1117445, 1100342, 1081452, 1169072, 1136928, 825171, 897841, 987651, 1229326, 829307, 1108354, 1233334, 1069925, 932789, 1038609, 871496, 1141786, 694453, 680257, 901450, 1317092, 810272, 726717]
16490G26717Q0941J71608N0615m7311l53006K02294K96661p7135l61013J51332
16480H41703O4570j4918k73106L54837l54149K05864k17819l7827J00460R8648
16470G68263l45667J91456K54403j55209n3496j40692L03811j48005r1593j09769
16460D73502K31541m6481j19623O7977r4281K9648k9444K25806k80225q239J73959
16449F24140A83685K99169P4808j34438K17571J854j23118q3014L94111j29259
16439G01369k05088P2385j50298O8905B41637L07832L774J95795r7053j73916
16429D78069o9705Q8612k39315L00816j56758j1775k6735J03384q2471Q0029K79573
16418G43724r4951k03777J15704j44352J92421J44121C00300L60015B51322K05732
$$ y = [726717, 807658, 979266, 1029881, 982570, 629564, 831858, 1128519, 1051384, 690371, 841703, 906273, 891355, 618249, 973086, 618937, 824801, 606982, 569155, 669615, 768263, 422596, 614052, 868455, 713246, 659750, 519058, 822869, 674864, 583271, 473502, 705043, 658562, 538939, 606916, 512635, 542283, 512839, 738645, 458420, 450181, 624140, 183685, 482854, 557662, 423224, 640795, 642649, 519531, 436517, 830628, 701369, 496281, 568666, 418368, 487273, 241637, 549469, 553243, 749038, 651985, 478069, 408364, 496976, 257661, 558477, 401719, 389944, 363209, 466593, 384122, 464151, 743724, 648773, 444996, 560700, 416348, 608769, 752890, 300300, 660315, 251322, 457054]
16408D57054F6824M78212k8189j6895j56231L47875k66521n0964P8263A73215
16397B45841J30191A62443J01924K1965j00149p9641L7733M9540J00679L97058
16387F91552j98401n2530j52276j3665L21042B96960K29010o4447O1956k42933
16377B80546k6674A21156K20726J54785A40792M08140j47333B7586L08295j0934
16367C24947N3495P9191A01494M01081L0998b0213I0872j8453K19417J43391A43580
16355B54602I2833K76987j46226p14c1303C44976I8372L2253J44470M6384C2616
16343D73094B05407p8583K02236A07046P296a79189A41676J07394A10665m1011
16333F9654R0631O7579L72776A7154L45822l4847m3897r0637E7149B5914K11067
$$ y = [457054, 66824, 545036, 516847, 499952, 343721, 691596, 425075, 374111, 452374, 173215, 245841, 376032, 162443, 264367, 286332, 186183, 106542, 144275, 193815, 294494, 691552, 493151, 440621, 288345, 274680, 595722, 296960, 525970, 461523, 523479, 280546, 253872, 121156, 341882, 496667, 140792, 548932, 401599, 27586, 335881, 324947, 378442, 457633, 101494, 502575, 533573, -20213, 90872, 72419, 291836, 435227, 143580, 254602, 92833, 369820, 223594, 222880, -31303, 344976, 98372, 130625, 275095, 321479, 32616, 473094, 205407, 126824, 329060, 107046, 114342, -179189, 141676, 249070, 110665, 69654, 160285, 227864, 600640, 17154, 362976, 328129, 284232, 193595, 57149, 25914, 236981]
16322B36981j09318j1669C2877m739b9343A20821J83717L54522A72394q2040j4761
16311G5593g8250B69967J42279A18989J05459m2289J20215a455G2029J58653m2866
16300A87816R6655A04270L73748A45875J7564C9572J98771J42699j85997l672
16290A91373C2109a07628A1566d8927a0696B59933a94610A01775g9717B38263
16279e9110A29524K85510a31928B86118p8706J04975l9017n1748d19869A90727
16268A48036l2118h186o3770D06535a28792A65072a70499a5132C1637a15908A14411
16256H9665H250K53789A28921l9784J339J98414d2981C34328b21059A13311n1687
16245F1624N7897m1723O1051R1270a14138k8511e610A48753F1707b10291C04157
$$ y = [236981, 127663, 115994, 32877, 28138, -29343, 120821, 304538, 659060, 172394, 90354, 75593, -78250, 269967, 412246, 118989, 224448, 182159, 302374, -1455, 72029, 230682, 187816, 284471, 104270, 478018, 145875, 163439, 39572, 238343, 381042, 195045, 191373, 32109, -107628, 11566, -48927, -10696, 259933, -194610, 101775, -79717, 238263, -59110, 129524, 415034, -131928, 286118, 207412, 312387, 273370, 221622, -419869, 190727, 148036, 115918, -8186, -71956, 406535, -128792, 165072, -170499, -15132, 31637, -115908, 114411, 89665, 8250, 262039, 128921, 89137, 90476, 288890, -42981, 334328, -221059, 113311, 61624, 119521, 77798, 138849, 230119, -114138, -142649, -5610, 148753, 61707, -210291, 304157]
16233H0363J0098a27232A52676G2529B4748P6344J50167n7960q1311a03479A08487
16221B10277b61496A81260i1745C91781q4950j41477b81396A16131K66914A61767
16210a14016D5726K05615K05060a30818E1522h3330J3382j39743C7014b6527A55667
16198C02620l6677i1102B63078p9580a04100J1145j13965b7882A58978J13025
16188B72003a31838j69848M9120C50181B6012J54315C1451j4894e1694H2634g2976
16176i5474D8367J31384a07224j8802K9157j23908C12997h2187C15076F4522J86482
16165B51004q7605a8299B90518k2681a29853j8512A83181a24938A32055k5611
16155A06444J04037J40945b61878B93611b45613g0265L1245E7693f27901G3619
$$ y = [80363, 90461, -127232, 152676, 72529, 24748, 101092, 251259, 193299, 111988, -103479, 108487, 210277, -261496, 181260, -91745, 391781, 306831, 165354, -281396, 116131, 383045, 161767, -114016, 45726, 251341, 456401, -130818, 51522, -83330, -69948, -209691, 37014, -26527, 155667, 302620, 265943, -91102, 263078, 183498, -104100, -92955, -206920, -27882, 158978, 272003, -131838, -301686, -252566, 350181, 26012, 180327, 31451, 16557, -51694, 82634, -72976, -95474, 48367, 179751, -107224, -126026, -96869, -220777, 312997, -82187, 315076, 64522, 251004, 163399, -18299, 290518, 267837, -129853, -148365, 183181, -124938, 132055, 106444, 210481, 351426, -261878, 293611, -245613, -70265, -39020, 57693, -627901, 73619]
16144a6963A57317M2695i6373C21038a03731B19255m1192a1154A43988j2001C0677
16132A0235a37805c4272H0571b802C6817d8544A21556n8826P0734A5439J38517
16121A53956P3685a49943A2150f0662j91127Q4318A04905O6432c19933c2649q2229
16110a14878B23542a00371j9477A70137o5116N0509a58629H9882Q8393a5810B28243
16098C98402C6310k695J44002e5048K4856G0012B8457J21770b65436A48127i1542
16086b21621B1811a6686A8710M1383P700c53089J19168d6095p4989A97864d55371
16074a7776l1129G9466h2792A0176J17326m5125Q2151L43104f6189I938M54624
16063D64562A99945m0456A3262c7725k0525l59530A07551M895i3774A35139P543
$$ y = [-16963, 157317, 200012, -96373, 321038, -103731, 219255, 178063, -11154, 143988, 131987, 30677, 10235, -137805, -34272, 80571, -2802, 36817, -48544, 121556, 62730, 133464, 15439, 153956, 227641, -149943, 12150, -60662, -251789, -167471, 104905, 171337, -319933, -32649, -114878, 223542, -100371, -119848, 170137, 105021, 155530, -158629, 89882, 178275, -15810, 228243, 398402, 36310, 33615, 177617, -55048, -30192, 70012, 28457, 150227, -265436, 148127, -91542, -221621, 21811, -16686, 18710, 60093, 67793, -353089, -233921, -46095, -121084, 197864, -455371, -17776, -48905, 79466, -82792, 10176, 127502, 82377, 164528, 507632, -66189, 9938, 464562, 199945, 159489, 13262, -37725, -58250, -417780, 107551, 112446, -93774, 135139, 142682]
16052A42682b21267A51548a55814K8988E6670J30491D0209O671a92966d5206j6638
16041f1844A89581J56444d5691k97078B72292A9094J54769J76226h2177p1807
16031a53984L0187P99A03216j1255J74238a61085e5746A77628E9996a42318B24552
16019a13174j13638H8546a1432k73886Q6173B03406C0615a19475G3548d71362
16008f355o1368q2507B90087i1239k02097a00570q5961A22778b42966B14183G290
15996I2186c6259J7326A60847a51905q3570k3955N1429C1510a11152A15001N530
15985A20531R369b0564B77882J8837m5181o3864j0557o9525e1560A50248o835
15974A43413E0731b13337D4944L33796j06105e8276l0192C5823f54k07044r6824
$$ y = [142682, -221267, 151548, -155814, -126826, 56670, 187161, 40209, 46880, -192966, -45206, -61844, 189581, 346025, -45691, -342769, 272292, 19094, 173863, 350089, -82177, -153984, -123797, -122998, 103216, 91961, 266199, -161085, -55746, 177628, 59996, -142318, 224552, -113174, -226812, 88546, -11432, -285318, -199145, 203406, 30615, -119475, 73548, -471362, -6355, -67723, -150230, 290087, -91239, -293336, -100570, -186531, 122778, -242966, 214183, 7290, 92186, -36259, -18933, 160847, -151905, -235475, -259430, -208001, 31510, -111152, 115001, 120531, 129900, -20564, 277882, 296719, 251538, 187674, 177117, 107592, -51560, 150248, 143413, 50731, -213337, 44944, 378740, 272635, -58276, -88468, 35823, -654, -207698, -304522]
15963c04522D18551G2177c7841k78043D17491a48610o9769A20956D4016A8942
15952c20006a4877j92095A03514f0057b7613A34620J33771G4551i1355B07342
15941C0053a76357B75984o8010J7288c9077j94687R6949O1517B21566a34025E8730
15929c77620B6297K1636R0479a19374k5953B50489f1928j09448m397b8482A8146
15917b07599K4161O6936C0879b1205A5446a48288D3971M7887a88160g6389B12334
15905b15435c5628A30147C3126a7905C1291c44289A27213a45906j55284c7241
15894a26050a7552c361A59042o8502b6627A15783a40351A19884a57833b2618j5336
15883c7954j43513H9369B6164J21028k8460B2959a49100g1648k6795B38028c05286
$$ y = [-304522, 418551, 72177, -37841, -315884, 417491, -148610, -218379, 120956, 44016, 18942, -320006, -14877, -206972, 103514, -60057, -27613, 134620, 268391, 74551, -91355, 207342, 30053, -176357, 275984, 207974, 225262, -39077, -233764, -136815, -75298, 221566, -134025, 58730, -377620, 26297, 47933, 138412, -119374, -145327, 250489, -61928, -171376, -175773, -28482, 18146, -207599, -183438, -116502, 30879, -21205, 15446, -148288, 43971, 91858, -188160, -76389, 212334, -215435, -35628, 130147, 33126, -17905, 31291, -344289, 127213, -145906, -301190, -37241, -126050, -17552, -3361, 159042, 90540, -26627, 115783, -140351, 119884, -157833, -22618, -37954, -181467, 89369, 26164, 147192, 118732, 22959, -149100, -71648, -98443, 238028, -305286]
15871A60570k8295h6554l2910j51526a32175l08836E5141a13711r6634o323O4533
15860a52135K1328P169H5790A5907L3076J55508o3231P9772a46288I6013b04738
15848A1780a42039r8468e3438l8419l0158C4238e9340B37033a9500I7466A09b23571
15835C104K90392E5163a37925I0087J15072a79583c5259J7128j15368A44924O1973
15824B06897a0408C0463J6718a14613K754I6071O7263a43660J7113r9672e8375
15812F5395b33718a01036k56834B34714J15560b74653r486b5695H656K04073A1433
15800C9581P837f7750q6718d84j42757r4215J06853D3004c9621l6662k54001h6495
15787A44772a49377M914r216r9855P910C5735O5181B6089i5719A13148b1979j67090
$$ y = [160570, 132275, -86554, -119464, -270990, -132175, -441011, 55141, -113711, -210345, -216668, -152135, -130807, -123638, 85790, 15907, 48983, 204491, 141260, 221032, -146288, 96013, -204738, 11780, -142039, -240507, -53438, -91857, -122015, 34238, -59340, 237033, -19500, 97466, 109, -223571, 3104, 293496, 55163, -137925, 90087, 205159, -179583, -35259, -18131, -133499, 144924, 206897, -10408, 30463, 47181, -114613, -111859, 96071, 163334, -143660, -126547, -226219, -58375, 65395, -233718, -101036, -357870, 234714, 350274, -274653, -284139, -25695, 8656, 212729, 11433, 39581, 47418, -67750, -154468, -484, -143241, -237456, -130603, 43004, -39621, -76283, -330284, -86495, 144772, -149377, -144463, -153679, -253534, -245624, 35735, 100916, 26089, -95719, 113148, -21979, -189069]
15775a89069b6502r2849e8020A20a39193L3826a3908p3738j20688h0916K3692
15764e7224k3813c2037j27973b608B28457b93606e1060B54142a61375G9388J03888
15753A83276F0884a541E12021j45565G7071J88947N4113J97154g3309a5446I5757
15741B35185B8288j0817J15673J48186a09611B23363p5172P7179E479a50756a1684
15729a82608d9063E2004b91631B01765a19682b3287H5878P2543F0121r23a16579
15717e4506q4415A67927m0804O8292J5017g8425r7811d0872A04264a97198A80068
15705b04918N9650n3632B49086a28924K9447B5430K08625D8462M4047K6633J64693
15694B83835o6335c7074E7149h6486A844J87875f2240P561A05778D8855J48255
$$ y = [-189069, -26502, -119351, -58020, 120, -139193, -105367, -13908, -87646, -208334, -80916, -57224, -81037, -32037, -160010, -2608, 228457, -293606, -51060, 254142, -161375, 79388, 183276, 60884, -1541, 512021, 366456, 77071, 266018, 320131, 517285, -73309, -15446, 95757, 235185, 28288, 17471, 133144, 281330, -109611, 223363, 148191, 225370, 5479, -150756, -11684, -182608, -49063, 52004, -291631, 201765, -119682, -23287, 85878, 158421, 60121, 59198, -116579, -54506, -138921, 167927, 127123, 195415, 210432, -78425, -176236, -40872, 104264, -197198, 180068, -204918, -145268, -198900, 249086, -128924, -99477, 25430, 234055, 48462, 92509, 119142, 283835, 217500, -37074, 57149, -86486, 1844, 189719, -62240, -54679, 105778, 48855, 197110]
15683A97110E8291k1674J6889J24807E1803N3416B846M52679a68263g2909j26940
15672a99849K7146B31461n2548p9880e951j64968O7705G429a16821E7479J915
15661E9394E193b76253E6962I512g2655B1854A0329O6293d46190J5881J99876
15650b30433A87069a39605P458C7505d4774C29473e2209B88255c4319d180j08059
15639a12239B76884d42459A05922b56938E4003k6647a89344A72693K77146d9658
15628B72413e1503j14873A18056a91326D493R1186B62b982r5752j75318B07698
15616e2736A76278A2846c6374k0371k46759G0173j3128O9647b95174E2282N8578
15605A10860b94147D1987b30755g5864L5320I3743e9340J0638F1758a77906D8902
$$ y = [197110, 58291, 36617, 53506, 178313, 51803, 105219, 2846, 455525, -168263, -72909, -199849, -172703, 231461, 178913, 99033, -5951, -170919, -103214, 7429, -116821, 57479, 59394, 5193, -276253, 56962, 9512, -72655, 21854, 10329, 76622, -446190, -430309, -230433, 187069, -139605, -132147, 37505, -44774, 329473, -52209, 288255, -34319, -4180, -112239, 276884, -442459, 105922, -256938, 54003, 27356, -189344, 172693, 449839, -49658, 272413, -51503, -166376, 118056, -191326, 4493, 95679, 262, -2982, -98734, -274052, 207698, -52736, 176278, 12846, -36374, -56745, -303504, 70173, 57045, 126692, -295174, 52282, 110860, -294147, 41987, -230755, -75864, -40544, 93743, -59340, -48702, 61758, -177906, 48902]
15593f2332K6448j64129D5640L1528k8285M9280h3666B10760E3394B0054a49340
15581A84431c74420A14820k8113b30474F70L15245b8464k63392g5570r4517B25484
15569B8262a47760O2220j60826I970b4929j37857A14739d4439Q273B99373B5575
15557a71621P933k4217A47143a20053b7036k4411a0471j3754p9485k43221J59886
15546a87045A4227O6988h1791j6857a4908k9039j4189a7911q0933B38555E6180
15534f6067G1421J64266C6785L66748G8666J45768b6625H1473k2671J21736i4248
15522b05383i1977C0840c9233j39479o383B27379g8450B63152b43017c442A44409
15510a08496D7160c1770D6338e7991D12616g762I0829e2775J4435C58324I1168
$$ y = [-62332, -35884, -200013, 45640, 77168, 48883, 98163, -83666, 210760, 53394, 20054, -149340, 184431, -374420, 114820, 86707, -230474, 670, 315915, -28464, -291856, -75570, -170087, 225484, 28262, -147760, -85540, -246366, 9970, -24929, -162786, 114739, -44439, -36166, 299373, 25575, -171621, -163688, -187905, 147143, -120053, -27036, -51447, -10471, -24225, -103710, -346931, -187045, 14227, 81215, -81791, -98648, -14908, -43947, -58136, -17911, -98844, 238555, 56180, -66067, 71421, 235687, 36785, 403533, 78666, 224434, -26625, 81473, 58802, 180538, -94248, -205383, -91977, 30840, -39233, -178712, -185095, 227379, -78450, 263152, -243017, -3442, 144409, -108496, 47160, -31770, 46338, -57991, 412616, -7762, 90829, -52775, -38340, 358324, 91168]
15498a04968n7925O342j37907D0345a34431G4592G928K47882G5598K4429G965
15486a5504A9938b31377j49855A17511a40236E193d3547j52960D1607J35207a8328
15474B0796Q7847J16023q8378h0404j8751q0954E9326a22754m3899a6125G9972
15462C5949G5P6434J07537F0369a8324j26684D30566A27285R5715a78404j21253
15451b99657C20903a52510j19310J06071g1782I5372J19398h3312C976c27633
15440h2574b1624j97917A99489i0453j11532Q0130K8102l48025A23051a24269
15429a09315b4709D8658a45044A75862a71447b8396j12536D4339d50166a0986
15418D25135G1697c8l45455E2267K3528a8388A23517m7934L0192M34851A17517
$$ y = [-104968, -162893, -156551, -294458, 40345, -134431, 74592, 7928, 255810, 75598, 100027, 7965, -15504, 19938, -231377, -381232, 117511, -140236, 5193, -43547, -196507, 41607, 176814, -18328, 20796, 108643, 224666, 136288, -80404, -99155, -180109, 59326, -122754, -166653, -16125, 79972, 35949, 75, 76509, 184046, 60369, -18324, -145008, 430566, 127285, 223000, -178404, -299657, 320903, -152510, -271820, -165749, -71782, 95372, 214770, -83312, 3976, -327633, -82574, -21624, -219541, 199489, -90453, -201985, -121855, -93753, -441778, 123051, -124269, -109315, -24709, 48658, -145044, 175862, -171447, -28396, -140932, 44339, -450166, -10986, 425135, 71697, -38, -345493, 52267, 75795, -18388, 123517, 75583, 105775, 540626, 117517]
15406D8335a2609D3899d9546A62793a18081F6793j9386Q6418f644I26a12408D2636
15393I414a68610F7133e8535B02048f997k54479b3741H8672J43854c0024r8942
15382a28966j33253B23310A8867b5107k4210r6304K7331A39026l2428d3836A44291
15370c7098A81610a3361k09666h7149L0158j62034D27036A80799c31838f9845
15359H3553j5623g4130G1491K2942J74928F3580e2538a6887o8909A39513Q6923
15348B26436a62239L8904K3304a0579A52993a06115A5805b1818j00851A59751
15337b03893F321P2665R8028B7552J07545b19852L6413h208j36935a2865E1094
15325b31057f3458o1848G8666c426F104d8010D3598b4222B64238G8277k9758K06412
$$ y = [48335, -12609, 43899, -49546, 162793, -118081, 66793, 47407, 133825, -6644, 926, -112408, 42636, 9414, -168610, 67133, -58535, 202048, -6997, -261476, -23741, 88672, 232526, -30024, -128966, -262219, 223310, 18867, -25107, -49317, -145621, -118290, 139026, 106598, -43836, 144291, -37098, 181610, -13361, -223027, -87149, -56991, -219025, 427036, 180799, -331838, -69845, 83553, 67930, -74130, 71491, 94433, 269361, 63580, -52538, -16887, -85796, 139513, 226436, -162239, -123335, -100031, -10579, 152993, -106115, 15805, -21818, -122669, 159751, -203893, 6321, 78986, 177014, 27552, 135097, -219852, -183439, -8208, -145143, -12865, 51094, -231057, -63458, -125306, 78666, -3426, 6104, -48010, 43598, -24222, 264238, 78277, 48519, 254931]
15313B54931b55246N901H8902B9861c1593A22150J20806q8073M021L3027m6168
15302A45763o4333f7615c1715O790B29030b15517B52323K4988C1454a0487j05818
15291a16305p784k9223O1762a2207j74701c1464E726J38140p1867h4014k73081
15280c57095a2886C12999J69797A56378B7941g1310O350A72070o2850a1974A90292
15268A30174a68724K4529j4176C275M965a26248M4608A08772c03059P7352e8765
15256g9070B33275H3152L71361m6167A34591c14821H2203K57996J59053M91484
15246I90736P44519l60052N6632l59463D56342A48905J07116A04982J10809J41706
15236C57497A22976i1967q7903C9758J25087a61273O0813A03756e0103F8046L89391
$$ y = [254931, -255246, -249345, 88902, 29861, -31593, 122150, 242956, 154883, 158904, 191931, 145763, 81430, -67615, -31715, -24925, 229030, -215517, 252323, 277311, 31454, -10487, -116305, -124089, -153312, -91550, -12207, -186908, -31464, 5726, 143866, 71999, -84014, -357095, -12886, 312999, 482796, 156378, 27941, -71310, -64960, 172070, 109220, -11974, 190292, 130174, -168724, -144195, -158371, 3275, 8240, -126248, -81640, 108772, -303059, -225707, -58765, -79070, 233275, 83152, 454513, 408346, 134591, -314821, 82203, 340199, 499252, 990736, 1735255, 1375203, 1431835, 1072372, 456342, 148905, 256021, 104982, 215791, 357497, 122976, -91967, -179870, 39758, 164845, -161273, -100460, 103756, -50103, 68046, 457437]
15225D57437a40297A24514D7715Q8719N0015G6502e0053j31743C98562I745f4013
15213a82451f190A25551J01722N346K197M4757b3616B3697B355M5856L2428J85608
15201B66247A32640J60219I5315N3357i709F9124O708J65293A00827l8570L6067
15190I8324f5703E4808c08178D5169J18126f8126A43564a37028C36565C8342L29949
15179C68291c4451m6772C7440a30284B77538A19392J01898C0666L3815K08188
15169B72669A27290h5434E6750J44619a51605K5531b3432C50304j31099g3460
15158h6134A54492a32900D046c7008q3561N7106B38348a21963M0667B76132r088
15147B67044b42669f8236D6353a36502f1443B95362j01821k3762F0939A9017a697
$$ y = [457437, -140297, 124514, 47715, 136434, 186449, 76502, -50053, -181796, 398562, 9745, -64013, -182451, -6190, 125551, 227273, 232619, 234816, 279573, -23616, 23697, 2355, 48211, 80639, 266247, 132640, 292859, 95315, 148672, -9709, 69124, 75832, 241125, 100827, 62257, 98324, -65703, 54808, -308178, 45169, 163295, -68126, 143564, -137028, 336565, 38342, 368291, -34451, -81223, 37440, -130284, 277538, 119392, 221290, 30666, 64481, 272669, 127290, -85434, 56750, 201369, -151605, -126074, -23432, 350304, 219205, -73460, -86134, 154492, -132900, 4046, -37008, -120569, -63463, 238348, -121963, -81296, 276132, 267044, -242669, -68236, 46353, -136502, -61443, 295362, 193541, 169779, 60939, 19017, -1697]
15135h0491A75438J26048a15641A24076O0051H6988J20124Q7392G5775J37979
15125B13754K30091A15668D747L12697A34269J29051r5193a8214p941B96459b22314
15113A78850a09425K604q3656B42013I8251J52253r3495M9789A00302J41816H7465
15101B21607l3316M5478K13159A19568R4280k2592j8064Q0522I1431J18726I5417
15089B59808b75379C70188P5323E5415J89450Q2445d288q4919C50997I5569M10900
15078E06469a13397A34373n5564c8810C8936M5820L27571B02336J83191A43294
15067A92641K32787j45999K178b6889A64683N6029j9438H7739O1623J37168K4365
15056C10895D5015K26376q7106J02000e6406E6700L62831j01642A17728N0995
$$ y = [-80491, 175438, 301486, -115641, 124076, 184127, 86988, 207112, 294504, 75775, 213754, 443845, 115668, 4747, 317444, 134269, 263320, 168127, -18214, -26155, 296459, -222314, 178850, -109425, -106821, -190477, 242013, 98251, 250504, 157009, 206798, 100302, 242118, 87465, 221607, 188291, 233769, 446928, 119568, 213848, 191256, 173192, 253714, 91431, 210157, 95417, 259808, -275379, 370188, 445511, 55415, 244865, 327310, -4288, -89207, 350997, 95569, 506469, -113397, 134373, 78809, -38810, 38936, 84756, 412327, 202336, 385527, 143294, 192641, 425428, 279429, 281607, -26889, 164683, 220712, 201274, 87739, 149362, 286530, 310895, 45015, 271391, 184285, 286285, -56406, 56700, 419531, 317889, 117728, 168723]
15046A68723b2669j89579F6799P549K40218o9668L794k7202E10J42668J0618J57567
15034C11363c5778A95651J15021j11316Q6865o6689G6215J52554o751N3060j8876
15023B56202P751j3902N4017b4538C7863L66243j93648K9047d5422C60495c5028
15011A33102R9220M2434L638G2067K7600L65553j0470f8419B41247I0788P5956
15000A66744b39393O5624C22664b73994D3892J70313R2536A15224K05207F3322
14989B74824A10719K2440D8490K44804F3978a43400E7769b8074B25007Q6164I1164
14977C41502l2696a11542C90942G9000k4055L5397L56010G5254K05024O3467Q591
14966C52336A04161J74469A29537E6600N5193N9508J65390j33195J22213q0954
$$ y = [168723, -22669, -212248, 66799, 74348, 314566, 244898, 248692, 221490, 510, 143178, 153796, 311363, -35778, 195651, 310672, 199356, 286221, 219532, 76215, 228769, 222018, 275078, 256202, 263953, 250051, 304068, -24538, 37863, 404106, 210458, 239505, -45422, 360495, -35028, 133102, 232322, 274756, 278394, 72067, 99667, 465220, 454750, -68419, 241247, 90788, 166744, -239393, -173769, 322664, -273994, 43892, 214205, 306741, 115224, 320431, 63322, 274824, 110719, 133159, 48490, 293294, 63978, -143400, 57769, -28074, 225007, 311171, 91164, 341502, 308806, -111542, 390942, 79000, 54945, 90342, 446352, 75254, 280278, 343745, 352336, 104161, 278630, 129537, 56600, 111793, 171301, 336691, 203496, 325709, 244755]
14956B44755K3638F9165J25841F8848L63929a5378C57747r807J32536l4423p5013
14945C71040m7592R6456j60882J33368l5915J53259A44548J85935j03089F1432
14934A89142r1858K85800j41105K22071j29562A34211J51630I8084K21390K3591
14924C43065j8587A13402B3986K92296o9408J28662G0205K34310J40827q6800
14914C58542M6577N6906K6902L5751j06770A60911J64831a00381B74867o5807
14904B09060H8042L10190A78565a3405B25470J47522r6093k7269R0319A9156L66296
14893C85452j328A82993M6311L9810Q1342p1923n6737F1633L28396J3498G3818
14881D46587B18062O5801L5789K08692k50715J35028M1990A72925L09945A77533
$$ y = [244755, 268393, 69165, 195006, 68848, 432777, -15378, 357747, 347940, 480476, 446053, 371040, 323448, 419904, 259022, 392390, 356475, 509734, 144548, 330483, 227394, 61432, 189142, 97284, 383084, 241979, 464050, 334488, 134211, 285841, 98084, 319474, 343065, 324478, 113402, 23986, 316282, 246874, 375536, 70205, 304515, 445342, 358542, 405119, 462025, 488927, 524678, 417908, 160911, 325742, -100381, 274867, 209060, 88042, 398232, 178565, -13405, 225470, 372992, 276899, 249630, 339949, 19156, 385452, 384124, 182993, 229304, 269114, 350456, 278533, 221796, 61633, 390029, 403527, 73818, 446587, 218062, 283863, 319652, 528344, 277629, 412657, 454647, 172925, 482870, 177533]
14870B72207J26104j92068p9683L35526N7736A06948k8147N88065B55361M10482
14860F65843B62193M20940B54215j9658O424J73083j91457J765L17021j38900
14850D02493r3214A15535K94500Q6011k5737n4057j9378N10A92882J77705M0688
14839D11275A97520j6393Q7363K78466Q2062j70683q1125F4906M62401l6330J51534
14828F42511B19157K37787B20908M85721k14653J00085k53710O5298q5957J26793
14818D44485l0771K28428j84421J97845l03371n313L53965k81578j30029G4435
14807F55973B05466M67205k74740K47530B01003J63462Q6056R2135j92642J85235
14797E35249j319J36015j65920J1540p8942K70769j13758k86065M10324k18229
$$ y = [272207, 398311, 206243, 126560, 462086, 519822, 106948, 78801, 666866, 255361, 665843, 262193, 683133, 254215, 234557, 240981, 414064, 222607, 224372, 541393, 402493, 309279, 115535, 410035, 496046, 470309, 416252, 396874, 397384, 192882, 370587, 411275, 197520, 181127, 268490, 546956, 629018, 458335, 377210, 64906, 527307, 490977, 642511, 219157, 456944, 220908, 706629, 491976, 592061, 338351, 403649, 317692, 444485, 413714, 642142, 457721, 655566, 352195, 346882, 700847, 419269, 289240, 74435, 655973, 205466, 672671, 397931, 645461, 201003, 364465, 450521, 542656, 350014, 535249, 533930, 669945, 504025, 515565, 436623, 707392, 593634, 307569, 717893, 499664]
14787D99664J78945l2569j57350n6896p4736k0295j19947M55381k83392K64801
14777F53606n2181q5445k22673J57448R7389J31088j02897J58979k57168k17554
14767B60592M14091N9821j69612K9938P7012j77844Q9024j23392L22156k34935
14757E46851l0497J11881j62654K60650j08783q1784N4837j05682J47672l9029
14747E93462J10571l8247L8846r4386j45461P0199L40486k78050L17588j71644
14737G43364p7899C29296N30482j89798L2323L60190m70800K21430o9742q8949
14727F54432o5702J69398k8426j54799k1245R2892M48245k19091j69246Q5652
14717G92110j41834m6134J01049K92225k92006M28851l15173j83713J08222L2283
$$ y = [499664, 678609, 646040, 488690, 431794, 357058, 336763, 216816, 672197, 388805, 653606, 601425, 515980, 293307, 450755, 548144, 679232, 576335, 735314, 478146, 260592, 674683, 734504, 564892, 594830, 671842, 493998, 583022, 459630, 781786, 546851, 516354, 628235, 465581, 726231, 617448, 535664, 590501, 484819, 632491, 593462, 704033, 665786, 704632, 610246, 464785, 534984, 875470, 597420, 915008, 743364, 665465, 329296, 859778, 669980, 702303, 1062493, 591693, 813123, 743381, 654432, 588730, 758128, 729702, 574903, 553658, 646550, 1094795, 875704, 706458, 792110, 650276, 604142, 705191, 997416, 705410, 1134261, 819088, 635375, 743597, 775880]
14707G75880J29831Q5562j21023J74508l7646m47148J67383J33415l16469J78093
14697G22386L7992K28726o5660j61413P871R6357o9925o5159K43713k81892R4271
14686G87267J21270l6802k14732L21409K04756m24614J84715r1771J56484Q5642
14676A093624r7803K37346j95774p3874k48165L61297p7629j99769N6152Q799
14666H64204N10145m55922M1591l9669J55584J09759l04347K6546N9726M0157
14656A007774N1698J67641j89912l4821N2960J51185l18255l1008M04281j77470
14646A084073j36817K93197j66761p5625o6980J90527r4249R6538K67364p296
14636A383971N991k69666J66653J11725q6164m3895j18361J6420l4977M4145L09065
$$ y = [775880, 905711, 991273, 870250, 1044758, 1007112, 559964, 727347, 860762, 544293, 722386, 760378, 989104, 923444, 762031, 769902, 866259, 796334, 731175, 974888, 692996, 787267, 908537, 871735, 657003, 978412, 1183168, 758554, 943269, 851498, 1007982, 1093624, 995821, 1233167, 1037393, 963519, 715354, 1076651, 999022, 799253, 855405, 864204, 1374349, 918427, 960018, 920349, 1075933, 1185692, 881345, 907891, 967617, 1007774, 1059472, 1227113, 1037201, 1002380, 1055340, 1206525, 888270, 857262, 1261543, 1084073, 947256, 1240453, 1073692, 998067, 931087, 1121614, 1027365, 1123903, 1391267, 1383971, 1389962, 1120296, 1286949, 1398674, 1312510, 1268615, 1150254, 1166674, 1131697, 1175842, 1484907]
14625A484907l62586L95931l53015r9661L57084k47796K60728m7119O0057O0814
14615A509344k43918L6387J22945K03821j12106j25941k22785O44132j89168K30084
14605A852795n29069J32189J18593j08575K39141m17245L86901k58754J89274
14596A605250m9698K68920l06538M5169Q5479L9910J59646j34764q1536K28448
14586A860286N1277j87768l55100K82737M8930L85923l78114J96732j27242n2276
14576A725385J92412R6127n15575L56791L6971K75823J68667m9557J64208k95005
14566B156247m09435L19931J87725K63924j30481J29841j73188J45392k37331
14557B252625O10228K26590P5480p9207L40334L74236Q88031Q51885K127975M117347
$$ y = [1484907, 1122321, 1518252, 1165237, 1065576, 1422660, 1174864, 1435592, 1388473, 1448530, 1509344, 1265426, 1301813, 1424758, 1628579, 1516473, 1390532, 1167747, 1811879, 1622711, 1852795, 1323726, 1455915, 1574508, 1465933, 1705074, 1287829, 1674730, 1415976, 1605250, 1555552, 1824472, 1517934, 1563103, 1648582, 1688492, 1848138, 1713374, 1631838, 1860286, 1911563, 1723795, 1368695, 1651432, 1700362, 2086285, 1708171, 1904903, 1777661, 1725385, 1917797, 2013924, 1498349, 1855140, 1892111, 2167934, 2336601, 2287044, 2451252, 2156247, 1746812, 2066743, 2254468, 2518392, 2387911, 2517752, 2344564, 2489956, 2252625, 2862853, 3089443, 3164923, 3085716, 3426050, 3800286, 4688317, 5540202, 7668177, 11785524]
14547A1785524Q080452J3456925O803156j7411995j0329221m332888l513310j595849
14539B942794j72912m64799k62692q5402k84437L3323P2592K86576r0158K0173
14529A995058P713L86894j66210L65126n73052K55678J97368j8844m03887L23805
14519B369649J54831q756R9359Q8217j40317j96526j36302N81818l63841j2234
14509B435898M33846l18352K43449K63834m03819K98925j84133l07515M72102
14500B934235l24196L35830k79091N97442r7865p1690M7145j53581k1367J05258
14490C072120K97841j09106J84922J5797k89297K46236L54647l49974M03133l94875
14480C431444j06026J98694j11607N26597o948K59523J59017n04221O1915J45601
$$ y = [11785524, 19865976, 33322901, 40126057, 22714062, 12384841, 8051953, 4538643, 2942794, 2769882, 2305083, 2042391, 1956989, 1672552, 1705875, 1778467, 2065043, 1974885, 1995058, 2002771, 2389665, 2223455, 2588581, 2015529, 2271207, 2468575, 2449731, 2045844, 2369649, 2524480, 2515724, 2615083, 2703300, 2562983, 2366457, 2230155, 2811973, 2448132, 2435898, 2869744, 2551392, 2794841, 3058675, 2654856, 2953781, 2769648, 2462133, 2934235, 2610039, 2945869, 2666778, 3264220, 3166355, 3094665, 3141810, 2988229, 2966862, 3072120, 3369961, 3260855, 3445777, 3461574, 3172277, 3418513, 3773160, 3423186, 3826319, 3431444, 3325418, 3524112, 3412505, 3939102, 3932154, 4191677, 4350694, 3846473, 3908388, 4053989]
14470D053989j90272P86687l94039l2978J57223o8600o6768J94785K00611n9279
14460D581359R1479Q6643M1980J33461k71734K28442K61914l04825j62766K47649
14450D933602J34834k2533j14645O64048l19714K32063k56256O55652j08606O4858
14440E863303j29627j97599J44101K58265J26363J88288O4424n4075M43093k30632
14430F475904J12174K02531R5198k22049L3084O96943j78061q5978J07819K37691
14420G475256R0461L457j89378Q32285o5946l9718o8942K78780M12767k23716
14410H505306J42571J18467N94691p7506N4562K359L29380J1382M58319j49603
14400I989928K71162k3313K25577J26334L25718p9941M28155l924L93829L31446
$$ y = [4053989, 3863717, 4650404, 4256365, 4223387, 4380610, 4312010, 4245242, 4440027, 4640638, 4581359, 4672838, 4759481, 4801461, 4934922, 4663188, 4891630, 5153544, 4848719, 4685953, 4933602, 5068436, 5045903, 4931258, 5595306, 5275592, 5507655, 5251399, 5907051, 5798445, 5863303, 5733676, 5536077, 5680178, 5938443, 6064806, 6253094, 6317518, 6263443, 6706536, 6475904, 6588078, 6790609, 6885807, 6663758, 6696842, 7393785, 7215724, 7129746, 7237565, 7475256, 7565717, 7569174, 7379796, 8212081, 8146135, 8106417, 8037475, 8316255, 8729022, 8505306, 8647877, 8766344, 9361035, 9283529, 9338091, 9340450, 9669830, 9681212, 10139531, 9989928, 10261090, 10237777, 10463354, 10589688, 10915406, 10835465, 11263620, 11259696, 11653525, 11984971]
14390A1984971K64478k43473K96701o2962O72498J02007p2496M84730r1741L49444
14380A3684157P76463J56862m0022N94605J19404L21648K94179J96070j57117
14371A5946249P44487M37298N86808k92184P97328K95391K66609N36723J61144
14362A9479853K61662R19871L91378L92049N93320M45900L79657K96482P03946
14353B3864118P84317N34205P88749N96110K06075R05176P18506N19369J100327
14344C0016952P17284J041568N76823J041162Q96488R91527O69057J184613P11935
14335C7847409J483809J029709J339173J530088J226198J310139J422264J542563
14327D8731352J631406J386864J976799J902026J680584J858547K126422K263307
$$ y = [11984971, 12249449, 12005976, 12302677, 12239715, 12912213, 13014220, 12941724, 13426454, 13334713, 13684157, 14460620, 14617482, 14577460, 15172065, 15291469, 15613117, 15907296, 16103366, 15946249, 16690736, 17128034, 17714842, 17422658, 18219986, 18515377, 18781986, 19318709, 19479853, 19741515, 20661386, 21052764, 21444813, 22038133, 22484033, 22863690, 23160172, 23864118, 24648435, 25182640, 25971389, 26567499, 26773574, 27678750, 28397256, 28916625, 30016952, 30734236, 31775804, 32352627, 33393789, 34290277, 35281804, 35950861, 37135474, 37847409, 39331218, 40360927, 41700100, 43230188, 44456386, 45766525, 47188789, 48731352, 50362758, 51749622, 53726421, 55628447, 57309031, 59167578, 61294000, 63557307]
14319F3557307K423771J909503K991932L014173K311020L016754L213913L302966
14311H5741339L563553L729622M227358M205374M342441M766132N042526N204318
14303A20822663N436254O149566O423761O454447P429310P954086P857978Q637356
14295A77165421R086963R645514R915573J0913001J1374899J1997849J2482354
14288B52581574J2686169J3603502J4235940J4377594J4548311J4794688J4919387
14281C51747165J4518457J4209392J3923756J2852994J1968809J0509471R074318
14274D38804362O070328J125304j308710j589283k815957L94471o097416n218840
14266D29364259p277887q040353r309765j1782605j3221824j3642300j5004913
$$ y = [63557307, 65981078, 67890581, 70882513, 73896686, 76207706, 79224460, 82438373, 85741339, 89304892, 93034514, 97261872, 101467246, 105809687, 110575819, 115618345, 120822663, 126258917, 132408483, 138832244, 145286691, 152716001, 160670087, 168528065, 177165421, 186252384, 195897898, 205813471, 216726472, 228101371, 240099220, 252581574, 265267743, 278871245, 293107185, 307484779, 322033090, 336827778, 351747165, 366265622, 380475014, 394398770, 407251764, 419220573, 429730044, 438804362, 444874690, 445999994, 444691284, 443102001, 440286044, 440680515, 434583099, 429364259, 422086372, 414046019, 404736254, 392953649, 379731825, 366089525, 351084612]
14259C51084612j5164814j5709873j4946466j4977492j4399265j3781216j2276829
14252B49828657j2023815j2319908j1330845j0578253j0507529r406441q863838
14245A74798028q205771q099096p181017p541407o571313o420428n928035n005339
14237A19845622n522644m876509m510387m355311m310742m095314l245577l601434
14229H5327704l618048k832778l089312l038434k358148l003650k064008k332653
14221F2990673k071079k030520j743928k062777j979209j788499j885905j229263
14213D8199493j034235j799094j638043p82209j200724j337075q24890j077717
14205C8505506j149240j190410j074671p02471p11351j145338q13898r50321n76702
$$ y = [351084612, 335919798, 320209925, 305263459, 290285967, 275886702, 262105486, 249828657, 237804842, 225484934, 214154089, 203575836, 193068307, 183661866, 174798028, 166592257, 158493161, 151312144, 143770737, 137199424, 130778996, 124850961, 119845622, 114322978, 109446469, 104936082, 100580771, 96270029, 92174715, 88929138, 85327704, 81709656, 78876878, 75787566, 72749132, 70390984, 67387334, 65323326, 62990673, 60919594, 58889074, 57145146, 55082369, 53103160, 51314661, 49428756, 48199493, 47165258, 45366164, 43728121, 42945912, 41745188, 40408113, 39583223, 38505506, 37356266, 36165856, 35091185, 34388714, 33677363, 32532025, 31718127, 30767806, 30191104]
14196C0191104r94556o25376p38378n83548o82921n58501o69219n51628q27632
14187B3959345n10939o52059k56490n64099n68506k15805l90625o93044j06698
14178B0001080n66804p6998p50400n0002q52122l04433P7434q33935k44459p8600
14168A6320761l21042o75712j14475l35362l32869l5294m71551k18597j10848
14159A3705011k25778l89280J30097n10477j54403l71045J75656m06716m31375
14150A1521690N3258m65320j88620K82777m09544m883m10029l60238k28672R0053
14140I880472M8913l27064J04029k08083p359k84370k01709J76631m89130l76549
14130H315781N97735p84558q718k33969O06460m87050O2196k88831n9287k00532
$$ y = [30191104, 29196548, 28571172, 27832794, 27249246, 26566325, 26007824, 25338605, 24786977, 23959345, 23448406, 22796347, 22539857, 21975758, 21407252, 21191447, 20800822, 20107778, 20001080, 19434276, 19357278, 18606878, 18556876, 17704754, 17400321, 17477755, 16643820, 16399361, 16320761, 15999719, 15324007, 15209532, 14874170, 14541301, 14506007, 14034456, 13815859, 13705011, 13479233, 13089953, 13220050, 12709573, 12555170, 12184125, 12359781, 11953065, 11521690, 11574948, 11109628, 10921008, 11203785, 10794241, 10789358, 10379329, 10019091, 9790419, 9880472, 9929385, 9602321, 9706350, 9498267, 9490908, 9206538, 9004829, 9181460, 8692330, 8315781, 8913516, 8128958, 8120240, 7886271, 8492731, 8005681, 8067877, 7779046, 7719759, 7519227]
14120G519227J13056k76487k9812k58093J92562n8025n36238P0608p8972L6989
14110F694815k99868j62600L10138j23113M2627j18977k95915j63280j58559n268
14100E720000M8829j34997j8616q5968J13058l16346Q6159L60274m84321j21195
14090E166877Q2321m44753M45224n32996J24980Q2929j42618o0682K76559l17600
14080D680241R8517J38935n80139M4361k6850J06492k5988j76446J1368j70999
14070D099492O6348L09943j13015l32718r6819K57399k98195j41787K25362l82401
14060C593609J42068p6373M7914j38379J68427l0358q2496J68635l20074r4746
14050C378227M73289l30268k13911j89208K34076j59935J78659j0343m35313M78700
$$ y = [7519227, 7632283, 7355796, 7325984, 7067891, 7260453, 7202428, 6666190, 6736798, 6657826, 6694815, 6394947, 6232347, 6542485, 6419372, 6461999, 6343022, 6047107, 5883827, 5725268, 5720000, 5768829, 5633832, 5615216, 5529248, 5642306, 5325960, 5412119, 5772393, 5288072, 5166877, 5249198, 4804445, 5249669, 4716673, 4841653, 4924582, 4781964, 4721282, 4997841, 4680241, 4778758, 4917693, 4337554, 4381915, 4355065, 4461557, 4435569, 4259123, 4270491, 4099492, 4165840, 4475783, 4362768, 4030050, 3933231, 4190630, 3892435, 3750648, 3976010, 3593609, 3735677, 3659304, 3707218, 3568839, 3737266, 3706908, 3624412, 3793047, 3472973, 3378227, 3851516, 3521248, 3307337, 3118129, 3352205, 3192270, 3370929, 3360586, 2925273, 3403973]
14040C403973j48037P9480l76000O9953K15133n22877J90062K93460p3094P300
14030C139353J40089n05357N06159n22612K80239j25582j75764l8969J74213J47145
14020C018914q7971k13956j28680J04431l08492J13679k14049K0039K06953j68307
14010B342561J35514n86319L29139K64800k25825J32173m97405j00041J03355
14001A897952K12980L05025m39392L51693o69679L40141k20304J49016j74994
13992A752438K74512K82178K28794J325930L206499O977583J3474446J2027440
13984C9549820j2640289j2099355n656976k530788j173624j179731n40010m07464
13976C321583l98425p6436K19194p85557J82833j08099r0701L35318k66214J64513
$$ y = [3403973, 3255936, 3335416, 2959416, 3029369, 3244502, 2721625, 2911687, 3205147, 3132053, 3139353, 3279442, 2774085, 3280244, 2757632, 3037871, 2912289, 2736525, 2697556, 2871769, 3018914, 2930943, 2716987, 2588307, 2692738, 2384246, 2497925, 2283876, 2303915, 2510868, 2342561, 2478075, 1891756, 2220895, 2485695, 2259870, 2392043, 1894638, 1794597, 1897952, 2110932, 2415957, 1976565, 2328258, 1658579, 1998720, 1778416, 1927432, 1752438, 2026950, 2309128, 2537922, 3863852, 7070351, 14047934, 27522380, 39549820, 26909531, 14810176, 9153200, 6622412, 5448788, 4269057, 3729047, 3321583, 2923158, 2846722, 3065916, 2280359, 2463192, 2355093, 2264392, 2599710, 2333496, 2498009]
13966B498009l16479K98536n95055J98400L5970k28561N2268J11709k12101m0518
13956A802178J60858L5456j4752j9260l85457L60644l43401M19836Q2768l73580
13946A725290J39726J15652m37923L52724l15315K02967l11673K72545r5803J87186
13936A835376j72395q3378M7314J42948k61529j68081K43811j21223K39692k04557
13926A497978j62002K32598m5262J97102J4950k18507M4965K5705N5042m18557
13916A224012K40547J24079k05670M3073R333J85225k74972L18352l46578J02629
13906A420030l19340O61926m64386J43222K73679o12946J81346j1318N0407k19547
13896A103073K36912n0054j61742J02394K69438j00303n5654q2099l31708O54783
$$ y = [2498009, 2181530, 2480066, 1885011, 2083411, 2119381, 1890820, 1943088, 2054797, 1842696, 1802178, 1963036, 1998492, 1983740, 1964480, 1579023, 1939667, 1596266, 2016102, 2098870, 1725290, 1865016, 1980668, 1542745, 1895469, 1580154, 1783121, 1471448, 1743993, 1648190, 1835376, 1662981, 1579603, 1626917, 1769865, 1508336, 1340255, 1584066, 1462843, 1702535, 1497978, 1335976, 1568574, 1523312, 1720414, 1735364, 1516857, 1561822, 1587527, 1642569, 1224012, 1464559, 1588638, 1382968, 1426041, 1435374, 1620599, 1345627, 1663979, 1317401, 1420030, 1100690, 1762616, 1298230, 1441452, 1715131, 1102185, 1283531, 1272213, 1322620, 1103073, 1339985, 1289931, 1128189, 1230583, 1500021, 1399718, 1344064, 1261965, 930257, 1585040]
13886A585040n54981O327L24830j31789l3027j24795L47550l38474K37992k12355
13876A106318O4008P6812k81178L64317m36111K1329J29000J5632o7975J03525
13866A095677k0276o6537j93574J33313j47784K14189j59144L29623p2661k35622
13856H77204K83288l0837m69729L80877n3738L6789M59869m80464K13836k68580
13846I48515j79703L39809p8474j13558J11107O3933K16589l10175M3655l88383
13836F53315L51521L4027l76628N04939l90786l20031M35529k75977M11755p2167
13826I55497O9782L7309P6031l59097J49669J56209m02171K08462K80398l91362
13816G80727P3170k46974L80572K7602l86471Q6752K50769l6903l99229L52570
$$ y = [1585040, 1030059, 1036386, 1361216, 1229427, 1196400, 1071605, 1419155, 1080681, 1318673, 1106318, 1170326, 1247138, 965960, 1330277, 894166, 915495, 1044495, 1060127, 992152, 1095677, 1075401, 1008864, 815290, 948603, 800819, 1015008, 855864, 1185487, 1112826, 877204, 1160492, 1129655, 659926, 1040803, 987065, 1023854, 1483723, 1003259, 1217095, 948515, 768812, 1108621, 1030147, 916589, 1027696, 1091629, 1308218, 998043, 1041698, 653315, 1004836, 1038863, 662235, 1167174, 776388, 456357, 891886, 615909, 1027664, 955497, 1025279, 1062588, 1138619, 779522, 929191, 1085400, 683229, 891691, 1172089, 780727, 853897, 606923, 987495, 1015097, 628626, 715378, 966147, 929244, 530015, 882585]
13806H82585L0075j04042J00844k78989j01282M6797j69178M79016k9995n8854
13796G96977j61751K17649L4797m3709k21524K13254j15319L29946k97593L96029
13786A148756l14055K19002m96308J0590L22633k79019j39294J43555K83636j67112
13776G32384L1668j3519k96687K14520Q460J11714j39349J05620J79276l35374
13766E98713J55938J1862J0722j86934J7412j07367R9880L58727p9304j35393
13756G44256j42763Q3986j77427J47304k04263R6290Q2359k54658M79083q0192
13746G73975j52411K5539k54527K69746l7238K5557j13741j15137P7818j4650
13736D84931M87156m06461m5741K16005l20221M78767l24559K79986j64204l35275
$$ y = [882585, 912660, 808618, 909462, 630473, 529191, 575988, 406810, 885826, 855831, 796977, 635226, 852875, 887672, 843963, 622439, 835693, 720374, 1050320, 752727, 1148756, 834701, 1053703, 557395, 567985, 890618, 611599, 472305, 615860, 899496, 732384, 764052, 750533, 453846, 668366, 676826, 788540, 649191, 754811, 934087, 598713, 754651, 766513, 777235, 590301, 607713, 500346, 600226, 958953, 879649, 744256, 601493, 685479, 508052, 655356, 451093, 547383, 629742, 375084, 854167, 773975, 621564, 647103, 392576, 662322, 625084, 650641, 536900, 421763, 499581, 484931, 972087, 565626, 519885, 735890, 415669, 894436, 569877, 849863, 685659, 350384]
13726C50384J77944J31488j1035p0115K6163O7212k71145L03267j61149k315j81757
13715C58942K84823k6835K24737B73351L97540j64172J36971r0002K4065k29588
13705C48165K18932L6603J97219J46968l95172m0909K63816p01j82090N9140j3931
13694F38040n0485j38542j62709L48487p0860A60390K72645F1905O24512B84499
13683C83414A71723M5380j2610o260K96716n3215j04635K49530P382j58005p3908
13672C62098K98238l17503N08847A48064J94340K83162k51190p0658K08248k26293
13662B85673N2578j22467K15422j25080K88584k36603j12942M39737r4888B92813
13651C72088m4813Q2188o8119J14883k18780K48919H4449K01922J9004K32322
$$ y = [350384, 528328, 659816, 648781, 578666, 604829, 672041, 400896, 704163, 543014, 540699, 358942, 643765, 616930, 841667, 273351, 670891, 506719, 643690, 553688, 577753, 348165, 567097, 603700, 800919, 947887, 552715, 511806, 775622, 774921, 592831, 651971, 638040, 587555, 449013, 286304, 634791, 563931, 160390, 433035, 61905, 686417, 284499, 383414, 171723, 217103, 204493, 198233, 494949, 441734, 337099, 586629, 594011, 436006, 362098, 660336, 342833, 851680, 148064, 342404, 625566, 374376, 303718, 511966, 285673, 338251, 215784, 431206, 306126, 594710, 358107, 245165, 684902, 590014, 292813, 372088, 327275, 409463, 341344, 456227, 237447, 486366, 84449, 286371, 305375, 537697]
13641E37697o4598o7298N8325J53315k1401j81138O5999I4071J29606L5018J54084
13630D12779J2641K30597I5293K48709J32758J56571B74657J31518P2309k32707
13620B45777K60097j74422L0741Q7252B10473P5946j264r5364O2431Q9127M13225
13609G54574A91776J49460L02752A50973J65398j08055L52521j82042l9441J30846
13599D70200J30248B03600K30202L6505n9085F9946M81215k29212N3199p1704
13589C03444N3992O7288j94582J37967J67155Q6528A25201K75134j29270J53219
13579D24284I5610N34590B00088J46217j69400L76485B61062n0693M49098B27792
13568B94064K09483q2200p7705J05183l0773j96972L95776j00116A41323O0586
$$ y = [537697, 473099, 405801, 464126, 617441, 596040, 414902, 480901, 94071, 223677, 258695, 412779, 425420, 656017, 95293, 344002, 476760, 633331, 274657, 406175, 478484, 245777, 505874, 331452, 362193, 449445, 210473, 286419, 285155, 189791, 252222, 341349, 754574, 191776, 341236, 643988, 150973, 316371, 208316, 560837, 378795, 339354, 470200, 600448, 203600, 433802, 470307, 411222, 69946, 551161, 321949, 375148, 303444, 357436, 424724, 230142, 368109, 535264, 621792, 125201, 400335, 271065, 424284, 95610, 630200, 200088, 346305, 176905, 553390, 261062, 210369, 659467, 227792, 294064, 503547, 421347, 343642, 448825, 418052, 221080, 616856, 516740, 141323, 201909]
13558B01909J03321O8095M8615K4601k0018M4262J2523B05110J31876N735m9581
13547B93140L57556A88288K61556m4582Q2608k42369K95727B9303J53817M4156
13537B27276o1603l616M6260K07543A71057K29027n4319l0666A07376K1360K28763
13526C57499o9549A31894R5444L81297k62886J03447k01091j04418J12290A2157
13515B80994K34518k35804A38978M35816k41217A36505K12834I0058K41560j64073
13505A67545Q920J2052K4603J77338a733A39336K98314P7869b02465D56889A98599
13493F30785A65985M3534q4645i3099A31076N4378L23071A91734q1162K64919
13483C75491M5413k1151J50105A75593K16994A67665K97220B25190J12606J00613
$$ y = [201909, 305230, 373325, 421940, 446541, 426523, 470785, 483308, 205110, 336986, 342721, 293140, 650696, 188288, 449844, 405262, 487870, 245501, 541228, 29303, 183120, 227276, 165673, 162057, 208317, 415860, 171057, 400084, 345765, 315099, 107376, 128736, 357499, 287950, 131894, 227338, 608635, 345749, 449196, 248105, 143687, 255977, 12157, 280994, 515512, 279708, 138978, 574794, 333577, 136505, 349339, 90058, 331618, 167545, 176465, 188517, 213120, 390458, -1733, 139336, 437650, 515519, -202465, 456889, 198599, 630785, 165985, 209519, 124874, -93099, 131076, 185454, 508525, 191734, 110572, 375491, 420904, 399753, 549858, 175593, 392587, 167665, 464885, 225190, 337796, 438409]
13473D38409m8378A89283l8273K23582A59413P484J02917k9216J6491L0015c4993
13461C48567D8759J56855J83803O4949j32125A37490J44170A38409l5822J59493
13451B62080h9124C19702F5472L15329b5201p572D86294l1277j38791n0787A13076
13439A63944J28777j12220L61578B813K12202P8300a65573A82713J88529j80059
13429A91183J56292a08804N1525A58591o0228d7444B48442g6823D21909B00612
13418c3577A19207h8604B04722M7216e3877C16039I5982R913O205P5257K7755
13407B15112l527G0340N0297J76294A30150J64974L1118A04483e824D883K12441
13396B17324n6230n6229J74551R2962K37528B15604R9014j31559E5091P4488J48923
$$ y = [438409, 390031, 189283, 151010, 374592, 159413, 166897, 269814, 240598, 257089, 287104, -34993, 348567, 48759, 205614, 389417, 454366, 322241, 137490, 281660, 138409, 102587, 262080, -89124, 319702, 65472, 380801, -25201, -32773, 486294, 455017, 316226, 265439, 113076, 163944, 292721, 180501, 542079, 2813, 215015, 293315, -165573, 182713, 371242, 191183, 347475, -108804, -57279, 158591, 98363, -47444, 248442, -76823, 421909, 200612, -33577, 119207, -88604, 204722, 251938, -53877, 316039, 95982, 105895, 112100, 187357, 215112, 211585, 70340, 120637, 296931, 130150, 295124, 326242, 104483, -5824, 4883, 217324, 161094, 104865, 279416, 372378, 609906, 215604, 314618, 183059, 55091, 129579, 278502]
13385B78502c0740A20243O9205G7201O0704C3048a2340B75639d2355B22260M6921
13374B69181B8560K14738K60615I2618J76697K61864j69407l6844q8506F3060
13363a31305D17592K6850l8247p6160n543p7638J09404r3688B2586d2603F4841
13351A56270K82137c1495A04438L33680A49430N8044o645Q754J26473r5130a3387
13339C65283A05911N08795B58202j5062C3317J81541H4590K11813O0040j35403
13329B21040F5385i679B33524L4519J84802j90712J79729k00136J67043q7127
13319C21642o2800D4205K68896M2339A13791A1892R490Q24657C06096J01266A18130
13307E65084B07722g3514D6959L2943M4566k0280c0442k7726B38778a4441D40188
$$ y = [278502, -30740, 120243, 189448, 77201, 137905, 33048, -12340, 275639, -42355, 222260, 269181, 28560, 243298, 503913, 92618, 269315, 531179, 361772, 324928, 236422, 63060, -131305, 417592, 444442, 406195, 330035, 324492, 246854, 356258, 262570, 22586, -42603, 64841, 156270, 438407, -31495, 104438, 438118, 149430, 207474, 200829, 209583, 336056, 240926, -13387, 365283, 105911, 614706, 258202, 243140, 33317, 214858, 84590, 296403, 356443, 221040, 65385, -9679, 233524, 268043, 452845, 262133, 441862, 241726, 408769, 321642, 258842, 44205, 313101, 355440, 113791, 11892, 21382, 846039, 306096, 407362, 118130, 565084, 207722, -73514, 46959, 79902, 124468, 104188, -30442, -58168, 238778, -14441, 440188]
13295A97226q5953D2279a028k7615E10765a79638D84394C4244K36439l9378C9510
13283G5259L26068A62J85290K7513Q6762G6473J62504a89547D04255r5094I8932
13271D10201a61005A66275j9692D67K85508a34846G9988g2857C65330k2708A10185
13259A21246n4530c01923A47930F9283e3082A83075R3508a65195O0332A12555
13248I9235M5875b68274F5962R696g0884j56280L3078P5549A54409K671K55442
13237D12522H7265b02868H9145P0623h497p206B23753d531D59967I0358R9248
13226A89606F3518K96569h227A51122a31989A31723L53042j32718A6286e883A23520
13214i0407C16162a26171d8170A60509k9763a08444C81117d6164n565C70958a08511
$$ y = [197226, 111273, 42279, -1028, -28643, 510765, -179638, 484394, 34244, 270683, 231305, 39510, 75259, 401327, 162, 185452, 212965, 299727, 76473, 238977, -189547, 404255, 309161, 98932, 410201, -161005, 166275, 146583, 467, 285975, -134846, 79988, -72857, 365330, 342622, 110185, 121246, 66716, -301923, 147930, 69283, -53082, 183075, 276583, -165195, -104863, 112555, 99235, 145110, -268274, 65962, 75658, -70884, -227164, -194086, -118537, 154409, 157080, 412522, 87265, -202868, 89145, 159768, -8497, -15703, 223753, -4531, 459967, 90358, 189606, 63518, 360087, -8227, 151122, -131989, 131723, 484765, 352047, 16286, -5883, 123520, -90407, 316162, -126171, -48170, 160509, 130746, -108444, 381117, -46164, -51729, 370958, -108511]
13202b6969j615A61549P8323F9956b89743a32500A78358R2245I4950i1129N764
13191h5365C47011j48902i6571D57531a15310A11546B1336L8974Q050N6969N7854
13180A83183e2918D20048B6658K20879a42694B62262j24658K41744f2788A54685
13169a11638G5190A3153f592n0704O40E5718f8848A69875F8328k7395b2964B72762
13156A05097M954a08383K8030B57437a26546A94399o4513a3473B85788I4049J52880
13145B46929c4085k65063H7063j9299P6972d594n5300C7225K19620A23837K97296
13134D21133j63788o1056D0705f4374B20661E6236d988G6946a49891C9415j2392
13123B7023a41604B5738a98924b1304B63999F7675a3267A31033c9713C6486J44206
$$ y = [-26969, -28584, 161549, 239872, 69956, -289743, -132500, 178358, 270603, 94950, -91129, -85365, 347011, 198109, -96571, 457531, -115310, 111546, 21336, 60310, 68360, 125329, 183183, -52918, 420048, 26658, 247537, -142694, 262262, 137604, 379348, -62788, 154685, -111638, 75190, 13153, -6592, -57296, -56656, 55718, -68848, 169875, 68328, 40933, -22964, 272762, 105097, 110051, -108383, -80353, 257437, -126546, 194399, 129886, -13473, 285788, 94049, 246929, -34085, -299148, 87063, 67764, 144736, -4594, -59894, 37225, 256845, 123837, 421133, 257345, 196289, 40705, -64374, 220661, 56236, -4988, 76946, -149891, 39415, 27023, -141604, 25738, -198924, -21304, 263999, 67675, -13267, 131033, -39713, 36486, 180692]
13112A80692E6718P8934l0946B9159L76547A6390P1139a05018I9337O7721F6002
13100G5496a63902E9073i5470k8122B75390o3104A00537J35633f4136j16706O1785
13089a19057B63516j15329d16939a98751C0418c03500i1383D0307J10455F7865
13078c5413l3270A47536F0877J17607b11579M3739d1565B92444A32083P4602K1856
13067B28541b77034A03726j295d9360C1859L1110J49802J02369r2873I3943O9571
13056A63514K9552b316I127a04864B44927I3094C1468c3408D67407b01385b5001
13044f5847B06487F8037l376K5070a52534D6900a04030C85228F5521J07218N3117
13033B25856K3984H0902b16713A40768J44624g5783D32986f0196k2080A59231
$$ y = [180692, 56718, 135652, 104706, 29159, 405706, 16390, 87529, -105018, 99337, 167058, 66002, 75496, -163902, 59073, -95470, -123592, 275390, 212286, 100537, 236170, -64136, -180842, -119057, 263516, 148187, -416939, -198751, 30418, -303500, -91383, 40307, 150762, 67865, -35413, -68683, 147536, 60877, 178484, -211579, -167840, -41565, 292444, 132083, 206685, 228541, -277034, 103726, 102431, -49360, 31859, 62969, 212771, 315140, 222267, 93943, 163514, 193066, -2316, 9127, -104864, 244927, 93094, 31468, -33408, 467407, -201385, -25001, -65847, 206487, 68037, 64661, 89731, -152534, 46900, -104030, 385228, 65521, 172739, 225856, 249840, 80902, -216713, 140768, 285392, -75783, 432986, -60196, -82276, 159231]
13022I8182J61075C0164L2247e1389E7999d5023B19938A2536J22652D9761a47850
13010A20100P1359p0098C4654J11882Q5139n1867a74524A21050a0055C30088A19875
12998c07112f867A39902J12753E0176J02128b17398E0847Q6218a96905B79302
12987H84Q2018K00025A34310K9377N0809a04295C6067Q0901A2277J50192L26011
12976D88480A6627L38921b3917A15621m7546a20552A45308g1452A44303o5007
12966G9296P7545n0325m2906i972H1694K32412F9754d59997h4883j77504a23805
12954b06728B12144C1923L181N3100O5568J05703n8088b96220B65583a08838K7696
12943h1142j18845A07268M6830D1204b55686A48196B5053K57060F2753f6989A87170
$$ y = [98182, 259257, 30164, 62411, -51389, 57999, -45023, 219938, 12536, 135188, 49761, -147850, 120100, 191459, 121361, 34654, 146536, 231675, 179808, -174524, 121050, -10055, 330088, 119875, -307112, -6867, 139902, 252655, 50176, 152304, -217398, 50847, 137065, -196905, 279302, 884, 82902, 282927, 134310, 163687, 214496, -104295, 36067, 116968, 12277, 162469, 488480, 16627, 355548, -23917, 115621, 68075, -120552, 145308, -71452, 144303, 79296, 156841, 106516, 63610, -9972, 81694, 314106, 69754, -459997, -84883, -262387, -123805, -206728, 212144, 31923, 35104, 88204, 153772, 259475, 201387, -296220, 265583, -108838, -81142, -199987, 107268, 154098, 41204, -255686, 148196, 25053, 282113, 62753, -66989, 187170]
12931A6009J07000d2112j2153A33230o2681i4367G1384e2152o6816a5354l4109
12920d9463I0877l7224b51033H2457O1493K66125i2364B26080a81065L1524d9655
12908b18340e1792A07212j3370e5558F4993O8447e645j65787A0504a49435B4375
12896A00396E672J26231C2039i4458C04683q8622K39091A17768J45328b8260r3379
12885a21639H7982K06764r1390a76861c8359m7966j90027A042a91633F1049a90437
12873A39392b64932A9675Q4859L29681a87098C67830A07124J45949D2805J775
12863D4580a46838o3962A88221C8514H38a24637A93099n0789a41898A54775m9486
12852A05289J87260a93996G8326j2686l0111a88113A8779a19547F5352a9331g904
$$ y = [16009, 123009, -42112, -54265, 133230, 70549, -94367, 71384, -52152, -118968, -15354, -49463, 90877, 53653, -251033, 82457, 143950, 410075, -92364, 226080, -181065, -149541, -49655, -218340, -51792, 107212, 93842, -55558, 64993, 133440, -5645, -171432, 10504, -149435, 24375, 100396, 5672, 131903, 32039, -94458, 304683, 216061, 455152, 117768, 263096, -28260, -121639, 87982, 294746, 203356, -176861, -38359, -86325, -276352, 1042, -191633, 61049, -190437, 139392, -264932, 19675, 104534, 434215, -187098, 367830, 107124, 253073, 42805, 44580, -146838, -210800, 188221, 38514, 838, -124637, 193099, 142310, -141898, 154775, 105289, 292549, -193996, 78326, 65640, 35529, -188113, 18779, -119547, 65352, -19331, -7904]
12840B2942J26456A3706a40162A19086J41204a11402B87079h8506j40442M4325
12830a84623M179O6972b2242J0775I5101c48412b6671H0609K5198N0340n6614
12819I9533B2635a90500e8378k10188J33472j78815C15473A07158R71N3721E2016
12807C4886K42322f9390A19957h9286p6220d4951j29436p1492a18837B7731N6931
12796H4662J52409A8376a5113e530J73j90668E33015D3663L8181K1226a45732
12784h3456C1034O9990k692i0684k13750a07047J3317b600p0338D08401H4597
12772F6021k7076O7737J94806d2685j07965A25373e635j67683A05096e37253a91961
12760A69074c9535B26118f7341A95041A5982J6390g6833G5014j2039J09119D073
$$ y = [22942, 149398, 13706, -140162, 119086, 260290, -111402, 287079, -88506, -228948, -184623, -180444, -113472, -22242, -11467, 95101, -348412, -26671, 80609, 105807, 156147, 99533, 22635, -190500, -58378, -268566, -135094, -313909, 315473, 107158, 108129, 161850, 52016, 34886, 277208, -69390, 119957, -89286, -165506, -44951, -174387, -245879, -118837, 27731, 84662, 237071, 18376, -15113, -5530, -5357, -196025, 533015, 43663, 81844, 103070, -145732, -83456, 31034, 101024, 98332, -90684, -304434, -107047, -93730, -2600, -72938, 408401, 84597, 66021, 38945, 106682, 301488, -42685, -150650, 125373, -5635, -173318, 105096, -537253, -191961, 169074, -39535, 226118, -67341, 195041, 15982, 32372, -76833, 75014, 62975, 172094, 4073]
12748a31657A27726a36987A73133e4153j3949A08042O5426a09853A56598G0866
12737A62947a4477B17918A01555E0212L06217I4024J58025H9300J29733a5048
12726B57458h5201j221A54539G4805b19894C02264h7864K8694k1853c4918j09841
12715a44759K2654d7617E5922L4347J35923q341K1856K11696A33648K7291K70660
12704D31599n676B1330e612I1713N994m4612J16686c0741a5137j75878A09741
12692C55720A57763n7666a59880j17439I8231e102k60172H3227i6681l007b7096
12680B6660N0924L19947F3681M1183N3189L123G8267a38623B51334j15346P1286
12669B07274K0622h5781p5947A23355J4631P742M5079k7439J58295A1190f9405
$$ y = [-131657, 127726, -136987, 173133, -54153, -68102, 108042, 173468, -109853, 156598, 70866, 162947, -14477, 217918, 101555, 50212, 356429, 94024, 252049, 89300, 219033, -15048, 257458, -85201, -86422, 154539, 74805, -219894, 302264, -87864, -59170, -81023, -34918, -144759, -122105, -47617, 55922, 90269, 226192, 217851, 239707, 451403, 133648, 160939, 431599, 425923, 21330, -5612, 91713, 97707, 53095, 169781, -30741, -15137, -191015, 109741, 355720, 157763, 100097, -159880, -277319, 98231, -5102, -265274, 83227, -96681, -99688, -27096, 26660, 77584, 397531, 63681, 104864, 158053, 161176, 78267, -138623, 251334, 135988, 207274, 227896, -85781, -161728, 123355, 137986, 145728, 190807, 163368, 321663, 11190, -69405]
12657D793Q4944a05487R737c4498A54707M66136i7615A05806a69492H5225Q7861
12646A73086C0240P206Q7991L10259a40831A7989c3379l42526B14886a83978a4030
12634A54608c6359B84248A39878c30020B5840L14257j15046J7946N5727q360o4409
12623B25955j08356J4397M53268A77006l8727A410J38149D2318J10290c83179
12612i8171a0484B3792h993j41982G547P0829g6437B22885b82663d5324B63109
12600G2094K38434A50635f6917e664A39799j7564A1688J80567a78842h949j08264
12589a17213m876D926a8245B21220l8630o8188M650b02641j3358c5462B6808J53117
12577A79925a0817o0538A24418J03071F6787J6151A852L90384a91070D4988K42782
$$ y = [4793, 89737, -105487, -95750, -34498, 154707, 620843, -97615, 105806, -169492, 85225, 173086, 30240, 37446, 125437, 435696, -140831, 17989, -33379, -375905, 214886, -183978, -14030, 154608, -36359, 284248, 139878, -330020, 25840, 340097, 225051, 242997, 298724, 290364, 225955, 117599, 131996, 585264, 177006, 138279, 1410, 139559, 42318, 152608, -383179, -98171, -10484, 23792, -8993, -150975, 7547, 78376, -76437, 222885, -282663, -45324, 263109, 72094, 310528, 150635, -66917, -5664, 139799, 122235, 11688, 192255, -178842, -8949, -117213, -122089, 4926, -18245, 221220, 182590, 114402, 119052, -202641, -215999, -35462, 26808, 179925, -10817, -71355, 124418, 227489, 66787, 82938, 1852, 392236, -191070, 44988, 287770]
12566B87770B5478b3324C5194g2464j0659C33108b44439f5965r6472B12071b2361
12554E7822a79352C16271A35928M8680a38278L8153M2878A71605I236J2675a04484
12542E63355A28421R7031e9918J4670B23697a52593A14625b6835B00483a16480
12531B89332j18371D4300r56L40535A25045j6465m6570j1975I770M1886a33801
12519a18163G3355g1080B10001K3854b6431F7184Q1752e7776M037G4173h3583
12507e0893B8093J79626r7950b21388r623B43947a29724d4329B44255G3411A4399
12495B12267E7772L06684g0636j00351K1947g2449k91813C75449A05848g2475
12484c52827G8236F391d08952A0086d5901b0690A60002b06430H5616a18248m2260
$$ y = [287770, 25478, -23324, 35194, -72464, -83123, 333108, -244439, -65965, -162437, 212071, -22361, 57822, -179352, 316271, 135928, 184608, -138278, -100125, -57247, 171605, 9236, 21911, -104484, 563355, 128421, 225452, -59918, -45248, 223697, -152593, 114625, -26835, 200483, -116480, 289332, 170961, 44300, 43344, 383879, 125045, 108580, 62010, 50035, 9770, 51656, -133801, -118163, 73355, -71080, 210001, 233855, -26431, 67184, 148936, -57776, -53739, 74173, -83583, -50893, 28093, 207719, 109769, -221388, -231011, 243947, -129724, -44329, 244255, 73411, 14399, 212267, 57772, 364456, -70636, -170987, -149040, -72449, -364262, 375449, 105848, -72475, -352827, 78236, 6391, -408952, 10086, -45901, -20690, 160002, -206430, 85616, -118248, -160508]
12473a60508B66614a49309D17636F5767d3071G5581N08535B07596J68195A70736
12462a57664g3415H0248a10797I5811b8991F0183K7027J8659R7727I0276c1427
12450C26295B5017L6959A7630o783a95801f2528j21669A15253C2104a5604j63049
12439a78653b0936j70957b00n9226r6536C0870h05C5051P9544f1451A44561f9812
12426b19632A32150a15125B17290A2118d2834l9687m1204j1033N5754l671A29528
12414a65565A00165a38217c9075l2023A06606i68n7335C22349e6827j32266A00396
12402B26753b11146o8634c726A47694c02331l660a24283C51043d40497A6911i1753
12390F7508b58784J18446M4603B29976G642J7234c04168a19333I1315g2459A69866
$$ y = [-160508, 266614, -149309, 417636, 65767, -43071, 75581, 584116, 207596, 375791, 170736, -157664, -73415, 80248, -110797, 95811, -28991, 60183, 87210, 105869, 203596, 90276, -31427, 326295, 25017, 61976, 17630, 10847, -195801, -62528, -184197, 115253, 32104, -15604, -178653, -20936, -191893, -200, -59426, -155962, 30870, -805, 35051, 114595, -61451, 144561, -69812, -219632, 132150, -115125, 217290, 12118, -42834, -82521, -123725, -134758, -79004, -82675, 129528, -165565, 100165, -138217, -39075, -71098, 106606, -968, -58303, 322349, -56827, -189093, 100396, 226753, -211146, -279780, -3726, 147694, -302331, -305991, -124283, 351043, -440497, 16911, -91753, 67508, -258784, -140338, -95735, 229976, 7642, 24876, -304168, -119333, 91315, -72459, 169866]
12378a65277F4000E733a10920A69359p4451M5197E5239o103J2298a50575A87041
12366G2301j8122N4373d1274A08931A1985b71829d8143I9324a70553B39085j05156
12355A33929c47968I4940C1831O3442k5801a66100f2052k5704a1912D54546h8489
12343B72634F0944k6700c3820r0474p9995A32375f6077A10140b24281F857R0217
12332I7074a20316A73795R4922A13782f198o8044m1881E2464R04J36269k3941
12321A65696E8216a44371m4515B6161a03601B66353F3897b9794H1400h3269d944
12309B7934a85218Q4552p4103j16732F9802P136b25538A52981m5384l305j8862
12298H5430B1474a71221D0691J8758K32137a61672P7249A24124O0983b3017B31619
$$ y = [-165277, 64000, 5733, -110920, 169359, 94908, 140105, 55239, 49136, 61434, -150575, 187041, 72301, 54179, 108552, -41274, 108931, 11985, -271829, -48143, 99324, -170553, 239085, 133929, -347968, 94940, 31831, 95273, 69472, -166100, -62052, -87756, -11912, 454546, -88489, 272634, 60944, 34244, -33820, -124294, -204289, 132375, -66077, 110140, -224281, 6857, 97074, -120316, 173795, 268717, 113782, -6198, -74242, -116123, 52464, 53368, 189637, 165696, 58216, -144371, -188886, 26161, -103601, 266353, 63897, -29794, 81400, -83269, -4944, 27934, -185218, -100666, -174769, -291501, 69802, 76938, -225538, 152981, 107597, 104292, 85430, 21474, -171221, 40691, 59449, 291586, -161672, -84423, 124124, 185107, -23017, 231619]
12286i7550c7746A31752J06289a75642r3563c7800F3804K73741A04324i2638A23447
12274b64577d3142L915A77827q2715a27336B05645K3301d12938b1554E626K28163
12263B33789J15993J59978H8309a86356A40668N4140k4985C6609f9472F9669O493
12252G6162c98680a52937A46119b50884A58519p0084L39963A85379J48085j59411
12242A74053m9481E7515g8656K1895A39355O6061Q1536N6619b25803A26807Q7283
12231B14090F7085P4049J83315r5596l3858n6808J47244J82758N6563A71170R6084
12220B67254j18894J32908r3910N2824D8297a22677A10006A7941M5342J99555
12210B62838p6139H9641A4356M1654h6329A86419n5679K1777O5661d8573B05116
$$ y = [-97550, -37746, 131752, 238041, -175642, -269205, -37800, 63804, 337545, 104324, -92638, 123447, -264577, -43142, -39227, 177827, 95112, -127336, 205645, 228946, -412938, -21554, 5626, 233789, 349782, 509760, 88309, -186356, 140668, 194808, 169823, 36609, -69472, 69669, 76162, -398680, -152937, 146119, -250884, 158519, 88435, 428398, 185379, 333464, 174053, 124572, 57515, -78656, -56761, 139355, 205416, 286952, 343571, -225803, 126807, 214090, 67085, 141134, 324449, 228853, 194995, 138187, 285431, 468189, 524752, 171170, 267254, 148360, 281268, 187358, 240182, 48297, -122677, 110006, 17941, 63283, 262838, 186699, 89641, 14356, 56010, -86329, 186419, 130740, 152517, 218178, -48573, 205116]
12198A8993J41858G6481R7040a48973I3495K79953n8737J21867n7140o9726L16065
12187F25777e7395D41890D4455i5126D34014A20269K91469a19373A01340O603
12177A07943L41227j62655N2307b67773l3503A49781d3032B00564q9132c3833
12166E4057O5132E4163K17575j20352Q3435e3609A62977a25357C39690C0513Q9612
12155A20125A3229K7544L93466A30920a4635k2367j8596A38134c6668J7347k4077
12144d3398H8759N7072I86J95708d843k18910d5121A66291a08505C3151L56102
12133C89253a67012A32969m5735b17456D4192L9206b4778j58783k0445j74370
12123c78376a8056A45796k4384a30506A73068C5028K0627O5343a99748H3691R0905
$$ y = [18993, 160851, 76481, 173521, -148973, 93495, 373448, 314711, 436578, 379438, 309712, 625777, -57395, 441890, 44455, -95126, 434014, 120269, 411738, -119373, 101340, 107943, 449170, 286515, 338822, -267773, -301276, 149781, -43032, 200564, 111432, -33833, 54057, 119189, 54163, 271738, 151386, 234821, -53609, 162977, -125357, 339690, 30513, 120125, 13229, 40773, 434239, 130920, -14635, -37002, -55598, 138134, -36668, -19321, -43398, 88759, 145831, 986, 196694, -4843, -223753, -45121, 166291, -108505, 33151, 389253, -167012, 132969, 87234, -217456, 44192, 83398, -24778, -183561, -204006, -378376, -18056, 145796, 121412, -130506, 173068, 35028, 55655, 120998, -199748, 83691, 174596]
12112A74596A6193l161K2488e0548N718k24570D0944J4499K98311C4612J50241
12101A84853h2479j21303C69853a9996A20089h9946H7336i0108L4075D1729K20109
12090B61838I9919a79653A90690F8512a05724J3843j1521p7562p354B40246F2060
12078A2073b21078J02310K6420I6140J10752N83324P09189j87486C56645j47013
12068B09632b53013d7048n940B54849A8370L16425b27001c7596j52344A7672K07927
12057B25599f2870I9673a59697M8230D3971O8619b4062k75340e165B05074n9359
12046A45715l678E4371a89485D8121a87322P4715l27466a59310I1345a91293p2583
12035b63876A77806N886c6109A30150n8208a58528j34920H548b53487A06145e356
$$ y = [174596, 16193, 13032, 35520, -50548, -44830, -269400, 40944, 55443, 353754, 34612, 184853, -82479, -203782, 369853, -19996, 120089, -89946, 87336, -90108, -56033, 41729, 261838, 99919, -179653, 190690, 68512, -105724, -91881, -103402, -180964, -188318, 240246, 62060, 12073, -221078, -118768, -92348, 96140, 206892, 790216, 1499405, 1311919, 356645, 209632, -253013, -47048, -52988, 254849, 18370, 334795, -227001, -37596, -189940, 17672, 225599, -62870, 99673, -159697, -111467, 43971, 112590, -24062, -299402, -5165, 205074, 145715, 142037, 54371, -189485, 48121, -187322, -112607, -440073, -159310, 91345, -191293, -263876, 177806, 183692, -36109, 130150, 71942, -158528, -293448, 8548, -253487, 106145, -5356]
12023B76523r1065e7302I6056i3803R659G3019B3640L61006b85705a42287b8389
12011a45690M7038C42797d8766p1025l0524H7940N2564c773k4078A0974f0190
11999F9539a81609o8969J15613A5510i4448j2362A15242J37802D9057i9230A58094
11987f2597j02833F2818b16203J9219R4237g248j97724A8305M5877a70001A85509
11975a39148j0035N3843A1402a59670A60865b0064C6235A4921b60703e0821l1449
11964h2270A39783E452d2013B31444a15880E5082a03615B55774i5A24265f2276
11952b98784K2104A22379e039G6307b99606H041h360B98005A25806L6346c6529
11940E2979c09172B34366q9750E488c9372H3909J35829a5591o2895j38162B58190
$$ y = [276523, 185458, -57302, 96056, -93803, -84144, 73019, 23640, 384646, -285705, -142287, -28389, -145690, -98652, 342797, -48766, -119791, -150315, 87940, 140504, -3773, -27851, 10974, -60190, 69539, -181609, -250578, -134965, 15510, -94448, -106810, 115242, 253044, 49057, -99230, 158094, -62597, -165430, 62818, -216203, -196984, -102747, -7248, -204972, 18305, 64182, -170001, 185509, -139148, -149183, -95340, 11402, -159670, 160865, -20064, 36235, 14921, -260703, -50821, -82270, 139783, 5452, -42013, 231444, -115880, 55082, -103615, 255774, -95, 124265, -62276, -298784, -276680, 122379, -5039, 76307, -299606, 8041, -8360, 298005, 125806, 162152, -36529, 52979, -309172, 234366, 144616, 5488, -39372, 83909, 219738, -15591, -78486, -216648, 258190]
11928d45436A85456b4184F9610c06868A83147m7599J22541q4407g2278A33999
11917b6467j37184B3898h0316B02983m9430a00902a0421k23282h5952d1877B11350
11905A5692f883q9305A15102c52920D0964K20003j27319P1201d5028B5670a47784
11893b00933P8717J0667A11797j6577l7540K0553b5675j98831B1475b56318M481
11882b51837B2548K9430j9931c085D13423c61553B28274H6694a71054A48817J30773
11871B79590a0940o840l8764J2724j36323O02a1458B4067e9423J4313l8341K6998
11859e6453j89988b8031r2074A34724A3942a85548a296A79673a08756l74323c0129
11847B24767G3168b36308J2276A83470b08636j01549a07949j7565B12590e92239
$$ y = [-445436, 185456, -24184, 69610, -306868, 183147, 135548, 258089, 173682, -72278, 133999, -26467, -163651, 23898, -80316, 202983, 153553, -100902, -10421, -233703, -85952, -41877, 211350, 15692, -6883, -96188, 115102, -352920, 40964, 260967, 133648, 204849, -45028, 25670, -147784, -200933, -122216, -111549, 111797, 95220, 57680, 78233, -25675, -224506, 21475, -256318, -251837, 22548, 51978, 32047, -3085, 413423, -361553, 228274, 86694, -171054, 148817, 279590, -10940, -17780, -56544, -43820, -180143, -179541, -11458, 24067, -59423, -45110, -83451, -56453, -246441, -28031, -120105, 134724, 13942, -185548, -1296, 179673, -108756, -483079, -30129, 224767, 73168, -236308, -224032, 183470, -208636, -310185, -107949, -125514, 212590, -592239]
11836a99051G3131J7398C2159d046C6724a8249r5577D08107a52323B9949a44120
11824g2203B15912a07152j17835l797G0680i9152D1245d31888F9587J33309I817
11812e4032k00919B9799a15572L9818F7979b50718A50861b26914A83310C327h6686
11800B74328O0034a80142A96066I6548J49151a09200j46798a07696j6484d2986
11789C56170E8130a86067B01037I9550P9221D171O0638J46202d3050A41550b1562
11777A7882b24403e0263A90153J14868n0988a83225d7972k79963J04163a10200
11766f9657j54808m0510G7443N5724C3777a59086A10683c00800A2188i2938C60426
11754F9332c1894F1614b81337E7711M8857D7059M4844c27164a49465A58213p3661
$$ y = [-199051, 73131, 90529, 32159, -4046, 36724, -18249, -113826, 408107, -152323, 29949, -144120, -72203, 215912, -107152, -224987, -228784, 70680, -99152, 41245, -431888, 69587, 202896, 9817, -54032, -254951, 29799, -115572, -75754, 67979, -250718, 150861, -226914, 183310, 3327, -86686, 274328, 334362, -180142, 196066, 96548, 245699, -109200, -255998, -107696, -124180, -42986, 356170, 58130, -186067, 201037, 99550, 178771, 4171, 64809, 211011, -43050, 141550, -21562, 17882, -224403, -50263, 190153, 305021, 254033, -183225, -47972, -327935, -223772, -110200, -69657, -224465, -264975, 77443, 133167, 33777, -159086, 110683, -300800, 12188, -92938, 360426, 69332, -31894, 61614, -281337, 57711, 106568, 47059, 91903, -327164, -149465, 158213, 84552]
11743H4552b18509j4787g2813m4876N8838A02426a02468j33408A44019a80150
11732F1374a4468B74411r9011e5505B27861J0666l1284n8477J81720A0326O7512
11721G7838a47962M7270i569o6900A47821J6179b06036i766r0806c1651D1463
11709A01648J59285i3283A90206l7124L2182L2805E9432O7979J59135E8058K6690
11698H4748B5372K03886j5289c18384C921J91439a81327B12451f9608k5240A91649
11686a91386J960A58602L9580m1716E2636J55312i5615C15193b2375m3581J6928
11675d9028A02124N9788K3486g032D4777d79791a60555A6349a07579b6530G2064
11663B7758J60763p2389Q6968i5309m2356G5382R4705J42763E0053b08164A45705
$$ y = [84552, -218509, -233296, -72813, -117689, -58851, 102426, -102468, -235876, 144019, -180150, 61374, -14468, 274411, 175400, -55505, 227861, 238527, 207243, 148766, 330486, 10326, 77838, -147962, -100692, -9569, -76469, 147821, 164000, -206036, -9766, -100572, -31651, 41463, 101648, 260933, -93283, 190206, 153082, 185264, 218069, 59432, 127411, 286546, 58058, 84748, 25372, 229258, 213969, -318384, 3921, 195360, -181327, 212451, -69608, -94848, 191649, -191386, -189426, 158602, 198182, 156466, 52636, 207948, -95615, 315193, -22375, -65956, -49028, 102124, 161912, 185398, -7032, 44777, -479791, -160555, 16349, -107579, -26530, 72064, 27758, 188521, 116132, 203100, -95309, -137665, 75382, 170087, 312850, 50053, -208164, 145705]
11651B47871c976A17574a36958c8310A22690a34315B74910h6484n1948a412j08983
11640a10395j02354A38757a17632c9404L222C9828P4261a65592G2696a45969J6008
11629a29961O569A8235R8681d4183C139d1196J4485D7362b34919a03745B73128
11617f428F1788j37o747b0468m1439l2986j73779b3110B26124a30575H9753M4638
11605A34391d7998E4774J60550d8770B83156q9400D0497R743a92081C44849a85647
11593a27033B16190j154c223j67118C04959j27193A5644Q0260q703c3791B74318
11581C33145c3730F0105J17524L41969g8280j5716E7012j1484a18085r7922A01399
11569G0633d7616n460E7326K5637J45265l1491m6806d6204j41535C11144k0289
$$ y = [247871, -3976, 117574, -136958, -38310, 122690, -134315, 274910, -86484, -138432, -1412, -110395, -212749, 138757, -117632, -39404, -36182, 39828, 114089, -165592, 72696, -145969, -129961, -123392, 18235, 116916, -44183, 3139, -41196, -26711, 47362, -234919, -103745, 273128, -6428, 61788, 61651, 54904, -20468, -61907, -94893, -268672, -23110, 226124, -130575, 89753, 134391, -47998, 54774, 215324, -48770, 283156, 193756, 40497, 50240, -192081, 344849, -185647, -127033, 216190, 215036, -3223, -170341, 304959, 177766, 15644, 95904, 87201, -33791, 274318, 333145, -33730, 60105, 177629, 519598, -78280, -93996, 57012, 45528, -118085, -216007, 101399, 70633, -47616, -53076, 57326, 82963, 228228, 196737, 149931, -46204, -187739, 311144, 290855]
11558B90855A30419K79336A34888B7595K63635n9177a15694B59737j23308J01445
11548B37874m7305M9807j14978J25688j07728J09091q6309b16224D11958B6271
11537f2920C06836k5149P0950a0457k0979o330r1117j33485h7486A97520F0784
11525f3524A24150C9067L7943O6820O299L214l7694C2110J18731f4013C20299
11513A56162l1145J04718d81j84433D2391N4272f3919C20400q6747a79903b914
11501g8177B04453K38657j51025h9832A65483Q5923J57653f73B51659m3180b03496
11489D64494J08203A71669J52882o8943K8824h4770A58430M3023J4245G4377K87114
11478C61491r7564j14m1638a72499O4245C4812R7337K28072A05536j4355l9318
$$ y = [290855, 130419, 409755, 134888, 27595, 291230, 232053, -115694, 259737, 136429, 237874, 190569, 240376, 125398, 251086, 143358, 252449, 166140, -216224, 411958, 26271, -62920, 306836, 281687, 352637, -10457, -31436, -37766, -128883, -262368, -87486, 197520, 60784, -63524, 124150, 39067, 77010, 143830, 150129, 153343, 115649, 32110, 150841, -64013, 320299, 156162, 125017, 229735, -481, -184914, 42391, 96663, -63919, 320400, 233653, -179903, -2914, -78177, 204453, 443110, 292085, -89832, 165483, 251406, 409059, -673, 251659, 208479, -203496, 464494, 572697, 171669, 324551, 255608, 284432, -84770, 158430, 201453, 215698, 74377, 361491, 263927, 263813, 222175, -172499, -108254, 34812, 132149, 360221, 105536, 91181, 51863]
11467E1863J00849K80154p0640g8975B89037a19896A6489a0016A05543d0257n712
11456d5969B23762n016c9138H3338N8844N5123L9963m8444k9254K66073l2771
11445C92872H3292P4079a21537L0321g271k09324F7031B7884b80773c1451I9965
11433E4843K52649A09249c579A62257Q9295L6691i4858c0211B7274J44972k0600
11422A51646J11665a32166A11027a44179A53862B9567f0648j304J4122n8336j58849
11411b65015A84790f5781D33742A08828k2154j7477Q4434J953A3004A065K21483
11400B22548A5946L38654A58759E3129J1750P32a96196D1378a15602G2241K2556
11389I4797e4993j5718i057G172J63376p7159J37865D5903a33488j13340Q0225
$$ y = [51863, 152712, 432866, 362226, -78975, 289037, -119896, 16489, -10016, 105543, -40257, -45969, 223762, 218746, -39138, 83338, 142182, 197305, 237268, 188824, 159570, 425643, 392872, 83292, 157371, -121537, -91216, -7271, -216595, 67031, 27884, -280773, -31451, 99965, 54843, 307492, 109249, -3579, 162257, 251552, 288243, -94858, -30211, 27274, 172246, 151646, 263311, -132166, 111027, -144179, 153862, 29567, -60648, -61952, -47830, -106166, -265015, 184790, -65781, 433742, 108828, 86674, 69197, 153631, 155584, 13004, 1065, 222548, 15946, 354600, 158759, 53129, 64879, 65611, -196196, 41378, -115602, 72241, 94797, -54993, -70711, -9057, 7172, 170548, 93389, 231254, 45903, -133488, -246828, -166603]
11378a66603H1614C7085a50721j38205A57038K13589a35104A44267a6757o912
11368b3669B36990f0038m8721b7139j21594j816h645k56945A98253g4853q4448
11357a59301A15305A5932b75603C07425c23440B0488J53440B8835K65167H4136
11346C00743j15451M7043a4598j28124D9277J33176F5875c25977A0419M6630N9910
11335A16959k7043M08819A11917a59766D5978K7677M7008a64156l23498c8057
11324A4535i2076C5026c4581n3795A49650c4730A90482q8127J54115j22514D0930
11312G2724B0598g0072E5509b67231B87732a67172M3510a1736j37430l2953L5677
11301a46442j0381H9028c76046g568q7795A9260b81195e0676m9704Q857A0381
$$ y = [-166603, 81614, 37085, -150721, -288926, 157038, 370627, -135104, 144267, -16757, -23669, 236990, -60038, -108759, -27139, -148733, -150549, -8645, -265590, 198253, -74853, -159301, 115305, 15932, -275603, 307425, -323440, 20488, 173928, 28835, 294002, 84136, 300743, 185292, 232335, -14598, -142722, 49277, 182453, 65875, -325977, 10419, 57049, 116959, 89916, 498735, 111917, -159766, 45978, 73655, 120663, -164156, -487654, -38057, 14535, -92076, 35026, -34581, -88376, 149650, -34730, 190482, 102355, 256470, 133956, 40930, 72724, 20598, -70072, 55509, -267231, 287732, -167172, -123662, -11736, -149166, -182119, -146442, -156823, 89028, -376046, -7568, -95363, 19260, -281195, -50676, -100380, -91523, 10381]
11289a53764j88988R9600J00122A7396K6956a57565A52398a89193F6726h0897
11278a2128A36732l0333e803C022a69418C8599h8879A13363i0413m9997B34860
11266E5704F606K83615I9599a46381A5725L15850l1395a71465A70013c7356n6882
11255i4238A4853J82604b91945B74279m3209k7127a37766n7j28863N1248j58706
11244c74144f8126j13140A04610L00498B6986c5765a4615F2849a64756j4948E977
11232a76287H7786g55r9083C47580a31492c3312C01612j44515E8671f3014D298
11220E5833M2087C5526c0504B52b43537A7805C11R4042k6026M563b10513f3142
11207B01147n3601B9401a66783k0159J8368A65093M6087b03620j4054D1626M8241
$$ y = [-153764, -342752, -243152, -143030, 17396, 44352, -157565, 152398, -189193, 66726, -80897, -12128, 136732, 106399, -5803, 3022, -169418, 38599, -88879, 113363, -90413, -140410, 234860, 55704, 6606, 290221, 99599, -146381, 15725, 331575, 300180, -171465, 170013, -37356, -94238, 14853, 197457, -291945, 274279, 231070, 203943, -137766, -137823, -266686, -215438, -374144, -68126, -181266, 104610, 405108, 26986, -35765, -14615, 62849, -164756, -179704, 5977, -176287, 87786, -755, -99838, 347580, -131492, -33312, 301612, 157097, 58671, -63014, 4298, 55833, 97920, 35526, -30504, 252, -243537, 17805, 311, 94353, 68327, 72890, -210513, -63142, 201147, 147546, 29401, -166783, -186942, -168574, 165093, 211180, -203620, -217674, 41626, 89867]
11196H9867b05565n2598e9728j13429B57005n0110A0043P0957e5088J6804I4808
11184g9747K9264k44826R4796r103k8489E6540J45850a36170B08532j4464G1343
11172B1422K03023I1169i1469B07228d0385j57675j3432H3526b86999F6237q351
11161E7886f0006B08624a53393d4102G5634b00914i0131A27999B4767J52081D9529
11149c11837d1150D98769a58950K8416j28480A01616C1875J86180p8887j2985
11139A26183B8477b07665A37698h2805a6169B38793C9858J92248a58616A84516
11128G6516L17899e2277o9925A6137a9927j30086A74269a76502l1978A06688a1706
11116E8089l200P9051b5256j2214C14945G0241L5813J02369c01875C57456a54099
$$ y = [89867, -205565, -258163, -59728, -173157, 257005, 206895, 10043, 81000, -55088, -38284, 94808, -79747, -50483, -295309, -200513, -209616, -238105, 56540, 202390, -136170, 208532, 194068, 71343, 21422, 224445, 91169, -91469, 207228, -40385, -198060, -211492, 83526, -286999, 66237, 57886, -60006, 208624, -153393, -44102, 75634, -200914, -90131, 127999, 24767, 176848, 49529, -311837, -41150, 498769, -158950, -130534, -259014, 101616, 31875, 218055, 139168, 126183, 28477, -207665, 137698, -82805, -16169, 238793, 39858, 232106, -158616, 184516, 76516, 394415, -52277, -122202, 16137, -19927, -150013, 174269, -176502, -208480, 106688, -11706, 58089, 54889, 133940, -25256, -37470, 314945, 70241, 106054, 208423, -301875, 357456, -154099]
11104A45177A0668L54830j79280l9340o5381M75a60328B251L44893h2568H5586
11092A63297F1318L03541j45228J57676j61571a6058B84748J66160n6917j02719
11082B91272j28764c6028B78507k8196J61174j72558p028K58094j54810K71052
11072F06235j31872j31591h5002B34254K15648n7263j15654M2465n0109o2195
11062B07146N01958k29021J51615P6051l31253J49673J91936K9125K54185k21951
11052G79464L92678j18974k19600k4508N6240j52518p9668L82944l44491j75442
11042D96125J50616j08933J94693J5042J12496J5960j84400R0141k50851K92901
11032H23790p5677R4295j39844K4610N0160q4065K66595j20848j15373k69J29445
$$ y = [145177, 10668, 365498, 186218, 146878, 81497, 81972, -160328, 2251, 347144, -82568, 85586, 163297, 61318, 364859, 219631, 377307, 215736, -16058, 284748, 450908, 393991, 291272, 162508, -36028, 278507, 250311, 411485, 238927, 231899, 489993, 335183, 606235, 474363, 342772, -85002, 234254, 449902, 392639, 276985, 319450, 269341, 207146, 709104, 480083, 631698, 707749, 376496, 526169, 718105, 747230, 1001415, 779464, 1172142, 1053168, 833568, 809060, 865300, 712782, 633114, 1016058, 671567, 496125, 646741, 537808, 732501, 747543, 860039, 875999, 691599, 781740, 530889, 823790, 748113, 842408, 702564, 727174, 777334, 693269, 959864, 839016, 723643, 723374, 852819]
11021H52819k04043L89102l09866J56012C39150K89982k64600M81872J00511m13362
11011E33553M2681N8912Q2384K42160r0980J96636C46146K62526L4987j27878
11001E15781J38755p6237J13960k57330K92386k50219J00997j41042K90479J12181
10991H39711j04274L6853R4566k80128K75211j27647N09347L785k40777J86808
10981A193455J75358p3861J75056j71325L99052j09217K78664L86485J26331M98717
10971B878715K14052J00277l47798K61538o3949j80988j78827n75833k53266L1063
10961A884984l3631q2952k02909M27472j25851M20026l8556o89938n5824J47078
10951A649899j89465K3395l85251j59520k87500l9385B58520K81823j79797j9376
$$ y = [852819, 648776, 1037878, 728012, 884024, 339150, 629132, 364532, 846404, 946915, 533553, 576234, 635146, 717530, 959690, 868710, 1065346, 346146, 608672, 643659, 515781, 654536, 578299, 692259, 434929, 727315, 477096, 578093, 437051, 727530, 839711, 735437, 772290, 866856, 586728, 861939, 734292, 1243639, 1247424, 1006647, 1193455, 1368813, 1294952, 1470008, 1298683, 1697735, 1588518, 1867182, 2253667, 2379998, 2878715, 3092767, 3193044, 2845246, 3106784, 3042835, 2861847, 2683020, 2107187, 1853921, 1884984, 1851353, 1768401, 1565492, 1992964, 1867113, 2287139, 2248583, 1558645, 1502821, 1649899, 1460434, 1483829, 1098578, 939058, 651558, 612173, 258520, 540343, 360546, 341170]
10941C41170q4059m0989J20738A27392R9883j3843D9409K67218A29719P5047C9667
10929A22449a30383L3346F9606O5401a03160j3946d1938A23166q460O0524a14974
10917A19589L609A9378L5884H842a08080M4700F8689a24306m2011A46042b35818
10905B29078a24061e5835F9031J74748l812I620g776A2034a77258M9373B50354
10893e7521j2368a8814q8528K4701I9264a27038A39443J48764b34188C01765j5077
10882B86688c25280J50187A24151B6947c15978h4336A27104C5232N7837a98829
10871a12786A0183N2457P0813M8720a02242l29997c0048j9592j09321d3526A35023
10859A0534J37854a33184B39351a06846j67281f5975g173j04505r736a7262A01701
$$ y = [341170, 257111, 216122, 336860, 127392, 227275, 213432, 49409, 316627, 129719, 204766, 39667, 122449, -130383, -97037, 69606, 135007, -103160, -117106, -41938, 123166, 114706, 175230, -114974, 119589, 123198, 19378, 55262, 8842, -108080, -63380, 68689, -124306, -166317, 146042, -235818, 229078, -124061, -55835, 69031, 243779, 239967, 9620, -7776, 12034, -177258, -127885, 250354, -57521, -69889, -18814, -107342, -82641, 99264, -127038, 139443, 288207, -234188, 301765, 286688, -325280, -175093, 124151, 26947, -315978, -84336, 127104, 35232, 93069, -198829, -112786, 10183, 62640, 133453, 182173, -102242, -432239, -30048, -49640, -158961, -43526, 135023, 10534, 148388, -133184, 239351, -106846, -274127, -65975, -7173, -111678, -121414, -17262, 101701]
10847a5660j02258A5746f8110k65379d9865B4423N041J2170c1706A14674D5213
10835A15881e9033k41093A65393a24889p8344d4998B5477K43007a58012j7179
10825a75191j10265d5632d171n6269C02346a64721A03806b7211p703m4538p9643
10814a59095A79768c1537j01185B61332a27432j6611H892a2811n9656I3791L086
10803I6877D829f9350j06528J0949A41577d6375J8955D8942a88641G5448e123
10791F6552k8486b51259I6932g9777A20477a05932a1377A96922a51702l9383P075
10780a84010A02064l7448O3602a05045A24386n8669h3626l8915J5904A22536D4961
10768b52743P5588j72699A93079D1790N8632m5434A2683d03349I7307K55923D6036
$$ y = [-15660, -117918, 15746, -68110, -333489, -49865, 24423, 29464, 41634, -31706, 114674, 45213, 115881, -59033, -300126, 165393, -124889, -203233, -44998, 25477, 268484, -158012, -175191, -285456, -45632, -4171, -60440, 302346, -164721, 103806, -27211, -34914, -79452, -159095, 179768, -31537, -132722, 261332, -127432, -144043, 8892, -12811, -72467, 93791, 96877, 4829, -69350, -175878, -164929, 141577, -46375, -27420, 48942, -188641, 75448, -5123, 66552, 38066, -251259, 96932, -79777, 120477, -105932, -11377, 196922, -151702, -191085, -184010, 102064, 64616, 128218, -105045, 124386, 65717, -83626, -122541, -106637, 122536, 44961, -252743, -177155, -349854, 193079, 41790, 100422, 54988, 12683, -403349, 97307, 353230, 46036]
10756a65743A419L12116a76934k7431A82776B8027b39408g7464k9104A36193E9707
10744D604L5726Q1972b12028A14781c7517G8422a95958g1199C11852h4371B74936
10732E7854d3650j90571A04313J43455D1087q817J23356b6588H8281c06364a41578
10720g7795l7937G4015b040n6364b6639l84328J21574N2902A20083a46516b4653
10708C14760g0088A83086D6466Q0734M3388b15673a6602A28277a89144J3397G3811
10696a67918E9331b47199b9571p3718j46805J10451c8353n4476A01856b24541
10685c62900A05142J02975a31459E5153c1281C31080c169A23201a9266j514B65855
10673F962a29327a5131o8683F7349M0643C5824c88568b2452l67681J52659Q286
$$ y = [-165743, 1419, 313535, -176934, -204365, 182776, 28027, -239408, -77464, -106568, 136193, 59707, 4604, 40330, 122302, -212028, 114781, -37517, 78422, -195958, -71199, 311852, -84371, 274936, 57854, -43650, -234221, 104313, 247768, 41087, 32270, 155626, -26588, 88281, -306364, -141578, -77795, -115732, 74015, -2040, -58404, -26639, -410967, -289393, -236491, 120083, -146516, -24653, 314760, -70088, 183086, 46466, 127200, 170588, -215673, -16602, 128277, -189144, -175747, 73811, -167918, 59331, -247199, -29571, -103289, -250094, -139643, -38353, -92829, 101856, -224541, -362900, 105142, 208117, -131459, 55153, -31281, 331080, -3169, 123201, -19266, -20780, 265855, 6962, -129327, -15131, -83814, 67349, 107992, 35824, -388568, -22452, -390133, -237474, -229188]
10662b29188j43389A60372B7257J34251c4443E2920i2879G8336J25064i7161C4577
10650G6709a05883A32633J11038A7710K16356B5913P3182f0413q5737f9583B85915
10638e2477j07204a968k69271B25651e1627k77367i8038A61479R3653A9638c11896
10626a02552o5563A49747P304D5045a3251r4169r4002Q4076G6693i8431a1223
10614a58650I0812k8168a36414G212g9771K1301J5313j72204f1078N364l3273
10603h8987A45471d6626k77474a46957r9066M9616A76434C4956e5306j02627f8373
10591i42j22375A67302E6614d2415j79636h6745a5880j43842A57500a8313k92424
10580c10737A46862a40596p9619R9237j29704A05482i9670g705j58275r3325e3443
$$ y = [-229188, -372577, 160372, 27257, 161508, -34443, 52920, -92879, 78336, 203400, -97161, 34577, 76709, -105883, 132633, 243671, 17710, 234066, 25913, 99095, -60413, -146150, -69583, 285915, -52477, -159681, -1968, -271239, 225651, -51627, -328994, -98038, 161479, 255132, 19638, -311896, -102552, -168115, 149747, 157051, 45045, -13251, -107420, -201422, -117346, 76693, -98431, -11223, -158650, 90812, 62644, -136414, 7212, -79771, -58470, -43157, -215361, -61078, -55714, -88987, 145471, -46626, -324100, -146957, -246023, -196407, 176434, 34956, -55306, -157933, -68373, -942, -123317, 167302, 56614, -42415, -222051, -86745, -15880, -159722, 157500, -18313, -310737, 146862, -140596, -220215, -120978, -250682, 105482, -99670, -7705, -165980, -259305, -53443]
10568h327m26408C57235A56721a95172O5098j29845O985E6322b5721r9047H1076
10556A29347a4901j03862o6112a1251N074j18679j0260j7412B84005b43019R8504
10545a44515L7483c0740F4416b52218a7593l04566A22531D7832a70216k9680K4848
10534a75048j72930H1582J0164B5382i9216B0612a04232B29715e6878E6919a91318
10522b50447L6299g6395C228L3064K17543E8910N49850d9915j59738B58506a36093
10510i4475B09772r4791a52939o9133A01139j0164b88264C7639h5610a9234j70095
10499a89329G1959a5923H3603K08269A1604b523G6450J41262b86079I1949m1881
10488E0068c6535q52j62729B28953K5693r988J93175J36751r9002O0551j63596
$$ y = [-8327, -434735, 357235, 156721, -195172, -130074, -259919, -252934, 56322, -25721, -124768, 81076, 129347, -14901, -118763, -184875, -11251, -6177, -124856, -135116, -152528, 284005, -243019, -144515, -107032, -30740, 64416, -252218, -17593, -322159, 122531, 47832, -170216, -199896, -175048, -347978, 81582, 91746, 25382, -99216, 20612, -104232, 229715, -56878, 56919, -191318, -250447, -214148, -76395, 3228, 36292, 253835, 58910, 608760, -49915, -209653, 258506, -136093, -94475, 209772, 114981, -152939, -222072, 101139, 90975, -288264, 37639, -85610, -19234, -189329, 71959, -15923, 83603, 291872, 11604, -2523, 76450, 217712, -286079, 91949, 50068, -36535, -37387, -200116, 228953, 254646, 244658, 437833, 574584, 475582, 536133, 372537]
10477C72537j35121k9656L99426I6060a0990I7505d0697I7593K02458E2290P0377
10466A22667E3031h984B24096b00213B34566F7644M8551b642k08377d7839J1562
10455c6277j03988k685p107Q202r0704h6025C00607b61327A80245i9748K7736
10444g2012l12450a58485M8630K9124c0647I2023c299B35294j1452C5954D607
10432H1950D0372e892A64655a7182B51149l083Q7263f0495B1406b56895E0194
10420A01797b55743i5049L6022o0499r090d9881l1599l78610g7752b9205k83094
10409c12299B13668a64932A46137b43431A22871e8465J1021B247c22797A10607
10398C14e8076j31991B63147j01050k4847j1276q61l0259E737J33337O7928K42382
$$ y = [372537, 237416, 207760, 607186, 96060, -10990, 97505, -40697, 97593, 300051, 52290, 122667, 53031, -8984, 224096, -200213, 234566, 67644, 116195, -2642, -211019, -47839, -36277, -140265, -142950, -150057, -141855, -232559, -86025, 300607, -261327, 180245, -99748, -72012, -384462, -158485, -109855, -80731, -30647, 92023, -3299, 235294, 223842, 35954, 4607, 81950, 40372, -5892, 164655, -17182, 251149, 248066, 335329, -60495, 21406, -256895, 50194, 101797, -255743, -95049, -59027, -119526, -128616, -49881, -81480, -460090, -77752, -29205, -312299, 213668, -164932, 146137, -243431, 122871, -58465, -47444, 2247, -322797, 110607, 314, -58076, -190067, 263147, 162097, 137250, 125974, 125113, 94854, 5737, 139074, 207002, 449384]
10386D49384A94741J18902a69277b6355B45683q3372G0210O1957K15327j22377
10376B25117J21426N769A24988J89420A39503N8084L079L18899k01420J67263
10366D85408k06801P1595K03349q7523J55513k42479m5888j53944J66933A45598
10355C08678o9800j2707o4943l516K77551P7314L3380K0037A81835J84908k3863
10344C42880J8024R6902n8301j11482m6695Q4205n349C4694K47619a02714A23662
10332B48414C2280L19083H0082b37159A14375K9863Q0944k5786b07498B56561
10321A54855k6749c56850C14871D3317j3677a89345F5010a77677a6348B10135
10310B94023c26790J26898g6891G5498h06j18409j02623C4028L37496A03090K3476
$$ y = [449384, 194741, 313643, -169277, -26355, 245683, 162311, 70210, 132167, 347494, 225117, 346543, 352312, 124988, 314408, 139503, 197587, 200666, 519565, 318145, 485408, 278607, 350202, 553551, 466028, 621541, 379062, 333174, 179230, 346163, 145598, 308678, 238878, 226171, 161228, 157712, 435263, 512577, 545957, 565994, 181835, 366743, 342880, 360904, 457806, 399505, 288023, 241328, 325533, 320184, 34694, 282313, -102714, 123662, 248414, 32280, 351363, 80082, -237159, 114375, 144238, 225182, 199396, -207498, 256561, 154855, 128106, -356850, 314871, 43317, 29640, -189345, 65010, -177677, -16348, 210135, 294023, -326790, -199892, -76891, 75498, -806, -119215, -221838, 34028, 371524, 103090, 126566]
10299A26566B3603a10454l5818A90658K73891B7220a63429k0955B37089B984K73051
10288B76035F8395a21180F2739a97653l1887D3096Q180a07670J1629k03709B57915
10276a19316H1186O0850c31511J14541c823B05438O5650A30115h3778B50970A5167
10264h6768L8782C17009J92926b77289B08851m9614K15274a5229B24036G8256
10253B06125l4412n3854k5083K83003B3365J32788a06196A07123a39365l6968
10243a76333M7637I1059f2809A07345B676M34783A67022F808M45549B15374P5761
10232B91135B6653N8802d5896j8148l70377K02224A6844h0068k16037A67958E6646
10220a62888A08555f4559D572e4180o3350A9977J7032c60113a62105A42836b06587
$$ y = [126566, 23603, -110454, -146272, 190658, 464549, 27220, -163429, -184384, 237089, 2984, 276035, 68395, -121180, 62739, -197653, -229540, 43096, 51276, -107670, -96041, -299750, 257915, -119316, 81186, 142036, -331511, -216970, -3823, 205438, 271088, 130115, -83778, 250970, 15167, -86768, -47986, 317009, 509935, -277289, 208851, 159237, 374511, -15229, 224036, 78256, 206125, 171713, 117859, 92776, 375779, 23365, 156153, -106196, 107123, -139365, -176333, -128696, 91059, -62809, 107345, 2676, 437459, 167022, 6808, 452357, 215374, 291135, 26653, 85455, -45896, -64044, -434421, -232197, 16844, -80068, -296105, 167958, 56646, -162888, 108555, -64559, 4572, -54180, -117530, 19977, 37009, -360113, -162105, 142836, -206587]
10208B13790G384J05806a21775C18648a3329l1117j31153M1702B73737a31974
10197a61072k233M5903I8419h5599A05161b32168F4272b65972J01831k20134a73824
10185a3404B50010a07627n2527B3330b7699k07440i2561I6211d58240K02880J6846
10174b38514P8756e937D0190c64209R5405A12820h3218r9338Q6827I8662a86562
10162A58314a39541f5884a3418B18796c58846J09856a01914A71446a21509c5518
10151e5660o6640K0183l6508c3022C20470b05726J6315i167o13l05275a43070
10139i3437R026B18898a97851L7412j93048P8651a09368L9968C25214F6052a63230
10127h6667C81415a01207j99708e2765A1271b74581J12867A07614h6647a2180
$$ y = [213790, 7384, 113190, -121775, 318648, -13329, -44446, -175599, -133897, 273737, -131974, -161072, -163305, -117402, 98419, -85599, 105161, -232168, 64272, -265972, -164141, -384275, -173824, -13404, 250010, -107627, -160154, 23330, -27699, -235139, -92561, 96211, -458240, -255360, -238514, -159758, -5937, 40190, -364209, -268804, 112820, -83218, -182556, -95729, 98662, -186562, 158314, -139541, -65884, -13418, 218796, -358846, -248990, -101914, 171446, -121509, -35518, -55660, -122300, -102117, -138625, -33022, 320470, -205726, -189411, -9167, -9780, -315055, -143070, -93437, -84411, 218898, -197851, -160439, -353487, -274836, -109368, -69400, 325214, 66052, -163230, -86667, 381415, -101207, -300915, -52765, 11271, -274581, -161714, 107614, -86647, -12180]
10116b20068E8618a02077n997g693A59144C089h0544p1639D6633N4827D421a96498
10103B01088a79627H7831L4217m1937f0058j97408A011a32876B7436b23764f4243
10091A47147g2056L5907a3497l61573a82561b7185A8617a34753A04919J507e1659
10079G4487K20016H4917b69953O9028B6187k397K17116G6329L8666L9999p5933
10068G9061C7436b4955n3260n5570E0247K15618a2092q2198j39082k30295A59123
10056c9852C06364b65202P0476c8739l82747d7090j57403j09559A07215a78756
10045c5199o4086a6997m7179a063E5048I036b24101C21576c87886J66040B44390
10033F0972a64382B53429D8813F369b45866a04840K1800B2173J57905c73125h0210
$$ y = [-220068, 58618, -102077, -108074, -7693, 159144, 3089, -80544, -152183, 46633, 101460, 4421, -196498, 201088, -179627, 87831, 122048, 80111, -60058, -257466, 1011, -132876, 27436, -223764, -64243, 147147, -72056, -36149, -13497, -375070, -182561, -27185, 18617, -134753, 104919, 106426, -51659, 74487, 294503, 84917, -269953, -200925, 26187, 23790, 240906, 76329, 114995, 154994, 79061, 37436, -24955, -78215, -133785, 50247, 265865, -12092, -94290, -233372, -463667, 159123, -39852, 306364, -265202, -194726, -38739, -421486, -47090, -204493, -314052, 107215, -178756, -35199, -99285, -16997, -64176, -1063, 55048, 9036, -224101, 321576, -387886, -221846, 244390, 60972, -164382, 253429, 48813, 6369, -245866, -104840, -83040, 22173, 180078, -373125, -80210]
10021a99670b4765G7616a18469D6447k0645m221L830g2684c317C01365C7661g9036
10008d11907J95645M6093C53438b04406p1466h6985B24093m9216c49425I8920
9997a82063f2827C3535b10780b4407p8230N34K416l22142c7035a3406n8276k21092
9985b92774B65810A4361J4004J29003A8443a65610k4536d0713l6117A6252K49780
9974B66032c10201L7879a23739m1328f2023B4196b96586E3387i535A48758C9397
9962a6220j93047R3653N7171k58522A60314k2360m5186a13237A12941d718j58922
9951a63640A36942e3590A49764F8480c19176C6631c78800A60021e3368k1013j44263
9940b18644O479D2494b0578j24548C7574a9564n8637b0687j99112h2967A9619
$$ y = [-199670, -24765, 77616, -118469, 46447, 25802, 21581, 25411, -72684, -3317, 301365, 37661, -79036, -411907, -216262, -170169, 353438, -204406, -275872, -86985, 224093, 174877, -349425, 98920, -182063, -62827, 33535, -210780, -24407, -102637, -102103, -99687, -421829, -37035, -13406, -71682, -292774, 265810, 14361, 28365, 157368, 18443, -165610, -190146, -40713, -76830, 16252, 266032, -310201, -272322, -123739, -165067, -62023, 24196, -296586, 53387, -9535, 148758, 39397, -16220, -209267, -115614, -58443, -316965, 160314, 137954, 92768, -113237, 112941, -4718, -163640, 136942, -53590, 149764, 68480, -319176, 36631, -378800, 160021, -53368, -74381, -218644, -212165, 42494, -20578, -145126, 37574, -19564, -78201, -20687, -219799, -82967, 19619]
9928F0851b08461g9059D6953b01697j79145D2311h4286l01779R8279B05381e7672
9916B93288F9977R9483g42097E515c79693a09557j40032C33609j09532c01571
9905a82485k0111d1399F0997a45823O1692G8169K2310b76797e4030B1808J15514
9894A37322B4050M1498J55315L0724j07350F4132K37093a60521J6731a2245q9739
9883a01984j67374P7669g8735k84418J07911c9247G3052b03902k8554B80936e4258
9871E8393B3212a23439D0625J67677a63757g0306j57130j9986O8788r2375f2410
9859B13024a21502j1997A1768L0446e16890F2654h4985A83216l6732m5919a15277
9847a2057m7710j68955I0397g4229m6469k02028J3382a34604G0974p789b96859
$$ y = [60851, -208461, -79059, 46953, -201697, -380842, 42311, -84286, -386065, -287786, 205381, -57672, 293288, 69977, 169460, -742097, 5515, -379693, -109557, -249589, 333609, 224077, -301571, -182485, -202596, -41399, 60997, -145823, -84131, 78169, 100479, -276797, -54030, 21808, 137322, 24050, 65548, 220863, 251587, 144237, 64132, 301225, -160521, -143790, -12245, -101984, -269358, -191689, -78735, -363153, -255242, -39247, 73052, -203902, -232456, 280936, -54258, 58393, 23212, -123439, 40625, 208302, -163757, -70306, -227436, -247422, -178634, -271009, -62410, 213024, -121502, -133499, 11768, 42214, -516890, 62654, -84985, 183216, 146484, 100565, -115277, -12057, -59767, -228722, 90397, -74229, -120698, -322726, -309344, -134604, 70974, 63185, -296859]
9835b32721F0503a6021n785j84751j28739A63928p5961a07654l88659I3071K1326
9824A14397J0445c37463J59389D3847a08652j49358J05874A47705h1842k1853
9814a03695A93226g6073D965d019j55942o6843J06326F8947b77296N4386C2369
9802H5229h259F6111b46605C6528L16463a94613e8952j55370A33036a31750m7311
9791a79061o640A62780l5498J0870e0485a8787j13697J302n9992A29955a1533
9779b55799a12380g498o3044A83907b62339A29098b28207a2167B69593c04713
9768e692p8232k26728A73169B7139e0461A26289a12594j09207J03308r7613n9910
9757b76016A68313d3692k36277i1754k6536G9929a26710k09151A37566a85276
$$ y = [-232721, 60503, -16021, -21806, -206557, -335296, 163928, 87967, -107654, -496313, 93071, 114397, 124842, -337463, -178074, 43847, -108652, -258010, -152136, 147705, -81842, -103695, 193226, -76073, 4965, -4019, -159961, -226804, -120478, 68947, -277296, -222910, 32369, 85229, -8259, 66111, -246605, 36528, 352991, -194613, -58952, -214322, 133036, -131750, -179061, -185701, 162780, 127282, 138152, -50485, -18787, -132484, -131182, -191174, 129955, -11533, -255799, -112380, -7498, -70542, 183907, -262339, 129098, -228207, -12167, 269593, -304713, -5692, -83924, -310652, 173169, 27139, -50461, 126289, -112594, -221801, -118493, -216106, -276016, 168313, -43692, -279969, -91754, -118290, 79929, -126710, -335861, 137566, -185276]
9746B0210J02291b63817d7133r0737A41085n4339K45588i2826j17895k12759A61647
9734a40999f6026l7704r5688A4812f9967k76448g3312m776C6562a05538K6161
9723g9377l6754j35961j72861D28484a21908l63924a0940l8959j23982e1872j4893
9712f6765m6674C0800a59081C5980c53826f6663H5811C8296i0071A77542a15243
9700a16000J5615k14143a02855c1642l3514B39930b84194h2466k53975f1586A13483
9688c3562C96913a2088q7878K738L2723A11757m605j5357c08779A94871g4300
9676A2794b71184J22375B860b49992K5914e0332K3024o2464E0784E574Q604b15809
9663a47663A851J13203E478K57701r1043f2910j15078j65470e2399j85739P6930
$$ y = [20210, 122501, -263817, -47133, -137870, 141085, 86746, 332334, -92826, -210721, -423480, 161647, -140999, -66026, -103730, -199418, 14812, -69967, -346415, -73312, -78088, 36562, -105538, -79377, -116131, -252092, -424953, 428484, -121908, -485832, -10940, -49899, -173881, -51872, -66765, -113439, 30800, -159081, 35980, -353826, -66663, 85811, 38296, -90071, 177542, -115243, -116000, -100385, -314528, -102855, -31642, -65156, 239930, -284194, -82466, -336441, -61586, 113483, -33562, 396913, -12088, -99966, -97228, -64505, 111757, 107152, 91795, -308779, 194871, -74300, 12794, -271184, -148809, 2860, -249992, -224078, -50332, -27308, -89772, 50784, 5574, 14178, -215809, -147663, 1851, 115054, 5478, 263179, 172136, -62910, -177988, -343458, -52399, -238138, -161208]
9652a61208b7893E4285a232H1804P6038C2037a95185C4531b2454A53575b42811
9640b22596a11274a6303n2620A7916J73619a03434L0723L5393B8702b48258A86250
9628a92542A03009a35660E0936N6784C6365d38440A3325b30729A01410C3268l91
9617C2877d6440A8431J31985L2758a98502b5596o2213l1629G8302a94604A7770
9605G2447a71968H7576A8543M8021a99745g7200G1469g9012q3488j02889C21821
9593a0188C9209a33974m0957a2946j44518p3664J05275M5893D1196g4029B71420
9581d04263d2251A4791g905j58980j9468E4461i9391B16127G2175a79306k49175
9570d28481J73761A12542k4653c01974a23959k02727A3363a31621e7953j32856
$$ y = [-161208, -27893, 54285, -1232, 81804, 157842, 32037, -195185, 34531, -22454, 153575, -242811, -222596, -111274, -16303, -68923, 17916, 191535, -103434, -72711, -37318, 28702, -248258, 186250, -192542, 103009, -135660, 50936, 107720, 36365, -438440, 13325, -230729, 101410, 33268, 32877, -46440, 18431, 150416, 183174, -198502, -25596, -87809, -119438, 78302, -194604, 17770, 72447, -171968, 87576, 18543, 66564, -199745, -77200, 71469, -79012, -162500, -265389, 321821, -10188, 39209, -133974, -174931, -12946, -157464, -231128, -125853, -79960, 41196, -74029, 271420, -404263, -42251, 14791, -7905, -166885, -186353, 54461, -99391, 216127, 72175, -179306, -428481, -254720, 112542, 87889, -301974, -123959, -326686, 13363, -131621, -57953, -190809]
9560a90809j04232A09712D445c5536o5066H22K20069b39269P3855l47695A36771
9548e6236K3479j28389A34162b80190h5578K5082m0387A2994K8440d49164D0234
9536B28560B3186a69713B3580K08519a11542g925A24763a46817K9703A11468a89333
9524c12200A60247e394D1850b14629j47763J44491c9738G3307b7591j35999A36051
9512A26843M0c19974a3167p7237m1200F6833N4372K94574e3740k33130a34653
9500a46082k8046E1639h3765A07900a89716P8713C03182b01930A47722a40514
9489A66016C7372R610N7534b70280a2869k56542G5235L17264C1471a75683a4435
9477A04674C2286b86341K4671A43188a73831N9413j32402B10242b47008F898c8814
$$ y = [-190809, -295041, 109712, 4445, -35536, -100602, 822, 220891, -239269, -165414, -513109, 136771, -56236, -32757, -161146, 134162, -280190, -85578, -60496, -100883, 12994, 41434, -449164, 40234, 228560, 23186, -169713, 23580, 232099, -111542, -7925, 124763, -146817, -117114, 111468, -189333, -312200, 160247, -5394, 41850, -214629, -362392, -217901, -39738, 73307, -27591, -163590, 136051, 126843, 126883, -319974, -13167, -90404, -131604, 66833, 121205, 415779, -53740, -286870, -134653, -146082, -174128, 51639, -83765, 107900, -189716, -111003, 303182, -201930, 147722, -140514, 166016, 37372, 46982, 104516, -270280, -12869, -269411, 75235, 392499, 31471, -175683, -14435, 104674, 32286, -286341, -261670, 143188, -173831, -114418, -246820, 210242, -247008, 6898, -38814]
9465b30235o2964k6082R3343C679b01849j46433e9985j82521N7764A17459a4712
9453b03511L8136q1948n0961c4125j85738j1548G8269g5545q2036r699f1768A38826
9440d2111l14607A40551a79154B37398a77151M8961I4515b29152C74995d7353
9429a07283E193c32946R4534b9140j93070k2804c2619j66717B48499a6251A10136
9417e6279B49769b76572k534a04210A94043m3128c01877J09563B47818c2799A80530
9405a82222A78111b83126f6737j37406J443N1956A4706J07753a32848I948a65898
9393a3322k08898B6588a35067M9738l40927E1496L0373b02536H8988J99210h6561
9381A40927a34053J6710A54400J35906a34966A03478h344B37381b80359B34168
$$ y = [-230235, -293199, -319281, -225938, 3679, -201849, -348282, -59985, -242506, -184742, 117459, -14712, -203511, -165375, -247323, -298284, -34125, -219863, -231411, 78269, -75545, -157581, -167280, -61768, 138826, -42111, -356718, 140551, -179154, 237398, -177151, -128190, 94515, -229152, 374995, -47353, -107283, 5193, -332946, -238412, -29140, -222210, -245014, -32619, -199336, 248499, -16251, 110136, -56279, 249769, -276572, -279106, -104210, 194043, 150915, -301877, -192314, 247818, -32799, 180530, -182222, 178111, -283126, -66737, -204143, -202700, -150744, 14706, 122459, -132848, 9948, -165898, -13322, -222220, 26588, -135067, -85329, -426256, 51496, 81869, -202536, 88988, 288198, -86561, 140927, -134053, -117343, 154400, 290306, -134966, 103478, -8344, 237381, -280359, 234168]
9370c9435l02228J14879E0324b57211p7809h5524q0085j85861b7251B63669b5847
9358a0448E8753b07476N5391F0069k7238g7462o2516A74588c42549A25176J29552
9347B54728c2281A99959a12537l4650p692M6348j28106E2296J33413a43336o3285
9336b06621N7454h757A59508a61338e4094k91446I1910a64294A36626D413N5702
9325F0115a28090C9979e2971K6185o0961c0769k15892H0710b29591h0832K2822
9314e8010b1503m9698E8521a516A00431a51123R930A33053i885j55069E3843L0097
9302H3940C5319b8398A8840J9549K03154i6257d077l24767R9003A55631J31932
9291B87563C1866J91739j04281d6907H7559c022l07987a14775J7832G8981a47465
$$ y = [-39435, -341663, -226784, 50324, -257211, -335020, -85524, -165609, -351470, -27251, 263669, -25847, -10448, 58753, -207476, -152085, 60069, 32831, -77462, -139978, 174588, -342549, 125176, 254728, -32281, 199959, -112537, -147187, -154879, -108531, -236637, 52296, 185709, -143336, -206621, -149167, -8757, 159508, -161338, -54094, -345540, 91910, -164294, 136626, 4413, 60115, -128090, 39979, -52971, -26786, -87747, -30769, -246661, 80710, -229591, -80832, -58010, -21503, -71201, 58521, -1516, 100431, -151123, -141193, 133053, -9885, -164954, 53843, 83940, 35319, -28398, 18840, 38389, 241543, -96257, -4077, -328844, -229841, 155631, 287563, 31866, 223605, 119324, -46907, 87559, -3022, -311009, -114775, -96943, 78981, -147465]
9279f8982A40541K283b39896A00244c11520P6619K9478c9965A99147d4468m9671
9268i4139C0732K65953A3005a40800C8769i7714n136o6123H1923d7895k50813
9257b98708d7038j98440a21776J8339d4138f421B7812P4175M1537d59959a33605
9245a45910G0864a10462F4019h5888k01279g8662j7968n4856j79923B539a70160
9233I6448k8479a63515J8791j04570f3839D5107e22253A7423a6777A09363b21621
9221I2388b5285m53392d5792E3662Q7141b86738j8455b2293B24413a11289j86815
9210b98104b3354j15143B3450R2750b94828J4811d5717j7757j67221i4365B60515
9198a69304I0318J93757E3844P2043a48939f5183j42059A8590c36708B960a09866
$$ y = [-68982, 140541, 142824, -239896, 100244, -311520, -234901, -205423, -39965, 199147, -44468, -94139, 30732, 296685, 13005, -140800, 38769, -97714, -102850, -168973, 81923, -47895, -298708, -47038, -245478, -121776, -103437, -44138, -6421, 27812, 101987, 143524, -459959, -133605, -145910, 70864, -110462, 64019, -85888, -287167, -78662, -96630, -151486, -331409, 2539, -170160, 96448, 67969, -163515, -144724, -249294, -63839, 45107, -522253, 17423, -16777, 109363, -221621, 92388, -25285, -478677, -45792, 53662, 140803, -286738, -305193, -22293, 224413, -111289, -298104, -23354, -138497, 23450, 116200, -294828, -280017, -45717, -63474, -230695, -94365, 260515, -169304, 90318, 284075, 53844, 125887, -148939, -65183, -207242, 18590, -336708, 2960, -109866]
9186a94073R0647G1895c617k06818e1025j85575M9439A45297E2248J53999C6168
9174i3809A39186c56606a05752B389b93675J42692M0555N430D7763I152J24296
9163A33448n0589c6763k02956I382g3371B9152J72166k9382e6343o7462K6007
9152i7798A0736d02960G3304i6757M4950A85903b22216i0976J1299j91975G2702
9140f3048H6108A6129f5898B5210J8144c49398g6674B64133b36932B51851a04537
9128A76972a79714B2855K55563c54997k4945E4402b24809Q5707L3333j09181d1953
9116A97504f7790k99227J72523a8489j47894L1474I6510a18721G9804c8125k60357
9105b98482Q0280b5026F2674a30261A55020b01487l4718k04146a29969l7775j94181
$$ y = [-194073, -103426, 71895, -3617, -210435, -51025, -236600, -187161, 145297, 52248, 206247, 36168, -93809, 139186, -356606, -105752, 2389, -293675, -150983, -110428, -104998, 47763, 9152, 133448, 82859, -36763, -239719, 9382, -73371, 29152, 201318, 171936, -56343, -123805, -97798, 10736, -402960, 73304, -96757, -51807, 185903, -222216, -90976, -79677, -271652, 72702, -63048, 86108, 16129, -65898, 25210, 43354, -349398, -76674, 264133, -236932, 251851, -104537, 176972, -179714, 22855, 278418, -354997, -379942, 54402, -224809, -139102, -105769, -214950, -41953, 197504, -67790, -367017, -194494, -18489, -166383, -134909, 96510, -118721, 79804, -38125, -298482, -218202, -25026, 62674, -130261, 155020, -201487, -236205, -440351, -129969, -167744, -361925]
9094c61925m2111d1856B6304a61425j7176D9095a06694A51727b81954h5151M517
9083h0634H5195b08432b1501B78397b10637O0885a2744k97637J18369A50515m7833
9072A02682J00715b14673C1941J17974g5628j12580R3395H9480l8931a23710l8232
9061a61942j17919I3264f1239K1515F3560a82084D0907b03330A65088b11387j9490
9050b30877B29215b35748A86627A2080b73927C9785J94724c49151B07657N0278
9040B57935j00937n6421a34523j07717B5481h8775l5393j05426g8764k11051L4011
9029b55804B32201d5971A16351a01095c2424r2719b5320j57494l11A9943e0758
9017D9774b1213j16685A21669a71253e6126k5481C7024a48516H0093a75669h4176
$$ y = [-361925, -404036, -41856, 26304, -161425, -178601, 49095, -106694, 151727, -281954, -85151, -80634, 85195, -208432, -21501, 278397, -210637, -149752, -12744, -310381, -192012, 150515, 102682, 203397, -214673, 31941, 149915, -75628, -188208, -94813, 89480, 50549, -123710, -161942, -279861, 93264, -61239, -39724, 63560, -182084, 40907, -203330, 165088, -211387, -230877, 229215, -235748, 186627, 12080, -273927, 39785, 234509, -349151, 207657, 257935, 156998, 100577, -134523, -242240, 25481, -88775, -124168, -229594, -78764, -289815, -255804, 232201, -45971, 116351, -101095, -32424, -125143, -25320, -182814, -183125, 19943, -50758, 49774, -21213, -137898, 121669, -171253, -56126, -81607, 37024, -148516, 80093, -175669, -84176]
9005a65672C18647j00052a58133A29193n228a97527E567P1684c5687A83076c30807
8993a56887j21721B3104J9827J13405N7189a06791A30602d07555A67079o2379
8983A04700m3723a11552o5464g328k66597L3770C07384B8469a2405o8243k58673
8972c39321e4941n078G1397L3188a73473Q2448B26199R0300a57895b8975A23073
8960a17569C9302i6750j44531e6419l72533h933q5380B47510c43748h1075p2328
8949a53403A85898D8346b36039a11403A56568h5438E3450b28045N8820P2090D5696
8937D8106f1508j67811J01125E4231d9102A07741c00916g5962l06936I3183b02435
8925c36516B12637a29819K8533C04239N33536B41862a13879k0194j74544O7976
$$ y = [-165672, 318647, 218595, -158133, 129193, 123965, -197527, 5567, 77251, -35687, 183076, -330807, -156887, -278608, 23104, 42931, 156336, 213525, -106791, 130602, -407555, 167079, 104700, 60977, -111552, -177016, -7328, -273925, -240155, 307384, 28469, -12405, -80648, -339321, -54941, -60019, 71397, 104585, -173473, -91025, 226199, 316499, -157895, -28975, 123073, -117569, 39302, -96750, -241281, -56419, -428952, -8933, -94313, 247510, -343748, -81075, -153403, 185898, 48346, -236039, -111403, 156568, -85438, 53450, -228045, -169225, -97135, 45696, 48106, -61508, -229319, -128194, 54231, -49102, 107741, -300916, -75962, -382898, 93183, -202435, -336516, 212637, -129819, -101286, 304239, 837775, 241862, -113879, -134073, -308617, -240641]
8915b40641J7341A42045a37199c4060E0130e8783C833a76491B13377F8117k8532
8904C9585A9523L3667a14467m3375P2704o3930A90365J51343b03119f905l73893
8893c80798A25991h214j37473a343r0382b5064A06304a92454E9622a4263j53919
8882a68182a0542j11025L6054B56586b76948A12362R2448e7828l21852J00627
8872b79053a37609A20295d1255o6032j25387J07040L2069H9915K60839b17460
$$ y = [-240641, -223300, 142045, -137199, -34060, 50130, -58783, 3833, -176491, 213377, 68117, 39585, 19523, 53190, -114467, -157842, -85138, -149068, 190365, 341708, -203119, -6905, -380798, 125991, -8214, -145687, -1343, -91725, -25064, 106304, -192454, 59622, -14263, -168182, -10542, -121567, -85513, 256586, -276948, 112362, 204810, -57828, -379680, -279053, -137609, 120295, -41255, -107287, -232674, -125634, -93565, 89915, 350754, -217460]
$$ [...]
##END NTUPLES=NMR SPECTRUM
##END=
