##TITLE=AC1738_SEN00011_9276187_vwu7jyrfVx
##JCAMPDX= 6.0         $$ Bruker NMR JCAMP-DX V2.0
##DATA TYPE= NMR SPECTRUM
##DATA CLASS= NTUPLES
##ORIGIN= BRUKER
##OWNER= Administrator
$$ 1.72 TOPSPIN		Version 2.1
$$ 2015-07-14 23:26:46.807 -0700  Administrator@X
$$ Compression mode = diff/dup
##.OBSERVE FREQUENCY= 400.02188249412
##.OBSERVE NUCLEUS= ^1H
##.ACQUISITION MODE= SIMULTANEOUS (DQD)
##.ACQUISITION SCHEME= undefined
##.AVERAGES= 64
##.DIGITISER RES= 22
##SPECTROMETER/DATA SYSTEM= spect
##.PULSE SEQUENCE= noesygpps1d.comp
##.SOLVENT NAME= COFFEE_meoh
##.SHIFT REFERENCE= INTERNAL, COFFEE_meoh, 1, 14.96117
##AUDIT TRAIL= $$ (NUMBER, WHEN, WHO, WHERE, PROCESS, VERSION, WHAT)
$$ ##TITLE= Audit trail, TOPSPIN		Version 2.1
$$ ##JCAMPDX= 5.01
$$ ##ORIGIN= Bruker BioSpin GmbH
$$ ##OWNER= Administrator
$$ $$ E:\/data/COFFEE/nmr/AC1738_SEN00011_9276187_vwu7jyrfVx/12/pdata/1/auditp.txt
$$ ##AUDIT TRAIL=  $$ (NUMBER, WHEN, WHO, WHERE, PROCESS, VERSION, WHAT)
(   1,<2015-07-14 23:26:41.713 -0700>,<Administrator>,<X>,<go>,<TOPSPIN 2.1>,
      <created by zg
	started at 2015-07-14 23:15:11.994 -0700,
	POWCHK enabled, PULCHK disabled,
       configuration hash MD5:
       21 0F 79 D6 B3 7B B4 F6 88 20 88 DB 03 48 BD 9F
       data hash MD5: 64K
       51 74 7A 3C 0C 40 2B 79 58 44 69 E5 70 6F 00 CC>)
(   2,<2015-07-14 23:26:44.854 -0700>,<Administrator>,<X>,<proc1d>,<TOPSPIN 2.1>,
      <Start of raw data processing
       efp LB = 0.3 FT_mod = 6 PKNL = 1 PHC0 = 0 PHC1 = 0 SI = 128K 
       data hash MD5: 128K
       64 F4 42 41 EE EA CD 5A 71 10 6C B8 AB 73 2E 7D>)
(   3,<2015-07-14 23:26:45.885 -0700>,<Administrator>,<X>,<proc1d>,<TOPSPIN 2.1>,
      <pk PHC0 = 269.967 PHC1 = 0 
       data hash MD5: 128K
       7F 60 D1 AD C2 95 55 03 31 0C 42 35 95 3B FF BE>)
(   4,<2015-07-14 23:26:46.307 -0700>,<Administrator>,<X>,<proc1d>,<TOPSPIN 2.1>,
      <abs ABSG = 1 
       data hash MD5: 128K
       30 4F 09 74 FC 17 7C A1 DB 0F B9 2B 3E 5D BB D5>)
(   5,<2015-07-14 23:26:46.400 -0700>,<Administrator>,<X>,<proc1d>,<TOPSPIN 2.1>,
      <abs ABSG = 2 
       data hash MD5: 128K
       96 0B AD 2C 50 8C CD BA 68 FC E6 23 54 36 62 E8>)
(   6,<2015-07-14 23:26:46.479 -0700>,<Administrator>,<X>,<proc1d>,<TOPSPIN 2.1>,
      <abs ABSG = 3 
       data hash MD5: 128K
       07 76 36 0C B7 0C 28 95 04 96 A2 CA F4 F6 F6 79>)
(   7,<2015-07-14 23:26:46.557 -0700>,<Administrator>,<X>,<proc1d>,<TOPSPIN 2.1>,
      <abs ABSG = 4 
       data hash MD5: 128K
       1D E1 33 B6 DB 6E 32 DA E9 37 EE 12 DE 6C 9D 66>)
(   8,<2015-07-14 23:26:46.650 -0700>,<Administrator>,<X>,<proc1d>,<TOPSPIN 2.1>,
      <abs ABSG = 5 
       data hash MD5: 128K
       81 A5 49 04 0C 94 A2 D5 9D 95 8D E4 73 06 82 F5>)
$$ ##END=
$$ 
$$ $$ hash MD5
$$ $$ 4F 61 36 A1 FE 9C 0F 9E 6F 24 6F DF A5 6F 96 D9
##$RELAX= 
##$RELAX= 
##$RELAX= 
##$RELAX= 
##$RELAX= 
##$RELAX= 
##$RELAX= 
##$RELAX= 
$$ Bruker specific parameters
$$ --------------------------
##$DU= <E:\>
##$EXPNO= 12
$$ [...]
150 150 150 150 150 150 150 150
##$TP07= 0
##$TPNAME0= <>
##$TPNAME1= <>
##$TPNAME2= <>
##$TPNAME3= <>
##$TPNAME4= <>
##$TPNAME5= <>
##$TPNAME6= <>
##$TPNAME7= <>
##$TPOAL= (0..7)
0.5 0.5 0.5 0.5 0.5 0.5 0.5 0.5
##$TPOFFS= (0..7)
0 0 0 0 0 0 0 0
##$TUNHIN= 0
##$TUNHOUT= 0
##$TUNXOUT= 0
##$USERA1= <user>
##$USERA2= <user>
##$USERA3= <user>
##$USERA4= <user>
##$USERA5= <user>
##$V9= 5
##$VALIST= <valist>
##$VCLIST= <CCCCCCCCCCCCCCC>
##$VD= 0
##$VDLIST= <DDDDDDDDDDDDDDD>
##$VPLIST= <PPPPPPPPPPPPPPP>
##$VTLIST= <TTTTTTTTTTTTTTT>
##$WBST= 2048
##$WBSW= 25
##$XGAIN= (0..3)
0 0 0 0
##$XL= 0
##$YL= 0
##$YMAX_a= 6541871
##$YMIN_a= -12069914
##$ZGOPTNS= <>
##$ZL1= 120
##$ZL2= 120
##$ZL3= 120
##$ZL4= 120
##$ABSF1= 14.96117
##$ABSF2= -5.597012
##$ABSG= 5
##$ABSL= 3
##$ALPHA= 0
##$AQORDER= 0
##$ASSFAC= 0
##$ASSFACI= 0
##$ASSFACX= 0
##$ASSWID= 0
##$AUNMP= <proc_prof1d_extract.lims>
##$AXLEFT= 0
##$AXNAME= <>
##$AXNUC= <1H>
##$AXRIGHT= 0
##$AXTYPE= 0
##$AXUNIT= <>
##$AZFE= 0.1
##$AZFW= 0.1
##$BCFW= 0
##$BC_mod= 0
##$BYTORDP= 0
##$COROFFS= 0
##$CY= 15
##$DATMOD= 1
##$DC= 0
##$DFILT= <>
##$DTYPP= 0
##$F1P= 0
##$F2P= 0
##$FCOR= 0.5
##$FTSIZE= 131072
##$FT_mod= 6
##$GAMMA= 0
##$GB= 0
##$INTBC= 1
##$INTSCL= 1
##$ISEN= 128
##$LB= 0.3
##$LEV0= 0
##$LPBIN= 0
##$MAXI= 10000
##$MC2= 0
##$MEAN= 0
##$ME_mod= 0
##$MI= 0
##$NCOEF= 0
##$NC_proc= -2
##$NLEV= 6
##$NOISF1= 0
##$NOISF2= 0
##$NSP= 0
##$NTH_PI= 0
##$NZP= 0
##$OFFSET= 14.96117
##$PC= 1
##$PHC0= 269.967
##$PHC1= 0
##$PH_mod= 1
##$PKNL= yes
##$PPARMOD= 0
##$PPDIAG= 0
##$PPIPTYP= 0
##$PPMPNUM= 2147483647
##$PPRESOL= 1
##$PSCAL= 4
##$PSIGN= 0
##$PYNMP= <proc.py>
##$REVERSE= no
##$SF= 400.02000956811
##$SI= 131072
##$SIGF1= 0
##$SIGF2= 0
##$SINO= 400
##$SIOLD= 131072
##$SPECTYP= <>
##$SREGLST= <1H.CDCl3>
##$SSB= 0
##$STSI= 131072
##$STSR= 0
##$SW_p= 8223.68421052631
##$SYMM= 0
##$S_DEV= 0
##$TDeff= 65536
##$TDoff= 0
##$TI= <>
##$TILT= no
##$TM1= 0
##$TM2= 0
##$TOPLEV= 0
##$USERP1= <user>
##$USERP2= <user>
##$USERP3= <user>
##$USERP4= <user>
##$USERP5= <user>
##$WDW= 1
##$XDIM= 131072
##$YMAX_p= 379008122
##$YMIN_p= -11803
##$CURPLOT= <Network HP LaserJet P1505>
##$CURPRIN= <$Network HP LaserJet P1505>
##$DFORMAT= <normdp>
##$LAYOUT= <+/1D_H.xwp>
##$LFORMAT= <normlp>
##$PFORMAT= <normpl>
##$SURQMSG= 1
$$ End of Bruker specific parameters
$$ ---------------------------------
##NTUPLES= NMR SPECTRUM
##VAR_NAME=  FREQUENCY,     SPECTRUM/REAL,   SPECTRUM/IMAG
##SYMBOL=    X,             R,               I
##VAR_TYPE=  INDEPENDENT,   DEPENDENT,       DEPENDENT
##VAR_FORM=  AFFN,          ASDF,            ASDF
##VAR_DIM=   131072,        131072,          131072
##UNITS=     HZ,            ARBITRARY UNITS, ARBITRARY UNITS
##FACTOR=    0.0627417313425164, 1,          1
##FIRST=     8223.62146879497, 1394,         -56263
##LAST=      0,             3010,            -56879
##MIN=       0,             -11803,          0
##MAX=       8223.62146879497, 379008122,    0
$$ Real data points
##PAGE= N=1
##DATA TABLE= (X++(R..R)), XYDATA
$$ [...]
63877F32140k994m46J845M053O727R767J2273J3784J4998J6689J8523J9782K0717
$$ 632140 629146 628700 630545 634598 641325 651092 663365 677149 692147 708836 727359 747141 767858
63864G67858K2202K4169K5426K5198K4008K2807K1911K1078J9929J7969J4888
$$ 767858 790060 814229 839655 864853 888861 911668 933579 954657 974586 992555 1007443
63853A007443J1142P733N010K268j133m943q751j2713j6849k0365k2617k4238
$$ 1007443 1018585 1026318 1031328 1033596 1032463 1027520 1018769 1006056 989207 968842 946225 921987
63841I21987k6272k8495k9735k9757k9606k9956l0189k9631k8700k8174k7964
$$ 921987 895715 867220 837485 807728 778122 748166 717977 688346 659646 631472 603508
63830F03508k7272k5636k3321k0878j8813j7414j6577j5914j5167j4373j3436
$$ 603508 576236 550600 527279 506401 487588 470174 453597 437683 422516 408143 394707
63819C94707j2051j0243q649p864p705p470o730n648m632l946l552l212k825k661
$$ 394707 382656 372413 363764 355900 348195 340725 333995 328347 323715 319769 316217 313005 310180 307519
63805C07519k993l483l398k558j643j340j594k043k634l353l748l394k609k159
$$ 307519 304526 301043 297645 295087 293444 292104 290510 288467 285833 282480 278732 275338 272729 270570
63791B70570k248k371k195k007k190k644k953k857k381j641q21j88j8l42q17r51
$$ 270570 268322 265951 263756 261749 259559 256915 253962 251105 248724 247083 246262 246074 246056 245714 244897 243946
63775B43946n93j70k11o98j078r84o11l09j53j08k61n69o88l50K30O34O94M84
$$ 243946 243353 243183 242972 242274 241196 240212 239601 239292 239139 239031 238770 238201 237513 237163 237393 238027 238721 239205
63757B39205J00k59k99k6Q3k63o22l87L33R00J105J357J907K398K377J884J382
$$ 239205 239305 239046 238747 238721 238804 238541 237919 237532 237865 238765 239870 241227 243134 245532 247909 249793 251175
63740B51175J347J911K692K997K521J836J809K528L115K771J721R88J400K819
$$ 251175 252522 254433 257125 260122 262643 264479 266288 268816 271931 274702 276423 277411 278811 281630
63726B81630M300N050N278N863P045P916P595O481N700N546N280M418L386K647
$$ 281630 285930 290980 296258 302121 309166 317082 324677 331158 336858 342404 347684 352102 355488 358135
63712C58135J972R48k96j344k068k598k960l176l452l890m127l637k407j076l70
$$ 358135 360107 361055 360759 359415 357347 354749 351789 348613 345161 341271 337144 333507 331100 330024 329654
63697C29654m34o96m61L56J165J511J642K030K563K790K708K695K659J990N94
$$ 329654 329220 328524 328063 328419 329584 331095 332737 334767 337330 340120 342828 345523 348182 350172 350766
63682C50766o87j026n37R5L82K10k86o54l87M05J014J186J571K611L540L300K103
$$ 350766 350079 349053 348516 348611 348993 349203 348917 348263 347876 348281 349295 350481 352052 354663 358203 361503 363606
63665C63606J236J352J815J754J103K84n05j299j983k376k646l238m345n547o121
$$ 363606 364842 366194 368009 369763 370866 371150 370645 369346 367363 364987 362341 359103 354758 349211 343090
63650C43090n764m907m214l886l604l060k215j126M5P77N79k05m91K46J281J705
$$ 343090 337326 332419 328205 324319 320715 317655 315440 314314 314359 315136 315715 315510 315019 315265 316546 318251
63634C18251J678J995K826L618M073M473N022N531N866O158O470O700O993P687
$$ 318251 319929 321924 324750 328368 332441 336914 341936 347467 353333 359491 365961 372661 379654 387341
63620C87341Q780R876J0832J1980J3518J5094J6344J7470J8984K0973K2962K4397
$$ 387341 396121 405997 416829 428809 442327 457421 473765 491235 510219 531192 554154 578551
63608E78551K5118K5433K5846K6629K7523K7870K6949K4272J9834J4322Q933M525
$$ 578551 603669 629102 654948 681577 709100 736970 763919 788191 808025 822347 831280 835805
63596H35805J009k183n101p150p960p934p885q378r545j1145j2750j4106j5360
$$ 835805 836814 834631 829530 822380 814420 806486 798601 790223 780678 769533 756783 742677 727317
63583G27317j6715j7891j8340j7961j7173j6250j5055j3511j1803j0010q054o190
$$ 727317 710602 692711 674371 656410 639237 622987 607932 594421 582618 572608 564554 558364
63571E58364m904m063k801o56J659L166L801M151M470M650M891N637O877Q160
$$ 558364 553460 549397 546596 545940 547599 550765 554566 558717 563187 567837 572728 578365 585242 593402
63557E93402R217J0088J0685J0948J1389J2826J5355J8169K0640K2999K5663K8423
$$ 593402 602619 612707 623392 634340 645729 658555 673910 692079 712719 735718 761381 789804
63545G89804L0758L2518L3732L3907L2115K7822K1389J3770O057p27n826q980
$$ 789804 820562 853080 886812 920719 952834 980656 1002045 1015815 1021872 1021145 1015319 1006339
63533A006339j0373j0331r237p746o761o868p929r464j1370j3973j7346k0891
$$ 1006339 995966 985635 976398 968652 961891 955023 947094 937630 926260 912287 894941 874050
63521H74050k3844k6005k7698k9142l0063k9972k8652k6360k3751k1526j9935
$$ 874050 850206 824201 796503 767361 737298 707326 678674 652314 628563 607037 587102
63510E87102j8648j7276j5886j4722j3549j1868r810q198p400o723n476m145l728
$$ 587102 568454 551178 535292 520570 507021 495153 485343 477145 469745 463022 457546 453401 449673
63497D49673m121m084k963j612j218j790k394k491k360k261j905j016NM30J41
$$ 449673 445552 441468 438505 436893 435675 433885 431491 429000 426640 424379 422474 421458 421463 421893 422034
63482D22034j91J06J019K072K979L803M555N041N131M887M289L229J845O16j82
$$ 422034 421843 421949 422968 425040 428019 431822 436377 441418 446549 451436 455725 458954 460799 461415 461233
63467D61233q60j885l226m402n025n007m428l592l040l114l480l486k954k238
$$ 461233 460373 458488 455262 450860 445835 440828 436400 432808 429768 426654 423174 419688 416734 414496
63453D14496j561p82J68J057J743K415L270M303N505O881Q096Q647Q621Q859R942
$$ 414496 412935 412153 412321 413378 415121 417536 420806 425109 430614 437495 445591 454238 462859 471718 481660
63438D81660J1474J2778J3992J5885J8749K1958K4586K5995K5889K4261K1459
$$ 481660 493134 505912 519904 535789 554538 576496 601082 627077 652966 677227 698686
63427F98686J8068J4605J1477R125P889P769Q541J0102J2419J5278J8371K1616
$$ 698686 716754 731359 742836 751961 759850 767619 776160 786262 798681 813959 832330 853946
63415H53946K4990K8092L0233L0933L0009K7226K2473J6392J0257M895J16m418
$$ 853946 878936 907028 937261 968194 998203 1025429 1047902 1064294 1074551 1079446 1079562 1075144
63403A075144q258j0604j1397j1437j1480j1820j2697j4518j7314k0353k2716
$$ 1075144 1066886 1056282 1044885 1033448 1021968 1010148 997451 982933 965619 945266 922550
63392I22550k4227k5510k7116k8750k9465k8567k6260k3459k1018j9198j7705
$$ 922550 898323 872813 845697 816947 787482 758915 732655 709196 688178 668980 651275
63381F51275j6109j4117j1718r192o958n224l719j887N45L210N401O752P613Q617
$$ 651275 635166 621049 609331 600139 593181 587957 584238 582351 582896 586106 591507 598259 605872 614489
63367F14489R928J1144J2033J3072J4870J7220J9230K0466K1490K3038K5080K7098
$$ 614489 624417 635561 647594 660666 675536 692756 711986 732452 753942 776980 802060 829158
63355H29158K8912L0623L1911L2010L0561K7961K4742K0917J6279J0958N454K98
$$ 829158 858070 888693 920604 952614 983175 1011136 1035878 1056795 1073074 1084032 1089486 1089784
63343A089784m036p145q959r917j0616j1290j1893j2528j3549j5209j7445k0016
$$ 1089784 1085748 1078603 1069644 1059727 1049111 1037821 1025928 1013400 999851 984642 967197 947181
63331I47181k2581k4624k5649k5572k4773k3629k2150k0166j7735j5169j2719
$$ 947181 924600 899976 874327 848755 823982 800353 778203 758037 740302 725133 712414
63320G12414j0319p700m831k434j867m062q388j2955j6190j7850j8389j7988j6758
$$ 712414 702095 694395 689564 687130 685263 681201 672813 659858 643668 625818 607429 589441 572683
63307E72683j5380j4587j4072j2812j0648q655p609o908n662m151l347l415l601
$$ 572683 557303 542716 528644 515832 505184 496529 488920 482012 476350 472199 468852 465437 461836
63294D61836l523l628m226m868m998m660m232l915l846m174m718m844m158l029
$$ 461836 458313 454685 450459 445591 440593 435933 431701 427786 423940 419766 415048 410204 406046 403017
63280D03017k147j786j822k184k789l290l369l169l028k796j991o39N16Q52N68
$$ 403017 400870 399084 397262 395078 392289 388999 385630 382461 379433 376637 374646 374007 374523 375375 375943
63265C75943L22M35P09Q34O97L29j36l84L8J301K887L826L642K954K809L396L960
$$ 375943 376265 376700 377409 378243 378940 379269 379133 378749 378787 380088 382975 386801 390443 393397 396206 399602 403562
63248D03562M064M361N591P315Q410Q616Q783R533J0536J1427J2572J4391J6425
$$ 403562 407626 411987 417578 424893 433303 441919 450702 460235 470771 482198 494770 509161 525586
63235E25586J7902J8901K0234K2223K4253K5652K6486K7213K7981K8593K8921
$$ 525586 543488 562389 582623 604846 629099 654751 681237 708450 736431 765024 793945
63224G93945K8975K8741K8221K7648K7361K7396K7394K7055K6550K6339K6605
$$ 793945 822920 851661 879882 907530 934891 962287 989681 1016736 1043286 1069625 1096230
63213A096230K6963K6747K5478K3043J9582J5285J0266M495k003q829j5216k0572
$$ 1096230 1123193 1149940 1175418 1198461 1218043 1233328 1243594 1248089 1246086 1237257 1222041 1201469
63201A201469k5004k9097l3065l6315l7956l7700l6078l3904l1584k9063k6236
$$ 1201469 1176465 1147368 1114303 1077988 1040032 1002332 966254 932350 900766 871703 845467
63190H45467k3250k0321j7397j4217j0705p130l805p73K102M882P491R748J1405
$$ 845467 822217 801896 784499 770282 759577 752447 748642 747869 749971 754853 762344 772092 783497
63177G83497J2404J3126J4086J5201J5743J5273J4203J3115J2043J1006J0586
$$ 783497 795901 809027 823113 838314 854057 869330 883533 896648 908691 919697 930283
63166I30283J1105J1507J0273P416M363J756j358n611r957j3161j5589j8325k1295
$$ 930283 941388 952895 963168 970584 974947 976703 975345 969734 959777 946616 931027 912702 891407
63153H91407k3558k4985k6246k7294k7243k5900k4189k2799k1404j9575j7517
$$ 891407 867849 842864 816618 789324 762081 736181 711992 689193 667789 648214 630697
63142F30697j5518j3531j1713j0476r599q195o093m365l756l473k390p82L06P75
$$ 630697 615179 601648 589935 579459 569860 561665 555572 551207 547451 543978 541588 540806 541112 541887
63128E41887J383K194K497K268K455L421M293M348M176M672N556N767M943L767
$$ 541887 543270 545464 547961 550229 552684 556105 560398 564746 568922 573594 579150 584917 589860 593627
63114E93627K942K554K415K388K268J794J006L16j7k42p54j515k061k057j649
$$ 593627 596569 599123 601538 603926 606194 607988 608994 609310 609293 609051 608297 606782 604721 602664 601015
63099F01015j303j339j651j825j500p10J06M62K69p6o5M71J310K183K987L652
$$ 601015 599712 598373 596722 594897 593397 592687 592793 593255 593524 593448 593383 593854 595164 597347 600334 603986
63083F03986L968L775L258K854K853L222L784M438N122N742O241O670P102P621
$$ 603986 607954 611729 614987 617841 620694 623916 627700 632138 637260 643002 649243 655913 663015 670636
63069F70636Q364R469J0825J2090J3115J4265J6024J8290K0333K1643K2624K4195
$$ 670636 679000 688469 699294 711384 724499 738764 754788 773078 793411 815054 837678 861873
63057H61873K6782K9911L2862L5524L8420M1974M6017N0056N3802N7290O0575
$$ 861873 888655 918566 951428 986952 1025372 1067346 1113363 1163419 1217221 1274511 1335086
63046A335086O3582O6220O8448P0068P0706P0208O8951O7635O6657O5848O4766
$$ 1335086 1398668 1464888 1533336 1603404 1674110 1744318 1813269 1880904 1947561 2013409 2078175
63035B078175O3231O1514O0158N9499N9156N8039N5040M9880M3136L5375K6481
$$ 2078175 2141406 2202920 2263078 2322577 2381733 2439772 2494812 2544692 2587828 2623203 2649684
63024B649684J5951L707r607k3065l5973m8061n9342o9696p8443q4444q7059q6934
$$ 2649684 2665635 2669342 2659735 2636670 2600697 2552636 2493294 2423598 2345155 2260711 2173652 2086718
63012B086718q5464q3383q0187p5141o8393o0813n3077m5320l7570l0025k2892
$$ 2086718 2001254 1917871 1837684 1762543 1694150 1633337 1580260 1534940 1497370 1467345 1444453
63001A444453j6257j0157m548P67N883J0494J4150J6813J8900K0718K2176K3170
$$ 1444453 1428196 1418039 1413491 1414258 1420141 1430635 1444785 1461598 1480498 1501216 1523392 1546562
62989A546562K3818K4218K4258K3904K3389K2807K1751J9654J6422J2396P873
$$ 1546562 1570380 1594598 1618856 1642760 1666149 1688956 1710707 1730361 1746783 1759179 1767052
62978A767052K880k582q435j4679k1348k8234l4823m0603m5285m8758n0991n2080
$$ 1767052 1769932 1767350 1758915 1744236 1722888 1694654 1659831 1619228 1573943 1525185 1474194 1422114
62966A422114n2249n1731n0643m9047m7011m4607m1936l9093l6172l3332l0898
$$ 1422114 1369865 1318134 1267491 1218444 1171433 1126826 1084890 1045797 1009625 976293 945395
62955I45395k9126k7861k6632k5297k4233k3604k2796k1200j9306j8212j8048
$$ 945395 916269 888408 861776 836479 812246 788642 765846 744646 725340 707128 689080
62944F89080j7707j6447j4880j3878j3267j2413j1416j0804j0342r344p981p200
$$ 689080 671373 654926 640046 626168 612901 600488 589072 578268 567926 558582 550601 543401
62932E43401p116o679n373m194m180m804m770l864l008k766k793k683k498k390
$$ 543401 536285 529606 524233 520039 515859 511055 506285 502421 499413 496647 493854 491171 488673 486283
62918D86283k302k251k228j955j320r86j702k996l500k809k015k029k441k637
$$ 486283 483981 481730 479502 477547 476227 475241 473539 470543 467043 464234 462219 460190 457749 455112
62904D55112k957l773m289l549k079j185r46l27P74J174L92m30l03J11k77j192
$$ 455112 452155 448382 444093 440544 438465 437280 436334 436007 436781 437955 438347 437917 437614 437725 437448 436256
62888D36256j458p18L20R86J102O33j89n89PR97J245O40J47K39K80j78n40j46
$$ 436256 434798 434080 434400 435386 436488 437121 436932 436343 436350 437347 438592 439232 439379 439618 439898 439720 439180 439034
62870D39034O30J019R78R10O81r9j070j319o49J29L57K26L7l72r70j019j0J273
$$ 439034 439664 440683 441661 442571 443252 443153 442083 440764 440115 440244 440601 440827 440864 440492 439522 438503 438493 439766
62852D39766J525O74OM09J299J699J658J888K444K536J645J87j050j629j513q79
$$ 439766 441291 441965 441971 442380 443679 445378 447036 448924 451368 453904 455549 455736 454686 453057 451544 450665
62836D50665j24K95L12L17N27O44M43L92J116K388L190K893J970J375J511K021
$$ 450665 450541 450836 451148 451465 451992 452636 453079 453471 454587 456975 460165 463058 465028 466403 467914 469935
62820D69935K399K474K476K761L456M247M655M592M550M998N787O339O329N943
$$ 469935 472334 474808 477284 480045 483501 487748 492403 496995 501545 506543 512330 518669 524998 530941
62806E30941N503N212N286N933P006P965Q520R060J0103J1428J2272J2427J2690
$$ 530941 536444 541656 546942 552875 559881 567846 576366 585426 595529 606957 619229 631656 644346
62793F44346J3929J6095J8501K0801K3246K6094K9299L2884L7108M1976M6951
$$ 644346 658275 674370 692871 713672 736918 763012 792311 825195 862303 904279 951230
62782I51230N1535N5998O1147O7324P3967Q0183Q5572R0363R4879R9046J02404
$$ 951230 1002765 1058763 1119910 1187234 1261201 1341384 1426956 1517319 1612198 1711244 1813648
62771A813648J04478J05040J03915J00559R4109Q4142P1332N7000M1890K5648
$$ 1813648 1918126 2023166 2127081 2227640 2321749 2405891 2477223 2534223 2576113 2601761
62761B601761P813j0955k9005m5079n9125p1599q2374r0705r6139r9012j00026
$$ 2601761 2609574 2598619 2569614 2524535 2465410 2393811 2311437 2220732 2124593 2025581 1925555
62750A925555r9668r8170r5731r2485q8429q3631p8440p3302o8308o3224n7942
$$ 1925555 1825887 1727717 1631986 1539501 1451072 1367441 1289001 1215699 1147391 1084167 1026225
62739A026225n2701m7736m2956l8211l3748l0046k7138k4452k1581j8870j6838
$$ 1026225 973524 925788 882832 844621 810873 780827 753689 729237 707656 688786 671948
62728F71948j5264j3418j1298r787r212q541o793m668l598l459k609m31J642K377
$$ 671948 656684 643266 631968 622181 612969 604428 597635 592967 589369 585910 583301 582870 584512 586889
62714E86889K702M172O476Q053Q739J0056J2775J5793J7946J9623K1811K4576
$$ 586889 589591 593763 600239 608292 617031 627087 639862 655655 673601 693224 715035 739611
62702G39611K7396L0248L3370L6482L9190M1799M4934M8424N1456N3757N5864
$$ 739611 767007 797255 830625 867107 906297 948096 993030 1041454 1092910 1146667 1202531
62691A202531N8041N9584N9491N7501N4149M9982M4886L8239K9687J9714R272
$$ 1202531 1260572 1320156 1379647 1437148 1491297 1541279 1586165 1624404 1654091 1673805 1683077
62680A683077j053j1238k1217l0552l8896m6257n2526n7213o0052o1426o1761
$$ 1683077 1682024 1670786 1649569 1619017 1580121 1533864 1481338 1424125 1364073 1302647 1240886
62669A240886o0882n8576n5372n2160m9286m6553m3844m1051l7734l3710k9758
$$ 1240886 1180004 1121428 1066056 1013896 964610 918057 874213 833162 795428 761718 731960
62658G31960k6867k4820k2468j9431j6629j4858j3804j2816j1852j1106j0408
$$ 731960 705093 680273 657805 638374 621745 606887 593083 580267 568415 557309 546901
62647E46901r535q628p785o758n515m631m424m251l361k080j391j404j195k75
$$ 546901 537366 528738 520953 514195 508680 504049 499625 495374 492013 489933 488542 487138 485943 485668
62633D85668N61L06q57j740j615r97q82j523k233k266j537m78M70J015J002O96
$$ 485668 486229 486535 485678 483938 482323 481326 480444 478921 476688 474422 472885 472407 472877 473892 474894 475590
62617D75590Q22J839L232M080M248M468N180N998O566P246Q440R757J0435J0381
$$ 475590 476412 478251 481483 485563 489811 494279 499459 505457 512023 519269 527709 537466 547901 558282
62603E58282J0314J0981J2634J5142J8171K1299K4212K6873K9434L2115L5199
$$ 558282 568596 579577 592211 607353 625524 646823 671035 697908 727342 759457 794656
62592G94656L8840M2700M6078M8529N0129N0977N0826M9408M6771M2967L7801
$$ 794656 833496 876196 922274 970803 1020932 1071909 1122735 1172143 1218914 1261881 1299682
62581A299682L1174K3431J5024O183k824j1492j9486k6829l3377l8552m2142m4807
$$ 1299682 1330856 1354287 1369311 1375494 1372670 1361178 1341692 1314863 1281486 1242934 1200792 1155985
62569A155985m7140m8658m8520m6892m4740m2492l9855l6886l4259l2218l0138
$$ 1155985 1108845 1060187 1011667 964775 920035 877543 837688 800802 766543 734325 704187
62558G04187k7464k4479k1742j9365j7148j5053j3209j1756j0836j0354r698q228
$$ 704187 676723 652244 630502 611137 593989 578936 565727 553971 543135 532781 523083 514855
62546E14855o169m495l743l435k943k320j919j690j370j026r00j009j208j380
$$ 514855 508686 504191 500448 497013 494070 491750 489831 488141 486771 485745 484845 483836 482628 481248
62532D81248j302o09P03K017K722K910L134L690M540N687P201Q949J0669J2236
$$ 481248 479946 479337 480040 482057 484779 487689 490823 494513 499053 504740 511941 520890 531559 543795
62518E43795J3689J5147J6955J9589K2980K6194K8325K9602L1126L3466L5997
$$ 543795 557484 572631 589586 609175 632155 658349 686674 716276 747402 780868 816865
62507H16865L7752L8458L8556L8460L8089L6914L4383L0398K5468K0337J5421
$$ 816865 854617 893075 931631 970091 1008180 1045094 1079477 1109875 1135343 1155680 1171101
62496A171101J0832O814L860K167J402J197J816L891P454J1578J5281J8607K2394
$$ 1171101 1181933 1188747 1192607 1194774 1196176 1197373 1199189 1203080 1210534 1222112 1237393 1256000 1278394
62483A278394K6873L1033L3746L5148L6160L6722L5299L0576K3014J4299N693
$$ 1278394 1305267 1336300 1370046 1405194 1441354 1478076 1513375 1543951 1566965 1581264 1586957
62472A586957k498j0380j8236k6697l6248m6270n5182o1680o5457o6722o5788
$$ 1586957 1584459 1574079 1555843 1529146 1492898 1446628 1391446 1329766 1264309 1197587 1131799
62461A131799o3425o0840n8578n5892n1845m6749m1797l7472l3205k8657k4505
$$ 1131799 1068374 1007534 948956 893064 841219 794470 752673 715201 681996 653339 628834
62450F28834k1459j9118j6446j3124r860p397n732m375l019j776r63p23p73n52
$$ 628834 607375 588257 571811 558687 548827 541430 535698 531323 528304 526528 525565 524842 524069 523517
62436E23517J73R08R80M20j08l36q10j958l276l920l821l628l755m053m323m571
$$ 523517 523690 524598 525578 525998 525890 525554 524744 522786 519510 515590 511769 508141 504386 500333 496010 491439
62420D91439m688m483m126l998l977l494k577k125k716l715m140l985l941m134
$$ 491439 486751 482268 478142 474144 470167 466673 464096 461971 459255 455540 451400 447415 443474 439340
62406D39340m004l313k527j969j350m54K34R1o85j109m31J077K375K677K176J754
$$ 439340 435336 432023 429496 427527 426177 425723 425957 426048 425363 424254 423823 424900 427275 429952 432128 433882
62390D33882J945K451K751K924L404M152M635M612M431M443M631M949N526O269
$$ 433882 435827 438278 441029 443953 447357 451509 456144 460756 465187 469630 474261 479210 484736 491005
62376D91005O734O822P117Q118R401J0112J0176J0443J1605J3407J5084J6288
$$ 491005 497739 504561 511678 519796 529197 539309 549485 559928 571533 584940 600024 616312
62364F16312J7395J9034K1463K4375K7344L0314L3559L7120M0642M3914M7218
$$ 616312 633707 652741 674204 698579 725923 756237 789796 826916 867558 911472 958690
62353I58690N0748N3868N5404N4671N1800M7230M1290L4347K6923J9406J1919
$$ 958690 1009438 1063306 1118710 1173381 1225181 1272411 1313701 1348048 1374971 1394377 1406296
62342A406296M611k177q197j3541j8459k3139k7662l1912l5421l7629l8496l8580
$$ 1406296 1410907 1408730 1400533 1386992 1368533 1345394 1317732 1285820 1250399 1212770 1174274 1135694
62330A135694l8286l7422l5737l3572l1541k9765k7951k6105k4708k4062k3875
$$ 1135694 1097408 1059986 1024249 990677 959136 929371 901420 875315 850607 826545 802670
62319H02670k3595k2906k1820k0594j9638j9157j8708j7521j5462j3389j2178
$$ 802670 779075 756169 734349 713755 694117 674960 656252 638731 623269 609880 597702
62308E97702j1633j0777r132p269n993n425n096m638m095l562k958k178j299m81
$$ 597702 586069 575292 566160 558891 552898 547473 542377 537739 533644 530082 527124 524946 523647 523166
62294E23166K36Q34J163J085P84O86R68J374J606J718J902K109K187K268K600
$$ 523166 523402 524236 525399 526484 527268 527954 528922 530296 531902 533620 535522 537631 539818 542086 544686
62279E44686L042L154K903K862L454M382N123N677O362P080P413P550Q447J0723
$$ 544686 547728 550882 553785 556647 560101 564483 569606 575283 581645 588725 596138 603688 612135 622858
62265F22858J3728J6254J8007J9852K2496K5565K8329L0993L4516L9174M3969
$$ 622858 636586 652840 670847 690699 713195 738760 767089 798082 832598 871772 915741
62254I15741M7796N0633N3072N5041N5660N4303N1110M6398M0218L2771K4719
$$ 915741 963537 1014170 1067242 1122283 1177943 1232246 1283356 1329754 1369972 1402743 1427462
62243A427462J6711Q961J546n312j1622j7801k4097l0065l5072l8938m1702m3181
$$ 1427462 1444173 1453134 1454680 1449368 1437746 1419945 1395848 1365783 1330711 1291773 1250071 1206890
62231A206890m3353m2770m1910m0387l7640l4218l1442k9731k8148k5872k3311
$$ 1206890 1163537 1120767 1078857 1038470 1000830 966612 935170 905439 877291 851419 828108
62220H28108k1410k0480k0156j9914j9230j7801j6034j4849j4566j4401j3503
$$ 828108 806698 786218 766062 746148 726918 709117 693083 678234 663668 649267 635764
62209F35764j2014j0606r441q197o815n538m417l305k258j384m63P93K193L304
$$ 635764 623750 613144 603703 595506 588691 583153 578736 575431 573173 571789 571326 572119 574312 577616
62195E77616M069M751N408O002O773P873Q701Q445P383O881P778R376J0424J0555
$$ 577616 581685 586436 591844 597846 604619 612492 621193 629638 637021 643902 651680 661056 671480 682035
62181F82035J0330J0252J0283J0118R543Q550P442O733O707P135P640Q292R651
$$ 682035 692365 702617 712900 723018 732561 741111 748553 755286 761993 769128 776768 785060 794711
62168G94711J2227J5957K0182K4141K7546L0683L3813L6607L8389L8865L8257
$$ 794711 806938 822895 843077 867218 894764 925447 959260 995867 1034256 1073121 1111378
62157A111378L6605L3366K8008K0908J3393O855J790k411o775j1713j6711k1096
$$ 1111378 1147983 1181349 1209357 1230265 1243658 1250513 1252303 1249892 1243117 1231404 1214693 1193597
62145A193597k4914k8603l1965l4036l4185l2879l1021k9054k7005k4984k3040
$$ 1193597 1168683 1140080 1108115 1074079 1039894 1007015 975994 946940 919935 894951 871911
62134H71911k0796j7864j4591j1864j0060q660p042n228l618k317j067K69J523
$$ 871911 851115 833251 818660 806796 796736 788076 781034 775806 772188 769871 768804 769073 770596
62121G70596K557L605N081P068R054J0391J0974J1370J2114J3055J3601J3425
$$ 770596 773153 776758 781839 788907 797961 808352 819326 830696 842810 855865 869466 882891
62109H82891J2622J1189Q782N302J445j674l419l867l258j684N11K371K874J852
$$ 882891 895513 906702 915484 920786 922231 920557 917138 913271 910013 908329 908840 911211 914085 915937
62095I15937J63j050j128j28J415K857L890M682N485O196O640P141Q198R576J0362
$$ 915937 916100 915050 913922 913794 915209 918066 921956 926638 932123 938319 944959 952100 960298 969874 980236
62080I80236J0298J0356J1504J3361J4802J5487J6017J6879J8000J9227K0409
$$ 980236 990534 1000890 1012394 1025755 1040557 1056044 1072061 1088940 1106940 1126167 1146576
62069A146576K1051K0751K0019J9841K0297K0534K0274K0269K0928K1489K1226
$$ 1146576 1167627 1188378 1208397 1228238 1248535 1269069 1289343 1309612 1330540 1352029 1373255
62058A373255K0473J9557J7647J3794Q600L624o04m786r240j3308j6523j9370
$$ 1373255 1393728 1413285 1430932 1444726 1453326 1456950 1456346 1451560 1442320 1429012 1412489 1393119
62046A393119k2482k5877k9388l3033l6567l9227m0524m0849m0805m0351l9048
$$ 1393119 1370637 1344760 1315372 1282339 1245772 1206545 1166021 1125172 1084367 1044016 1004968
62035A004968l6914l4501l2159k9685k6755k3521k0607j8500j7053j5651j4015
$$ 1004968 968054 933553 901394 871709 844954 821433 800826 782326 765273 749622 735607
62024G35607j2548j1702j1237j0548r593q979r058r432r482q957p874o386m960
$$ 735607 723059 711357 700120 689572 679979 671000 661942 652510 643028 634071 626197 619811 614851
62011F14851m246m333m420l599j805K91K064L297L948M089M073M367N125O031
$$ 614851 610605 606272 601852 598253 596448 596739 598803 602100 606048 610137 614210 618577 623702 629733
61997F29733O653O787O417N532M117K347N64r91k467m168o024p516q337q844r512
$$ 629733 636386 643173 649590 655122 659239 661586 662150 661159 658692 654524 648500 640984 632647 623803 614291
61982F14291j0166j0290r920r617r527r150q221p207o592o162n438m368l208k100
$$ 614291 604125 593835 583915 574298 564771 555621 547400 540193 533601 527439 522001 517633 514425 512325
61968E12325j263j181k032l158l647l305k586j809r70j43M99J054J718K378K798
$$ 512325 511062 509881 507849 504691 501044 497739 495153 493344 492374 492231 492730 493784 495502 497880 500678
61953E00678L174L807M418M477M351N170P268R487J0603J0852J1409J2833J4737
$$ 500678 503852 507659 512077 516554 520905 526075 533343 542830 553433 564285 575694 588527 603264
61940F03264J6677J8550K0112K0885K0823K0631K1090K2227K3279K3368K2181
$$ 603264 619941 638491 658603 679488 700311 720942 742032 764259 787538 810906 833087
61929H33087K0210J8335J7021J5891J4202J1675Q559N127J526j890m614o647q488
$$ 833087 853297 871632 888653 904544 918746 930421 938980 944107 945633 943743 939129 932482 923994
61916I23994j0187j0865r716p208m615k495k99K555N852R072J2010J4574J6402
$$ 923994 913807 902942 893226 886018 881403 878908 878609 881164 887016 896088 908098 922672 939074
61903I39074J7183J7071J6295J4675J1861P946L422j290n830r668j2358j4100
$$ 939074 956257 973328 989623 1004298 1016159 1024105 1027527 1026237 1020407 1010739 998381 984281
61891I84281j5463j6653j7412j7695j7805j7751j7095j5791j4646j4483j5092
$$ 984281 968818 952165 934753 917058 899253 881502 864407 848616 833970 819487 804395
61880H04395j5498j5132j4350j3855j3916j4184j4061j3197j1697r913q081o263
$$ 804395 788897 773765 759415 745560 731644 717460 703399 690202 678505 668592 660511 654248
61868F54248m512k849j169N74K138L345M644O740R598J2330J4319J5869J7492
$$ 654248 649736 646887 645718 646292 648430 651775 656419 663159 672757 685087 699406 715275 732767
61855G32767J9143K0677K2455K4869K7588L0048L2336L4919L7558L9257L9336
$$ 732767 751910 772587 795042 819911 847499 877547 909883 944802 982360 1021617 1060953
61844A060953L8033L5944L3416L0484K6954K2489J7045J1170N449j76n947j1243
$$ 1060953 1098986 1134930 1168346 1198830 1225784 1248273 1265318 1276488 1281937 1281761 1275814 1264571
61832A264571j4798j6075j5704j4321j1774p922l525M03L647O631R385J1263J1618
$$ 1264571 1249773 1233698 1217994 1203673 1191899 1183977 1180452 1180855 1184502 1191133 1200518 1211781 1223399
61819A223399J0305P539L577j384p199j3590j9941k5452k9727l2998l5563l7251
$$ 1223399 1233704 1241243 1244820 1243436 1236237 1222647 1202706 1177254 1147527 1114529 1078966 1041715
61807A041715l7715l7093l6083l5282l4635l3551l1603k9122k7033k5846k4959
$$ 1041715 1004000 966907 930824 895542 860907 827356 795753 766631 739598 713752 688793
61796F88793k3283k0582j7712j5526j4021j2748j1448j0004q333o810o228o728
$$ 688793 665510 644928 627216 611690 597669 584921 573473 563469 555136 548326 542098 535370
61784E35370p226o582n062l829l261k704j866j427j810k235j658j83J149J717
$$ 535370 528144 521562 516500 512671 509410 506706 504840 503413 501603 499368 497710 497527 498676 500393
61770E00393J872K149K588K951L259L785M651N648O468O972P237P462P880Q650
$$ 500393 502265 504414 507002 509953 513212 516997 521648 527296 533764 540736 547973 555435 563315 571965
61756E71965R651J0346J0036Q476O222M149K604J170o15k488l686l938l951m628
$$ 571965 581616 591962 601998 610474 616696 620845 623449 624619 624004 621516 617830 613892 609941 605313
61742F05313n907o782o552n701n214n332n399m828l760k736k123j958k001j767
$$ 605313 599406 592624 586072 580371 575157 569825 564426 559598 555838 553102 550979 549021 547020 545253
61728E45253r17K67J090J327J507K074K697K775K377K160K461K900K895K347J709
$$ 545253 544336 544603 545693 547020 548527 550601 553298 556073 558450 560610 563071 565971 568866 571213 572922
61713E72922J517J771J774P86j044k679l287l066k796k960l542m349n049n214
$$ 572922 574439 576210 577984 578770 577726 575047 571760 568694 565898 562938 559396 555047 549998 544784
61699E44784m757m219m122m261m047l375k722k431k433k561k699k644k347k199
$$ 544784 540027 535808 531686 527425 523378 520003 517281 514850 512417 509856 507157 504513 502166 499967
61685D99967k556l037k902k121j489j518j773j601r97l88K1K84L72J69k33m60
$$ 499967 497411 494374 491472 489351 487862 486344 484571 482970 481973 481585 481606 481890 482262 482431 482198 481738
61669D81738j72N78J319J568J414J404J723J810J206L86J81N66P38M02J91O97
$$ 481738 481566 482144 483463 485031 486445 487849 489572 491382 492588 492974 493155 493721 494459 494861 495052 495749
61653D95749J734K740L386L550L311L113L376L788L617K875K397K523K542J930
$$ 495749 497483 500223 503609 507159 510470 513583 516959 520747 524364 527239 529636 532159 534701 536631
61639E36631J300J465K182K571K223J295Kj304k032k065k142k820l468l211k382
$$ 536631 537931 539396 541578 544149 546372 547667 547669 546365 544333 542268 540126 537306 533838 530627 528245
61624E28245k082k545k999l062l124l287l001k105j294j121j219j048p54q45j451
$$ 528245 526163 523618 520619 517557 514433 511146 508145 506040 504746 503625 502406 501358 500604 499759 498308
61609D98308k376l516m794n947o747p245p561p656p484p148o744o278n776n225
$$ 498308 495932 492416 487622 481675 474928 467683 460122 452466 444982 437834 431090 424812 419036 413811
61595D13811m497l649l310m057n350n827m957l701l089k869k264j402j076j379
$$ 413811 409314 405665 402355 398298 392948 387121 382164 378463 375374 372505 370241 368839 367763 366384
61581C66384j618j548j703k258k535k069j470j552k087k155j528r53j017j372
$$ 366384 364766 363218 361515 359257 356722 354653 353183 351631 349544 347389 345861 344908 343891 342519
61567C42519j339q11k36qj63m64n17n2O49Q53L13j79K80J405K032J722J248J264
$$ 342519 341180 340369 340133 340125 339962 339498 338981 338929 339578 340431 340744 340565 340845 342250 344282 346004 347252 348516
61549C48516J353R27L47L87J019J530J602J526J508J520J700K192K627K539K198
$$ 348516 349869 350796 351143 351530 352549 354079 355681 357207 358715 360235 361935 364127 366754 369293 371491
61534C71491K301K789K859K280J735J619J374N76k58n40o23j102j752j980j913
$$ 371491 373792 376581 379440 381720 383455 385074 386448 387024 386766 386226 385603 384501 382749 380769 378856
61519C78856k203k907l404l310k789k089j370r19q93q44j91Q47J346Q56p6o54
$$ 378856 376653 373746 370342 367032 364243 362154 360784 359865 358972 358128 357937 358784 360130 360986 360910 360256
61503C60256o20j62M55R50J115J026R49R56R60J073J473J923J911J409R27O94
$$ 360256 359636 359474 359929 360879 361994 363020 363969 364925 365885 366958 368431 370354 372265 373674 374601 375295
61487C75295L30m63j344j807j693r48M99K158K848J923L53j92P63K111K666K343
$$ 375295 375625 375162 373818 372011 370318 369370 369869 372027 374875 376798 377151 376959 377722 379833 382499 384842
61471C84842J730J171O99L85L07L00J02l22p80j080j077p03j84j04q21j797j944
$$ 384842 386572 387743 388442 388827 389134 389434 389536 389214 388434 387354 386277 385574 385390 385286 384465 382668 380724
61454C80724q43O18J245R82Q64J502K165J822O50j37J51J000J648K103K781L672
$$ 380724 379881 380499 381744 382726 383590 385092 387257 389079 389729 389592 389743 390743 392391 394494 397275 400947
61438D00947M366M652M569M117L402K975L348M174M511M018L379L255L378L134
$$ 400947 405313 409965 414534 418651 422053 425028 428376 432550 437061 441079 444458 447713 451091 454225
61424D54225K545K119J929J543Q79N36R93J940K649K758K369J612N88l64q44j059
$$ 454225 456770 458889 460818 462361 463240 463776 464769 466709 469358 472116 474485 476097 476685 476321 475477 474418
61408D74418j801l370m795m808l548k641l169m254m243k922j656j420j676j561
$$ 474418 472617 469247 464452 459644 456096 453455 450286 446032 441789 438867 437211 435791 434115 432554
61394D32554j296j654k548l027k548j536o09R5O62J031J127J055R07P09O75J212
$$ 432554 431258 429604 427056 424029 421481 419945 419336 419431 420093 421124 422251 423306 424213 424922 425597 426809
61378D26809K337L431L860L674L391L253L076K771K619K860L249L240K640J880
$$ 426809 429146 432577 436437 440111 443502 446755 449831 452602 455221 458081 461330 464570 467210 469090
61364D69090J538J668J827J727J581J699K107K788L958N606P069P680P777Q321
$$ 469090 470628 472296 474123 475850 477431 479130 481237 484025 487983 493589 500658 508338 516115 524436
61350E24436R523J0576J0988J1211J1563J1345R896P795O144N058L917K826K629
$$ 524436 533959 544535 555523 566734 578297 589642 599538 607333 613477 618535 622452 625278 627907
61337F27907L369L918L479K601K086J683O28j048k473l071l122l289l903m734
$$ 627907 631276 635194 638673 641274 643360 645043 645671 644623 642150 639079 635957 632668 628765 624031
61323F24031n162m730l726k947k680k235r94N28J276J183J247K019K815K882K666
$$ 624031 618869 614139 610413 607466 604786 602551 601557 602085 603361 604544 605791 607810 610625 613507 616173
61308F16173L188M513N662O077O401P427Q783R203P919N307K274n39k876m681
$$ 616173 619361 623874 629536 635613 642014 649441 658224 667427 675346 680653 682927 682388 679512 674831
61294F74831o055p150p922q205q141q217q676r124r033q352p285n759l637j347
$$ 674831 668776 661626 653704 645499 637358 629141 620465 611341 602308 593956 586671 580912 577275 575928
61280E75928L07J044J396J985K933M057N289O600P798Q623Q918Q627P886P172
$$ 575928 576235 577279 578675 580660 583593 587650 592939 599539 607337 615960 624878 633505 641391 648563
61266F48563P072P701Q566R203R691J0389J1350J2286J2935J3319J3545J3525
$$ 648563 655635 663336 671902 681105 690796 701185 712535 724821 737756 751075 764620 778145
61254G78145J2874J1227Q738O100L856J879j48k017l304m245n548p265q545q849
$$ 778145 791019 802246 810984 817084 820940 822819 822671 820654 817350 813105 807557 800292 791747 782898
61240G82898q648q640q825q895q860q742q161o929n653n019m810m362l715l437
$$ 782898 774250 765610 756785 747890 739030 730288 722127 715198 709545 704526 699716 695354 691639 688202
61226F88202l459k904j287Q00K360K831K237J090K49K84Q89J306J321J301J318
$$ 688202 684743 681839 680552 681352 683712 686543 688780 689870 690119 690403 691292 692598 693919 695220 696538
61211F96538R89K91k63m76p67j286j463r12r2M96J163K440M127N717P369R617
$$ 696538 697527 697818 697555 697079 696312 695026 693563 692651 692559 693055 694218 696658 700785 706502 713871 723488
61195G23488J2350J4828J6644J7866J8338J7629J5849J3723J1631R249O477M021
$$ 723488 735838 750666 767310 785176 803514 821143 836992 850715 862346 871595 878072 882093
61183H82093K559J804J041J85l12m56r11k093l618m854n682o422p283q113q668
$$ 882093 884652 886456 887497 887682 887370 886914 886003 883910 880292 875438 869756 863334 856051 847938 839270
61168H39270q908r049r341r797j0162j0271j0308j0554j0917j1037j0862j0646
$$ 839270 830362 821313 811972 802175 792013 781742 771434 760880 749963 738926 728064 717418
61156G17418j0261r014o581l770j785q22l3J163K329K770K459J795Q24q14l273
$$ 717418 707157 698143 691562 687792 686007 685185 685152 686315 688644 691414 693873 695668 696492 695678 692405
61141F92405o197q968j0979j1835j1501j0331q814p310o004m864l571j755M12
$$ 692405 686208 677240 666261 654426 642925 632594 623780 616470 610466 605602 602031 600276 600688
61128F00688K229L249L916N026O807Q813J0595J2039J3165J3970J4564J5146J5844
$$ 600688 602917 606166 610082 615108 621915 630728 641323 653362 666527 680497 695061 710207 726051
61115G26051J6748J7918J9171J9999K0126J9946J9984K0100J9705J8688J7506
$$ 726051 742799 760717 779888 799887 820013 839959 859943 880043 899748 918436 935942
61104I35942J6359J4889J2849J0468P919M932J287k741o727j0542j4099j7047
$$ 935942 952301 967190 980039 990507 998426 1003358 1004645 1001904 995177 984635 970536 953489
61092I53489j9057k0185k0641k0509j9953j9389j9041j8670j8075j7546j7339
$$ 953489 934432 914247 893606 873097 853144 833755 814714 796044 777969 760423 743084
61081G43084j6998j5831j3937j2131j0874r900q972q302p943p366o155m768m011
$$ 743084 726086 710255 696318 684187 673313 663413 654441 646139 638196 630830 624675 619907 615896
61068F15896l893l566k455r27L12J104J781K508L155L781M754O204P659Q545Q814
$$ 615896 612003 608437 605982 605055 605367 606471 608252 610760 613915 617696 622450 628654 636313 644858 653672
61053F53672Q867Q990R238R803J1030J2941J5081J6966J8538K0012K1473K2773
$$ 653672 662539 671529 680767 690570 701600 714541 729622 746588 765126 785138 806611 829384
61041H29384K3670K4008K3926K3937K4556K5723K6855K7597K8209K9047K9977
$$ 829384 853054 877062 900988 924925 949481 975204 1002059 1029656 1057865 1086912 1116889
61030A116889L0712L1383L2297L3353L4270L5404L7572M0874M4246M6628M8177
$$ 1116889 1147601 1178984 1211281 1244634 1278904 1314308 1351880 1392754 1437000 1483628 1531805
61019A531805M9792N1871N4230N7102O1466O8125P7076Q8064J01290J17125J35622
$$ 1531805 1581597 1633468 1687698 1744800 1806266 1874391 1951467 2039531 2140821 2257946 2393568
61008B393568J56869J81575K10807K45310K85612L32451L86642M48941N20998
$$ 2393568 2550437 2732012 2942819 3188129 3473741 3806192 4192834 4641775 5162773
60999E162773O06178P08675Q32329R81025J157939J359720J570349J764965J921874
$$ 5162773 5768951 6477626 7309955 8290980 9448919 10808639 12378988 14143953 16065827
60990A6065827K024492K044749J931934J639682J181412O56931K08226o4433j50492
$$ 16065827 18090319 20135068 22067002 23706684 24888096 25545027 25753253 25688820 25538328
60981B5538328j06879p372P8132P3662r6006m60510r62456j472970j861423k061048
$$ 25538328 25431449 25424077 25502209 25575871 25479865 25019355 24056899 22583929 20722506 18661458
60971A8661458k081889j977205j803832j603260j400786j209868j036287q82009
$$ 18661458 16579569 14602364 12798532 11195272 9794486 8584618 7548331 6666322
60963F666322p47566o32233n34093m51325l82820l26999k81112k42591k10362
$$ 6666322 5918756 5286523 4752430 4301105 3918285 3591286 3310174 3067583 2857221
60954B857221j83871j61586j41632j23447j07671r4459q2887p2041o1884n2887
$$ 2857221 2673350 2511764 2370132 2246685 2139014 2044555 1961668 1889627 1827743 1774856
60944A774856m5381l9515l5364l2829l1496l0624k9275k6809k3419j9844j6359
$$ 1774856 1729475 1689960 1654596 1621767 1590271 1559647 1530372 1503563 1480144 1460300 1443941
60933A443941j2599q625n488m098m009m072l839l573l354l149l514n189p954j0802
$$ 1443941 1431342 1422717 1417229 1413131 1409122 1405050 1401211 1397638 1394284 1391135 1387621 1382432 1374478 1363676
60919A363676j3324j6039j9155k1995k3963k5278k6317k6930k6958k6820k6985
$$ 1363676 1350352 1334313 1315158 1293163 1269200 1243922 1217605 1190675 1163717 1136897 1109912
60908A109912k7219k6894k5790k4172k2329k0437j8739j7497j6748j6316j5963
$$ 1109912 1082693 1055799 1030009 1005837 983508 963071 944332 926835 910087 893771 877808
60897H77808j5455j4684j3822j3234j3054j3021j2800j2315j1687j1009j0291
$$ 877808 862353 847669 833847 820613 807559 794538 781738 769423 757736 746727 736436
60886G36436r472q468p326o337n814n807o208o991q070q997r217q658p759o959
$$ 736436 726964 718496 711170 704833 699019 693212 687004 680013 671943 662946 653729 645071 637312 630353
60872F30353o435o273o440o629o502o171o028o081n938n481n125n229n565n588
$$ 630353 623918 617645 611205 604576 598074 591903 585875 579794 573856 568375 563250 558021 552456 546868
60858E46868m928l616k106j059q06j042j326j656k111k301j901j440j636k047
$$ 546868 541940 538324 536218 535159 534353 533311 531985 530329 528218 525917 524016 522576 520940 518893
60844E18893j525j18P31K42o96j299k268m340o453o880n700m665m698m897m187
$$ 518893 517368 517250 517981 518223 517527 516228 513960 509620 503167 496287 490587 485922 481224 476327 472140
60829D72140k786j605r50l90N50J949L410M274M182L539L094L030K849K106R40
$$ 472140 469354 467749 466799 466409 466959 468908 472318 476592 480774 484313 487407 490437 493286 495392 496332
60814D96332j75q59r79p69p80j390k282k741k445j682q69l14k70p55j304j431
$$ 496332 496157 495298 494319 493550 492770 491380 489098 486357 483912 482230 481361 481047 480777 480022 478718 477287
60798D77287j379j814k740l339l157k805l088l905m503m495m105l630l206l043
$$ 477287 475908 474094 471354 468015 464858 462053 458965 455060 450557 446062 441957 438327 435121 432078
60784D32078l361m011m470m405m024l774l790l751l254k297j336q61q97j037r05
$$ 432078 428717 424706 420236 415831 411807 408033 404243 400492 397238 394941 393605 392744 391847 390810 389905
60769C89905m89J5N67J312K311L369M116M285L935L450L239L407L692L805L737
$$ 389905 389416 389431 389998 391310 393621 396990 401106 405391 409326 412776 416015 419422 423114 426919 430656
60754D30656L715L862M036L998L719L336K876K188J271M63P5r3n26j361k256k983
$$ 430656 434371 438233 442269 446267 449986 453322 456198 458386 459657 460120 460195 460102 459576 458215 455959 452976
60738D52976l717m587n295n550n563n747o102o264o042n549m838l886k950k570
$$ 452976 449259 444672 439377 433827 428264 422517 416415 410151 404109 398560 393722 389836 386886 384316
60724C84316k924l482l543k977k250j753j391r21m95n66j224j874j858j201m42
$$ 384316 381392 377910 374367 371390 369140 367387 365996 365075 364580 364014 362790 360916 359058 357857 357415
60709C57415R3M21M53L0m63k76N90J137P02l6r4L92O32O02R63J697K029J769J716
$$ 357415 357508 357929 358382 358412 357949 357673 358263 359400 360102 360066 359972 360364 360996 361598 362561 364258 366287 368056 369772
60690C69772K355L112L392L481L851M258M229L946L918M158M310M309M297M184
$$ 369772 372127 375239 378631 382112 385963 390221 394450 398396 402314 406472 410782 415091 419388 423572
60676D23572L908L873M441N138N123M334L521L088K625J718N72m05j180j909k590
$$ 423572 427480 431353 435794 440932 446055 450389 453910 456998 459623 461341 461913 461508 460328 458419 455829
60661D55829l152l577l775l636l331l206l197k848k093j494j378j304q57m24n17
$$ 455829 452677 449100 445325 441689 438358 435152 431955 429107 427014 425520 424142 422838 421981 421557 421040
60646D21040p72n17k9k48j175j712j396j254k257l791m527m208l584k915j789
$$ 421040 420268 419751 419722 419474 418299 416587 415191 413937 411680 407889 403362 399154 395570 392655 390866
60631C90866l86K30m41j454j584q38k12l17p54p60pJ154J984K010J513J157J132
$$ 390866 390480 390710 390269 388815 387231 386393 386181 385864 385110 384350 384343 385497 387481 389491 391004 392161 393293
60614C93293J017O44M36N94O24K26M5P19J585J423K70n66m03l5l07q83j017q03
$$ 393293 394310 394954 395390 395984 396608 396834 396879 397598 399183 400606 400876 400310 399907 399872 399565 398682 397665 396862
60596C96862q09r72o93J18Q70J126J072J084J295J674K157K544K548K040J143
$$ 396862 396053 395081 394388 394506 395376 396502 397574 398658 399953 401627 403784 406328 408876 410916 412059
60581D12059J11p14r48m38M80J291J780K069K206K172K277L044M456N671N935
$$ 412059 412170 411456 410508 410070 410550 411841 413621 415690 417896 420068 422345 425389 429845 435516 441451
60566D41451N595N752O933Q517R557R772R465Q844P897O757N701M702L452J906
$$ 441451 447046 452798 459731 468248 477805 487577 497042 505886 513783 520540 526241 530943 534395 536301
60552E36301M76n75j439k171k253j304O6Q23R22J381K830M691O146P318Q861J0803
$$ 536301 536777 536202 534763 532592 530339 529035 529101 529924 530846 532227 535057 539748 545894 553212 562073 572876
60536E72876J2475J3500J4213J4936J5347J4896J3534J1718R721P248L870k34
$$ 572876 585351 598851 613064 628000 643347 658243 671777 683495 693216 700464 704334 704100
60524G04100m084o622p601p681p641p709p645p272o670n962n125m047k666j148
$$ 704100 700016 693394 685793 678112 670471 662762 655117 647845 641175 635213 630088 626041 623375 622227
60510F22227N9N83O51J081K462M453O199P401Q615J0456J2867J5429J8085K1235
$$ 622227 622286 622869 623520 624601 627063 631516 637715 645116 653731 664187 677054 692483 710568 731803
60496G31803K5089K9273L3172L6476L9211M1402M3010M4086M4617M4029M1267
$$ 731803 756892 786165 819337 855813 895024 936426 979436 1023522 1068139 1112168 1153435
60485A153435L5752K8125J9579J0615R22r565k0077k9716l8107m4908m9330n0826
$$ 1153435 1189187 1217312 1236891 1247506 1248428 1238863 1218786 1189070 1150963 1106055 1056725 1005899
60473A005899n0063m8405m6446m3644l9591l4962l0862k7672k4974k2358j9850
$$ 1005899 955836 907431 860985 817341 777750 742788 711926 684254 659280 636922 617072
60462F17072j7681j5990j4798j3991j3240j2123j0421q308o239m739m169m422
$$ 617072 599391 583401 568603 554612 541372 529249 518828 510520 504281 499542 495373 490951
60450D90951m874m776l909k766k061k073k557l123l543l679l396k671j718q48
$$ 490951 486077 481301 477392 474626 472565 470492 467935 464812 461269 457590 454194 451523 449805 448957
60436D48957k71m2j47m09n06k68oj77p18r73m78L91Q45N93M1k98k88l9L24O56
$$ 448957 448686 448644 448497 448088 447582 447314 447308 447131 446413 445440 444962 445353 446198 446791 446832 446534 446246 446207 446531 447187
60416D47187P87P63R31J528K257K505K020J235P99Q94J135J115Q25N28L51K59
$$ 447187 447974 448737 449668 451196 453453 455958 457978 459213 460012 460906 462041 463156 463981 464509 464860 465119
60400D65119L04O25J125J387J186R11J221K229L273L594L111K433K163K353K641
$$ 465119 465423 466048 467173 468560 469746 470657 471878 474107 477380 480974 484085 486518 488681 491034 493675
60385D93675K779K836K911K879K614K335K459L040L670L958L914L661L145K389
$$ 493675 496454 499290 502201 505080 507694 510029 512488 515528 519198 523156 527070 530731 533876 536265
60371E36265J818J845K234K306J854J414J444J701J718J567J698K189K585K550
$$ 536265 538083 539928 542162 544468 546322 547736 549180 550881 552599 554166 555864 558053 560638 563188
60357E63188K306K351K930L901M927N645N898N953O335P293Q430R078Q941Q293
$$ 563188 565494 567845 570775 574676 579603 585248 591146 597099 603434 610727 619157 628235 637176 645469
60343F45469P505O621N421L766J811j17j833l419n032o507p344p310o880o844
$$ 645469 652974 659595 665016 668782 670593 670476 668643 665224 660192 653685 646341 639031 632151 625307
60329F25307p376p844p632o886o147n521m681l602k845k840l198l134k399j535
$$ 625307 617931 610087 602455 595569 589422 583901 579220 575618 572773 569933 566735 563601 561202 559667
60315E59667j067p58O4J593L262M500N436O611Q125R520J0471J1270J2457J4243
$$ 559667 558600 557842 557906 559499 562761 567261 572697 579308 587433 596953 607424 618694 631151 645394
60301F45394J6438J8607K0109K0314J9103J6921J4059J0197N046q49o469j1307
$$ 645394 661832 680439 700548 720862 739965 756886 770945 781142 786188 785339 778870 767563
60289G67563j5367j8374j9736j9432j8219j6715j4914j2910j1385j0812j0613
$$ 767563 752196 733822 714086 694654 676435 659720 644806 631896 620511 609699 599086
60278E99086r814q345p083o720p044p355p139o291n081l995l437l403l558l491
$$ 599086 589272 580927 573844 567124 560080 552725 545586 539295 534214 530219 526782 523379 519821 516330
60264E16330k961k019j101p11q40q78l79L20N03j12j178k078k244j418nJ070J300
$$ 516330 513369 511350 510249 509538 508698 507820 507441 507761 508264 508152 506974 504896 502652 501234 501229 502299 503599
60247E03599J142J212J307Q52on00m35l93o55p26k22M93R54J273J660J856J566
$$ 503599 504741 505953 507260 508112 508106 507606 507171 506778 506123 505397 505175 505668 506622 507895 509555 511411 512977
60230E12977J131J162J742K452L006L506M107M804N404N567N099M414M325N061
$$ 512977 514108 515270 517012 519464 522470 525976 530083 534887 540291 545858 550957 555371 559696 564757
60216E64757N898O199O357P065Q027Q234P488O760O847P394P595P244O699O257
$$ 564757 570655 576854 583211 590276 598303 606537 614025 620785 627632 635026 642621 649865 656564 662821
60202F62821N975N811N538M810L677K762K502K511K079J103K5r75k073l194l951
$$ 662821 668796 674607 680145 684955 688632 691394 693896 696407 698486 699589 699614 698639 696566 693372 689421
60187F89421m333m825n563n945n519m764m454m661m884m933m955m782m005k829
$$ 689421 685088 680263 674700 668755 663236 658472 654018 649357 644473 639540 634585 629803 625798 622969
60173F22969k114k282k806l000k791k303j400k20L87k06j317j689j134n96o30
$$ 622969 620855 618573 615767 612767 609976 607673 606273 606053 606440 606234 604917 603228 602094 601498 600868
60158F00868p65n90n26r90j509j380o95m5L74P69J130J319J585K272L045L201
$$ 600868 600103 599513 598987 597997 596488 595108 594413 594368 594742 595511 596641 597960 599545 601817 604862 608063
60142F08063K774K662L377M312M628M368M207M406M611M544M448M684N189N541
$$ 608063 610837 613499 616876 621188 625816 630184 634391 638797 643408 647952 652400 657084 662273 667814
60128F67814N414M867M148L350K432J551J133J392J953K262K268K340K583K703
$$ 667814 673228 678095 682243 685593 688025 689576 690709 692101 694054 696316 698584 700924 703507 706210
60114G06210K599K558K649K471J840J280J302J471Q69o26k080k629k461k521l483
$$ 706210 708809 711367 714016 716487 718327 719607 720909 722380 723249 722623 720543 717914 715453 712932 709449
60099G09449n117o407o394n114l688l149l240k830j518k32lo34j065p56k19k05
$$ 709449 704332 697925 691531 686417 682729 679580 676340 673510 671992 671760 671757 671123 670058 669302 669083 668878
60083F68878p62j262j195p63o06r91j536j894k414l553m875n321m748m308m897
$$ 668878 668116 666854 665659 664896 664290 663299 661763 659869 657455 653902 649027 643706 638958 634650 629753
60068F29753n862n956n082m265m132m356m473m500m518m381m068l753l333k498
$$ 629753 623891 617935 612853 608588 604456 600100 595627 591127 586609 582228 578160 574407 571074 568576
60054E68576j435q35q60p23K09J438K053K009K106K813L746M307M366M215M197
$$ 568576 567141 566306 565446 564723 564932 566370 568423 570432 572538 575351 579097 583404 587770 591985 596182
60039E96182M366M414L946L048K341K191K120J331k35j835k907l572m195m801
$$ 596182 600548 604962 608908 611956 614297 616488 618608 619939 619704 617869 614962 611390 607195 602394
60025F02394n231n540n955o450o624o106n047m108l807l959l977l714l590l820
$$ 602394 597163 591623 585668 579218 572594 566488 561441 557333 553526 549567 545590 541876 538286 534466
60011E34466l941l504k871k738l139l469l409l178k842k072q29K64O24L86M0k72
$$ 534466 530525 527021 524150 521412 518273 514804 511395 508217 505375 503303 502474 502738 503362 503748 503788 503516
59995E03516o41q08k98Q51J885K087J528R70J100J971L063L802L995L839L625
$$ 503516 502875 502067 501769 502620 504505 506592 508120 509090 510190 512161 515224 519026 523021 526860 530485
59980E30485L427L045K209R07m41j231j244r11r49j717k942l978m217l474k147
$$ 530485 533912 536957 539166 540073 539632 538401 537157 536246 535297 533580 530638 526660 522443 518969 516822
59965E16822r99n06n38o99q55j014r29k47Q98J867K222K128J975J844J583J183
$$ 516822 515823 515317 514779 514080 513225 512211 511282 511035 511933 513800 516022 518150 520125 521969 523552 524735
59949E24735P79M40J34j39l19l74l61m03o08q84r50o80m02n96j288j983k220j883
$$ 524735 525514 525954 526088 525949 525630 525256 524895 524492 523884 523000 522050 521370 520968 520372 519084 517101 514881 512998
59931E12998j003L89K010L297L922M175M544N162N847O502P087P346P057O595
$$ 512998 511995 512384 514394 517691 521613 525788 530332 535494 541341 547843 554930 562276 569333 575928
59917E75928O780P939R365J0041R784R269Q920Q208O405L823J735R62R85O34n82
$$ 575928 582708 590647 600012 610053 619837 629106 638026 646234 652639 656462 658197 659159 660144 660778 660196
59902F60196k178l435m011l974l625l338l240l067k536j764j054m30K07O67P23
$$ 660196 658018 654583 650572 646598 642973 639635 636395 633328 630792 629028 627974 627544 627751 628418 629141
59887F29141O81J089J880K438K607K888L408L537K998K653L385M734N397M879
$$ 629141 629822 630911 632791 635229 637836 640724 644132 647669 650667 653320 656705 661439 666836 671715
59873F71715L861L030K314J416M83j11l00m45j008k102l279l843l633l200l034
$$ 671715 675576 678606 680920 682336 682819 682708 682408 681963 680955 678853 675574 671731 668098 664898 661864
59858F61864k903k460k088k431l173l192k094p85j15K84J154K250K744K675L096
$$ 661864 658961 656501 654413 651982 648809 645617 643523 642738 642623 642907 644061 646311 649055 651730 654826
59843F54826M551O322P489Q050Q371Q115O576L996J675N72M10N20Q62J643K381
$$ 654826 659377 665699 673188 681238 689609 697724 704300 708296 709971 710543 710953 711473 712335 713978 716359
59828G16359K139O63j391l395n267o931p871p659o581n392m588m184l919l437
$$ 716359 718498 719161 717770 714375 709108 702177 694306 686647 680066 674674 670086 665902 661983 658546
59814F58546k523j362m68j43k48n90j208k091k900l312l377l317l188l030l010
$$ 658546 656023 654661 654193 654050 653802 653212 652004 649913 647013 643701 640324 637007 633819 630789 627779
59799F27779l127l062k716k566l043l757l932l406k723k263j860j321q19o64j022
$$ 627779 624652 621590 618874 616308 613265 609508 605576 602170 599447 597184 595324 594003 593184 592520 591498
59784E91498j896k966l487k869j478l88j68l19q9N39J057J237J307J441J535J513
$$ 591498 589602 586636 583149 580280 578802 578414 578246 577927 577838 578377 579434 580671 581978 583419 584954 586467
59768E86467J614K133L036L929M461M587M452M175L932M084M826N791O350O416
$$ 586467 588081 590214 593250 597179 601640 606227 610679 614854 618786 622870 627696 633487 639837 646253
59754F46253O370O240N546M263L253L138L357L068K456K207K148J520M69K2M31
$$ 646253 652623 658863 664409 668672 671925 675063 678420 681488 683944 686151 688299 689819 690288 690310 690741
59739F90741O89J28o47q92q26r00q24k71J70k09r34r09q5N00L05p2k0K11J28j98
$$ 690741 691430 691558 690911 690019 689193 688293 687469 687198 687368 687159 686225 685316 685231 685731 686036 685964 685944 686155 686283 686085
59719F86085m11m88n43l83K10Q91R52K41m47j10J385L131M123M283M388N059O032
$$ 686085 685674 685186 684643 684260 684470 685361 686313 686554 686107 685997 687382 690513 694636 698919 703307 708366 714398
59702G14398O592O473O150O268P000P942Q466Q226P455O734O382O176N767N087
$$ 714398 720990 727463 733613 739881 746881 754823 763289 771515 778970 785704 792086 798262 804029 809116
59688H09116M143K703O82j276k221k061j745k069k751l119l263l870n099o289
$$ 809116 813259 815962 816644 815368 813147 811086 809341 807272 804521 801402 798139 794269 789170 782881
59674G82881o873o983o983o841o403n815n325m857m249l696l475l332k704j504
$$ 782881 776008 769025 762042 755201 748798 742983 737658 732801 728552 724856 721381 718049 715345 713841
59660G13841j97J000K384M088N583O371O634O847O995O654N694M391K999J539
$$ 713841 713644 714644 717028 721116 726699 733070 739704 746551 753546 760200 765894 770285 773284 774823
59646G74823nj668l554n564p231q200q715r264r832j0001r664r102q413p452o364
$$ 774823 774818 773150 769596 764032 756801 748601 739886 730622 720790 710789 701125 692023 683610 676158 669794
59631F69794n592n162m615l865l492l827m276m107l491l320m115n548o840p297
$$ 669794 664202 659040 654425 650560 647068 643241 638965 634858 631367 628047 623932 618384 611544 604247
59617F04247o695n475m517m390m887n358n312m602l373k033r48k9J054K079K292
$$ 604247 597552 592077 587560 583170 578283 572925 567613 563011 559638 557605 556657 556628 557682 559761 562053
59602E62053J591J015J402K083J781N15l72p1P49J085Q66P02R47J482K046K359
$$ 562053 563644 564659 566061 568144 569925 570440 570068 569997 570746 571831 572697 573399 574346 575828 577874 580233
59586E80233K217J707J146O17q7r27j501j726k138l031l730l402k338j767k366
$$ 580233 582450 584157 585303 585920 585833 584906 583405 581679 579541 576510 572780 569378 567040 565273 562907
59571E62907l527m247m208l724l162k730k579k661k622k135j321o14k70k24l38
$$ 562907 559380 555133 550925 547201 544039 541309 538730 536069 533447 531312 529991 529377 529107 528883 528545
59556E28545n10n74l38J98Q72J575K277K905L412L934M489M691M222L677M202
$$ 528545 528035 527461 527123 527321 528193 529768 532045 534950 538362 542296 546785 551476 555698 559375 563577
59541E63577O026P986R074R829J1453J3963J6165J7304J7586J6911J4248R031
$$ 563577 569603 577589 586663 596492 607945 621908 638073 655377 672963 689874 704122 713153
59529G13153K533k892n739o096m941l254j644k90Q38J533J382M22o22j187j587
$$ 713153 715686 712794 707055 700959 696018 692764 691120 690830 691668 693201 694583 695005 694383 693196 691609
59514F91609k502m029n696p154q288q876q808q473q377q407q127p642p466p415
$$ 691609 689107 685078 679382 672228 663940 655064 646256 637783 629406 620999 612872 605230 597764 590349
59500E90349o529m466k255j129j049r86l45M48P47N36L58O34J240J668J699J744
$$ 590349 583820 579354 577099 575970 574921 573935 573590 574038 574785 575321 575679 576313 577553 579221 580920 582664
59484E82664K371L468M270M355M193M414M875M931M495M217M533N007M900M118
$$ 582664 585035 588503 592773 597128 601321 605735 610610 615541 620036 624253 628786 633793 638693 642811
59470F42811L281K902K774K242R78o23j798k088j662r77k64N51J494K370L017
$$ 642811 646092 648994 651768 654010 654988 654365 652567 650479 648817 647840 647576 648127 649621 651991 655008
59455F55008L595M402N433O349O921P281P541P459O766N699M777M022K823Q10
$$ 655008 658603 663005 668438 674787 681708 688989 696530 703989 710755 716454 721231 725253 728076 728886
59441G28886j556l553n067o415p548q017p751p365p349p373o742n439m284l970
$$ 728886 727330 723777 718710 712295 704747 696730 688979 681614 674265 666892 660150 654711 650427 646457
59427F46457m190l927k573n38J297K605L817N388P247R074J0810J2572J4267J5668
$$ 646457 642267 638340 635767 635229 636526 639131 642948 648336 655583 664657 675467 688039 702306 717974
59413G17974J6666J7231J7239J6789J6412J6195J4838J0479K962n317j1353j3961
$$ 717974 734640 751871 769110 785899 802311 818506 833344 843823 846785 841468 830115 816154
59401H16154j3835j1940q780m984j495J104K716K905P72l803r335j3844j6472
$$ 816154 802319 790379 781599 776615 775120 776224 778940 781845 782617 778814 769479 755635 739163
59388G39163j7534j7370j6013j3812j1522r485p425n212l253j771l89J104K080
$$ 739163 721629 704259 688246 674434 662912 653427 646002 640790 637537 635766 635377 636481 638561
59375F38561J931J191J066J939L068L768M172M636N145N586O069O578O816O780
$$ 638561 640492 641683 642749 644688 647756 651524 655696 660332 665477 671063 677132 683710 690526 697306
59361F97306P125Q372J0066J1199J1426J1273J1289J1533J1970J2864J4431J6346
$$ 697306 704431 712803 722869 734068 745494 756767 768056 779589 791559 804423 818854 835200
59349H35200J7895J8628J8696J8571J8473J8163J7275J5781J3995J2165J0268
$$ 835200 853095 871723 890419 908990 927463 945626 962901 978682 992677 1004842 1015110
59338A015110Q286O372M577K575j05l530p167j0199j2129j3213j4239j5610j6726
$$ 1015110 1023396 1029768 1034345 1036920 1036815 1033285 1026118 1015919 1003790 990577 976338 960728 944002
59325I44002j6633j5324j3829j2951j2498j2052j1757j1708j1244r744p805o651
$$ 944002 927369 912045 898216 885265 872767 860715 848958 837250 826006 816262 808457 801806
59313H01806o455o200n280m299l900l754l193k224j231j38J332K890L852M095
$$ 801806 795351 789151 783871 779572 775672 771918 768725 766501 765270 765132 766464 769354 773206 777301
59299G77301M321N205O723Q370R803J1016J2071J2870J3173J2695J1117Q068L364
$$ 777301 781622 786827 793550 801920 811723 822739 834810 847680 860853 873548 884665 892733 896097
59286H96097k534q436j3074j5896j7080j6932j5607j3437j1048q932p106n364
$$ 896097 893563 885127 872053 856157 839077 822145 806538 793101 782053 773121 766015 760651
59274G60651l632j828K93K833N363P205Q064Q168P810P042N867M473L116J826
$$ 760651 757019 755191 755484 758317 763680 770885 778949 787117 794927 801969 807836 812309 815425 817251
59260H17251L42j527l582n336o539p427q305r092r527r731j0067j0395r995q546
$$ 817251 817593 816066 812484 807148 800609 793182 784877 775785 766258 756527 746460 736065 726070 717524
59246G17524o737n432m556l426k050j304j604k025j307O08K625L860M430M718
$$ 717524 710787 705355 700799 697373 695323 694019 692415 690390 689083 689691 692316 696176 700606 705324
59232G05324M568L606K059P26J72J83O7p64k365m154n225n091m151l217k659k312
$$ 705324 709892 713498 715557 716283 716455 716638 716705 715941 713576 709422 704197 699106 694955 691738 689079 686767
59216F86767k096k152k305j986j037o2M04O23J103J751K196K554L169L855M106
$$ 686767 684671 682519 680214 678228 677191 677129 677533 678156 679259 681010 683206 685760 688929 692784 696890
59201F96890M096M617N870O987P075O263N410N102N193N130M488L337K198J500
$$ 696890 700986 705603 711473 718460 725535 731798 737208 742310 747503 752633 757121 760458 762656 764156
59187G64156J141P89N11O66J221J620J434P40j55j018j648j952k096k270k234
$$ 764156 765297 766086 766597 767263 768484 770104 771538 772278 772123 771105 769457 767505 765409 763139 760905
59172G60905j578m24O49J416K210L238M310N361O566P638P785O788N505M818M620
$$ 760905 759327 758903 759552 760968 763178 766416 770726 776087 782653 790291 798076 804864 810369 815187 819807
59157H19807M306L648K682J228o80k343l113l287l593m049m114l778l686m107
$$ 819807 824113 827761 830443 831671 830991 828648 825535 822248 818655 814606 810492 806714 803028 798921
59143G98921m602m841n064n512n928o029o006o260o799p196p047o356n525n012
$$ 798921 794319 789478 784414 778902 772974 766945 760939 754679 747880 740684 733637 727281 721756 716744
59129G16744m901m860m529l824k748j214P00K515L730M366M886N695O942Q560
$$ 716744 711843 706983 702454 698630 695882 694668 695368 697883 701613 705979 710865 716560 723502 732062
59115G32062J0193J1313J1754J1989J2487J3051J3162J2814J2448J2217J1871
$$ 732062 742255 753568 765322 777311 789798 802849 816011 828825 841273 853490 865361
59104H65361J1297J0651R902Q812P391N934M521K976J369k2j262k728m303n209
$$ 865361 876658 887309 897211 906023 913414 919348 923869 926845 928214 928192 926930 924202 919899 914690
59090I14690n002m217l676l585l628l626l572l411l219l497m745o756q712r981
$$ 914690 909688 905471 901795 898210 894582 890956 887384 883973 880754 877257 872512 865756 857044 847063
59076H47063j0559j0707j0547j0091r455q853q395q023p617p153o721o408o210
$$ 847063 836504 825797 815250 805159 795704 786851 778456 770433 762816 755663 748942 742534 736324
59063G36324o095o082o131o030n571m868m285m038l981l863l639l437l313l094
$$ 736324 730229 724147 718016 711986 706415 701547 697262 693224 689243 685380 681741 678304 674991 671897
59049F71897k518j561o29k51m84p53m98J49N96N67L77M04O83J075J541K097K688
$$ 671897 669379 667818 667189 666938 666454 665701 665203 665352 665948 666515 666892 667296 667979 669054 670595 672692 675380
59032F75380L274L854M418M983N691O702P933R112J0167J1252J2372J3251J3703
$$ 675380 678654 682508 686926 691909 697600 704302 712235 721347 731514 742766 755138 768389 782092
59019G82092J3874J3907J3610J2627J0787Q201N216K427M72m84r21j391j870j948
$$ 782092 795966 809873 823483 836110 846897 855098 860314 862741 863213 862729 861808 860417 858547 856599
59005H56599j500q13p5Q87K214L597M526M838M749M373L494J978K19j132j841
$$ 856599 855099 854286 854211 855098 857312 860909 865435 870273 875022 879395 882889 884867 885086 883954 882113
58990H82113k354l246m655o283p790q972r648r647q966p865o662n459m044k151
$$ 882113 879759 876513 871858 865575 857785 848813 839165 829518 820552 812687 806025 800566 796522 794371
58976G94371Q5K062L298L980M716N698O578P175P757Q406Q585P896O841O258O246
$$ 794371 794456 796518 799816 803796 808512 814210 820788 827963 835720 844126 852711 860607 867448 873706 879952
58961H79952O241N902N254M092K079m44k541l880n139o936q918j0417j1458j2511
$$ 879952 886193 892095 897349 901441 903520 903076 900535 896655 891516 884580 875662 865245 853787 841276
58947H41276j3536j3920j3258j1811j0189q889q098p577o809n487l855k412j426
$$ 841276 827740 813820 800562 788751 778562 769673 761575 753998 747189 741702 737847 735435 734009
58934G34009r23q88j221j545j526j314j407j955k493k499k016j580j599j987k373
$$ 734009 733086 732198 730977 729432 727906 726592 725185 723230 720737 718238 716222 714642 713043 711056 708683
58919G08683k495k294j736p35O42K044L102L806M455N277O228P125P850Q433R039
$$ 708683 706188 703894 702158 701423 702065 704109 707211 711017 715472 720749 726977 734102 741952 750385 759424
58904G59424R779J0417J0505J0036R764J0426J1747J2718J2833J2483J2090J1537
$$ 759424 769203 779620 790125 800161 809925 820351 832098 844816 857649 870132 882222 893759
58892H93759J0737J0164J0293J0900J1463J1921J2551J3344J4002J4357J4249
$$ 893759 904496 914660 924953 935853 947316 959237 971788 985132 999134 1013491 1027740
58881A027740J3178J0729P299L894J065j403l675n326o000o159o670p818r084
$$ 1027740 1040918 1051647 1058946 1062840 1063905 1062502 1058827 1053501 1047501 1041342 1034672 1026854 1017770
58868A017770r855j0048r987r966j0068j0259j0466j0597j0681j1004j1932j3383
$$ 1017770 1007915 997867 987880 977914 967846 957587 947121 936524 925843 914839 902907 889524
58856H89524j4584j4715j3814j2836j2597j2916j3049j2658j2031j1428j0729
$$ 889524 874940 860225 846411 833575 820978 808062 795013 782355 770324 758896 748167
58845G48167r823q998q672q889r270r419r221q794q255p562o590n376m243l563
$$ 748167 738344 729346 720674 711785 702515 693096 683875 675081 666826 659264 652674 647298 643055 639492
58831F39492l401l431l219k561j602o79j7N00J165J982K473K193J360P30Q24J497
$$ 639492 636091 632660 629441 626880 625278 624599 624582 625082 626247 628229 630702 632895 634255 634985 635809 637306
58815F37306K313L014L471L519L135K631K350K256K045J656J272R09L51l98r82
$$ 637306 639619 642633 646104 649623 652758 655389 657739 659995 662040 663696 664968 665877 666228 665830 664848
58800F64848j278j700k597l556l795l131k161j487j130q03l71J57P95J508K152
$$ 664848 663570 661870 659273 655717 651922 648791 646630 645143 644013 643210 642839 642996 643791 645299 647451
58785F47451K657L177L875M743N688O639P431P839P850P777P865P930P502O205
$$ 647451 650108 653285 657160 661903 667591 674230 681661 689500 697350 705127 712992 720922 728424 734629
58771G34629L917R05k077m208n430o582q288r989j0592r871q688p851p320o652
$$ 734629 738546 739451 737374 733166 727736 721154 712866 702877 692285 682414 673726 665875 658555 651903
58757F51903n709m709l909l449l265l043k437j505o65j59K68J017K132L285M134
$$ 651903 646194 641485 637576 634127 630862 627819 625382 623877 623212 623053 623321 624338 626470 629755 633889
58742F33889M661N163N874O568O748O393O223O881Q092R006R186Q840Q287P723
$$ 633889 638550 643713 649587 656155 662903 669296 675519 682400 690492 699498 708684 717524 725811 733534
58728G33534P413P398P084N765L704J991J204Q91N58L85N68P55P10R08J778K837
$$ 733534 740947 748345 755429 761194 764898 766889 768093 768984 769542 769927 770495 771250 771960 772868 774646 777483
58712G77483L252K944K386J597J37j986m144n889p314q604r794j1026j2471j3818
$$ 777483 780735 783679 786065 787662 787799 785813 781669 775780 768466 759862 750068 739042 726571 712753
58698G12753j4411j4172j3864j4137j4634j4537j3652j2490j1387j0111q455o831
$$ 712753 698342 684170 670306 656169 641535 626998 613346 600856 589469 579358 570903 564072
58686E64072n879n651n529n013m313l958m063m179l821k864j530k23O37R68J241
$$ 564072 558193 552542 547013 542000 537687 533729 529666 525487 521666 518802 517272 517049 517686 518654 519895
58671E19895K070L453M730N441N967P054Q869J0816J2110J2289J1278R322O953
$$ 519895 521965 525418 530148 535589 541556 548610 557479 568295 580405 592694 603972 613294 620247
58658F20247M729K791P29j918m943p376q374q131p667p657p762p331o357n383
$$ 620247 624976 627767 628496 626578 621635 614259 605885 597754 590087 582430 574668 567337 560980 555597
58644E55597m682m042l272k480j837j439j336j399j224o41q5NQN92J497J659P50
$$ 555597 550915 546873 543601 541121 539284 537845 536509 535110 533886 533245 533160 533165 533173 533765 535262 536921 537671
58627E37671l12o18l14J11O74J427J822J389O98P88J829L006L692M082M537M837
$$ 537671 537359 536741 536427 536538 537212 538639 540461 541850 542548 543336 545165 548171 551863 555945 560482 565319
58611E65319M426L265K159K068K999L843L610K560J653J151N12k83m03M75J363
$$ 565319 569745 573010 575169 577237 580236 584079 587689 590249 591902 593053 593565 593282 592879 593354 594717
58596E94717J171J60n07k48N30J211J636K142L234M988O782Q003Q991J0499J2148
$$ 594717 595888 596048 595541 595293 595823 597034 598670 600812 604046 609034 615816 623819 632810 643309 655457
58581F55457J2611J1681J0925J1429J2101J1399R695Q522Q185P747P044P031Q133
$$ 655457 668068 679749 690674 702103 714204 725603 735298 743820 752005 759752 766796 773827 781960
58568G81960R668J1167J3062J5672J8512K1017K3149K4990K6322K6929K6736K5594
$$ 781960 791628 802795 815857 831529 850041 871058 894207 919197 945519 972448 999184 1024778
58556A024778K3375K0323J6770J2677Q001L326n10l277n158o158o514p211q954
$$ 1024778 1048153 1068476 1085246 1097923 1105924 1109250 1108740 1105463 1100305 1094147 1087633 1080422 1071468
58543A071468j0938j1893j2202j3501j6112j8501j9635k0393k1853k3480k4031
$$ 1071468 1060530 1048637 1036435 1022934 1006822 988321 968686 948293 926440 902960 878929
58532H78929k3247k1792k0177j8563j7073j5580j3697j1457r478q038o612m850
$$ 878929 855682 833890 813713 795150 778077 762497 748800 737343 727865 719827 713215 708365
58520G08365l264k317j558m36O21P75O1o80r07p74n81m08k22j3P6k91j251k150
$$ 708365 705101 702784 701226 700790 701411 702186 702247 701567 700660 699886 699305 698897 698675 698662 698738 698447 697196 695046
58502F95046k042r94k54o56j462j422m36N60R16Q20P56J089K059L619N311O663
$$ 695046 693004 692010 691756 691100 689638 688216 687780 688340 689256 690076 690832 691921 693980 697599 702910 709573
58486G09573P674Q640R753J1120J2875J4933J6872J8350J9471K0491K1332K1566
$$ 709573 717247 725887 735640 746760 759635 774568 791440 809790 829261 849752 871084 892650
58474H92650K0645J8128J4083R348M890P87l564q110j1686j3379j3562j3112j2235
$$ 892650 913295 931423 945506 954854 959744 960531 956967 948857 937171 923792 910230 897118 884883
58461H84883j0659q486o136l756j316J005L035M919O698P885Q009P260O077M345
$$ 884883 874224 865738 859602 855846 854530 855535 858570 863489 870187 878072 886081 893341 899418 903763
58447I03763J599k155o257r941j2675j4199j4626j4372j3633j2150r789p070m737
$$ 903763 905362 903207 896950 887009 874334 860135 845509 831137 817504 805354 795565 788495 783758
58434G83758l037j732n33P53K216L688M911O065P643R571J1024J1532J1626J1879
$$ 783758 780721 778989 778456 779209 781425 785113 790024 796089 803732 813303 824327 835859 847485 859364
58420H59364J1845J0669Q296N360K281q27l586n422o247o566o998p944r400j0650
$$ 859364 871209 881878 890174 895534 897815 896988 893402 887980 881733 875167 868169 860225 850825 840175
58406H40175j0626r122p329o491o381n792m248k459j172l32M99J428K120K132
$$ 840175 829549 820427 813098 806607 800226 794434 790186 787727 786555 786223 786722 788150 790270 792402
58392G92402J423O65P07J509J969J259j09r91r97n48O6R37K076L307M554N675
$$ 792402 793825 794490 795197 796706 798675 799934 799825 798834 797837 797289 797355 798292 800368 803675 808229 813904
58376H13904O234O001N563N806O831P920Q489Q628Q716Q926R153R186R018R067
$$ 813904 820138 826139 831702 837508 844339 852259 860748 869376 878092 887018 896171 905357 914375 923442
58362I23442R819J1112J2173J2526J2386J1920J0862R214P614O417N126L357J725
$$ 923442 933261 944373 956546 969072 981458 993378 1004240 1013454 1021068 1027485 1032611 1035968 1037693
58349A037693J006J071J372J895K765L597M139M966O503P977Q529Q813J0121J2328
$$ 1037693 1038699 1039770 1041142 1043037 1045802 1049399 1053538 1058504 1065007 1072984 1081513 1090326 1100447 1112775
58335A112775J4132J5102J5948J6744J6574J5248J3952J3488J3061J1501Q868
$$ 1112775 1126907 1142009 1157957 1174701 1191275 1206523 1220475 1233963 1247024 1258525 1267393
58324A267393O114L872K221J137O00M81O72J186J958K848L832M894N877O730P799
$$ 1267393 1273507 1277379 1279600 1280737 1281337 1281818 1282490 1283676 1285634 1288482 1292314 1297208 1303085 1309815 1317614
58309A317614R321J0917J2122J3186J4635J6220J7101J7031J6607J6379J6382
$$ 1317614 1326935 1337852 1349974 1363160 1377795 1394015 1411116 1428147 1444754 1461133 1477515
58298A477515J6582J6977J7267J7084J6670J6681J7269J7912J8227J8422J8883
$$ 1477515 1494097 1511074 1528341 1545425 1562095 1578776 1596045 1613957 1632184 1650606 1669489
58287A669489J9738K0838K1856K2552K3196K4403K6183K7787K8881L0217L2306
$$ 1669489 1689227 1710065 1731921 1754473 1777669 1802072 1828255 1856042 1884923 1915140 1947446
58276A947446L4278L5068L5162L5936L7652L9332M0367M1089M1848M2674M3845
$$ 1947446 1981724 2016792 2051954 2087890 2125542 2164874 2205241 2246330 2288178 2330852 2374697
58265B374697M5731M8085N0348N2565N5163N7971O0365O2133O3357O3831O3477
$$ 2374697 2420428 2468513 2518861 2571426 2626589 2684560 2744925 2807058 2870415 2934246 2997723
58254B997723O2992O3124O3712O4440O5942O9014P3245P7685Q2382Q8008R4494
$$ 2997723 3060715 3123839 3187551 3251991 3317933 3386947 3460192 3537877 3620259 3708267 3802761
58243C802761J01293J08436J15957J23061J29311J35950J44361J53976J63406
$$ 3802761 3904054 4012490 4128447 4251508 4380819 4516769 4661130 4815106 4978512
58234D978512J72904J83741J95801K07974K20463K34482K50101K66590K84481
$$ 4978512 5151416 5335157 5530958 5738932 5959395 6193877 6443978 6710568 6995049
58225F995049L05086L28359L53402L80661M11322M45230M81844N22666N70041
$$ 6995049 7300135 7628494 7981896 8362557 8773879 9219109 9700953 10223619 10793660
58216A0793660O24154O84036P51070Q28557R18338J020898J138525J275784J437757
$$ 10793660 11417814 12101850 12852920 13681477 14599815 15620713 16759238 18035022 19472779
58207A9472779J630904J865118K152732K507369K945754L485705M135764M888513
$$ 19472779 21103683 22968801 25121533 27628902 30574656 34060361 38196125 43084638
58199D3084638N729830O654934P675227Q818541J0130848J1672692J3508336J5703413
$$ 43084638 48814468 55469402 63144629 71963170 82094018 93766710 107275046 122978459
58191A22978459J8318538K1342803K4573020K7579180K9862913L1050561L0829509
$$ 122978459 141296997 162639800 187212820 214792000 244654913 275705474 306534983
58184C06534983K8658584K3726558J5511733M576264p236362j7568571k4711724
$$ 306534983 335193567 358920125 374431858 379008122 371771760 354203189 329491465
58177C29491465k8244583k8800673k7398582k4950482k2150636j9531896j7453466
$$ 329491465 301246882 272446209 245047627 220097145 197946509 178414613 160961147
58170A60961147j6013530j5033135j4192561j3235891j2088199j0821155r544111
$$ 160961147 144947617 129914482 115721921 102486030 90397831 79576676 70032565
58163G0032565q333051p226970o245235n391629m655496m022230l481249l022535
$$ 70032565 61699514 54472544 48227309 42835680 38180184 34157954 30676705 27654170
58155B7654170k632739k299427k014866j772750j565360j386618j233996j104703
$$ 27654170 25021431 22722004 20707138 18934388 17369028 15982410 14748414 13643711
58147A3643711r93243q94917q08582p33808o68105o08943n55748n07977m63601
$$ 13643711 12650468 11755551 10946969 10213161 9545056 8936113 8380365 7872388 7408787
58138G408787m21308l82032l46748l14821k85829k60853k40428k23198k08061
$$ 7408787 6987479 6605447 6258699 5943878 5658049 5397196 5156768 4933570 4725509
58129D725509j95755j86861j79879j72730j64804j56334j47225j37754j29107
$$ 4725509 4529754 4342893 4163014 3990284 3825480 3669146 3521921 3384167 3255060
58120C255060j21928j15292j08047j00368r3257q7382q2872p9267p5397p0449
$$ 3255060 3133132 3017840 2909793 2809425 2716168 2628786 2545914 2466647 2391250 2320801
58110B320801o5372o1930o0186n8391n5577n2641n0492m8885m7640m7247m7512
$$ 2320801 2255429 2193499 2133313 2074922 2019345 1966704 1916212 1867327 1819687 1772440 1724928
58099A724928m7170m5722m4184m3228m2023l9819l7244l5035l2706k9527k5759
$$ 1724928 1677758 1632036 1587852 1544624 1502601 1462782 1425538 1390503 1357797 1328270 1302511
58088A302511k2124j9001j6847j6235j6696j6706j5672j4812j5244j6387j7177
$$ 1302511 1280387 1261386 1244539 1228304 1211608 1194902 1179230 1164418 1149174 1132787 1115610
58077A115610j7730j8624j9548j9825j9546j9197j8751j8068j7493j7273j6913
$$ 1115610 1097880 1079256 1059708 1039883 1020337 1001140 982389 964321 946828 929555 912642
58066I12642j5908j4473j2944j1202r337q095p825p805p385p063p553q481r012
$$ 912642 896734 882261 869317 858115 848778 840683 832858 825053 817668 810605 803052 794571 785559
58053G85559r190r646j0350j0596j0026r021q198p966q240q347p677o611o155
$$ 785559 776369 766723 756373 745777 735751 726730 718532 710566 702326 693979 686302 679691 673536
58040F73536o387o227n191m323m675n757o380o285o068o140o600p551q752r444
$$ 673536 667149 660922 655731 651408 646733 640976 634596 628311 622243 616103 609503 601952 593200 583756
58026E83756r266q779q504q085p149o198n799n575m935m180l898l819l296k463
$$ 583756 574490 565711 557207 549122 541973 535775 529976 524401 519466 515286 511388 507569 504273 501810
58012E01810j929j720j482j291j322j200o11j55m77r49l75J229K678L332L607
$$ 501810 499881 498161 496679 495388 494066 492866 492255 492100 491623 490674 490299 491528 494206 497538 501145
57997E01145L819L643K890J970J379J328J816K390K048K12k282l983m473m492
$$ 501145 504964 508607 511497 513467 514846 516174 517990 520380 522428 522640 520358 516375 511902 507410
57983E07410m560m492m240m174m424m708m935n234n334m745l628k711k263j939
$$ 507410 502850 498358 494118 489944 485520 480812 475877 470643 465309 460564 456936 454225 451962 450023
57969D50023j571j321j041m36O6k96j269j675j178q03j279j890j670q07j12O7
$$ 450023 448452 447131 446090 445654 445720 445424 444155 442480 441302 440499 439220 437330 435660 434853 434741 434808
57953D34808k84j304k676l256k263m28Q99J491K167L237M095M398M683N479O529
$$ 434808 434524 433220 430544 427288 425025 424597 425496 426987 429154 432391 436486 440884 445567 451046 457575
57938D57575P304P767Q240Q864R644J0692J1996J3051J3161J2117J0271P977N283
$$ 457575 464879 472646 480886 489750 499394 510086 522082 535133 548294 560411 570682 578659 583942
57925E83942K281o95l401n897q073r394r613r443r815j0523j0442r214p855p298
$$ 583942 586223 585528 582127 576230 568157 558763 549150 539707 529892 519369 508927 499713 491858 484560
57911D84560p113o338m930l655k934k551k319k348k698l325m218n193n762n690
$$ 484560 477447 471109 466179 462524 459590 457039 454720 452372 449674 446349 442131 436938 431176 425486
57897D25486n348n086m610l630k539j751q57O02J921K040J306J139J899K457K093
$$ 425486 420138 415052 410442 406812 404273 402522 401665 402267 404188 406228 407534 408673 410572 413029 415122
57882D15122J509J402J384R67N81O94P57q2j761l510m681m814l564j392L25P15
$$ 415122 416631 418033 419417 420384 420965 421659 422416 422334 420573 417063 412382 407568 404004 402612 402937 403652
57866D03652M44O52J359J870K169K856L915M666M920N243N941O628O931O946O856
$$ 403652 404096 404748 406107 407977 410146 413002 416917 421583 426503 431746 437687 444315 451246 458192 465048
57851D65048O605O146N454M303K537N77q84j804k767m045n232n951o325o529o497
$$ 465048 471653 477799 483253 487556 490093 490670 489786 487982 485215 481170 475938 469987 463662 457133 450636
57836D50636o269o114n999n490m509l726l678l888l409j985k86R13J370J263R06
$$ 450636 444367 438253 432254 426764 422255 418529 414851 410963 407554 405569 405283 406196 407566 408829 409735
57821D09735N90M79N24O22P62Q71O25k44j501k519k911k892k898l060l146k988
$$ 409735 410325 410804 411328 411950 412712 413583 414208 413964 412463 409944 407033 404141 401243 398183 395037 392049
57805C92049k769k847l335l921m164l969l613l322k898j992n76R32K026K430K161
$$ 392049 389280 386433 383098 379177 375013 371044 367431 364109 361211 359219 358643 359575 361601 364031 366192
57790C66192J546J210J669K785L851M463M942N670O267O082N356N184O048P038
$$ 366192 367738 368948 370617 373402 377253 381716 386658 392328 398595 404677 410033 415217 421265 428303
57776D28303P014O103N422N513N666M810K664n9k283l402l795m522o154q024q916
$$ 428303 435317 441420 446842 452355 458021 462831 465495 465436 463153 459751 455956 451434 445280 437256 428340
57761D28340q487p556p046p087p272p236o825o065n182m389l512k220o80N32J236
$$ 428340 419853 412297 405251 398164 390892 383656 376831 370766 365584 361195 357683 355463 354783 355315 356551
57746C56551J860K601K998K783K546K937L605L629K836K011J817K093K311K203
$$ 356551 358411 361012 364010 366793 369339 372276 375881 379510 382346 384357 386174 388267 390578 392781
57732C92781J850J434J092P86K94m48j126j387j352j435j744k016k092k118k146
$$ 392781 394631 396065 397157 397943 398237 397789 396663 395276 393924 392489 390745 388729 386637 384519 382373
57717C82373j960j452r02p54j174j969k771l291l475l454l330l099k831k710k753
$$ 382373 380413 378961 378059 377305 376131 374162 371391 368100 364625 361171 357841 354742 351911 349201 346448
57702C46448k678k301j845j552j198m60M01P41M73K48N23R17P40j63j344k268
$$ 346448 343770 341469 339624 338072 336874 336414 336815 337556 338029 338277 338800 339717 340457 340294 338950 336682
57686C36682k581k137j097M3Q12J221J690K561L788N177O762Q915J2024J6060
$$ 336682 334101 331964 330867 330910 331722 332943 334633 337194 340982 346159 352921 361836 373860 389920
57672C89920K0473K4628K8417L2408L7303M3187M9205N3931N5989N4386M8286
$$ 389920 410393 435021 463438 495846 533149 576336 625541 679472 735461 789847 838133
57661H38133L6834J9811j222k2599m0022n0822n5024n4470n1176m6374m0740l4888
$$ 838133 874967 894778 893556 870957 830935 780113 725089 670619 619443 573069 532329 497441
57649D97441k9450k4725k0544j6700j3352j0854r182p884o656n695n238n044m582
$$ 497441 467991 443266 422722 406022 392670 381816 372634 364750 358094 352399 347161 342117 337535
57636C37535l613k376j316p95r61j606k226k369j971j244m58J45L71K49J6k10
$$ 337535 333922 331546 330230 329435 328474 326868 324642 322273 320302 319058 318600 318745 319116 319365 319381 319171
57620C19171n78j145j629j770j679j615j585j449j246j059q41o34p36j225j608
$$ 319171 318593 317448 315819 314049 312370 310755 309170 307721 306475 305416 304575 303941 303205 301980 300372
57605C00372j391q49o78j020j388j486j529j676j709j443j094j002j269j775k333
$$ 300372 298981 298132 297454 296434 295046 293560 292031 290355 288646 287203 286109 285107 283838 282063 279730
57590B79730k740k884k803k522k003j386j038j072j171j182j449k030k162j258
$$ 279730 276990 274106 271303 268781 266778 265392 264354 263282 262111 260929 259480 257450 255288 254030
57576B54030p8R4p67j566j894k470l565m186l506k123j237j204j567j940k153
$$ 254030 253952 254046 253279 251713 249819 247349 243784 239598 236092 233969 232732 231528 229961 228021 225868
57561B25868k051j727j583j680j460n58N07R67P46L30R0J60O19J301J808K038
$$ 225868 223817 222090 220507 218827 217367 216809 217316 218283 219029 219359 219449 219609 220228 221529 223337 225375
57545B25375K355K841K944K343J552J068M98o43j728j587j13J521K237J939J114
$$ 225375 227730 230571 233515 235858 237410 238478 238976 238333 236605 235018 234905 236426 238663 240602 241716
57530B41716K25l52m11j37K5j44n12p87o83j47L49J18p73j303o77O23J532J738
$$ 241716 241941 241589 241178 241041 241066 240922 240410 239623 238940 238793 239142 239260 238487 237184 236507 237130 238662 240400
57512B40400J707J722J642J412J196J070J105J472J952J797P20l64m39J54K71
$$ 240400 242107 243829 245471 246883 248079 249149 250254 251726 253678 255475 256195 255831 255392 255546 255817
57497B55817l39r30j161j424j815j920j805k027k505k463j753j167j057q08j79
$$ 255817 255478 254548 253387 251963 250148 248228 246423 244396 241891 239428 237675 236508 235451 234643 234464
57482B34464j9q40j739j629p80j84p8j16l61j084j866j972j470j111j155j196
$$ 234464 234445 233605 231866 230237 229457 229273 229195 229079 228718 227634 225768 223796 222326 221215 220060 218864
57466B18864j080j150j457j533j116n38j60N3J60%m27p35o61m25k72O2R32K007
$$ 218864 217784 216634 215177 213644 212528 211990 211830 211883 212043 212043 211616 210881 210220 209795 209523 209585 210517 212524
57448B12524K404J756P40K60L53L01k66q47q12j77O29J426K217K703K438J495
$$ 212524 214928 216684 217424 217684 218037 218338 218072 217225 216413 216236 216865 218291 220508 223211 225649 227144
57432B27144N00o6k19j61k4M0q0j81J4L81N46N42P76J187J114K32q51j347j205
$$ 227144 227644 227578 227359 227198 227174 227214 227134 226953 226967 227348 227894 228436 229212 230399 231513 231745 230894 229547 228342
57413B28342r22q05q01p67n94k06K98P07R83J189J130M78n54j242j269j124j269
$$ 228342 227420 226615 225814 225047 224453 224247 224545 225252 226235 227424 228554 229032 228478 227236 225967 224843 223574
57396B23574j484j408j207j138r49l56K87M22J83J91O18J102J502K121L078M007
$$ 223574 222090 220682 219475 218337 217388 217032 217319 217741 217924 218115 218733 219835 221337 223458 226536 230543
57380B30543M502M514M131L351K269J290R07J164J451J025j67j396k062k395k783
$$ 230543 235045 239559 243690 247041 249310 250600 251507 252671 254122 255147 254980 253584 251522 249127 246344
57365B46344k841k019r08p69j569j765o03O55O54o1k06J5n20j670k050j239l34
$$ 246344 243503 241484 240576 239807 238238 236473 235870 236525 237179 237118 236912 236927 236407 234737 232687 231448 231114
57348B31114j51k23J3K09o8n21p42q40r54p85j88M05O00N98O32M87O3j39L54J255
$$ 231114 230963 230740 230753 230962 230894 230373 229631 228791 227837 227052 226864 227269 227869 228467 229099 229586 229649 229510 229864 231119
57328B31119J911K100K002J769J596J895K766L568L530K671J733J312J394J696
$$ 231119 233030 235130 237132 238901 240497 242392 245158 248726 252256 254927 256660 257972 259366 261062
57314B61062K013K285K538K778K849K545J991J642J707J844J669J301J134J266
$$ 261062 263075 265360 267898 270676 273525 276070 278061 279703 281410 283254 284923 286224 287358 288624
57300B88624J465J512J320Q69L42J88P07J626K320K431K136J805J661J645J538
$$ 288624 290089 291601 292921 293790 294132 294320 295027 296653 298973 301404 303540 305345 307006 308651 310189
57285C10189J264J087J326J855K169K153K326L075L944M111L402K440J946K212
$$ 310189 311453 312540 313866 315721 317890 320043 322369 325444 329388 333499 336901 339341 341287 343499
57271C43499L092M073M476M024L256K923L071L118K862K780L154L528L433L130
$$ 343499 346591 350664 355140 359164 362420 365343 368414 371532 374394 377174 380328 383856 387289 390419
57257C90419L077L015K290J060L72Q42J790K111J630J171J555K863M552N791N768
$$ 390419 393496 396511 398801 399861 400233 401075 402865 404976 406606 407777 409332 412195 416747 422538 428306
57242D28306M314K328J208J575K804L963M787N513O118O295O039N782N906O372
$$ 428306 432620 434948 436156 437731 440535 444498 449285 454798 460916 467211 473250 479032 484938 491310
57228D91310O901P311P611P867Q041P948P494P022P130P946Q812R024Q718Q694
$$ 491310 498211 505522 513133 521000 529041 536989 544483 551505 558635 566581 575393 584417 593135 601829
57214F01829R396J0437J1106J1103J0689J0409J0673J1471J2425J3191J3730J4120
$$ 601829 611225 621662 632768 643871 654560 664969 675642 687113 699538 712729 726459 740579
57202G40579J4283J4155J3946J3937J4088J4111J3912J3715J3825J4443J5584
$$ 740579 754862 769017 782963 796900 810988 825099 839011 852726 866551 880994 896578
57191H96578J6986J8248J9216K0055K0813K1323K1698K2469K3668K4358K3702
$$ 896578 913564 931812 951028 971083 991896 1013219 1034917 1057386 1081054 1105412 1129114
57180A129114K2232K1269K1298K1721K2018K2280K2580K2781K3165K4391K6453
$$ 1129114 1151346 1172615 1193913 1215634 1237652 1259932 1282512 1305293 1328458 1352849 1379302
57169A379302K8434K9693L0685L2115L3890L5435L6574L7616L8787M0047M1271
$$ 1379302 1407736 1437429 1468114 1500229 1534119 1569554 1606128 1643744 1682531 1722578 1763849
57158A763849M2312M2968M3157M2917M2170M0829L9246L8231L8384L9540M1032
$$ 1763849 1806161 1849129 1892286 1935203 1977373 2018202 2057448 2095679 2134063 2173603 2214635
57147B214635M2233M2846M2976M3004M3134M3039M2188M0433L8019L5221L2393
$$ 2214635 2256868 2299714 2342690 2385694 2428828 2471867 2514055 2554488 2592507 2627728 2660121
57136B660121L0042K8337K6801K5140K3981K3964K4461K4411K4298K5982L0262
$$ 2660121 2690163 2718500 2745301 2770441 2794422 2818386 2842847 2867258 2891556 2917538 2947800
57125B947800L5676M0053M2168M1745L9126L5626L3149L2732L4150L7099M1687
$$ 2947800 2983476 3023529 3065697 3107442 3146568 3182194 3215343 3248075 3282225 3319324 3361011
57114C361011M7259N2095N5160N7316O0282O5321P3385Q5285J00947J19470J40611
$$ 3361011 3408270 3460365 3515525 3572841 3633123 3698444 3771829 3857114 3958061 4077531 4218142
57103D218142J65526J95922K33867K82589L45413M23145N14160O17691P35060
$$ 4218142 4383668 4579590 4813457 5096046 5441459 5864604 6378764 6996455 7731515
57094G731515Q66857J011227J165296J324880J480869J618265J719155J762184
$$ 7731515 8598372 9609599 10774895 12099775 13580644 15198909 16918064 18680248
57086A8680248J720142J571304J326147J039278P80053N83786M33978K90429J26217
$$ 18680248 20400390 21971694 23297841 24337119 25117172 25700958 26134936 26425365 26551582
57077B6551582o1955k63844m63094o39980p79795q82184r58513j020327j073598
$$ 26551582 26489627 26225783 25762689 25122709 24342914 23460730 22502217 21481890 20408292
57068B0408292j121135j163303j195217j208584j198586j166473j115434j048118
$$ 20408292 19287157 18123854 16928637 15720053 14521467 13354994 12239560 11191442
57060A1191442r69395q87473q09472p37650o71290o10277n55352n06758m64208
$$ 11191442 10222047 9334574 8525102 7787452 7116162 6505885 5950533 5443775 4979567
57051D979567m27057l93561l61493l30458l02380k78979k60016k44493k31639
$$ 4979567 4552510 4158949 3797456 3466998 3164618 2885639 2625623 2381130 2149491
57042B149491k19810k06290j89712j71504j53761j36896j20486j05025r1268p8797
$$ 2149491 1929681 1723391 1533679 1362175 1208414 1071518 951032 846007 754739 675942
57032F75942o6681n4948m4137l4134k4609j5885q051R2R891K1116L2693M4369
$$ 675942 609261 554313 510176 476042 451433 435548 427497 427589 437480 458596 491289 535658
57020E35658N5947O5143O8104O2551M9174K9822O026j9930m3938o1660p1131p3284
$$ 535658 591605 656748 724852 787403 836577 866399 872425 852495 808557 746897 675766 602482
57008F02482p0312o4296n7030n0042m4114l9009l4047k9057k4554k1046j8343
$$ 602482 532170 467874 410844 360802 316688 277679 243632 214575 190021 168975 150632
56997A50632j5838j3273j1009r454q542p839o940n691m229k746j125J100M029
$$ 150632 134794 121521 110512 101058 92516 84677 77737 72046 67817 65071 63946 65046 69075
56984F9075O849Q526Q969Q829Q192O270K744j403m880p268q767r381r081q289
$$ 69075 75924 84450 93419 102248 110440 116710 119454 118051 113171 105903 97136 87755 78674 70385
56970G0385p455o464n007l243j527K02K184M303O416Q897J2056J5309J7668J8927
$$ 70385 62930 56466 51459 48216 46689 46891 49075 53378 59794 68691 80747 96056 113724 132651
56956A32651J9491J9180J7058J2657O664K10n840j0724j3758j4875j4711j3867
$$ 132651 152142 171322 188380 201037 207701 207911 202071 191347 177589 162714 148003 134136
56944A34136j2443j0474q302o194m036j732N24K711N364Q950J3083J6742J9271
$$ 134136 121693 111219 102917 96723 92687 90955 91479 94190 99554 108504 121587 138329 157600
56931A57600K0848K1963K2590K1931J8929J3096M993m001j2288j8538k2069k3115
$$ 157600 178448 200411 223001 244932 263861 276957 281950 277949 265661 247123 225054 201939
56919B01939k2601k1318j9407j6868j4297j2496j1514j0671r527q291p133n836
$$ 201939 179338 158020 138613 121745 107448 94952 83438 72767 63240 54949 47816 41980
56907D1980m368l232k755k490j796p56j2J44J87P97K104L504M250M325M621N963
$$ 41980 37612 34380 31625 29135 27339 26583 26571 26715 26902 27699 29803 33307 37557 41882 46503 52466
56891E2466Q051R852J0959J1929J3152J4144J4362J4039J3541J2363R604N228
$$ 52466 60517 70369 81328 93257 106409 120553 134915 148954 162495 174858 184462 189690
56879A89690K79m086p220q863r073q308p074n404l061k36K483M907P414J0206
$$ 189690 189969 185883 178663 169800 160727 152419 145345 139941 136880 136644 139127 144034 151448 161654
56865A61654J2932J5405J8197K2015K6637L0908L3769L4910L4283L1316K5109
$$ 161654 174586 189991 208188 230203 256840 287748 321517 356427 390710 422026 447135
56854D47135J5572M214o524j4778j9988k2370k2182j9775j5943j1690p612l726
$$ 447135 462707 466921 460397 445619 425631 403261 381079 361304 345361 333671 326059 322333
56842C22333K48M696J0039J6441K3541L0795L7984M5036N1387N5929N7684N6039
$$ 322333 322581 327277 337316 353757 377298 408093 446077 491113 542500 598429 656113 712152
56830G12152N0196L9040K2311J968j8079l4005m4060m8818m9877m8453m5079m0143
$$ 712152 762348 801388 823699 825667 807588 773583 729523 680705 630828 582375 537296 497153
56818D97153l4254k8046k1868j5728r454k847M068J0913J7315K3369K9343L4771
$$ 497153 462899 434853 412985 397257 387803 384956 389024 399937 417252 440621 469964 504735
56806E04735L8296L8643L5287K7948J6295J053j4996k8247l6738m0895m1969m0723
$$ 504735 543031 581674 616961 644909 661204 662257 647261 619014 582276 541381 499412 458689
56794D58689l7700l3735k9460k4820j9679j4513j0007o213k583J294N364R331
$$ 458689 420989 387254 357794 332974 313295 298782 288775 282562 279979 281273 286637 295968
56782B95968J2887J5775J7799J8621J7532J3793P475l64q461j5989k2195k6106
$$ 295968 308855 324630 342429 361050 378582 392375 399850 399486 391025 375036 352841 326735
56770C26735k7194k6091k4041k1805j9543j7524j6149j5259j4051j1992r493p473
$$ 326735 299541 273450 249409 227604 208061 190537 174388 159129 145078 133086 123593 116120
56758A16120o535o622p163p328o514m809k994j869j649k007k505k860k871k390
$$ 116120 109585 102963 95800 88472 81958 77149 74155 72286 70637 68630 66125 63265 60394 58004
56744E8004j469n18p7k73n96m48Q9L43j5m76l57L27R77J157R11M68R3J47Q69K016
$$ 58004 56535 56017 55940 55667 55071 54623 54712 55055 55040 54564 54207 54534 55511 56668 57579 58047 58140 58287 59156 61172
56724F1172K951L247K971K421J836J351R90O10O9n30q64p20j22P86J781K500K596
$$ 61172 64123 67370 70341 72762 74598 75949 76939 77549 77618 77088 76224 75504 75382 76168 77949 80449 83045
56707H3045K080J331O85K51R6L65J043J743J949J439M96k89m79j44K17K13j9o0
$$ 83045 85125 86456 87141 87392 87488 87853 88896 90639 92588 94027 94523 94234 93755 93611 93828 94041 94022 93962
56689I3962K66P56J123J199Q98L33o7J24P45J100P57Q0k21O7N18O42L81Lk71m53
$$ 93962 94228 94984 96107 97306 98204 98537 98470 98594 99339 100439 101196 101276 101055 101122 101640 102282 102663 102666 102395 101942
56669A01942n74m78M0Q64J478J477J049P59R05J268J507J528J373J041N94L54
$$ 101942 101368 100890 100930 101794 103272 104749 105798 106557 107462 108730 110237 111765 113138 114179 114773 115127
56653A15127O95J575K459K768K462K015J781J562R81J97j39L04J054J437J332
$$ 115127 115822 117397 119856 122624 125086 127101 128882 130444 131425 131622 131483 131787 132841 134278 135610
56638A35610J018N64j25q24j076q50o69r24j431j841k087k206k034j484r21q74
$$ 135610 136628 137192 137067 136243 135167 134317 133648 132724 131293 129452 127365 125159 123125 121641 120720 119846
56622A19846j362j784j609r85n46o39r71j067r75j180j810k246j839p65J58M54
$$ 119846 118484 116700 115091 114106 113560 112921 111950 110883 109908 108728 106918 104672 102833 102068 102226 102680
56606A02680L67L26M06M35L10K1l77o93o39j51M52P26M68j07m87k21N70J163J002
$$ 102680 103047 103373 103779 104214 104524 104545 104168 103475 102836 102685 103137 103863 104331 104224 103737 103516 104086 105249 106251
56587A06251M15K40P29J274J328J108J178J649K128K216J843J237P56O30Q10J181
$$ 106251 106666 106906 107635 108909 110237 111345 112523 114172 116300 118516 120359 121596 122352 122982 123792 124973
56571A24973J859K947L994M211L458K594K540L305M264N014N665O484P606Q882
$$ 124973 126832 129779 133773 137984 141442 144036 146576 149881 154145 159159 164824 171308 178914 187796
56557A87796R754R568Q345O860N605M074J681r58k501k567k209k523l387l913
$$ 187796 197550 207118 215463 222323 227928 232002 233683 232725 230224 227657 225448 222925 219538 215625
56543B15625l633k870k220k031k277k674k903k805k374j714j158j181j867k551
$$ 215625 211992 209122 206902 204871 202594 199920 197017 194212 191838 190124 188966 187785 185918 183367
56529A83367k519j965j725k006k050j349n38m92j025j185o36l0l2n38j034j226
$$ 183367 180848 178883 177158 175152 173102 171753 171215 170723 169698 168513 167877 167847 167815 167277 166243 165017
56513A65017j148j038j251j938k680k786k186j607j576j653j129j34N04L91o7
$$ 165017 163869 162831 161580 159642 156962 154176 151990 150383 148807 147154 146025 145891 146395 146786 146719
56498A46719m36p55j055r57k33O14Q09K46m33o59m68j61K06P89J524J991J829
$$ 146719 146283 145528 144473 143516 143283 143897 144706 144952 144519 143860 143392 143231 143437 144226 145750 147741 149570
56481A49570J228P75P52P71L80j50j49M77J077J210J148J219J238R55N88L96J66
$$ 149570 150798 151573 152325 153096 153476 153326 153177 153654 154731 155941 157089 158308 159546 160501 161089 161485 161651
56464A61651k68m90j17L83K99j76l04m0N0lM79J494K153K092K014K306K186J006
$$ 161651 161383 160893 160776 161159 161458 161282 160978 160938 160988 160985 161464 162958 165111 167203 169217 171523 173709 174715
56446A74715m36q74k35N28Q33Q23O34K30j93l63m12n82o57l28Q2ll88l05L93J017
$$ 174715 174279 173405 173170 173698 174531 175354 175988 176218 176025 175662 175250 174668 174011 173683 173765 173762 173374 173069 173462 174479
56426A74479J100R53R77J076J015Q10N37J67j51j68j2j58o78j001o25L31J472
$$ 174479 175579 176532 177509 178585 179600 180410 180947 181114 180963 180795 180783 180625 179947 178946 178321 178652 180124
56409A80124K498L031K602J302J6m13o2M36P98J111J214P04l44j127q75K82J391
$$ 180124 182622 185653 188255 189557 189573 189160 189098 189534 190332 191443 192657 193361 193017 191890 191015 191297 192688
56392A92688J588R30L47O86J776K554K197R79j29n30m13k43j35J01N33R47J143
$$ 192688 194276 195206 195553 196239 198015 200569 202766 203745 203616 203086 202673 202430 202295 202396 202929 203876 205019
56375B05019J215J414J757J937J704J193P34M48K36N3j8L3J56L98Q06J104Q56
$$ 205019 206234 207648 209405 211342 213046 214239 214973 215421 215657 215710 215692 215725 215881 216279 217085 218189 219045
56358B19045J42l13K2P34R72N72K25M58R58J123R20P91Q88R31Q65J102J794K348
$$ 219045 219187 218874 218896 219630 220602 221174 221399 221857 222815 223938 224858 225649 226537 227468 228333 229435 231229 233577
56340B33577K142J537J530K380L178L085K420K058K159K075J419O02K66N62J180
$$ 233577 235719 237256 238786 241166 244344 247429 249849 251907 254066 256141 257560 258162 258428 258990 260170
56325B60170J734J995J996K031K321K600K364J580Q49O17O61O24P05J271J949
$$ 260170 261904 263899 265895 267926 270247 272847 275211 276791 277640 278257 278918 279542 280247 281518 283467
56310B83467J784M89r69j395o52M71J398K201K952L345L257L224L827M832N422
$$ 283467 285251 285740 284771 283376 282724 283195 284593 286794 289746 293091 296348 299572 303399 308231 313653
56295C13653N185M489L848L406L147L096L114K855K214J627J627K254L158M066
$$ 313653 318838 323327 327175 330581 333728 336824 339938 342793 345007 346634 348261 350515 353673 357739
56281C57739M903N564N930O068O158O215O112N881N782O001O375O635O865P532
$$ 357739 362642 368206 374136 380204 386362 392577 398689 404570 410352 416353 422728 429363 436228 443760
56267D43760Q878J0438J1473J1944J2617J3967J5458J6438J7364J9346K2573K6059
$$ 443760 452638 463076 474549 486493 499110 513077 528535 544973 562337 581683 604256 630315
56255F30315K9102L2127L5714L9605M3289M6918N0990N5451N9849O4034O8089
$$ 630315 659417 691544 727258 766863 810152 857070 908060 963511 1023360 1087394 1155483
56244A155483P1750P4450P5889P6076P4965P2454O8568O3329N6624M8537L9461
$$ 1155483 1227233 1301683 1377572 1453648 1528613 1601067 1669635 1732964 1789588 1838125 1877586
56233A877586K9504J8219N495p649j9779l0338l9589m7610n4121n9111o2831o5257
$$ 1877586 1907090 1925309 1930804 1923155 1903376 1873038 1833449 1785839 1731718 1672607 1609776 1544519
56221A544519o6237o6132o5424o3821o0636n6175n1891m8801m6547m4244m1548
$$ 1544519 1478282 1412150 1346726 1282905 1222269 1166094 1114203 1065402 1018855 974611 933063
56210I33063l8611l5669l3160l1564l0638k9313k6908k4044k1922k0918k0295
$$ 933063 894452 858783 825623 794059 763421 734108 707200 683156 661234 640316 620021
56199F20021j9062j6862j4184j1890j0358r014p056m653k901k403k513k313j788
$$ 620021 600959 584097 569913 558023 547665 538651 531595 526942 524041 521638 519125 516812 515024
56186E15024j514j602j572j061k15N74J010J014Q56R91J568K190K416K358K536
$$ 515024 513510 511908 510336 509275 509060 509634 510644 511658 512514 513505 515073 517263 519679 522037 524573
56171E24573L229M190M966N303N300N296N544N941O107N864N506N588O498Q211
$$ 524573 527802 531992 536958 542261 547561 552857 558401 564342 570449 576313 581819 587407 593905 602116
56157F02116J0327J2302J3868J5260J6905J8954K1230K3582K6038K8766L2088
$$ 602116 612443 624745 638613 653873 670778 689732 710962 734544 760582 789348 821436
56146H21436L6493M2307M9344N7189O5822P5613Q6716R8656J10607J21760J31363
$$ 821436 857929 900236 949580 1006769 1072591 1148204 1234920 1333576 1444183 1565943 1697306
56135A697306J38628J42706J42612J37413J26964J12534R6608Q1871P0229O2221
$$ 1697306 1835934 1978640 2121252 2258665 2385629 2498163 2594771 2676642 2746871 2809092
56125B809092N6810N1857M5306L6095K4148J0102m602j7918k8498l6907m5114
$$ 2809092 2865902 2917759 2963065 2999160 3023308 3033410 3028808 3010890 2982392 2945485 2900371
56114B900371n4851o6810q0936r6564j12143j25480j34625j38432j36737j30471
$$ 2900371 2845520 2778710 2697774 2601210 2489067 2363587 2228962 2090530 1953793 1823322
56104A823322j21294j10498r8381q5282p2556o1686n2699m4592l7068l0787k5926
$$ 1823322 1702028 1591530 1493149 1407867 1335311 1273625 1220926 1176334 1139266 1108479 1082553
56093A082553k1794j7956j4670j1920r235o689n023m295l483j931k66P51J385
$$ 1082553 1060759 1042803 1028133 1016213 1006978 1000289 995266 990971 987488 985557 985291 986042 987427
56080I87427K276L360M154M651N319O465P923R119R419Q873Q536R422J1185J2614
$$ 987427 989703 993063 997217 1001868 1007187 1013652 1021575 1030694 1040113 1048986 1057522 1066944 1078129 1090743
56066A090743J3285J3796J4483J5052J5559J6440J7372J7333J6225J5175J4806
$$ 1090743 1104028 1117824 1132307 1147359 1162918 1179358 1196730 1214063 1230288 1245463 1260269
56055A260269J4438J3518J2606J2258J2197J2266J3006J4466J5599J5836J6177
$$ 1260269 1274707 1288225 1300831 1313089 1325286 1337552 1350558 1365024 1380623 1396459 1412636
56044A412636J7714J9954K1593K2243K2514K2997K4008K5625K7376K8466K8892
$$ 1412636 1430350 1450304 1471897 1494140 1516654 1539651 1563659 1589284 1616660 1645126 1674018
56033A674018K9476L0451L1088L1225L1907L3734L5821L7259L8415L9876M1264
$$ 1674018 1703494 1733945 1765033 1796258 1828165 1861899 1897720 1934979 1973394 2013270 2054534
56022B054534M2210M3358M5235M7213M8728N0568N3690N7566O0959O3600O6116
$$ 2054534 2096744 2140102 2185337 2232550 2281278 2331846 2385536 2443102 2504061 2567661 2633777
56011B633777O8902P2021P5544P9182Q2454Q5789R0398R6314J01913J06260J10564
$$ 2633777 2702679 2774700 2850244 2929426 3011880 3097669 3188067 3284381 3386294 3492554 3603118
56000C603118J16250J22983J29810J36908J44820J53220J61745J71031J81587
$$ 3603118 3719368 3842351 3972161 4109069 4253889 4407109 4568854 4739885 4921472
55991D921472J92778K04065K16167K29876K44999K61416K79857L00609L22985
$$ 4921472 5114250 5318315 5534482 5764358 6009357 6270773 6550630 6851239 7174224
55982G174224L47046L74191M05021M38607M74915N15955N63341O16900O76956
$$ 7174224 7521270 7895461 8300482 8739089 9214004 9729959 10293300 10910200 11587156
55973A1587156P45716Q25155R16012J020277J142216J286055J455914J659588
$$ 11587156 12332872 13158027 14074039 15094316 16236532 17522587 18978501 20638089
55965B0638089J909676K220213K605340L080295L656634M333779N100648N949609
$$ 20638089 22547765 24767978 27373318 30453613 34110247 38444026 43544674 49494283
55957D9494283O887831P938795R141342J0547513J2214866J4202923J6573564
$$ 49494283 56382114 64320909 73462251 84009764 96224630 110427553 127001117
55950A27001117J9349769K2407354K5399013K7849703K9354286K9594938K8087044
$$ 127001117 146350886 168758240 194157253 222006956 251361242 280956180 309043224
55943C09043224K4035528J6754338O474944n255112j6134540k4247418k8853266
$$ 309043224 333078752 349833090 356308034 351052922 334918382 310670964 281817698
55936B81817698l0333438k9600968k7562946k4897779k2045881j9261408j6674445
$$ 281817698 251484260 221883292 194320346 169422567 147376686 128115278 111440833
55929A11440833j4348502j2309651j0551792r046747p762995o673114n749003
$$ 111440833 97092331 84782680 74230888 65184141 57421146 50748032 44999029
55922D4999029m962455m292210l723455l240766k827894k473502k170853j912310
$$ 44999029 40036574 35744364 32020909 28780143 25952249 23478747 21307894 19395584
55914A9395584j689388j497123j333080j192480j068968r59415q63635p79999
$$ 19395584 17706196 16209073 14875993 13683513 12614545 11655130 10791495 10011496
55906A0011496p05288o38146n78761n25675m76611m31848l93219l60111l29761
$$ 10011496 9306208 8668062 8089301 7563626 7087015 6655167 6261948 5901837 5572076
55897E572076l01191k75689k53638k33853k15989k00735j87548j74662j61626
$$ 5572076 5270885 4995196 4741558 4507705 4291716 4090981 3903433 3728771 3567145
55888C567145j49691j39551j30497j21837j13524j05418r7409q9993q3503p7237
$$ 3567145 3417454 3277903 3147406 3025569 2912045 2806627 2709218 2619225 2535722 2458485
55878B458485p0620o4466n9757n6010n2413m9723m9408n1540n5025n9055o2830
$$ 2458485 2387865 2323399 2263642 2207632 2155219 2105496 2056088 2004548 1949523 1890468 1827638
55867A827638o4810o4044o1635n9240n6832n3598n0046m7318m5134m2444l9626
$$ 1827638 1762828 1698784 1637149 1577909 1521077 1467479 1417433 1370115 1324981 1282537 1242911
55856A242911l7986l7348l6073l3394l0052k6778k3787k1618k0805k0762k0407
$$ 1242911 1204925 1167577 1131504 1098110 1068058 1041280 1017493 995875 975070 954308 933901
55845I33901j9853j9997k0645k0635j9731j8886j8494j7829j6431j4777j3395
$$ 933901 914048 894051 873406 852771 833040 814154 795660 777831 761400 746623 733228
55834G33228j2382j1902j2109j2494j2266j1384j0421r562q607p657o920o203
$$ 733228 720846 708944 696835 684341 672075 660691 650270 640708 632101 624444 617524 611321
55822F11321n482n462o553p823q158p903q007q165p389o038n525o110o578o135
$$ 611321 605839 600377 593824 586001 577843 569940 561933 553768 546379 540341 534816 528706 522128 515993
55808E15993n143l933k392q59P0P39K019L622M297L954L888M563M730L372J058
$$ 515993 510850 506917 504525 503666 503736 504475 506494 510116 514413 518367 522255 526818 531548 534920 535978
55793E35978j371m052p116r632j0661j0499r974r210p959o524n488m931m586m527
$$ 535978 534607 530555 523439 513807 503146 492647 482673 473463 465504 458980 453492 448561 443975 439448
55779D39448n111o386p909r007r087q060o593n586n275n166m784m011k818j345
$$ 439448 434337 427951 420042 411035 401948 393888 387295 381709 376434 371268 366484 362473 359655 358310
55765C58310k25r9p29j276j504j934k766l418l483l341l496l873m072l846l163
$$ 358310 358085 357986 357257 355981 354477 352543 349777 346359 342876 339535 336039 332166 328094 324248 321085
55750C21085k279j907k734m569o440p593p926p575o728n870n449n202m603l911
$$ 321085 318806 316899 314165 309596 303156 295563 287637 280062 273334 267464 262015 256813 252210 248299
55736B48299l964m753n258m870m108l500k794j748r01q45j359j852k142k290k198
$$ 248299 244335 239582 234324 229454 225346 221846 219052 217304 216403 215558 214199 212347 210205 207915 205717
55721B05717j882j703j838j919j628j212j004q05k19O72J398J574J128L19k42
$$ 205717 203835 202132 200294 198375 196747 195535 194531 193726 193507 194179 195577 197151 198279 198598 198356
55706A98356l0P26J246J209J057J091R31K55n21p92n73k45J33O71J111J027M98
$$ 198356 198326 199052 200298 201507 202564 203655 204586 204841 204320 203528 202955 202710 202843 203514 204625 205652 206150
55689B06150J31L62R57J273Q90P6n20o01n94j012j686k029j778j091j57O77O45
$$ 206150 206281 206643 207600 208873 209763 209839 209319 208718 208124 207112 205426 203397 201619 200528 200371 201048 201693
55672B01693o85k486l334k888k113j762j686j741k261l172l601l017j974j108
$$ 201693 201008 198522 195188 192300 190187 188425 186739 184998 182737 179565 175964 172947 170973 169865
55658A69865k46Q54J709J866J799K185K853L184L076K718J886M01j127j926k233
$$ 169865 169619 170473 172182 174048 175847 178032 180885 184069 187145 189863 191749 192150 191023 189097 186864
55643A86864k975m400n727o141n488m184k961k583l160l939m199m078l954l512
$$ 186864 183889 179489 173762 167621 162133 157949 154988 152405 149245 145306 141107 137029 133075 129563
55629A29563k246n82M99Q06J000J243R15j61j134j227p27m54p48j329j712j468
$$ 129563 127317 126735 127234 128040 129040 130283 131198 131037 129903 128676 127949 127495 126747 125418 123706 122238
55613A22238n28M32M18p55k057k425j926j399j255j190r53p44p33o64j87N46R88
$$ 122238 121710 122142 122560 121805 119748 117323 115397 113998 112743 111553 110600 109856 109123 108459 108272 108818 109806
55596A09806Q37L45j32n82j168j758k017j903j698j450q51J44J025J341J328J506
$$ 109806 110643 110988 110856 110274 109106 107348 105331 103428 101730 100280 99429 99573 100598 101939 103267 104773
55580A04773J970K454K801K955K678J878J099J094J844K462K326J889K114L327
$$ 104773 106743 109197 111998 114953 117631 119509 120608 121702 123546 126008 128334 130223 132337 135664
55566A35664M828N584N200M161L191K380J236m54k136l143l526l904m600n281
$$ 135664 140492 146076 151276 155437 158628 161008 162244 161790 159654 156511 152985 149081 144481 139200
55552A39200n338m437k875j624j623k659l322k587j065j9M41J175K241K537J522
$$ 139200 133862 129425 126550 124926 123303 120644 117322 114735 113670 113651 114092 115267 117508 120045 121567
55537A21567K13j80K20M99L67K38K76J91j68o93j383k243k830k547j533p43r11
$$ 121567 121780 121600 121820 122319 122686 122924 123200 123391 123223 122530 121147 118904 116074 113527 111994 111251 110340
55520A10340j720k240k013j483j417k022k681k634j878j170j055j246j178q46
$$ 110340 108620 106380 104367 102884 101467 99445 96764 94130 92252 91082 90027 88781 87603 86757
55506H6757o79p54o99l38J09M94Q86J126Q07p0q70j132j126j221j127m45L52L36
$$ 86757 86078 85324 84625 84287 84396 84890 85776 86902 87709 87639 86769 85637 84511 83290 82163 81718 82070 82406
55488H2406m71r31l35N92P83L49L10J014J696J686J325J269J442J235N11j74l67
$$ 82406 81935 81004 80669 81261 82044 82393 82703 83717 85413 87099 88424 89693 91135 92370 92881 92707 92340
55471I2340k15n6M7K8m71j601k700k783j719m71Q6P3P1J30j10o12r23q91p93o30
$$ 92340 92125 92069 92116 92144 91673 90072 87372 84589 82870 82399 82485 82558 82629 82759 82649 82037 81114 80223 79430 78800
55451G8800j7R42J393Q15q5k32L91Q55P07N28R18J565J636Q30l55j224j451j159
$$ 78800 78783 79725 81118 81933 81848 81616 82007 82862 83569 84097 85015 86580 88216 89046 88691 87467 86016 84857
55433H4857o75l28k87m36l44M16J683K594K342J116q4o10p03p61o57j96K44J84
$$ 84857 84182 83854 83567 83131 82787 83203 84886 87480 89822 90938 90854 90244 89541 88780 88123 87927 88171 88355
55415H8355k23n00o23p98p38qJ030J439R68L03n9l15o00o11l65m94j297k148k321
$$ 88355 88132 87632 87009 86211 85473 85465 86495 87934 88902 89205 89146 88831 88231 87620 87255 86761 85464 83316 80995
55396H0995j838j002P9J032J001k31j505j527m67N04R22J266J737J837J315O40
$$ 80995 79157 78155 78234 79266 80267 80036 78531 77004 76537 77041 77963 79229 80966 82803 84118 84758
55380H4758L01K36J65o2m90r99j152o52K8J13l50m99M9O11M53j72m66j55L16M17
$$ 84758 85059 85295 85460 85398 84908 83909 82757 82105 82133 82246 81896 81397 81446 82057 82510 82338 81872 81717 82033 82450
55360H2450J6n98r92r75q22q62r16n02L19Q16N10k13p06q70r88j063p66K5R89
$$ 82450 82466 81868 80876 79901 79079 78217 77301 76799 77118 77934 78444 78231 77525 76655 75667 74604 73838 73863 74852
55341G4852J613J566Q95L2n60p63p09l87K64R32J098Q11P06J011J083M68k20j32
$$ 74852 76465 78031 78926 78958 78398 77635 76926 76539 76803 77735 78833 79644 80350 81361 82444 82912 82692 82560
55323H2560M73O13N8m21l51k06m80q43p14j81J90J78N9N3M3j02k58j58K91R03
$$ 82560 83033 83646 83704 83283 82932 82726 82246 81403 80689 80508 80698 80876 80935 80988 81031 80929 80671 80513 80804 81707
55303H1707J315J328J104R56R03O59J04m85p87p86n73p8O52J124P81k10r98r85
$$ 81707 83022 84350 85454 86410 87313 87972 88076 87591 86804 86018 85445 85367 86019 87143 87924 87714 86716 85731
55285H5731m84k21m61p70o21J8O79R13O90L02n2l91o72o36k38N2k02o89o42N1
$$ 85731 85247 85026 84565 83795 83174 83192 83871 84784 85474 85776 85724 85333 84661 84025 83787 83839 83637 82948 82306 82357
55265H2357O07M32o4j47K01M17K96K02L59N73O42O20N28K25k25m82l34K9L08M15
$$ 82357 82964 83396 83332 83185 83386 83803 84099 84301 84660 85233 85875 86495 87023 87248 87023 86541 86207 86236 86544 86959
55245H6959L73J94k1j11j11k82p73j422j986k266j981r26N35J467J224J37q44
$$ 86959 87332 87526 87505 87394 87283 87001 86228 84806 82820 80554 78573 77647 78182 79649 80873 81010 80166
55228H0166j051m94L58R22Q81M86L29O16Q45M89k76p50m74M43J501K097J804P37
$$ 80166 79115 78621 78979 79901 80782 81268 81597 82213 83058 83547 83271 82521 82047 82490 83991 86088 87892 88629
55210H8629m87j358j829j907j329q2J111J465J050N35J61l18p34m10P56J814J807
$$ 88629 88142 86784 84955 83048 81719 81637 82748 84213 85263 85798 85959 85641 84907 84497 85253 87067 88874
55193H8874Q87k9m14n21p21r35p59p3O14N90j94r21p67J20R79J456J761J827J137
$$ 88874 89761 89732 89318 88797 88076 87141 86382 86309 86923 87513 87319 86398 85631 85751 86730 88186 89947 91774 92911
55174I2911l62j796k283j859j071j45Q62J452J036j03q82o61O3M34L08K09M59
$$ 92911 92549 90753 88470 86611 85540 85395 86257 87709 88745 88642 87760 87099 87162 87596 87904 88113 88572
55157H8572P88Q36O71N86N71K69m38j119j274r50n85l09J14O81R16M91k51p02
$$ 88572 89360 90196 90867 91453 92024 92293 91855 90736 89462 88512 87927 87618 87732 88413 89329 89820 89569 88867
55139H8867o34k05M09J023J313J079N86K51R3j57m48m33j46j08n45q72m10O20
$$ 88867 88233 88028 88437 89460 90773 91852 92438 92689 92782 92625 92177 91744 91598 91490 90945 90073 89663 90283
55121I0283J268R91K28j87M1N34Q13P57N31K65oj55O8O43J006M77p85j616j016
$$ 90283 91551 92542 92770 92583 92624 93158 93971 94728 95259 95524 95518 95363 95431 96074 97080 97557 96772 95156 94140
55102I4140N92J707J480O03J85K91J95k29k56L90Q61L58o44j006m87P5j1n18q91
$$ 94140 94732 96439 97919 98522 98707 98998 99193 98964 98708 99098 99959 100317 99673 98667 98180 98255 98244 97726 96835
55083I6835r28o88j88M72J044J362J438J225O57P2O2O34R55M00n40q76m37K3j40
$$ 96835 95907 95219 95031 95503 96547 97909 99347 100572 101229 101301 101363 101997 102952 103352 102812 101936 101499 101522 101382
55064A01382q10j443j574j016m1O83P31N13O89J065Q00k35j041q36j15K32J41
$$ 101382 100572 99129 97555 96539 96498 97181 97912 98425 99114 100179 100979 100744 99703 98867 98752 98984 99125
55047I9125Q9J1m78j046q43J19P53L77l37m11J11M79L81J14j44n23r27r62m82
$$ 99125 99214 99225 98747 97701 96858 96977 97730 98107 97770 97359 97470 97949 98330 98444 98300 97777 96850 95888 95406
55028I5406J61N88P94R24R95Q67M59j19m91k74L89P62L80j95l7P83J155M59n69
$$ 95406 95567 96155 96949 97873 98868 99735 100194 100075 99584 99310 99699 100461 100841 100646 100609 101392 102547 103006 102437
55009A02437q65l95R5K72M96R31J163Q33K57L3K78N33M04N6l4L09P36Q49O53M44
$$ 102437 101572 101177 101272 101544 102040 102971 104134 104967 105224 105257 105535 106068 106472 106528 106494 106803 107539 108388 109041 109485
54989A09485L77L95M56M69J94m37r29o56K07P27L78l38o89n48j23N65J374J688
$$ 109485 109862 110257 110713 111182 111376 110939 110010 109354 109561 110288 110666 110328 109639 109091 108968 109533 110907 112595
54971A12595J081Q4l45K0O69J230J700J862J285Q4q97r56j84Q02J439J440Q53
$$ 112595 113676 113760 113415 113435 114104 115334 117034 118896 120181 120265 119368 118412 118228 119030 120469 121909 122762
54954A22762O2m88p00p36o73n18m40n53n93k44K64L89M6m03p63j010q00K24J562
$$ 122762 122824 122336 121636 120900 120227 119709 119269 118716 118123 117879 118143 118532 118578 118175 117412 116402 115602 115826 117388
54935A17388K145J691J022P81P39P13J195K386L374L274K597K512L165L704L811
$$ 117388 119533 121224 122246 123027 123766 124479 125674 128060 131434 134708 137305 139817 142982 146686 150497
54920A50497M107M911N531N258M347L519K866J803L7j928l239l606l552l835m624
$$ 150497 154604 159515 165046 170304 174651 178170 181036 182839 182876 180948 177709 174103 170551 166716 162092
54905A62092n379n478m814l773k880k529k742l007k636j572n76l74p68r18l75
$$ 162092 156713 151235 146421 142648 139768 137239 134497 131490 128854 127282 126706 126332 125564 124646 124271
54890A24271N09J120J210R94Q93J171J711K134K266K386K906L897N013N797N947
$$ 124271 124780 125900 127110 128104 128997 130168 131879 134013 136279 138665 141571 145468 150481 156278 162225
54875A62225N501M871M453M072L074J207q39k175k704l025l528m090m570n058
$$ 162225 167726 172597 177050 181122 184196 185403 184564 182389 179685 176660 173132 169042 164472 159414
54861A59414n545n686n180m161l085k330j970j832j646j268p98n11o27j071j482
$$ 159414 153869 148183 143003 138842 135757 133427 131457 129625 127979 126711 125913 125402 124775 123704 122222
54846A22222j477j089p93r50j329j409j088o87l66k2J94j55j002j530j124k01
$$ 122222 120745 119656 118863 117913 116584 115175 114087 113400 113034 113012 113206 113051 112049 110519 109395 109194
54830A09194L61K76p3k99k70J5L57L32j76o09l02O70J550J703J064N5o39n31Q0
$$ 109194 109555 109831 109758 109459 109189 109204 109561 109893 109717 109108 108806 109476 111026 112729 113793 113848 113209 112678 112758
54811A12758K87k44p07k68O96J225J178J163J273R63K41j15K38O16L27l62p28
$$ 112758 113045 112801 112094 111826 112522 113747 114925 116088 117361 118324 118565 118450 118688 119304 119631 119269 118541
54794A18541m98Q7O76R06N79Jj90K43R27J510J991K266K005J308R05J208J682
$$ 118541 118043 118130 118806 119712 120291 120292 120102 120345 121272 122782 124773 127039 129044 130352 131257 132465 134147
54777A34147J612J086O93O23O89J012J985L521M880N410N187M817M768N044N325
$$ 134147 135759 136845 137538 138161 138850 139862 141847 145368 150248 155658 160845 165662 170430 175474 180799
54762A80799N349N046M347L088J289o08k131l300m411n329n558n046m445m336
$$ 180799 186148 191194 195541 198629 199918 199310 197179 193879 189468 184139 178581 173535 169090 164754
54748A64754m657n011n103m659l505k027j059q88q72l94K32M11K74M10Q36J057
$$ 164754 160097 155086 149983 145324 141819 139792 138733 137845 136973 136579 136811 137222 137496 137906 138742 139799
54732A39799R51R17J102J179J010R98J556K629L869M949N572N508M886M202L805
$$ 139799 140750 141667 142769 143948 144958 145956 147512 150141 154010 158959 164531 170039 174925 179127 182932
54717A82932L479K698J222n94k111k976l472m134n025n600n401m645l867l182
$$ 182932 186411 189109 190331 189737 187626 184650 181178 177044 172019 166419 161018 156373 152506 149324
54703A49324k352j421r06j154j841k312k267j963j767j605j003K05J318J352K52
$$ 149324 146972 145551 144645 143491 141650 139338 137071 135108 133341 131736 130733 130938 132256 133608 133860
54688A33860q90j125p51o58r38r07l54Jl99j109j326r61n94o03q34j026j083r40
$$ 133860 132970 131845 131094 130436 129498 128591 128237 128238 127839 126730 125404 124443 123849 123246 122412 121386 120303 119363
54670A19363n08P1M11L19Q1J12M04O03N68N96Q61J006N69k52p38n22M9N12Q07
$$ 119363 118855 118926 119337 119656 119737 119849 120253 120856 121424 122020 122881 123887 124456 124204 123466 122944 122993 123505 124312
54651A24312R78Q05J44o35r93q74n78j75N08J326J793J707J391J178J047R02Q08
$$ 124312 125290 126095 126239 125604 124611 123737 123159 122984 123492 124818 126611 128318 129709 130887 131934 132836 133644
54634A33644P29M13k09p44q14n94n59q64j276j550j533j021j3R47J172P15L88
$$ 133644 134373 134786 134577 133833 133019 132425 131866 131002 129726 128176 126643 125622 125609 126556 127728 128443 128831
54617A28831O42Q59K70p75j105k64Q53J182P32K36nl56j004j457j097M3J244J719
$$ 128831 129473 130332 130602 129827 128722 128458 129311 130493 131225 131461 131456 131100 130096 128639 127542 127585 128829 130548
54599A30548J244L24k71j92K05L64J68j12k86l38j69L26Q70R95P03M71M99L78
$$ 130548 131792 132116 131845 131653 131858 132222 132390 132278 131992 131654 131485 131811 132681 133676 134379 134850 135349 135727
54581A35727k27r52j182q34l41k2K06N96J256J927K063J365L32j60J5P8m27q06
$$ 135727 135500 134548 133366 132532 132191 132169 132375 132971 134227 136154 138217 139582 139914 139754 139769 139847 139420 138614
54563A38614k26R45J534J072J78m15n74m69k29K3K17N30J086J591J673J523J585
$$ 138614 138388 139333 140867 141939 142117 141702 141128 140659 140430 140453 140670 141200 142286 143877 145550 147073 148658
54546A48658J716J387O89L73O26P05J84k12L06J271J543Q74J98L13R73J366J043
$$ 148658 150374 151761 152450 152823 153449 154154 154338 154126 154432 155703 157246 158120 158318 158631 159604 160970 162013
54529A62013K32m87o52k56K45L26j72r49j484j384o82R5L77J22j87k04j21k51
$$ 162013 162245 161758 161106 160850 161095 161421 161249 160300 158816 157432 156750 156845 157222 157344 157157 156953 156832 156581
54511A56581n02n29k53N0P0k69p78j144j159r28o84m07J33Q25J088N91j67l52
$$ 156581 156079 155550 155297 155347 155417 155148 154370 153226 152067 151139 150455 150048 150181 151006 152094 152685 152518 152166
54493A52166K16Q57Q41J51m82k72P74J729J696R15M99R17J312P41l97r01m02L36
$$ 152166 152382 153239 154080 154231 153749 153477 154251 155980 157676 158591 159090 160007 161319 162060 161663 160762 160360 160696
54475A60696O97J001J703K552K925K650K065J509J092Q10O40N64N96P14P45N87
$$ 160696 161393 162394 164097 166649 169574 172224 174289 175798 176890 177700 178340 178904 179500 180214 180959 181546
54459A81546N41J026J754J681K40j606k229j210J85O12J93L8N96J106P35l36j308
$$ 181546 182087 183113 184867 186548 186788 185182 182953 181743 181928 182540 182733 182771 183367 184473 185208 184872 183564
54442A83564j758j832j630r92k8O45N28j74q56j221j410j564j560j227o08K0K63
$$ 183564 181806 179974 178344 177352 177324 177969 178497 178323 177467 176246 174836 173272 171712 170485 169877 169897 170160
54425A70160n8o39q73n05P0L71M56O31Q21O64K58J82O74J187J072L45l81n72j76
$$ 170160 170102 169463 168590 168085 168155 168526 168982 169613 170434 171098 171356 171538 172212 173399 174471 174816 174435 173863 173687
54406A73687M02O71N49N14R89J598J539P21L1J46O30O20O3l04lO44J004P64J14
$$ 173687 174089 174760 175309 175823 176812 178410 179949 180670 180701 180847 181477 182097 182160 181856 181853 182497 183501 184265 184379
54387A84379m52n46l17l33p97j247j240j039j078j140p02N1M03K05J02M49Q55
$$ 184379 183927 183381 183064 182731 181934 180687 179447 178408 177330 176190 175488 175539 175942 176147 176249 176698 177553
54370A77553R90J203J802K384K399J933J468J194J108J344J880K170J753R68M86
$$ 177553 178543 179746 181548 183932 186331 188264 189732 190926 192034 193378 195258 197428 199181 200149 200635
54355B00635L13n1n77o41j54J01m14j210j549j427j291j199r20o85r87j685j948
$$ 200635 200948 200897 200320 199679 199525 199626 199212 198002 196453 195026 193735 192536 191616 190931 189944 188259 186311
54338A86311j392p31q69j664k109j681j027j094j889k473k064q66L01Q84R43P94
$$ 186311 184919 184188 183319 181655 179546 177865 176838 175744 173855 171382 169318 168452 168753 169637 170580 171374
54322A71374O19M13J69p2k41l02k81k40k14k04k39l47m73n04m81n93r16j228j212
$$ 171374 171993 172406 172575 172503 172262 171960 171679 171439 171225 171021 170782 170435 169962 169458 168977 168384 167468 166240 165028
54303A65028p94j65M41Q52R81Q88O79K97l92j165j428r52l38k97o54n67K87J295
$$ 165028 164234 164069 164510 165362 166343 167231 167910 168207 167815 166650 165222 164270 163932 163635 162981 162414 162701 163996
54285A63996J726J432O64k59q90q32k59J48P8r4o2j37n38p76l89J15j05q74j151
$$ 163996 165722 167154 167818 167559 166669 165837 165578 165726 165804 165710 165648 165511 164973 164197 163808 163923 163818 162944 161793
54266A61793n11L36P03Q15J175J650J747J387R32N81K88J08K60O86R12N16l73
$$ 161793 161282 161618 162321 163136 164311 165961 167708 169095 170027 170608 170896 171004 171264 171950 172862 173378 173005
54249A73005j168j387j063n81k58j85l36o51r54j021q75o98m79k0N22N62p8p00
$$ 173005 171837 170450 169387 168806 168548 168363 168027 167376 166422 165401 164526 163828 163349 163329 163851 164413 164335 163635
54231A63635o10j48p3k31K16J233J648Q68j51k44L87P41M88ko18j451j975j421
$$ 163635 163025 162877 162804 162573 162789 164022 165670 166538 166387 166143 166530 167271 167759 167757 167139 165688 163713 162292
54213A62292p0Q32P45N37J031J740J700R19J82k15o83j386j868j778j366j056
$$ 162292 162222 163054 163799 164336 165367 167107 168807 169726 169908 169693 169010 167624 165756 163978 162612 161556
54197A61556r66j026j129j041n35J54M02K9k93J24J017J511J255P19L62M2m90
$$ 161556 160590 159564 158435 157394 156859 157013 157415 157444 157151 157275 158292 159803 161058 161777 162139 162181 161691
54180A61691j005j008m13L08O14L46k48p64r40p58l62R0M38N13K91Kj17j22k34
$$ 161691 160686 159678 159265 159573 160187 160533 160285 159521 158581 157823 157461 157551 157989 158502 158793 158795 158678 158556 158322
54161A58322m10m01k59l76q68j256j085n33q4J18K05J75n0k60j43K42N72P53Q75
$$ 158322 157912 157511 157252 156876 156008 154752 153667 153134 153050 153168 153373 153548 153498 153238 153095 153337 153909 154662 155537
54142A55537Q10L77j30j63K59N29M42N31J172J927K232K223K269K168J455L01
$$ 155537 156347 156724 156594 156431 156690 157219 157661 158192 159364 161291 163523 165746 168015 170183 171638 171939
54126A71939n65q16p97q44q60p67q31j239j610j289p1J464K406K323J703J453
$$ 171939 171374 170558 169761 168917 168057 167290 166459 165220 163610 162321 162250 163714 166120 168443 170146 171599
54110A71599J884K357K130J305N73K31j8l65n65m54k50j08J50N37O25J70l27k57
$$ 171599 173483 175840 177970 179275 179848 180079 180061 179696 179131 178677 178427 178319 178469 179006 179631 179801 179474 179217
54092A79217J89L48J70L28J112J839J746R57K54J59O37J434K380L305M057M636
$$ 179217 179406 179754 179924 180252 181364 183203 184949 185906 186160 186319 186956 188390 190770 194075 198132 202768
54076B02768N108N396N339M920M194L086J419p41k958m652n359m888l560k234
$$ 202768 207876 213272 218611 223531 227725 230811 232230 231489 228531 223879 218520 213632 210072 207838
54062B07838j731k050k374k047j243n44j80MJ1l31q96j160p09L53J604K679L344
$$ 207838 206107 204057 201683 199636 198393 197849 197669 197673 197684 197353 196457 195297 194588 194941 196545 199224 202568
54045B02568L429K898J947R98N01P43J686K994M246N181N687N738N454N182N279
$$ 202568 205997 208895 210842 211840 212341 213084 214770 217764 222010 227191 232878 238616 244070 249252 254531
54030B54531N799O488P049P320P237O836O280N740N268M884M705M770M811M484
$$ 254531 260330 266818 273867 281187 288424 295260 301540 307280 312548 317432 322137 326907 331718 336202
54016C36202L807L096K424J483P8j510k878l997n124o294p139p257o760o319o544
$$ 336202 340009 343105 345529 347012 347090 345580 342702 338705 333581 327287 320148 312891 306131 299812 293268
54001B93268p210p362o391m824l727l481l615l657l595l444l032k474k296k681
$$ 293268 286058 278696 272305 267481 263754 260273 256658 253001 249406 245962 242930 240456 238160 235479
53987B35479l040k765k064j615j666j937k196k360k182j376j65P00P13J59j96
$$ 235479 232439 229674 227610 225995 224329 222392 220196 217836 215654 214278 214113 214813 215526 215685 215489
53972B15489K7M03J53q72j843j803q26J59N96Q13J129J254J002R42J544K219K032
$$ 215489 215516 215919 216072 215200 213357 211554 210728 210887 211483 212296 213425 214679 215681 216623 218167 220386 222418
53955B22418J088L87M04P11R43J252J691K013K279K932L946M611M565M392M785
$$ 222418 223506 223893 224297 225008 225951 227203 228894 230907 233186 236118 240064 244675 249240 253632 258417
53940B58417N634O396O830O916O527N783N379N914P066P948Q142P986P919P997
$$ 258417 264051 270447 277277 284193 290720 296503 301882 307796 314862 322810 330952 338938 346857 354854
53926C54854P967P426N948L479O14j743l034l215k502j226J64J329K297L236M056
$$ 354854 362821 370247 376195 379674 380288 378545 375511 372296 369794 368568 368732 370061 372358 375594 379650
53911C79650M520M689M904N272N511N419N220N217N297M966L897K288O31p60j908
$$ 379650 384170 388859 393763 399035 404546 409965 415185 420402 425699 430665 434562 436850 437481 436721 434813
53896D34813k854l436l495l196k909k851l082l733m887o156o873o864o641o723
$$ 434813 431959 428523 425028 421832 418923 416072 412990 409257 404370 398214 391341 384477 377836 371113
53882C71113p046p327p548p763p726p181o313n543m976m476m111m098m346m398
$$ 371113 364067 356740 349192 341429 333703 326522 320209 314666 309690 305214 301103 297005 292659 288261
53868B88261l975l379l222l824m773n124m315k908k064k171k444k157j682j780
$$ 288261 284286 280907 277685 273861 269088 263964 259649 256741 254677 252506 250062 247905 246223 244443
53854B44443k325k452j739o29K09L27m02j531k048j411l74j26o79j029p78n73
$$ 244443 242118 239666 237927 237298 237507 237834 237432 235901 233853 232442 232068 231942 231263 230234 229456 228883
53838B28883q46j134j055r39j094j236j133j006q19r3J032J446N97m38l63N44
$$ 228883 228037 226903 225848 224909 223815 222579 221446 220440 219621 219528 220560 222006 222603 222165 221802 222346
53822B22346J028O72J4o40j289j441n50P98J378J077J022J790K670K978K981L015
$$ 222346 223374 224046 224060 223420 222131 220690 220140 220938 222316 223393 224415 226205 228875 231853 234834 237849
53806B37849K814K374K508L675N008N365M886M638N038N484N345M669L910L490
$$ 237849 240663 243037 245545 249220 254228 259593 264479 269117 274155 279639 284984 289653 293563 297053
53792B97053L579L934M121M089M255M661M617L628K285J538J358R40k3j030j766
$$ 297053 300632 304566 308687 312776 317031 321692 326309 329937 332222 333760 335118 336058 336035 335005 333239
53777C33239k540l554m388m592m292l903l626l530l766m389n076n272m675l567
$$ 333239 330699 327145 322757 318165 313873 309970 306344 302814 299048 294659 289583 284311 279636 276069
53763B76069k707k726l413l826l383k587k230k208j817j133j088k017k970k974
$$ 276069 273362 270636 267223 263397 260014 257427 255197 252989 251172 250039 248951 246934 243964 240990
53749B40990k326j954k044k004j541r49m73k8L18J84n00j131j020k39M07K88l29
$$ 240990 238664 236710 234666 232662 231121 230172 229699 229671 229989 230173 229673 228542 227522 227283 227690 227978 227649
53732B27649n76j2Q35J128P94N32Q38J384J654J636J630J683J672J658J675J395
$$ 227649 227073 227061 227896 229024 229818 230350 231188 232572 234226 235862 237492 239175 240847 242505 244180 245575
53716B45575N38n33j106j020p08l63L54J604K909L729M056M128L913L293K533
$$ 245575 246113 245580 244474 243454 242746 242383 242737 244341 247250 250979 255035 259163 263076 266369 268902
53701B68902K121K251K724L258L629L625L246K857K868L212L490L583L786M144
$$ 268902 271023 273274 275998 279256 282885 286510 289756 292613 295481 298693 302183 305766 309552 313696
53687C13696M111L149J488q5j108j716k134k221j818j131n06J9O06J067R08nj060
$$ 313696 317807 320956 322444 322359 321251 319535 317401 315180 313362 312231 311725 311744 312350 313417 314325 314320 313260
53670C13260j441r46j01M29L47j85p78j113j153j081r69o16Q8P42O43l48j413
$$ 313260 311819 310873 310772 311201 311548 311363 310585 309472 308319 307238 306269 305653 305741 306483 307126 306778 305365
53653C05365j510n18N47O24k03q53n63K47O16K83r3J22P62J194J069N17j14m31
$$ 305365 303855 303337 303884 304508 304305 303452 302889 303136 303752 304035 303942 304064 304826 306020 307089 307606 307492 307061
53635C07061j14P57J622J922J681J361J260J281J265J251J376J729K302K908L204
$$ 307061 306947 307704 309326 311248 312929 314290 315550 316831 318096 319347 320723 322452 324754 327662 330866
53620C30866L023K685K717L277M027M593M882N006N116N373N763N955N641N005
$$ 330866 333889 336574 339291 342568 346595 351188 356070 361076 366192 371565 377328 383283 388924 393929
53606C93929M559M481M491M474M707N230N497N014M035L190K684K252J688J004
$$ 393929 398488 402969 407460 411934 416641 421871 427368 432382 436417 439607 442291 444543 446231 447235
53592D47235J98o49j183j099o64m75p16j056j316j668k064k048j432p61o90j173
$$ 447235 447433 446784 445601 444502 443838 443363 442647 441591 440275 438607 436543 434495 433063 432302 431612 430439
53576D30439j664j904k088k398k792l187l479l428k904k221j850j725j290l94
$$ 430439 428775 426871 424783 422385 419593 416406 412927 409499 406595 404374 402524 400799 399509 399115
53562C99115L11J96m09n27K83J415J852J190k0q07o80j9M63N71P02J082J361J269
$$ 399115 399426 399622 399213 398686 398969 400384 402236 403426 403406 402599 401919 401900 402363 402934 403636 404718 406079 407348
53544D07348J128J326J616J555J426J938L080M024M312M378M675N004N130N372
$$ 407348 408476 409802 411418 412973 414399 416337 419417 423441 427753 432131 436806 441810 446940 452312
53530D52312O026O743P165P656Q692R924J0622J0892J1514J2619J3426J3443J3230
$$ 452312 458338 465081 472246 479902 488594 498518 509140 520032 531546 544165 557591 571034 584264
53517E84264J3619J4787J6341J7799J8742J9001J9031J9686K1244K2989K4092
$$ 584264 597883 612670 629011 646810 665552 684553 703584 723270 744514 767503 791595
53506G91595K4567K5033K5826K6772K7521K7762K7326K6393K5496K4956K4526
$$ 791595 816162 841195 867021 893793 921314 949076 976402 1002795 1028291 1053247 1077773
53495A077773K3860K3148K2874K3124K3448K3417K2962K2260K1499K0820K0251
$$ 1077773 1101633 1124781 1147655 1170779 1194227 1217644 1240606 1262866 1284365 1305185 1325436
53484A325436J9746J9354J9161J9022J8604J7979J7751J8165J8460J7718J6182
$$ 1325436 1345182 1364536 1383697 1402719 1421323 1439302 1457053 1475218 1493678 1511396 1527578
53473A527578J5018J4643J4091J2348R685P144N118L082N53k280n011p530r868
$$ 1527578 1542596 1557239 1571330 1583678 1593363 1600507 1605625 1608707 1609260 1606980 1601969 1594439 1584571
53460A584571j1839j3184j4000j4709j5604j6603j7510j8341j9281k0413k1625
$$ 1584571 1572732 1559548 1545548 1530839 1515235 1498632 1481122 1462781 1443500 1423087 1401462
53449A401462k2687k3310k3267k2675k2099k2078k2490k2623k1934k0521j8731
$$ 1401462 1378775 1355465 1332198 1309523 1287424 1265346 1242856 1220233 1198299 1177778 1159047
53438A159047j6699j4503j2522j1160j0263r232p682n767l870k250j040k08O02
$$ 1159047 1142348 1127845 1115323 1104163 1093900 1084668 1076986 1071219 1067349 1065099 1064059 1063851 1064453
53425A064453J898L811N886P642R105J0611J2204J3602J4696J5837J7458J9577
$$ 1064453 1066351 1070162 1076048 1083690 1092795 1103406 1115610 1129212 1143908 1159745 1177203 1196780
53413A196780K1778K3603K4874K5722K6447K7339K8559L0092L1843L3687L5415
$$ 1196780 1218558 1242161 1267035 1292757 1319204 1346543 1375102 1405194 1437037 1470724 1506139
53402A506139L6749L7632L8499M0070M2659M5803M8705N1007N2980N5017N7097
$$ 1506139 1542888 1580520 1619019 1659089 1701748 1747551 1796256 1847263 1900243 1955260 2012357
53391B012357N8817N9814O0126O0141O0253O0507O0664O0540O0106N9193N7395
$$ 2012357 2071174 2130988 2191114 2251255 2311508 2372015 2432679 2493219 2553325 2612518 2669913
53380B669913N4562N1162M7920M5126M2602M0125L7515L4410L0510K6111K1889
$$ 2669913 2724475 2775637 2823557 2868683 2911285 2951410 2988925 3023335 3053845 3079956 3101845
53369C101845J7994J3747Q491K348m073j0472j7096k4366l2317m0191m6622n0710
$$ 3101845 3119839 3133586 3142077 3144425 3140352 3129880 3112784 3088418 3056101 3015910 2969288 2918578
53357B918578n3031n5074n7430n9232n9635n9215n9146n9531n9376n8055n5991
$$ 2918578 2865547 2810473 2753043 2693811 2634176 2574961 2515815 2456284 2396908 2338853 2282862
53346B282862n3878n1929n0033m8239m6792m5974m5816m5817m5158m3469m1251
$$ 2282862 2228984 2177055 2127022 2078783 2031991 1986017 1940201 1894384 1849226 1805757 1764506
53335A764506l9061l6675l3633l0367k7868k6265k4519k1842j8715j6096j4269
$$ 1764506 1725445 1688770 1655137 1624770 1596902 1570637 1546118 1524276 1505561 1489465 1475196
53324A475196j2943j2060j1893j2533j3601j4552j5008j4913j4430j3677j2561
$$ 1475196 1462253 1450193 1438300 1425767 1412166 1397614 1382606 1367693 1353263 1339586 1327025
53313A327025j1097r715q879q381p503n880l835j785J32J772K877L531M254N337
$$ 1327025 1315928 1306213 1297334 1288953 1281450 1275570 1271735 1269950 1270082 1271854 1274731 1278262 1282516 1287853
53299A287853O573P886R648J1962J4173J5707J6945J8632K0722K2500K3707K4854
$$ 1287853 1294426 1302312 1311960 1323922 1338095 1353802 1370747 1389379 1410101 1432601 1456308 1481162
53287A481162K6329K7809K8683K8603K7596K5977K4298K3017K2027K0738J8722
$$ 1481162 1507491 1535300 1563983 1592586 1620182 1646159 1670457 1693474 1715501 1736239 1754961
53276A754961J6133J3477J1160R159O973L978R8l901p177r740j2292j5159j7893
$$ 1754961 1771094 1784571 1795731 1804890 1811863 1815841 1815939 1812038 1804861 1795121 1782829 1767670 1749777
53263A749777k0043k1880k4001k6490k8840l0558l1606l2245l2777l3370l3999
$$ 1749777 1729734 1707854 1683853 1657363 1628523 1597965 1566359 1534114 1501337 1467967 1433968
53252A433968l4423l4318l3522l2189l0731k9637k9169k9182k9240k8970k8374
$$ 1433968 1399545 1365227 1331705 1299516 1268785 1239148 1209979 1180797 1151557 1122587 1094213
53241A094213k7744k7376k7323k7447k7519k7260k6362k4735k2718k0882j9441
$$ 1094213 1066469 1039093 1011770 984323 956804 929544 903182 878447 855729 834847 815406
53230H15406j8010j6195j4229j2725j1839j1108j0200r460r410j0036j0853j1486
$$ 815406 797396 781201 766972 754247 742408 731300 721100 711640 702230 692194 681341 669855
53218F69855j1895j2188j2572j3320j4484j5571j5882j5213j4010j2868j2044
$$ 669855 657960 645772 633200 619880 605396 589825 573943 558730 544720 531852 519808
53207E19808j1514j1144j0734j0067r121q169p593p573p918q220q179p932p926
$$ 519808 508294 497150 486416 476349 467228 459059 451466 443893 435975 427755 419576 411644 403718
53194D03718q399r036r345r226q957q690q245p438o392n373m519l861l432l274
$$ 403718 395319 386283 376938 367712 358755 350065 341820 334382 327990 322617 318098 314237 310805 307531
53180C07531l332l451l480l338l091k883k804k804k760k536j982j042LO13M95
$$ 307531 304199 300748 297268 293930 290839 287956 285152 282348 279588 277052 275070 274028 274031 274644 275139
53165B75139p1n72q18r37r67q52p26q63j258j588j638j486j189o97j97j43o48
$$ 275139 275068 274496 273678 272741 271774 270922 270196 269333 268075 266487 264849 263363 262174 261477 261280 261137 260489
53148B60489j151j010l21K02O9m98r45r90p87n97m48k00J26K84K63N07J325K148
$$ 260489 259338 258328 258007 258209 258278 257780 256835 255845 255058 254461 254013 253813 253939 254223 254486 254993 256318 258466
53130B58466K004Q77k1K60J135J321N84o3J67R16J433J512J400J198Q34M02J26
$$ 258466 260470 261347 261326 261586 262721 264042 264626 264563 264730 265646 267079 268591 269991 271189 272023 272425 272551
53113B72551J47M63J041J706K086J868J008l07j725k688k720k025j487j694k236
$$ 272551 272698 273161 274202 275908 277994 279862 280870 280563 278838 276150 273430 271405 269918 268224 265988
53098B65988k294j726j072p28o35p32j080j447j333o55L3K35P4j16l21o51r16
$$ 265988 263694 261968 260896 260168 259533 258801 257721 256274 254941 254286 254319 254554 254628 254512 254191 253540 252624
53081B52624p78k06M95R55Q84K81l62l91K15O95M78j17m83n71o13m48J31O63M56
$$ 252624 251846 251640 252135 253090 253974 254255 253893 253502 253717 254412 254890 254773 254290 253719 253106 252658 252789 253452 253908
53062B53908l53r66j125j285j509j201k37M64J52o77j008n72J90J006J876K504
$$ 253908 253555 252589 251464 250179 248670 247469 247232 247696 247848 247171 246163 245591 245781 246787 248663 251167
53046B51167K419J645Q03M53N96P31K68r34k192k539j816q71l84n0N57R81N48
$$ 251167 253586 255231 256034 256487 257083 257814 258082 257148 254956 252417 250601 249730 249346 249296 249853 250834 251382
53029B51382l62p34m23k64o09q24m60NJ5k00j45J75N33R56J401J412P46Lo0M31
$$ 251382 251020 250286 249863 249599 248990 248166 247706 247711 247726 247526 247381 247556 248089 249045 250446 251858 252604 252607 252547 252978
53009B52978P64P95J090J839K337J855O11m92q82q02q37j166j385r94o6P76J029
$$ 252978 253742 254537 255627 257466 259803 261658 262269 261777 260895 260093 259256 258090 256705 255711 255645 256421 257450
52992B57450Q02N27M03L18J95R6J16L34Q66J609K079J869J252R56J190J374J040
$$ 257450 258252 258779 259182 259500 259695 259791 259907 260241 261107 262716 264795 266664 267916 268872 270062 271436 272476
52975B72476O02Q18J724K588K879K750K528K138J408O10K54L73L74j92r69j165
$$ 272476 273078 273896 275620 278208 281087 283837 286365 288503 289911 290521 290775 291148 291522 291330 290361 289196
52959B89196n53J30p9j308k651l043k239r10J16M74K85j81o97j064j173j055q51
$$ 289196 288643 288773 288694 287386 284735 281692 279453 278543 278659 279133 279418 279237 278540 277476 276303 275248 274397
52942B74397p26q15j063j141p05J12P03O78K77r6m87j051j486j345q35n80o27
$$ 274397 273671 272856 271793 270652 269947 270059 270762 271440 271717 271621 271134 270083 268597 267252 266417 265837 265210
52925B65210m13O7N7o76j161o00K97L17m10o04K27J186J396J095R28R50Q10L89
$$ 265210 264797 264864 264921 264245 263084 262484 262781 263098 262688 262084 262311 263497 264893 265988 266916 267866 268676 269065
52907B69065j82p57j125j113r50j098j486j405n96J37m3q40j253q67m9Q70J821
$$ 269065 268883 268126 267001 265888 264938 263840 262354 260949 260353 260490 260447 259607 258354 257487 257438 258308 260129
52890B60129K481K281J276L28J23M00M92K90J65J91o5q11j527j477o05L21N47
$$ 260129 262610 264891 266167 266495 266618 267018 267510 267800 267965 268156 268091 267280 265753 264276 263671 263992 264539
52873B64539Q9m18m45K2P46J558K369L052L452L498L215K729K187J630R66K21
$$ 264539 264628 264210 263765 263787 264533 266091 268460 271512 274964 278462 281677 284406 286593 288223 289189 289410
52857B89410k78k35J29K05l31j244k128k791l172l185k916k664k652k847l177
$$ 289410 289132 288897 289026 289231 288900 287656 285528 282737 279565 276380 273464 270800 268148 265301 262124
52842B62124l585l806l493k741k072j707j300p34n26r46j337r40j3O68J094J820
$$ 262124 258539 254733 251240 248499 246427 244720 243420 242686 242160 241214 239877 238937 238924 239592 240686 242506
52826B42506K723K968K313J441P84J4r33j278n64L60L41n80j365j385q80l15L2
$$ 242506 245229 248197 250510 251951 252735 252749 251816 250538 249974 250334 250675 250095 248730 247345 246465 246150 246182
52809B46182l6m46o57k44L55K96m61j089j097r17j069j364j348j019o54k90Q9
$$ 246182 246146 245700 245043 244799 245154 245450 244989 243900 242803 241886 240817 239453 238105 237086 236432 236142 236231
52792B36231J70l73j220j589j153m06j8j13l26l60k35q3J29N32J095J503J439
$$ 236231 236401 236028 234808 233219 232066 231660 231642 231529 231203 230843 230608 230525 230654 231186 232281 233784 235223
52775B35223R76N41M46O02P46P76O87L84j41n95o43m12m29q88j333j237o96k92
$$ 235223 236199 236740 237186 237788 238534 239310 239997 240381 240240 239645 239002 238590 238161 237273 235940 234703 234007 233715
52757B33715l90p56r34p26l39m1J62N79J381K179K249J336R9m53R1J253K221K483
$$ 233715 233325 232569 231635 230909 230570 230529 230691 231270 232651 234830 237079 238415 238514 238061 238152 239405 241626 244109
52739B44109K070J479J299J691K180K247J967J761J600J027P9m63j20N20O11K39
$$ 244109 246179 247658 248957 250648 252828 255075 257042 258803 260403 261430 261509 261046 260926 261446 262057 262296
52723B62296J27L76K80n57j614k200k210j899j387q26n53o68p24l23K23K83k07
$$ 262296 262423 262799 263079 262522 260908 258708 256498 254599 253212 252386 251833 251165 250441 250118 250341 250624 250417
52706B50417p52j031j137j092o78P5P31R78J023J161J293J121O39J15k26l26j86
$$ 250417 249665 248634 247497 246405 245727 245802 246533 247511 248534 249695 250988 252109 252748 252863 252637 252311 252125
52689B52125J53N57Q83J065J042P48K51k58o59r45r99o62j37N9j94l24R2O17N50
$$ 252125 252278 252835 253718 254783 255825 256573 256824 256566 255907 254962 253963 253301 253164 253223 253029 252705 252797 253414 253964
52670B53964K6j99O8K47Q1J28P73J383J081nq60q65l80m4M7K61Q26J521J932J955
$$ 253964 253990 253791 253859 254106 254187 254315 255088 256471 257552 257547 256687 255822 255442 255398 255445 255706 256532 258053 259985 261940
52650B61940J919K222K786L051K522J225m11j856k630k426j411k60K83m0r38j836
$$ 261940 263859 266081 268867 271918 274440 275665 275254 273398 270768 268342 266931 266671 266954 266914 265976 264140
52634B64140k179j717o85M33J387K188K597K116P92l87m97J48M14j61q88r77n25
$$ 264140 261961 260244 259559 259992 261379 263567 266164 268280 269072 268685 268188 268336 268750 268589 267701 266724 266199
52617B66199j76k50n52q27j048j274j424j316r33n35l12J1Q65K034K590J960P49
$$ 266199 266023 265773 265221 264394 263346 262072 260648 259332 258399 257864 257552 257563 258428 260462 263052 265012 265761
52600B65761k8j68j73j82J77Q93J345J218R70J047J121O15l99j199j185m15M87
$$ 265761 265733 265565 265392 265210 265387 266280 267625 268843 269813 270860 271981 272596 272197 270998 269813 269398 269885
52583B69885Q59O02K84M09P24O72L96N85J307J767J480R19O21L73j49o21o63o04
$$ 269885 270744 271346 271630 272039 272763 273435 273831 274416 275723 277490 278970 279889 280510 280883 280734 280113 279450 278846
52565B78846r41j422j477j203j116j210j054o73m83m57j97J72N7n07o97j41M63
$$ 278846 277905 276483 275006 273803 272687 271477 270423 269750 269267 268810 268613 268785 268842 268335 267638 267497 267960
52548B67960L51l10q86j147j244j201r47n54j09M06Q70R35N34J16Q4K68L28L36
$$ 267960 268311 268001 267115 265968 264724 263523 262576 262022 261913 262319 263189 264124 264658 264774 264858 265126 265454 265790
52530B65790N01O10K92k82n70m53l60n31o25k84L62R77J492J994K406K626K799
$$ 265790 266291 266901 267193 266911 266341 265888 265528 264997 264372 264088 264450 265427 266919 268913 271319 273945 276744
52513B76744L158L536L462K765J899J506J728K071J914J117J93j91O8L14j34j162
$$ 276744 279902 283438 286900 289665 291564 293070 294798 296869 298783 299900 300093 299902 299970 300284 300150 298988
52497B98988k063k571l100l783l882k803j270o18j052j455j082n32o08j054j037
$$ 298988 296925 294354 291254 287471 283589 280786 279516 278898 277846 276391 275309 274777 274169 273115 272078
52482B72078l96L44Q36J134J226J046Q11Q02R10Q46P72J055J552J705J453J366
$$ 272078 271682 272026 272862 273996 275222 276268 277079 277881 278791 279637 280409 281464 283016 284721 286174 287540
52466B87540J771K235K236J899J718J866J998J691R07J17j69r3m36j634l057l787
$$ 287540 289311 291546 293782 295681 297399 299265 301263 302954 303861 303978 303809 303716 303280 301646 298589 294802
52450B94802l783l724l844l753l333k942k616j875o67L07N97N85O26L70l70q94
$$ 294802 291019 287295 283451 279698 276365 273423 270807 268932 268265 268572 269169 269754 270380 270750 270380 269486
52434B69486m89M18Q99R19J174J742J888J222K49m38p60p72l29M88J115J093O19
$$ 269486 268997 269415 270314 271233 272407 274149 276037 277259 277508 277070 276310 275538 275209 275697 276812 277905 278524
52417B78524L03M93J112J844K320K265J785J426J732K707L796M450M680N042N991
$$ 278524 278827 279320 280432 282276 284596 286861 288646 290072 291804 294511 298307 302757 307437 312479 318470
52402C18470P298Q210Q208P433O247M702K659K33k211m378o057o899o585n324
$$ 318470 325768 333978 342186 349619 355866 360568 363227 363460 361249 356871 350814 343915 337330 332006
52388C32006l918l096k877k686k064j205p40r32j189o52P14J977K304J874J465
$$ 332006 328088 324992 322115 319429 317365 316160 315420 314488 313299 312647 313361 315338 317642 319516 320981
52373C20981J555K127L003L884M294M016L503L321L348K973K057J120N31J77M
$$ 320981 322536 324663 327666 331550 335844 339860 343363 346684 350032 353005 355062 356182 356713 356890 356894
52358C56894K44Q59J282J085N19J11K7J95O13J215J667J669J343J017Q86J079
$$ 356894 357138 357997 359279 360364 360883 360994 361021 361216 361829 363044 364711 366380 367723 368740 369626 370705
52342C70705J779K948M086M617M437L861L270K968L173L815M541N209O078P223
$$ 370705 372484 375432 379518 384135 388572 392433 395703 398671 401844 405659 410200 415409 421487 428710
52328D28710Q101Q226Q063Q580J0012J1649J2825J3524J3889J3863J3587J3580
$$ 428710 436811 445037 453100 461680 471692 483341 496166 509690 523579 537442 551029 564609
52316E64609J4044J4505J4560J4620J5329J6560J7605J8252J8961J9949K0757
$$ 564609 578653 593158 607718 622338 637667 654227 671832 690084 709045 728994 749751
52305G49751K1029K1189K1860K2950K3793K4049K3923K3541K2648K1127J9396
$$ 749751 770780 791969 813829 836779 860572 884621 908544 932085 954733 975860 995256
52294I95256J7931J6591J4833J2515J0064P833N689L441J299l18j332k044k742
$$ 995256 1013187 1029778 1044611 1057126 1067190 1075023 1080712 1084153 1085452 1085134 1083802 1081758 1079016
52281A079016l553m506n521o287o505o207n601m682l395k164j707k097k443j857
$$ 1079016 1075463 1070957 1065436 1059149 1052644 1046437 1040836 1036154 1032759 1030595 1028888 1026791 1024348 1022491
52267A022491m03J245K755M185N364N923O050O576P997R858J1370J2370J3330
$$ 1022491 1022088 1023333 1026088 1030273 1035637 1041560 1047610 1054186 1062183 1072041 1083411 1095781 1109111
52254A109111J4692J6383J7957J8885J8952J8466J7960J7455J6291J3977J1032
$$ 1109111 1123803 1140186 1158143 1177028 1195980 1214446 1232406 1249861 1266152 1280129 1291161
52243A291161Q520O795N223L189R52q31k134l606n662p865r430j0181j0698j1634
$$ 1291161 1299681 1306476 1311699 1314888 1315840 1315009 1312875 1309269 1303607 1295742 1286312 1276131 1265433 1253799
52229A253799j2974j4191j4936j5390j5895j6365j6279j5266j3620j2173j1606
$$ 1253799 1240825 1226634 1211698 1196308 1180413 1164048 1147769 1132503 1118883 1106710 1095104
52218A095104j1862j2277j2206j1509j0440r214p881o435m921l373j875o28J76
$$ 1095104 1083242 1070965 1058759 1047250 1036810 1027596 1019715 1013280 1008359 1004986 1003111 1002483 1002659
52205A002659N75P66R15J091J391J808K119K174K282K892L881M592M736M751N043
$$ 1002659 1003234 1004000 1004915 1006006 1007397 1009205 1011324 1013498 1015780 1018672 1022553 1027145 1031881 1036632 1041675
52190A041675N380N329M918M376L591K369R93j04j088k550m556o468p723q372
$$ 1041675 1047055 1052384 1057302 1061678 1065269 1067638 1068631 1068527 1067439 1064889 1060333 1053865 1046142 1037770
52176A037770q656q534p891o932o101n639n365m921m215l649l594l652k938j333
$$ 1037770 1029114 1020580 1012689 1005757 999656 994017 988652 983731 979516 975867 972273 968621 965683 964350
52162I64350N5L53K23R43K424L252K685J545Q06L76k20p60p00j49K81L71M82J020
$$ 964350 964405 964758 964981 965924 968348 971600 974285 975830 976636 977012 976792 976032 975332 975183 975464 975835 976317 977337
52144I77337K086L402M314M168L028J761J126J089J279J587J984K198K191K552
$$ 977337 979423 982825 987139 991307 994335 996096 997222 998311 999590 1001177 1003161 1005359 1007550 1010102
52130A010102L862N889P909R576J1027J2400J3815J5532J7567J9365K0491K1302
$$ 1010102 1013964 1019853 1027762 1037338 1048365 1060765 1074580 1090112 1107679 1127044 1147535 1168837
52118A168837K2330K3337K3741K3747K4049K4514K4232K3058K2086K2137K2653
$$ 1168837 1191167 1214504 1238245 1261992 1286041 1310555 1334787 1357845 1379931 1402068 1424721
52107A424721K2594K1750K0620J9610J8961J8966J9571K0078J9800J8705J6994
$$ 1424721 1447315 1469065 1489685 1509295 1528256 1547222 1566793 1586871 1606671 1625376 1642370
52096A642370J4520J1313Q164N807L690O43l298o775r098j1227j4111j6942j8131
$$ 1642370 1656890 1668203 1676367 1682174 1685864 1686507 1683209 1676434 1667336 1656109 1641998 1625056 1606925
52083A606925j7524j6555j6292j6390j6091j5383j4645j3952j3289j2885j2702
$$ 1606925 1589401 1572846 1556554 1540164 1524073 1508690 1494045 1480093 1466804 1453919 1441217
52072A441217j2005j0209p878o120n102l876j701J112L870O283Q357J0067J1504
$$ 1441217 1429212 1419003 1411125 1405005 1399903 1396027 1394326 1395438 1399308 1405591 1413948 1424015 1435519
52059A435519J2972J4548J5895J6777J7393J7952J8245J7984J7214J6056J4312
$$ 1435519 1448491 1463039 1478934 1495711 1513104 1531056 1549301 1567285 1584499 1600555 1614867
52048A614867J1795Q827O053L795J873l9k064m060n749p023q155r473j0849j1858
$$ 1614867 1626662 1635489 1641542 1645337 1647210 1647171 1645107 1641047 1635298 1628275 1620120 1610647 1599798 1587940
52034A587940j2438j2907j3296j3361j3371j4168j5975j7860j8870j9140j9306
$$ 1587940 1575502 1562595 1549299 1535938 1522567 1508399 1492424 1474564 1455694 1436554 1417248
52023A417248j9524j9689j9985k0457k0505j9636j8246j6923j5527j3856j2622
$$ 1417248 1397724 1378035 1358050 1337593 1317088 1297452 1279206 1262283 1246756 1232900 1220278
$$ [...]
##END NTUPLES=NMR SPECTRUM
##END=
