##TITLE=AC1738_SEN00011_9276187_vwu7jyrfVx
##JCAMPDX= 6.0         $$ Bruker NMR JCAMP-DX V2.0
##DATA TYPE= NMR SPECTRUM
##DATA CLASS= NTUPLES
##ORIGIN= BRUKER
##OWNER= Administrator
$$ 1.72 TOPSPIN		Version 2.1
$$ 2015-07-17 19:02:28.854 -0700  Administrator@X
$$ Compression mode = diff/dup
##.OBSERVE FREQUENCY= 400.02188249412
##.OBSERVE NUCLEUS= ^1H
##.ACQUISITION MODE= SIMULTANEOUS (DQD)
##.ACQUISITION SCHEME= undefined
##.AVERAGES= 8
##.DIGITISER RES= 22
##SPECTROMETER/DATA SYSTEM= spect
##.PULSE SEQUENCE= zg30
##.SOLVENT NAME= COFFEE_meoh
##.SHIFT REFERENCE= INTERNAL, COFFEE_meoh, 1, 14.98509
##AUDIT TRAIL= $$ (NUMBER, WHEN, WHO, WHERE, PROCESS, VERSION, WHAT)
$$ ##TITLE= Audit trail, TOPSPIN		Version 2.1
$$ ##JCAMPDX= 5.01
$$ ##ORIGIN= Bruker BioSpin GmbH
$$ ##OWNER= Administrator
$$ $$ E:\/data/COFFEE/nmr/AC1738_SEN00011_9276187_vwu7jyrfVx/20/pdata/1/auditp.txt
$$ ##AUDIT TRAIL=  $$ (NUMBER, WHEN, WHO, WHERE, PROCESS, VERSION, WHAT)
(   1,<2015-07-17 19:02:21.775 -0700>,<Administrator>,<X>,<go>,<TOPSPIN 2.1>,
      <created by zg
	started at 2015-07-17 19:01:15.650 -0700,
	POWCHK enabled, PULCHK disabled,
       configuration hash MD5:
       21 0F 79 D6 B3 7B B4 F6 88 20 88 DB 03 48 BD 9F
       data hash MD5: 64K
       E5 7A 9B 80 CD FD 45 89 6A 94 00 17 E0 FA D5 7E>)
(   2,<2015-07-17 19:02:25.057 -0700>,<Administrator>,<X>,<proc1d>,<TOPSPIN 2.1>,
      <Start of raw data processing
       efp LB = 0 FT_mod = 6 PKNL = 1 PHC0 = 0 PHC1 = 0 SI = 32K 
       data hash MD5: 32K
       28 CE 89 C0 8B 75 17 2B D2 01 0C F2 5F 3C EB 40>)
(   3,<2015-07-17 19:02:25.354 -0700>,<Administrator>,<X>,<proc1d>,<TOPSPIN 2.1>,
      <pk PHC0 = 87.7478 PHC1 = 0 
       data hash MD5: 32K
       F5 72 6B A7 4E 25 E6 95 F5 7B 2B 0F 7C 95 20 28>)
(   4,<2015-07-17 19:02:25.463 -0700>,<Administrator>,<X>,<proc1d>,<TOPSPIN 2.1>,
      <abs ABSG = 1 
       data hash MD5: 32K
       55 3C 5F 2E 79 DF 38 0A 56 94 C2 B2 AC 29 02 BC>)
(   5,<2015-07-17 19:02:25.541 -0700>,<Administrator>,<X>,<proc1d>,<TOPSPIN 2.1>,
      <abs ABSG = 2 
       data hash MD5: 32K
       8D 44 D2 B1 49 EC 4E 3C BB 67 D9 84 D2 B8 0F 63>)
(   6,<2015-07-17 19:02:25.604 -0700>,<Administrator>,<X>,<proc1d>,<TOPSPIN 2.1>,
      <abs ABSG = 3 
       data hash MD5: 32K
       DA A5 40 FA 3E 81 BB 03 55 DE 8E E8 90 4C DD DB>)
(   7,<2015-07-17 19:02:25.666 -0700>,<Administrator>,<X>,<proc1d>,<TOPSPIN 2.1>,
      <abs ABSG = 4 
       data hash MD5: 32K
       8B D9 9E D6 55 C7 62 2E B6 79 2B 16 8E BA ED 88>)
(   8,<2015-07-17 19:02:25.713 -0700>,<Administrator>,<X>,<proc1d>,<TOPSPIN 2.1>,
      <abs ABSG = 5 
       data hash MD5: 32K
       70 64 7C 2D 03 85 6D BA D8 5C F1 DF 66 27 23 41>)
$$ ##END=
$$ 
$$ $$ hash MD5
$$ $$ E9 4A 7A B4 BC D2 2B 9A D5 D8 E3 5E BD FE 1B DD
##$RELAX= 
##$RELAX= 
##$RELAX= 
##$RELAX= 
##$RELAX= 
##$RELAX= 
##$RELAX= 
$$ Bruker specific parameters
$$ --------------------------
##$DU= <E:\>
##$EXPNO= 20
##$NAME= <AC1738_SEN00011_9276187_vwu7jyrfVx>
$$ [...]
##$TP= (0..7)
150 150 150 150 150 150 150 150
##$TP07= 0
##$TPNAME0= <>
##$TPNAME1= <>
##$TPNAME2= <>
##$TPNAME3= <>
##$TPNAME4= <>
##$TPNAME5= <>
##$TPNAME6= <>
##$TPNAME7= <>
##$TPOAL= (0..7)
0.5 0.5 0.5 0.5 0.5 0.5 0.5 0.5
##$TPOFFS= (0..7)
0 0 0 0 0 0 0 0
##$TUNHIN= 0
##$TUNHOUT= 0
##$TUNXOUT= 0
##$USERA1= <user>
##$USERA2= <user>
##$USERA3= <user>
##$USERA4= <user>
##$USERA5= <user>
##$V9= 5
##$VALIST= <valist>
##$VCLIST= <CCCCCCCCCCCCCCC>
##$VD= 0
##$VDLIST= <DDDDDDDDDDDDDDD>
##$VPLIST= <PPPPPPPPPPPPPPP>
##$VTLIST= <TTTTTTTTTTTTTTT>
##$WBST= 2048
##$WBSW= 25
##$XGAIN= (0..3)
0 0 0 0
##$XL= 0
##$YL= 0
##$YMAX_a= 609883
##$YMIN_a= -534296
##$ZGOPTNS= <>
##$ZL1= 120
##$ZL2= 120
##$ZL3= 120
##$ZL4= 120
##$ABSF1= 14.98509
##$ABSF2= -5.573092
##$ABSG= 5
##$ABSL= 3
##$ALPHA= 0
##$AQORDER= 0
##$ASSFAC= 0
##$ASSFACI= 0
##$ASSFACX= 0
##$ASSWID= 0
##$AUNMP= <proc_prof1d_extract_pilot.lims>
##$AXLEFT= 0
##$AXNAME= <>
##$AXNUC= <1H>
##$AXRIGHT= 0
##$AXTYPE= 0
##$AXUNIT= <>
##$AZFE= 0.1
##$AZFW= 0.1
##$BCFW= 0
##$BC_mod= 0
##$BYTORDP= 0
##$COROFFS= 0
##$CY= 15
##$DATMOD= 1
##$DC= 0
##$DFILT= <>
##$DTYPP= 0
##$F1P= 0
##$F2P= 0
##$FCOR= 0.5
##$FTSIZE= 32768
##$FT_mod= 6
##$GAMMA= 0
##$GB= 0
##$INTBC= 1
##$INTSCL= 1
##$ISEN= 128
##$LB= 0
##$LEV0= 0
##$LPBIN= 0
##$MAXI= 10000
##$MC2= 0
##$MEAN= 0
##$ME_mod= 0
##$MI= 0
##$NCOEF= 0
##$NC_proc= -8
##$NLEV= 6
##$NOISF1= 0
##$NOISF2= 0
##$NSP= 0
##$NTH_PI= 0
##$NZP= 0
##$OFFSET= 14.98509
##$PC= 1
##$PHC0= 87.7478
##$PHC1= 0
##$PH_mod= 1
##$PKNL= yes
##$PPARMOD= 0
##$PPDIAG= 0
##$PPIPTYP= 0
##$PPMPNUM= 2147483647
##$PPRESOL= 1
##$PSCAL= 4
##$PSIGN= 0
##$PYNMP= <proc.py>
##$REVERSE= no
##$SF= 400.02
##$SI= 32768
##$SIGF1= 0
##$SIGF2= 0
##$SINO= 400
##$SIOLD= 32768
##$SPECTYP= <>
##$SREGLST= <1H.CDCl3>
##$SSB= 0
##$STSI= 32768
##$STSR= 0
##$SW_p= 8223.68421052631
##$SYMM= 0
##$S_DEV= 0
##$TDeff= 65536
##$TDoff= 0
##$TI= <>
##$TILT= no
##$TM1= 0
##$TM2= 0
##$TOPLEV= 0
##$USERP1= <user>
##$USERP2= <user>
##$USERP3= <user>
##$USERP4= <user>
##$USERP5= <user>
##$WDW= 1
##$XDIM= 32768
##$YMAX_p= 455896243
##$YMIN_p= -705648
##$CURPLOT= <Network HP LaserJet P1505>
##$CURPRIN= <$Network HP LaserJet P1505>
##$DFORMAT= <normdp>
##$LAYOUT= <+/1D_H.xwp>
##$LFORMAT= <normlp>
##$PFORMAT= <normpl>
##$SURQMSG= 1
$$ End of Bruker specific parameters
$$ ---------------------------------
##NTUPLES= NMR SPECTRUM
##VAR_NAME=  FREQUENCY,     SPECTRUM/REAL,   SPECTRUM/IMAG
##SYMBOL=    X,             R,               I
##VAR_TYPE=  INDEPENDENT,   DEPENDENT,       DEPENDENT
##VAR_FORM=  AFFN,          ASDF,            ASDF
##VAR_DIM=   32768,         32768,           32768
##UNITS=     HZ,            ARBITRARY UNITS, ARBITRARY UNITS
##FACTOR=    0.250966925370066, 1,           1
##FIRST=     8223.43324360094, 52122,        4438
##LAST=      0,             158493,          24269
##MIN=       0,             -705648,         0
##MAX=       8223.43324360094, 455896243,    0
$$ Real data points
##PAGE= N=1
##DATA TABLE= (X++(R..R)), XYDATA
$$ [...]
23826 -198108 68806 -100530 -92535 41666 85596 -165222 11607 -183586 67297 -130859 93243
23814 58684 -125887 109768 151019 274274 -218616 64648 107924 -361277 -377215 159565
23803 -256886 -132052 188748 12115 -68715 -17656 -111089 135229 39878 -116021 -180717 -112933
23792 -112933 9686 -42790 249477 -282646 20137 -118392 -141847 -33102 -97592 -148337 198224
23780 -19564 -41601 23042 -100433 -131561 58096 49313 -335600 -19617 184906 -84072 -544282
23769 -544282 -55809 170282 95824 7770 116572 -277576 12188 18419 121283 -31363 78895
23757 -36176 -253781 26136 -306165 -90989 -219642 -159719 110012 74127 -66460 56560 102682
23746 102682 -54471 43721 -77353 199211 57833 -81031 -348715 231972 -12185 -124971 65383
23734 -95165 26527 32811 63242 -39250 -56246 210730 -133202 -72309 -201153 107437 283661
23723 283661 -112262 199897 -232353 25912 212935 -241908 184140 -60982 -33337 -154650
23713 -154650 33487 24549 -200591 7862 312403 -140164 -17489 148196 324125 -176584 232634
23701 -302197 122270 91391 19032 -155310 125615 126365 66030 -84194 -167750 52072 237232
23690 237232 141010 62208 79612 -153412 -163211 281130 235915 -15532 55290 48659 242536
23679 242536 -78137 -228945 5963 -224437 264321 -244338 -113076 132875 -307109 111782
23668 73734 -164578 -233100 -135612 63020 139172 -206639 -122090 -165033 5724 44469 -246533
23656 325417 -196773 -1926 -24834 111791 -145278 65579 315177 -187375 -67313 199248
23645 -96054 136430 -71738 -64308 8015 128787 -13443 -327261 -124381 -38527 12834 141611
23634 141611 223013 -31440 -275483 -101931 -150675 218367 -231529 -255645 -122408 111668
23623 168555 -198013 -85706 -159102 7533 -128402 -307544 4787 -108754 -167882 -20632 28314
23611 220422 120234 -119338 -182229 160126 -74630 96317 15541 169946 150080 251625
23601 251625 -12696 -238727 81623 255414 -413131 27770 100019 37869 61817 198992 -106975
23589 91023 -58250 -233907 27313 -105620 2601 -3896 -50059 -308054 -121726 -107008 -84707
23578 -84707 -84573 -124549 126369 341267 107587 95943 -97675 188722 -99901 10700 210371
23567 210371 138869 81098 110520 182920 -277070 266514 -55298 -137098 -42106 -88691 3237
23555 -182962 -60966 269358 -274898 -365693 -228045 201962 108449 91155 -62616 -54638 227970
23543 -75111 170014 -265960 -108459 -9830 191986 65376 35623 189706 -257325 -44706 190553
23531 -80518 -249869 224842 139186 67077 316600 -76870 -246977 -248670 23621 -63439 -46450
23520 -46450 20593 81816 -467168 93515 71540 -79702 -61004 -135270 13118 -12754 -453907
23509 -453907 283723 -52199 -28870 -85434 -112521 202443 222472 -60563 146007 -236673 -33330
23497 79460 -32139 -162591 291916 -46198 34034 43353 8772 -291835 133868 -104130 184955
23485 -68942 42953 63417 368093 -142943 57491 212210 163893 -120127 -465940 62629 -118236
23473 -181987 -4857 35644 -93138 -72516 67414 -20792 181709 -178926 338786 99326 -113936
23461 86 -229627 188499 41420 -86059 -96180 36967 35661 113369 34817 169943 -9580 170045
23448 -98908 20801 -182610 111320 158208 458551 250866 -63219 -147612 -30314 -59671 -198186
23437 -198186 -136337 -144520 122672 -104423 -244251 46788 270867 -61275 152504 106084 180479
23426 180479 -305151 39810 151065 196144 -62602 377756 157612 -269846 -157904 -33251
23415 -191021 1700 -74750 -169932 126119 310916 -45160 190894 81352 20011 86187 285016
23404 285016 125598 -189058 -134240 138861 -23391 -186248 -50880 23753 19821 398866 159276
23392 -210610 -95121 -8785 61439 94648 56959 -46324 10443 -64855 103881 137178 -225049
23380 12045 -160762 3619 139065 -17608 -31472 109021 10814 -121907 -68038 -8477 -271914
23369 -271914 135581 231227 8694 -104568 -206780 -133093 -48530 -40933 -174503 90213 44506
23357 -123822 -144424 55248 -13280 -176894 -350393 211762 168966 -105680 75846 -6423 114036
23345 190148 360388 33308 -153530 66520 -320653 260915 -239096 -185134 -276314 91038
23334 128208 129905 -292642 -22479 295545 -86312 9492 155111 -108793 11883 -30759 -296791
23323 -296791 -389567 -133940 -524717 -273203 -345363 -151824 -34097 125262 -106283 -65948
23313 -65948 -86095 229454 -117002 -301648 217189 -130396 -66493 266494 64698 179978
23303 179978 -193364 29021 205953 105767 273008 59927 -29526 380197 -127575 -177868
23293 -177868 100268 47627 -275252 -216283 -168455 -205443 -58945 109255 -9856 56001 -240626
23281 215018 -230540 -9684 -110374 202827 101493 128292 -134000 -45129 -307057 -20394
23270 170824 71809 24032 170120 118530 8479 205189 -27250 -99575 -67297 41983 71971
23259 71971 9399 -4468 -174407 -104647 -147580 13841 -238717 -65517 185814 -325780 53813
23247 -138904 341231 217809 -187100 -183697 -370009 -61387 212558 -179754 293945 41441
23236 -33093 18565 318453 26481 -246747 -184200 -157264 129478 80413 -333073 -71006 -228473
23225 -228473 161599 391084 -26440 8156 -127287 -118590 -224410 -369575 29131 127690 -328178
23213 66111 -136108 -253749 7678 23616 -286371 119733 70053 -97548 73342 -75118 -120449
23202 -120449 53096 37184 -167264 -107063 -8460 36262 83151 117279 -147098 -249204 -44434
23190 20925 142444 -180473 -197978 -69293 -39247 -347528 -247001 -266760 149377 268934
23180 268934 19805 6664 -42507 -169645 100509 66557 -150277 -81024 155603 -210477 91841
23168 -82117 67745 -157963 9533 126889 -226778 -141113 28939 108409 -261494 131946 164680
23157 164680 -74518 -5604 96592 -365418 143900 -202284 58445 -125534 61320 -51257 113652
23145 -292894 75582 111412 286962 -96563 64008 -54865 109633 70805 -79137 -74127 61649
23133 -63239 -146425 116951 -211156 135161 -74937 -26143 207012 -317288 107995 -176329
23122 -161351 199265 992 205516 120400 130302 32422 28765 124617 -18056 -90050 364918 57318
23109 -332559 -61871 97097 -266866 4713 281032 34541 13048 237715 148028 154922 81954
23098 81954 59526 253608 -24948 -44599 304593 -69967 -20569 -123662 -14693 208633 -102162
23086 -165777 -184454 -107191 -270965 115171 148649 -78598 147924 81403 -233673 64289 -156762
23074 -347565 -349288 206875 78417 -39581 182675 326577 -34919 -168853 404241 -35525 -243688
23063 -243688 211203 -122316 84707 -54283 -93635 41474 9523 -122548 95263 -33608 -279592
23052 -279592 286177 47879 -28966 -160638 29526 -203320 408721 -38868 51679 -201024
23041 -206858 156053 45201 -271888 -30008 52900 4701 163763 101461 24852 -291047 83723
23029 -492406 -124398 -162787 115276 -349650 -60726 96628 58402 -58466 157575 -205444
23018 50734 73760 64847 -17271 -602474 44883 -18835 -115118 128998 -75761 -106437 283678
23006 86026 -10439 -8630 126400 -75822 -243703 41021 109345 202249 138845 -192987 234868
22994 -63069 -196948 -106887 197937 -149836 -208825 23400 69804 56043 -166723 -246025 145980
22982 -191724 -57836 -21711 120594 68067 -55680 246176 74381 -166556 -133651 123541 86961
22971 86961 358981 -218184 328664 -108309 41694 -39067 -25560 -130779 -21030 158956
22960 -48973 -248327 29031 -239411 48890 4663 -305090 -159728 17400 103727 24272 64999
22949 64999 68846 -15308 -19160 -11849 -239192 -70962 4878 23849 -54183 -219558 244213 -87496
22936 90417 -184784 -276906 -132347 15755 40946 191290 222558 -24895 157549 260477 -558283
22924 -75854 302067 65153 -155511 -237411 -177152 -263912 117744 259348 -120655 32463 -256810
22912 815 14614 -60185 -82722 -92909 24676 20106 126268 59753 171171 123960 -80717 -85742
22900 -85742 -236735 -228221 -55824 -275606 41573 -180782 16821 -107325 200450 -93304 -187872
22889 -187872 -5475 30322 -144162 166517 -277487 9858 -126430 179785 94923 -58580 94680
22877 -22265 -150526 -120053 -31506 -136476 156948 -86724 266644 -129198 -19892 25456 -26722
22865 303684 4425 468284 -78627 190817 -219580 42783 -105656 -161853 33353 3002 130011
22854 130011 -152198 189995 148915 225374 283170 110107 -24232 124939 117509 75978 3459
22842 -188439 -111262 6733 8053 -71200 -328215 -101999 -195428 -36880 -6355 -69040 -181736
22831 -181736 257495 160987 297849 -241505 -471855 -106382 -371130 27223 -108243 52130
22820 -289005 85356 -362150 -107142 -270538 -107920 -68828 -214417 31748 -194389 -353139
22810 -353139 208454 98308 13279 -248668 11629 -100500 -194065 -6170 -186166 -235513 -255870
22799 -255870 20240 122001 89479 -136694 160015 -127546 -259132 28388 248276 -138930
22788 -138459 -252894 131969 -173990 -51617 -74867 281186 45018 -291591 83542 -206316
22777 -232437 158777 -245479 217899 -51855 126243 120175 387081 85398 -286089 -26032
22766 -186819 191446 6826 -498 -264020 -108656 172029 46907 -48492 46948 -211157 -135817
22755 -135817 45774 -125174 23259 -330899 176701 -54963 146514 26707 -124469 140301
22744 -195764 -225481 40823 337994 -266926 -9388 -198956 102855 -58041 66129 -81092 325987
22732 56544 -449671 -112172 -133290 -372091 -132278 -239620 -74811 16237 47596 -218394
22721 185586 12679 -152507 -310795 236478 209726 220862 -286960 -224993 285766 -118884
22710 185757 112539 -14082 15890 -214624 149213 -307316 319694 -176792 24542 -204577
22699 -146537 16763 275180 -41731 226951 -151157 -299464 -202885 -178242 -2740 -98844 -348453
22688 -348453 173107 -223673 80709 -93387 -136488 -14376 -274620 -190695 163945 82550 -97039
22676 -92975 -227775 218459 22874 184540 139959 -258338 124642 -233649 -296194 99858
22665 171669 -189993 -365899 -251410 -309663 148234 -100101 -135339 -231267 9018 -81086 129507
22653 101670 16986 -21321 -200043 206952 32916 42803 -28060 -49090 299396 -133057 68510
22641 -48133 71310 -213660 260259 -99363 -170603 -74095 113353 -102742 8442 191617 -33071
22629 145226 28427 -339489 -124225 52831 44563 205054 -169566 290756 90380 34016 29289
22618 29289 6793 -52868 172644 24640 132546 -165023 -39582 82333 242272 1417 -231282
22606 -98938 -160536 -55282 158418 420235 126659 251568 -54634 141460 14297 420850
22596 420850 -170322 -209770 -9994 -353683 182019 170151 194617 59534 -34053 -154781 111145
22584 -44308 -295943 308185 -91965 154839 129172 -230144 -214153 -79908 -215169 76899 -405090
22572 101681 -134658 -247135 50776 -68732 50366 -174809 -264569 -160882 -1329 8630 403685
22561 403685 -45583 -201190 -196368 123619 37786 -12697 -107312 133761 -282556 -117104 -37331
22549 -467144 254935 -48276 -17712 -51479 -268292 47456 -361988 50598 125243 -22538 -7816
22537 -222197 119541 23454 144388 -28131 -191658 -136548 14323 267526 -216443 -294695
22527 -294695 -100626 -60958 121369 -1053 131015 276270 -166525 64689 -227039 96699
22516 90168 -404384 -86863 -69578 -191779 22562 -259950 16542 229143 33859 -224301 168483
22504 75952 -18315 -99741 -459680 -82721 -112166 40703 -185251 -56874 15069 77348 -23991
22492 -241430 -144088 -153175 -271581 -64410 37961 -7064 -141843 -127595 -110199 -61294 15520
22480 -40696 -80639 31827 -178570 201135 231959 15075 -99939 50929 102672 42533 152816
22469 152816 38550 11327 -30622 113829 -26195 125795 1982 152617 -94686 339612 63593
22457 -345452 67147 -69441 -154148 -104975 34916 214303 -282915 -7088 -126941 -57992 206874
22445 -168318 212950 -59745 -101315 -269126 78012 122136 -11800 162712 -45792 -266349 72662
22433 -217739 49360 -467804 -250195 184364 124969 -262111 144365 100779 -110702 212418
22422 -138694 -199020 45987 9286 74172 -103388 249587 132350 77566 -191624 201288 -1935
22410 -341575 71977 297932 29336 363633 -116164 -166578 -39889 217105 8398 229650 -145068
22398 -155932 280344 -47703 -169173 -126048 14970 181885 -72750 153726 -55869 -78790 -107968
22387 -107968 148429 -122072 -139779 -43261 196530 -156899 177482 -508910 -319403 -170346
22377 -170346 204140 -208046 260507 178698 322928 41692 -51789 -334033 273499 -7973
22366 -59116 -60482 14707 44783 -26745 -281237 -378723 -106538 -269952 -231515 -95857 63986
22354 -58250 -168520 54341 -116344 170013 186262 -399771 -316249 172286 86967 -22984 9366
22342 28103 -60964 -99992 239736 23959 133778 -18128 -323903 210174 113704 56098 91097
22331 91097 -127094 -227809 -44671 -122763 -388876 -119634 -68066 35831 205129 38353 -125543
22319 -42963 26125 191334 9078 213738 -460692 -113697 234758 5707 -39513 32015 141012
22308 141012 13315 -91841 -243978 63135 -1026 -233554 -183563 47369 -281636 28691 -81293
22296 162679 10544 226764 -7534 -10110 68390 -36312 152649 -212884 -181413 623 -218347
22284 89521 -126351 -117271 81313 -312461 -148268 -132406 -404015 -138432 374955 -453952
22273 -33117 -441437 -47281 72323 -62992 -288238 -7062 -82794 -126558 -144184 -71469 93030
22261 219004 112357 46468 -165756 143469 -143253 270859 85568 223753 127447 -85004
22250 -213705 176162 -44822 -161620 -88871 -160272 -463875 -203797 137973 -9076 23387 16379
22239 16379 -23526 -153939 -209702 -285721 -4008 -85249 -151201 -148394 -447507 115486 108816 -133674
22226 -3216 44513 246744 -303739 -91109 -64333 -164546 -200776 -59938 -181312 264532 109354
22214 -352186 36096 9475 143306 -163404 -55393 224793 -81029 -482209 -163887 451288
22203 -91829 28041 -96644 -222815 196488 202779 -199374 20580 30797 106176 -152736 94139
22191 58164 -127136 103589 75559 -263207 136711 -139131 -158604 29446 73662 -257911
22180 78317 161237 79471 -37367 52908 16185 -397932 70840 168362 224308 310832 -26677
22168 44311 -78559 -239478 -119590 -241336 248085 258576 -225348 -162175 -255563 38633 -323166
22156 -21203 -318555 -5119 -188735 98981 -251458 -4967 -31740 217668 36888 -423067 -271676
22145 -271676 -116281 -154429 -203520 455 -284140 -18766 -28988 41712 -150786 203558 -174036
22133 -221339 -81026 77314 -16818 -24887 178996 178881 332061 100496 7681 242453 11733
22121 262772 161820 -32156 -126790 -211133 90829 -306443 -47285 -51102 -232521 31216 -121725
22109 9039 179794 253854 -9297 -272262 150407 99166 -49236 -249623 -22340 -161329 283524
22097 129538 9235 -42162 358109 -61372 -90863 -202544 -6059 2559 38258 -228888 -396392
22086 -396392 125844 -183486 8795 -220212 59400 78605 -185514 612126 11782 -94171 -27994
22074 -46192 -75285 -103968 18483 -276474 -90234 -269570 -110949 -75150 -175808 -20505 -381123
22063 -381123 -111548 -173855 242682 -25785 -101127 3659 125749 -124195 -96867 -25776 -145967
22052 -145967 -205354 -121074 -34361 -183041 -115160 -136827 -126320 224086 107776 -122835 277997
22040 219681 16760 -7094 -163503 -51681 160556 133572 153703 7865 49121 -231606 106987
22028 248213 186991 -283765 -131600 -293947 -92923 -2458 243883 19495 -9279 346616 175664
22017 175664 -113911 -424706 85685 -50223 177546 6615 242791 321466 19457 -43626 -206507
22006 -206507 16488 -565309 246501 222047 -200737 -29644 374048 -102740 -49179 178934
21995 -32850 -108082 35042 69113 107075 254894 83606 -63651 210576 201072 -19898 104528
21983 195513 -59225 -59873 -68122 -96591 -231468 -177522 157397 35048 -21398 11745 228685
21972 228685 -280496 -35767 -150245 50140 -87114 -259766 -315657 -278494 -185973 -149248 -253512
21961 -253512 -122879 202639 -37785 176603 118725 -3697 129088 164146 121472 -471409 186752
21949 -323332 -20624 -244142 -106759 408033 111363 215984 -98539 -209286 -179472 222791
21938 288163 218365 65985 -48021 31230 -276222 -212013 39195 -345682 -196145 -119459 -347442
21927 -347442 -67858 -18707 -79677 -55858 237643 335592 -1202 30387 191574 44631 180592
21916 180592 727 -359299 -42610 -34451 -26410 -413461 -315459 -459587 -259569 67253 -56588
21904 -288571 43155 58199 66132 -118101 -341844 -65514 107500 -134368 38239 -1194 -291436
21893 -291436 -159486 8941 -304312 215453 206792 135088 50723 -245989 -229083 -196016 -47206
21881 70225 -205031 127849 -72268 -155722 22601 41468 -97102 107834 105649 -178066 -125659
21870 -125659 -165340 18579 -255236 -200746 171176 -224605 -35208 -239248 -257828 -262543 -331024
21859 -331024 -391134 104818 96869 -440343 67590 -195529 371332 -227069 18376 79457 76620
21848 76620 496937 -54479 29303 -111999 134621 -75298 38815 142829 153112 8476 -166271
21836 98702 176607 -21862 -17423 -34676 68010 -70403 -62440 -67309 -119778 -64531 49268 -196901
21823 187875 36882 -26973 -126059 -378255 379816 -16368 -213508 113557 49004 -40858 -26720
21812 -26720 -75623 -284298 -56780 48586 63006 114484 162519 -109368 -42566 -130772 154968
21800 -41175 -22945 21674 3422 -180733 -15380 145119 -14209 -145835 -21290 58375 -75514
21788 244419 -20654 240929 33184 129414 91085 48480 149370 -99913 157645 -107821 172400
21776 -79049 -142660 127174 89731 -54047 -57909 227479 -186661 -15261 4787 -96054 -65843
21765 -65843 -170383 227851 -78704 -239071 -316202 78879 10200 100518 26566 -200607 203302
21753 66322 27531 -128407 -339829 -282883 -49378 -154695 23947 64564 119808 -56993 280163
21741 146742 -47422 1667 -240760 499567 442196 -75887 1976 -289358 -113917 -225449 115638
21729 -49020 -61511 -380696 60770 -32245 -439154 -264506 -335387 20985 -38999 -7376 -99080
21718 -99080 -194948 203854 -133305 -177476 -113466 3806 3348 -133367 -137224 -25611 -272829 14042
21705 106456 30594 -158820 -52914 -299244 -107867 211371 -208325 82246 -75023 67701
21694 58827 81653 168637 62127 41906 -113167 24913 129147 -124676 238179 12435 -116635
21682 -126703 276673 -96855 -190046 -30189 124768 -24131 206449 -44668 -190209 -202482 -124602
21671 -124602 -164209 42604 89941 17357 -98374 -148604 65328 168808 47865 128765 -86826
21659 105142 -219820 -82473 -186943 -51126 -471493 345192 -67467 -206910 -159108 29871
21648 -51095 -147603 -90843 -71091 -99696 -334672 100307 97182 38277 -320332 -195601 270559
21636 183986 -310244 247077 30680 -257963 -87842 42066 1620 384633 -306725 -137325
21625 -20637 25821 -35124 -54930 -243106 214621 -140438 -52069 184171 66791 389785 307152
21614 307152 -210029 -19831 -183969 139758 293860 116543 -88649 -91661 -329623 -86730
21603 28951 -249611 158905 -215898 102303 156034 4851 -209032 -184392 -63481 45184 -151837
21591 9851 -297376 232108 63568 76348 -280974 135852 -39626 51291 67462 122279 -127757
21579 -195964 70832 89634 -169640 178167 38805 -425187 -151295 90578 -41949 169739
21568 -203758 -34696 -92454 43825 -6357 -45534 -34102 -300263 -37128 184355 113905 -648 -224336
21556 -224336 -284907 385396 -188614 56544 -197040 30164 9930 -93876 203621 159633 -89109
21544 -127430 -20845 -24767 -133138 -318530 178242 -86656 -360874 11750 -194596 18495 3716
21532 190976 227061 71418 -11523 56250 143524 -43190 -217975 77831 -51241 -184696 -120546
21521 -120546 94593 -102866 -197034 -108467 -1646 -47224 93305 -325021 301629 82663 -148340
21509 41838 -137456 -206021 -149209 2846 282756 417345 76620 -232982 190200 -113734 29274
21497 -58546 -201848 94479 -331081 254671 193072 -50342 172944 24847 167694 -149404
21486 464803 151130 -30129 -49014 -195572 -332151 -12130 57294 -593487 -243197 86494
21475 -164870 77413 -170884 204810 65799 -71654 1549 -145425 10845 -92098 -87773 -334367
21464 -334367 -159200 -57377 -333819 -334252 37521 -1159 -224349 -94762 -206197 13615 -159173
21452 37704 -91295 -35407 -185708 159323 -61873 -17464 -337464 37604 -171676 202583 -46166
21440 -82725 32941 242362 410607 76547 326941 34444 265643 447035 72098 335502
21430 335502 28336 -68634 -84889 -32371 -217076 13334 -293689 -161116 62820 -99477 -484819
21419 -484819 -138262 50879 -48839 -123779 -60597 85174 -213 -433769 246186 -129285 -42958
21407 -99594 168750 18883 -400463 -80909 180717 107705 -103857 -229548 -335701 -123557
21396 -388633 118870 -350667 -101009 -175541 25100 -175149 -140071 -7046 104582 -295389
21385 -32644 9031 -125363 232018 -150367 -84793 -186452 331347 -194898 97572 106914 -157559
21373 7868 -124075 -62095 -146776 122054 -63689 236316 281811 -105010 -201477 -198350 53035
21361 165983 -281154 -151148 -191930 -168604 44278 -207318 65616 411561 -120531 -241178
21351 -241178 218262 -99701 -246632 -156612 -185322 -34883 -22290 12919 -76930 -384469 170067
21339 23637 33848 -210441 -340224 -143425 17949 21641 -192010 -65231 -129417 -7783 -164093
21328 -164093 -74251 224449 -88138 -319735 86456 20204 229222 264347 -272131 -35601 23585
21316 -341767 -230295 -77182 75 -92474 -207629 -455063 -182074 46314 131815 -40347 -224549
21305 -224549 -18563 -43807 -40867 -216615 102235 -7176 13873 174079 -131977 50070 218398
21294 218398 149474 -163293 -152556 306195 -5442 -193741 -223920 -133904 55987 206829 -33055
21282 -384656 -53020 56534 -164495 382756 160040 121594 77432 -147577 -58028 -70080 -69712
21271 -69712 -305243 -135817 -137016 -131704 -106275 -158087 -269050 -181565 -207344 -145188 -272794
21260 -272794 -213442 27894 -108780 -98094 -201469 -416088 19627 111953 -232199 192060
21249 31442 -75561 -74462 -5904 -133195 -18657 -280151 -25518 -6518 -191328 -155523 -117404 -81819
21237 -81819 -351392 -157281 -79197 88976 -230059 96602 25398 -82538 -202979 -332613 115977
21225 -69831 90648 128300 117138 -101752 -182476 52294 -7354 111492 -23470 24967 28786 70303
21213 70303 281508 -321740 148639 -59566 -130504 135504 -374054 18921 -40199 -58515 54070
21201 76649 -249870 212979 -55931 29057 -125223 -334344 -280356 -6889 -90178 -120811 -128313
21190 -128313 -217563 54664 -87533 148058 -416574 12844 133996 -64305 -11902 -84904 -5022
21178 -41810 69268 -106001 183238 -202977 -152052 -98506 -345564 -180756 -409956 129546
21167 153090 297561 -98162 -251921 273371 65188 -572409 -21918 24073 175079 160436
21157 160436 -22418 -215686 135479 -48687 15254 -130039 -408273 -283059 202193 -64736
21146 57751 -299388 -204327 71513 235373 31634 55715 328223 -164182 -128620 -254756 331876
21134 -204177 98369 -94685 -161783 -129494 231360 -122487 -263611 -79354 298893 -80524 -248982
21123 -248982 -226917 -57819 -193355 214590 -143315 -128784 -89940 15318 -82827 -70468 352191
21111 12261 211945 10864 -329386 -111010 -177226 132714 -18324 129299 -302848 -1913 -45950
21100 -45950 -112474 -234139 -37661 -234318 -3369 316778 -91739 -322775 -61199 -167347 -3369
21088 -311295 -214766 168468 -60350 152361 152091 -97915 -184702 -96419 -102529 71220 26791 -43103
21075 -249519 -131908 4632 -207518 15092 67783 -51218 119436 -123436 -280046 208096
21064 70161 71367 -196822 -212949 -55901 54422 196318 -74002 119434 -53680 -324781 -177549
21053 -177549 -121679 197996 -48808 238719 149354 -309129 -191769 137614 -281588 -333261
21043 -333261 -167803 -311725 -18192 178627 69282 10835 -149890 104665 62590 95059
21033 95059 42298 -386075 82299 -106405 -30297 -218636 -195780 369086 206853 -90559 -170363
21022 -170363 140619 -259058 54822 -246664 196759 -72707 -193930 41901 88850 -85686
21011 -20149 -129857 -52125 197647 -101963 136622 -248221 -107320 -94817 100237 -161019
21000 206348 143987 -243734 -210774 -149806 61721 -36980 4257 -14701 -84567 -33264 172202
20988 -462847 -275402 10122 -206295 30055 -335171 -98449 106533 164403 4252 -17347 -45667
20977 -45667 2932 -13464 123134 -21280 122603 109716 -100420 -59808 -85690 223192 104002
20965 -9415 -320908 81142 43185 40560 -126232 53332 -97852 -113819 109878 -95157 60887
20953 215462 -16578 -106055 -91668 -428244 18776 -255533 134714 -125608 102416 56903
20943 56903 -23206 -173527 -159923 -132166 -312397 -73367 -210393 -24894 185300 -191363 -248501
20932 -248501 -142913 140029 104621 -133106 7634 -1135 -127051 -131135 9368 -105313 -4310
20920 -16994 -124841 253614 102657 -291866 -18700 -378473 41913 -210226 59958 -202955
20909 -119596 141928 239496 60024 187608 -61783 273438 -256603 -277306 -81147 -9717 -173338
20898 -173338 -35980 -200150 131916 404873 330885 285343 -33795 -99227 -193530 -178495 10071
20886 -267678 38327 202466 -85799 -116828 37846 478904 -151180 -412346 -157246 -194648
20876 -194648 -103664 -43113 189113 -77093 -81280 -1518 88920 -25291 -2072 -64908 162816 -14735
20863 -87689 -174205 -171128 -256563 -138873 125137 132391 -153389 25288 -224833 261020 14004
20851 26738 32741 -383 -174162 -61283 -169569 -390403 -59378 229537 -175264 -27995 -116478
20840 -116478 -99047 -140332 -102143 -224803 262649 87255 216278 89905 -62035 249955 -71979
20828 -54191 -12334 141795 -50856 -108184 43176 -2205 233032 -148184 -107972 31562 -197349
20816 -77642 106560 3594 -44646 390610 -201625 -125353 186588 -115646 72829 -154550 102738
20804 19225 86549 68712 226696 -137610 -244863 3747 -363235 -5874 246272 22662 -25406
20792 -259218 -51245 -21301 -233844 -62419 -39528 -194361 -216056 4914 -433270 68489 40508
20781 40508 -304482 88799 -335707 24069 -10579 -81871 39391 159798 -138222 -310097 111458
20769 -256978 -330258 -124351 -166468 234669 141350 7432 -125391 -190306 -203376 -196591 175882
20757 -109291 -236376 -199801 -174438 -113582 -303355 111798 143272 -197910 322555 83293
20746 -100174 68862 -372037 247218 -37960 -59718 -192509 23631 -91947 -207459 -132576 -77245
20735 -77245 -175312 -309053 67987 -393096 -32621 148474 109498 184414 -121451 6910 216748
20724 216748 -5215 79479 -61570 -40286 -180083 -61216 -134040 325749 -196785 194148 -152201
20712 -138004 183034 47551 -187808 -16070 -437817 -108102 180455 -150788 -149316 4000 -86390
20700 20676 -282106 -133739 -94450 -164553 -301742 -113788 -241794 230963 93843 -413650
20689 40873 -10464 110965 215571 -103116 -304103 -21125 193737 94834 -271698 -102382
20678 525888 -9402 -204251 -74025 3380 96278 18134 -1611 331445 -183378 -139034 -322375
20667 -322375 89193 -119396 -6377 -18091 -144858 115953 -223075 -282540 -118094 280984
20656 -219818 -196087 4258 265686 -368214 -39653 -439536 -210610 251432 308221 -267546
20645 -153205 -147333 122634 49365 -203393 -252407 -45976 14488 -82900 105623 -129606 14309
20633 -435964 -143619 15523 192324 204701 -67025 -364628 -321402 -307736 -45566 -231830 -158028
20622 -158028 -59256 -95570 -89413 143518 36482 -104586 -77055 -44916 -276373 -58325 31394
20610 78777 212653 -208464 -8662 -50621 -116273 -169331 -148329 -321953 -141724 -3038 179847
20598 -69367 26651 -124037 217841 -233902 -141225 -63671 58597 -205910 -319561 -137254
20587 61621 213254 177088 49629 233901 -234828 9849 169650 -25031 -303448 168442 -12292
20575 19749 44324 178460 -27952 72663 -246333 -44058 -106685 59926 -271273 -150499 -41521
20563 27804 -181349 -102732 -149527 92166 -5294 -89220 -56100 -32141 -216818 -281065 172544
20551 193727 -19134 -79631 -162739 -93465 60101 96374 -38952 81323 12815 -217562 -213192
20540 -213192 -99803 38416 -122995 24683 -191823 -240878 -76529 67272 -36270 -102386 137532
20528 -368758 -218366 -210927 -10349 -35650 -164915 -376745 -112844 -121199 53975 -318335 -114515
20516 -222871 4230 -30268 17932 -213599 115993 74571 -213470 -239376 23961 -181095 -130026
20505 -130026 -248807 195729 -60826 -52041 38902 154853 -62143 -133660 47419 173588 -157762
20493 -176194 -100425 118783 -134539 42803 -164522 12354 184650 217161 -222010 232443
20482 303970 -295050 -23794 250280 -92231 129545 -224932 -177139 -201369 311329 -211456
20471 -173203 -403228 201225 -28380 -266893 48111 315715 368905 69372 31107 79933 183763
20460 183763 81027 -291509 -24505 248625 -54395 18201 -93827 29649 48533 99207 388937
20449 388937 -326119 -76687 -54221 49449 -279345 -268441 -282079 -192716 -243759 -331649 -189305
20438 -189305 -104726 -56080 -22048 279423 -19054 -81860 -95943 -232355 -42936 38152 214053
20427 214053 14775 -97699 -6696 47382 -76564 -58407 170786 -119805 -100605 -277230 134550
20415 -112326 155513 -121040 -164042 -88054 36635 -210221 -228690 52949 -314540 58878 -62375
20403 -282991 -162681 135908 -492073 213427 -410743 -98299 -124140 64556 318130 186019
20393 186019 -71866 -77359 -142762 -265820 -67368 122129 10421 -127359 95971 -73112 97018
20381 34397 -199918 -235500 -343643 -285338 89508 496449 -17714 -206066 -207573 -66227 -131535
20370 -131535 -305706 -129850 -277331 -284146 -184365 -296132 147903 -25510 -109498 243608
20359 130568 -7804 -81617 -136734 64799 -407705 205101 3386 -253073 156085 161037 -106408
20347 -131668 -102503 -107835 -159223 -331227 -324656 -192506 41992 178973 127706 295055 -163549
20335 -194496 -81029 12901 69907 -259963 -322460 188345 234469 -117396 95819 -105397 194415
20323 -331199 -132325 149171 153112 20169 -166493 42864 111329 -232847 19869 -245079 119463
20311 -326987 -165372 -182499 -121829 149527 -319402 -281219 -183478 -128018 239029 -85178 -271788
20300 -271788 -71104 40013 -63356 171460 100550 33195 39175 79726 -272474 -161827 -356046
20289 -356046 -309474 -53042 -203632 -84732 -197002 111636 187298 -17235 -234491 -83990 116655
20277 -103961 75807 204657 -68257 -35652 -215578 -85106 -303363 -155300 -166132 -237048 -315203
20266 -315203 139569 -223090 -229658 95380 -287840 -103318 62124 76186 -303039 -248073 -283086
20255 -283086 -140297 192573 89036 -245099 -27247 -158616 201563 -93556 107364 19492
20244 -151430 247417 215597 110753 155485 -100170 116830 -18285 -184964 -373264 -66318
20233 211628 96397 -34284 -122861 -64021 20827 -32102 19622 -297006 -94756 -161038 -55053
20221 -190463 -236304 93910 -274678 -31267 109503 -172727 101712 -308554 115893 68903
20211 68903 -150848 -113937 -328161 129684 24405 -309148 -494156 -136742 -110953 142393
20200 13474 -197791 -87271 -186944 100492 119971 124010 63842 54049 -311552 59649 117070
20189 117070 -153176 -48881 85684 -229070 35077 -56847 19835 -71099 -126322 86039 -351124
20177 -396696 246272 -290949 15848 -108254 -10675 278731 -71995 70087 81270 94528 10128
20165 176121 39094 178978 -36899 -233163 -90666 79637 -118114 -280183 137662 -50526
20154 -194507 -37314 88366 -25186 190182 104925 223431 -309122 -40347 44448 19720 -37105
20142 169665 -10654 -276271 201925 -143070 54775 -174357 312796 -61621 107485 -149626
20131 5458 7444 -180259 191979 -140746 -96222 57327 -70475 -305058 -65004 54879 157613
20120 157613 126443 -42968 -436530 -297063 -108766 182027 -108005 -15968 94209 106826
20110 106826 -251185 132936 -33887 -173401 81536 -119887 -253551 -235543 -47839 -246388
20100 -246388 -280028 -333923 -30596 -157427 10001 89068 -233012 -308963 -179337 6099 -75219
20088 -2452 79169 -324568 -234539 -234383 87577 -110385 -62665 -50043 71962 166197 -26004 -165365
20076 -165365 -326340 2130 -49366 -107678 53511 -123744 -75468 -166127 30871 -272365 296444
20064 -160568 -61080 289374 -242352 449 112060 -14308 -16616 -174539 250521 97354 -156582
20052 84196 87429 -205121 72438 16553 -214224 -289226 89838 -94728 -90376 -198446 -191411 -238940
20040 -238940 -303769 -49547 -33167 -469100 180822 114502 -90015 -39657 215081 -10050 -199362
20029 -199362 -85308 -168728 -220490 -1638 -63133 47316 -45569 -26340 -94760 -175399 -106881 -420172
20017 -420172 -66856 -217458 -223323 -47793 -215194 81328 -168228 -301067 79164 72404 140051
20006 140051 -139238 -241266 -142176 -150459 162765 -105417 -235484 -68413 -143638 -163311 10571
19994 195391 63711 -80463 -31829 86059 104038 195573 80789 -187359 46781 62216 -49618
19982 -159504 -163665 -126717 -12274 77207 -151856 -276145 -236394 -158344 294013 -132572 -170354
19971 -170354 -5741 -177343 -56187 -112433 379084 -7232 197086 4824 98195 -49356 -341433
19960 -341433 171208 55241 37507 -137588 -135322 256804 -122677 -293624 -263809 -212950 -162765
19949 -162765 -99436 -38665 -214895 -324629 -76841 39513 74178 10337 -268171 78764 -115446
19937 -175454 -71270 27619 -328522 -274693 74921 -71809 -225653 -164928 57808 213005 -296175
19925 -130333 -237243 137091 51488 -177478 -77991 -60754 166644 -316837 -165789 105898
19914 -335464 -584 136686 -134615 -322342 85245 28191 -348191 -30091 -176212 -21340 128788
19902 393436 -355141 -168201 -7024 -279208 34809 44246 29600 -218005 -188705 80812 -96151
19890 -224900 -189967 -216271 15304 -12379 -217553 30282 -87595 201827 429627 -176795 -100615
19879 -100615 237118 -181798 189119 -99537 -375564 167047 -245966 -144777 -124602 322241
19868 89891 122708 148660 -86445 -130298 35618 73318 107362 35329 -115773 -174816 -256931
19857 -256931 -226940 192077 219399 345067 2758 -42890 369676 -29430 -285487 -222502 100099
19845 -72801 -220513 71714 89147 -244864 32439 -118276 59133 174478 -37171 -78303 -103045
19834 -103045 -192050 44513 73465 296501 -5329 40843 -76800 -467347 220749 -153213 -245448
19823 -245448 126299 56826 -122405 -183640 -104358 -29733 4912 211336 -34024 133019 -319136
19811 -149912 78234 -277538 215927 -229609 106273 -209086 18574 13619 -159584 84156
19800 -201604 -119867 -515703 -73978 -233205 -91693 -269579 -14627 75686 41883 -202292 57930
19788 151318 181747 -7315 -52354 -15448 -123765 -188821 6300 137204 160986 -75238 62131
19776 -100245 -407431 -158535 12351 -273146 164701 -141730 199183 144703 -196801 -222194
19766 -222194 -53117 -44434 -365862 32174 -86295 130956 -234526 -420362 53211 -62926 339689
19754 -182577 9564 -95990 -126095 -40623 25250 -601751 245452 137728 818 -576921 -33055
19742 275637 -115652 -204857 -298734 52621 -41605 127573 -263104 61636 191331 50063 -86207
19730 4250 41189 71022 -448441 45637 -27265 40356 26372 -204267 39094 -55556 -113907
19719 -113907 36943 194965 -88594 -276658 -92648 -124377 339236 148768 -6561 66517 -156402
19707 -99907 -14751 -31550 -378254 -72061 -88619 -129509 44530 -193120 -196993 -234394 -392808
19696 -392808 25608 48307 128013 -100765 391816 26564 -130038 21197 86493 -110556 1691
19684 -197978 151812 27956 -79816 -362336 -100863 -121083 16400 121526 -214631 -93816
19673 80158 -54736 88420 64628 26450 117197 245501 177311 101367 206475 -193091 117969
19661 -249545 15301 47988 -165571 16509 -415582 -310976 70157 -18545 145575 -191938
19650 29969 190671 145273 105272 -124817 124097 221776 -87916 -210269 109266 258539
19640 258539 -14592 -397723 -246383 282218 100403 -45850 159013 34361 -244619 -324974
19630 -324974 267664 -49384 233200 61213 -167862 -118298 93837 -24568 -51770 -24341 -138012
19619 -138012 24888 65063 -225980 -119885 -65794 155965 72294 291439 113338 -209477
19608 -332262 93662 -316292 -175542 51769 182642 122811 -130812 -174405 -14743 110770
19597 -70007 -75975 -82235 -85823 232581 -143614 -26191 -93955 -68632 100238 -212225 -283025
19586 -283025 -136862 76396 -49193 -320409 -515183 -76577 307284 -92857 253503 -195117
19575 -116404 -10622 -179253 161064 70304 -467230 -297780 -504876 17980 99374 -198193
19564 -26636 -55797 277654 -209953 256022 -12505 -260302 -381786 42259 72794 83018 -437417
19552 -363594 11304 -150738 311586 -129479 85740 -116870 78372 -84583 -353692 171532
19541 48130 -515519 -89203 -104913 -237200 -261988 62016 163212 22905 -382103 -64977 -257239
19530 -257239 225231 170754 -102306 -124079 44949 245390 -3960 158321 26199 -142058 84827
19518 -377824 21435 522416 -159272 118680 20072 -181640 -210171 -344023 202609 276187
19508 276187 -92507 -96593 33100 -130891 123852 55444 409 65568 -317646 69964 -31229
19496 -36287 -353894 -150817 -185718 70528 -82130 -242902 -108728 -174440 -137356 -119858 74976
19484 247767 -6139 -108996 -58731 -327876 -235867 63310 -100561 -202125 103706 159486 -15485
19472 -304492 87435 -48803 -92945 -91262 -265642 159498 2578 -108902 -106633 284450 -252448
19460 -44368 -267854 -93085 -76304 -72865 -31568 -393334 -21219 -37520 -304021 -349666 385664
19448 -193251 -9079 214184 139014 27201 -172824 -327250 -202626 23078 40723 49168 -115688
19436 -189986 -175739 -132272 -5688 -18917 140050 -191378 -377891 -101000 290491 -197508
19425 113957 -206986 -149444 -152232 -172951 -264814 -194438 11038 27132 79161 -75783 16958
19413 -28813 -246985 -236312 49731 39199 -18684 344518 211433 -278170 103881 -107542
19402 -22893 -16351 -15382 -258944 -101171 70196 -194828 25618 -217295 -146844 -87488 -39588
19390 -4918 -194992 -1125 -4914 310015 -271506 89785 -91133 -38886 27801 5800 64279 -196745
19377 -531810 -43444 -37976 95073 101250 -136313 -7376 -22929 146728 -281946 128972 -10000
19365 171642 183757 -128283 -97207 327133 -264508 -27614 -335453 -51654 -193266 -437695
19355 -437695 -17533 -38469 45958 -159050 -30524 -169995 -351809 -132410 222577 134955
19345 134955 -26376 -296975 78026 -161064 31741 -130643 2687 -314355 287574 -337422
19334 -32266 -90108 -298287 -221688 -69937 117121 -35466 5608 89521 -56804 -36198 -112231
19323 -112231 -101433 -129731 -69514 236352 38524 112562 25486 -192971 53427 208680 -29197
19311 -174338 82343 -357912 226244 -69720 4688 2203 -287208 29370 -104963 -22792 281824
19299 214608 -159385 -236027 -143152 -105318 251601 32501 -66759 76705 -138263 -138489 -254730
19288 -254730 6766 3425 -115912 97984 50027 -142532 132179 70639 75115 -197561 -59998
19276 186167 -30239 115725 57878 -417626 -330368 -21145 9020 -323141 -218275 20394 146311
19265 146311 -126106 -96611 -287397 25869 -182287 -386149 54251 82913 174344 -483467
19254 193527 144653 192635 307513 116866 93806 48904 -174814 -260900 11516 73884 -121381
19242 -347182 93459 32146 56503 -161991 -132953 -92406 182323 -110246 -287733 -512111
19232 -512111 255362 -154362 2863 85706 -168444 -11190 203294 -218244 -29071 285289
19221 -491472 -36366 -91998 109773 -2964 18801 -299502 -118810 -2265 42970 146308 -144342
19209 212297 -399256 -151447 225686 -234201 4461 -165749 9018 -331756 -337241 79569 -326299
19197 -62057 145209 57421 70179 244575 -63638 -37461 -82504 -85812 -104299 84693 -97319
19185 -33180 -107297 -209588 -183834 204292 -280368 120662 -57992 55383 -318807 -169339
19175 -169339 -72727 89531 -5851 -83583 424 -22393 20754 193840 -442758 -240777 -210292
19164 -210292 -442823 -885 -137907 -308722 55170 22678 108777 -169256 33835 -421907 -157733
19152 -232501 -97845 -195415 122893 -407307 86405 -84138 -129543 -24706 47456 -17888 -315669
19141 -315669 -218854 189276 -18900 98045 -68422 -55984 -164874 23634 28196 -161291 15648
19129 -191726 325145 233543 14212 -46489 -21843 -365978 -21087 -104736 -232749 -104504 -318386
19118 -318386 -223085 -43242 -211779 88311 -226449 -90902 -50860 114420 -225133 -251468 201443
19106 -158998 14251 -184987 -48975 212146 134870 -111976 -184044 169291 -80977 43549 4963
19094 -65415 -166354 193139 24539 173500 142476 -74846 27403 -41989 -87877 -50070 8759
19082 -236516 129366 -100864 -109429 -110649 67241 140514 364285 -124169 -101033 95753 -130679
19070 139595 110307 -49319 290471 151588 197873 -254333 -204478 52160 -121000 -359018
19060 -359018 8304 -7996 -281201 -30431 -401378 -222772 22692 107488 -241530 134819 -98514
19048 3399 -136286 6261 72224 21519 -72163 6054 137950 -140221 -396865 -271333 155189
19036 122512 -171677 48864 -207395 -21995 -485393 310372 -68366 29072 -69281 99328 135434
19025 135434 195714 -14227 -446097 -71303 280879 -104500 169375 212661 70625 200250
19015 200250 -115626 -22433 -46497 -133611 191968 187032 -135675 -62973 -183590 -38513 -261598
19004 -261598 33455 -151945 175558 112228 -140151 97328 -172084 118848 -6782 15203 -212537
18992 -277007 -123222 -208663 14681 -301371 52845 -108710 -165312 -269418 107444 128657
18982 128657 -131476 -11637 65633 -89920 60815 -71820 -162935 104429 201739 -120440 117663
18970 -98556 -138753 94469 -103484 -91610 219430 -196783 -695 -140951 -40783 -63239 37664
18958 -129506 11782 190838 -195392 -57340 -156852 80221 135646 243882 144899 68044 -219544
18946 -59792 -149181 -102461 -292375 -129550 13386 -291075 355217 136303 -116879 95271
18935 80917 -47683 -149878 -54109 71887 -19324 147033 56668 -55432 -27083 -11705 -159528
18924 -159528 -174039 130385 136826 204719 90190 -12377 70525 132527 272529 116436 -90614
18912 29708 -180564 159113 -226805 -144550 -106163 -73721 -147628 203482 -40956 -58177 39911
18900 -42122 -50961 30774 71846 115211 48400 54365 -131545 -127391 -95539 134026 -404888 112823
18887 -302751 -164268 44720 -270544 -200576 20297 -135778 87611 -189334 -273285 -131520
18876 -353602 -292851 289367 -189285 -151601 -261642 -339371 -200013 -295803 -212658 -169022 303012
18864 59604 -361116 -396262 -150300 -418923 118460 -78221 -210546 77770 78441 -220814 198543
18852 72508 -2580 111352 -58365 212766 203163 156209 284762 -129796 219110 227611 72080
18840 -106554 71747 126964 -26395 -234384 -203629 -99741 -41355 32975 -52246 -217857 -276526
18829 -276526 -43386 -141107 -391810 -167617 -26278 -42837 -251221 -31837 -80060 -12405 237136
18817 138427 -244648 -13561 -198686 230164 -202402 119757 92335 457370 -86638 -70258
18807 -70258 12087 -172734 -226490 56403 211014 41987 -63847 141183 -2527 16441 -131477
18795 65068 96932 -25246 -6817 249955 369819 -128290 308580 -179577 38419 17677 259138
18784 259138 17388 112585 -143922 -169118 252208 -87875 -110597 -389070 -144085 22061 -165168
18772 -247169 -225982 77098 -142660 -1630 -162259 220184 408505 -138869 -174501 -250905 -107988
18760 -302666 197171 -156103 -235173 -64028 -167180 -224077 -237465 193403 -36135 37899 -97716
18748 343539 98549 -197857 -289017 17106 57519 -34792 -40939 -152476 -89602 180490 -236970
18736 -223123 164877 237797 -106043 -210819 87380 2781 -5950 -278959 -157587 -189863 -40986
18724 -109461 -78561 -169399 58209 162754 -6218 -38380 -269806 29673 -66891 41833 159414
18713 159414 -289236 13741 -164487 -210403 3764 -210334 -72755 -3090 -82581 -178156 -273458
18702 -273458 -183392 -189142 -197191 5923 234978 -70855 -97229 69743 28576 82291 -40839 16498
18689 -58424 36328 -217486 110546 3142 -228198 -8225 -418543 -138536 -288576 41293 163936
18678 163936 -386761 -34998 -209462 -266109 58142 -117157 -79967 -61405 -50717 -383119 -171715
18666 -79332 102759 112046 -122727 157008 -57273 -21160 176842 -89382 -82176 -13113 -203954
18655 -203954 -200280 -286763 -131354 -176018 90434 33767 -324126 166723 -23256 -37366 -84463
18644 -84463 108192 -110444 -81307 11506 58090 -202581 -108545 -242741 -224758 149515 -407134
18632 66776 -337579 -178300 199246 86998 314091 -124146 103697 -83719 -124513 181420
18621 -211954 197869 -10322 48802 -110728 -183544 -19543 79271 94933 -192205 94823 172171
18610 172171 149518 101163 -180424 54349 -195661 48423 -119697 13046 3034 -434489 -252316
18599 -252316 161371 -67258 -147397 -168954 -65331 147638 9889 -45723 -337098 178627 -92598
18587 -145919 -264888 -122861 -174753 81481 240566 -56613 217672 -151292 66534 -52567
18576 -138179 -81721 352255 75735 89654 55881 -44803 110462 313350 164000 -338184
18565 166544 -105124 -167866 -23984 180031 331123 324083 -74894 224964 -252380 -75808 123176
18553 128562 -83166 -43707 -137951 17811 -84411 197072 84053 -250063 16201 47175 53955
18542 53955 -273726 42138 -33813 -275316 -242086 -50439 -278566 164442 -293595 -181884
18532 -181884 -334311 115218 50711 -108718 -167141 -86810 193020 -307881 -133539 -41161
18521 -80733 -246733 -83670 156842 -86765 -240701 147781 -219432 -73966 51477 182498
18511 182498 -214162 -71911 -49835 18705 -87948 -255999 47722 -30013 27877 134067 -13597
18499 -94819 23737 94552 -45994 -233160 -158190 -106685 -168738 18984 68340 169395 -348138
18487 -125768 114398 89988 46511 35800 -80909 -324244 -211657 -72385 29866 -87980 -189107
18476 -189107 111947 -95753 254971 -295889 -11391 -62759 -135277 314849 -105204 -80907
18466 -80907 172120 81960 -29177 72317 164760 -49329 -340524 -35422 57076 -121129 -119023
18455 -119023 -193151 -428301 -151899 46775 -499429 -16960 27521 -136628 -15153 -162152
18445 -162152 121340 -52034 -131962 -214608 -3962 -198627 -175739 175861 -245524 -97626 67543
18433 36349 166140 -155369 -393573 -110318 -7475 100031 -216256 117095 248322 -20143
18422 12238 141827 -187820 -101175 29739 -78227 -376816 -279090 -112926 78021 -105783 99423
18410 59370 56305 -171379 -284884 370399 20916 214492 -69818 -174701 234272 218263 223676
18399 223676 113929 -115376 92051 -7509 -123852 142912 194230 45398 30428 -295191 -32203
18387 -255032 -10125 -262749 145327 -54121 -25187 -122617 -91927 54963 -1642 -81800 -342667
18376 -342667 169978 53110 94492 -189385 56703 25484 -114437 -15356 -131742 -181984 45974
18364 38297 -12260 -147783 -5247 19358 90918 157037 2101 141158 -18781 -81404 468746
18352 -160566 40442 -58516 57627 -282296 -127142 102169 6750 207995 -286444 -93721 58747
18340 -148778 -57797 -13611 -377096 -231311 324894 -114682 12842 -62729 -2377 187581 -122366
18328 297610 -184079 -124544 -74309 -34976 148445 -159664 16172 -109028 -21151 -60216 -147113
18317 -147113 99655 -188751 -100848 -130121 344164 -42 -218122 173669 219888 173992 -90390
18305 161796 136532 31558 294662 -6387 -244440 -208156 123942 -202672 63054 -11134 -253185
18294 -253185 -53736 -76527 173805 -98914 -278613 -23215 55313 -24468 -233834 189194 -133241
18282 189082 -352948 -36774 -124433 -94553 143238 253566 -368871 49433 -163002 -162079 -130663
18271 -130663 -291729 -77099 -339661 -372877 86370 -125323 -6632 -205978 267383 -105248
18260 -32016 -75241 -141507 211749 -342924 227340 126310 -245108 -317256 36057 -18643 -85225
18249 -85225 -10911 -169664 -132768 69007 41705 232262 26882 102458 -93644 280790 -335470
18237 -182094 -313597 163751 -36980 -304275 148104 203632 38612 -18739 196283 102593
18227 102593 46537 396410 -21278 -60278 28098 264180 -221993 54406 -294634 -37386 64397
18215 122367 -88065 -190129 122046 43630 39235 -64460 -141847 71686 121663 -12332 -400238
18204 -400238 -400410 114551 -380401 160959 39472 -226087 52514 72410 127701 120575 205711
18193 205711 286033 -191935 -2538 83712 65544 -12605 538029 -77194 285085 222863 -62520
18181 188783 287744 -317592 -291962 -107097 81398 1332 -320147 113162 -155174 -302478
18171 -302478 63147 71730 -150791 63768 156260 313560 98116 159103 57371 357793 51219
18159 -156498 -93113 137157 -73488 -344294 65290 -227781 -9305 -249999 -327959 129484 23076
18147 -61458 190390 -422271 -161676 -85785 88043 -11901 -398632 207512 12511 -300393
18136 -193397 61994 53495 -130567 -210070 126283 316470 -332902 146010 -283608 -28270
18125 39824 -284889 -224280 -124529 261666 -16938 -19448 58866 -151112 -202613 407156 -44189
18113 141671 84534 119101 -1498 -275491 -175217 42591 -279038 128005 135750 14185 3453
18101 -77591 18115 153244 383347 74541 123574 -281718 53567 111296 -18062 -381122 -319522
18090 -319522 -279068 -238758 144123 226614 -62382 56428 110947 -56220 -68749 257933 46776
18078 -9860 136873 -16197 -35824 -175824 -355889 77260 133175 51173 -118298 22381 -159369
18066 -113143 76161 -35076 85790 -319393 145946 23789 -178787 124614 -355156 90945
18055 -110679 -102243 97619 50403 81409 -353682 14599 -157918 -47362 334866 -295295 -272178
18044 -272178 55609 22697 46532 178134 73960 54597 62991 92683 -23252 23668 -30979
18032 -93983 -154751 126094 -110172 50824 -90443 105957 -199591 160110 -168088 191105
18021 -523409 17182 -11739 -150957 2321 -300398 -61100 -38663 -4540 -18975 -167082 -119329
18010 -119329 -170566 11506 -391325 33692 38516 -188594 39449 -53150 -296092 -492341 77742
17998 -140118 -78232 -75183 -15922 -25051 -169637 302086 -118426 -130009 -12804 -53822 225454
17986 -60583 -47259 -158448 112216 -129321 -91020 9526 -143134 122897 -76676 134644 -216539
17974 218097 -47173 327399 -100131 132120 72232 11391 -140324 131549 105989 -16834
17963 63290 -188123 -123636 230414 -40789 74199 -144269 23404 -77290 -263775 217473 -174951
17951 4238 -1401 -11047 -136906 200410 306797 -322743 129421 208997 -108492 146917 62350
17939 -91560 228245 -146521 -61068 -6307 -80291 -117413 -105857 -2587 -47588 -226136 -318893
17928 -318893 109562 -34270 -146630 -105920 116948 -12236 5351 -257591 -252212 79808 173212
17917 173212 262504 217091 224972 -47128 509302 -405059 -164732 -117310 14117 -120280 4539
17905 -186828 224838 5920 -138676 142539 26514 350632 -277671 89836 -267393 8995 49467
17894 49467 -48598 165986 139204 353210 18729 -417453 -287268 -62301 139908 -133067
17883 21952 -7173 -171348 -37303 -173576 -139636 -99814 12001 -89076 -205386 -59279 152136
17871 -57596 121421 112075 -6183 -149125 -92583 -21498 -15012 -128180 -239518 -102469 -151657
17860 -151657 -397823 -76731 -81884 -39201 -188878 185817 159965 11158 25653 337330 -267695
17848 -173526 -209778 -174305 -66986 -40701 131215 -59087 108594 -28835 215425 -3006 120975
17836 59426 96127 -122541 -328119 282378 -48142 -91344 157116 172091 78937 -79338 33435
17824 137278 53294 -88207 145087 36613 -238551 29538 248657 -42666 3126 161233 66188
17812 17618 -104980 82492 -175386 51018 22846 -96384 -18925 84907 -20828 24449 119642
17801 119642 436388 88112 -186836 16359 173090 -47205 -36977 3907 -18523 301627 -67407
17789 219406 60780 156752 164331 164471 -21533 -219777 -229603 135487 657 29638 -246337 -46200
17776 80015 -65385 -154170 -474151 -169439 35106 -230491 -60836 -177886 -323850 40127 -180531
17764 26418 -248123 -44689 27996 -230519 -179279 -179295 -121428 27102 -49253 48472 -38421 114037
17751 114498 95031 34568 -141494 88380 20380 275530 94482 -33548 370748 -252700 140412
17739 -266867 27517 255196 -95 -200064 231085 63133 37297 -140130 24288 -89819 -434103
17728 -434103 -207195 362758 -67255 -140879 255456 -107741 -132193 -15579 295802 -100562
17717 57003 118042 22786 24941 -353921 -31329 60755 335609 73761 106260 27096 48352
17706 48352 212672 -172783 22500 -97611 -224535 -234104 329013 -20252 74591 -37700 328906
17694 21652 156986 -367804 168559 104686 -157652 -88411 -369622 -219469 -160162 204061
17683 144459 -56410 -125015 -43897 -61779 -228284 179981 363385 357025 -9241 -155392 190100
17671 189085 -139855 -27924 13393 66964 -257308 -131453 207232 -9588 196316 -37641 128641
17659 122814 254504 32575 -315454 14643 122611 136561 272607 29671 -76144 -192415
17649 -192415 -303280 -38936 -88127 333854 16504 206199 -158365 21033 156587 228948
17639 228948 91251 115214 -233635 139098 128717 435802 53682 96706 96525 -80215 -250596
17628 -250596 -106474 263363 -11168 -149949 242318 207312 -107299 112668 53849 -1234
17617 -31938 -134743 -29009 256093 -169702 258637 166531 113756 220230 -2044 10594 94978
17606 94978 162253 -142317 242326 232531 -4253 -252233 13421 193231 313888 126287 -144296
17594 58914 72456 236559 123430 -52312 -2844 155586 -30986 113124 117576 -98890 -82968
17583 -82968 65761 235949 22853 -192572 336932 -303878 163935 86827 -344965 -172951
17573 -172951 -175964 95844 245419 212650 -162923 -112815 245996 -130065 -48506 114444 -231225
17561 -52111 185357 42361 -29310 104669 -125541 27469 108678 -146568 25431 172152 -47573
17549 66773 3725 -273439 86036 103612 82279 202264 14966 293938 43563 96202 -128956
17537 -417982 185035 -73120 66212 110185 -44155 197200 -66161 40430 -28862 298602 170646
17526 170646 115975 67635 6468 261363 100773 -40237 18870 -43656 -171336 43971 76287
17515 76287 -49270 209606 -259600 -90640 216792 107353 132931 196496 -212889 150888
17504 109108 164481 169307 174910 -142206 110370 264854 -144552 316405 -207373 77341 167149
17493 167149 131134 179733 84287 -157107 82358 -26991 -59559 -176480 183380 198319 -348388
17481 109427 199408 -96137 312210 363651 208816 381197 192102 -111033 -83549 11664
17470 322488 43963 192792 364808 372507 136811 -87120 59423 304973 -12407 -539 -173029
17459 -173029 110781 181169 -243163 112150 -22556 -265889 -38226 68108 149967 172706 193205
17448 193205 400610 435797 478278 456538 550378 -3502 414248 168587 321572 341255 43944
17436 239501 168586 193622 -114579 230343 38028 620516 378256 300879 218903 156640 79509
17425 79509 425645 12677 385272 48295 461399 332049 703287 420374 152128 389145
17415 389145 145744 359381 19435 -94427 66976 247333 275307 56749 177619 39184 119201
17404 119201 17286 49035 238389 232755 106798 12729 41699 224584 110681 295100 420351
17393 420351 382227 241625 -37060 231963 359858 298382 213336 375052 289689 85211 120018
17382 120018 172800 48529 43072 93214 -7293 67502 -63832 358360 130120 -278629 -364441
17371 -364441 37719 196875 283579 3619 38691 -176651 -59565 -89127 -40218 -16383 470287
17359 279223 169165 212145 351447 -4612 132613 343422 113953 -38707 256221 -73279
17348 -41780 102753 -218846 4371 204865 84049 -59993 453133 218035 210115 -10493 301853
17336 -10792 437524 -165348 -5774 19018 92291 135693 206074 113712 -188000 176954 -10166
17324 172973 230633 219794 142754 -110279 169254 87380 292000 269704 89326 637430 -130960
17312 264516 269170 359349 32688 228468 294567 287153 103849 354092 7985 67614 -78622
17300 96183 -37559 182352 148014 366667 108546 170443 430435 -3077 283106 81057 159640
17289 159640 96887 -46538 -166144 178219 126868 393726 66227 302007 355273 267887 155105
17278 155105 407071 472535 -167963 214904 315107 -208891 113541 17122 466316 122723
17267 -7165 -11273 184038 197998 71893 176844 63390 -69839 337453 460641 6319 48173
17256 48173 96147 454891 -83479 57003 -11034 368040 -188895 241492 82043 113688 -101569
17244 237833 461359 245145 84406 153935 99819 -6899 526451 221539 128240 176829 316436
17233 316436 9938 471974 238744 374073 190411 154882 339893 144732 260762 6648
17222 362447 175275 150330 81392 453384 446230 281125 432148 318602 163011 41217
17211 57375 -100834 177639 587944 355259 257223 189899 288994 26092 196067 -57113 69596
17199 113342 168097 223673 32991 -221475 120589 395039 2096 262768 352103 6851 49699
17188 49699 378070 348107 189407 344929 146265 256535 411866 279904 31839 70870
17178 70870 82706 224557 353655 -1729 410630 307291 432336 255964 589093 416135
17168 416135 285073 195443 248963 53789 100250 128799 -45917 164519 240191 453573 285795
17157 285795 357118 259725 613094 2274 12952 155077 590612 176044 213923 140413 435815
17146 435815 317892 -9322 267622 254638 397076 177128 250436 201246 -46066 129553 451257
17135 451257 537619 347046 407293 157915 267089 366377 190094 386357 151834 278056
17125 278056 339828 337220 237885 275716 523658 459663 570390 385985 223771 63547 444174
17114 444174 135702 338144 352165 598738 377998 77123 412886 57944 122545 273195
17104 273195 435245 331463 -41950 596741 430678 236436 404966 345040 356379 229591
17094 229591 453998 432930 668983 517971 242538 333631 409678 386642 275585 186241
17084 186241 221571 277812 371039 440527 624049 706352 488601 262292 179063 351432 234972
17073 234972 465014 452815 43697 581989 301044 314949 641460 743569 468056 159053
17062 509373 217541 511053 611946 572405 483442 388145 609765 120941 453083 538904
17052 538904 342045 375956 549742 524602 240660 844021 410837 737002 472113 719006
17042 719006 710601 227854 460672 627017 350649 628362 537801 488023 575275 424808
17032 424808 841394 744828 506549 461864 630242 547532 499797 545886 618002 359118 641238
17021 641238 1037077 610679 642307 797483 641822 691933 370352 845812 521064 1047249
17011 1047249 679950 779092 790969 523073 470716 705389 622917 754756 859148 546596
17001 546596 701719 990654 713982 864307 805273 944723 701269 1108466 703982 995023
16991 995023 469128 846542 612184 845900 696931 682089 1046260 495916 640389 734340
16981 734340 635671 845123 435807 871127 692327 887442 992121 729492 961004 675729
16971 675729 811089 923184 673051 902434 926866 1074461 698641 976262 1154940 1238337
16961 1238337 932259 653648 1013366 981457 1030308 972534 1037635 1042866 1003938 871491 1034463
16950 1034463 1130269 999400 1039783 1369722 1059871 1263399 1289839 1290622 1379323 787769 1155929
16939 1155929 1364870 1044715 1036260 1235110 1228028 1345678 1385651 1454739 1349634 1207949
16929 1207949 1232293 1420477 1334638 1257281 1319687 764795 1528705 1644580 1298114 1560108
16919 1560108 1146550 1313589 1349824 1598489 1555689 1325421 1434786 1484117 1654266 1575630
16909 1575630 1802702 1619211 1400946 1711570 1757868 1481933 1787310 1534486 1778569 1525615
16899 1525615 1644556 1523479 1828757 1991497 2375784 1891340 1726436 1924523 1958988 1821349
16889 1821349 2143993 1797433 2119417 2064668 1945393 2093267 1991362 1984435 2142674 2205912
16879 2205912 1965976 2118562 2187859 2550750 2780398 2527144 2410556 2447721 2406245 2489793
16869 2489793 2615772 2414488 2660080 2552052 2673258 2667181 2813258 2650462 2618633 3203942
16859 3203942 2685719 2829272 3086200 2791059 2936109 3282229 3035250 3337753 3367260 3193207
16849 3193207 3300391 3341542 3520609 3293142 3647032 3516093 3527807 3623703 3673247 3572744
16839 3572744 3663465 3685852 3968223 4179035 3722966 4134968 4207340 4326941 4716911 4470926
16829 4470926 4945968 4692890 4632680 5021516 5235958 5226227 5534549 5299829 5602741 5555320
16819 5555320 5372265 5842389 5637520 5898860 5667757 6196441 6172414 6573301 6437076 6640585
16809 6640585 6552596 6765312 7087820 7059180 7301144 7695363 7715287 8039540 8193448 8256094
16799 8256094 8324495 8490399 8823989 9211897 9581737 9579282 9922380 10058423 10461471 10451572
16789 10451572 11128850 10906560 11432201 11886860 11706107 12444562 12698561 13071745 13627326
16780 13627326 13917339 14300304 14573858 15441050 15653689 16045415 16579668 17282554 17684295
16771 17684295 18629861 18805438 19566598 20449425 21313226 21987425 22682142 23716921 24737870
16762 24737870 25667170 26499018 27644974 28637509 29617142 31740781 32321964 34043331 35225309
16753 35225309 37128823 39089200 40536504 42700570 44643024 46580593 49154688 51652756
16745 51652756 54238235 57112757 60127941 63345844 66801160 70305509 74123037 78366017
16737 78366017 82569169 87201699 91874279 97543847 102640352 108405120 114251768 120011818
16729 120011818 126017212 132506388 138545134 144725753 150491851 156133977 161367153 165925350
16721 165925350 169711567 173153917 174816242 176216797 176250031 175265307 173490773 170470096
16713 170470096 167090106 162645213 157917799 152495645 146602259 140472443 133790852 127686569
16705 127686569 121257748 115317662 109287276 103445274 97990856 92781836 87721582 82993274
16697 82993274 78317326 74042135 70465903 66385452 62906342 59720559 56496270 53472387
16689 53472387 51331588 48851519 46379074 44327302 42060478 40182134 38309225 36768854
16681 36768854 34718097 33313225 32032929 30455814 29055297 27983809 26935213 26087092
16673 26087092 24978416 24050749 23029983 22478360 21524216 20726406 19754030 19108083 18536506
16664 18536506 17746196 17080721 16721359 16309526 15567167 15102960 14472536 14559720 13815836
16655 13815836 13281526 12941750 12242415 12285017 11766115 11410901 11342110 11129535 10646901 10398962
16645 10398962 9830255 9932329 9374454 9424511 9157638 8908648 8084269 8395447 8193035
16636 8193035 7853637 7844950 7469041 7317254 7206204 7045905 6854617 6426671 6457443 6307366
16626 6307366 6122566 6266969 6174613 5842338 5976320 5649151 5813464 5293590 5563099 5254623
16616 5254623 5196355 4981331 4999995 4805358 4749543 4638205 4532515 4749300 4995267 4251626
16606 4251626 4440599 4056303 4180714 4068296 3676585 3971860 3795371 3634469 3717169 3672121
16596 3672121 3679894 3689954 3444395 3473957 3409337 3561541 3352167 3360287 3127989 3191204 3074261
16585 3074261 2823137 2826557 3286215 2677036 2644556 2554380 2999556 2549049 3011805 2468076
16575 2468076 2956251 2203437 2010647 2134881 2314165 2535856 2074553 2382498 2020761
16566 2020761 2640390 2204086 2469835 2058877 2318158 2013871 2159749 2121933 1989101 1906978
16556 1906978 1941706 1859937 2067349 1903265 2034994 1907470 1858873 1981309 1495949 1698106
16546 1698106 1494792 1832858 1632313 1661353 2203533 1753808 1411380 1419792 1771748 1433024
16536 1433024 1590168 1624588 1493635 1434861 1718226 1224722 1365820 1297099 1543526 1473975
16526 1473975 1333510 1398394 1516703 1394756 1455352 1612702 1152937 1219154 1482795 1215681
16516 1215681 1222532 943443 1314093 1369973 1130283 1080065 1036650 1197049 1117352 924079
16506 924079 941260 1003740 1021864 1113880 926287 1268892 1144352 790383 1064803 1179324
16496 1179324 838121 772696 1041019 467176 1077869 1151102 897229 904714 984294 1190338
16486 1190338 590572 779681 1159467 652010 1007181 809481 1127786 670780 892665
16477 892665 863647 633733 941933 815609 694666 892491 1112063 564832 821810 858264
16467 858264 886209 764691 993790 767923 856284 742225 891894 752356 626259 755636
16457 755636 761305 889160 845226 461246 922246 615151 780130 322908 609096 431283
16447 431283 472311 797193 552653 614801 754094 714057 824019 637518 481034 528687
16437 528687 673986 563915 596312 660218 450418 608154 617535 206549 563003 706006
16427 706006 726767 871388 419901 75708 597793 487230 266138 687273 471247 1024523
16417 1024523 287131 363230 505056 474208 551126 584643 735717 499975 545125 352110
16407 352110 422242 481432 632983 320816 90442 427860 461137 382556 740019 408360
16397 408360 232510 397617 178801 357260 589990 408242 322391 194092 270662 633448
16387 633448 346643 276635 406855 454915 186786 35974 262934 278395 573197 399965
16377 399965 536726 541923 53072 357753 477302 341899 355553 423367 171379 439722
16367 439722 597108 467438 273845 329417 239151 201404 512166 285583 346205 215828
16357 215828 307516 492219 696495 311944 147523 325123 463285 198788 318439 551266
16347 551266 589005 137460 9325 287902 370781 385748 134470 90738 459133 226538 345087
16336 345087 322017 168976 424847 360895 412791 167536 399539 231834 468496 166356
16325 237708 342425 320947 -1272 -85920 309860 470529 406178 105782 47110 103915 228844
16314 228844 188049 234602 31612 522207 314356 -147738 398069 262266 187303 238573
16304 238573 366831 335834 35889 48102 -9935 -2293 387389 425173 230795 -22551 -65523
16293 -65523 440596 -40398 408707 272808 423771 263593 491640 452500 126723 155745
16283 155745 171227 213875 99332 336422 167682 200669 239693 65501 340913 338153 13154
16271 23796 -105031 187506 234959 163709 131257 221593 -32952 173108 177640 132454 134983
16260 134983 220617 218975 152164 72470 306023 284122 381071 54611 204588 315315 1909
16248 143003 206740 145321 335224 193492 95690 58217 226804 225475 179870 -72118 -5801
16236 82678 -138201 180025 140512 -26674 65024 265504 28574 260640 -36247 71132 312527
16225 312527 -37741 240214 78422 12588 188823 394236 142052 42258 256024 -49019
16214 -58385 181477 241297 381352 231377 43054 -137711 80348 267623 249227 45490 194075
16203 194075 121037 252825 99651 -46450 -257512 323678 -46459 371558 178359 34465
16192 461501 30291 140148 -429713 302483 142503 -118500 212719 147509 351724 -69425
16181 100112 31835 -7377 310527 123308 42188 75218 111805 99955 105725 115179 182139 353049
16169 353049 -75294 96874 208582 -177 14427 -165644 34169 160095 103268 -357358 -193456
16158 -193456 229266 -171175 88775 120236 30195 -269868 -96559 -155232 -35538 -64392 -231387
16147 -231387 -254787 183204 206590 -22104 182603 184232 164873 -63353 -197995 -101470 146713
16135 71380 128352 -12816 131043 334093 145877 34025 8867 18787 95618 231735 -162866
16123 112583 -140649 87167 108841 143424 -395853 -152569 14545 28431 -166247 79456 6166
16111 251250 99049 77418 -80934 50188 188628 -190044 195506 296265 388532 407031 289400
16100 289400 171215 -387606 477875 51887 -203837 257884 141070 220269 -59924 -105764
16090 -105764 -200795 -238089 -124170 -253671 60897 -48775 45379 -77094 73679 -142128 -74515
16079 -74515 142007 55862 -95891 -141408 244 182210 180554 -24010 -215469 -191842 94181 157181
16067 157181 100374 -105758 147188 105800 -152155 -8535 -16509 -186430 118719 159684 265538
16056 265538 81690 8941 73265 -7302 -159620 -71906 -117591 60407 62794 129169 -121195 153490
16043 -31241 148958 -6338 -194608 -244270 -391336 -112777 252075 54064 -438937 -98804 325734
16031 171937 310653 -192126 -244797 204689 -9611 145872 184914 204151 -108285 108860
16020 32724 -35859 145969 -100041 -220431 -61580 -175654 -386337 127258 288915 189838
16010 189838 44735 -244931 -251454 153535 -133765 -124998 -96609 151371 21119 -32397 67629
15998 25303 -277701 211075 -200216 -178407 -112331 -180971 425772 -291625 -41119 322091
15987 -172738 108571 -393498 -21619 175998 175245 340619 383629 407353 264323 317099 63061
15975 184924 -175962 37396 -150753 -348095 -2448 30833 123425 83660 106364 56683 238955
15964 238955 -126423 185652 -25761 205563 -103637 -378206 -267969 134414 137929 235905
15954 235905 336897 381379 -245570 -233112 -298163 133862 174185 94668 59402 -179000 -120343
15943 -120343 -60057 116574 267100 -51825 -107677 293353 -15957 -257714 133541 -65103
15932 -79034 -327582 -35139 193968 111413 -85902 29671 280154 -185135 -390189 -122329
15921 -191924 45583 -64984 257142 3363 -116710 -357072 -267596 -71235 -36776 -345246 -101789
15909 -37757 -23613 -128251 11944 -181852 -96610 236325 -352906 -35631 -46417 -250460 -281668
15898 -281668 110329 -2063 -107344 -463387 82950 -224357 -270360 422888 50223 89960 -30447
15886 188914 -135732 42323 55368 -9991 -236639 -65404 217061 119235 -344506 -231524 -272143
15875 -272143 199470 -9349 -43036 116553 21829 -32917 -266320 -143126 228736 84316 -532208
15863 -87657 -167665 -1363 -210927 -31588 172210 200773 -151327 63759 142935 -207480 -180258
15852 -180258 113731 -126561 -94299 205188 78460 -135371 -129264 47270 -308830 138386
15841 20719 -352489 -36252 -32120 -50570 -80718 -78244 -359051 67249 -255751 -144296 -17043
15829 -296933 48780 -213394 -330871 -175692 -327659 -293485 -49113 88487 26938 -25577 -29445
15818 -29445 30883 207765 80506 77316 -94910 101064 -311412 -359588 293529 101798 -8487
15806 54178 -110767 -3667 96201 268587 147849 34487 -380661 61244 -207106 -211710 -21422
15794 90948 -134264 42492 30555 -328544 -114024 -308703 -162571 -3737 18685 257172 93329
15782 -162059 55685 -170913 -276419 -426263 -226034 -201963 -230358 154580 3997 -195994
15771 89784 -212325 49272 -458659 -227716 -17092 86549 132240 167849 -146398 -121 -142524
15760 -142524 5637 -212606 82392 -204002 -44142 646892 -99830 276538 239927 64105 -27755
15748 -55813 -237011 -166315 222907 20585 55667 -49357 -369286 99231 30527 17910 -19573
15736 -26395 133813 -36859 22994 -392891 132437 -36545 56703 -164063 278795 -163821
15725 -299981 214080 -68570 -2883 -99347 -108105 -429638 -165117 78382 373885 -120998 -44928
15713 113379 -60466 -107401 -402017 132920 -229235 76989 302188 241524 9666 -29543 40288
15701 -321786 163698 -30355 61946 -320167 -115410 -102567 36484 -213696 -300198 61651 95474
15690 95474 54728 127558 93898 -95554 -4623 4714 -163036 161477 -197110 -147702 -3374 -153638
15678 -153638 130422 130342 -23248 -142801 249306 208870 -101985 18389 59767 -99715 52083
15666 233912 -87887 217615 -144715 118441 -34665 179746 -412975 366963 -12128 68911
15655 -91295 -234243 -153883 319012 -406556 -28688 104656 22176 222527 -331581 -77379
15644 12317 -220888 218384 -83258 155117 -87155 6960 170607 213636 149304 -98360 -28215
15632 46830 -28 285840 85694 -239458 -114593 -262489 239622 247536 -238573 203330 504351
15621 504351 160012 252796 -24575 48999 116738 -69429 -308411 -75906 -52847 -308650 200761
15609 -35122 25025 -114867 123460 63541 -43780 105140 173927 -8131 -160990 19613 -66979
15597 113844 65313 -293665 176098 20211 132140 -231132 -119363 267749 -18190 -46391
15587 -46391 -114132 74266 171475 -177791 -259080 73145 -135753 72087 38339 116376 157290
15576 157290 296582 84144 275517 150623 133906 190212 -107514 80948 -122842 -131888 80391
15564 -295450 -190752 106814 -207191 -267342 -163709 -90948 -76299 68824 -30335 92737 -86539
15552 64126 -19233 92642 -280220 97874 -333812 -13922 61543 -438649 -143552 143367 100928
15541 100928 -188073 -46178 -139774 -33205 -48490 -107931 107334 -31142 5355 13717 -440781
15529 -204883 207783 81988 -106223 107871 -127812 -81467 -421121 250525 17917 103273
15519 103273 90016 122275 -199423 -207707 -214188 438025 41112 -80528 221059 50173 108850
15508 108850 35998 53222 -119065 -85509 309652 -323885 360020 -49936 98058 -26458 -291241
15497 -291241 -182431 -48656 -17981 73350 -251458 84508 -77918 -155857 -235674 -36844 70882
15485 -280495 33261 80769 -319962 91628 54677 -418263 40065 41908 -185083 -122853 95299
15473 121163 98631 127135 -387717 61119 -290355 13722 -156075 -165100 -121015 347497 345443
15462 345443 -111919 -7766 -40092 -182802 -429113 -165488 -66692 -132278 -146374 216370 48695
15450 415912 -102889 159683 -16072 -73239 -127843 -124031 1254 -100175 -70139 -93955 -293985
15439 -293985 98290 12070 211177 -211316 52459 164552 -227453 -18416 -56344 -82436 68797
15427 -40480 -109180 54991 5166 -248440 -143938 -349797 -12141 -37712 75117 -132185 -256843
15416 -256843 -119024 239354 -164057 -128488 47352 -89092 71884 -53149 259876 36767 19929
15405 19929 -42247 115026 135355 -55018 275827 -303895 265956 184658 -59286 -83675 -124395
15394 -124395 38384 -295641 41127 187632 -114711 -17546 -100998 -3472 137528 -102552 -50565
15382 -288456 -387371 -63439 163260 -47755 -47075 249305 -60824 -312 -53454 -73422 55135 179637
15370 179637 241277 65082 8262 -347500 69330 276902 198984 122935 -104677 -135912 500166
15358 -310089 -134266 373758 88378 -203367 -114436 44868 136243 -86383 113802 -51831 -261980
15347 -261980 -95043 -23773 162126 -38620 6741 -75488 -266122 -114005 -159298 -102684 -126867
15336 -126867 -117157 44893 168296 -4052 -108374 64870 282758 -68649 29232 163985 99728
15325 99728 201844 62017 3547 97128 91500 131086 152408 -157578 21691 235881 -304869
15313 270282 105064 21907 -161289 95769 31253 -128750 -85438 28804 83972 260708 87905
15301 -370831 -344357 -36267 33420 310750 -86269 -5950 30970 -370057 91876 137849 26591
15289 -26636 124293 114762 -147800 246438 -297011 37498 -58546 56502 -97045 84050 190502
15278 190502 237656 38594 118054 -129909 248526 -86268 53602 -22163 -173338 190207 267357
15267 267357 -171840 174316 38723 342937 -15902 96283 -106244 351129 272016 227487
15257 227487 148760 68821 233021 -132179 73140 36690 161985 265155 334660 1080377
15247 1080377 1427514 905471 1414676 1263942 547955 39117 225867 718694 24983 136782
15237 136782 195345 46432 281079 125906 -142048 39777 -15168 69823 -128937 99149 278575
15226 278575 145742 -181629 425497 136891 119437 -125080 140516 109669 -298267 263742
15215 251379 -27053 1873 181616 -120461 -80652 -289190 352363 22795 -190308 524463
15204 -11652 -19704 270731 23976 -45901 86180 39841 279634 -32028 223711 330779 193196
15193 193196 -241013 104749 261362 -107352 264061 167633 193865 76516 -84112 24653
15182 -4995 82282 -43236 104236 -126586 -64892 -57516 132048 125268 373094 -27940 -352406
15171 -352406 34668 171318 416041 150369 -35719 39796 279369 18891 -145626 -124652
15161 -124652 242953 3719 73753 308707 -95571 -207163 382516 -66528 -164001 -206143 109920
15149 -165133 310598 138356 13907 -6640 -112549 -15642 167438 250196 101368 319562
15139 319562 3836 -26029 139002 -64658 42270 259700 -64113 203126 47288 158591 113838
15128 113838 212414 -3260 117844 100337 21376 -212793 101615 167381 -6666 101305 -22327
15116 298213 269288 -278467 18408 11028 262149 198757 -336439 278424 39608 265282 -66235
15104 -259874 5558 256584 67282 -28733 450006 -25856 174910 -86473 274397 449634 29133
15092 150698 33500 247413 113119 -170951 96309 184005 -6839 20756 143283 -116455 126956
15080 11893 47002 20287 75029 103793 605115 70216 23982 292199 -125189 187776 543576
15069 543576 242707 -58453 -69985 72369 82509 321489 100651 292102 354098 -218979
15058 207648 314510 94750 33150 17018 442513 173622 119126 265147 -219643 45787
15047 293938 96513 117554 78135 59051 485445 179665 82392 394239 392497 162839 63247
15035 20946 229563 73928 -176269 -184124 57443 43112 127643 306686 185257 -71473 -248848
15024 -248848 511190 245404 -19062 -434144 445429 18425 -15414 200391 117314 -49886
15013 473076 -103380 113900 120352 463434 109694 235914 105576 504063 185587 119326
15003 119326 401886 131382 -13998 -61878 453014 147191 48858 287213 418813 -20978
14992 168432 177433 241732 504034 58555 35464 49142 543991 267190 320259 525388 -40150
14980 389697 349506 221511 92140 137468 193093 246495 267110 -4351 251265 376843 -40375
14968 175649 -36714 -52549 213668 403775 24052 396892 265970 526054 414029 313307
14958 313307 275620 134778 426265 209263 56865 288288 531678 535469 -17965 3837 175099
14947 175099 287544 177974 440281 219185 196420 835411 264733 102254 15381 165500
14937 165500 388060 287702 376710 245825 188829 52534 -206151 236047 208837 435250
14927 435250 -11555 213345 -48564 521682 192742 364231 445559 127574 81844 337557
14917 337557 -104928 381988 274310 117672 24299 596684 316572 450466 458324 418218
14907 418218 124885 329156 167824 633764 15145 150666 393844 447487 73335 116886
14897 116886 427220 509699 161784 610679 261773 444076 461022 105815 384200 382270
14887 382270 155625 234514 354120 213186 266277 26833 405650 154676 235693 403755
14877 403755 614582 146708 439685 381258 347054 472740 225617 520111 337352 155324
14866 370059 268077 192078 311571 579922 403536 265800 317519 464556 441773 651932
14856 651932 417902 561776 431507 426854 687583 383973 368815 226482 335311 324852
14846 324852 472949 437366 727063 158989 485866 262696 257006 260975 134327 375925
14836 375925 326584 229313 178320 158187 456149 674671 502492 583800 422472 435897 329871
14825 329871 238258 293065 413447 269429 457809 543241 237894 653257 554923 370249
14815 370249 142032 546331 587058 327413 650962 343636 581958 292208 331786 135662
14804 569845 374955 335567 375158 651753 331093 516238 773543 647252 607730 262631
14793 590959 356235 549679 425628 355690 363611 364769 561898 426478 370089 485368 510160
14782 510160 389549 530879 582315 377679 541449 127532 190575 544880 576974 458539
14772 458539 562060 738484 503603 458380 364823 531642 755304 15901 549646 628975
14762 628975 567131 930533 571262 523075 273059 642701 696573 690095 299640 632646
14752 632646 713806 649799 669447 701339 626393 812260 792317 640294 471510 416930 812139
14741 812139 424742 525662 712816 900309 578889 529088 667210 416793 877735 640822
14731 640822 585963 608326 733499 514882 712387 953485 655048 671619 596915 541111
14721 541111 885998 803196 635491 732860 424882 696141 574829 1088020 531992 708728
14711 708728 809192 849433 921221 772624 749042 771929 660660 902956 823554 916154 706544
14700 706544 771150 1023897 849053 672798 939481 1065642 807046 1128477 837626 666150
14690 666150 946336 795626 747487 751286 1032357 896290 954807 401008 880152 745113
14680 745113 720793 786170 961165 708173 959106 812736 786413 615724 874167 780263
14670 780263 921795 1087201 1023844 1357053 881263 1506669 875636 903475 742773 989818
14660 989818 621828 1304786 921456 977716 884501 1038068 1200248 1198790 1071326 818946
14650 818946 1089491 958313 963351 1094553 916016 1253699 1508040 1031685 1331005 1439871
14640 1439871 1123305 948014 1385089 1138587 1255686 1162601 1544987 1162722 898798 1177397
14630 1177397 1466180 1336616 1034428 1211291 1074954 1299124 1396521 1402612 1171117 1203139
14620 1203139 1408181 1266367 1202377 1305435 1574039 1206950 1289046 1314122 1397342 1368037
14610 1368037 1285732 1722536 1015976 1047566 1392426 1748084 1376629 1941425 1369864 1385043
14600 1385043 1464805 1607507 1463078 1858735 1523297 1372932 1387131 1578087 1644331 1638816
14590 1638816 1512378 1763400 1843812 1842680 1458878 2309486 1602991 1865986 1766242 1769121
14580 1769121 1799986 1836868 1914385 1818542 2140476 2259821 2015531 1799977 2127847 1982791
14570 1982791 2083852 2003585 2126530 2367106 2143829 2326456 2475504 2467779 2333551 2430946
14560 2430946 2663523 2916662 2589173 3004391 2798932 3318785 3489538 3784211 4004271
14551 4004271 4940901 6033774 8336657 12566657 20499795 37934485 38671644 23081047
14543 23081047 11475759 5682141 3311017 2293758 2058850 1953594 1661618 1779296
14535 1779296 1905288 1755420 1960400 2230377 1753990 2040531 1832233 2095260 2175792 2444544
14525 2444544 2283381 2168688 2275164 2202640 2404161 2650687 2377409 2191232 2650845 2207131
14515 2207131 2265452 2279407 2404504 2386799 2650399 2639402 2679269 2727369 2772006 2654060 2874691
14504 2874691 2562378 2646782 2725133 2703117 2909703 3020954 3098418 3112150 3297983 3011070
14494 3011070 3221214 2800175 3063314 3384923 3227830 3413799 3671034 3635991 3545927 3371283
14484 3371283 3458438 3392293 3646945 3606600 3730321 3568811 3597284 3703842 4039533 3750667
14474 3750667 3651092 3883296 4001432 4051291 3935878 4184615 4032740 4365367 4155836 4024266
14464 4024266 4486032 4391549 4564038 4527495 4707609 4708025 4654863 5055963 4678190 5086137
14454 5086137 4986301 5268472 5075564 4973859 4929523 5255753 5448302 5211958 5324423 5337040
14444 5337040 5864581 5589420 5812770 5655571 6058247 5878162 6159966 5885425 6183973
14435 6183973 6167424 6374577 6327895 6197637 6730254 6588332 7032440 6617146 7083691 7088938
14425 7088938 6937275 7149517 7246502 7593893 7682866 7379310 7709801 7917786 7924323 8295948
14415 8295948 8308535 8356605 8453609 8278407 8545546 8411804 8933888 9079858 8847639 9109130
14405 9109130 9485501 9585150 9327576 9883682 10005396 10324639 10116578 10552724 10928245 10901020
14395 10901020 11359279 11332888 11505798 11810392 12163843 12065921 12636388 12599730 12760596 12782377
14385 12782377 13007464 13470464 13464090 13983441 14141178 14465044 14299530 14782659 15238261 15400621
14375 15400621 15844729 16074363 16638408 16861612 16859882 17516523 18299411 18032239 18561734 18907461
14365 18907461 19272834 19550161 20050863 20600109 21189450 21361488 22014700 22299820 23051189
14356 23051189 23518749 23929005 24712101 25235624 25936075 26368632 26864301 27704610 28509688
14347 28509688 29153771 30119183 30836609 31299424 32609324 33111830 34152468 35147581 36079741
14338 36079741 37114426 38044961 39194123 40478959 41928667 42952048 44044708 45580319
14330 45580319 47137749 48432146 49992966 51668319 52958635 54824564 57141981 58998548
14322 58998548 61191127 63317321 65267315 67924210 70436734 73310355 75988895 79042161
14314 79042161 81768788 85474387 89019911 93176264 96923369 100689217 105193962 109804572
14306 109804572 114740454 120188136 125911741 131415191 138090784 144512309 151566136 158857766
14298 158857766 167114800 175318972 184245345 193773218 203613741 214507098 225306066 237251515
14290 237251515 249521321 262444626 275860770 289545239 303937906 318888571 333439770
14283 333439770 348717042 363451502 378234162 392675778 405985170 419214503 430952397
14276 430952397 441221128 449762276 454945484 455896243 455084145 453759207 451914239 447676822
14268 447676822 443165960 438568862 431239092 421347906 408723999 394804534 380174622
14261 380174622 364568684 348874346 333002043 317357127 301999059 287229234 273161396
14254 273161396 260042701 247032101 234373944 222817653 211776143 200827620 190951681
14247 190951681 181721994 172699297 164736307 156731857 149796586 142548481 136004726 129725363
14239 129725363 124436345 118808843 113990446 108832267 104183898 99423287 95637216 92019028
14231 92019028 88713666 85400999 81698045 78828655 75517435 72944146 70240728 67337585
14223 67337585 65172495 63018579 60679117 58947068 56998504 55040607 52990678 51385865
14215 51385865 49671151 48546673 47037473 45532582 44063304 42917120 41434257 40497725
14207 40497725 39652803 38641939 37408149 36349623 34978197 34074437 33474714 32797291 32232030
14198 32232030 30875636 30154738 29190013 28695453 28049247 27491600 26523479 25778260 25182029
14189 25182029 24756031 24469240 23529617 23040222 22663224 22233807 21555904 21046567 20447559
14180 20447559 20088890 19607370 19406118 19040179 18650402 18163806 18020551 17875730 17209377
14171 17209377 16860795 16796219 16287928 15877260 15809077 15280753 15062729 14783657 14798651 14413073
14161 14413073 14061451 13748541 13667309 13393670 13089229 12803777 12632791 12407826 12384382 12016323
14151 12016323 11574947 12090725 11451901 11606394 11111371 10902433 10863373 10992030 10206937
14142 10206937 10199078 10308684 10208434 9663597 9810111 9676662 9429178 9382741 9281596 8864559
14132 8864559 8949715 8411543 8551090 8765335 8798888 8664767 8071154 7977574 7911499 7629471
14122 7629471 8012749 7794580 7622775 7383559 7110763 7398826 7113982 7065027 6977371 6797933
14112 6797933 6680138 6912657 6614892 6522729 6703181 6541624 6512350 6346911 5877835 6464589
14102 6464589 5899465 5903809 6076955 5877794 5752477 5496358 5576695 5352984 5228075 5633317
14092 5633317 5280160 5272813 5343942 4953794 4919004 5282958 4988345 5281026 5039747 4619166
14082 4619166 4559079 4921008 4735024 4509278 4593622 4771502 4514361 4561595 4635143 4587845
14072 4587845 4332655 4175151 4264442 4031844 4214558 4091289 3986638 3973548 4235452 4128129
14062 4128129 3966832 4237791 3940031 3752999 3921239 3686087 3720560 3570739 3672660 3597569
14052 3597569 3705085 3209718 3856607 3633611 3523894 3344559 3245561 3454881 3442548 3360652
14042 3360652 3257374 3173951 3407784 3105564 3065790 3120230 3101287 2951078 3107305 2923890
14032 2923890 2803609 3263758 2942958 2870343 2987768 3249733 2625052 2866956 2957733 2713224
14022 2713224 2774587 2918132 2511538 2423234 2698613 2491877 2478974 2257533 2502368 2476850
14012 2476850 2486356 2528987 2558046 2385957 2127654 2109765 2363388 2379060 2162657 2183331 2295587
14001 2295587 2199498 2199885 2232927 2106138 2194273 2067602 2354224 2208727 2181745 2175577 2484587
13990 2484587 2983070 4458918 7618336 14060244 31256376 39491807 26244939 14276341
13982 14276341 8211278 5859752 4761371 3935189 3505715 3089206 2825633 2760245 2905795
13973 2905795 2761652 2630829 2494661 2454134 2645176 2301128 2450143 2441926 2119536 2152512
13963 2152512 2234180 2221727 1909770 2252402 2160725 2187079 1890522 2261938 2019655 2054670
13953 2054670 2135713 1814989 1810756 2091708 1753883 1671887 1844957 1688869 1854775 1948085
13943 1948085 1951367 1742337 1869126 1736208 1671314 1696665 1861807 1882278 1591672 1622601
13933 1622601 1351733 1614162 1924215 1781827 1454272 1659249 1282781 1655031 1364649
13924 1364649 1494714 1451803 1503179 1441015 1409692 1377745 1723560 1621600 1350444 1335239
13914 1335239 1494306 1575151 1614887 1360889 1245247 1573509 1520521 1426575 1856644 1556078
13904 1556078 1102045 1114516 1529705 1445146 1382456 1485110 1326972 1016159 1120185 1249943
13894 1249943 1405118 1145120 1558734 1446149 1230101 1115048 1202168 1253782 1282653 1080251
13884 1080251 1173636 998972 860666 1367061 1413418 1402810 1458326 1274034 909239 1190408
13874 1190408 1029119 1090477 859567 1164356 1132263 864296 1347986 758413 1064112 1319881
13864 1319881 1019878 1225415 1224820 1199860 853750 875576 1258024 1156119 1250985 1380387
13854 1380387 1409787 824089 1016770 1087321 1240364 922051 1001636 1082554 824460 997069
13844 997069 1312674 1105335 763914 844318 1047739 1279617 808525 1049023 917809 1215915
13834 1215915 960426 748664 822037 999997 689486 973242 931090 846703 898945 982691
13824 982691 715847 803156 981632 923845 632308 956123 739162 777101 771690 555863
13814 555863 912335 770286 640059 1196682 816565 495187 729321 658798 702592 1039231
13804 1039231 853278 379640 593946 793866 801245 945963 807294 908315 914230 845410
13794 845410 662422 1116166 381517 800966 659670 871029 1047451 476849 840940 834022
13784 834022 1214667 885328 382806 592674 793707 613686 735559 513204 728344 685761
13774 685761 828076 792296 686365 605356 623408 675708 556372 866446 775853 666295
13764 666295 725175 747203 809708 815433 816459 573419 444188 279724 806568 858750 399242
13752 687269 736429 510308 818337 179740 447649 796312 406172 715344 527553 579246
13742 579246 513509 648796 556971 531786 782661 352760 528836 530424 530362 930534 754695
13731 754695 613701 889644 462223 772439 688963 674950 972495 667010 903219 181567
13720 481174 607846 242099 594227 624120 390919 449648 471907 810035 549979 588314
13710 588314 413013 796869 739124 544840 736125 736800 744655 604812 491830 1008702 596975
13699 596975 740677 604738 619158 507984 943820 217482 508026 678231 279039 389444
13689 389444 447758 589714 439094 153066 621117 447016 531320 511195 159226 552604
13679 552604 251781 528717 639362 591165 395923 708582 467804 418704 416145 785426
13669 785426 443683 326780 414035 206663 468009 269770 287952 401670 329527 461583
13659 461583 779646 471930 637740 571430 802997 386343 352672 443162 365352 566090
13649 566090 523150 198733 410168 469272 516138 354147 602598 569159 542625 632004 101760
13637 886776 368858 708013 582390 63313 612130 455964 392513 605741 334019 390294
13627 390294 632606 234704 435127 124505 574565 463988 477754 573773 564338 556972 518913
13616 518913 667210 559601 432209 201035 110009 573002 378908 296693 589352 116865
13605 582675 180918 282980 633291 307397 478343 255401 622111 437567 321538 306370
13595 306370 279738 546319 419163 547596 438986 477028 416994 355254 661231 10215
13584 84716 60985 -6339 611113 174814 180049 265983 238056 398662 420931 622376 433472
13573 433472 429546 748860 561771 410020 65804 546805 485762 340690 498269 346641
13563 346641 432823 91231 305964 289983 574619 547776 -206404 221405 283268 555559
13553 555559 76133 183004 338543 608078 120984 184825 296509 308163 248387 281751
13543 281751 518162 434407 -59527 150258 285456 261418 52799 437856 270734 269248 212625
13532 212625 505302 390439 336267 213994 535303 489958 332202 -77031 59737 175533
13522 175533 210389 135823 265157 318008 82130 441848 284901 407281 187172 258612
13512 258612 196902 32600 188123 165923 283633 247780 512026 416412 77222 465982 216917
13500 282536 448191 176254 175403 386239 707192 232921 401521 287349 442208 518463
13490 518463 125006 276650 131651 520149 302285 152926 591230 109471 433330 81907
13479 179742 -5067 256945 6631 297381 179683 137368 117522 316423 240593 285754 231174
13468 231174 204917 51324 154914 366602 474915 519869 44961 432146 437483 305717 369990
13457 369990 450509 314367 140665 293186 238201 856028 125408 276711 251687 -43794
13446 75354 171952 222539 220809 79398 375537 567771 391104 99129 75025 -146362 324685
13434 148087 -130268 222161 339424 88327 119261 421394 191642 -11815 281514 434918
13424 434918 206179 188327 300079 503209 78195 111980 266491 538105 161082 63002
13413 322311 342214 333781 251441 344994 233550 257926 181849 203007 45902 -5767 57684 187462
13401 187462 298413 227964 236481 194619 482347 -6878 276566 -40096 320052 101115 86138
13390 86138 504177 258451 -258254 404434 -129453 131771 -20979 69628 483142 115793
13379 245090 362506 40133 241227 172130 139470 308101 252951 561915 -32917 540771
13368 333382 394843 20108 39340 261260 199938 199682 123946 -10017 89096 85711 -135991 162097
13355 395317 161282 -149062 193175 437284 127524 202012 399114 229514 162903 429155
13345 429155 234736 331643 -200495 25250 442658 490934 482823 30882 182880 309770 86557
13333 356503 92492 129418 -36069 316341 192225 282220 164040 438499 349105 -2780 125532
13321 259044 362231 348117 70506 -95134 384528 124757 236317 318452 134651 -19173
13310 67318 87571 245489 -42897 298691 271507 -175476 101604 89066 -62849 187628 13531
13298 201180 14053 181106 274413 -246115 131638 84560 157449 353470 113323 -147193
13287 95267 -171142 237483 45226 156264 408858 132584 34424 228037 285047 306099
13277 306099 160739 32346 358207 292311 254247 74314 36643 39920 125861 150933 269033
13266 269033 291634 241165 336613 44926 320412 166305 -180503 77993 208658 221868 -236892
13254 -53316 375444 53971 184597 310188 414022 -155917 364983 -461494 287288 364473
13244 364473 80526 239501 -57003 -16364 -30530 70155 240678 34343 16786 73093 180237
13233 180237 224091 291771 99962 78084 252406 77966 72024 333114 132915 -614 413690
13221 -93663 88365 16879 316140 40064 180386 -98384 88980 128343 80860 16784 -29099
13209 -180030 106616 276054 71749 612649 198321 -5140 132468 402681 129181 142613
13199 142613 -11378 101665 120500 66194 -97371 292788 234622 343033 428902 -49646 -113698
13188 -113698 51845 117416 276713 -156228 -116826 -170539 359766 112497 212075 27846 408485
13177 408485 287130 -15803 20980 -121334 183033 -105234 34359 -30250 275568 124884
13166 85428 7706 -75722 47166 -170572 -165061 -65145 206404 -265869 101774 126233 126994 22224
13153 348248 -5942 261621 153492 99964 81071 56262 16094 -96708 -110961 137635 -31113
13141 128160 310724 -39096 62226 -427076 -250921 -29178 -30803 333722 61614 -115481 133665
13129 44085 -148304 63055 -215577 20732 215867 -91138 -81788 122945 -60923 211516 129780
13118 129780 139663 136344 107358 256753 50228 -166256 -24662 -26311 -117438 109832 20513
13106 289863 360566 168557 314920 -167725 228230 20318 126445 78092 193191 81821
13095 305752 49035 -132905 297367 -110699 228083 8459 -107523 66921 114362 -124845
13084 -192085 99692 163432 -53506 -19924 -31488 36001 37436 261704 221677 -103178 235367
13072 179023 129068 94622 94295 7506 278640 35897 353585 -278301 359492 -58037 -136484
13061 -136484 360265 1175 81981 320518 5171 57247 364782 17432 -130989 196491 8051
13049 183310 -45503 -7166 147745 252629 306522 -62326 291452 210903 -168987 -61066 9821
13037 175068 -44360 -60238 29112 65051 239157 -13793 124820 18091 49057 -116555 7210
13025 207667 33292 352594 232188 45859 83076 490610 75319 150435 55559 442456 176066
13013 4176 329881 283213 254925 110306 294476 233527 -256108 417287 -53702 457046 332034
13002 332034 51963 -85986 15704 184225 -93316 -88417 -233728 68947 -64367 109241 -31735
12990 -122578 72717 12393 -37586 -133047 180560 -18862 -6231 42399 172624 143896 -47739
12978 97123 -82525 -34480 -69419 -38789 -148425 388368 56748 -283061 6769 -485816 71921
12966 75411 -35995 105711 111399 210194 70151 11898 66673 86052 144478 119837 72996 81710
12954 81710 102846 -57766 274523 126636 83182 120532 23096 -124461 303899 243248 135885
12943 135885 88695 293931 142880 10312 -10213 -121784 18682 114738 148663 117920 258948
12932 258948 10226 -154230 94390 56247 202507 48033 -152932 101372 207712 -14887
12921 104128 -214152 -48036 164864 173030 199301 77491 -121067 58615 113829 331258 -372218
12909 90307 -115397 154808 -261072 38526 300049 350965 -65277 -7909 -194431 -137109 41736
12897 -380589 205735 -117168 99075 -28674 -91145 67816 -166190 117297 -94860 -65934 -363437
12886 -363437 171707 -224922 43001 78237 -69605 87164 12424 45189 250729 4015 -115767
12874 92858 -189905 -93754 326923 50533 73562 22772 -302224 243477 255268 62153 170288
12863 170288 170512 -15758 311458 -145 36990 204778 -66777 -114723 35817 85251 -37864 -138904
12851 -138904 27889 -224902 -304595 48093 -31387 -351248 342367 56261 -35989 -193081 -107341
12840 -107341 245347 270292 226174 41890 18048 -95849 193373 68364 5267 116710 160110
12829 160110 153257 -122688 180466 81156 -49347 225633 -56673 91831 138268 -281369 -141725
12818 -141725 187640 -107433 76053 -171015 26793 476758 -268955 124845 -53946 -64839
12808 -64839 -130878 77403 134305 -160942 372375 -90698 -84023 -55681 -13098 -119069 515544
12796 100829 150410 -21787 -75627 -203366 1036 -24742 -61236 -20618 16359 -27485 -140064
12785 -140064 2303 200207 -103030 -212264 3703 272905 2252 -45194 80376 -91541 246628
12773 -129082 39345 142993 100918 -17549 -439234 236497 354022 -111032 123876 -165335
12762 -218639 60975 -219891 -66465 -23981 245284 -180366 232190 -332796 86675 103486
12752 103486 115637 -112283 193064 -85618 50505 -284160 -226854 -14087 82444 77551 239674
12741 239674 58999 -51394 -58909 139639 165668 440599 205594 -46240 303318 74376 172803
12730 172803 295230 230852 19650 295732 -126045 197772 294802 -18301 137760 -76395
12719 235965 -177089 -228740 -36049 -153543 54411 5507 -137150 160265 45735 321148 152906
12707 42118 148607 541672 294419 215290 319599 198990 125633 49754 121493 320835
12697 320835 88453 50577 160275 116257 -550100 6963 34799 235749 -286057 56830 -142533
12685 135422 263941 73567 -137079 49671 200913 148600 -5849 313751 128029 332547
12675 332547 -137882 -12291 214555 78109 -2488 23415 -107457 -194182 155700 -20578 249556
12663 44751 247633 291293 -213997 -61706 -88620 104445 437465 282123 351610 103233
12652 102236 138718 -64143 144424 101421 122093 -177714 54813 527848 -301315 86326 -60602
12640 90484 40027 2783 -356487 57228 152137 181035 136764 14546 212357 514604 138632
12628 161411 -198680 280593 244305 -71964 16136 34323 181828 69302 75063 188967 24211
12616 135056 31419 -128437 -120514 -59242 189661 -59220 -272669 -78900 218449 -52922 -92815
12605 -92815 75505 -95595 424465 243167 -35324 130210 17637 71837 293149 441056 194461
12593 3635 275840 -33838 215476 130177 41587 -15411 -324343 -26482 -39451 -215100 87353
12581 -183234 -359404 -234129 -147356 -19822 186927 101588 -168687 46476 202047 8437 -267127
12569 47253 155049 121181 126355 -58761 340367 139643 -19164 167287 -240662 38509 69112
12558 69112 151746 -32926 226967 282647 -82234 86125 -21156 91749 -17714 -17810 -70699 172434
12545 164781 87059 65626 -37549 283831 -33303 322861 -219854 138052 -20054 -125459
12535 -125459 -232068 94852 -397135 -130421 251015 8153 -334471 61168 147357 -104419
12524 -78081 178709 -239348 -181415 19982 -267808 -105791 -191820 263325 120340 -208642
12513 -24847 36031 182308 367792 156501 -133399 -85656 115271 -4361 80873 -79899 99465
12501 318984 -224524 266949 -20627 52510 -11947 102959 242120 278861 251869 186518 75477
12489 25364 -205926 162995 132966 -44667 35634 272009 383914 -122650 -3234 -104109 98172
12477 -208560 -321172 286160 26713 -151602 -28252 92912 90975 -55689 -44206 226376 -338454
12465 41674 -5679 -192723 -120656 20515 18327 -111754 -87780 -68744 83987 303150 67075
12453 139079 75776 67872 -50284 33552 49034 57494 149997 192182 37650 366491 -225789
12441 40837 -193422 129201 -22055 172357 202417 -3069 132816 -30488 8073 73660 53334
12430 53334 -165681 -128498 176268 181964 -105717 39088 -41636 -7855 74999 15663 -323867
12418 -198448 717 61677 240158 209617 234776 103201 -107272 -44700 -239343 24310 -92951
12406 -136591 -160000 97812 51623 174151 -32538 -22358 2599 26768 104371 195455 146584
12395 146584 -44602 -132621 226855 -100543 -19288 -30362 254290 -65576 -169668 63611 -2682
12383 -10782 -82825 -242365 -3896 -185969 -59381 -159056 44968 183043 58603 -150770 -69721
12371 -518317 73184 -41558 39809 -160574 69406 -146196 -28243 68965 -193463 -160165 -9296
12359 -160858 163481 208360 -37661 -253111 -32434 -106650 230023 -315192 71932 -249720
12348 -475760 -28558 299756 -5467 220580 245987 30210 204820 107621 -79898 213514 236028
12337 236028 69096 -85587 -138385 -9664 -64843 177015 271093 -140441 263244 161337 -65924
12325 -89000 77968 -131132 148658 -194010 233053 -162258 -210928 257400 87451 -37175
12314 298019 -371570 340858 230026 -69322 -78333 -290558 65122 241346 -322284 162573
12303 -135591 113435 -128460 -118367 205408 364641 22355 293 46404 -274512 214967 209495
12292 209495 104236 -36156 121377 184092 -65567 -109838 244868 26996 94068 -217142 8924
12280 -12867 -339242 93364 258007 -182263 -92971 194661 226015 238949 373442 126976
12269 128044 123697 440948 -14583 274236 -52296 51621 150545 -77435 87902 -250988 -24297
12257 311119 123552 -175340 243351 -148502 174075 223776 158623 -73534 -221251 287571
12246 -27859 297944 308537 27650 169544 85007 -705 21149 91329 204275 420458 97544
12234 113113 352338 122518 186886 205410 277491 218224 60398 129320 302306 287872 321733
12223 321733 196856 -27555 10654 254061 174635 -29805 93099 29317 85147 90938 84270
12212 84270 -252142 95806 331589 113097 -196141 179959 275242 494959 398751 216029
12202 216029 114043 229449 159454 35496 30573 110312 60524 302689 279668 321128 179582
12191 179582 375385 176254 354061 369292 -233792 231981 141284 93165 20317 351412
12181 351412 195229 72083 -146459 66218 -55671 305216 277642 187386 191938 66025 -166211
12169 74096 218910 171355 178212 182383 -165651 260725 93952 444893 311800 129764 -117869
12157 252660 78780 161301 303362 203841 338524 197142 -12565 83521 5161 245361 -138781
12145 -18648 -274563 -178542 98825 145683 -375092 210348 -29528 -280222 -118213 279723
12134 -22545 214633 53301 33117 276133 -41441 267408 -128955 125568 300646 20982
12123 -4965 -72780 -63109 -82084 -113921 -195183 -86330 -97468 77151 -183123 188937 -22920 -121741
12111 -121741 77080 9373 -66310 -254601 59058 306750 -330649 39367 55368 171044 -396569
12099 -121773 128451 196616 159998 209601 17433 54476 183646 -155346 -335310 251131
12088 203947 -94437 -60601 37400 95979 228530 -309397 18366 -191506 -28955 -25729 9873
12076 -161390 -181261 80768 46299 631874 1185820 1258393 564766 370994 244177 239010 -55063
12064 23277 145402 187435 208716 -268342 347401 216613 181664 359259 58849 231746
12054 231746 266080 -171847 117087 -147314 -288512 -200471 -247319 -104502 -160017 101093
12043 63588 209446 106211 -69647 -88472 -42954 -260057 -162667 6754 39040 -302952 -67462
12031 -138742 138193 -40965 125578 -203422 -142809 -395613 -204169 -199289 83453 76964 -110868
12019 229777 212952 62649 51761 -195545 176939 -132964 356462 -134760 241107 326867
12009 326867 110600 118106 -237886 99226 -84149 140468 -20313 136817 208174 -239170 -188417
11998 -188417 284590 272237 -57839 -2100 -302679 -5298 99113 -18082 85444 -95304 -389949
11987 -389949 72556 -290798 210347 -60720 40421 -92 234901 -124517 -50429 19493 -13337
11975 91352 224418 -58897 113680 118464 6041 -5242 34802 -181444 -223126 -42008 115398
11963 -42317 -183845 155979 82420 83883 -19573 57781 48206 153118 -247939 73828 132079
11952 132079 61567 229677 61319 43451 51223 -202308 27994 32757 168558 272738 246936
11941 246936 241997 -181075 -114217 -57463 198007 -102747 -156148 5528 150213 -257075 -256267
11930 -256267 39224 64743 -45987 315668 -11994 -117828 -120627 51242 -85102 139900 85057
11919 85057 -80298 101598 -272530 -164543 -42429 -22779 40980 198000 129439 52363 -81312
11907 -285281 -49370 23321 200764 -157992 -135114 -164617 170274 -153657 -10637 -223804
11897 -223804 207380 130408 -93895 -11294 262178 68074 -40073 -134993 309478 234376 162534
11886 162534 -47276 -72625 -178464 166308 -192666 154729 160464 -100519 197005 115478
11876 115478 -80184 47357 -344693 97594 -29014 -62468 41988 30804 277722 -49918 -515343
11865 -515343 -320221 199765 -144030 21138 -290868 -74798 -66657 -206125 -118813 15593 -134791
11853 31784 -137540 71749 28658 175111 -84741 -48732 -403106 221506 -22934 -145299 -55238
11841 -122085 -134287 -140404 -123674 -24988 123350 -240215 -16716 -2407 5829 27078 145426
11830 145426 49588 203967 70624 -143387 96348 47975 -181826 -406796 -386 -268672 -17726
11818 78556 -120386 -3669 -341153 1875 78015 145978 327318 44848 -36002 -499746 -296731
11807 -296731 -122801 97661 15170 247722 18138 4076 -113151 218938 -122990 -22730 -211496
11796 -211496 -378977 53307 136697 -75178 4085 175347 53257 -135394 -259178 208193 -198134
11784 247880 -293643 22302 313209 39024 53080 -97575 83120 -106932 190277 -15975 -65600
11773 -65600 51940 59074 17423 79259 108878 192227 23825 -156058 163119 2338 19935 -114130
11760 -203157 -141679 -72942 -12658 -55924 135182 235093 339233 128105 131159 298856 60384
11748 -296462 73505 -73422 10051 -158490 -279558 70745 132511 -71650 35174 -133429 121631
11736 367049 158023 194404 -83749 248959 -262129 184842 -297903 573809 184479 -37549
11725 198457 -47938 120900 163882 -438124 62807 55196 127254 -99140 10345 -12144 32847
11713 -63762 -91700 141697 -56587 57888 -241605 -488181 106755 28066 113407 235319 240105
11702 240105 -119398 -287267 -234280 251923 -45017 51985 -196431 -192771 268402 -81818 -384627
11691 -384627 -131816 -13296 -27930 195941 319603 11187 -37295 24018 -9194 -173108 -132594
11680 -132594 329204 -285478 55084 -96172 -39538 -11603 -253983 23013 -166372 103619
11669 -153607 190332 21067 100414 50894 478395 270531 -173793 47380 -82135 29518 25978
11658 25978 147062 90167 -232013 96559 113903 274709 494796 205148 -99939 -17561 -80851
11647 -80851 -30440 130135 -29644 -85876 -217142 147192 191399 -9307 13069 36424 87696
11636 87696 -180265 -141154 -52096 63412 -234308 24738 59240 -38856 116613 -91906 -147666
11625 -147666 6199 162693 258129 209698 -17493 -102326 20537 176253 -152543 -196030 -59080
11613 -23944 -57072 39256 -207520 79051 270844 -26910 149028 47483 22709 -250609 255436
11601 157077 282053 -28759 61421 -100976 78899 317223 111839 -301045 43443 -291764
11590 -450155 311350 -77720 -149308 234922 -83995 274003 145222 269242 -21432 210141
11579 -223630 84233 -114226 145732 80864 140442 175040 -11792 305579 350455 19431 -158788
11567 120149 -45358 32107 86087 152994 297759 -15420 -93390 30474 -203997 3978 84614
11556 84614 15146 238374 -177555 -7311 187981 -148559 379968 185912 163718 188120 173970
11545 173970 -134876 61453 65247 -31571 96866 343042 96450 108582 575317 307593 169746
11534 169746 -30882 249679 -170781 205149 217495 -82002 108566 47445 -55056 -6278 273906
11522 563 -142444 -206469 115388 186290 -154656 -205337 -161763 125467 -103553 382444 339728
11511 339728 317036 91839 140111 171327 -137626 119384 357360 76712 154457 -51507 -172843
11500 -172843 -343383 181246 -78506 245433 2754 5238 -89260 51381 117009 -110047 87890
11488 100155 192385 -261024 -2557 37450 282058 36769 -1501 42522 -14832 537574 329613
11477 329613 -113473 177131 217747 216538 148572 412087 247763 293837 360987 22348 102560
11466 102560 198132 -124692 114676 460085 153549 264568 149686 282241 -244028 99830
11455 -97002 28479 135805 161295 -47864 442822 -272524 340365 -31316 -126587 48103 82216
11444 82216 -230067 57531 -116480 165967 -362881 -81800 -204017 199258 -184986 69040
11433 8427 -111853 309282 177464 92421 -36107 -31342 138480 -142593 -349563 44747 108925
11422 108925 160684 -260 -268976 164096 -154856 241503 -199729 -61559 -27512 5526 111413
11411 111413 515639 -187804 -161725 291642 92606 -128901 178415 25637 190364 7125
11400 10368 138768 -113276 -67007 15986 67120 166337 -8569 4250 22409 -27239 -57995 14193
11387 17909 19012 -152913 2829 -88033 151795 -106010 157850 127603 90259 -101583 -37944
11375 -114360 -162591 -42571 7898 333959 -52057 201278 -146372 69209 331707 -380476 -93694
11363 211909 -92255 234861 113110 -26221 301386 -257795 -16396 237300 -176861 -20364
11352 -180967 158158 -40197 -125254 143904 80701 572 237992 5786 294320 434581 165253
11340 -136935 111930 -221932 -36397 -296285 -14428 -258302 -178381 -57961 -11006 203209
11329 54498 86660 -96808 59295 -250179 88711 143167 -75881 -225595 169552 -42597 -90778
11318 -90778 43930 -193912 12858 7823 107936 110500 -191967 -66289 -55386 31288 173562
11307 173562 -227745 67926 -247669 -98034 77726 -277198 33911 -40129 30085 65630 182617
11296 182617 193160 -325129 84313 -227864 -150857 -210323 -45191 -183481 -233219 189194 266265
11285 266265 176604 -22000 345843 -116743 -224125 -288873 -7696 -180648 -209865 -189504 -93076
11273 -223461 31140 -23029 -129723 -34124 -144320 358094 -298471 63609 -147768 321857
11262 -135813 188076 261031 -57625 -135625 -44836 3464 -74255 -78464 24971 339032 -50238
11250 -157202 11580 -333841 13490 -388096 -213604 -140332 -151030 114228 18882 130363
11240 130363 258325 -36148 -377482 -40761 -111299 243219 23911 -239885 283488 -304155
11229 -21792 -96146 -164629 -37714 79473 41846 -9926 148377 54069 182864 -21544 1498 17517
11217 17517 -107009 146254 81504 -369257 -327597 -295294 52315 -7744 -27831 307735 -118180
11205 -318658 202628 -384982 -175608 -55759 6120 -94800 -252718 43524 155057 -31172 49581
11193 -85759 -28797 -51264 150195 -135079 32584 -278593 170144 127028 -73081 -99454 -117698
11182 -117698 -109597 -398594 -330570 103956 -359115 -77799 -44823 53300 44331 -107638 -138755
11171 -138755 -273880 -15074 116898 -32441 61554 -189162 100972 -436436 67319 232852
11161 232852 49554 130303 -21093 -91109 -46852 237398 -70894 -1193 127935 20184 -18091
11149 -129619 -84336 -267004 -169222 106525 4697 210970 6629 207474 -41612 -138282 236577
11137 179175 -35212 2299 -170931 25879 238451 32920 118625 -47821 -166742 13402 -56144
11125 65814 55333 -364313 81189 8292 167183 102637 -211362 -132479 120390 -130269 -43428
11113 192283 42238 67948 172175 -58736 -85921 157997 79255 39405 44695 -104693 15801
11101 388098 -102447 332057 261506 365648 -86055 301583 399745 337300 161698 277825
11091 277825 -165243 25440 364639 23418 198658 331783 -47678 -117177 -178331 149538
11080 201908 377477 378143 175379 106396 -153496 243219 238446 451736 516193 412361 341499
11069 341499 214971 351979 345896 385416 282990 355882 698184 207325 378606 686632
11059 686632 585068 508758 562500 770678 727172 637836 758099 529205 957400 767822
11049 767822 711629 769128 573170 836079 667496 878576 752755 841643 574098 903978
11039 903978 781776 530603 825739 866497 830564 842327 1116752 632018 816802 514882
11029 514882 670611 805609 932067 886299 722539 800145 667367 786659 1001389 1050739
11019 1050739 675432 490929 924706 589009 853254 699826 289980 367794 387318 792016
11009 792016 705372 447384 744537 633771 450594 486003 469662 561710 675120 572201
10999 572201 472823 625668 660290 265861 570919 667613 647870 809213 852751 645310
10989 645310 879725 482774 689602 851159 1164955 1006776 1001327 1040073 1438761 1520153
10979 1520153 1151838 1230881 1642233 1840496 2128722 2305561 2708816 3006058 2951785 2900885
10969 2900885 3067980 3297726 2907150 2361151 2101488 1822726 1625285 1671418 1578262 1923027
10959 1923027 1972678 1537195 1631588 1811437 1889008 1540291 1386236 1344092 1241230 1165980
10949 1165980 943014 757689 675247 252284 532650 297066 536152 468365 182760 191577
10939 191577 281924 3567 482910 333120 373811 -154463 -65180 211135 -149808 90144 59319
10928 59319 148359 76969 71741 -348765 18058 -28424 37821 41776 198840 185000 -41124 -26545
10916 -26545 4486 266306 94578 90598 204940 217074 114097 147193 181219 314989 -107835
10904 259131 64215 -274274 -103648 42782 12996 -276855 116206 -89336 116314 -226236
10893 -78734 -4538 157104 -79425 -129379 -83832 -56895 -192496 -25802 -24585 -64405 278617
10881 47430 -125079 -97275 383972 209694 -56749 -105164 -106797 116357 -937 -399621 -160659
10869 67456 50977 -11543 -57606 12731 -101931 106892 -119747 159679 -149055 -153660 133739
10857 7788 56867 -43085 68521 111003 -106037 269462 -38608 224571 115670 252017 94982
10845 -15454 -251677 46649 -231558 -21257 -54038 -175675 231673 28908 155496 -3786 65886
10833 -64846 -233307 -51188 96937 -219226 -120757 -82608 -7080 -248289 109361 100181 -188141
10821 38771 -51801 60307 139003 14963 -113483 21331 31901 53163 -52767 107054 -15190
10809 -148602 -54346 -323003 52382 101084 -9592 265551 -72347 22161 128584 -180623 -150327
10798 -150327 25428 -351510 -8914 -52913 -75287 -282795 -23486 -69087 246274 -349184 135412
10786 -49136 165007 -301520 -113743 323676 -193818 -205984 -137222 181944 154666 -59158
10775 -72350 107899 -23433 111181 -201866 31378 95750 -157654 -19022 136617 -69449 256642
10763 -166180 270809 -289738 17187 97934 -67943 246094 -266931 56706 -155596 -166719
10753 -166719 266728 311464 -34475 340443 73747 -438640 -79227 238239 -133693 192055
10742 -113027 147825 261481 64200 -176857 -39872 -152698 -114992 -84108 16927 -195093
10731 15482 -53045 90072 101192 -183995 -373785 124120 198639 -293549 -168940 -230621 -175854
10720 -175854 -79072 -105870 -98695 -131653 -111952 27717 -28904 73036 -328491 -215998 -156170
10709 -156170 -394014 65712 -188386 27181 -70949 255633 -312457 -33004 -83367 229494
10698 28754 -580408 -185633 -213811 -238970 -44427 300538 180205 -191216 -208428 247131
10687 72990 101008 -45847 -177524 -346618 215305 -1414 -4120 -236933 65234 -13383 -252756
10676 -252756 -99994 -186356 162690 18323 -110351 210051 -39917 -66772 41324 -96799 -304874
10665 -304874 106907 40402 74451 -104962 -34028 37003 26812 226889 -162162 -225426 101263
10653 -71495 -75056 119030 49582 -96592 228943 182067 120395 237147 43175 21207 -10162
10641 -147789 -8765 -121067 80741 54494 73923 -159991 54765 -109918 -580333 -243999 104345
10629 34046 -19021 -276358 -3794 16731 54723 -152267 32334 -325786 186876 65370 -92077
10617 -3751 -197512 -102227 -325650 251715 -303787 -46509 -267272 70762 -60905 53273 -450640
10605 801 259357 -42518 57710 -329902 -148477 -204804 -170401 74015 -158437 36237 -168279
10593 -256792 137635 -89078 -170433 35185 -247314 59938 -111238 -125945 -52483 58380 -45989
10581 34407 108170 243747 -64034 -120799 -64583 -30401 192598 171827 51556 -7461 -1532 -192797
10569 -192797 -139115 143822 -432439 -12415 134650 104621 58413 -76167 6863 136979 -116345
10557 -87392 -307779 -204979 -65112 -36593 -13184 147478 -141915 -112629 -103170 155098 -25371
10545 -25449 -204685 112520 -67881 -6116 291297 -51673 -156755 27931 -85728 47720 -58988
10533 -127792 224053 104482 -323657 -122425 -37853 113738 -383147 33123 35903 -145704
10522 -66524 -240056 -111912 43535 -140522 -154423 -68659 -167584 63616 -132377 -163111 -17188
10510 3073 -58873 -191780 -100877 -32137 -309265 -267176 -354978 -35362 -49978 189386 -292847
10498 -216995 -22052 -212478 4756 -209115 9061 175423 166664 -190612 193247 131222 40037
10486 -317973 44405 -156994 207460 58290 437649 396655 848450 232831 388384 378330
10476 378330 108279 242138 42272 -131195 -86512 -33313 -32842 227544 -94495 -173458 -182932
10465 -182932 -187993 72631 48170 -152090 -89695 142642 54963 -46362 -13640 -241010 -337400
10454 -337400 296643 347900 -326007 -248519 -272990 -14604 -79578 319851 -208574 169528
10443 -211899 -122205 64374 3683 -155676 -108419 -116869 -157578 232147 -94880 127385 -383419
10431 38108 -16729 -79192 135728 307089 117907 83755 301217 -72001 -214847 141860
10420 -142104 80703 -89313 51146 -23422 210129 -151596 -283979 -189174 -177885 25859 176770
10409 176770 174735 -418679 -245506 -45296 172204 -23728 140085 103726 54048 -152225 112893
10397 -118756 259447 182407 -35216 106508 198708 141079 66286 250440 -59765 100368 375917
10386 375917 326339 -68775 235519 -42537 74839 -7519 135820 429795 193882 385379 186529
10374 376146 4184 410874 403580 406869 446094 474431 301579 348634 242406 285896 424193
10363 424193 251955 181601 381852 -6108 183695 237237 407627 216210 37963 49840 207468
10352 207468 448419 584157 478297 562902 586693 442476 360159 201230 181196 327174
10342 327174 664063 394981 98499 87258 457646 146547 157430 -68167 220769 -250306
10331 72192 44162 106 13689 196946 113003 7649 -47749 24604 200104 53488 369756 109322
10318 70052 115530 148920 190193 373313 154830 99233 146028 17560 -39527 8524 90450
10307 90450 75668 197934 225123 -127245 159231 224576 -35038 -67075 118050 47972 -173478
10295 -113539 193640 -149068 21506 -126269 13665 -27450 295851 -47220 -125687 92685 293661
10284 293661 -349797 56366 -5331 -202744 -213218 32931 227329 26285 -25933 52512 -222458
10272 -250944 -158619 -351572 61863 -11597 255734 315601 59339 -161756 -191040 -13512 80670
10260 180437 100903 482973 161646 257443 129284 -157545 36834 -73690 16578 70540 155719
10249 155719 -386240 -194894 -238594 37276 -17885 6404 -106930 138240 -132800 -92385 235100
10237 195116 -239100 -1086 -139913 -38770 30765 -302355 -9050 117729 39935 -188357 -105071
10226 -105071 -181993 -120916 -223012 43778 -13941 -180286 -47681 132900 205286 77302 237822
10215 237822 -18427 -201846 138968 71230 -188555 -57007 -340818 -9234 -16041 284737 -94294
10203 -257571 86647 -158945 72503 -164592 -27480 -251963 -17837 -42397 -221023 -102066
10192 -24137 -175712 -138828 -71923 -315698 -5038 35734 61844 -53630 -117890 -248667 -183990
10181 -183990 -271074 -199375 -47375 -177036 231615 -161475 181 172306 72877 -130071 -170676
10170 -170676 93166 -159491 3928 -33343 -281004 -224 204591 75384 -130289 66053 -206706
10158 54711 -146498 108476 -205936 92082 26675 -182747 121611 -84851 -66358 -50892 -129941
10147 -129941 -26368 135103 -51086 -163181 202810 417898 228447 -30862 -19090 -164546
10137 -164546 -58785 151149 -229830 -47546 -338450 10628 -268944 -128735 -147814 99043
10126 121194 -232733 -115131 350416 -72134 -61551 120156 78858 -157119 -27245 189507
10115 159669 -306513 240882 -347028 -66655 -240386 -27802 -108676 -17903 79215 -165407
10104 -441985 -282378 -30892 62343 66586 -90393 -18066 -91263 -116570 58622 -219591 72268
10092 234659 -199192 -119884 -25778 -84840 -358257 -17167 -24689 -111868 249278 -85728 -177145
10081 -177145 -76934 -59557 63637 191420 -136405 393314 -53836 -115974 164865 186702 -285993
10069 -13885 -71457 -76243 97475 -16526 -332053 -76535 102688 -66529 173131 -236561 -366308
10058 -366308 -429202 75541 -153882 -62324 -68751 -269819 -352950 -290822 -78706 -137626 -87504
10047 -87504 148950 -12440 -54813 72649 -185792 -131063 -161278 -115744 -242445 -37413 13709
10035 157321 -43268 -150061 197246 -145560 54689 46697 -168214 -192998 101236 -174465
10024 -247398 48385 -24158 166758 81516 -123137 9061 -20489 259953 -169614 -90121 31363
10012 9401 -104357 -104974 -119912 139602 -134355 151008 -254568 -294891 -279672 -163609 -22875
10000 87773 146741 -216293 -165650 286154 -210284 -267393 -167069 -169961 269593 -254648 40446
9988 -279249 -84209 34594 -180083 -14547 74612 -53281 57164 -119602 -39660 12175 111638
9977 111638 -210473 -13841 -67966 -173180 -41338 -117448 109006 -37147 -29299 100086 -107958
9965 323009 -405764 -243362 -251739 199001 -176105 -182891 -55443 -35477 167396 -153290 -213319
9954 -213319 64715 -50995 197859 298795 115141 -464126 -361329 -254251 330547 -149525
9943 -250228 -311134 263468 -83794 40906 -4259 -118857 24767 -236396 83744 -66506 -133442
9932 -133442 -123360 -67790 -285884 -132730 -31370 88769 -218943 301549 -43856 291806 -22447
9920 -174128 -169499 -176838 -235709 -8423 97871 -79708 -363166 -8919 -31946 -2424 80373 -55574
9907 -317576 42318 109724 -14808 182294 128276 -237496 -32746 -321631 9719 -107661 159238
9895 -305896 188590 -98311 -424343 -116667 -96669 241142 -219641 -83930 -86339 -108785 -105846
9884 -105846 -145725 -286618 -327217 341458 -13419 -167601 -77482 -81203 143634 -27548 -244655
9873 -244655 -116812 418295 149515 -401334 -11926 -561063 -208667 -79361 -78653 79474 147646
9862 147646 -101897 -80517 -384363 -49238 62009 322923 -317153 -15640 106647 -217894
9851 -21283 9556 201084 -324044 28584 -41340 -111255 -118699 -228054 -26531 -146067 56795
9839 115230 55621 -220754 -164788 -125819 13911 20015 -132526 238077 -96449 -206322 -62044
9827 -158770 -200701 -264394 -211990 173937 7464 -247655 -69769 296974 155922 -83251 -185428
9816 -185428 -229518 52373 -147223 -161233 140382 -53566 92332 -15286 39931 247473 136747
9805 136747 -246024 -47592 -316659 13045 274910 15935 -212994 -154795 -218111 133033 -139843
9793 24405 -89019 227307 228321 -36662 127328 -95825 81819 118188 240154 -51926 197630
9781 -293080 -26311 316850 -43159 128902 95680 -366272 175601 -20181 -100846 38713 193538
9770 193538 -235816 -211301 185288 -39795 -99035 -49705 -189287 -122903 -233905 179556 -16134
9758 -5833 17362 79810 73118 148453 -116961 -166180 55247 -421455 116629 122815 -236898 -189602
9746 -189602 -157393 -64810 -421641 65321 -55324 13105 68027 -15188 -163303 59178 224763
9735 224763 -216184 -96271 63833 136691 -289467 -362071 -143473 -138752 -166396 4169 168576
9724 168576 143885 -326942 -64446 440641 157512 -48827 46475 -119685 -40259 -285066 -118136
9712 -23173 -37731 -34043 -176246 -253782 -44579 79352 212712 -155022 -271189 -341471 405102
9700 25830 -316510 -82971 -264853 158360 -236435 -173631 -166468 39081 -223551 -253400 10079
9688 116769 -13084 202942 74172 -164457 57521 -131713 -408277 222305 16662 -171905
9677 -171442 106312 210189 -154726 187231 -43938 41820 -79539 17662 -80721 23748 -44441
9665 25124 -108666 -69302 -163659 -278724 238261 -210032 -53551 -172125 -84012 112955 -86682
9653 30112 2213 4429 95108 155895 43033 -230056 -106685 -28875 -16529 137991 416045
9642 416045 -153196 182725 30711 -136447 -184827 62783 56282 -112054 154729 245369 -149542
9630 -307090 137252 -262583 27275 -403204 -4655 99184 272866 372002 -5989 34423 -47193
9618 -223046 -219555 -71931 -31850 -15111 -64008 -247172 -54082 64077 -340605 -263083 -87358
9606 168661 -150529 72277 -126229 -138149 -52348 156973 77994 -194454 75532 -33516 57578
9594 -444357 -86847 48327 -84984 72874 158284 -386624 48124 -85015 189776 55226 -256423
9582 43639 -167239 96046 -406447 -46537 173270 -64715 -145137 73405 -184689 69396 36067
9571 36067 -164016 192472 -183409 -263388 45459 -117213 25683 -170361 131500 37733 -109208
9559 105471 -158852 -624890 -378772 -38930 -45587 -132646 -55450 192016 -196617 -219193 -57112
9547 -705648 63951 30599 345835 97746 -64487 -318100 -41033 -136355 -35907 99488 220330
9536 220330 80081 -332638 26509 280995 69795 41238 -132434 -206919 36745 -163754 -101116
9525 -101116 -138194 317711 -169342 104259 -74628 -184948 12029 -188370 -371501 -120468
9514 52630 -154259 -123449 -310051 -39315 132713 135638 387134 -144635 -62450 -242772 -4760
9502 -109805 -290156 -247494 399027 -133102 127102 -37211 -14396 -146950 -339092 152464
9491 229505 -253999 99095 1744 -25426 741 -142657 -198789 -47053 -160495 54581 -40020 -23723
9479 -23723 -169069 52854 -197364 98346 -171616 68501 -91348 -94133 238883 -209018 35850
9467 95761 -73035 119992 -1534 132140 -97460 48948 48243 -106620 -599051 354021 -217714
9455 207209 47369 -279342 99486 35600 60984 12196 -185217 -134107 -326370 -25742 -32562
9444 -32562 52123 -158593 -334539 -82807 118665 73933 -253974 61394 -138526 44861 -146379
9432 -332248 -49689 -29971 5008 -9663 408133 183388 22452 -116895 -33342 -84544 73808
9420 165342 115759 302076 7884 52981 -205271 -128393 -310208 124595 23066 -1894 -374404
9409 -374404 -83001 -25861 -222455 -328226 178487 -276114 -93759 69211 -254526 -168389 -254679
9398 -254679 -178750 -122395 63944 14893 237 -7722 -9071 255319 134541 104428 -153368 -94249
9386 -94249 -225445 -178585 -138737 48342 -18280 254104 -358088 -11500 -14041 -14703 -136066 148601
9373 32661 -11402 -45896 -12123 -270661 -32680 -121296 -172308 4457 -259820 -93682 -74119 203599
9360 85909 -99438 -244486 174424 -22753 -81460 56770 -116461 130596 -197978 -228438 -104679
9348 113260 -57424 -215002 -171029 -579320 71274 108450 -142387 -113367 13292 -4720 156070
9336 33842 -149418 -95940 -47596 -111652 -266551 149915 97734 -40552 -156063 45090 115608
9325 115608 180073 26429 -38466 -59462 -42097 108121 -47551 -22344 321064 249139 -174983
9313 -179058 -345758 -90467 44625 -180445 -395531 17957 -118848 286548 -309273 -174951
9303 -174951 34958 -12857 -240582 -353360 79805 132296 152551 -334638 -252156 -70283 -178777
9292 -178777 83160 -158756 116529 -220691 150795 -41557 214011 -292436 -127158 -291744
9282 -291744 21179 -84971 -113874 -84564 125520 63479 -194527 46938 -151884 -165007 54901
9270 171273 -277637 -184616 -312578 30930 -314652 51296 281404 -66468 -29109 -149875 174130
9258 -150893 -195673 -245463 -174432 127119 -62414 -82305 -80612 270018 -64120 60254 84106
9247 84106 -177209 -33124 159373 100526 -94796 37711 -305719 147595 92340 28994 -250638
9235 -266623 -218102 -216905 -444340 -335373 46569 -122237 395783 342552 -168442 -43914 -163356
9224 -163356 -277652 -258189 -63499 -239278 -72001 -182850 -151703 -410350 -296936 -92174 47314
9212 31073 -160896 222178 243059 79480 42772 -324078 170453 -150182 -112474 -167254 -66935
9200 375397 -354718 -233536 34616 -134386 -275909 121423 -204620 -326817 -30574 -229950
9190 -229950 -403882 73171 221305 -107940 96357 59756 -32912 -82393 -92753 7406 -100900
9178 8092 -60732 -156540 -237628 49320 38369 193060 -159741 -203839 82086 -90415 -116614 160198
9165 -425421 -43946 -234471 -101697 321476 -244657 38316 156501 -32682 25234 -182704
9154 107012 77993 85984 -47637 -175739 178153 11519 -186992 31575 76427 -251947 162628
9142 7041 49718 222582 -231017 -360232 110399 -203527 13882 -24576 -87505 -89674 -188741
9131 -188741 97575 188494 35439 -97440 189950 -203600 -87402 -146122 135038 105101 195398
9120 195398 -62874 60 -58617 -212153 46732 -110542 -58328 -166829 65207 -359486 121242
9108 -27054 -219552 342956 -351460 166193 169343 -271324 113758 165300 -9336 -44279 191225
9096 -65161 -92185 -6023 -295067 75881 -129075 -170336 -355320 -35425 -374027 13089 59063
9085 59063 -144335 -262869 -360481 -93665 -39802 14459 -245986 209817 -80267 -104703 -206568
9074 -206568 43301 -145656 -15858 -9703 -244647 -292648 43346 267932 -230353 103819 -113332
9062 -117516 127044 -47735 -54008 10800 20046 190576 -39296 -303763 76619 -323644 87094
9050 -109567 -234278 -81795 -215464 -51132 79779 -16205 -71889 -157055 27640 -45358 -10568
9038 -315086 176149 -58217 106023 -461434 -84838 -22705 156321 -187440 137515 -289867
9027 86523 -150987 -327467 -206059 -22048 -105459 -365629 82191 -213696 -28118 4668 54364
9016 54364 -53707 -116305 92456 173383 -202461 -240994 -250335 -340280 -144664 -56748 110593
9004 35210 248558 -639 -454037 60589 -46627 -182095 -7147 -166279 121076 8828 206995
8993 206995 -122145 -83572 -24863 -89020 62759 62880 -250332 -134672 105568 -160035 -211444
8982 -211444 105014 -127014 57024 -126633 123021 -154497 -34307 95989 -122215 -201690
8972 -201690 47876 28302 112468 -1069 -62988 -386921 80663 -42114 -88672 -272444 -37257
8960 -166715 -34896 148337 250592 193151 94918 -419273 85035 -37992 -109698 -249210 152713
8948 -20140 173901 83259 -150600 -171339 375851 -258345 -518033 -130562 35005 -2181 -219414
8937 -219414 -105562 -126949 177372 136163 443527 -188131 -349051 -282996 -100164 -141508
8927 -141508 82567 -125316 74447 420073 259670 104054 401348 51646 42386 -148927 -150514
8916 -150514 51917 -41181 182618 -225975 -119748 86852 -15112 -208655 13390 -139648 -29595
8904 15190 72369 140807 -68755 -127273 -130419 -83270 -108846 6969 123136 -194490 -324903 -298387
8892 -298387 -283248 -166966 41009 36427 -266768 -143297 -46245 263125 -127118 174012 -22422
8880 11442 -34909 -96424 295 -134182 211167 -91046 -120516 55106 -92475 -244240 -95057 19410
8867 -296545 -120184 8236 -32328 -50061 -15762 -147221 43172 172311 -62379 156956 84704
8856 84704 -272512 -116790 88085 -78691 -111595 -179092 -40669 -255701 200366 -182416 -142982
8845 -142982 -39455 -9090 66782 -94390 -206772 -576153 196256 -72630 220085 439483 -124282
8833 139256 371009 -141421 174855 -48651 -18443 -30795 27135 -6814 -32390 22216 -279341
8821 -52630 -274691 -334604 -391603 -79132 -174933 46877 -181576 65754 7758 -180963 -88697
8809 -45717 30574 160136 -8041 62521 -302058 -408106 108326 196346 4496 74905 125086
8798 125086 -40380 224137 70253 -157397 -196480 327801 -107576 -112546 79092 -138718 -45887
8786 -214209 -24140 -102642 -84837 -74486 56804 -301665 221253 99063 -226315 110514 -95515
8774 -160647 30781 233724 -33396 -192373 83543 -108023 -131863 -242179 -343078 -13087 137306
8762 -84242 -58680 95447 -343262 30946 100878 -43805 99188 -76878 128034 -193701 -112485
8751 -112485 -408348 224138 -315281 147249 9733 -43972 -74788 -137076 139043 -320837 -372797
8740 -372797 -52447 -393281 32396 127584 -67471 333655 138097 -42756 -132501 -169925 -82109
8728 -84641 -198573 -182453 -108709 -187650 -90244 279084 -295496 -177795 101618 10550 10767
8717 10767 159756 8372 -128904 -78315 126888 61496 -49741 139875 132332 4236 81887 -360710
8704 -13682 81416 7428 -278268 46607 82151 -293758 -137352 165366 -63559 -5101 172535
8692 -31077 -168911 -34972 50524 29989 82054 119616 -273654 -133100 147022 66868 -120699
8680 16748 -340204 -88389 -127189 334671 235929 -374802 -9661 251014 234177 -40682 -146732
8669 -146732 89252 -207677 -149282 4396 107417 177120 -386599 -144688 -224330 -497115 -219447
8657 39570 110962 -169390 99590 210070 -249028 -88924 -51933 -190453 3937 28417 48696
8646 48696 -108924 -291234 -16967 50006 -262854 49951 -88210 -129166 -426234 -675201 100714
8634 -528494 -152800 -104126 57331 -137113 -126292 -191027 -10599 -234066 55692 -107266 -13306
8622 29880 266686 97137 -193388 -44324 -94395 -55900 -177911 78608 249443 109673 57455
8611 57455 202 -231451 182113 -50115 -109748 387275 -99067 158442 -40771 -97886 -8396 -255127
8599 -255127 -85889 116978 -209528 -151607 69368 -21734 -167788 -131746 105892 59798 -84738
8587 -31615 -304911 -50081 18113 85332 39990 -153516 146368 -71530 140581 -148652 -10046
8575 -35926 -68798 -59918 165717 -148478 -25737 25716 -43471 -151782 -68193 -406609 -272498
8564 -272498 -100858 -167621 -164965 34460 -252346 -74393 106158 -304907 31010 -16896 117022
8552 -423168 -17352 101251 -82548 -69019 -109343 -4669 -109158 -110241 -11415 -184352 107187
8540 -98860 133762 -141080 -181746 -61840 -99476 -132102 -30218 -115067 141765 -26717 -91119
8529 -91119 157325 -147407 -188530 136373 -150898 -210623 -291693 -295337 143227 -54855 -374780
8518 -374780 -253181 186983 -1400 105967 237356 -424063 -27791 226325 -333356 -157919
8507 -3429 233716 193050 -120379 -56617 16568 -211432 -254113 200171 -93509 -467554 205375
8495 -289795 30777 -179386 37734 454 148107 -180269 190353 -223386 72470 -49385 81016
8483 -41534 51836 -132412 -46715 -165166 65238 68720 -271148 -161579 35420 -112808 321680
8471 78070 -356165 254892 44276 -1149 68318 78519 -182603 -401899 -93692 -223862 53402
8459 -36223 129924 -288680 -254459 -188793 -482001 -88547 68255 -132346 2454 217154 20481
8447 122989 123344 37791 -91673 -59643 225645 -124851 23515 -144268 34750 -49482 -157308
8436 -157308 -109448 -240836 -449202 6463 -22686 -139815 673374 87882 70158 25334 -384673
8424 -226074 103816 -88541 -169122 228407 329307 -38735 -64912 -70065 287532 391085 -284073
8412 114474 -237842 -198560 43640 -3033 198883 -68816 222347 74525 231645 52238 98392
8401 98392 -241557 132008 90148 129923 69944 127207 -146486 -297276 -45725 -131612 36418
8389 -69286 253154 -19504 -322773 64475 -99894 -2167 -200244 -12378 -320049 113637 97375
8378 97375 -32801 44147 -66706 -345939 -207761 -48393 -146182 204510 11797 -479129 -5506
8366 78264 -371029 48031 259620 -158136 -78763 -162223 -55793 -5066 247583 -79721 -68261
8355 -68261 -315730 -92253 211201 -112544 -151142 12602 166869 -292847 -44544 135974 -267562
8343 72144 94676 146450 -19466 -187820 -126131 105517 -45332 118707 -70139 85007 58883
8332 58883 -212544 -149435 -95948 170170 -49754 29068 -16896 -18726 73147 -234365 105340
8320 -134728 139240 -67360 -627911 5317 181952 39107 -257129 -69267 -307355 -48755 74540
8308 -124759 -142326 -301176 -7769 -57991 -68946 -59398 16386 -110084 -131087 26633 125019 -203422
8295 -228215 65911 -48361 272443 215533 -246934 92374 51659 116603 -102643 -188660 -106763
8284 -106763 7071 83459 198734 -196442 -340096 -49322 -79956 -90522 24004 -101699 -11481
8272 -257412 -169718 -233415 -87613 -46537 -62727 -195584 -2885 -145869 215933 106233 -60406
8260 -54060 61833 -164885 -243460 -297281 -73992 179186 175293 -17806 -159986 -43240 35412
8248 -9976 -152799 -196728 -289492 14370 -31145 90448 -46151 -181544 4803 39664 -189282 -256673
8236 -256673 -371802 -20656 27 -132742 139421 96931 -96927 -244277 -131772 -18027 -284690
8225 -284690 -104282 238457 101023 -239094 -131554 -20465 -36964 19692 122387 46822
8214 50887 212878 183 35622 -65760 -52182 -108762 -171913 -418683 -54908 -373932 -74963 -175130
8202 -175130 -102469 -73156 -31776 -85287 6928 189895 -36056 29298 -46201 -187572 -114853
8191 -114853 104629 42540 122361 -237224 -105400 181474 7563 262379 109337 -132594
8180 58739 -87982 260499 -241730 -237620 2177 283464 -48900 120746 -267500 177583 -166315
8168 -144876 139156 -32698 -34366 -201997 -158687 225883 31084 37547 54708 226054 1933
8156 170482 -96311 107218 35140 -200351 314964 -117655 158777 -55401 33862 31504 -248862
8144 -99525 -517238 -2858 -7798 30614 -146190 308793 163536 -183925 -36463 55699 5225
8132 42293 -396107 -183458 -297947 -194245 -130162 -36473 26657 -23093 -149583 21955 -102710
8120 71762 -330925 -201020 -274744 80244 2083 -153501 37855 -94376 -202792 325952 189660
8109 189660 -127224 -79717 163147 -90690 -90100 -2738 26939 -154280 71667 156729 -313092
8097 81585 -239205 -12027 -172129 -121777 -270323 -132935 270935 -256699 57001 -202995
8086 96738 255094 88788 -54170 70352 -45864 69278 239572 59039 -230728 236279 153474
8075 153474 -172772 64520 -205292 206691 -95232 -149561 -63538 -52259 1557 -33932 -273129
8064 -273129 -66173 -89164 17248 -71187 247701 -16026 -317198 142934 -142730 -167278 -75640
8052 26609 -29187 -285311 -303689 44772 305372 -182688 -128434 63436 -172732 -75258 -334869
8041 -334869 -139263 90793 169624 -76892 -61045 32294 230245 -72906 135304 249965 -175697
8029 36929 72710 -34735 161435 -23592 -8135 -118608 8497 335335 -117835 -73418 -250524
8018 -250524 -89700 -79918 -124327 24725 -27408 -51443 142628 -253329 -244005 -212551 -267806 -208697
8006 -208697 41499 -41852 -23483 -314632 -60797 -127682 250984 77725 133662 218841 -263497
7994 139445 187477 -141702 -159099 -38973 30335 -72949 245704 171010 130642 -253969 -24231
7982 -6960 128953 205733 -64549 -97394 -248494 41356 -238902 -206801 -64521 -435371 -102882
7970 21908 -305228 -64325 -2692 -157388 141518 -153732 229057 66711 -182246 -267597 -332463
7959 -332463 -5003 146088 34575 150577 -116013 -181673 -11995 -230049 29317 -85591 -67107
7948 -67107 26275 -362339 -286717 52014 -4482 -98926 -230354 -180568 -154032 393833 135271
7936 -153075 -190726 22494 -154188 -149214 -136709 -335506 96209 -1996 192842 -59167 -60640 142582
7923 22753 -33040 -69274 -67055 -14159 -68914 -121645 -207811 46083 -144855 169238 155616 178803
7911 178803 175657 -354605 150969 -272615 76551 -152616 309126 45340 -84928 -210061 -295912
7900 -295912 -37771 104876 -312634 -99907 227317 -228826 -4937 250333 -63022 -139861 -11339
7888 -188542 -22005 190551 77267 -52994 -18164 30783 -269625 -177654 -376788 -406276 -25121
7876 -226690 36383 216534 71174 -122725 76247 -281185 -182787 15977 5249 -280177 21538
7864 98728 -286127 56213 138284 -278467 -218282 -192705 -194128 -7523 -106358 15176 30085 -7650
7851 2373 -46517 156337 158019 -77478 171487 4630 -110494 42048 -112939 52598 -216542
7839 -209354 202939 -11178 151127 138880 -118475 -270463 -162072 59596 14191 191819
7829 191819 86855 296650 -53731 -86879 120657 -230670 40836 -3207 11169 163302 -202307
7817 58183 -77911 -76523 80662 145917 -216585 -171652 -154627 -50821 15310 -124597 -47659 379885
7804 -103789 -119101 68850 -111761 -150773 115639 -85706 -17797 -97384 -139782 299116 156741
7793 156741 121601 100724 78170 -16135 -52418 128884 -49362 -148009 -158228 -89501 -202240
7782 -202240 -186356 71220 -123187 173648 124242 -95365 150526 372468 -225144 -1090 224163
7770 78680 -57304 28093 -82095 109162 204820 -172666 211103 -123306 -337250 27517 -195381
7758 -108461 -30144 -47245 338532 117072 39540 -224097 143604 127999 -62065 -83922 -139693
7747 -139693 197939 186220 -322585 -30709 -27244 -416446 109281 23351 -253414 -267140 -208425
7736 -208425 -7649 -383255 -59733 296812 41780 166449 38403 -17336 -190610 -242051 -209356
7725 -209356 -72916 -51359 22651 -44263 -124373 -465325 -206323 -53163 -88652 239099 -63824
7713 -349800 10506 153358 -29557 -97677 116445 -144773 345914 -421463 -221924 -212796 25527
7701 -168557 -292735 77897 -21140 -217784 23413 -30915 -208373 -75157 42488 110401 185865
7690 185865 -26288 -79131 -7464 -230908 274043 28301 -201863 -261321 -192552 123674 -32383
7678 -84669 13314 -146508 -70530 -26879 26654 66126 45861 -16531 92765 111318 -147912
7666 95115 -254945 -221112 -522727 -139845 -94799 -24040 -238731 135046 -40817 293208 -119575
7654 293216 -37078 -94665 -236382 -120696 177237 -241363 -209041 29036 76766 -225189 -202613
7643 -202613 222728 -111588 -109935 105538 -251538 133216 -241208 17445 -79819 -5486 -48269
7632 -48269 -71269 61144 71942 -90521 114329 -87714 -64245 -2330 -30653 89639 62530 -83112
7619 -172388 103567 -75792 -31521 -22146 32010 -218541 -38429 116072 -138964 -82039 -100448
7608 -100448 20558 174323 238746 -138056 -95425 -93449 -249899 -64502 19125 398281 -234112
7596 58135 -446238 228724 -112473 199860 -113347 52777 55977 -205454 -163606 116256 -191296
7584 67702 -278501 -76046 -151036 -238482 190080 14297 108882 -460095 -265034 -77676 -221951
7573 -221951 255074 -224405 -66248 -496634 -28550 108953 -69240 -36258 49710 -105221 301135
7561 940 -307153 -13660 -203099 -63439 193668 -44414 330359 -53021 -20915 -117086 -196379
7550 -196379 -27672 136173 -114481 140664 -122201 -302466 -69197 -293959 -51519 -148070
7540 -148070 96842 -189860 -59269 -216262 188356 46121 -2445 -167748 -16791 23690 -236779
7528 -299015 -123705 -287184 163334 45988 -172791 -114160 2783 -51588 -152516 13434 157310
7517 157310 -77605 155376 189751 -63820 -71654 77620 -39530 -70765 -256215 104074 78777
7506 78777 -120560 -200458 -16082 -65621 -162683 2341 -156731 -316116 -137748 -334376 101535
7494 140696 160627 -15717 -244136 -9867 -148147 -307854 -38248 -135386 42429 63947 -389546
7482 -40566 13924 82494 -154047 119181 -31781 149259 -24478 -89350 -217584 50267 165720
7471 165720 185476 -131072 -20655 -235118 149648 683110 -362175 -213094 56047 -32417
7460 -141032 -66398 -269025 112803 79932 93346 -311676 -144394 192444 -101901 -160236
7450 -160236 -185948 30915 -107481 -211235 -337472 19170 76504 28631 20477 164609 -44188
7438 47046 -229780 -4832 54243 -4286 107188 243258 50145 -203683 -72023 47499 -227144
7426 -185172 100656 -180690 113747 357820 106819 -332933 -85196 -16070 -228376 -150366
7416 -150366 325567 220415 -31573 -80330 158891 -37372 -7951 238210 124709 -65975 69347
7404 -125584 -88855 241212 -76837 120677 38591 -196640 -153954 164523 -20603 303899 204624
7393 204624 343986 -61736 -266411 9343 -117695 -14989 186711 158297 9907 -39610 -348988
7382 -348988 99277 162939 -111742 -235455 95618 -152791 251026 -229269 189863 -105783
7371 34428 -93487 -61219 6698 36602 -169176 133791 10826 175474 -453593 -181723 171069
7359 149192 196883 -156557 -154867 -54952 8533 -354305 -40297 -317347 -39862 -301874 -109238
7347 63536 -204546 -333909 -56305 -188922 352642 -217013 -156908 124593 -82024 -198172
7337 -198172 -113176 47668 -74057 -475117 -156048 -198259 -352139 -181139 170896 -12477 -81938
7326 -81938 -29629 -120771 60571 -145852 -197245 160143 -93794 194131 -179957 91740 -117343
7314 -223204 -27719 202636 142217 -319140 -301325 232006 122081 -289029 -221486 -79814 158008
7302 -26556 -5470 225507 -13674 -213336 24176 37231 205849 -239991 -12935 -57052 -26967
7290 -73054 9481 -190347 -6094 -233527 -13819 345156 -200807 64335 327577 -298798 -132181
7278 -86528 212128 -291440 189717 -413289 -96723 227171 79961 -151722 141612 -294470
7267 30495 -107210 27738 -72424 -10565 -251464 37524 22894 -20527 -48148 -177169 221059
7255 -234399 -16247 24949 -15535 264396 -181161 -85642 18189 -90642 133550 -264960 73732
7243 -207238 178026 -153402 -45507 -256588 -113916 248383 -167084 378393 -5313 38476
7232 105179 245069 -86076 87967 -206680 -21638 131881 58885 259449 -236535 -23681 -299404
7221 -299404 -123908 131472 213693 -145701 105448 -108465 187494 -68269 11915 -81006
7210 -242000 115406 -102042 -124526 -123457 -162482 -60634 -39297 -102848 6296 -5929 -120423 -109655
7198 -109655 -100316 298187 -89732 -246974 229419 14536 -186659 86727 44620 98135 130643
7187 130643 -344346 -272391 156440 -114689 -445568 23772 -146398 46361 -10356 198986
7176 -188771 -42584 -182126 332484 78213 -282154 -49524 140636 132807 27219 -367174 215095
7164 216507 -40439 -28840 269140 -160903 -42523 73521 -75269 -152420 -58306 68769 -292580
7152 -267779 61185 -216342 -283485 -296075 156653 -130452 64228 -102780 -27641 91745 181309
7141 181309 -25205 -600245 -326697 211924 -69064 153389 -83699 11796 -193172 50058 -119977
7129 134149 -287485 -232828 18966 117479 -155232 120975 29186 237553 193034 -200012 -193905
7118 -193905 13963 15338 211983 -30546 -42531 -395914 164560 -222409 -302242 158879 -21614
7106 35580 292044 -157404 12734 6602 -80777 -47714 -207397 -34602 129096 -249496 87616
7094 -57659 99088 -17300 212909 26896 -178418 -315622 -104192 -91604 43271 -64696 60720
7082 -247896 34358 -145098 -220108 -108776 -103241 226905 50513 -76429 132041 -234924 -58833
7070 331042 -92038 -255698 -175414 -188484 -106225 -261896 190186 -106201 22218 72615 68308
7059 68308 -88788 -153129 182318 301899 22508 135327 -80180 -306143 -216160 53526 -82539
7047 67239 -57314 -136170 -277708 -265947 -5402 159579 11436 261281 -122310 195919 125045
7036 125045 -189198 45399 -120622 23163 -100484 48275 -238005 -145512 -42000 93434 266222
7025 266222 -99064 125318 -15639 321919 -58617 41573 -382650 132083 148863 122267 176720
7014 176720 -160653 235364 -141412 -302954 -228460 -78418 255344 -421512 -245721 -96857
7003 327332 31894 -49158 -295824 -192208 -276911 -193586 72190 -150040 181332 -176212 -58798
6991 67996 -87059 -90049 -102985 134344 -103623 -194239 -52285 14577 -53397 191504 -208102
6979 365436 116341 -61598 -363739 -117052 39921 -95992 37487 -214384 -84635 209539 155176
6968 155176 55965 -14136 -146376 -231847 -43402 729 -85426 208149 -82212 60169 29804 145907
6956 145907 349089 -92285 -215984 309525 224409 -222316 192714 176270 -5787 -359444 198132
6944 75206 -239144 -170 -325732 -36528 -155943 292003 -260149 -210764 137414 -102211 -372346
6933 -372346 25042 -4124 -27278 -74801 -209506 -488 -217619 -48920 -106239 -225626 -45864 -17850
6920 -45901 116571 -33743 -18364 111818 13417 -40218 57582 377521 36899 -249289 26740
6908 -479476 24650 243093 -361814 134159 -76962 -376 -47488 140690 214699 -201303 -181597
6897 -181597 101122 -13400 -137342 -325936 41673 -117868 -72621 129938 71624 178592
6887 178592 -62182 20720 18207 108212 -173155 9435 -267596 -137881 -467947 -119759 90853
6875 -136383 -279857 88837 -75329 -69188 -220395 21583 -208420 -63383 -16055 -43740 78431
6863 -38106 49647 -4571 40762 198354 196517 100067 -239164 -137404 -43636 -166801 160168
6851 -57768 -182648 100065 210739 61194 -359561 249621 -65163 -52294 -260438 199914
6840 73901 3945 72967 -184761 -284137 14256 70460 280031 -330589 147313 98237 -143652
6828 44526 126490 9772 39091 3641 -46370 52657 -188701 61084 240246 -262299 -237571 -26967
6815 -32958 -35680 931 -120110 -262870 -57694 -3790 82288 -351527 -22794 229359 -37107 -78346
6803 -78346 -84552 -96191 -134047 213021 -2635 56577 -106040 -167287 -63666 -373442 -101536
6791 187843 218530 -216320 4141 -243296 70449 176226 -191488 3527 66486 -174652 8901
6779 198814 4613 99887 -182613 155774 133806 36259 78626 -27345 -89520 -32609 173397
6767 71084 -294866 329545 47805 -18491 -72362 -374991 132420 25147 -171784 45218 -144497
6755 -19293 141936 101485 89926 -5612 -116031 16537 -165030 80515 -60704 9757 48985 -183695
6742 214117 -139649 186409 -43265 -81567 -127714 -35819 99599 35873 -115989 67247 -58724
6730 68406 -144032 250103 -92706 27781 241942 -91378 -176059 -179149 -22989 181952 84748
6718 160870 -251287 -90334 258132 117280 234338 -52003 -42494 67980 77623 -82294 -280381
6707 -280381 51836 -56188 175988 -177173 -19154 -25217 -214408 -64837 97470 -180172 -378122
6696 -378122 50177 -98573 175191 156224 -24279 -39403 363667 215812 -207506 241514 -390786
6684 -175947 186496 -26954 181970 -52930 66992 -399671 50081 -299179 -182915 -60253 -262574
6673 -262574 -112555 18269 -163413 165030 36772 21115 68243 -125599 199652 70917 -148649
6661 210200 16600 7529 -16786 -303271 2129 -278173 -177319 -116450 26969 187545 -253201
6649 206769 -366990 -276437 -361470 173577 -455752 -108912 2028 43005 -59288 -109674 -36968
6637 -199468 -156058 367419 43771 -96593 49252 198876 179989 59091 339891 -94432 -130908
6626 -130908 -87647 116508 33922 -318124 -27426 -65320 221610 68060 -101643 -25382 39705
6614 317108 -151535 -48004 75905 219795 -282467 -82821 -10049 -41093 267008 12697 39468
6603 39468 -2317 -53153 -345400 -51783 -366874 -214861 111037 417435 -70331 145161 -28348
6591 12332 350641 -123303 61606 -293832 -96436 53410 157289 -106572 -59538 -18086 -159618
6580 -159618 227287 1380 -222888 183319 178108 -76371 -16233 -63977 210327 -114366 -196490
6569 -196490 -14220 -136650 39320 -371344 -112189 201300 148120 93397 108900 251488 -46845
6557 -191521 175410 125333 -37462 -34038 143122 -75019 80988 -37564 -8867 -85375 198318
6545 -102932 80210 119464 -203841 -391332 -24911 -112525 -207081 -258552 -56209 237097 -278744
6533 -132366 125072 132098 15960 -106754 -34670 -507777 -70189 -310702 -7371 -140151 -43517
6521 -7316 -108001 -47984 15378 -39793 -156167 -49905 137865 274552 -287080 -116612 31670
6509 -171471 -861 168306 -248806 246449 19888 34003 90043 -174404 -53165 28393 -63075
6497 -4939 112014 -220487 173244 -53092 183286 47733 12583 253548 -252855 -98474 39923
6485 -78476 -59751 -79946 81857 -6811 298896 -6890 -95895 382710 137215 4215 86450 -181881
6472 -184044 64375 -117751 -174724 221291 16855 44431 -27018 -33165 -24469 -101520 -121013 -31497
6459 11783 7462 -27616 -131352 51778 -141453 194632 -32547 10840 -154883 78657 206494
6448 206494 69853 9237 33132 -321086 96704 -122973 -535645 -12113 158412 -1026 126446
6436 -385776 -67795 51397 -160998 163061 111735 269474 132762 -201079 -60227 -163967
6426 -163967 542873 -42425 -246877 -82202 -264800 48059 221842 55594 98909 -257492 -99335
6414 123321 101343 -73478 -63575 -127541 153550 -126313 67695 -43360 38107 36277 -111747
6402 88921 35697 -94694 189331 35556 -52039 405966 -110061 98809 269040 79059 -10237
6390 37864 -158082 -25483 119538 251128 -391847 -70499 -74092 236990 65486 -48004 -76822
6379 -76822 218159 275721 -256571 -155813 3978 -58632 -190530 -362469 -277207 22936 -277291
6367 70965 -116784 147570 354481 122680 -71164 -8809 -161827 240065 44002 232053 61137
6355 -33501 -216202 60245 -57766 -57070 -200511 189543 -168312 24100 7838 -21165 -184672
6344 -184672 430734 -199186 165079 -653 -12708 1151 -41324 147721 -307526 36108 -32669
6332 -86604 123235 157281 16230 -125451 134377 -3032 -8778 248852 69140 194060 -243981
6320 -62770 -54123 -109758 46785 -3143 118986 -22828 -1378 -212495 -248226 -377427 -35886 -299645
6308 -299645 65050 -4660 -49430 -306360 -9663 -131357 59766 -82950 255292 274443 54419
6296 -30549 -93937 103939 25772 -29482 -210615 19840 -252283 -107392 -134871 -39601 235951
6284 -54203 -21866 -95228 -244953 -123229 -146755 67712 -98639 -32583 -104519 -89211 -61142
6273 -61142 5631 40521 -161581 -177867 -100039 -410032 201065 -66979 -73937 129140 -166079
6261 148175 -138790 -64036 210910 114678 48958 164206 -57699 -34348 -231691 -129045 75394
6249 87173 -158411 165280 77133 -179665 48198 -70576 -266985 -210995 -24230 -28781 150969
6237 106121 -156679 191904 252817 -414649 42832 244512 -99825 98440 54464 -48494 200497
6225 -110722 -82818 137429 -132150 60660 -79490 -300999 31889 -74274 8870 50535 -307807
6213 -260187 -251963 97663 -391282 97879 61706 -59537 -114007 99312 -7909 -136048 18440 70703
6201 70703 284503 -573112 -272685 6981 -30607 -26048 -355415 -112508 111557 -78659 -135010
6190 -135010 230614 -327680 -43566 -58081 -13831 147885 -13388 47774 88006 -6633 -292295
6179 -292295 245649 -192510 82559 -98253 327927 -15082 121951 93248 -273519 -93122 70711
6167 7921 -47181 160598 30048 180991 -109105 105684 79318 -47010 -55520 -220052 -169069
6156 -169069 6842 134780 -12374 -43031 -28365 -294001 -70905 126919 88533 -197461 52512
6144 158447 169427 -165809 -160810 -94352 347730 -227496 -196900 239961 -57710 -117726 -226421
6133 -226421 -44643 327956 31262 -197800 166364 298250 -112039 144961 187552 -164582
6122 -17055 25586 242819 -69151 321673 99226 243907 28193 -207862 -166718 -358082 -62162
6110 -256472 -5813 -61190 77256 111240 -58483 -265885 146807 -109680 277260 116476 64114
6099 64114 -217941 -165906 -120704 -285827 94625 -394714 -90407 -243246 -10956 13976 107147
6088 107147 98407 320107 228194 10348 198446 -133479 -122659 -32170 -33195 112762 -18588
6076 -81625 96348 340234 -1976 -40294 -471122 350513 -161081 -33172 61435 190576 -131918
6064 -27931 -367930 93378 154364 96078 -116866 47866 -354325 -46999 -193750 137611 -18386
6052 -239666 -67555 234940 171402 -24603 -218823 142993 62731 46082 359213 -27069 147285
6040 -539471 2710 -121165 2612 -74604 -229237 -138728 17471 -262139 109957 -56461 -403543
6029 -403543 -44303 -143375 -356426 -161696 142630 -81025 -247352 -41472 -205087 -110700 66331
6017 11610 -8055 94149 318598 -166671 15766 -386300 185383 42287 173041 -86851 -78465
6006 -78465 -3895 7995 119955 -172628 202139 -25397 -37212 68628 -23530 120309 147804
5995 147804 22593 -498 -182125 37481 -167599 -145011 20347 -103147 -19459 196413 200848
5984 200848 -84139 196534 -54819 -163893 -29420 -84777 -293217 -103976 257441 -129589
5973 -45224 -173550 49787 -147220 -218227 -11024 97673 32541 198279 48707 -200196 75271
5961 -78140 -343951 -156596 -245972 143756 -3124 18514 238213 25389 4539 298753 -40679
5949 56496 -231230 108080 -71670 -70566 -3789 -3527 154318 141526 70476 52321 300763 134803
5936 -70638 -117015 98959 -156773 -349796 -84371 -142104 36133 -296345 190618 -231910 -240689
5925 -240689 115806 -104213 320492 361595 356657 -326916 234418 -28204 117884 77231 -53710
5913 -364567 -217626 273546 -84565 112492 89162 -48071 -375378 -277408 -38022 -175861 -82820
5901 70567 -192531 35015 24222 -65664 102231 -6502 122495 55347 118183 121878 86525 58569
5889 58569 -43060 154718 82253 232536 -260583 91359 -89867 -46160 179800 -255831 60425
5877 -28095 -36333 22740 -237891 -51232 28063 -16151 -104755 -100380 359660 -97216 100536 330275
5865 330275 -299203 301628 41362 -179113 32588 134727 -14532 -230227 -286272 94848 -95689
5853 53849 177366 -257077 -36656 217535 -306279 88417 166636 108375 131372 105286 299879
5842 299879 307482 -138872 -22026 221502 -281697 -124077 -117917 281927 -201224 111613 67634
5831 67634 176239 -8623 189046 152269 203487 -15596 85563 101886 -213449 -35072 78788
5819 2743 -114783 38890 205038 -316546 -269974 21477 34524 -14299 -57516 -170631 -178211
5808 -178211 -31380 120221 -133465 -3263 -69606 81198 48878 -81670 -67390 -16152 124908
5796 188268 123775 -58548 -319247 -205472 18648 -326690 152523 122866 134445 -2848 290632
5784 30974 97069 130580 -183824 -56180 54131 -50420 161088 -196105 47231 120389 -270484
5772 -12623 89161 -106560 -254146 -373241 194638 -38106 -145123 95242 127928 55708 21399
5760 -97129 6488 321261 -193324 -170361 249301 78980 -523031 -223234 -45488 235098 126904
5749 126904 -60805 -181587 138845 317290 -185347 -123665 38121 -28147 322792 -60225 -64808
5738 -64808 -83234 368017 -124088 76336 -221951 289560 41739 201718 41334 -182200 -83735
5726 -131489 -148091 148945 10801 -259718 -272587 -56073 125950 305878 -66578 646001 122845
5714 166137 89373 -183098 39489 41422 -271011 -184913 -248121 24370 72263 48677 -123047
5702 -67730 -206966 -402705 316245 102875 140551 -174267 256874 -108082 -54144 118664
5691 -297909 101048 -22842 -121394 539 -62759 -59168 99724 -246002 12707 268566 13000 -317972
5678 7357 -208421 -84048 51102 -183027 428557 -140800 -66417 88815 -201575 -83306 312501
5666 -63011 -278616 37839 357937 62823 418567 -348765 102230 -29378 -129888 146772
5655 -232416 153495 247923 2573 153251 -12132 257756 -151227 -255431 5695 129371 -197402
5643 17336 -209417 -32396 361614 -109703 -51383 98619 342960 -142851 -16869 75653 -52185
5631 86223 70553 -307565 264127 -14367 79416 136654 -191490 -32410 383222 -123649 40298
5619 27544 58466 43052 -186689 23126 -228584 -173949 119640 -39650 174382 -362103 -170742
5607 -27315 -76954 -275709 19473 209760 120873 -35074 61444 -281389 -93464 -35592 68920
5595 -135665 357021 -108179 62159 56273 -114301 187492 205568 95534 103973 165933 229599
5584 229599 -47903 13367 173573 -146695 -228451 -21299 -138187 -197747 -122275 -69250 148443
5572 -74367 10461 131910 -188953 -213767 6176 171950 253954 -225074 -249485 130977 299518
5561 299518 22085 -160160 34687 168404 -120035 -236686 7073 296122 260347 -373187 41819
5549 46519 -150437 -202579 85169 272739 200363 6502 217841 170054 -52088 -57727 -54782 -322385
5537 -322385 -232062 291197 -55504 -189044 -79407 43801 -29243 196636 10976 -273114 -60931
5525 190312 -112845 -142615 -11599 -201529 111689 48304 -76603 131057 22065 -201648 -54014
5513 -104038 182769 9017 -73157 -204109 -63499 -60888 -353844 193399 -183380 51326 -211815
5501 -482876 120127 -144033 252182 192382 22931 -14344 204363 183379 40312 -21751 -171855
5490 -171855 321652 21185 -348179 -94975 -156022 294580 -191398 186791 198208 69389 252139
5479 252139 57294 102049 -32037 -24870 224625 -72080 -46937 -3709 231393 -21928 -203714
5468 -203714 66197 -289660 140788 -28125 280675 164572 52581 -56252 -74341 -210517 191857
5456 -141392 -1961 -90206 -142920 304697 191972 327166 209002 -79765 314643 83176 -14750
5444 -36020 -147203 19348 29853 37453 -189157 87011 -78519 -118772 -101358 74157 80319 110866
5432 110866 32703 33446 60867 35468 204058 -9583 93535 115809 8303 216762 217043 375825
5420 375825 -172611 50754 45960 -54298 132673 27850 -57632 -37699 96258 33026 -64046
5408 -26244 50053 185005 -158887 -263689 -109583 86706 -232600 -56059 152777 -8292 2169
5396 118500 168063 69669 254336 227206 -258967 -264581 -162764 162348 -33632 -76245 -509327
5385 -509327 -114907 48236 -89866 -207770 -169040 -294628 -187117 116812 265356 107417
5374 -262313 -204393 118024 37864 -169992 -142580 96646 -138717 166978 -42401 -29919 -66742
5363 -66742 -137453 145472 10020 -226795 -262959 -322129 134028 4236 -232753 -34073 -2374
5351 191098 117938 -5120 -282464 -10759 120013 -112161 161565 19850 -120194 -107378 -99597
5340 -99597 78881 -47473 364515 133540 -79809 148085 9603 75124 7626 -122993 -183878
5329 -183878 296492 27400 -44316 -121232 -210419 -167612 237902 -302909 -123415 -50832 198027
5317 30892 -223317 61112 -6374 -89673 118775 -89453 536532 12404 -396207 232458 -28407
5305 70549 261931 -143347 -91754 -92072 -73575 72954 72907 -102462 -43477 -368101 -272428 144603
5292 -18314 -31937 319036 111978 -43314 15086 -221534 314448 -176882 -182232 -60251 122762
5280 60955 122170 -205145 -131127 168036 -43140 -67027 -199531 -181989 -287215 98828 -218976
5268 -140350 -162022 93459 252038 932 -124191 224218 -4097 81795 -3762 13326 342025 104069
5255 41747 49393 123562 111401 36252 130549 72282 -344066 -150494 -251655 -143258 -4658
5243 176839 -131801 -130031 -12447 30694 76981 -25314 -52206 -210389 36257 -4932 37341 -442630
5230 150145 -49298 10980 -187298 -197046 -351380 303927 -190494 208931 57669 263883 33126
5218 54370 -248103 -201025 -260909 98614 -179359 115894 106197 -250326 -95258 336055 10339
5206 29593 -229902 194687 375109 -39138 -25107 314563 94292 167036 -53155 73551 184764
5195 184764 -47795 76913 149002 -85768 -112010 -249344 139853 184251 -257259 103072 -73488
5183 -421462 -27586 264057 119750 187586 -44472 -99049 -67778 -41339 19696 32138 56854
5172 56854 -185252 43115 131645 202396 -79517 42484 -51668 77493 227043 40297 -4787 -403443
5160 -403443 7813 107986 17617 281048 88959 -420684 -178307 -181624 -75378 -18656 133982
5148 162022 115702 -26141 -66709 -311265 -80072 28928 174013 268923 43432 109214 -91987
5136 62696 -357802 -41171 -77788 -303944 -105545 -16055 -152665 128723 174827 318587 -534153
5124 446207 177266 -453163 64577 64290 -300329 -95650 -322166 -145769 -109130 -97464 11390
5112 77806 52089 -19828 -63398 233509 -30969 -73843 502086 -46148 165124 348401 249148
5101 249148 -78969 -104044 -53854 180380 5208 85911 -116423 275433 -242388 -94046 69486
5089 154537 -57507 -169098 154860 -96972 -375926 174265 -153185 149716 21418 347691
5079 347691 -152944 50878 94071 151071 71489 -99312 -72695 186053 55752 73950 -281535
5067 14987 -181462 -10860 352463 120924 127679 -33083 148423 -163126 -159764 -163676 -20775
5055 -276848 -75707 -11225 -24865 155575 158703 169875 -1809 48106 -346734 129531 -76349
5043 75060 113837 72227 -307568 228120 78977 -210752 129399 130675 -30021 129804 -57179
5031 -211522 358145 -58764 57228 10313 149496 93347 169449 -8750 -56872 -302839 -177284
5020 -177284 149129 -75357 30958 222440 -184636 -57846 -183642 -30685 117223 186430 -11309
5008 -278093 106804 213230 127752 115192 98536 171019 108742 -77113 198795 145853 216458
4997 216458 213778 103118 -40591 -78543 179705 106597 -268068 215216 122436 122869 18250
4985 -318049 -268071 -44331 -1924 148826 47279 -16573 -77379 -157447 27595 253960 62786
4973 298198 365306 36110 110107 -25768 74038 -134091 -105494 233632 4309 -85249 257183
4961 191681 -95277 -223964 -84459 173415 78180 -117418 -862 39304 -118183 -73130 59676
4949 236496 -125267 -336110 169129 -203200 -282530 266911 137568 50344 231792 -39980
4938 -198293 200077 43355 -282566 127021 -70375 -108684 -80418 66563 118988 -8026 26361
4926 218048 -4836 -61117 -281095 80570 -11941 -6441 138883 -211476 15315 128111 -156747
4914 23093 144080 36645 -11915 25468 183736 277604 -13128 127681 72783 -11543 104666
4902 31682 -258350 4865 94719 -271798 -75395 -259420 -110381 168783 -246247 263773 181538
4891 181538 -254666 269818 21046 -75152 21489 106497 -13711 -51757 65434 -139207 -42279
4879 -148198 -213481 346724 55493 -79167 -76875 147767 -189811 24799 204353 208862 63331
4867 -245136 15016 105491 356973 109648 -237311 112814 -235729 -34911 -251105 372276
4856 118573 -589932 267121 -53340 21736 -7620 -51650 117519 -255673 115838 138479 -58631
4844 -197333 115299 66390 -158454 169046 -130476 230430 -15734 -141156 -57205 7401 -17724
4832 94970 37781 -31170 -121158 -173641 -51314 -17199 64009 -362474 -15043 86939 51303 -127462
4819 -18488 569920 -47945 -318821 27396 23024 8847 52913 98926 27711 -153269 -144309 -25621
4806 110756 303492 158573 -39602 -289354 -164723 82367 43889 11706 35873 -164885 -8089
4794 222072 60215 -266116 -114522 518131 165888 107103 -195368 -170505 191082 -211218
4783 200816 136962 -31789 237039 -68023 -247881 -76261 -27778 -254447 207279 -370588 -58293
4771 81004 -103744 -311760 -114584 -380898 -49282 159126 193878 -472 263450 -65869 -90588
4760 -90588 123997 -283102 84502 203403 233933 -131242 -118489 -18959 78388 129701 3018
4748 177196 2777 -117139 -112570 92782 95001 -208251 19095 -130492 -89385 13100 -250101
4736 -68343 50698 -60735 58257 137838 -156654 -306670 -253059 -105284 216209 -97198 -362218
4725 -362218 -45903 65682 87458 -65256 -11513 -115271 164088 200915 277728 7890 182080
4714 182080 -43871 -182240 -187119 150887 261585 160043 -362357 -92710 -21012 -42403 -144468
4703 -144468 -361392 257649 -24381 126856 8293 34685 -120360 131332 -45490 -131281 -164820
4692 -164820 -82244 134277 128961 3719 -32001 -24151 31992 54196 -231313 13688 -399594 -177922
4679 45314 129306 125573 -363547 -73065 26336 158473 45646 49730 137140 140444 104154 23468
4666 -305491 -19019 315813 -164737 246424 142873 278890 47124 111615 349848 -57686
4655 99162 -36743 -348286 436087 44503 190955 60022 134126 228282 426683 150603 -34205
4643 -28616 -141537 257404 -225575 -157902 108144 -65727 157192 -138102 -36041 321705
4632 -64561 -180143 -8301 355546 78394 -119942 49752 -78196 21023 234170 276619 165384
4621 165384 -140378 -204235 -320738 94978 252056 -85925 -26267 -11919 -46871 41536 -7064
4609 240634 -82075 -259458 122101 31019 -90228 226418 204891 -24479 52959 74520 209438
4598 209438 -28639 -147403 62558 412559 -58612 -149281 66270 -198661 33930 -71763 -239257
4587 -239257 -207070 -145568 60563 -18431 -82177 76587 167086 348485 95209 231872 -338048
4575 135900 157480 -146262 55530 -170254 -79793 50225 140051 257617 50720 280090 98578
4563 -52007 -37656 306316 46663 286229 -347653 68089 -87990 -36595 -70886 38709 6020
4551 -198989 16472 80353 -57449 -62358 7751 -46920 83807 336441 46115 -36510 -112301 -66203
4539 -66203 120173 231253 -105941 -231608 8909 -190455 -11252 145930 47377 -61902 -319157
4528 -319157 -103282 -87846 200818 -36613 -83853 308025 149902 204924 15618 -131996 199802
4516 -54315 164258 -200031 33674 217844 -70785 60181 347700 -266488 327670 50019 296548
4505 296548 -90934 -87716 -119083 -225376 -47893 60303 13739 181295 -240619 203631 -61130
4493 -205993 86073 187589 78498 -163634 -79316 -10295 117383 -32810 -158810 -231128 -7513
4481 83170 79052 -121725 122711 164238 -125931 -210248 56019 -114521 2271 262463 200809
$$ [...]
##END NTUPLES=NMR SPECTRUM
##END=
