##TITLE=AC1738_SEN00011_9276187_vwu7jyrfVx
##JCAMPDX= 6.0         $$ Bruker NMR JCAMP-DX V2.0
##DATA TYPE= NMR SPECTRUM
##DATA CLASS= NTUPLES
##ORIGIN= BRUKER
##OWNER= Administrator
$$ 1.72 TOPSPIN		Version 2.1
$$ 2015-07-17 19:15:34.463 -0700  Administrator@X
$$ Compression mode = diff/dup
##.OBSERVE FREQUENCY= 400.02188249412
##.OBSERVE NUCLEUS= ^1H
##.ACQUISITION MODE= SIMULTANEOUS (DQD)
##.ACQUISITION SCHEME= undefined
##.AVERAGES= 64
##.DIGITISER RES= 22
##SPECTROMETER/DATA SYSTEM= spect
##.PULSE SEQUENCE= noesygpps1d.comp
##.SOLVENT NAME= COFFEE_meoh
##.SHIFT REFERENCE= INTERNAL, COFFEE_meoh, 1, 14.96103
##AUDIT TRAIL= $$ (NUMBER, WHEN, WHO, WHERE, PROCESS, VERSION, WHAT)
$$ ##TITLE= Audit trail, TOPSPIN		Version 2.1
$$ ##JCAMPDX= 5.01
$$ ##ORIGIN= Bruker BioSpin GmbH
$$ ##OWNER= Administrator
$$ $$ E:\/data/COFFEE/nmr/AC1738_SEN00011_9276187_vwu7jyrfVx/22/pdata/1/auditp.txt
$$ ##AUDIT TRAIL=  $$ (NUMBER, WHEN, WHO, WHERE, PROCESS, VERSION, WHAT)
(   1,<2015-07-17 19:15:29.182 -0700>,<Administrator>,<X>,<go>,<TOPSPIN 2.1>,
      <created by zg
	started at 2015-07-17 19:03:59.369 -0700,
	POWCHK enabled, PULCHK disabled,
       configuration hash MD5:
       21 0F 79 D6 B3 7B B4 F6 88 20 88 DB 03 48 BD 9F
       data hash MD5: 64K
       A2 87 34 E7 B1 08 2B 07 34 B6 B7 01 EB 82 45 92>)
(   2,<2015-07-17 19:15:32.619 -0700>,<Administrator>,<X>,<proc1d>,<TOPSPIN 2.1>,
      <Start of raw data processing
       efp LB = 0.3 FT_mod = 6 PKNL = 1 PHC0 = 0 PHC1 = 0 SI = 128K 
       data hash MD5: 128K
       0B 21 29 21 4F 8D 42 FE 60 59 3D 8A 60 63 4F 68>)
(   3,<2015-07-17 19:15:33.572 -0700>,<Administrator>,<X>,<proc1d>,<TOPSPIN 2.1>,
      <pk PHC0 = 267.5116 PHC1 = 0 
       data hash MD5: 128K
       D7 A7 5F 70 03 7F 94 18 B9 19 93 BB 56 00 D4 C1>)
(   4,<2015-07-17 19:15:33.963 -0700>,<Administrator>,<X>,<proc1d>,<TOPSPIN 2.1>,
      <abs ABSG = 1 
       data hash MD5: 128K
       8A 32 D1 BC 39 36 10 20 3B 11 5F 28 91 9E EA 8C>)
(   5,<2015-07-17 19:15:34.072 -0700>,<Administrator>,<X>,<proc1d>,<TOPSPIN 2.1>,
      <abs ABSG = 2 
       data hash MD5: 128K
       4B 9B 5E 65 6C A8 46 79 67 22 A7 7E B8 10 6F 3A>)
(   6,<2015-07-17 19:15:34.150 -0700>,<Administrator>,<X>,<proc1d>,<TOPSPIN 2.1>,
      <abs ABSG = 3 
       data hash MD5: 128K
       6F 2C 31 1C A6 5A 18 0C 1D 72 4B 54 AA 79 A2 6B>)
(   7,<2015-07-17 19:15:34.229 -0700>,<Administrator>,<X>,<proc1d>,<TOPSPIN 2.1>,
      <abs ABSG = 4 
       data hash MD5: 128K
       79 75 13 C5 F9 53 CF 2D 0E 6F 21 73 84 BE 15 44>)
(   8,<2015-07-17 19:15:34.307 -0700>,<Administrator>,<X>,<proc1d>,<TOPSPIN 2.1>,
      <abs ABSG = 5 
       data hash MD5: 128K
       3A CC F3 F2 2B E8 9F AC EC 99 BE 88 58 6C F2 41>)
$$ ##END=
$$ 
$$ $$ hash MD5
$$ $$ D5 65 E6 2A 89 BD 8B 2A 72 19 F2 F3 F2 BF DC D1
##$RELAX= 
##$RELAX= 
##$RELAX= 
##$RELAX= 
##$RELAX= 
##$RELAX= 
##$RELAX= 
##$RELAX= 
$$ Bruker specific parameters
$$ --------------------------
##$DU= <E:\>
##$EXPNO= 22
$$ [...]
150 150 150 150 150 150 150 150
##$TP07= 0
##$TPNAME0= <>
##$TPNAME1= <>
##$TPNAME2= <>
##$TPNAME3= <>
##$TPNAME4= <>
##$TPNAME5= <>
##$TPNAME6= <>
##$TPNAME7= <>
##$TPOAL= (0..7)
0.5 0.5 0.5 0.5 0.5 0.5 0.5 0.5
##$TPOFFS= (0..7)
0 0 0 0 0 0 0 0
##$TUNHIN= 0
##$TUNHOUT= 0
##$TUNXOUT= 0
##$USERA1= <user>
##$USERA2= <user>
##$USERA3= <user>
##$USERA4= <user>
##$USERA5= <user>
##$V9= 5
##$VALIST= <valist>
##$VCLIST= <CCCCCCCCCCCCCCC>
##$VD= 0
##$VDLIST= <DDDDDDDDDDDDDDD>
##$VPLIST= <PPPPPPPPPPPPPPP>
##$VTLIST= <TTTTTTTTTTTTTTT>
##$WBST= 2048
##$WBSW= 25
##$XGAIN= (0..3)
0 0 0 0
##$XL= 0
##$YL= 0
##$YMAX_a= 6324457
##$YMIN_a= -11267803
##$ZGOPTNS= <>
##$ZL1= 120
##$ZL2= 120
##$ZL3= 120
##$ZL4= 120
##$ABSF1= 14.96103
##$ABSF2= -5.597152
##$ABSG= 5
##$ABSL= 3
##$ALPHA= 0
##$AQORDER= 0
##$ASSFAC= 0
##$ASSFACI= 0
##$ASSFACX= 0
##$ASSWID= 0
##$AUNMP= <proc_prof1d_extract.lims>
##$AXLEFT= 0
##$AXNAME= <>
##$AXNUC= <1H>
##$AXRIGHT= 0
##$AXTYPE= 0
##$AXUNIT= <>
##$AZFE= 0.1
##$AZFW= 0.1
##$BCFW= 0
##$BC_mod= 0
##$BYTORDP= 0
##$COROFFS= 0
##$CY= 15
##$DATMOD= 1
##$DC= 0
##$DFILT= <>
##$DTYPP= 0
##$F1P= 0
##$F2P= 0
##$FCOR= 0.5
##$FTSIZE= 131072
##$FT_mod= 6
##$GAMMA= 0
##$GB= 0
##$INTBC= 1
##$INTSCL= 1
##$ISEN= 128
##$LB= 0.3
##$LEV0= 0
##$LPBIN= 0
##$MAXI= 10000
##$MC2= 0
##$MEAN= 0
##$ME_mod= 0
##$MI= 0
##$NCOEF= 0
##$NC_proc= -2
##$NLEV= 6
##$NOISF1= 0
##$NOISF2= 0
##$NSP= 0
##$NTH_PI= 0
##$NZP= 0
##$OFFSET= 14.96103
##$PC= 1
##$PHC0= 267.5116
##$PHC1= 0
##$PH_mod= 1
##$PKNL= yes
##$PPARMOD= 0
##$PPDIAG= 0
##$PPIPTYP= 0
##$PPMPNUM= 2147483647
##$PPRESOL= 1
##$PSCAL= 4
##$PSIGN= 0
##$PYNMP= <proc.py>
##$REVERSE= no
##$SF= 400.02000962497
##$SI= 131072
##$SIGF1= 0
##$SIGF2= 0
##$SINO= 400
##$SIOLD= 131072
##$SPECTYP= <>
##$SREGLST= <1H.CDCl3>
##$SSB= 0
##$STSI= 131072
##$STSR= 0
##$SW_p= 8223.68421052631
##$SYMM= 0
##$S_DEV= 0
##$TDeff= 65536
##$TDoff= 0
##$TI= <>
##$TILT= no
##$TM1= 0
##$TM2= 0
##$TOPLEV= 0
##$USERP1= <user>
##$USERP2= <user>
##$USERP3= <user>
##$USERP4= <user>
##$USERP5= <user>
##$WDW= 1
##$XDIM= 131072
##$YMAX_p= 392913425
##$YMIN_p= -12735
##$CURPLOT= <Network HP LaserJet P1505>
##$CURPRIN= <$Network HP LaserJet P1505>
##$DFORMAT= <normdp>
##$LAYOUT= <+/1D_H.xwp>
##$LFORMAT= <normlp>
##$PFORMAT= <normpl>
##$SURQMSG= 1
$$ End of Bruker specific parameters
$$ ---------------------------------
##NTUPLES= NMR SPECTRUM
##VAR_NAME=  FREQUENCY,     SPECTRUM/REAL,   SPECTRUM/IMAG
##SYMBOL=    X,             R,               I
##VAR_TYPE=  INDEPENDENT,   DEPENDENT,       DEPENDENT
##VAR_FORM=  AFFN,          ASDF,            ASDF
##VAR_DIM=   131072,        131072,          131072
##UNITS=     HZ,            ARBITRARY UNITS, ARBITRARY UNITS
##FACTOR=    0.0627417313425164, 1,          1
##FIRST=     8223.62146879497, 938,          -54820
##LAST=      0,             3380,            -54874
##MIN=       0,             -12735,          0
##MAX=       8223.62146879497, 392913425,    0
$$ Real data points
##PAGE= N=1
##DATA TABLE= (X++(R..R)), XYDATA
$$ [...]
63924F063488q4588j27471j66749k01461k31339k55876k74100k85513k90728k90805
63914C854858k86276k77389k65018k50553k34744k17347j98243j78415j59350
63905A787523j41771j25409j09940r5652q3178p2993o5137n9055n3551m7503m1023
63894H92311l5563l2340l0818k9312k6962k4360k2213k0216j7786j5204j3235
63883F24302j1930j0602q913p208n682l895j434J470M279O758Q990J1116J3286
63870F20537J5567J7674J9150J9997K0816K1959K2966K3175K2627K1910K1301
63859H47679K0537J9359J7767J5692J2853R217N327J915p70l160n885r180j2729
63846I18622j6076j9025k1552k3510k4738k5479k6298k7411k8437k8975k9095
$$ y = [6063488, 5978900, 5851429, 5684680, 5483219, 5251880, 4996004, 4721904, 4436391, 4145663, 3854858, 3568582, 3291193, 3026175, 2775622, 2540878, 2323531, 2125288, 1946873, 1787523, 1645752, 1520343, 1410403, 1314751, 1231573, 1158580, 1093443, 1034388, 980837, 933334, 892311, 856748, 824408, 793590, 764278, 737316, 712956, 690743, 670527, 652741, 637537, 624302, 612372, 601770, 592857, 585649, 579967, 576072, 574638, 576108, 580387, 587145, 596135, 607251, 620537, 636104, 653778, 672928, 692925, 713741, 735700, 758666, 781841, 804468, 826378, 847679, 868216, 887575, 905342, 921034, 933887, 943104, 948431, 950346, 949576, 946416, 940531, 931351, 918622, 902546, 883521, 861969, 838459, 813721, 788242, 761944, 734533, 706096, 677121, 648026]
63835F48026k8965k8352k6927k4929k2992k1413k0018j8751j7851j7326j6665
63824D03837j5347j3474j1702j0616j0277j0216r761q549o867n435m723m546m350
63811B87974l786k977k300k021k057k052j695j102p92j230k281l237l476l106
63797B55862k807k937l036k490j476q64j053j450j344r40j044j844k576k467j699
63782B27835j165j444k114k160j030O45J578J175J52l60j24J81O2j81r8J69J01
63765B23222m73j177j532j377q95m17k06l03n47p15o39k31M06Q56O90Qn10k88
63747B15872N38J406J984K291K372K293K414L116M111M495L811K694K086K105
63733B51588K207K204K481L136L592L301K479J826J873K750M206N538N969N460
$$ y = [648026, 619061, 590709, 563782, 538853, 515861, 494448, 474430, 455679, 437828, 420502, 403837, 388490, 375016, 363314, 352698, 342421, 332205, 322444, 313895, 307028, 301593, 296870, 292324, 287974, 284188, 281211, 278911, 276890, 274833, 272781, 271086, 269984, 269192, 267962, 265681, 262444, 258968, 255862, 253055, 250118, 247082, 244592, 243116, 242252, 241199, 239749, 238405, 237465, 236421, 234577, 232001, 229534, 227835, 226670, 225226, 223112, 220952, 219922, 220567, 222145, 223320, 223472, 223112, 222988, 223169, 223231, 223050, 222952, 223121, 223222, 222749, 221572, 220040, 218663, 217768, 217351, 217145, 216842, 216295, 215580, 214941, 214710, 215116, 215972, 216662, 216670, 216160, 215872, 216410, 217816, 219800, 222091, 224463, 226756, 229170, 232286, 236397, 240892, 244703, 247397, 249483, 251588, 253795, 255999, 258480, 261616, 265208, 268509, 270988, 272814, 274687, 277437, 281643, 287181, 293150, 298610]
63719B98610M856M858N183N172M732M061K885Q95j284k492k575k615l395m405
63705C14486m741m273l441k579j921j726j863j728j013j54M85J239K384L269L134
63690C01558K331J916K155K310J881J190P04N33O41R38J046O90L20O31J355J411
63674C21610N02l13j13O52J043J088J523K473L286L484L174K544J633O93J21j81
63658C43219q75k327m014n111n443n515n676n712n285m515l824l375k950k397
63644B86200j830j232k68J176K494K854K236J510J423J926K593L309M155M967
63630C11513N380N315N103N137N553O212O889P503Q158Q947R725J0268J0684J1478
63616D17865J3067J5289J7504J9150K0179K1053K2278K3876K5329K6199K6577
$$ y = [298610, 303466, 308324, 313507, 318679, 323411, 327472, 330357, 331252, 329968, 327476, 324901, 322286, 318891, 314486, 309745, 305472, 302031, 299452, 297531, 295805, 293942, 292214, 291201, 291047, 291532, 292771, 295155, 298424, 301558, 303889, 305805, 307960, 310270, 312151, 313341, 314045, 314578, 315219, 316157, 317203, 317893, 318213, 318844, 320199, 321610, 322112, 321799, 321686, 322338, 323381, 324469, 325992, 328465, 331751, 335235, 338409, 340953, 342586, 343279, 343400, 343219, 342344, 340017, 336003, 330892, 325449, 319934, 314258, 308546, 303261, 298746, 294922, 291547, 288597, 286200, 284370, 283138, 282870, 284046, 286540, 289394, 291630, 293140, 294563, 296489, 299082, 302391, 306546, 311513, 316893, 322208, 327311, 332448, 338001, 344213, 351102, 358605, 366763, 375710, 385435, 395703, 406387, 417865, 430932, 446221, 463725, 482875, 503054, 524107, 546385, 570261, 595590, 621789, 648366]
63605F48366K6741K6520K5350K2890J9221J4567R335M351M40k375m658o453p106
63592G77189o592o158p009q906j0831j2520j4478j6688j8360j9016j9016j8753
63580F18862j8089j6836j5269j3758j2333j0887r447q012o374m426k344l60J449
63567E02176L017M229N195O218P381Q375Q903Q926Q496P761P333Q025R922J2137
63553F08094J3950J5693J7984K0562K2751K4843K7960L2306L6292L7868L6240
63542H94543L1900K5552J7711R205J373m643q555j0755j1649j1376j0135q487
63530I14684p137o499o663p773j0131j3786j8114k2083k4882k6327k6827k7085
63518G17377k7542k7917k7443k5852k3774k1895k0100j7981j5865j4489j3746
$$ y = [648366, 675107, 701627, 726977, 749867, 769088, 783655, 792990, 797341, 797781, 795406, 790748, 784295, 777189, 770597, 764439, 757430, 748524, 737693, 725173, 710695, 694007, 675647, 656631, 637615, 618862, 600773, 583937, 568668, 554910, 542577, 531690, 522243, 514231, 507857, 503431, 501087, 500727, 502176, 505193, 509422, 514617, 520835, 528216, 536591, 545494, 554420, 562916, 570677, 578010, 586035, 595957, 608094, 622044, 637737, 655721, 676283, 699034, 723877, 751837, 784143, 820435, 858303, 894543, 926443, 951995, 969706, 978911, 980284, 975641, 967086, 956331, 944682, 933306, 923171, 914684, 907547, 901048, 894385, 886612, 876481, 862695, 844581, 822498, 797616, 771289, 744462, 717377, 689835, 661918, 634475, 608623, 584849, 562954, 542854, 524873, 509008, 494519, 480773]
63507D80773j2726j1130r724q994q262o817n077l840l023k167j674k325l729m446
63493C96839l860k847k240j737p86K42N97K73j08k06n9L46J015J638J959K313
63477C93379L205M429N145M920M134L364K723K016J110n8j513l024m060m201l630
63462D07939l006k891l349m035m535m635m324l704k938k156j271J6J820L729N158
63447C81818O028O779P672Q427Q781Q989R502J0427J1657J3214J5119J7183J9267
63434E24863K1524K3901K5587K5544K3564K0319J6502J2444Q670O090N297O022
63422G20327P620R768J2480J5666J9072K2563K6126K9554L2178L3013L1281K7043
63410I86691K1337J5438R907M514r12n859r495j1445j2049j1983j1814j1877j2396
$$ y = [480773, 468047, 456917, 447193, 438199, 429937, 423120, 418043, 414203, 411180, 409013, 407339, 405014, 401285, 396839, 392979, 390132, 387892, 386155, 385369, 385611, 386208, 386481, 386373, 386167, 386108, 386454, 387469, 389107, 391066, 393379, 396584, 401013, 406158, 411078, 415212, 418576, 421299, 423315, 424425, 424367, 422854, 419830, 415770, 411569, 407939, 404933, 402042, 398693, 394658, 390123, 385488, 381164, 377460, 374522, 372366, 371095, 371111, 372931, 376660, 381818, 387846, 394625, 402297, 410724, 419505, 428494, 437996, 448423, 460080, 473294, 488413, 505596, 524863, 546387, 570288, 595875, 621419, 644983, 665302, 681804, 694248, 702918, 709008, 714305, 720327, 727947, 737715, 750195, 765861, 784933, 807496, 833622, 863176, 895354, 928367, 959648, 986691, 1008028, 1023466, 1033373, 1037887, 1036975, 1031116, 1021621, 1010176, 998127, 986144, 974330, 962453, 950057]
63397I50057j3638j5824j8849k2200k5278k7754k9420k9878k8762k6350k3639
63386F88465k1554k0236j9183j7888j6135j3878j1175q334n894m122k594m93K378
63373E49357N132O752P361Q065R432J0835J1562J1941J2744J4020J5289J6632
63361F79122J8633K1301K3884K5942K7786K9648L1098L1652L1317L0175K7947
63350I78505K4431J9936J4887R377L554j915o191q961j0435j0979j1043j1192
63338I89974j1819j2981j4685j7064j9955k2668k4580k5688k6235k6136k5148
63327G63015k3420k1389j9303j7170j4922j2316r039n416k706k041l259n368p892
63314F18774j0975j4216j6494j7196j6901j6356j5498j3981j2138j0636r502q172
$$ y = [950057, 936419, 920595, 901746, 879546, 854268, 826514, 797094, 767216, 738454, 712104, 688465, 666911, 646675, 627492, 609604, 593469, 579591, 568416, 560082, 554188, 550066, 547472, 546979, 549357, 554489, 561241, 568602, 576667, 586099, 596934, 608496, 620437, 633181, 647201, 662490, 679122, 697755, 719056, 742940, 768882, 796668, 826316, 857414, 889066, 920383, 950558, 978505, 1002936, 1022872, 1037759, 1047136, 1050690, 1048775, 1042584, 1033623, 1023188, 1012209, 1001166, 989974, 978155, 965174, 950489, 933425, 913470, 890802, 866222, 840534, 814299, 788163, 763015, 739595, 718206, 698903, 681733, 666811, 654495, 645456, 640040, 637334, 635293, 632034, 626666, 618774, 607799, 593583, 577089, 559893, 542992, 526636, 511138, 497157, 485019, 474383, 464881, 456709]
63302D56709o520n096m332m015l731l411l150k926k823l202m209n221n396m754
63288C97923m215m352m625m256l433l076l538m160m161l475k543j765j342j286
63274C51696j267q05J22Q47P51j7q13j355j839k287k194j080P70K358K819K147
63258C49853J096M65N71J336K508L647M299M508M921N880O687O403N285M706N533
63243D07698P295R175J0988J2742J4033J4590J4967J5942J7563J9381K1266K3294
63231E88934K5063K5971K6159K6370K6897K7337K7478K7658K7926K7648K6423
63220H83864K4964K4373K4736K5037K4484K3488K3061K3441K3650K2422J9309
63209A142829J4740R307L330k910r076j5018k0800k6230l0739l3900l5777l6578
$$ y = [456709, 450189, 445093, 440761, 436746, 433015, 429604, 426454, 423528, 420705, 417503, 413294, 408073, 402677, 397923, 393708, 389356, 384731, 380475, 377042, 373966, 370428, 366268, 362107, 358632, 356089, 354324, 352982, 351696, 350429, 349624, 349746, 350593, 351344, 351327, 350514, 349159, 347320, 345033, 342839, 341759, 342529, 344887, 347706, 349853, 350949, 351414, 351985, 353321, 355829, 359476, 363775, 368283, 373204, 379084, 385771, 392174, 397459, 402165, 407698, 414993, 424168, 435156, 447898, 461931, 476521, 491488, 507430, 524993, 544374, 565640, 588934, 613997, 639968, 666127, 692497, 719394, 746731, 774209, 801867, 829793, 857441, 883864, 908828, 933201, 957937, 982974, 1007458, 1030946, 1054007, 1077448, 1101098, 1123520, 1142829, 1157569, 1166876, 1170206, 1167296, 1158220, 1143202, 1122402, 1096172, 1065433, 1031533, 995756, 959178]
63197I59178l6304l5107l3455l1551k8940k5249k1039j7338j4488j2000r391o616
63185F87700l758q91J805M305O997J0105J2912J4224J3790J2655J2004J2174J2897
63172G96919J3807J4422J4182J3030J1623J0559R651Q252O054L283L20k565n245
63159H94292p860j0790j4305j8162k1665k4136k5368k5665k5459k4883k3833k2425
63147F49741k1118k0134j9024j7246j4964j2924j1527j0477r319p937o514n317
63135D93240m554m146l659k730j487k46J003K380L561M089M131M266M564M552
63121E04964M131L849M044M373M501M567M684M552L923K955J860O94k16k97M09
63106E48993J004Q29L02J70M30N99N53M38J26n31j184j352j090p29k31N71J273
$$ y = [959178, 922874, 887767, 854312, 822761, 793821, 768572, 747533, 730195, 715707, 703707, 694316, 687700, 683942, 683051, 684856, 689161, 696158, 706263, 719175, 733399, 747189, 759844, 771848, 784022, 796919, 810726, 825148, 839330, 852360, 863983, 874542, 884193, 892445, 898499, 901782, 902102, 899537, 894292, 886432, 875642, 861337, 843175, 821510, 797374, 772006, 746341, 720882, 695999, 672166, 649741, 628623, 608489, 589465, 572219, 557255, 544331, 532804, 522327, 513008, 505071, 498557, 493240, 488686, 484540, 480881, 478151, 476664, 476418, 477421, 479801, 483362, 487451, 491582, 495848, 500412, 504964, 509095, 512944, 516988, 521361, 525862, 530429, 535113, 539665, 543588, 546543, 548403, 549097, 548881, 548584, 548993, 549997, 550826, 551128, 551298, 551728, 552327, 552880, 553318, 553444, 552913, 551729, 550377, 549287, 548558, 548327, 548898, 550171]
63089E50171J289Q44Q15J512K310K605K483K276K071K005K476L630M945N757N971
63074E91160O014O241O726P395Q124Q758R309J0083J1356J3007J4651J6151J7741
63061G26716J9611K1642K3681K5878K8503L1517L4583L7554M0649M4059M7570
63050A081963N0823N3798N6801N9993O3087O5465O6584O6413O5650O5168O5103
63039A760848O4713O3414O1663O0336N9554N8726N7526N6122N4439N1877M7899
63028B397117M2350L5127K6178J5918M964o753j9799l3902m7594n9571o9653p7855
63016B206527q3440q5797q5629q4260q2058p8432p3082o6454n9023n1085m3135
63005A414132l5671k8558k1306j4033p426j746L403Q152J1964J4480J6153J7683
$$ y = [550171, 551460, 552304, 553119, 554631, 556941, 559546, 562029, 564305, 566376, 568381, 570857, 574487, 579432, 585189, 591160, 597174, 603415, 610141, 617536, 625660, 634418, 643727, 653810, 665166, 678173, 692824, 708975, 726716, 746327, 767969, 791650, 817528, 846031, 877548, 912131, 949685, 990334, 1034393, 1081963, 1132786, 1186584, 1243385, 1303378, 1366465, 1431930, 1498514, 1564927, 1630577, 1695745, 1760848, 1825561, 1888975, 1950638, 2010974, 2070528, 2129254, 2186780, 2242902, 2297341, 2349218, 2397117, 2439467, 2474594, 2500772, 2516690, 2521654, 2514901, 2495102, 2461200, 2413606, 2354035, 2284382, 2206527, 2123087, 2037290, 1951661, 1867401, 1785343, 1706911, 1633829, 1567375, 1508352, 1457267, 1414132, 1378461, 1349903, 1328597, 1314564, 1307138, 1305392, 1308795, 1316947, 1328911, 1343391, 1359544, 1377227]
62993A377227J9262K0693K1895K2889K3618K4017K4027K3470K2117K0076J7719
62982A617010J5112J1837P559K403l385r769j6669k3670l0313l6429m1873m6197
62970A445616m8914n0055n0166m9765m8974m7645m5613m2899l9798l6800l4278
62959I50709l2205l0262k8227k6195k4438k3096k2041k1113k0345j9851j9443
62948F83493j8684j7410j6036j5061j4460j3825j3006j2260j1783j1446j1059
62937E28463j0532r793q768p642o795o278n616m409l009k259k493l068l065k365
62923D52371j778k004k686k838k142j434j665k711l589l613k988k308j930j840
62909D18845j873j846j730j704j923k236k317k066j683j370j194j202j366j395
$$ y = [1377227, 1396489, 1417182, 1439077, 1461966, 1485584, 1509601, 1533628, 1557098, 1579215, 1599291, 1617010, 1632122, 1643959, 1651518, 1653921, 1650536, 1640767, 1624098, 1600428, 1570115, 1533686, 1491813, 1445616, 1396702, 1346647, 1296481, 1246716, 1197742, 1150097, 1104484, 1061585, 1021787, 984987, 950709, 918504, 888242, 860015, 833820, 809382, 786286, 764245, 743132, 722787, 702936, 683493, 664809, 647399, 631363, 616302, 601842, 588017, 575011, 562751, 550968, 539522, 528463, 517931, 508138, 499370, 491728, 484933, 478655, 473039, 468630, 465621, 463362, 460869, 457801, 454736, 452371, 450593, 448589, 445903, 443065, 440923, 439489, 437824, 435113, 431524, 427911, 424923, 422615, 420685, 418845, 416972, 415126, 413396, 411692, 409769, 407533, 405216, 403150, 401467, 400097, 398903, 397701, 396335, 394940]
62895C94940r15OQ04R86O12O5l86p01q76q90p33m19K6N78J237J987K596K590J739
62876D03246N57k8L42J058J267Q03J48k94n61q79j316j759k007j866j294n41O
62859C96882K57M73Q31J059Q46M73O31J455K206K181J649J410J665J863J616J159
62843D16656Q38O80O80R31J186Q36k18j134j020n9P69Q70M96K05L15Q24J475J982
62825D26312K348K826L344L372K704J998J984K443K608K397K495L345M643N821
62811D68640O496O417N638M810M688N258N867O273O906P993R082R742J0231J1003
62797E69044J2021J2897J3484J4056J5014J6583J8662K0921K3328K6341L0347
62786G72698L4963L9454M3698M8200N3248N8665O4428P0729P7296Q3356Q8555
$$ y = [394940, 394025, 394031, 394835, 395821, 396433, 396498, 396112, 395411, 394535, 393645, 392912, 392493, 392519, 393097, 394334, 396321, 398917, 401507, 403246, 403803, 403775, 404117, 405175, 406442, 407245, 407393, 407099, 406538, 405659, 404343, 402584, 400577, 398711, 397417, 396876, 396882, 397139, 397612, 398443, 399502, 400348, 400821, 401452, 402907, 405113, 407294, 408943, 410353, 412018, 413881, 415497, 416656, 417494, 418174, 418854, 419785, 420971, 421807, 421589, 420455, 419435, 419376, 420145, 421015, 421511, 421716, 422031, 422855, 424330, 426312, 428660, 431486, 434830, 438202, 440906, 442904, 444888, 447331, 449939, 452336, 454831, 458176, 462819, 468640, 475136, 481553, 487191, 492001, 496689, 501947, 507814, 514087, 520993, 528986, 538068, 547810, 558041, 569044, 581065, 593962, 607446, 621502, 636516, 653099, 671761, 692682, 716010, 742351, 772698, 807661, 847115, 890813, 939013, 992261, 1050926, 1115354, 1186083, 1263379, 1346735, 1435290]
62775A435290R3207R7417J00633J02349J02544J00976R6787Q9369P9072O6589
62765B364233N2177L5999J8730J203j6117l2807m8109o1442p2900q2678r0405
62754B067884r5566r8215r8793r7683r5456r2890r0051q5929p9922p3103o7047
62743A093229o1877n6652n1380m7131m4050m0742l6176l1115k6933k3868k1159
62732F52146j8379j5806j3823j2484j1545j0517r003p177n745n103m793m054k646
62719E31071q94P23J851K435K916M017N954Q094R707J0827J2126J4110J6682J9377
62705F38996K1763K3744K5697K8173L1304L4658L7789M0718M3718M6854M9950
62694A023364N2770N4965N6138N6304N5976N5393N3759M9836M3313L5143K6395
$$ y = [1435290, 1528497, 1625914, 1726547, 1828896, 1931440, 2032416, 2129203, 2218572, 2297644, 2364233, 2416410, 2452409, 2471139, 2472342, 2456225, 2423418, 2375309, 2313867, 2240967, 2158289, 2067884, 1972318, 1874103, 1775310, 1677627, 1582171, 1489281, 1399230, 1313301, 1233379, 1160276, 1093229, 1031352, 974700, 923320, 876189, 832139, 791397, 755221, 724106, 697173, 673305, 652146, 633767, 617961, 604138, 591654, 580109, 569592, 560589, 553412, 547667, 542564, 537771, 533717, 531071, 530177, 530900, 532751, 535186, 538102, 542119, 548073, 556167, 565874, 576701, 588827, 602937, 619619, 638996, 660759, 684503, 710200, 738373, 769677, 804335, 842124, 882842, 926560, 973414, 1023364, 1076134, 1131099, 1187237, 1243541, 1299517, 1354910, 1408669, 1458505, 1501818, 1536961, 1563356]
62683A563356J7268P469k846j3052k2760l2055m0867m8499n4102n7501n9326o0291
62671A196794o0496n9558n7282n4085n0676m7417m4068m0309l6319l2687k9657
62660F84240k6794k3702k0804j8921j8050j7095j5141j2572j0538r571r183q710
62648D93159q023p365o885o480n915n003l799k655j860j347r28o70o76o45j23
62633D40785P33J154O61l55j192j607j721j590j197p17l69r6L28R50J599K131
62617D39497K488K681K837L175L724M267M777N644P108Q654R486R568R782J0878
62603E24566J2720J4697J6565J8552K0824K3178K5349K7435K9952L3375L7591
62592G84804M1808M5174M7421M8832M9597M9468M8024M5070M0663L4993K8291
$$ y = [1563356, 1580624, 1588093, 1585247, 1572195, 1549435, 1517380, 1476513, 1428014, 1373912, 1316411, 1257085, 1196794, 1136298, 1076740, 1019458, 965373, 914697, 867280, 823212, 782903, 746584, 713897, 684240, 657446, 633744, 612940, 594019, 575969, 558874, 543733, 531161, 520623, 511052, 501869, 493159, 485136, 477771, 470886, 464406, 458491, 453488, 449689, 447034, 445174, 443827, 442899, 442229, 441553, 440908, 440785, 441518, 442672, 443333, 442978, 441786, 440179, 438458, 436868, 435671, 434954, 434585, 434489, 434817, 435767, 437366, 439497, 441985, 444666, 447503, 450678, 454402, 458669, 463446, 469090, 476198, 484852, 494338, 503906, 513688, 524566, 537286, 551983, 568548, 587100, 607924, 631102, 656451, 683886, 713838, 747213, 784804, 826612, 871786, 919207, 968039, 1017636, 1067104, 1115128, 1160198, 1200861, 1235854, 1264145]
62581A264145K0775J2542L693n361j3985k1794k8834l5161m0459m4286m6527m7400
62569A017348m7205m6314m5132m3695m1475l8065l3985l0363k7743k5663k3474
62558F14234k1110j8881j6958j5443j4509j4008j3184j1365q935p136o715p078
62546D58912o908n511l359j491n16k16%L56N57L16j78n04m95l19j54J0K62P08
62528D41470J496K723M198N479O296O881P801R415J1550J3713J5593J7285J9054
62515E62954K1042K3309K5945K8814L1288L2713L3256L3907L5317L6890L7321
62504I02756L5836L2783K9129K5589K2104J8010J2960P644L224Pk685n039n985
62491A076333m619j678J325M073P475J1853J6312K0077K3447K7008L0639L3740
$$ y = [1264145, 1284920, 1297462, 1301155, 1295794, 1281809, 1260015, 1231181, 1196020, 1155561, 1111275, 1064748, 1017348, 970143, 923829, 878697, 835002, 793527, 755462, 721477, 691114, 663371, 637708, 614234, 593124, 574243, 557285, 541842, 527333, 513325, 500141, 488776, 479841, 472705, 465990, 458912, 452004, 446493, 443134, 441643, 441127, 440911, 440911, 441267, 441824, 442140, 441962, 441458, 440963, 440644, 440490, 440500, 440762, 441470, 442966, 445689, 449887, 455366, 461662, 468543, 476344, 485759, 497309, 511022, 526615, 543900, 562954, 583996, 607305, 633250, 662064, 693352, 726065, 759321, 793228, 828545, 865435, 902756, 938592, 971375, 1000504, 1026093, 1048197, 1066207, 1079167, 1086811, 1090035, 1090042, 1087357, 1082318, 1076333, 1071714, 1070036, 1071361, 1075434, 1082909, 1094762, 1111074, 1131151, 1154598, 1181606, 1212245, 1245985]
62479A245985L5753L6046L3940K9380K3231J6541R767K817m672j3232k2984l2863
62467A359709m1130m7077n1563n5478n8457n9762n9533n8333n6046n2325m7696
62456G72309m3174l9005l4745l0496k6962k4174k1187j7476j3816j1292r922q776
62444D91284p105m914k672p82N70J286J268O60Q7K40R91J364P04m81j318j781
62428D79401k426l277l786l838l954m372m646m423l968l691l638l711l885m012
62414D25774l820l407l285l676m131m092l469k489j405n94m40p61p12K82J707
62399C95482K467K051R71J41Q1N93J086J209J273J816K734L244K849K011J629
62384D19637K017K775L431L971M683N715O774P416P646Q112R270J0617J1196J0925
$$ y = [1245985, 1281738, 1317784, 1351724, 1381104, 1404335, 1420876, 1430643, 1433460, 1428788, 1415556, 1392572, 1359709, 1318579, 1271502, 1219939, 1164461, 1106004, 1046242, 986709, 928376, 872330, 820005, 772309, 729135, 690130, 655385, 624889, 597927, 573753, 552566, 535090, 521274, 509982, 500060, 491284, 484179, 479265, 476593, 475811, 476381, 477667, 478935, 479595, 479682, 479922, 480913, 482277, 482981, 482500, 481182, 479401, 476975, 473698, 469912, 466074, 462120, 457748, 453102, 448679, 444711, 441020, 437382, 433671, 429786, 425774, 421954, 418547, 415262, 411586, 407455, 403363, 399894, 397405, 396000, 395406, 394966, 394205, 393493, 393775, 395482, 397949, 400000, 400971, 401112, 401193, 401786, 402872, 404081, 405354, 407170, 409904, 413148, 415997, 418008, 419637, 421654, 424429, 427860, 431831, 436514, 442229, 449003, 456419, 464065, 472177, 481447, 492064, 503260, 514185]
62370E14185J0753J1327J2216J2842J3558J5190J7822K0728K3353K5775K8295
62359G06044L1117L4463L8521M3079M7511N1148N3523N4361N3574N1303M7602
62348A212246M2217L5029K6717J8537J1251M609j973q483j4396j9405k3809k8116
62336A254424l2501l6636l9867m1538m1386l9818l7709l5729l3859l1700k9182
62325H54499k6698k4548k2660k1042k0087j9968k0069j9550j8451j7545j7117
62314F26764j6572j5503j4406j3804j3252j1950j0053q635q303q477q193p126
62302D90490n623m176l075k375j918j465r19l06L53J004J436J496J493J915K701
62287D81031L172K987K717L092L974M624M746M695M669M458M115M161M760N299
$$ y = [514185, 524938, 536265, 548481, 561323, 574881, 590071, 607893, 628621, 651974, 677749, 706044, 737161, 771624, 810145, 853224, 900735, 951883, 1005406, 1059767, 1113341, 1164644, 1212246, 1254463, 1289492, 1316209, 1334746, 1345997, 1350606, 1348633, 1340150, 1325754, 1306349, 1282540, 1254424, 1221923, 1185287, 1145420, 1103882, 1062496, 1022678, 984969, 949240, 915381, 883681, 854499, 827801, 803253, 780593, 759551, 739464, 719496, 699427, 679877, 661426, 643881, 626764, 610192, 594689, 580283, 566479, 553227, 541277, 531224, 522589, 514286, 505809, 497616, 490490, 484867, 480691, 477616, 475241, 473323, 471858, 470939, 470633, 470986, 471990, 473426, 474922, 476415, 478330, 481031, 484203, 487190, 489907, 492999, 496973, 501597, 506343, 511038, 515707, 520165, 524280, 528441, 533201, 538500]
62273E38500N359N545O609Q173R218R707J0651J2509J4502J5999J7593K0101K3240
62260F97706K6140K8748L1850L5864M0377M4781M8685N1702N3494N4059N3457
62249A166863N1268M6858M0268L2288K3704J4951O465j400q842j6314k3622k9903
62237A302584l4733l8527m1650m3856m4958m5326m5174m4001m1350l7660l3789
62226H51560l0052k6356k2934k0215j8144j6218j4227j2418j0988r815q734p727
62214F53732o953o734p368q585r439r169q054p021o565o445o354o291o191n680
62200E52883m446k655p55R01K189L073L577L861M240M950N861O570O920P282P984
62185F02435Q701Q899Q779R138J0136J0891J0626R680Q867Q377P818P004O169
$$ y = [538500, 543859, 549404, 556013, 564186, 573404, 583111, 593762, 606271, 620773, 636772, 654365, 674466, 697706, 723846, 752594, 784444, 820308, 860685, 905466, 954151, 1005853, 1059347, 1113406, 1166863, 1218131, 1264989, 1305257, 1337545, 1361249, 1376200, 1382665, 1381265, 1372423, 1356109, 1332487, 1302584, 1267851, 1229324, 1187674, 1143818, 1098860, 1053534, 1008360, 964359, 923009, 885349, 851560, 821508, 795152, 772218, 752003, 733859, 717641, 703414, 690996, 680008, 670193, 661459, 653732, 646779, 640045, 632677, 624092, 614653, 605484, 597430, 590409, 583844, 577399, 571045, 564754, 558563, 552883, 548437, 545782, 545027, 545928, 548117, 551190, 554767, 558628, 562868, 567818, 573679, 580249, 587169, 594451, 602435, 611136, 620035, 628814, 637952, 648088, 658979, 669605, 679285, 688152, 696529, 704347, 711351, 717520]
62172G17520N642N849P336J0276J4073J7936K1659K5461K9308L2877L5971L8454
62160I62362L9886L9715L7683L3745K7984K1035J4181Q376L381j554o550j1326
62148A168918j6029k0914k5398k8541l0397l1854l3078l3225l1933l0026k8283
62137H59240k6443k3944k0877j7704j4651j1931r916q573p230n440l574k110q87
62124G05960M48J750K729L594M806O477Q452J0635J2742J4148J4420J3701J2174
62111H12036R693O458L500J717Q30k3r49j403j382j571k304l206l953m637n217
62096H09589n199m222k489m34J673L597N111O229P179Q033Q683R290J0276J1711
62082H69027J3030J3626J3564J3485J3969J5079J6393J7412J8035J8660J9614
$$ y = [717520, 723162, 729011, 736347, 746623, 760696, 778632, 800291, 825752, 855060, 887937, 923908, 962362, 1002248, 1041963, 1079646, 1113391, 1141375, 1162410, 1176591, 1184967, 1188348, 1186794, 1180244, 1168918, 1152889, 1131975, 1106577, 1078036, 1047639, 1015785, 982707, 949482, 917549, 887523, 859240, 832797, 808853, 787976, 770272, 755621, 743690, 733774, 725201, 717971, 712531, 708957, 706847, 705960, 706408, 708158, 710887, 714481, 719287, 725764, 734216, 744851, 757593, 771741, 786161, 799862, 812036, 821729, 828187, 831687, 833404, 834234, 834211, 833262, 831859, 830477, 828906, 826602, 823396, 819443, 814806, 809589, 804390, 800168, 797679, 797245, 798918, 802515, 807626, 813855, 821034, 829067, 837750, 847040, 857316, 869027, 882057, 895683, 909247, 922732, 936701, 951780, 968173, 985585, 1003620, 1022280, 1041894]
62071A041894K0654K1242K1243K1002K0855K0904K1232K1925K2780K3427K3813
62060A280971K4155K4264K3260K0298J5449R713M287j79l899p569j1604j5741
62048A363405j9539k3088k6800l0667l4170l6915l8850l9869l9837l9094l8319
62037I96257l7600l6266l3952l1258k8892k6742k4297k1613j9184j7177j5394
62026G03882j3814j2613j1706j0790r765q744p852p307p487q406r361r677r550
62013E76810r512r323q167o007l834k402j421l54P41J629K597M077N901P416Q260
61998E66411Q613Q705Q399P317N375L134J483O83q1j786m250o273p141p342p639
61983E75608q134q663r390j0381j0989j0442q854p164o148n850n800n418m465
$$ y = [1041894, 1062548, 1083790, 1105033, 1126035, 1146890, 1167794, 1189026, 1210951, 1233731, 1257158, 1280971, 1305126, 1329390, 1352650, 1372948, 1388397, 1398110, 1402397, 1402218, 1398319, 1390750, 1379146, 1363405, 1343866, 1320778, 1293978, 1263311, 1229141, 1192226, 1153376, 1113507, 1073670, 1034576, 996257, 958657, 922391, 888439, 857181, 828289, 801547, 777250, 755637, 736453, 719276, 703882, 690068, 677455, 665749, 654959, 645194, 636450, 628598, 621291, 613804, 605398, 596037, 586360, 576810, 567298, 557975, 549808, 543801, 539967, 537565, 536144, 535790, 536531, 538160, 540757, 544834, 550735, 558151, 566411, 575024, 583729, 592128, 599445, 604820, 607954, 609437, 610120, 610039, 608253, 604003, 597730, 590589, 583247, 575608, 567474, 558811, 549421, 539040, 528051, 517609, 508755, 501591, 495443, 489593, 483793, 478375, 473910]
61970D73910l396k993l265l206k105o25J14R0J33M60M60o8m46o5J006K498M180
61953D66682N441N556M836M676N858P535Q507Q852R482J0660J1904J3138J4921
61940E78048J7406J9824K1292K1703K1543K1224K0900K0632K0409K0014J9139
61929H02134J7726J6076J4506J2860J0625P616M377J582q14l366o150q429r540
61916H59203r617r214q514p243n181k404Q01M078P170J0041J2669J4696J5605
61903H82090J5386J4576J3459J1550Q248L687j279n721r007j1061j2540j4367
61891H95021j6675j8543j9184j8898j8392j7691j6395j4736j3484j2936j2759
61880G15328j2785j3197j3856j4260j4275j4263j4218j3496j1728r487p561o015
$$ y = [473910, 470514, 467521, 464256, 461050, 458945, 458320, 458434, 458524, 458657, 459117, 459577, 459509, 459063, 458998, 460004, 462502, 466682, 472123, 477679, 482515, 487191, 493049, 500584, 509091, 517943, 527425, 538085, 549989, 563127, 578048, 595454, 615278, 636570, 658273, 679816, 701040, 721940, 742572, 762981, 782995, 802134, 819860, 835936, 850442, 863302, 873927, 881543, 885920, 887502, 886688, 883322, 877172, 868743, 859203, 849586, 840372, 831858, 824615, 819434, 817030, 817831, 821909, 829079, 839120, 851789, 866485, 882090, 897476, 912052, 925511, 937061, 945309, 948996, 947717, 941996, 932989, 921928, 909388, 895021, 878346, 859803, 840619, 821721, 803329, 785638, 769243, 754507, 741023, 728087, 715328, 702543, 689346, 675490, 661230, 646955, 632692, 618474, 604978, 593250, 583763, 576202, 570187]
61868E70187m379k427l26J751L697N345O638P873R488J1573J3871J6171J8528
61855F57990K1050K3673K6179K8459L0606L2750L4763L6353L7423L8160L8564
61844A005970L8166L6513L3748L0292K6061K0545J3778O667J25n686j0894j5073
61832A180212j7388j7522j6024j3682j0842p520l841r4L645P498J1143J3438J3185
61819A142208J0393O349K195k243p805j4506k1238k6921l1385l4935l7487l8594
61807I46031l8161l6828l5455l4259l2664l0131k7091k4676k3407k2544k1028
61796F19787j8749j6442j4608j3127j1794j0676r792q992q266p846p829p918p628
61783D76120o644n032l372k463k527k818k445j472o92m47l15J3L32N26R71J937
$$ y = [570187, 565808, 563381, 563055, 564806, 568503, 573848, 580486, 588359, 597847, 609420, 623291, 639462, 657990, 679040, 702713, 728892, 757351, 787957, 820707, 855470, 891823, 929246, 967406, 1005970, 1044136, 1080649, 1114397, 1144689, 1170750, 1191295, 1205073, 1211740, 1211865, 1206179, 1195285, 1180212, 1162824, 1145302, 1129278, 1115596, 1104754, 1097234, 1093393, 1093299, 1096944, 1104442, 1115585, 1129023, 1142208, 1152601, 1158950, 1161145, 1158902, 1151097, 1136591, 1115353, 1088432, 1057047, 1022112, 984625, 946031, 907870, 871042, 835587, 801328, 768664, 738533, 711442, 686766, 663359, 640815, 619787, 601038, 584596, 569988, 556861, 545067, 534391, 524599, 515607, 507341, 499495, 491666, 483748, 476120, 469476, 464444, 461072, 458609, 456082, 453264, 450819, 449347, 448655, 448208, 447893, 447906, 448238, 448764, 449735, 451672]
61767D51672L130M097M638M661M165L639L878M977O049O363O306O665P402P786
61753E25428P458O729N901M887L521J847K0j730l049l659l643l403l320l537l888
61738E29562m010l708l302l291l604l561k813j855j296j049o79j58K93Q15J699
61723E03043K682L092K730K077J589J293J197J552K378L126L147K384J324L60
61709E31974n28j480k378k958l217l491l975m446m654m799n156n354m667l173
61695D81698j997k057k996l781l908l560k954k210j630j528j753j857j667j311
61681D48489q34l38l10j127k201k315j145J95M77j36m21L33J528K066J578P53
61665D46592N14J088J915K375K406K250J982J537J076R16J066J252J431J826K377
$$ y = [451672, 454802, 458899, 463537, 468198, 472363, 476002, 479880, 484857, 490906, 497269, 503575, 510240, 517642, 525428, 532886, 539615, 545516, 550403, 553924, 555771, 555791, 554061, 551012, 547353, 543710, 540307, 536987, 533450, 529562, 525552, 521844, 518542, 515251, 511647, 508086, 505273, 503418, 502122, 501073, 500394, 500236, 500529, 501344, 503043, 505725, 508817, 511547, 513624, 515213, 516506, 517703, 519255, 521633, 524759, 527906, 530290, 531614, 531974, 531446, 529966, 527588, 524630, 521413, 517922, 513947, 509501, 504847, 500048, 494892, 489538, 484871, 481698, 479701, 477644, 474648, 470867, 466959, 463399, 460445, 458235, 456605, 455077, 453324, 451467, 449800, 448489, 447655, 447317, 447007, 445880, 443679, 441364, 440219, 440414, 440891, 440755, 440334, 440667, 442195, 444261, 445839, 446592, 447106, 448194, 450109, 452484, 454890, 457140, 459122, 460659, 461735, 462651, 463717, 464969, 466400, 468226, 470603]
61650D70603K547K094J640J995L039L729L412K664K518L112L554L161K347J942
61636E08357K011J794P76o86j919k681l137l391l329k941k531k584l311m297m718
61621D77413m171l149k367j800r42O0K95n93j750k231k157k208k535k844l199
61606D47822l858m620n071n364o006o877p229o726n829n037m422m002l946m120
61592C74715m084l827l897m479m837m248l049k222k157k362k318k074j928j890
61578C31343j762j555j513j703j743j238l99O8k12q45j242j313j290j197r46p12
61562C13741o94o09o5O93R76O70L86M15L01k91q52p49j17M25P17J041J460J657
61544C19105J450R61L43k69n05L2J182K194K485K242K052K141K271K253K223K259
$$ y = [470603, 473150, 475244, 476884, 478879, 481918, 485647, 489059, 491723, 494241, 497353, 500907, 504068, 506415, 508357, 510368, 512162, 512938, 512252, 510333, 507652, 504515, 501124, 497795, 494854, 492323, 489739, 486428, 482131, 477413, 473242, 470093, 467726, 465926, 464984, 465044, 465339, 464746, 462996, 460765, 458608, 456400, 453865, 451021, 447822, 443964, 439344, 434273, 428909, 422903, 416026, 408797, 402071, 396242, 391205, 386783, 382781, 378835, 374715, 370631, 366804, 362907, 358428, 353591, 349343, 346294, 344072, 341915, 339553, 337235, 335161, 333233, 331343, 329581, 328026, 326513, 324810, 323067, 321829, 321430, 321498, 321286, 320441, 319199, 317886, 316596, 315399, 314453, 313741, 313047, 312438, 312373, 313066, 314042, 314712, 315098, 315513, 315814, 315523, 314671, 313922, 313805, 314230, 314947, 315988, 317448, 319105, 320555, 321516, 321859, 321590, 321085, 321117, 322299, 324493, 326978, 329220, 331272, 333413, 335684, 337937, 340160, 342419]
61528C42419K086J406M06l59o27p03r95j534k009k104j698j005n80q44j475j649
61512C30735j114n40n04o48l98j2j82q17j103o88q0K56M58P28R42R99R86Q43M05
61493C30266nL07J347K148J947J165O80O61N89J51m11o92m38L03J102J436J342
61476C41898J408J869K115J536M40l08l44KK74K18k23p71q86m20N1n1n12p50p48
61457C44798r22j258j266p76j50L30O88Q57O45K74L53J061J819K085K037K172
61441C52747K545K782K699K598K973L913M811M830L914L111L436M492M831L719
61427D03401J986R39J007J759K671L367L566L375L382L901M325L785K277O09o27
61412D39723j393j667j336q66j225k711m332m906m418l743l395l209l032k990
$$ y = [342419, 344505, 345911, 346317, 345958, 345331, 344628, 343633, 342099, 340090, 337986, 336288, 335283, 334703, 333859, 332384, 330735, 329621, 329081, 328577, 327929, 327531, 327519, 327337, 326520, 325417, 324729, 324649, 324905, 325363, 326091, 327033, 328032, 329018, 329861, 330266, 330261, 330568, 331915, 334063, 336010, 337175, 337855, 338516, 339105, 339256, 338845, 338153, 337715, 338018, 339120, 340556, 341898, 343306, 345175, 347290, 348826, 349266, 348958, 348614, 348616, 348890, 349108, 348885, 348114, 347228, 346808, 346859, 346808, 346296, 345546, 344798, 343876, 342618, 341352, 340576, 340426, 340756, 341444, 342301, 342946, 343220, 343573, 344634, 346453, 348538, 350575, 352747, 355292, 358074, 360773, 363371, 366344, 370257, 375068, 379898, 383812, 386923, 390359, 394851, 399682, 403401, 405387, 406326, 407333, 409092, 411763, 415130, 418696, 422071, 425453, 429354, 433679, 437464, 439741, 440350, 439723, 438330, 436663, 435327, 434461, 433236, 430525, 426193, 421287, 416869, 413126, 409731, 406522, 403490, 400500]
61398D00500k988k629j886j297j268j628k142k882l669l723k505o27P52J264J401
61383C76673J485J316R19Q75J552K569L344L680L586L045K338K082K544L196L427
61368D12631L255L018K742K340K049K074K105J816J555J873K573K982L103L660
61354D47776M938O401P661Q988J0470J1476J1465J0777J0012R130P838O474N735
61341E59141N609N288M203K729J700J550K018K360J923P28n52j381k021l049m367
61326E75879n216n093m256l200k177j435j314j740k000j462l61N80J122J672K511
61311E53510L351L852M164M700N535O344O840P097P400P803P886O945M608J335
61297F31370j821m102n681p178q623r291q757p721p341p785p990p090n524m337
$$ y = [400500, 397512, 394883, 392997, 391700, 390432, 388804, 386662, 383780, 380111, 376388, 373883, 373256, 374008, 375272, 376673, 378158, 379474, 380393, 381268, 382820, 385389, 388733, 392413, 395999, 399044, 401382, 403464, 406008, 409204, 412631, 415886, 418904, 421646, 423986, 426035, 428109, 430214, 432030, 433585, 435458, 438031, 441013, 444116, 447776, 452714, 459115, 466776, 475764, 486234, 497710, 509175, 519952, 529964, 539094, 546932, 553406, 559141, 564750, 570038, 574241, 576970, 578670, 580220, 582238, 584598, 586521, 587249, 586697, 585316, 583295, 580246, 575879, 570663, 565570, 561314, 558114, 555937, 554502, 553188, 551448, 549448, 547986, 547625, 548205, 549327, 550999, 553510, 556861, 560713, 564877, 569577, 575112, 581456, 588296, 595393, 602793, 610596, 618482, 625427, 630035, 631370, 629549, 625447, 619766, 612588, 603965, 594674, 585917, 578196, 570855, 563070, 555080, 547990, 542466, 538129]
61283E38129l737l007j759n15J35L79P60J406K165L213M819O631P763P797P227
61268E71406O795O743O930P301P914Q686R456J0208J1025J1900J2666J3119J3108
61255F97257J2555J1478R938Q026N978M214K922J617m23l120n391o355o444o767
61241G25485p635q262q005p273o951p267p672p619p138o598o210n825n085l763
61227F30182k074o26P2J49K19N96Q77N55j02k70L09Q77O61Kn4Q56J947K246J584
61208F38006M95m75j105j353j183n52M68J582K480L322M837P484J0644J3186J4815
61193F92651J6217J7752J8635J7831J5270J1810Q408N672L841K702J827J104O97
61180H14417K97q59k804m349m547m049m222n333o491p041p077o812o449o577p615
$$ y = [538129, 534392, 531385, 529626, 529111, 529246, 529625, 530385, 531791, 533956, 537169, 541988, 548619, 556382, 564179, 571406, 578201, 584944, 591874, 599175, 607089, 615775, 625231, 635439, 646464, 658364, 671030, 684149, 697257, 709812, 721290, 731228, 739254, 745232, 749446, 752368, 753985, 753562, 750442, 745051, 738696, 732252, 725485, 717850, 709588, 701583, 694310, 687359, 680092, 672420, 664801, 657663, 651065, 644855, 639030, 633945, 630182, 628108, 627482, 627554, 627703, 627922, 628518, 629395, 629950, 629848, 629578, 629887, 630764, 631425, 631427, 631373, 632229, 634176, 636422, 638006, 638501, 638026, 636921, 635568, 634385, 633833, 634301, 635883, 638363, 641685, 646522, 654006, 664650, 677836, 692651, 708868, 726620, 745255, 763086, 778356, 790166, 798574, 804246, 808087, 810789, 812616, 813720, 814417, 814714, 813855, 811051, 806702, 802155, 798106, 793884, 788551, 782060, 775019, 767942, 761130, 754681, 748104, 740489]
61165G40489q927r411r130r247j0204j1042j0911j0200r609r034q024o631n105
61152F23014l340j256P56K292L407M066L786K354L64j575l581n782p541q291q616
61137F00057r378j0158r723p922n913m437l024j213N64J856K968M287N499O287
61123E69750P135Q700J0714J2360J3439J4424J5495J6329J6853J7456J8229J8677
61111G39561J8507J8163J8151J8295J8050J7255J6135J4771J3067J1048Q786O112
61099I17901K895m80l459o104q920j1880j4234j5620j6665j8065j9520k0200j9876
61086G65773j9008j7933j6600j5118j3921j3234j2765j2101j1182j0257r504q759
61074F05391p630n929m043k686k179k157k060j637q62K15J323K030K258K435K872
$$ y = [740489, 731562, 722151, 713021, 703774, 693570, 682528, 671617, 661417, 651808, 642774, 634750, 628119, 623014, 619674, 618418, 619174, 621466, 624873, 628939, 632725, 635079, 635443, 633868, 630287, 624505, 616964, 608673, 600057, 590679, 580521, 570798, 562876, 556963, 552526, 549502, 548289, 548853, 550709, 553677, 557964, 563463, 569750, 576885, 585585, 596299, 608659, 622098, 636522, 652017, 668346, 685199, 702655, 720884, 739561, 758068, 776231, 794382, 812677, 830727, 847982, 864117, 878888, 891955, 903003, 911789, 917901, 920796, 920316, 916857, 910753, 901833, 889953, 875719, 860099, 843434, 825369, 805849, 785649, 765773, 746765, 728832, 712232, 697114, 683193, 669959, 657194, 645093, 633911, 623654, 614150, 605391, 597761, 591832, 587789, 585103, 582924, 580767, 578707, 577070, 576208, 576423, 577746, 579776, 582034, 584469, 587341]
61059E87341L476M187N188O319P003P248P969R625J1323J2144J2660J4003J5958
61046G04444J7341J7972J8850K0473K2250K3663K4810K5613K5788K5816K6781
61035I53801K8856L0938L2132L2654L3097L3848L5471L8461M2194M5209M6970
61024A353631M8321M9953N1557N2977N4924N8053O2490O8766P7878Q9799J03256
61013B071605J17627J33803J52574J73821J98131K27622K64087L07756L58814
61004D005840M18532M88193N69469O67181P88902R40273J124188J345171J603528
60995A1951277J871072K073934K118225J950619J597755J145115O83751K83369
60987B3675117K727j08378m5234J15254K36542K00665k6451l97470q33791j264095
$$ y = [587341, 590817, 595004, 600192, 606511, 613514, 620762, 628731, 638356, 649679, 661823, 674483, 688486, 704444, 721785, 739757, 758607, 779080, 801330, 824993, 849803, 875416, 901204, 927020, 953801, 982657, 1013595, 1045727, 1078381, 1111478, 1145326, 1180797, 1219258, 1261452, 1306661, 1353631, 1401952, 1451905, 1503462, 1556439, 1611363, 1669416, 1731906, 1800672, 1878550, 1968349, 2071605, 2189232, 2323035, 2475609, 2649430, 2847561, 3075183, 3339270, 3647026, 4005840, 4424372, 4912565, 5482034, 6149215, 6938117, 7878390, 9002578, 10347749, 11951277, 13822349, 15896283, 18014508, 19965127, 21562882, 22707997, 23391748, 23675117, 23677844, 23569466, 23524232, 23639486, 23876028, 24076693, 24050242, 23652772, 22818981, 21554886]
60977B1554886j628402j875315j976115j940506j809013j627329j428529j232861
60969H036816j052687q93186p53301o30745n25387m37290l64465l04454k56103
60960B819198k18136j87838j62752j42228j25858j11827r8329q5381p3798o3443
60950A549608n3924m5953m0428l6818l3853l1286k9686k8914k8030k6508k4597
60939A169611k2664k0915j9469j8075j6117j3482j0937r124p691o052m354k941
60927A017790j477N95L151N750Q380J1068J3233J4291J4542J4599J4303J3081
60915A129306J1157R456Q344P242N464K841m89m256p985j1170j3656j5563j6998
60902A103693j8062j8999j9983k0914k1658k2251k2658k2655k2188k1505k0726
$$ y = [21554886, 19926484, 18051169, 16075054, 14134548, 12325535, 10698206, 9269677, 8036816, 6984129, 6090943, 5337642, 4706897, 4181510, 3744220, 3379755, 3075301, 2819198, 2601062, 2413224, 2250472, 2108244, 1982386, 1870559, 1772230, 1686849, 1613051, 1549608, 1495684, 1449731, 1409303, 1372485, 1338632, 1307346, 1277660, 1248746, 1220716, 1194208, 1169611, 1146947, 1126032, 1106563, 1088488, 1072371, 1058889, 1047952, 1038828, 1031137, 1025085, 1020731, 1017790, 1016313, 1016908, 1020059, 1025809, 1034189, 1045257, 1058490, 1072781, 1087323, 1101922, 1116225, 1129306, 1140463, 1149919, 1158263, 1165505, 1170969, 1173810, 1173321, 1169065, 1161080, 1149910, 1136254, 1120691, 1103693, 1085631, 1066632, 1046649, 1025735, 1004077, 981826, 959168, 936513, 914325, 892820, 872094]
60891H72094j9668j8338j7166j6438j5920j5285j4481j3474j2185j1035j0845
60880G07259j1758j2818j3067j2490j1464j0073q535p607p699q100p852o989o175
60867E82632n582m995m639m978n812o365o217n552m651l722l059k778k549k133
60853E19600j941k468l413l953l759l203k716k467k478k519k125j353j140k288
60839D83777m303n942o696p024p260p179o598n667m465l043j892j582j791j366
60825D18969K41K174L186L078K663K584K627K319J815J786K377K760K137R22K43
60810D49881L75M69o6p80j143j356j620j445n97M0m67j647k315k283k358k778
60794D31910k911k518k258k577k971k838k391k356l011l915m404m206l665l299
$$ y = [872094, 852426, 834088, 816922, 800484, 784564, 769279, 754798, 741324, 729139, 718104, 707259, 695501, 682683, 669616, 657126, 645662, 635589, 627054, 619447, 611748, 603648, 595796, 588807, 582632, 577050, 572055, 567416, 562438, 556626, 550261, 544044, 538492, 533841, 530119, 527060, 524282, 521733, 519600, 517659, 515191, 511778, 507825, 504066, 500863, 498147, 495680, 493202, 490683, 488558, 487205, 486065, 483777, 479474, 473532, 466836, 459812, 452552, 445373, 438775, 433108, 428643, 425600, 423708, 422126, 420335, 418969, 419210, 421384, 424570, 427648, 430311, 432895, 435522, 437841, 439656, 441442, 443819, 446579, 448716, 449638, 449881, 450256, 450725, 450659, 449879, 448736, 447380, 445760, 444315, 443718, 443758, 443291, 441644, 439329, 437046, 434688, 431910, 428999, 426481, 424223, 421646, 418675, 415837, 413446, 411090, 408079, 404164, 399760, 395554, 391889, 388590]
60780C88590l192k989k625k518k820k990k568j918j663j814j973j931j545n36
60766C57508R30J988K131J985K309K730K518K007K165K987L593L629L502L314
60752C93296K770K123K010K346K457K365K753L547L753K973J884R38k43j777l029
60737D18166l746m595n894o828o636n772n154n012n079n230n274m748l610k521
60723C48067j928j448p53l54p96j642k009j717j222p92m17k67n58j124j545j553
60707C29942j053j20P59R27L72j06J8L38L52L46Q37J632K129K182J976J491P57
60690C42779L70R54K194L142L404L395L512L660L698L747L936M164M325M490M777
60675C92547N172N447N249M445L458K943K931K665J590J44q28j136j335j883k697
$$ y = [388590, 385398, 382409, 379784, 377266, 374446, 371456, 368888, 366970, 365307, 363493, 361520, 359589, 358044, 357508, 358438, 360426, 362557, 364542, 366851, 369581, 372099, 374106, 376271, 379258, 382851, 386480, 389982, 393296, 396066, 398189, 400199, 402545, 405002, 407367, 410120, 413667, 417420, 420393, 422277, 423215, 422972, 421195, 418166, 414420, 409825, 403931, 397103, 390467, 384695, 379541, 374529, 369450, 364220, 358946, 354198, 350588, 348067, 346139, 344691, 343938, 343584, 342788, 341146, 339137, 337420, 336198, 335406, 334989, 334722, 334164, 333040, 331495, 329942, 328889, 328769, 329528, 330455, 330827, 330721, 330739, 331077, 331429, 331775, 332612, 334244, 336373, 338555, 340531, 342022, 342779, 343149, 344103, 346297, 349439, 352843, 356238, 359750, 363410, 367108, 370855, 374791, 378955, 383280, 387770, 392547, 397719, 403166, 408415, 412860, 416318, 419261, 422192, 424857, 426447, 426591, 425763, 424627, 423292, 421409, 418712]
60660D18712l416l758l640l222k782k395j923j439j314j606j727j095J02J161
60646C91658J595J321M13q55j952k568l043l829m712m994m408l421k633k204j917
60631C58451j540j074p73q20r26n68J86N42M5o38n36L22J056J166R20O26K77O7
60613C56783M76J495K270J989Q84pLN79P78R9r54j417j025n14n82q81n47N26J571
60594C61526K036K129K166K049J667J259J000P21L60K33M11L44k94q48m75N62
60578C74846J217J200J313K051K778K788K458K659L465M219M660N201O138P205
60564D22198Q150R138J0216J0832J0256Q428O106M159K754J217j147l901n440
60551D82966m625k310n41k09k57N30J933L046L893N308P545R974J2044J3776J5226
$$ y = [418712, 415296, 411538, 407898, 404676, 401894, 399499, 397576, 396137, 394823, 393217, 391490, 390395, 390497, 391658, 393253, 394574, 394987, 394132, 392180, 389612, 386569, 382740, 378028, 373034, 368626, 365205, 362572, 360368, 358451, 356911, 355837, 355064, 354244, 353318, 352750, 352936, 353478, 353523, 352885, 352349, 352671, 353727, 354893, 355813, 356439, 356716, 356783, 357259, 358754, 361024, 363013, 363897, 363890, 363893, 364472, 365250, 365349, 364395, 362978, 361953, 361439, 360857, 359976, 359429, 359955, 361526, 363562, 365691, 367857, 369906, 371573, 372832, 373832, 374553, 374913, 375146, 375557, 375901, 375607, 374759, 374284, 374846, 376063, 377263, 378576, 380627, 383405, 386193, 388651, 391310, 394775, 398994, 403654, 408855, 414993, 422198, 430348, 439486, 449702, 460534, 470790, 479218, 485324, 489483, 492237, 493454, 492307, 488406, 482966, 478341, 476031, 475490, 475281, 475024, 475554, 477487, 480533, 484426, 489734, 497279, 507253, 519297, 533073, 548299]
60536E48299J6100J6103J5229J3645J1614R479P318M757J620j513l892n599p184
60523F25976q485q710p817o895o746o866o340n150m009l248k460j104Q52K802
60509E61800L957M125M123M963O651Q288R432J0696J2780J5614J8891K2695K7003
60496G11018L1116L4342L6909L9490M2037M3741M4028M2862M0197L5735K9376
60485A130851K1369J1882R41j1017k2842l3219m1312m6790m9542m9728m8042m5556
60473H16995m3016m0297l6734l2197k7585k4040k1741j9878j7779j5606j3762
60462E24360j2155j0471q881p937p750p682p072n985n130n020n397n490m877l888
60448D26625l133k802k612k313j881j339o78o7K08J29%J6j1l38q57j135q63k54
$$ y = [548299, 564399, 580502, 595731, 609376, 620990, 630469, 637787, 642544, 644164, 642651, 638759, 633160, 625976, 617491, 608781, 600964, 594069, 587323, 580457, 574117, 568967, 564958, 561710, 559250, 558146, 558998, 561800, 565757, 569882, 574005, 578968, 585619, 593907, 603339, 614035, 626815, 642429, 661320, 684015, 711018, 742134, 776476, 813385, 852875, 894912, 938653, 982681, 1025543, 1065740, 1101475, 1130851, 1152220, 1164102, 1165043, 1154026, 1131184, 1097965, 1056653, 1009863, 960321, 910593, 862551, 816995, 773979, 733682, 696948, 664751, 637166, 613126, 591385, 571507, 553728, 538122, 524360, 512205, 501734, 492853, 484916, 477166, 469484, 462412, 456427, 451297, 446277, 440880, 435390, 430513, 426625, 423492, 420690, 418078, 415765, 413884, 412545, 411867, 411800, 412008, 412137, 412137, 412153, 412142, 411804, 410947, 409812, 408949, 408695]
60430D08695O9k80q20n64P56K102K198J008l47r33p48k40K46M73L29M5N3M70J044
60411D13556J551J870J760J111L62J61N34R45J067R85P27K89J04O54J602K106
60395D29384K089K282K891L217K899K553K673K800K392J764J546J801K225K615
60381D63131K732K294J553J204J389J541J529J994K989L464K826K000J981K249
60367D92876J801R09O18J055J522J848K381K940K973K641K633L016L323L572M243
60352E28351N289O158O774P494Q192Q378Q177Q191Q266P476N458K906N46j508
60338F10148l250m514n440o386p204p339o859o511o517o200n218m342m396n069
60324E30903n383m947m166l488k982k508j999j516j133p25M7J334K828M150N330
$$ y = [408695, 408764, 408484, 407664, 407100, 407856, 409958, 412156, 413164, 412817, 411884, 411136, 410896, 411142, 411615, 411944, 411989, 412042, 412512, 413556, 415107, 416977, 418737, 419848, 420210, 420371, 420905, 421850, 422917, 423902, 424629, 424918, 425022, 425676, 427278, 429384, 431473, 433755, 436646, 439863, 442762, 445315, 447988, 450788, 453180, 454944, 456490, 458291, 460516, 463131, 465863, 468157, 469710, 470914, 472303, 473844, 475373, 477367, 480356, 483820, 486646, 488646, 490627, 492876, 494677, 495586, 496204, 497259, 498781, 500629, 503010, 505950, 508923, 511564, 514197, 517213, 520536, 524108, 528351, 533640, 539798, 546572, 554066, 562258, 570636, 578813, 587004, 595270, 602746, 608204, 611110, 611656, 610148, 606898, 602384, 596944, 590558, 583354, 576015, 569156, 562645, 556128, 549928, 544710, 540368, 535972, 530903, 525520, 520573, 516407, 512919, 509937, 507429, 505430, 503914, 502781, 502056, 502103, 503437, 506265, 510415, 515745]
60309E15745O483P379P881Q601J0395J3198J5972J7909J9014J9419J8856J7043
60297F77895J4048J0027N102k67n326r650j3304j6138j7489j6996j5374j3921
60285E98607j3315j3135j2490j0974r019p374o348n679n085m633m467m571m940
60272D96577n496n666m716k981j982k592l709l663k432j309q72n16K8J33n09j218
60256D59077j298q85m06LK28Q6j83N1Q96J671J779J333P64M20O28J425K121J859
60238D69569Q31R0K0r5o12p40K48J770K731K873K720K661K759L084L555L762L456
60221D98682K973K816L049L424L736L806L551L372L989N441O789P223P057P089
60207E62997P418P536P298P076P027O751N888M641L593L083K947K825K623K459
$$ y = [515745, 522228, 529607, 537488, 546089, 556484, 569682, 585654, 603563, 622577, 641996, 660852, 677895, 691943, 701970, 707072, 706805, 701479, 691829, 678525, 662387, 644898, 627902, 612528, 598607, 585292, 572157, 559667, 548693, 539674, 532300, 525952, 520273, 515188, 510555, 506088, 501517, 496577, 491081, 485415, 480699, 477718, 475736, 473144, 469435, 465772, 463340, 462031, 461159, 460643, 460671, 460804, 460295, 459077, 457779, 456894, 456488, 456491, 456719, 456805, 456622, 456673, 457569, 459240, 461019, 462352, 463116, 463536, 464164, 465589, 467710, 469569, 470400, 470490, 470510, 470415, 469803, 469063, 469311, 471081, 473812, 476685, 479405, 482066, 484825, 487909, 491464, 495226, 498682, 501655, 504471, 507520, 510944, 514680, 518486, 522037, 525409, 529398, 534839, 541628, 548851, 555908, 562997, 570415, 577951, 585249, 592325, 599352, 606103, 611991, 616632, 620225, 623308, 626255, 629080, 631703, 634162]
60193F34162K150J220k84j474j693j591k357m074n683o450o545o174n261m206
60179E91740l882m333m505l808l039l082l552l522k885k167j555r73o89r75j488
60164E51285j688j623j629j604j231p09n28p13q79q70p59m06L65J284J872K067
60148E44234K142K114J757J112N27K66M28J096K168L169L717M021M554N300N748
60133E82353N559M874M066L480L322L464L501L192K756K486K364K244K148K063
60119F27872J800J415J431K210L361M145M240L678K457P74n70q17k49mp07j775
60103F49261k255j988j679k015k925l739m017l989m045m017l359k056p80j1M49
60088F12835Q50R22L75m43q69o86k13J18p1r90k361l486m000m279m785n355n561
$$ y = [634162, 636312, 637532, 637248, 635774, 634081, 632490, 630133, 626059, 620376, 613926, 607381, 601207, 595946, 591740, 587858, 583525, 579020, 575212, 572173, 569091, 565539, 562017, 559132, 556965, 555410, 554437, 553748, 552773, 551285, 549597, 547974, 546345, 544741, 543510, 542801, 542273, 541560, 540681, 539811, 539052, 538646, 539011, 540295, 542167, 544234, 546376, 548490, 550247, 551359, 551886, 552152, 552580, 553676, 555844, 559013, 562730, 566751, 571305, 576605, 582353, 587912, 592786, 596852, 600332, 603654, 607118, 610619, 613811, 616567, 619053, 621417, 623661, 625809, 627872, 629672, 631087, 632518, 634728, 638089, 642234, 646474, 650152, 652609, 653383, 652813, 651996, 651747, 651743, 651036, 649261, 647006, 645018, 643339, 641324, 638399, 634660, 630643, 626654, 622609, 618592, 615233, 613177, 612397, 612386, 612835, 613685, 614607, 614982, 614539, 613670, 612984, 612771, 612889, 612818, 611828, 609467, 605981, 601981, 597702, 592917, 587562, 582001]
60071E82001n401n145m775m149l483l161l194l339l567l946m221m069l678l615
60057E26258l998m249l701k270n64N87Q04N34N96J258K083K776L615M694N353
60042E33776M989M075L674M068M484M159L162K173J737J774J526K01k088m232
60028E63478n255n307n230n502n997o447o592o118n023l955l661m117m621m625
60014D91028m114l347k652k392k633k901k643j887j165q55r06j094j191j018o34
59999D61596l55l71n56q36j345j883j723m64J239K407K919L317L760L929L781
59984D75415L674L648L278K416J483Q92N84K99o4m99j016j552k006k386k712k857
59968D78597k679k266j822j403r39m48L0N42J059J388J384J061M24m87j181r72
$$ y = [582001, 576600, 571455, 566680, 562531, 559048, 555887, 552693, 549354, 545787, 541841, 537620, 533551, 529873, 526258, 522260, 518011, 514310, 512040, 511476, 512063, 512867, 513401, 513997, 515255, 517338, 520114, 523729, 528423, 533776, 538765, 542840, 546514, 550582, 555066, 559225, 562387, 564560, 566297, 568071, 569597, 569798, 567710, 563478, 558223, 552916, 547686, 542184, 536187, 529740, 523148, 517030, 512007, 508052, 504391, 500274, 495653, 491028, 486914, 483567, 480915, 478523, 475890, 472989, 470346, 468459, 467294, 466439, 465533, 464439, 463248, 462230, 461596, 461241, 460870, 460314, 459478, 458133, 456250, 454527, 454063, 455302, 457709, 460628, 463945, 467705, 471634, 475415, 479089, 482737, 486015, 488431, 489914, 490806, 491390, 491689, 491625, 491126, 490110, 488558, 486552, 484166, 481454, 478597, 475918, 473652, 471830, 470427, 469488, 469040, 469070, 469612, 470671, 472059, 473443, 474504, 474928, 474441, 473260, 472288]
59952D72288M2Q48P99N05P87J295J058M1p48o68r6L28L84O6n67j198j370j074
59934D72720p83q13r49p83j37Q58J848K520K997L777N034O168O458N952N344N232
59918E15443N877P336R232J0600J0630R559Q315P385O480N214L573J770Q5j131
59904F00368j750k095k532k922k863k378j988k162k890l657l689k638j182m91
59890E67131p94j032l64P29J403J765K413L257L713L707L652L736L986M623N536
59875F03461N867N046L802L171K919K051N35p14j340j841k425k773k903l149l289
59860F08418k807k006j715j914j793j189p42n87j72M64O64O29J525L680N931P308
59844F15694Q028Q307P509N302K604M88r17j747j610m00R49J421J037K98q23k549
$$ y = [472288, 472330, 473178, 473977, 474482, 475269, 476564, 477622, 477663, 476915, 476247, 476151, 476479, 476863, 476929, 476362, 475164, 473794, 472720, 471937, 471124, 470175, 469392, 469255, 470113, 471961, 474481, 477478, 481255, 486289, 492457, 498915, 504867, 510211, 515443, 521320, 528656, 537888, 548488, 559118, 568677, 576992, 584377, 590857, 596071, 599644, 601414, 601499, 600368, 598618, 596523, 593991, 591069, 588206, 585828, 583840, 581678, 578788, 575131, 571442, 568804, 567622, 567131, 566337, 565305, 564941, 565670, 567073, 568838, 571251, 574508, 578221, 581928, 585580, 589316, 593302, 597925, 603461, 609328, 614374, 618176, 621347, 624266, 626317, 626852, 626138, 624798, 622957, 620532, 617759, 614856, 611707, 608418, 605611, 603605, 601890, 599976, 598183, 596994, 596252, 595665, 595493, 595957, 596621, 597250, 598775, 602455, 608386, 615694, 623722, 632029, 639538, 644840, 647444, 647932, 647015, 645268, 643658, 643258, 644207, 645628, 646665, 646963, 646140, 643591]
59828F43591m472n949o872p429p542p145o570o069n378m246k989k028j282m73
59814E75147L88J153J757J924J221k39j630k348k595k747k745k482k178j984j778
59799E60864j690k151l056l581l297k750k476k169j479r01j148k029k616k304
59785E29217j263k49o8q54j679j492n06J41J32J96N39M38m6M79K561M581M857
59768E36984L984L656M128M396M234M392M955N086M438L592L081K947L236L964
59754E93073M604M513L875L394L199K837K289J962J818J374O38J43L5j11m71p61
59738F22411r35j268j703j802j519j286j260j071n76j76j73l54m10l15j13K68
59722F09718P55J031Q90M86J41R2L22M91J94m91r25o22K45J332K687M325N684
$$ y = [643591, 639119, 633170, 626298, 618869, 611327, 604182, 597612, 591543, 586165, 581919, 578930, 576902, 575620, 575147, 575535, 576688, 578445, 580369, 581590, 581351, 579721, 577373, 574778, 572031, 569286, 566804, 564626, 562642, 560864, 559174, 557023, 553967, 550386, 547089, 544339, 541863, 539694, 538215, 537314, 536166, 534137, 531521, 529217, 527954, 527705, 527637, 526783, 525104, 523612, 523106, 523247, 523379, 523575, 524114, 524552, 524506, 524985, 527546, 532127, 536984, 540968, 544624, 548752, 553148, 557382, 561774, 566729, 571815, 576253, 579845, 582926, 585873, 589109, 593073, 597677, 602190, 606065, 609459, 612658, 615495, 617784, 619746, 621564, 622938, 623576, 623719, 623754, 623643, 623172, 622411, 621476, 620208, 618505, 616703, 615184, 613898, 612638, 611567, 610991, 610815, 610642, 610288, 609878, 609563, 609450, 609718, 610473, 611504, 612394, 612880, 613021, 613113, 613435, 613926, 614120, 613629, 612704, 612082, 612327, 613659, 616346, 620671, 626355]
59705F26355O132N796N352N139N012M905M915N010N157N561O231O536N858M473
59691G02432L229K471J904J326Q39M16n2k94K3N57M71n31j871k912l595m198m876
59674F95339n494n695n233m451m074m241m204l491k777k829l174k792j754r94
59660F44136o84m2J196K344L043L794M834N497N284M690M411M431M359L977K997
59645F94267J034j579l659m557n089o377q263r621r906r491q744p654o433n639
59631F08289n409n169m473l746l763m560n287n203m564m276m761n435n488m899
59617E41256m440m679n343n710n412m653l789k923j960r64k35L3P6L30Q25J141
59601E03553J037Q87J133J599J617Q51l00j051q60J99J472K233K282J980J691
$$ y = [626355, 632487, 638283, 643635, 648774, 653786, 658691, 663606, 668616, 673773, 679334, 685565, 692101, 697959, 702432, 705661, 708132, 710036, 711362, 712201, 712617, 712565, 712271, 712294, 712851, 713322, 712791, 710920, 708008, 704413, 700215, 695339, 689845, 684150, 678917, 674466, 670392, 666151, 661947, 658456, 655679, 652850, 649676, 646884, 645130, 644136, 643452, 643410, 644606, 646950, 649993, 653787, 658621, 664118, 669402, 674092, 678503, 682934, 687293, 691270, 694267, 695301, 693722, 690063, 685506, 680417, 674040, 665777, 656156, 646250, 636759, 628015, 620361, 613928, 608289, 602880, 597711, 593238, 589492, 585729, 581169, 575882, 570679, 566115, 561839, 557078, 551643, 546155, 541256, 536816, 532137, 526794, 521084, 515672, 511019, 507230, 504307, 502347, 501383, 501148, 501181, 501257, 501587, 502412, 503553, 504590, 505477, 506610, 508209, 509826, 510677, 510377, 509326, 508466, 508665, 510137, 512370, 514652, 516632, 518323]
59586E18323J392R66N70M08L30Oo15j296j825k184k457k769l156l406l255k842
59570D98190k723l166l768l926l462k601j659r56o93o48l77R6K30j44m70l41j18
59553D73464j71n7Q14K197L365M134M786N314N519N620N998O475O600O667P656
59538E38381J0083J3374J6385J8063J7720J5259J1234O396J382k914n326n510
59526F34527m669m273m321l733k211o48L16R63J519J528O43p11j976l154m505
59511F09295o046p621r033r896r816q955p949p127o235n040l717k584j928k079
59497E21269l018l824l366j745l44q3l18K4R55J658J768J683J842K294K946L712
59481E25453M355M501L984L050K177J722J711J953K264K563K684K400J759J149
$$ y = [518323, 519715, 520681, 521251, 521659, 521989, 521995, 521380, 520084, 518259, 516075, 513618, 510849, 507693, 504287, 501032, 498190, 495467, 492301, 488533, 484607, 481145, 478544, 476885, 475929, 475236, 474588, 474211, 474307, 474537, 474393, 473923, 473582, 473464, 473293, 473236, 474050, 476247, 479612, 483746, 488532, 493846, 499365, 504985, 510983, 517458, 524058, 530725, 538381, 548464, 561838, 578223, 596286, 614006, 629265, 640499, 646895, 648277, 645363, 640037, 634527, 629858, 625585, 621264, 617531, 615320, 614672, 614988, 615951, 617470, 618998, 619641, 618930, 616954, 613800, 609295, 603249, 595628, 586595, 576699, 566883, 557928, 549979, 542852, 536617, 531577, 527860, 525276, 523348, 521269, 518251, 514427, 511061, 509316, 508972, 508889, 508571, 508595, 509550, 511208, 512976, 514659, 516501, 518795, 521741, 525453, 529808, 534309, 538293, 541343, 543520, 545242, 546953, 548906, 551170, 553733, 556417, 558817, 560576, 561725]
59467E61725Q00M58j00n26l00M12Q50N98P8J22J168K883M323M701M233L939M392
59450E89756N071N235M918M532M005L066J934R06l81k448m863o624p488p992q253
59435E81374p737o421n151m546m261l757l063k420j730p47N04J815L079M401O075
59420E57415Q282J0620J2244J2858J3129J3752J4590J5332J6238J7307J7350J5094
59408G24211J0818N721K37n579j0442j2497j1664r571p028l416R23L765L516J058
59394F90052k013n546r856j3897j6063j6167j5268j4006j2254j0086p946n987
59382E60963m115k486j289k51R93K260L103L441L458L255K989K949L109L096K938
59367E84413L265M285N326N826O153O787P455P793Q123Q789R404R576R807J0727
$$ y = [561725, 562525, 562983, 562883, 562357, 562057, 562469, 563319, 563917, 563995, 564117, 565285, 568168, 572491, 577192, 581425, 585364, 589756, 594827, 600062, 604980, 609512, 613517, 616583, 618517, 619423, 619042, 616594, 611731, 605107, 597619, 589627, 581374, 573637, 567216, 562065, 557519, 553258, 549501, 546438, 544018, 542288, 541541, 542045, 543860, 546939, 551340, 557415, 565697, 576317, 588561, 601419, 614548, 628300, 642890, 658222, 674460, 691767, 709117, 724211, 735029, 740750, 740987, 735408, 724966, 712469, 700805, 691234, 684206, 680790, 681713, 685478, 688994, 690052, 688039, 682493, 672637, 658740, 642677, 626510, 611242, 597236, 584982, 574896, 566950, 560963, 556848, 554362, 553073, 552822, 553815, 556075, 559178, 562619, 566077, 569332, 572321, 575270, 578379, 581475, 584413, 587678, 591963, 597289, 603115, 609268, 616055, 623510, 631303, 639426, 648215, 657619, 667195, 677002, 687729]
59353F87729J1959J2735J3225J4198J5672J6878J7480J7895J8388J8686J8518
59342H63363J7899J6788J5056J2792J0240P487M572J743p45k943m994o950r018
59329I25290j1472j3969j5516j5644j5027j4450j3859j3075j2618j2771j2583
59318G74306j1032q741p283o991o793o120n575n505n269m328l061j913o68Q79
59304G01906K353L451M537N980P552R141J1362J4569J7608J8509J6492J2569Q065
59291H34094L286k025p472j1962j4657j5561j5152j3911j2310j0831r707q772
59279G15020p855o979o038m620k507j41J917L642N191O203O228N669N479N834
59265G27043N872M923L329J814O83j33r07k232m547p308r242r785r569r332r098
$$ y = [687729, 699688, 712423, 725648, 739846, 755518, 772396, 789876, 807771, 826159, 844845, 863363, 881262, 898050, 913106, 925898, 936138, 943625, 948197, 949940, 949195, 946252, 941258, 934308, 925290, 913818, 899849, 884333, 868689, 853662, 839212, 825353, 812278, 799660, 786889, 774306, 763274, 754533, 747250, 740259, 733466, 727346, 721771, 716266, 710997, 706669, 703608, 701695, 701027, 701906, 704259, 707710, 712247, 718227, 725779, 734920, 746282, 760851, 778459, 796968, 813460, 826029, 834094, 837380, 835355, 827883, 815921, 801264, 785703, 770551, 756640, 744330, 733499, 723792, 715020, 707165, 700186, 694148, 689528, 687021, 686880, 688797, 692439, 697630, 703833, 710061, 715730, 721209, 727043, 732915, 737838, 741167, 742981, 743664, 743531, 742624, 740392, 735845, 728537, 719295, 709510, 699941, 690609, 681511]
59250F81511q707q325p925p097n837m814m333l863l045k317j895j099N10K129
59236F24893K826K834K858K805K272J619J369J086Q4j191j690j451j491k230l182
59221F31411m059m944n418m795l397k353j936j240P9R95O18l77o60P4J095J848
59205F06941K442L052L470L463L247L424M306N447O019N779N331N272N493N628
59191F69314N732N980O127N847N380N156N001M379L297K237J345L91n11r10q19
59176G17946q07j137j397j249r78j024j329j376o98P47K442L622M017M220M917
59161G27916N905O269N590M395L353K479J361j31j644k726l232l335l254l061
59147G39885k861k881l139l129k455j667j766k817l793m075m205m747n287n246
$$ y = [681511, 672804, 664479, 656554, 649457, 643620, 638806, 634473, 630610, 627565, 625248, 623353, 622254, 622764, 624893, 627719, 630553, 633411, 636216, 638488, 640107, 641476, 642562, 642646, 641455, 639765, 638314, 636823, 634593, 631411, 627352, 622408, 616990, 612195, 608798, 606445, 604509, 603269, 603348, 604343, 604961, 604584, 603924, 603998, 605093, 606941, 609383, 612435, 615905, 619368, 622615, 626039, 630345, 635792, 641811, 647590, 652921, 658193, 663686, 669314, 675046, 681026, 687153, 693000, 698380, 703536, 708537, 712916, 716213, 718450, 719795, 720186, 719675, 718765, 717946, 717139, 716002, 714605, 713356, 712378, 711354, 710025, 708649, 707951, 708698, 711140, 714762, 718779, 722999, 727916, 733821, 740090, 745680, 750075, 753428, 755907, 757268, 757137, 755493, 752767, 749535, 746200, 742946, 739885, 737024, 734143, 731004, 727875, 725420, 723753, 721987, 719170, 715377, 711302, 707097, 702350, 697063, 691817]
59133F91817m922m939n190n205n018m853m407l350k134j468j248p79K42J780L965
59118F54291O662Q891R762R723R887J0415J0601J0360J0421J1044J1601J1640
59106G75298J1315J0692R572Q177P133O518N742M520L170J803J30j694k877l002
59092H36497k629k544k968l616m066l927l185k508k640l501m378m964n570o408
59078G83593p330q157q693q522p611o842p087p889q064p495p107p149o808n858
59064F78981n325n908o847p094o654o086n467m677l978l550k954j880r38r13j551
59049F15159j784j142k84q8o03j048o71M38J422J604J194Q33P04N38L35M99J209
59032F18315K167L038L776M449N184O205P538Q706R278R574J0302J1548J2722
$$ y = [691817, 686895, 681956, 676766, 671561, 666543, 661690, 657283, 653933, 651799, 650331, 649083, 648304, 648546, 650326, 654291, 660953, 669844, 679606, 689329, 699216, 709631, 720232, 730592, 741013, 752057, 763658, 775298, 786613, 797305, 806877, 815054, 822187, 828705, 834447, 838967, 842137, 843940, 844070, 842376, 839499, 836497, 833868, 831324, 828356, 824740, 820674, 816747, 813562, 811054, 808414, 804913, 800535, 795571, 790001, 783593, 776263, 768106, 759413, 750891, 743280, 736438, 729351, 721462, 713398, 705903, 698796, 691647, 684839, 678981, 673656, 667748, 660901, 653807, 647153, 641067, 635600, 630923, 626945, 623395, 620441, 618561, 617623, 616710, 615159, 613375, 612233, 611949, 611861, 611258, 610210, 609539, 609977, 611399, 613003, 614197, 615030, 615734, 616272, 616607, 617106, 618315, 620482, 623520, 627296, 631745, 636929, 643134, 650672, 659378, 668656, 678230, 688532, 700080, 712802]
59019G12802J3384J3522J3027J1647R540P250N057K874Q13p38j635k020j922j395
59005G82206q69p03n37K26J464K594L551M555N162M670L344K142J177k97k331
58990H06354l964m753n373o265o957p194p543q239q556q007p109o295n029k915
58976G18155o73Q49J887L069M264N042N640O511P419P914Q165Q424Q148O729M837
58961G96380L921M307M762M094K467Q25l77j514l125n267p438r063r986j0505
58947G69481j0980j1482j1706j1132r469p216n487m865m658l781k235j040q02
58934F84628j122j440j698k001k303k671l244l688l332k105q40l65o85j252j539
58919F56343j279n52K50Q75J570K539L301L329L071L488M709O051P252Q603R844
$$ y = [712802, 726186, 739708, 752735, 764382, 773922, 781172, 786229, 789103, 789916, 789178, 787543, 785523, 783601, 782206, 781337, 780634, 780097, 780323, 781787, 784381, 787932, 792487, 797649, 802319, 805663, 807805, 808982, 808685, 806354, 802390, 797637, 792264, 785999, 779042, 771848, 764305, 756066, 747510, 739503, 732394, 726099, 721070, 718155, 717482, 718331, 720218, 723287, 727551, 732593, 738233, 744744, 752163, 760077, 768242, 776666, 784814, 791543, 796380, 800301, 804608, 809370, 813464, 815931, 816756, 816379, 814865, 811740, 806473, 799035, 789972, 779986, 769481, 758501, 747019, 735313, 724181, 714712, 707496, 702009, 697144, 692486, 688705, 686470, 685430, 684628, 683506, 682066, 680368, 678367, 676064, 673393, 670149, 666461, 663129, 661024, 660184, 659819, 659134, 657882, 656343, 655064, 654512, 654762, 655637, 657207, 659746, 663047, 666376, 669447, 672935, 677644, 683695, 690947, 699550, 709394]
58904G09394J0164R601R297R944J0948J1541J1647J1211R794P561N783N548O536
58891H28969P671Q452R050R674J0490J1647J2932J3696J3507J2578J1352J0036
58879I60054Q603O851M442J458j295l154m457n779o683o474n886o450q141r303
58865I23786r198q982r618j0484j0912j1448j2565j3390j3044j2206j2153j2951
58853G86835j3712j3959j3758j3110j2097j1179j0633j0164r515q868q234p359
58841F54247o521o463p016o969n989n313n792o457o122n205m675m307l315j976
58827E78127j239j244j429j581j700j279J05J846K922L184L163L099K946K928
58813E89848L207L315K664J416K64k20K26J365K148J469k67j346r93l51n02r17
$$ y = [709394, 719558, 729159, 738456, 748400, 759348, 770889, 782536, 793747, 803541, 811102, 816885, 822433, 828969, 836640, 845092, 854142, 863816, 874306, 885953, 898885, 912581, 926088, 938666, 950018, 960054, 968657, 975508, 979950, 981408, 980113, 976959, 972502, 966723, 960040, 953566, 947680, 941230, 933089, 923786, 914588, 905606, 895988, 885504, 874592, 863144, 850579, 837189, 824145, 811939, 799786, 786835, 773123, 759164, 745406, 732296, 720199, 709020, 698387, 688223, 678708, 669840, 661606, 654247, 647726, 641263, 634247, 627278, 621289, 615976, 610184, 603727, 597605, 592400, 587725, 583418, 580103, 578127, 576888, 575644, 574215, 572634, 570934, 569655, 569760, 571606, 574528, 577712, 580875, 583974, 586920, 589848, 593055, 596370, 599034, 600450, 600714, 600494, 600720, 602085, 604233, 605702, 605435, 604089, 603096, 602745, 602243, 601326]
58797F01326p69n55j070j843j912j342p80k42M26P22L67L03J469L234M364M873
58781F08571N602O628P424Q099R047R778R403P950O119M085J653q44k923m786
58767F75806o730q236q733q646q627q344p323o262o141o526o215n150m238l668
58753E80967k866j872j325j194q04r5M03O98J355K421L364L989M547N138N775
58738F00501O660P601P774O971O394P100Q340Q617P797O911O465O222O067N821
58724F99241M799K880J311J110J395Q57O1M89J931K817K749K748L109K983K110
58709G30590J190M25p51k371l870n253o953q588r440r973j1336j3451j5079j5703
58695F29437j5755j5213j3718j1932j1009j0706r778q211p193o825n900m235l145
$$ y = [601326, 600557, 600002, 598932, 597089, 595177, 593835, 593055, 592813, 593239, 593961, 594328, 594631, 596100, 599334, 603698, 608571, 614173, 620801, 628225, 636324, 645371, 655149, 664552, 672502, 678621, 682706, 684359, 683515, 680592, 675806, 669076, 660840, 652107, 643461, 634834, 626490, 619167, 612905, 606764, 600238, 594023, 588873, 584635, 580967, 578101, 576229, 574904, 573710, 572906, 572811, 573214, 573912, 575267, 577688, 581052, 585041, 589588, 594726, 600501, 607161, 614762, 622536, 629507, 635901, 643001, 651341, 659958, 667755, 674666, 681131, 687353, 693420, 699241, 704040, 706920, 708231, 709341, 710736, 711593, 711654, 712143, 714074, 716891, 719640, 722388, 725497, 728480, 730590, 731780, 732205, 731454, 729083, 725213, 719960, 713007, 704419, 694979, 685006, 673670, 660219, 645140, 629437, 613682, 598469, 584751, 572819, 561810, 551104, 541326, 533115, 525922, 519097, 513197, 508962, 505817]
58682E05817l129l023k158j504j849k412k217j495q35j95N70J165J608K504M070
58667D96917N667O845P930R292J0710J1680J1670J0181P419M619K738J147j219
58654E85596l955n786o656p437q032p651o742o605p025o459m762l549l429l102
58640E04406j862q04o85o00J47O52J33o17o65m11m48k87N86J491J587J188J029
58623E04840J071R48Q14R44J228J642K462L490M006L930M133N046N929O020N455
58608E51958M579L316J726L22n71j005p61M61J975K403J389M5o18o71n18k64j07
58591E63659k19k9J299L440N191O223P292Q639R595R961J0333J0783J0606R692
58577F56465Q803Q228P580O984P003P241O730N893O367Q534J0964J2746J4523
$$ y = [505817, 502688, 499665, 497507, 496003, 494154, 491742, 489525, 488030, 487195, 487000, 487570, 488735, 490343, 492847, 496917, 502584, 509429, 517359, 526651, 537361, 549041, 560711, 570892, 578311, 582930, 585668, 586815, 585596, 581641, 575855, 569199, 561762, 553730, 546079, 539337, 532732, 525707, 519248, 514486, 510937, 507508, 504406, 502544, 501740, 501055, 500455, 500602, 501254, 501387, 500770, 500105, 499694, 499246, 498959, 499545, 501036, 502623, 503811, 504840, 505911, 506859, 507673, 508617, 509845, 511487, 513949, 517439, 521445, 525375, 529508, 534554, 540483, 546503, 551958, 556537, 559853, 561579, 561901, 561330, 560325, 559564, 560025, 562000, 564403, 565792, 565837, 565219, 564548, 564030, 563766, 563659, 563440, 563411, 564710, 568150, 573341, 579564, 586856, 595495, 605090, 615051, 625384, 636167, 646773, 656465, 665268, 673496, 681076, 688060, 695063, 702304, 709034, 714927, 721294, 729828, 740792, 753538, 768061]
58564G68061J6813J9080K1116K3508K6048K7404K6998K5598K3494J9909J4961
58553A012990J0305O973M220J250j488l527n199o513o906o790p608r643j1604
58540I76460j3055j5231j8569k1515k2897k3498k4120k4038k2649k0767j9016
58529G51105j6715j3679j1258j0155r010o689m258l131k804k101j235r69r92o46
58515F67463k16j34k5K96O1j057k025j997j518j215p46o1r4j108j840j508j070
58498F53206j373j689j328r39r04j96J612L005K769K019K369L676N086O828R182
58483F83323J1180J2015J2467J3442J4457J4972J5654J6767J6941J5167J2551
58472H38936J0339P790L796q35m545p078q737q996p715o322n930n531l753j119
$$ y = [768061, 784874, 803954, 825070, 848578, 874626, 902030, 929028, 954626, 978120, 998029, 1012990, 1023295, 1030268, 1034488, 1035738, 1034250, 1030723, 1025524, 1019011, 1012105, 1005315, 997707, 988064, 976460, 963405, 948174, 929605, 908090, 885193, 861695, 837575, 813537, 790888, 770121, 751105, 734390, 720711, 709453, 699298, 690288, 683599, 679341, 676210, 673406, 671305, 670070, 669101, 668109, 667463, 667247, 667113, 667088, 667384, 667445, 666388, 664363, 662366, 660848, 659633, 658887, 658826, 658732, 657624, 655784, 654276, 653206, 651833, 650144, 648816, 647877, 646973, 646777, 648389, 651394, 654163, 656182, 658551, 662227, 667313, 674141, 683323, 694503, 706518, 718985, 732427, 746884, 761856, 777510, 794277, 811218, 826385, 838936, 849275, 857065, 860861, 860026, 855481, 848403, 839666, 830670, 822955, 816633, 810703, 805172, 801419, 800300]
58458H00300J152L117N152O482O627O835Q125R198Q285N891L731J989l10l262
58444H63312o175q849j1137j2231j1820j0870j0024q530o033l763k605j667k10
58431G69398R60J519K855N495P548P801Q085J0186J2640J3151J2181J1345J0162
58418H73326P392L964J560l14k964n538o349o062o615p987q622q240p688o946
58404H18917n670m637m398l781j878p3K34K16J437K947L296L561N251O982O604
58389H29008N133M996N724N034L197K638L844N052N479N685N300L482J190J37
58375H85899J64J58N84K279L952L943L356M274O028O561O371P557R865J1223J1519
58360I63733J2330J3537J3584J2623J2071J1640R949P489N885M919L344J723J441
$$ y = [800300, 801452, 804569, 809721, 816203, 822830, 829665, 837790, 846988, 855273, 861164, 864895, 866884, 866574, 863312, 857137, 848288, 837151, 824920, 813100, 802230, 792206, 783676, 777643, 773880, 771275, 769608, 769398, 770358, 771877, 774732, 780227, 787775, 795576, 803661, 813847, 826487, 839638, 851819, 863164, 873326, 880718, 884682, 886242, 885928, 882964, 877426, 871077, 865015, 858400, 850413, 841791, 833551, 825863, 818917, 813247, 808610, 804212, 800431, 798553, 798480, 798714, 798930, 800367, 803314, 806610, 810171, 815422, 822404, 829008, 834141, 839137, 844861, 849895, 853092, 855730, 859574, 864626, 870105, 875790, 881090, 884572, 885762, 885899, 886063, 886221, 886805, 889084, 893036, 896979, 900335, 904609, 910637, 917198, 923569, 931126, 940991, 952214, 963733, 976063, 989600, 1003184, 1015807, 1027878, 1039518, 1049467, 1056956, 1062841, 1067760, 1071104, 1072827, 1074268]
58347A074268J846J606J651L498N972P083P758R935J2435J2784J1889J2549J4451
58334A177725J5063J4543J5227J6884J7042J5590J4624J4140J2231R246P465O934
58322A336714N793M176L707L764K639J592L187O314P601P152P972J0243J1278
58309A412132J0845J1475J3465J4585J4655J5635J7285J7576J7132J8285K0123
58298A583193J9613J7290J6607J7901J8412J7971J9046K1338K2044K1467K2600
58287A797482K5261K6317K5755K6540K8611K9112K8492L0083L3617L5637L6277
58276B123184L8929M3023M4263M2423M1855M3664M4535M3987M5402M8965N0937
58265B611167N0978N2935N7262O0118O0988O3631O8391P1235P1534P3035P5984
$$ y = [1074268, 1076114, 1077720, 1079371, 1082869, 1088841, 1095924, 1103682, 1113617, 1126052, 1138836, 1150725, 1163274, 1177725, 1192788, 1207331, 1222558, 1239442, 1256484, 1272074, 1286698, 1300838, 1313069, 1322315, 1329780, 1336714, 1342507, 1346683, 1350390, 1354154, 1356793, 1358385, 1361572, 1367886, 1375487, 1382639, 1390611, 1400854, 1412132, 1422977, 1434452, 1447917, 1462502, 1477157, 1492792, 1510077, 1527653, 1544785, 1563070, 1583193, 1602806, 1620096, 1636703, 1654604, 1673016, 1690987, 1710033, 1731371, 1753415, 1774882, 1797482, 1822743, 1849060, 1874815, 1901355, 1929966, 1959078, 1987570, 2017653, 2051270, 2086907, 2123184, 2162113, 2205136, 2249399, 2291822, 2333677, 2377341, 2421876, 2465863, 2511265, 2560230, 2611167, 2662145, 2715080, 2772342, 2832460, 2893448, 2957079, 3025470, 3096705, 3168239, 3241274, 3317258]
58254C317258P6442P4470P4825P8315Q0919Q2426Q7112R4742J00211J03344J09465
58243D279529J18878J25937J30004J36846J47335J55781J61546J70901J84890
58234E611647J97046K05902K17794K34315K49411K62087K79179L02042L23806
58225G883229L43480L68869M01599M33819M63996N00698N46082N91958O37454
58216A2171184O93474P63823Q39843R20180J017096J136142J269836J419460J602207
58207B1833245J828393K094408K407257K790685L255437L789683M391229N081493
58199D7471830N875747O772691P789417Q973032J0365389J2002245J3965407J6378329
58191A29594087J9318644K2784106K6725841L0915177L4592041L6350312L4704395
$$ y = [3317258, 3393700, 3468170, 3542995, 3621310, 3702229, 3784655, 3871767, 3966509, 4066720, 4170064, 4279529, 4398407, 4524344, 4654348, 4791194, 4938529, 5094310, 5255856, 5426757, 5611647, 5808693, 6014595, 6232389, 6466704, 6716115, 6978202, 7257381, 7559423, 7883229, 8226709, 8595578, 8997177, 9430996, 9894992, 10395690, 10941772, 11533730, 12171184, 12864658, 13628481, 14468324, 15388504, 16405600, 17541742, 18811578, 20231038, 21833245, 23661638, 25756046, 28163303, 30953988, 34209425, 37999108, 42390337, 47471830, 53347577, 60120268, 67909685, 76882717, 87248106, 99250351, 113215758, 129594087, 148912731, 171696837, 198422678, 229337855, 263929896, 300280208, 334984603]
58184C34984603K9017807J9937411Q973604k245959j2400515k0548002k6172237
58177C31546712k9265624l0251544k9730105k8256177k6255993k4005599k1631939
58170A42149731j9183824j6736408j4410594j2301785j0439162q822249p452184
58163E2803525o312661n360219m556259l885767l333912k871368k476221k146764
58155B1860354j879523j655216j458273j290886j155868j042640r40965q52549
58147A1584434p78637p10655o42995n81698n31300m85448m38818l96302l62207
58138F656374l31778l01301k75750k58797k45275k30750k18807k11917k04550
58129D377449j92367j79506j70129j61107j49413j38646j31895j25665j16843
$$ y = [334984603, 364002410, 383939821, 392913425, 390667466, 378266951, 357718949, 331546712, 302281088, 272029544, 242299439, 214043262, 187787269, 163781670, 142149731, 122965907, 106229499, 91818905, 79517120, 69077958, 60255709, 52803525, 46490864, 41130645, 36574386, 32688619, 29354707, 26483339, 24007118, 21860354, 19980831, 18325615, 16867342, 15576456, 14420588, 13377948, 12436983, 11584434, 10805797, 10095142, 9452147, 8870449, 8339149, 7853701, 7414883, 7018581, 6656374, 6324596, 6023295, 5747545, 5488748, 5243473, 5012723, 4793916, 4581999, 4377449, 4185082, 4005576, 3835447, 3674340, 3524927, 3386281, 3254386, 3128721, 3011878]
58120C011878j08493j03141r7502q9360q2666q0272p8383p3512o8499o6313o4238
58109B099499n9562n5076n3738n3340n1355m9640m9786m9171m6154m3850m4443
58098A543384m4973m2948m0812m0571l9347l4760k9701k7217k5496k2234j9300
58087A176025j8509j7429j3931j0674j0646j2251j3004j4059j6876j9262j8975
58076A010409j7835j8264j9128j8683j8204j9080j9684j8616j7611j8002j7811
58065H07491j5635j3658j3549j3121j0609q402q793r783q979q125r596j1729j1766
58052F63746j0529j0184j0125q926p784q212q822p867o547o421o285m933m237
58039E62874n909p889p634o359o344o640n356l790m248n831o254n995o828q033
$$ y = [3011878, 2903385, 2800244, 2702742, 2613382, 2530716, 2450444, 2372061, 2298549, 2230050, 2163737, 2099499, 2039937, 1984861, 1931123, 1877783, 1826428, 1776788, 1727002, 1677831, 1631677, 1587827, 1543384, 1498411, 1455463, 1414651, 1374080, 1334733, 1299973, 1270272, 1243055, 1217559, 1195325, 1176025, 1157516, 1140087, 1126156, 1115482, 1104836, 1092585, 1079581, 1065522, 1048646, 1029384, 1010409, 992574, 974310, 955182, 936499, 918295, 899215, 879531, 860915, 843304, 825302, 807491, 791856, 778198, 764649, 751528, 740919, 732517, 723724, 713941, 704962, 696837, 687241, 675512, 663746, 653217, 643033, 632908, 623982, 616198, 607986, 599164, 591297, 584750, 578329, 572044, 567111, 562874, 556965, 549076, 541442, 535083, 528739, 522099, 516743, 512953, 508705, 502874, 496620, 490625, 483797, 475764]
58025D75764p811o904p140p893p410o245o025o170n153l682l442l889l383k352
58011C98265k318k895k613j632j051o92k8J22q07j403n66K46m41j295o09M41J3
57994C82737r13m92L10n01j989j766k17K68n63r06m15m04r47r60p17j477k851
57977C68197l240k558k087k056j677j101j076j259r64q13j581k328j904j218j657
57962C42678k411j851n51k37p00m77K13j9r74j319j222j826k660k201o65L73O75
57945C26826J269K101K294K334L484N360O501O988Q040R400R680R139R521J1129
57931D14066J2380J2277J1198R383O759M152K572J421o20l278n280o684q369r691
57917D40286r212p491o626p043p204o529o103o250n792m196k411j182l80j74j053
$$ y = [475764, 467953, 461049, 453909, 446016, 438606, 432361, 426336, 420166, 415013, 411331, 407889, 404000, 400617, 398265, 395947, 393052, 390439, 388807, 387756, 387064, 387036, 387158, 386351, 384948, 384382, 384628, 384187, 382892, 382283, 382724, 382737, 381824, 381332, 381642, 381141, 379152, 377386, 377169, 377437, 376874, 375968, 375553, 375149, 374202, 373242, 372525, 371048, 368197, 364957, 362399, 360312, 358256, 356579, 355478, 354402, 353143, 352179, 351366, 349785, 347457, 345553, 344335, 342678, 340267, 338416, 337865, 337628, 336928, 336451, 336664, 336645, 335671, 334352, 333130, 331304, 328644, 326443, 325778, 326151, 326826, 328095, 330196, 332490, 334824, 338308, 343668, 350169, 357157, 365197, 374597, 384277, 393416, 402937, 414066, 426446, 438723, 449921, 459304, 466063, 470215, 472787, 474208, 473588, 470310, 465030, 458346, 449977, 440286, 431074, 423583, 416957, 409914, 402710, 396181, 390078, 383828, 378036, 373840, 371429, 370247, 369867, 369693, 368640]
57902C68640k472l241l337l692m303m361m011m039m024k866j071l36q72j189o08
57887C28218R8O05J399K166J921R64O30R15N29o05j128q69j332k936m006l362
57871C23207j986j212r37m95J83R61J774K125J540P75J117K393L204L225L516
57856C39390M430N036M912M688M539L951L247L386L902L030N36j679k425k781
57842C74162l935n386o207o487o473n871m905m609n198n492m758l722k974j930
57828C06215k83R97J152Q21Q01Q96R26J488K665L237K408J183Q53J064P05j87
57812C24941p00p17j062k135l388m076m077m000m644o031o970o223m156k413j915
57797B72434j982j642p74K42J137J609J464J123J304K031K724L240L854M345M292
$$ y = [368640, 366168, 362927, 359590, 355898, 351595, 347234, 343223, 339184, 335160, 332294, 331223, 330887, 330015, 328826, 328218, 328316, 328921, 330320, 332486, 334407, 335371, 336001, 336916, 337445, 336840, 335712, 334843, 333511, 330575, 326569, 323207, 321221, 320009, 319072, 318577, 318760, 319721, 321495, 323620, 325160, 325935, 327052, 329445, 332649, 335874, 339390, 343820, 348856, 353768, 358456, 362995, 366946, 370193, 373579, 377481, 380511, 381047, 379368, 376943, 374162, 370227, 364841, 358634, 352147, 345674, 339803, 334898, 330289, 325091, 319599, 314841, 311119, 308145, 306215, 305932, 306929, 308081, 308902, 309703, 310599, 311525, 313013, 315678, 318915, 321323, 322506, 323359, 324423, 325128, 324941, 324241, 323524, 322462, 320327, 316939, 312863, 308786, 304786, 300142, 294111, 287141, 280918, 276762, 274349, 272434, 270452, 268810, 268036, 268278, 269415, 271024, 272488, 273611, 274915, 276946, 279670, 282910, 286764, 291109, 295401]
57782B95401M219N126O680P300O352M942M176L913L649L351K885J863N12m20j028
57767C48921k262m183n624o081o545p713q776q788q046p192o122m684l500l106
57753B66299l115k924k472j718l59J297K256K279K394L210L893L667L113L027
57739B80847K999K289J296R19J104J131Q24N01J21o01j529k305k863l188l005
57724B78540k230j333p48m59m75j018j855k178j711j204j312j725j979k242k720
57709B55351k956k545j903j652j824k161k590k846k388j335p38j147j646j105
57695B28515J90J039R16K83k95n58m04n8q8p46j526j756j314l58J080K901M720
57678B32541O333P956R714J1423J3184J5592J8990K3063K7564L2811L9137M6253
$$ y = [295401, 299620, 304746, 311426, 318726, 325078, 330020, 334196, 338109, 341758, 345109, 347994, 349857, 350369, 349949, 348921, 346659, 342476, 336852, 330771, 324226, 316513, 307737, 298949, 290903, 283711, 277589, 272905, 269405, 266299, 263184, 260260, 257788, 256070, 255711, 257008, 259264, 261543, 263937, 267147, 271040, 274707, 277820, 280847, 283846, 286135, 287431, 288350, 289454, 290585, 291409, 291910, 292031, 291430, 289901, 287596, 284733, 281545, 278540, 276310, 274977, 274229, 273770, 273295, 272277, 270422, 268244, 266533, 265329, 264017, 262292, 260313, 258071, 255351, 252395, 249850, 247947, 246295, 244471, 242310, 239720, 236874, 234486, 233151, 232413, 231266, 229620, 228515, 228705, 229744, 230660, 230943, 230648, 230090, 229686, 229628, 229540, 228794, 227268, 225512, 224198, 223840, 224920, 227821, 232541, 238874, 246830, 256544, 267967, 281151, 296743, 315733, 338796, 366360, 399171, 438308, 484561]
57666D84561N3247N8441N9134N2712L8796J9861n94j9846l5911m7150n2904n3899
57654E56448n1401m6495m0389l4452k9284k4568k0226j6878j4616j2418r594o793
57642B49334m914l862l227l158l598l589k494j162p49j006q19k3N19K80m26j144
57626B19962j599j617j375j458k096k713k771k523k322j928j225q65j317j809
57612A94344j375m18j36o64r41m23J32k08j336k264k168j181l40n64j604k361
57596A78493k310k021k037k040j596r85p39q59j122j510j907j937j602j438j640
57581A54750j697j298p87l56K47P35J37j624l098l166k490k196k241k148k261
57566A32507k906l252k424j039k42L6M69P33J42o77n05L51L97n97j179m22R22
$$ y = [484561, 537808, 596249, 655383, 708095, 746891, 766752, 766158, 746312, 710401, 663251, 610347, 556448, 505047, 458552, 418163, 383711, 354427, 329859, 309633, 292755, 278139, 265721, 256127, 249334, 244420, 240558, 237331, 234173, 230575, 226986, 224492, 223330, 222581, 221575, 220756, 220733, 221252, 221532, 221106, 219962, 218363, 216746, 215371, 213913, 211817, 209104, 206333, 203810, 201488, 199560, 198335, 197470, 196153, 194344, 192969, 192551, 192415, 191751, 190810, 190387, 190519, 190311, 188975, 186711, 184543, 183362, 183022, 182458, 180854, 178493, 176183, 174162, 172125, 170085, 168489, 167504, 166765, 165906, 164784, 163274, 161367, 159430, 157828, 156390, 154750, 153053, 151755, 150968, 150612, 150859, 151594, 151731, 150107, 147009, 143843, 141353, 139157, 136916, 134768, 132507, 129601, 126349, 123925, 122886, 122644, 122680, 123149, 123882, 124024, 123347, 122842, 123193, 123590, 122993, 121814, 121392, 122314]
57549A22314J800K211K642L180L485L114J729l93k165k647k013j003O8R74R82
57534A34278k35j457j120M90J550J071k18j316j889j731o69O63J121N47JK26Q60
57517A32172J425K037K678K729J851P12K27N47J129J443J324R47O44N50M39J95
57501A51049J04L85O83N47Q9l24o35q61p79m63o19j548k421k414k042k208k565
57484A35978k030o18N93J066J132R10K43m74o10m73q76j694k106k117k424k826
57468A23674k366j139m12o51j018j026j177j507j197k75p1j121k060j606m38K0
57452A07630l63o49l30L64J034J339J118Q41J203J942J966J051K70K74L40j04
57436A17926l11M06J263J182M72J72L98N59O35R68J316J176P39N22M21J28J8N25
$$ y = [122314, 124114, 126325, 128967, 132147, 135632, 138746, 140475, 140082, 137917, 135270, 133257, 132254, 132322, 133296, 134278, 134043, 132586, 131466, 131956, 133506, 134577, 134359, 133043, 131154, 129423, 128754, 129417, 130538, 131085, 131086, 131312, 132172, 133597, 135634, 138312, 141041, 142892, 143604, 143831, 144378, 145507, 146950, 148274, 149221, 149865, 150415, 150854, 151049, 151153, 151538, 152221, 152768, 152857, 152533, 151898, 151037, 150258, 149795, 149176, 147628, 145207, 142793, 140751, 138543, 135978, 133948, 133330, 133923, 134989, 136121, 137031, 137274, 136800, 136190, 135717, 134841, 133147, 131041, 128924, 126500, 123674, 121308, 120169, 119757, 119106, 118088, 117062, 115885, 114378, 113181, 112906, 112835, 111714, 109654, 108048, 107610, 107630, 107267, 106618, 106288, 106652, 107686, 109025, 110143, 110984, 112187, 114129, 116095, 117146, 117416, 117690, 118030, 117926, 117615, 118021, 119284, 120466, 120938, 121110, 121508, 122067, 122702, 123670, 124986, 126162, 126901, 127423, 127844, 127972, 127990, 128515]
57418A28515J033O23l55p12k54k1m95q56l63N63J126J210J095P53N9p35j278j598
57400A28310j884j948j399l50N28P97Q08J149J718J774R99M3k33K34R08J580K444
57383A35478L414M023M068L804L330K406J054j73q34j125j446j809j934j715j379
57368A47162j296j704k384k669k127j121l58k7J64K77J63O0M18J115J577J710
57352A40960J926K223K071J411Q88Q62J039J214J549J796J377N56M77J523K627
57337A62499K830K533K488K566K375K184K276K213J706J442K000K701K644K256
57323A94713K503L116L030K289K044K615L022K663K257K622L502M142M279M084
57309B36881L686L200K832K647K544K572K953L573L894L537K763K218K394L236
$$ y = [128515, 129548, 130171, 129816, 129104, 128850, 128829, 128334, 127478, 127115, 127678, 128804, 130014, 131109, 131862, 131921, 131186, 129908, 128310, 126426, 124478, 123079, 122729, 123257, 124054, 124862, 126011, 127729, 129503, 130502, 130545, 130312, 130546, 131454, 133034, 135478, 138892, 142915, 146983, 150787, 154117, 156523, 157577, 157404, 156570, 155445, 153999, 152190, 150256, 148541, 147162, 145866, 144162, 141778, 139109, 136982, 135861, 135503, 135476, 135640, 135917, 136080, 136140, 136558, 137673, 139250, 140960, 142886, 145109, 147180, 148591, 149479, 150341, 151380, 152594, 154143, 155939, 157316, 157872, 158349, 159872, 162499, 165329, 167862, 170350, 172916, 175291, 177475, 179751, 181964, 183670, 185112, 187112, 189813, 192457, 194713, 197216, 200332, 203362, 205651, 207695, 210310, 213332, 215995, 218252, 220874, 224376, 228518, 232797, 236881, 240567, 243767, 246599, 249246, 251790, 254362, 257315, 260888, 264782, 268319, 271082, 273300, 275694, 278930]
57295B78930M073M131L409K898L483M880N984O205N864N469N193N086N247N546
57281C46398N677N590N577N779N971N919N671N348M932M343L610K885K448K646
57267D12794L605M988O222O936P143P148P352P957Q647Q859Q487Q075Q038Q098
57253E14349P884P695Q089Q932R462R340R069R280J0006J0855J1483J1783J1743
57240F39970J1334J0490R322Q404Q601J0245J2567J4198J4290J3091J1612J0852
57228G74976J1129J1939J2530J2758J3070J3604J3813J3391J3059J3763J5369
57217I19401J6877J7802J8616J9747K0809K1181K0888K0517K0512K0851K1240
57206A138441K1437K1350K1042K0649K0276J9911J9416J8675J7892J7612J8199
$$ y = [278930, 283003, 287134, 290543, 293441, 296924, 301804, 307788, 313993, 319857, 325326, 330519, 335605, 340852, 346398, 352075, 357665, 363242, 369021, 374992, 380911, 386582, 391930, 396862, 401205, 404815, 407700, 410148, 412794, 416399, 421387, 427609, 434545, 441688, 448836, 456188, 464145, 472792, 481651, 490138, 498213, 506251, 514349, 522233, 529928, 538017, 546949, 556411, 565751, 574820, 584100, 594106, 604961, 616444, 628227, 639970, 651304, 661794, 671116, 679520, 688121, 698366, 710933, 725131, 739421, 752512, 764124, 774976, 786105, 798044, 810574, 823332, 836402, 850006, 863819, 877210, 890269, 904032, 919401, 936278, 954080, 972696, 992443, 1013252, 1034433, 1055321, 1075838, 1096350, 1117201, 1138441, 1159878, 1181228, 1202270, 1222919, 1243195, 1263106, 1282522, 1301197, 1319089, 1336701, 1354900]
57195A354900J9267K0059K0416K0953K2063K3140K3317K2644K2087K2412K3500
57184A594758K4771K5915K7067K8384K9674L0498L0688L0619L0769L1103L1238
57173A915484L1099L0957L0798L0274K9494K9214K9859L0818L1205L0924L0507
57162B250633L0219K9807K9031K7962K6893K6220K6237K6810K7444K7888K8327
57151B557471K8794K8785K7899K6478K5162K4047K2718K0865J8540J5921J3204
57140B809884J0605Q226O147M645M046M186M574N235O860R851J3755J7974K2288
57127B928276K6198K8454K7979K4821J9693J3152N997j57l655m019j831K207P383
57114C074498J2624J6991K0519K3956K7941L2966L9883M9663O2757P9216R9314
$$ y = [1354900, 1374167, 1394226, 1414642, 1435595, 1457658, 1480798, 1504115, 1526759, 1548846, 1571258, 1594758, 1619529, 1645444, 1672511, 1700895, 1730569, 1761067, 1791755, 1822374, 1853143, 1884246, 1915484, 1946583, 1977540, 2008338, 2038612, 2068106, 2097320, 2127179, 2157997, 2189202, 2220126, 2250633, 2280852, 2310659, 2339690, 2367652, 2394545, 2420765, 2447002, 2473812, 2501256, 2529144, 2557471, 2586265, 2615050, 2642949, 2669427, 2694589, 2718636, 2741354, 2762219, 2780759, 2796680, 2809884, 2820489, 2828715, 2834862, 2839507, 2843553, 2847739, 2852313, 2857548, 2864408, 2874259, 2888014, 2905988, 2928276, 2954474, 2982928, 3010907, 3035728, 3055421, 3068573, 3074570, 3074413, 3070758, 3066739, 3064908, 3067115, 3074498, 3087122, 3104113, 3124632, 3148588, 3176529, 3209495, 3249378, 3299041, 3361798, 3441014, 3540328]
57103C540328J23685J53248J89376K33611K86622L47781M16237M91849N74864
57094F357601O65631P65047Q74010R91366J112714J229898J326987J374231J332265
57085A6029750J174727R16161O18961L68153K30057K21687L06768M17158M86489
57076B0769911M77168L86501K33614M2792j64390l69880n60193p28434q73221
57067A9213868r94700j091809j162236j203297j213014j191922j144259j076761
57059A0135870r96207r08491q19046p32547o51771n77538n10005m49510l96299
57050D094456l50135l10363k76069k46190k19882j96736j76391j58195j41595
57041B018900j26566j13304j01640r1071q1203p1843o2933n4637m7174m0328l3441
$$ y = [3540328, 3664013, 3817261, 4006637, 4240248, 4526870, 4874651, 5290888, 5782737, 6357601, 7023232, 7788279, 8662289, 9653655, 10766369, 11996267, 13323254, 14697485, 16029750, 17204477, 18120638, 18739599, 19107752, 19337809, 19559496, 19866264, 20283422, 20769911, 21247079, 21633580, 21867194, 21909986, 21745596, 21375716, 20815523, 20087089, 19213868, 18219168, 17127359, 15965123, 14761826, 13548812, 12356890, 11212631, 10135870, 9139663, 8231172, 7412126, 6679579, 6027808, 5450270, 4940265, 4490755, 4094456, 3744321, 3433958, 3157889, 2911699, 2691817, 2495081, 2318690, 2160495, 2018900, 1892334, 1779030, 1677390, 1586319, 1505116, 1433273, 1370340, 1315703, 1268529, 1228201, 1194760]
57030A194760k6200j9036j2363n636K537J3297K6313L9001M7074M6835L7495K1002
57018A365079j41k3743m6654o4538p4406p6739p4215o9017o2289n5139m8502m2231
57006G27465l5740k9514k4840k2020k0027j8059j6328j5072j3896j2543j1527
56995E07899j1299j1491j1423j0941j0214r097p337n177l251j770j78K098M638
56982D32457O051N228K458r70m131o995r595j1413j1957j1451j0423r061p459
56969C62739o060n126m085k240O0J839L009M635P469J0976J4146J6597J8395J9196
56955D41550J8154J4691R067K277m509j0428j5036j8089j9409j9082j7555j5294
56943C66337j2503r350o282l719j560O61L205O031R138J2629J6365J9873K2597
$$ y = [1194760, 1168560, 1149524, 1137161, 1131525, 1134062, 1147359, 1173672, 1212673, 1259747, 1306582, 1344077, 1365079, 1364938, 1341195, 1294541, 1230003, 1155597, 1078858, 1004643, 935626, 873337, 818198, 769696, 727465, 691725, 662211, 637371, 615351, 595324, 577265, 560937, 545865, 531969, 519426, 507899, 496600, 485109, 473686, 462745, 452531, 443434, 436097, 430920, 427669, 425899, 425721, 427819, 432457, 438508, 443736, 446194, 445224, 441093, 434098, 424503, 413090, 401133, 389682, 379259, 370198, 362739, 356679, 351553, 347468, 345228, 345288, 347127, 350136, 354771, 362240, 373216, 387362, 403959, 422354, 441550, 459704, 474395, 483462, 485739, 481230, 470802, 455766, 437677, 418268, 399186, 381631, 366337, 353834, 344484, 338202, 334483, 332923, 333584, 336789, 342820, 351958, 364587, 380952, 400825, 423422]
56930D23422K3939K3117J9399J2743M075n069j3132j9069k2674k4505k5229k5035
56918C71982k3778k1564j8896j6250j3834j1705r935q566p596o943o406n712m780
56905B16017l798k909k035j178o22n07m52O2J034K059K942L795M684N630O934
56890B31656Q998J1701J4284J6012J6697J6473J5353J3211J0062O169J981k057
56878C60540n581q293r844j0010q982p295n307k966k42K497M863O991R375J2328
56864C38074J5912K0128K4835K9537L3566L6329L7019L4445K7729J7374N284o330
56852F13902j5843k2334k5538k5927k4419k1741j8180j3910r140l961J648P445
56840D42002J2987J8272K4020L0939L8962M7345N5186O1242O3426N9347M7988
$$ y = [423422, 447361, 470478, 489877, 502620, 506695, 501626, 488494, 469425, 446751, 422246, 397017, 371982, 348204, 326640, 307744, 291494, 277660, 265955, 256020, 247454, 239858, 232915, 226509, 220797, 216017, 212219, 209310, 207275, 206097, 205475, 204968, 204516, 204578, 205612, 207671, 210613, 214408, 219092, 224722, 231656, 240654, 252355, 266639, 282651, 299348, 315821, 331174, 344385, 354447, 360616, 362597, 360540, 354959, 346666, 336822, 326812, 317830, 310535, 305228, 302262, 302020, 304517, 309380, 316371, 325746, 338074, 353986, 374114, 398949, 428486, 462052, 498381, 535400, 569845, 597574, 614948, 620232, 613902, 598059, 575725, 550187, 524260, 499841, 478100, 459920, 446010, 436870, 432909, 434557, 442002, 454989, 473261, 497281, 528220, 567182, 614527, 669713, 730955, 794381, 853728, 901716]
56829I01716L0717J0396j0246k9076m3943n2882n5434n3196m8454m2565l6020
56818E71013k9382k3216j7283j0867l918K868R207J5586K2375K9330L6073M1971
56806F43757M5130M2730L3397J8771K135j3964k8163l9366m6583m9612m8994m5399
56794E13839l9685l3219k7289k2191j7387j2498p600k800J870O311J0567J4969
56782C84887J9462K3016K4357K3034J9267J3097M596n227j4625k2251k7569l0283
56770D11761l0258k8086k4939k1699j8704j6297j4830j3993j2870j0990q840p117
56758B03138o022n374m975m583l934l052k236j682j347j187j180j186j124j177
56744A64079j444j557j155n70m40p61q99n54m6L51P33J033Q30qr34j215o18N00
$$ y = [901716, 932433, 942829, 932583, 903507, 859564, 806682, 751248, 698052, 649598, 607033, 571013, 541631, 518415, 501132, 490265, 486347, 489215, 498422, 514008, 536383, 565713, 601786, 643757, 688887, 731617, 765014, 783785, 785920, 771956, 743793, 704427, 657844, 608232, 559238, 513839, 474154, 440935, 413646, 391455, 374068, 361570, 353970, 351170, 353040, 359351, 369918, 384887, 404349, 427365, 451722, 474756, 494023, 507120, 511716, 506489, 491864, 469613, 442044, 411761, 381503, 353417, 328478, 306779, 288075, 271778, 256948, 242955, 230085, 219095, 210255, 203138, 197116, 191742, 186767, 182184, 178250, 175198, 172962, 171280, 169933, 168746, 167566, 166380, 165256, 164079, 162635, 161078, 159923, 159353, 158913, 158152, 157253, 156699, 156653, 157004, 157737, 158770, 159600, 159592, 158658, 157443, 156825, 157325]
56726A57325J491J844J573J230J221J307J076O61N43Q05J122J297J284R54L18
56711A74051j43ON19R03J188J615J905J548P21Q0j57j95JM75O57l1j068j373r02
56692A79800n68o68n61o3J23l20p90r09j078j432j383o95o7N1K66J154K192K501
56674A77553K007J222N50K72O48J364J580J063O26R16J418J336Q35O45R24J227
56658A94186J273J163J050J060J208J202O68j70n60j89M75R65J248J164L39q57
56642B04225j247l26Q99J285R99Q51Q55M24m89j258j505j415j321j429j756k046
56626A96746j986j754j871k307k332j603p57m74o32q09j043j470j816j752j322
56611A74818p04MM34K20j90J81J274J748Q55m10q28n57m02l38J19P83J082R76
$$ y = [157325, 158816, 160660, 162233, 163463, 164684, 165991, 167067, 167728, 168271, 169076, 170198, 171495, 172779, 173733, 174051, 173908, 173914, 174433, 175336, 176524, 178139, 180044, 181592, 182313, 182393, 182236, 182041, 182042, 182517, 183174, 183143, 182075, 180702, 179800, 179232, 178564, 178003, 177940, 178063, 177743, 176953, 176044, 174966, 173534, 172151, 171456, 171389, 171440, 171706, 172860, 175052, 177553, 179560, 180782, 181332, 181604, 182252, 183616, 185196, 186259, 186885, 187801, 189219, 190555, 191390, 192035, 192959, 194186, 195459, 196622, 197672, 198732, 199940, 201142, 201810, 201640, 201080, 200891, 201366, 202331, 203579, 204743, 205082, 204225, 202978, 202652, 203551, 204836, 205835, 206686, 207541, 207965, 207476, 206218, 204713, 203298, 201977, 200548, 198792, 196746, 194760, 193006, 191135, 188828, 186496, 184893, 184136, 183662, 183030, 182221, 181178, 179708, 177892, 176140, 174818, 174114, 174118, 174552, 174772, 174582, 174763, 176037, 177785, 178640, 178230, 177402, 176845, 176443, 176105, 176224, 177007, 178089, 179065]
56593A79065P08K24l58l25O20J596J646J036N83L85J74K04O53Q91M20q4J47N52
56575A88137K50k35K08J239J529J023J003J892K686K813L044M008N181N938O558
56560B25274P576Q904J0034J0544J0025Q225N472K538p2k191l520l772l292k833
56546B72912k724k835l163l728m121l892l342l055k900k330j504j136j292j310
56532B35580r75p74r48j161j200j220j213j066j055j477j844j376l08L02O2m02
56516B20925o67j033j654k118k117j790j207l39M20N21J05k17l81q32j426j494
56500B06696r92o51p65q99q39q03o12J27Q78N10q47j589q17M47R03O44M43M15
56482B02249K70K05N02Q43P67M29K87M58Q30J378J876J748P84l67r13p95n06l26
$$ y = [179065, 179773, 179997, 179639, 179314, 179934, 181530, 183176, 184212, 184795, 185180, 185354, 185558, 186211, 187102, 187522, 187438, 187585, 188137, 188387, 188152, 188360, 189599, 191128, 192151, 193154, 195046, 197732, 200545, 203589, 207597, 212778, 218716, 225274, 232850, 241754, 251788, 262332, 272357, 280582, 286054, 288592, 288520, 286329, 282809, 279037, 275745, 272912, 270188, 267353, 264190, 260462, 256341, 252449, 249107, 246052, 243152, 240822, 239318, 238182, 236890, 235580, 234605, 233831, 232883, 231722, 230522, 229302, 228089, 227023, 225968, 224491, 222647, 221271, 220963, 221265, 221327, 220925, 220258, 219225, 217571, 215453, 213336, 211546, 210339, 210000, 210420, 210941, 211046, 210829, 210448, 209616, 208190, 206696, 205704, 205053, 204288, 203389, 202550, 201747, 201135, 201262, 202140, 202650, 201803, 200214, 199397, 199844, 200747, 201391, 201834, 202249, 202519, 202724, 203226, 204069, 204836, 205265, 205552, 206010, 206840, 208218, 210094, 211842, 212626, 212259, 211346, 210551, 210045, 209719]
56464B09719j73L5J57q2p98j584j640o59O21J256J239J212J328J259J137J418
56448B14445J935K027J742J832K350K385J480L36l18o26r24j035p43k90M0K74
56432B24910M22L57J94J78J36k59p09o06j25m2m45o67n73o90r55o14L35R08P93
56413B22548Q66J535J872J170J75j07J90L97M38M57J85n15j085r98m35J60O32
56396B27485Q36O56N65J212K145K122J106N86J286J961J397L21J12P41J219J231
56380B44981J144J105J154J606K324K365J297J24n5M52P36P92J029J051K77p67
56364B59615r77l30J75k9n73r11p57n1Q33J151P19L58P77J560J907J788J639J452
56346B68346J024N90M22K81rmO57J493J904K017K192K255K001J756J731J522R79
$$ y = [209719, 209546, 209581, 209738, 209656, 208858, 207274, 205634, 204975, 205596, 206852, 208091, 209303, 210631, 211890, 213027, 214445, 216380, 218407, 220149, 221981, 224331, 226716, 228196, 228532, 228214, 227588, 226664, 225629, 224886, 224596, 224636, 224910, 225332, 225689, 225883, 226061, 226197, 225938, 225229, 224623, 224498, 224456, 224011, 223344, 222771, 222081, 221126, 220512, 220847, 221755, 222548, 223414, 224949, 226821, 227991, 228166, 228059, 228249, 228646, 229084, 229541, 229726, 229211, 228126, 227128, 226693, 226853, 227485, 228321, 228977, 229542, 230754, 232899, 235021, 236127, 236713, 237999, 239960, 241357, 241678, 241790, 242531, 243750, 244981, 246125, 247230, 248384, 249990, 252314, 254679, 255976, 256100, 256045, 256497, 257233, 258025, 259054, 260105, 260382, 259615, 258638, 258308, 258483, 258454, 257881, 256970, 256213, 256162, 256995, 258146, 258865, 259223, 260000, 261560, 263467, 265255, 266894, 268346, 269370, 269960, 270382, 270663, 270654, 270650, 271307, 272800, 274704, 276721, 278913, 281168, 283169, 284925, 286656, 288178, 289157]
56329B89157P67J239J652J485J579K753M117M135K842J625J213J127Q62M19j75
56314C14797q69j272j150r55j087j100m25N41J051J215J652K384K970L309L447
56299C24508L127K441K306L321M668N171M879M541M161L257K114J480J418J532
56285C68924J976L087M338M827M616M519M838N216N454N534N252M734M888O290
56271D34493Q077Q931Q768Q503Q653R131R895J0814J1406J1733J2826J5213J7797
56258E76240J9393K0584K2705K5735K8749L1763L5495L9801M3908M7855N2154
56247I44382N6455N9943O2741O5394O7497O8301O8163O7749O6298O2430N6302
56236A645655M9148M1062L1197J9922Q789j634j1941k1955l0511l7377m3437m8762
$$ y = [289157, 289924, 291163, 292815, 294300, 295879, 298632, 302749, 306884, 309726, 311351, 312564, 313691, 314553, 314972, 314797, 313928, 312656, 311506, 310551, 309464, 308364, 307939, 308480, 309531, 310746, 312398, 314782, 317752, 321061, 324508, 327635, 330076, 332382, 335703, 340371, 345542, 350421, 354962, 359123, 362380, 364494, 365974, 367392, 368924, 370900, 373987, 378325, 383152, 387768, 392287, 397125, 402341, 407795, 413329, 418581, 423315, 428203, 434493, 442570, 451501, 460269, 468772, 477425, 486556, 496451, 507265, 518671, 530404, 543230, 558443, 576240, 595633, 616217, 638922, 664657, 693406, 725169, 760664, 800465, 844373, 892228, 944382, 1000837, 1060780, 1123521, 1188915, 1256412, 1324713, 1392876, 1460625, 1526923, 1589353, 1645655, 1694803, 1735865, 1767062, 1786984, 1795773, 1794139, 1782198, 1760243, 1729732, 1692355, 1648918, 1600156]
56224A600156n2342n4058n5165n6361n7039n6807n6135n5065n2918m9798m6846
56213A007622m4516m2009l8846l5544l2392k8936k5287k2461k0897j9829j8603
56202F78302j7372j6148j4478j2513j1114j0433r491p784o131n423n438n362m677
56189E51938l296j576l00J25L21Q84J206N15l55P9J513K157J452P54J074J941
56173E58432K758L649M466M573M170M366N421O270O282O162O625P420Q169R051
56159F37814J0178J1293J2406J3737J5053J6025J7196J9323K1978K4183K6286
56148H25472K9691L4707M0311M6113N2916O1209P0633Q1053R2563J04251J14523
56137A553442J22768J29106J32517J30968J23823J12634R9480Q6053P4308O5933
$$ y = [1600156, 1547814, 1493756, 1438591, 1382230, 1325191, 1268384, 1212249, 1157184, 1104266, 1054468, 1007622, 963106, 921097, 882251, 846707, 814315, 785379, 760092, 737631, 716734, 696905, 678302, 660930, 644782, 630304, 617791, 606677, 596244, 586753, 578969, 572838, 567415, 561977, 556615, 551938, 548642, 547066, 546766, 546891, 547212, 548096, 549302, 549817, 549462, 549541, 551054, 553211, 554663, 555417, 556491, 558432, 561190, 564839, 569305, 573878, 578048, 582414, 587835, 594105, 600387, 606549, 613174, 620594, 628763, 637814, 647992, 659285, 671691, 685428, 700481, 716506, 733702, 753025, 775003, 799186, 825472, 855163, 889870, 930181, 976294, 1029210, 1090419, 1161052, 1242105, 1334668, 1438919, 1553442, 1676210, 1805316, 1937833, 2068801, 2192624, 2305258, 2404738, 2490791, 2565099, 2631032]
56127B631032O0581N6034N0399M3012L3517K1868R355k145j2035k0962k9359l7822
56115B803475m8224o2172p8510r4349j08191j19857j27932j30240j26866j20130
56105A787004j11493j00941q9307p8315o8120n7617m7348l9234l3255k7430k1396
56094A112548j6919j4360j1860q688o340n443m539k840j322k92J175K775K993
56081A046888K256K879N131O663O696P268R265J0797J0810J0838J1742J2165J1706
56068A155104J2205J4225J5621J5277J4978J5953J6877J6868J7157J8020J7604
56057A329889J5545J4392J5502J6880J6908J6832J7650J8059J7466J7629J9278
56046A516030K0518K0437K0888K2886K4818K5963K7879L0630L1716L0675L0412
$$ y = [2631032, 2691613, 2747647, 2798046, 2841058, 2874575, 2896443, 2905798, 2903653, 2891618, 2870656, 2841297, 2803475, 2755251, 2693079, 2614569, 2520220, 2412029, 2292172, 2164240, 2034000, 1907134, 1787004, 1675511, 1574570, 1485263, 1406948, 1338828, 1281211, 1233863, 1194629, 1161374, 1133944, 1112548, 1095629, 1081269, 1069409, 1060721, 1054381, 1048938, 1044399, 1041559, 1040237, 1039945, 1041120, 1043895, 1046888, 1049144, 1052023, 1057154, 1063817, 1070513, 1077781, 1087046, 1097843, 1108653, 1119491, 1131233, 1143398, 1155104, 1167309, 1181534, 1197155, 1212432, 1227410, 1243363, 1260240, 1277108, 1294265, 1312285, 1329889, 1345434, 1359826, 1375328, 1392208, 1409116, 1425948, 1443598, 1461657, 1479123, 1496752, 1516030, 1536548, 1556985, 1577873, 1600759, 1625577, 1651540, 1679419, 1710049, 1741765, 1772440, 1802852]
56035A802852L1979L2573L0901K9744L0735L1530L0893L1667L5470L9373M1068
56024B168785M2538M5365M7434M7694M9126N3269N6943N8141N9927O4514O9010
56013B762746P1274P4367Q0456Q6018Q8084Q9790R4412R9426J02033J05063J11578
56002C765247J18820J23470J27809J34810J42377J48310J55573J66589J77882
55993E060887J86475J95882K09544K24530K38069K53712K74264K95541L14322
55984G253226L35187L62027L90567M17312M47579M85985N27840N69334O17006
55975A1406063O76947P44481Q15606Q98373J000938J119451J251176J408165J603699
55966B0924899J837603K110863K441056K844760L318222L855444M471428N186565
$$ y = [1802852, 1834831, 1867404, 1898305, 1928049, 1958784, 1990314, 2021207, 2052874, 2088344, 2127717, 2168785, 2211323, 2256688, 2304122, 2351816, 2400942, 2454211, 2511154, 2569295, 2629222, 2693736, 2762746, 2834020, 2908387, 2988843, 3074861, 3162945, 3252735, 3347147, 3446573, 3548606, 3653669, 3765247, 3884067, 4007537, 4135346, 4270156, 4412533, 4560843, 4716416, 4883005, 5060887, 5247362, 5443244, 5652788, 5877318, 6115387, 6369099, 6643363, 6938904, 7253226, 7588413, 7950440, 8341007, 8758319, 9205898, 9691883, 10219723, 10789057, 11406063, 12083010, 12827491, 13643097, 14541470, 15542408, 16661859, 17913035, 19321200, 20924899, 22762502, 24873365, 27314421, 30159181, 33477403, 37332847, 41804275, 46990840]
55958D6990840O004927O933082Q004020R258764J0730005J2476949J4606180J7213131
55950A32217898K0326597K3925879K7874684L1629459L4006450L3503577K9141646
55943C32626190K1102740J0590086q23430j1683258k0777509k7223665l0686245
55936B73124909l1472104l0300764k7940985k5005516k1928027j8979423j6282870
55929A01215220j3870689j1753210r933639q389506p082309n984585n076821m327870
55921C4796591l701700l177504k744600k384839k077677j815679j598135j415347
55913A5881110j254277j113295r96261q97532q07008p24659o56116n98400n43400
55904H290162m91520m48884m14185l80490l47486l20420k98932k77658k56178
$$ y = [46990840, 52995767, 59928849, 67932869, 77191633, 87921638, 100398587, 115004767, 132217898, 152544495, 176470374, 204345058, 235974517, 269980967, 303484544, 332626190, 353728930, 364319016, 363495586, 351812328, 331034819, 303811154, 273124909, 241652805, 211352041, 183411056, 158405540, 136477513, 117498090, 101215220, 87344531, 75591321, 65657682, 57268176, 50185867, 44201282, 39124461, 34796591, 31094891, 27917387, 25172787, 22787948, 20710271, 18894592, 17296457, 15881110, 14626833, 13513538, 12517277, 11619745, 10812737, 10088078, 9431962, 8833562, 8290162, 7798642, 7349758, 6935573, 6555083, 6207597, 5887177, 5588245, 5310587, 5054409]
55895E054409k38380k23553k07544j91167j78599j68880j57503j45017j35808
55886C407958j29540j21794j12085j03688r6467q7375p7343p0625o7713o5481
55876B475847o3643o4703o8019p0128p0551p1521p2495p0678o6617o3728o2445
55865A731319o0060n6128n3001n1078m8371m4717m2046m0538l8560l6039l4048
55854A226733l1709k7447k2639k0074j9534j8716j7632j8084j9665k0295k0075
55843I90863k0680k1640k1114j9605j9095j9168j7870j5729j4992j5452j4845
55832G90673j2988j1789j1560j0937j0064j0274j0987j0412r000q819r898j0540
55820F63405j0727j1782j3083j2679j0917j0026j0281r960q798q132p770o127
$$ y = [5054409, 4816029, 4592476, 4384932, 4193765, 4015166, 3846286, 3688783, 3543766, 3407958, 3278418, 3156624, 3044539, 2940851, 2844384, 2757009, 2679666, 2609041, 2541328, 2475847, 2412204, 2347501, 2279482, 2209354, 2138803, 2067282, 1994787, 1924109, 1857492, 1793764, 1731319, 1671259, 1615131, 1562130, 1511052, 1462681, 1417964, 1375918, 1335380, 1296820, 1260781, 1226733, 1195024, 1167577, 1144938, 1124864, 1105330, 1086614, 1068982, 1050898, 1031233, 1010938, 990863, 970183, 948543, 927429, 907824, 888729, 869561, 851691, 835962, 820970, 805518, 790673, 777685, 765896, 754336, 743399, 733335, 723061, 712074, 701662, 692662, 683843, 673945, 663405, 652678, 640896, 627813, 615134, 604217, 594191, 583910, 573950, 565152, 557020, 549250, 543123]
55808E43123l508j983j834j261L02J487J824K407L613M629N282N909N676L515
55794E69181L77j907l473n591p760q484q164q228q024n897k856j802l284n263
55780D98825o840q950j1384j2545j2381j2407j2575j1323q875p298o909n813l494
55767C78031j833j856k387k617l202m195m527m132m178m667m388l570l826n088
55753C27565n369m151l214l441l640l288l594m857n468m642l741l807m066l924
55739B70363m138m949n163m201l085k477j743p44m91j142j354n86o6o23j465j959
55723B36177k649l640l891l044k173j947j785j460j613k033j482o3M37o29j593
55708B08612j163j42N92J638L298M163L058Q59r19j955k454k213j492j380k135
$$ y = [543123, 539615, 537632, 535798, 534537, 534839, 536326, 538150, 540557, 544170, 548799, 554081, 559990, 565666, 569181, 569558, 567651, 564178, 558587, 550827, 542343, 534179, 525951, 517927, 512030, 509174, 507372, 504088, 498825, 491985, 483035, 471651, 459106, 446725, 434318, 421743, 410420, 401545, 394247, 387338, 381525, 378031, 376198, 374342, 371955, 369338, 366136, 361941, 357414, 353282, 349104, 344437, 340049, 336479, 332653, 327565, 322196, 318045, 314831, 311390, 307750, 304462, 300868, 296011, 290543, 285901, 282160, 278353, 274287, 270363, 266225, 261276, 256113, 251912, 248827, 246350, 244607, 243863, 243372, 242230, 240876, 240290, 240224, 239601, 238136, 236177, 233528, 229888, 225997, 222953, 220780, 218833, 217048, 215588, 213975, 211942, 210460, 210397, 210834, 210205, 208612, 207449, 207307, 207899, 209537, 212835, 216998, 220056, 220915, 219996, 218041, 215587, 213374, 211882, 210502, 208367]
55693B08367k530j850j102j214j507j065k90J49N07J052J221P83O22J257J826
55678B06226J595J288J774K597K885K707K416J652J83j130j299n48J69M27M57
55663B21399N73R67J509J582Q31M3K06Q14M94o87j180m67J91m8m79n62j028k328
55645B21830l595m081m223m373m029l143k776l390l938l658l365l886m518m280
55631A68575l476k858k326j596j112j244j432j141p35n88l07L61Q59Q61Q91J129
55615A55861P66n77j912k298k118k105k148j919j616j337p46q0k10j027j209l51
55599A36974J64n08j195p61j34o42j704j882j202p51p08m44RQ9j05k7K83M43N32
55580A28431P76R92J142J737K859L576L256K618K624L161L748M539N601O087N316
$$ y = [208367, 205837, 203987, 202885, 201671, 200164, 199099, 198809, 198958, 199465, 200517, 201738, 202521, 203143, 204400, 206226, 207821, 209109, 210883, 213480, 216365, 219072, 221488, 223140, 223323, 222193, 220894, 220346, 220515, 220942, 221399, 221972, 222939, 224448, 226030, 226861, 226904, 227110, 227924, 228418, 227731, 226551, 226084, 226275, 226227, 225748, 225186, 224158, 221830, 218235, 214154, 209931, 205558, 201529, 198386, 195610, 192220, 188282, 184624, 181259, 177373, 172855, 168575, 165099, 162241, 159915, 158319, 157207, 155963, 154531, 153390, 152655, 152067, 151760, 152121, 152980, 153841, 154732, 155861, 156627, 156050, 154138, 151840, 149722, 147617, 145469, 143550, 141934, 140597, 139851, 139771, 139561, 138534, 137325, 136974, 137138, 136630, 135435, 134674, 134540, 133898, 132194, 130312, 129110, 128359, 127651, 127207, 127216, 127305, 127200, 127173, 127456, 127899, 128431, 129207, 130199, 131341, 133078, 135937, 139513, 142769, 145387, 148011, 151172, 154920, 159459, 165060, 171147, 176463]
55565A76463L905K766J742K16j688l475n023o100o055m973m087m100m167l545
55551A41879k966l125l163k237j347j774k700k314o38P00J041J141J360J225P85
55536A27867P60J214J419J084O42L25K3j48l8k7m46q88r62j211k145l043k963
55519A21463k355k323k742k619j926j590j810j864j537j343j327j002m95n05j017
55504I7008j155m98M81J278J726J567O51m51r28p94o46o06m08k34m11n23L5Q20
55486I6912Q49K03p7K99N50K83J03M99J051J118N57k91p84k70J129K147J692K96
55468A06266n84m55m1O4j00m84j080j413j048n28p57j522j716j035k92j0J27L28
55450I5720K51k21o92r48j083r39k43O18R15P08O89R50Q77L61J2J8j09m56m72
$$ y = [176463, 180368, 183134, 184876, 185092, 183404, 179929, 174906, 168806, 162751, 157778, 153691, 149591, 145424, 141879, 138913, 135788, 132625, 130388, 129041, 127267, 124567, 122253, 121615, 122315, 123356, 124497, 125857, 127082, 127867, 128627, 129841, 131260, 132344, 132986, 133311, 133334, 133186, 133148, 133121, 132675, 131787, 130825, 129614, 127469, 124426, 121463, 119108, 116785, 114043, 111424, 109498, 107908, 106098, 104234, 102697, 101354, 100027, 99025, 98530, 98025, 97008, 95853, 95355, 95836, 97114, 98840, 100407, 101058, 100607, 99679, 98885, 98239, 97633, 97225, 96991, 96580, 96057, 96092, 96912, 97761, 97964, 97887, 98186, 98736, 99019, 99122, 99621, 100672, 101790, 102347, 102056, 101272, 101002, 102131, 104278, 105970, 106266, 105682, 105227, 105186, 105250, 105150, 104666, 103586, 102173, 101125, 100597, 99840, 98318, 96602, 95567, 95275, 95265, 95392, 95720, 95971, 95750, 95058, 94110, 93027, 92088, 91845, 92463, 93378, 94086, 94775, 95725, 96602, 96963, 96975, 96993, 96884, 96428, 95956]
55431I5956r2l6n74r55n76J14L80J80q3k06j78q7j94o76j125r38k26K62J81p6
55411I1051j42m3J88N14M86k47j000n89R57K165J950P98k30p54q70n58J06O47
55393I4429P31N67M45L05J26J88N93R53R33P31O53O16L38k06p83j158j173q20
55375I7468l01J66N49Q13O78jp45r23n50k75n29j178j886k303k063j162k16J68
55357H7710J74L82Q12J036J040J202J435J199L80m66q58p88l57L14P96O44oo18
55339I4031r21r06m42L92Q80N07m8K14R34Q12l29j150q20j19n9m17m15O5N84R12
55319I3705J010P72K62r3l3J88K43J06j72o00r63r04n02k53l17k82O5L42J59k89
55299I2444n34l49J95Q12J056P36K41R8K70L60L53N09O43L44j36q5M92P06O5q57
$$ y = [95956, 95864, 95828, 95254, 94299, 93723, 93837, 94217, 94397, 94314, 94108, 93930, 93843, 93649, 92973, 91848, 90910, 90684, 90946, 91127, 91051, 90909, 90866, 91054, 91568, 92054, 91807, 90807, 90218, 91175, 93340, 95290, 96088, 95858, 95104, 94234, 93676, 93782, 94429, 95160, 95727, 96172, 96477, 96603, 96791, 97384, 98337, 99270, 100001, 100654, 101270, 101608, 101402, 100619, 99461, 98288, 97468, 97167, 97333, 97882, 98695, 99373, 99372, 98627, 97704, 97154, 96879, 96350, 95172, 93286, 90983, 88920, 87758, 87542, 87710, 87884, 88266, 89078, 90114, 91154, 92356, 93791, 94990, 95370, 94904, 94046, 93258, 92901, 93215, 94011, 94655, 94649, 94031, 93110, 92204, 91762, 92154, 93034, 93541, 93493, 93707, 94641, 95453, 95124, 93974, 93154, 93035, 92976, 92559, 92144, 92209, 92793, 93705, 94715, 95487, 95749, 95656, 95623, 95811, 96054, 96160, 95988, 95388, 94425, 93521, 93019, 92766, 92449, 92167, 92232, 92574, 92733, 92444, 91910, 91561, 91756, 92568, 93624, 94360, 94601, 94699, 94969, 95329, 95682, 96191, 96834, 97178, 97042, 96957, 97449, 98155, 98220, 97363]
55279I7363j312j278j143j064r95q73o11k53j51n55j048r80l77J80M84P74J058
55262H9219J097J015J096J064M87k77m57q5J76K90P20J163Q25pk15J72j30j282
55244I4871j662m57Q35O03m95q03j45M51O36Q45R89N21l85r04p20k14L32Q54R91
55225I6143L80o27j208j037n20j88k80o91r53n31M80J291J367J031P39L89j58
55208I5627n19l70j14k57n51m46K0M31P30J050J154P16n7o36q16o12N0J000J520
55189I7920J104K36k34j41O5J66K26O5m79r43o16M38J322J308M71o54j554j950
55171I6750j899j705j479r93j57O19R78J114J323J410J081O08N07P13P07K71l61
55154I9487r75j459j567j091k96L05M62K45k64q36r68m26K67M56L04N20J163J425
$$ y = [97363, 96051, 94773, 93630, 92566, 91571, 90698, 90087, 89834, 89683, 89128, 88080, 87100, 86723, 86903, 87387, 88161, 89219, 90316, 91331, 92427, 93491, 93978, 93701, 93244, 93159, 93335, 93625, 94345, 95508, 96333, 96326, 96111, 96283, 96153, 94871, 93209, 92752, 93587, 94190, 93695, 92892, 92747, 93198, 93834, 94679, 95668, 96189, 95804, 94900, 94180, 93966, 94298, 95152, 96143, 96523, 95896, 94688, 93651, 93131, 92943, 92663, 91972, 91019, 90488, 90968, 92259, 93626, 94657, 95396, 95785, 95627, 95108, 94738, 94624, 94367, 93816, 93370, 93390, 93821, 94551, 95601, 96755, 97471, 97414, 96778, 95962, 95350, 95400, 96400, 97920, 99024, 99260, 99026, 98885, 98950, 99116, 99342, 99407, 98928, 97985, 97369, 97807, 99129, 100437, 100908, 100254, 98700, 96750, 94851, 93146, 91667, 90674, 90517, 91136, 92114, 93228, 94551, 95961, 97042, 97650, 98157, 98870, 99577, 99848, 99487, 98512, 97053, 95486, 94395, 94099, 94404, 94866, 95111, 94847, 94011, 93043, 92617, 92884, 93340, 93644, 94164, 95327, 96752]
55136I6752Q29Kq2P39J674J865J146M3p72j033r58q83r06q84o78k71K40P06R99
55117I8528J038P50J56m31o22n19o75j175j209k12J063J395P88L66O90J206J408
55100A02545J416J215M46o39j060m98K19M99Q07J448J637Q00j39Q2J229K011J814
55083A13832J037Q7q40j337j099n86n17q43r44o17j25L59P00M95l23r95q76n41
55065A06867r19j629j368P6J357J360M74k11k05K84R04J355J396J003L99j40l44
55048A10659q7K56l4j029j729j258j55K85k44q55q73n38k58p5n0l69q22q51l67
55029A01606J07L12N92J070J237P51J05l9K44L97K34Q5J64K96K21r2m76p78r19
55010A05117q59n70j27K03J76l7N4O40J279J440J192J057J270J510J362Q74O00
$$ y = [96752, 97581, 97583, 97501, 98240, 99914, 101779, 102925, 102968, 102196, 101163, 100205, 99322, 98416, 97532, 96854, 96583, 96823, 97529, 98528, 99566, 100316, 100472, 100041, 99419, 98900, 98225, 97050, 95841, 95629, 96692, 98087, 98875, 99241, 99931, 101137, 102545, 103961, 105176, 105622, 104983, 103923, 103425, 103644, 104143, 104950, 106398, 108035, 108835, 108696, 108778, 110007, 112018, 113832, 114869, 114956, 114116, 112779, 111680, 111094, 110577, 109734, 108790, 108173, 108048, 108407, 109107, 109602, 109279, 108284, 107408, 106867, 105948, 104319, 102951, 103027, 104384, 105744, 106218, 106007, 105802, 106086, 106990, 108345, 109741, 110744, 111143, 111003, 110659, 110572, 110828, 110794, 109765, 108036, 106778, 106623, 106908, 106664, 105809, 104936, 104398, 104140, 104065, 104015, 103646, 102824, 101973, 101606, 101713, 102025, 102617, 103687, 104924, 105675, 105780, 105741, 105985, 106382, 106616, 106701, 106865, 107161, 107382, 107290, 106814, 106036, 105117, 104258, 103688, 103561, 103764, 103940, 103903, 103957, 104597, 105876, 107316, 108508, 109565, 110835, 112345, 113707, 114581, 115181]
54993A15181J018J849K122J196l40j231j016l56O6L14O05P80P24O64N87M4r15
54976A21292j373p79J29M53N13J051J698J407K30o24m73J64O38R11R96N79l21
54959A26491j078j170p25j17M55P66M31o11j782k265j700m73N77Q41N19L00L87
54942A20846K52l93r78r07m56j62J02O95J296J351J081J135J449J483J372J743
54926A29909K497K853K763L139M370N629O031N752N464N362N152M478L113J211
54912A87723m74j234j397k045l566n131n823n602m925m100l367l012l011k956
54898A41080k657k331k096j748j270r20o30M6J057J564J019N7k15N78J929L194
54882A38657M004M196L818L230K889K987L368L737L937M010L921L353K019K94
$$ y = [115181, 116199, 118048, 120170, 121366, 121026, 119795, 118779, 118423, 118489, 118803, 119408, 120188, 120912, 121576, 122163, 122207, 121292, 119919, 119140, 119269, 119722, 120235, 121286, 122984, 124391, 124621, 123997, 123524, 123688, 124326, 125237, 126233, 126812, 126491, 125413, 124243, 123518, 123401, 123856, 124622, 125053, 124442, 122660, 120395, 118695, 118222, 118799, 119640, 120159, 120459, 120846, 121098, 120705, 119727, 118820, 118364, 118202, 118304, 118999, 120295, 121646, 122727, 123862, 125311, 126794, 128166, 129909, 132406, 135259, 138022, 141161, 145531, 151160, 157191, 162943, 168407, 173769, 178921, 183399, 186512, 187723, 187249, 186015, 184618, 182573, 179007, 173876, 168053, 162451, 157526, 153426, 150059, 147047, 144036, 141080, 138423, 136092, 133996, 132248, 130978, 130058, 129428, 129474, 130531, 132095, 133114, 133171, 132956, 133534, 135463, 138657, 142661, 146857, 150675, 153905, 156794, 159781, 163149, 166886, 170823, 174833, 178754, 182107, 184126, 184420]
54868A84420j008j695k439l592m464m387l835l597l491k990k589l186m291m418
54854A38438l284k208j982j859j162n27p42j418j720j564j277q14j73M4n92j503
54838A17657j771j270n04K44R16J206Q51J91j72j81k94p80j402j704j353l96O35
54821A11873J110R70P18O65O06M17L64N94Q13P96P51Q25P47L13j97m52n18n78
54803A19817o00n29m17j43M95J217J350P41%l75n28o04l78N0J2o97j263j015m48
54784A16685l19l47K72J484K458K783K765K628K271J818J715K118K711L149L352
54769A45543L346L244L316L740M341M816N045M970M412L369K260J498R39J68r19
54754A90088k086l151m108m941n596n966n787m792l216j787j003p51p74j088j584
$$ y = [184420, 183412, 181717, 179278, 175686, 171222, 166835, 163000, 159403, 155912, 152922, 150333, 147147, 142856, 138438, 135154, 132946, 130964, 129105, 127943, 127416, 126674, 125256, 123536, 121972, 120695, 119881, 119708, 119752, 119160, 117657, 115886, 114616, 114112, 114356, 115272, 116478, 117329, 117520, 117348, 117167, 116873, 116093, 114691, 112987, 111634, 111238, 111873, 112983, 113953, 114671, 115336, 115942, 116359, 116723, 117317, 118130, 118926, 119677, 120502, 121249, 121562, 121365, 120913, 120395, 119817, 119217, 118688, 118271, 118128, 118623, 119840, 121190, 121931, 121931, 121556, 121028, 120424, 120046, 120096, 120108, 119411, 118148, 117133, 116685, 116366, 116019, 116291, 117775, 120233, 123016, 125781, 128409, 130680, 132498, 134213, 136331, 139042, 142191, 145543, 148889, 152133, 155449, 159189, 163530, 168346, 173391, 178361, 182773, 186142, 188402, 189900, 190839, 191007, 190088, 188002, 184851, 180743, 175802, 170206, 164240, 158453, 153661, 150445, 148658, 147655, 146904, 146130, 145042, 143458]
54739A43458j729j160k67K76L44L20M22N61O73Q39J109J398J560J498J399J821
54723A52522L126M843O047O376O177N647M618L261K121J123m80k753m599n261
54709A82768n352n714o040n618m663l873l280k596k155k377k675k090q51j37l95
54694A34952q86r55p41n53m31m91q41j100p72j47om01n22m5L86K10k37l95k26
54675A26799J06O40J218J240M16o18r63n09M6J20j79l82k03K07M90N04M18M19
54657A29769L77Q1l61n89l97P7N40P42O12L62L63P28J116J140P36O1o79j121q57
54638A32700j1O91P81N75M91L17k56q59q96m88k12j62j7J69N2k31j41L64P32O40
54618A34239K34l40r81j206n81M13P57K94j1N03J332J677J431R10K79k65l62l1
$$ y = [143458, 141729, 140569, 140302, 140578, 140922, 141242, 141664, 142225, 142898, 143737, 144846, 146244, 147804, 149302, 150701, 152522, 155648, 160491, 166538, 172914, 179091, 184738, 189356, 192617, 194738, 195861, 195381, 192628, 188029, 182768, 177416, 171702, 165662, 160044, 155381, 151508, 148228, 145632, 143477, 141100, 138425, 136335, 135484, 135347, 134952, 134066, 133111, 132370, 131817, 131386, 130895, 130054, 128954, 128182, 128035, 128029, 127628, 127106, 127061, 127447, 127657, 127420, 127025, 126799, 126905, 127545, 128763, 130003, 130419, 129801, 128838, 128329, 128375, 128495, 128316, 127934, 127731, 127938, 128428, 128932, 129350, 129769, 130146, 130227, 129866, 129277, 128880, 128957, 129497, 130239, 130851, 131213, 131576, 132304, 133420, 134560, 135296, 135357, 134678, 133557, 132700, 132689, 133380, 134161, 134736, 135227, 135544, 135288, 134429, 133533, 133045, 132833, 132671, 132654, 132823, 132875, 132644, 132503, 132867, 133599, 134239, 134473, 134133, 133152, 131946, 131365, 131778, 132535, 132829, 132818, 133321, 134653, 136330, 137761, 138671, 138950, 138685, 138323, 138292]
54600A38292J48j94o67p57n43l81l45l98o35q62m55P38J747J532L91m37m54l34
54582A36386n75o72lJ037J470J016L18j5k7l2n9jK3k03n93p92n96j03N19J123
54562A38221J455J289Q17N39O26O87L61j04j88K82J021J611J665J061K89K64J256
54545A51152K293K204J121L25O09J401J702J305P02K54j04m51o54o02m62n41q80
54528A59374j162j068o84l32q8K92Q77J255J003K38n18q77q19n16k10j19k55l43
54510A56048j68J69M00M21K96O8k02l71l65k88k60k41j06J81N86R41R05K37p67
54491A57484j460j535j258r02l81L83J166J703J887J572O98k15k93O30J725K285
54475A63489K514K788K810K162J108K62j38o0O84J921K726K387J370O64M88M62
$$ y = [138292, 138440, 138246, 137579, 136822, 136279, 135898, 135553, 135155, 134520, 133658, 133203, 133941, 135688, 137220, 137611, 137174, 136720, 136386, 135811, 135139, 135136, 136173, 137643, 138659, 138977, 138962, 138935, 138903, 138844, 138843, 138866, 138663, 138070, 137278, 136682, 136579, 137098, 138221, 139676, 140965, 141782, 142321, 142947, 143634, 143995, 143891, 143703, 143985, 145006, 146617, 148282, 149343, 149632, 149896, 151152, 153445, 155649, 156770, 157095, 157704, 159105, 160807, 162112, 162814, 163068, 162964, 162513, 161859, 161257, 160795, 160254, 159374, 158212, 157144, 156460, 156128, 156040, 156332, 157209, 158464, 159467, 159705, 159187, 158310, 157491, 156975, 156765, 156646, 156391, 156048, 155880, 156049, 156449, 156870, 157166, 157234, 157032, 156661, 156296, 156008, 155748, 155507, 155401, 155582, 156168, 157109, 158014, 158251, 157484, 156024, 154489, 153231, 152329, 151948, 152331, 153497, 155200, 157087, 158659, 159357, 159142, 158849, 159479, 161204, 163489, 166003, 168791, 171601, 173763, 174871, 175133, 174995, 174935, 175619, 177540, 180266, 182653, 184023, 184687, 185175, 185637]
54459A85637N47R25J187P13k10n67l0O34O55Q8n45r03r67j029j456k142k424j989
54441A78124j423j354j413q83K8M52J92j13j2L60P82J033P09k72j162j304j143
54424A72601j440j817j318j54N48O26J049K002K357J525M44J22L07L09N2k80p50
54407A76183j170j001k77J50q0k23L46J127J383J224J107R88O68L31P0l96r43
54390A79487p22O33K111K486J793R00K06m31r23j062j093j399j769j684j145n91
54374A76797j45M08J075J568J711J515J020M20J32L72Q14R90Q31O00M82N08O75
54357A89773R44J248J530J584J052M2n18J15J241J400L45p38j109j393k147k739
54341A90630k483j844j653j825j795j575j482j413j172j032j207j307j017p83
$$ y = [185637, 186184, 187109, 188296, 189009, 188799, 188232, 188202, 188836, 189491, 189579, 189034, 188131, 187164, 186135, 184679, 182537, 180113, 178124, 176701, 175347, 173934, 173051, 173079, 173531, 173723, 173610, 173598, 173958, 174740, 175773, 176482, 176210, 175048, 173744, 172601, 171161, 169344, 168026, 167872, 168420, 169046, 170095, 172097, 174454, 175979, 176423, 176545, 176852, 177161, 177213, 176933, 176183, 175013, 174012, 173735, 173885, 173805, 173582, 173928, 175055, 176438, 177662, 178769, 179757, 180425, 180756, 180826, 180430, 179487, 178765, 179398, 181509, 183995, 185788, 186688, 186894, 186463, 185540, 184478, 183385, 181986, 180217, 178533, 177388, 176797, 176652, 177060, 178135, 179703, 181414, 182929, 183949, 184369, 184501, 184873, 185687, 186677, 187508, 188108, 188590, 189098, 189773, 190717, 191965, 193495, 195079, 196131, 196173, 195655, 195770, 197011, 198411, 198756, 198018, 196909, 195516, 193369, 190630, 188147, 186303, 184650, 182825, 181030, 179455, 177973, 176560, 175388, 174356, 173149, 171842, 170825, 170042]
54327A70042r97j149o36K04O72Q16R62P18l97j750k163j521p18j83L92R71R22
54310A66185J51m94l06M32R25P47R6m66n26l03m22r74j224p34j42j99n17j90P43
54291A62782J396J338Q75K66m44r03p29k54j27k76j36J84Mo18q29l84q7m40q37
54272A60781n64J58O94R28J083J109P78J75l36m61j63K76L87l2n45n39k5M86Q03
54253A64993J206J765K092J950J580J202O98l7p73j239j408j352j084o90l95l70
54237A68138n74p89p25k83J57O6m27m81K89J106J059L48j94m42q68j427j532j105
54219A62316o60l34K28R55J264J063R09R42O33j84q73j046j098j348j465j219
54203A60083r84r43o43N4M29nn16j71O94R66L81k31k51K9mm95j076j149l71Q80
$$ y = [170042, 169045, 167896, 167260, 167464, 168136, 168952, 169914, 170632, 170235, 168485, 166322, 164801, 164083, 163900, 164292, 165263, 166185, 166336, 165842, 165536, 165968, 166893, 167640, 167736, 167270, 166744, 166441, 166019, 165045, 163821, 163087, 162945, 162746, 162229, 162039, 162782, 164178, 165516, 166391, 166657, 166213, 165310, 164581, 164327, 164200, 163924, 163788, 163972, 163976, 163358, 162529, 162145, 162058, 161618, 160781, 160217, 160375, 161069, 161997, 163080, 164189, 164967, 165142, 164806, 164345, 164182, 164458, 164845, 164813, 164268, 163729, 163704, 164190, 164993, 166199, 167964, 170056, 172006, 173586, 174788, 175486, 175449, 174676, 173437, 172029, 170677, 169593, 168903, 168508, 168138, 167564, 166775, 166050, 165767, 165924, 165990, 165563, 165082, 165371, 166477, 167536, 167884, 167690, 167248, 166380, 164953, 163421, 162316, 161656, 161322, 161550, 162505, 163769, 164832, 165741, 166683, 167316, 167132, 166259, 165213, 164115, 162767, 161302, 160083, 159099, 158156, 157513, 157567, 157996, 157991, 157475, 157304, 157998, 158964, 159345, 159114, 158863, 158892, 158888, 158393, 157317, 156168, 155797, 156677]
54183A56677J637J277K80l82l41jK60M49O38P45P61P48N64o9r86j478j067k45
54165A59467q8j014k175k300j103M00R76L89o47j299j192m20N03Q36K69o28r75
54148A50999n86j6L30N67P60O84M08M73J050J438R74Q7j86M11J071J090O98N18
54130A60770O11N62L13L88J075J785J651O48l78p72o92n24k32L03Q10J004J096
54113A68418J377J598J344Q00M60K58k14p47o26J86P89N84j8m02o01q60r83o92
54095A70671k16j4j00j47n7j8r9j33N9M81R80J359J566J719J851J761J390J204
54077A82257J667K501K992L106L625M961O397O854N891L775J113j255k548k794
54063B18542k903l571m437m693m125l167k199j353p68n50n03l02J43O72J106J302
$$ y = [156677, 158314, 159591, 159871, 159489, 159148, 159147, 159407, 159856, 160494, 161239, 162000, 162748, 163312, 163243, 162257, 160779, 159712, 159467, 159379, 158365, 156190, 153890, 152787, 153187, 154163, 154552, 153905, 152606, 151414, 150994, 151497, 152333, 152602, 151974, 150999, 150413, 150397, 150727, 151294, 152054, 152738, 153146, 153619, 154669, 156107, 157081, 157168, 156982, 157393, 158464, 159554, 160252, 160770, 161381, 161943, 162256, 162644, 163719, 165504, 167155, 167803, 167425, 166653, 165961, 165437, 165205, 165508, 166318, 167322, 168418, 169795, 171393, 172737, 173537, 173997, 174255, 174041, 173294, 172668, 172854, 173643, 174227, 174209, 173807, 173206, 172346, 171363, 170671, 170455, 170441, 170341, 170194, 170137, 170119, 170020, 169887, 169946, 170427, 171407, 172766, 174332, 176051, 177902, 179663, 181053, 182257, 183924, 186425, 189417, 192523, 196148, 201109, 207506, 214360, 220251, 224026, 225139, 223884, 221336, 218542, 215639, 212068, 207631, 202938, 198813, 195646, 193447, 192094, 191326, 190776, 190273, 189971, 190114, 190786, 191892, 193194]
54047A93194J166Q72Q50J312J953K322K377K454K891L760M800N540N667N379N123
54032B39660N037M995N118N636O228O170N380M604M239L735K640J474Q82N93J06
54017B96497j85L86J332J388L58n46m95j28m28j277j873j977j977k032j940j885
54001B85218k513l957n332n683n171m721m699m518l751k894k600k699k590k263
53987B31827k184k365k260j684j118r72j180j574k026k136j519n91l16q80j405
53972B09617j287r75r28o79K16J110J068K41m42n99n06k15M71J288J672J595J548
53955B13195J662J602J282J096J313J807K356K731K658K192J975K519L405L875
53941B43668L949M191M582M584M319M552N419O127O261O397P010P686P937Q074
$$ y = [193194, 194360, 195232, 196082, 197394, 199347, 201669, 204046, 206500, 209391, 213151, 217951, 223491, 229158, 234537, 239660, 244697, 249692, 254810, 260446, 266674, 272844, 278224, 282828, 287067, 290802, 293442, 294916, 295798, 296391, 296497, 296312, 296698, 298030, 299418, 299776, 299230, 298735, 298607, 298179, 296902, 295029, 293052, 291075, 289043, 287103, 285218, 282705, 278748, 273416, 267733, 262562, 257841, 253142, 248624, 244873, 241979, 239379, 236680, 234090, 231827, 229643, 227278, 225018, 223334, 222216, 221244, 220064, 218490, 216464, 214328, 212809, 212218, 211902, 211022, 209617, 208330, 207355, 206427, 205748, 205964, 207074, 208142, 208383, 207941, 207342, 206836, 206621, 207092, 208380, 210052, 211647, 213195, 214857, 216459, 217741, 218837, 220150, 221957, 224313, 227044, 229702, 231894, 233869, 236388, 239793, 243668, 247617, 251808, 256390, 260974, 265293, 269845, 275264, 281391, 287652, 294049, 301059, 308745, 316682, 324756]
53927C24756Q564R157R264Q711P555N648L048M98j151j806j886j594q89R5J161
53912C71131K351L616M500M684M575M681M709L963K564J396Q06K27p59j759k308
53897D04377k579k870l014k870k860l400m112m361m318m751n760o600o847o975
53883C43060p379p592p045o066n399n076m591l988l868m268m353l665k876k801
53869B74093l274l594l621l725l889l699l154k749k657k509k147j991k308k658
53855B32118k509j938j365q81m11k38p23j538j813j206m31l64r99j563j475q52
53839B13812k29o3m82j159j471j013j19M68N11N26R30J314J023K55j11K47O06
53822B15045K58m65o46j7Q01J159J034P67O13O89J074J710K386K899L216L332
$$ y = [324756, 333320, 342477, 351741, 360452, 368007, 373655, 376703, 377201, 376050, 374244, 372358, 370764, 369875, 369970, 371131, 373482, 377098, 381598, 386282, 390857, 395538, 400247, 404210, 406774, 408170, 408976, 409203, 408444, 406685, 404377, 401798, 398928, 395914, 393044, 390184, 386784, 382672, 378311, 373993, 369242, 363482, 356882, 350035, 343060, 335681, 328089, 321044, 314978, 309579, 304503, 299912, 295924, 292056, 287788, 283435, 279770, 276894, 274093, 270819, 267225, 263604, 259879, 255990, 252291, 249137, 246388, 243731, 241222, 239075, 237084, 234776, 232118, 229609, 227671, 226306, 225425, 225014, 224776, 224053, 222515, 220702, 219496, 219065, 218701, 217702, 216139, 214664, 213812, 213583, 213520, 213038, 211879, 210408, 209395, 209276, 209744, 210255, 210781, 211711, 213025, 214048, 214303, 214192, 214439, 215045, 215303, 214838, 214192, 214175, 214976, 216135, 217169, 217936, 218549, 219238, 220312, 222022, 224408, 227307, 230523, 233855]
53806B33855L204K926K810L070L550L942M219M619N167N506N350M922M692M753
53792B92585M672M106L304K846K928L058K550J230l53j473j916k047k230k379
53778C06881k316k314k837l737m181l736l041k996l531l771l324k808k926l538
53764B61825l960l832l344k800k344k065k059k246k287j932j371j126j469k017
53750B28973k112j605j001p70q01p10m32j61K7J25qm19p10m19L09Q60R50P58L81
53731B23235k63q42o25N10J629J808J292J100J608K099J723N61m40n06K05Q48
53715B33942Q96O30O35J057J609K036K202J997J612J719K733L947M202L427K775
53700B65419L001L533L517L029K645K457K238K149K541L265L788L846L511K779
$$ y = [233855, 237059, 239985, 242795, 245865, 249415, 253357, 257576, 262195, 267362, 272868, 278218, 283140, 287832, 292585, 297257, 301363, 304667, 307513, 310441, 313499, 316049, 317279, 316926, 315453, 313537, 311490, 309260, 306881, 304565, 302251, 299414, 295677, 291496, 287760, 284719, 281723, 278192, 274421, 271097, 268289, 265363, 261825, 257865, 254033, 250689, 247889, 245545, 243480, 241421, 239175, 236888, 234956, 233585, 232459, 230990, 228973, 226861, 225256, 224255, 223485, 222684, 221974, 221542, 221381, 221408, 221533, 221525, 221106, 220396, 219977, 220286, 221146, 222096, 222854, 223235, 222972, 222130, 221505, 222015, 223644, 225452, 226744, 227844, 229452, 231551, 233274, 233835, 233395, 232889, 233094, 233942, 234838, 235468, 236103, 237160, 238769, 240805, 243007, 245004, 246616, 248335, 251068, 255015, 259217, 262644, 265419, 268420, 271953, 275470, 278499, 281144, 283601, 285839, 287988, 290529, 293794, 297582, 301428, 304939, 307718]
53686C07718J604K91o56j059j096r53p52p33j029j346j208n85j3k6o33j324j469
53669B96731q49P4M73k8r70j494j079Q6J233J489N90p30j376r88j80L04K33k26
53651B93293p27p11P2R55Q58k95j334j341o38M8N76J020J164J083J476K599L490
53634C01588L184K134J494J470J401J127J108J350J286Q03M65O25J108J738K470
53619C23351L046L286L576M338N074M942M122L675L930M118L808L700M477N762
53605C81205O725P065O896O228N164M167L633L375K897J967P70k94q82r92r86
53590D26938j100j072o39j73k79q59j250j282j441j983k508k638k495k361k338
53575D04520k490k777k831k309j502r97p62l08L14N19K86L18Q63J250R53L33q5
$$ y = [307718, 309322, 309613, 308957, 307898, 306802, 305849, 305097, 304364, 303335, 301989, 300781, 300196, 300183, 300157, 299524, 298200, 296731, 295882, 295956, 296429, 296401, 295431, 293937, 292858, 292944, 294177, 295666, 296256, 295526, 294150, 293162, 292982, 293286, 293519, 293293, 292566, 291855, 291927, 292882, 293740, 293445, 292111, 290770, 290132, 290180, 290756, 291776, 292940, 294023, 295499, 298098, 301588, 304772, 306906, 308400, 309870, 311271, 312398, 313506, 314856, 316142, 316945, 317410, 318035, 319143, 320881, 323351, 326397, 329683, 333259, 337597, 342671, 347613, 351735, 355410, 359340, 363458, 367266, 370966, 375443, 381205, 387930, 394995, 401891, 408119, 413283, 417450, 421083, 424458, 427355, 429322, 430092, 429798, 428916, 427924, 426938, 425838, 424766, 424127, 423954, 423675, 422816, 421566, 420284, 418843, 416860, 414352, 411714, 409219, 406858, 404520, 402030, 399253, 396422, 394113, 392611, 391614, 390852, 390544, 390858, 391377, 391663, 391981, 392844, 394094, 395047, 395380, 395295]
53558C95295k70k14L65J286J651R58j33o84o00k87J55P19J033Q74P59J281K171
53541D04359K740K946L314L886M115L845L722M358N504O372O640O770P365Q338
53527D74274R008R099R226J0071J1350J2193J2416J2632J3155J3548J3547J3680
53515F14199J4539J5998J7573J9063K0427K1472K2127K2662K3328K4078K4817
53504H40283K5554K6039K5825K4934K3997K3474K3249K3155K3299K3553K3441
53493A106803K2909K2505K2394K1968K1003K0328K0571K0943K0254J8627J7234
53482A335539J6683J6587J6539J6554J6627J6540J6212J5668J4732J3242J1404
53471A506327R541P596N369K992P22j424l521n518p638j0348j3408j5568j6044
$$ y = [395295, 395025, 394811, 395176, 396462, 398113, 399071, 398938, 398254, 397654, 397367, 397522, 398241, 399274, 400148, 400907, 402188, 404359, 407099, 410045, 413359, 417245, 421360, 425205, 428927, 433285, 438789, 445161, 451801, 458571, 465936, 474274, 483282, 492381, 501607, 511678, 523028, 535221, 547637, 560269, 573424, 586972, 600519, 614199, 628738, 644736, 662309, 681372, 701799, 723271, 745398, 768060, 791388, 815466, 840283, 865837, 891876, 917701, 942635, 966632, 990106, 1013355, 1036510, 1059809, 1083362, 1106803, 1129712, 1152217, 1174611, 1196579, 1217582, 1237910, 1258481, 1279424, 1299678, 1318305, 1335539, 1352222, 1368809, 1385348, 1401902, 1418529, 1435069, 1451281, 1466949, 1481681, 1494923, 1506327, 1515868, 1523464, 1528833, 1531825, 1532547, 1531123, 1527602, 1522084, 1514446, 1504098, 1490690, 1475122, 1459078]
53458A459078j5724j5994j6829j7170j6930j7243j8724k0583k1772k2014k1488
53447A254607k0470j9593j9625k0476k1087k0680j9569j8381j7142j5488j3321
53436A048775j0838q316o160m735l866k884j435K03J758L366N041O285O783P060
53422A041037P916R410J0975J2343J3881J5907J8093J9739K0568K1064K2020K3665
53410A236618K5421K6585K7186K7891K9204L1083L3265L5555L7694L9396M0771
53399A590669M2420M4792M7547M9847N1242N2122N3291N5088N6996N8176N8375
53388B160565N8169N8129N8060N7362N5883N3988N1890M9559M7217M5298M3625
53377B739745M1260L7594L3239K9328K6195K3183J9605J5344J0582N373l00o458
$$ y = [1459078, 1443354, 1427360, 1410531, 1393361, 1376431, 1359188, 1340464, 1319881, 1298109, 1276095, 1254607, 1234137, 1214544, 1194919, 1174443, 1153356, 1132676, 1113107, 1094726, 1077584, 1062096, 1048775, 1037937, 1029621, 1023461, 1018726, 1014860, 1011976, 1010541, 1010744, 1012502, 1015868, 1020909, 1027194, 1033977, 1041037, 1048953, 1058363, 1069338, 1081681, 1095562, 1111469, 1129562, 1149301, 1169869, 1190933, 1212953, 1236618, 1262039, 1288624, 1315810, 1343701, 1372905, 1403988, 1437253, 1472808, 1510502, 1549898, 1590669, 1633089, 1677881, 1725428, 1775275, 1826517, 1878639, 1931930, 1987018, 2044014, 2102190, 2160565, 2218734, 2276863, 2334923, 2392285, 2448168, 2502156, 2554046, 2603605, 2650822, 2696120, 2739745, 2781005, 2818599, 2851838, 2881166, 2907361, 2930544, 2950149, 2965493, 2976075, 2981448, 2981148, 2974690]
53365B974690j3249k0817k8812l6270m2344m7003n0745n3715n5663n6676n7391
53354B512005n8147n8420n7634n6154n4834n3744n2119m9693m7363m6192m6213
53343A931492m6579m6505m5721m4313m2556m0702l8705l6302l3520l0755k8179
53332A497655k5431k2247j9009j6296j4226j2654j1634j1305j1464j1794j2298
53321A329297j3023j3570j3368j2448j1403j0631r982r197q263p277o216m984
53309A208935l589k223j214o46m9J185K981M605N807P269R527J1982J3697J4754
53295A273021J6040J7896J9878K1736K3698K5662K6901K6941K6249K5658K5470
53284A529150K5342K4768K3530K1819K0009J8217J6219J3956J1818J0022Q054
$$ y = [2974690, 2961441, 2940624, 2911812, 2875542, 2833198, 2786195, 2735450, 2681735, 2626072, 2569396, 2512005, 2453858, 2395438, 2337804, 2281650, 2226816, 2173072, 2120953, 2071260, 2023897, 1977705, 1931492, 1884913, 1838408, 1792687, 1748374, 1705818, 1665116, 1626411, 1590109, 1556589, 1525834, 1497655, 1472224, 1449977, 1430968, 1414672, 1400446, 1387792, 1376158, 1364853, 1353389, 1341595, 1329297, 1316274, 1302704, 1289336, 1276888, 1265485, 1254854, 1244872, 1235675, 1227412, 1220135, 1213919, 1208935, 1205346, 1203123, 1201909, 1201263, 1201214, 1202399, 1205380, 1209985, 1215792, 1223061, 1232588, 1244570, 1258267, 1273021, 1289061, 1306957, 1326835, 1348571, 1372269, 1397931, 1424832, 1451773, 1478022, 1503680, 1529150, 1554492, 1579260, 1602790, 1624609, 1644618, 1662835, 1679054, 1693010, 1704828, 1714850, 1722904]
53273A722904N239J705j825n033q163j1232j3830j5836j7739k0029k2733k5628
53261A587800k8401l0543l1593l1683l1453l1302l1232l1386l2088l3147l3667
53250A241305l2965l1320k9584k8350k7671k7250k6730k6050k5556k5580k5880
53239I34369k5837k5185k4152k2963k1655k0362j9220j7959j6183j4134j2534
53228G14185j1617j0846r830q809q085p660p692q592j0196j1509j1832j1660j1844
53215E84013j2349j2500j2127j1754j1755j1931j1903j1465j0561r325q230p769
53203D52344p926q201q209q073q091q247q240q010q010q676r691j0071r260p783
53189C33856o523n667m817l958l532l584l549l104k676k738l073l109k702k160
$$ y = [1722904, 1728143, 1729848, 1728023, 1722990, 1714827, 1703595, 1689765, 1673929, 1656190, 1636161, 1613428, 1587800, 1559399, 1528856, 1497263, 1465580, 1434127, 1402825, 1371593, 1340207, 1308119, 1274972, 1241305, 1208340, 1177020, 1147436, 1119086, 1091415, 1064165, 1037435, 1011385, 985829, 960249, 934369, 908532, 883347, 859195, 836232, 814577, 794215, 774995, 757036, 740853, 726719, 714185, 702568, 691722, 681892, 673083, 664998, 657338, 649646, 641054, 630858, 619349, 607517, 595857, 584013, 571664, 559164, 547037, 535283, 523528, 511597, 499694, 488229, 477668, 468343, 460113, 452344, 444418, 436217, 428008, 419935, 411844, 403597, 395357, 387347, 379337, 370661, 360970, 350899, 341639, 333856, 327333, 321666, 316849, 312891, 309359, 305775, 302226, 299122, 296446, 293708, 290635, 287526, 284824, 282664]
53175B82664j780j668j864k378l014l351k984j937q47m97r11j215p47K0J84l21
53159B59354q26j073j345j568j235m43l2l23n85k36K08K9n00n78q8L18J08o70
53141B50515j538j824j086K77J118P61j92o03p4Q88J629J795J288L62l49k54O25
53124B53338J739K484K531J954J224Q29P21N05J84K50Q15J277J089L63o29j836
53108B66838k873k854j499N9M60k39q26o44k27k86q59j554k053k139j715j045
53092B48544o59q63j375j550j041k12J42k70p70n37K21N53J34l71m82m98o22l86
53074B39958M57J227J277R55Q39O71j2p91r12n73n96j076j368j302j347j590j529
53057B34288r90m13m7L26P76R64P68N59O45R37J239J424J312Q48L53J26n8n11
$$ y = [282664, 280884, 279216, 277352, 274974, 271960, 268609, 265625, 263688, 262841, 262344, 261433, 260218, 259471, 259491, 259675, 259354, 258528, 257455, 256110, 254542, 253307, 252864, 252832, 252509, 251924, 251688, 251896, 251925, 251425, 250847, 250759, 251077, 251185, 250515, 248977, 247153, 246067, 246344, 247462, 248223, 248031, 247428, 247354, 248242, 249871, 251666, 252954, 253316, 252967, 252713, 253338, 255077, 257561, 260092, 262046, 263270, 264099, 264820, 265325, 265509, 265759, 266574, 267851, 268940, 269303, 268674, 266838, 263965, 261111, 259612, 259671, 260131, 259892, 259066, 258422, 258195, 257909, 257050, 255496, 253443, 251304, 249589, 248544, 247885, 247022, 245647, 244097, 243056, 242844, 242986, 242716, 241946, 241409, 241630, 242183, 242317, 241946, 241464, 240966, 240344, 239958, 240415, 241642, 242919, 243874, 244713, 245384, 245372, 244581, 243669, 243096, 242500, 241424, 240056, 238754, 237407, 235817, 234288, 233298, 232885, 232838, 233164, 233940, 234904, 235672, 236231, 236876, 237813, 239052, 240476, 241788, 242636, 242989, 243115, 243057, 242546]
53039B42546r42q71n36o06j061j218q25k63K79R24J335Q74k17p94l13N22R48J009
53021B40791Q80L39m57o82j4O46M71l2O5O09P74M86M16P54J046J116J209J202
53003B49619N88n48j324j146l80K95O49P20M31j79o53n21R4N65M43j73p95r20
52985B46765l26P57J748K140J927J549J390J405J300J038R42J271J829K219K331
52970B68285K394K506K426J922J148N08K15J50O3j72m85o89o41m35l78o76j169
52953B74972j486j516j588k010k522k493j720p71l08k86k76k92p66j600j973j388
52937B53977m15Q4O8J10M18O41N41J81m36j313j974j678l85R49J387R79M80L38
52919B53952L15K4m52o33k75K11J93l55p44m62J52M23K26l0q5JJ86M28M28k9n83
$$ y = [242546, 241604, 240733, 240197, 239591, 238530, 237312, 236487, 236224, 236503, 237427, 238762, 239636, 239419, 238625, 238312, 238834, 239782, 240791, 241671, 242010, 241553, 240871, 240857, 241503, 241974, 241942, 242007, 242616, 243390, 243876, 244292, 245046, 246092, 247208, 248417, 249619, 250207, 249659, 248335, 247189, 246809, 247104, 247753, 248473, 248904, 248725, 248072, 247551, 247645, 248210, 248653, 248480, 247685, 246765, 246439, 247196, 248944, 251084, 253011, 254560, 255950, 257355, 258655, 259693, 260635, 261906, 263735, 265954, 268285, 270679, 273185, 275611, 277533, 278681, 279189, 279404, 279554, 279617, 279445, 278960, 278271, 277630, 277195, 276817, 276141, 274972, 273486, 271970, 270382, 268372, 265850, 263357, 261637, 260866, 260558, 260272, 259996, 259704, 258938, 257338, 255365, 253977, 253562, 253646, 253714, 253824, 254242, 254883, 255424, 255605, 255169, 253856, 251882, 250204, 249819, 250768, 252155, 253134, 253614, 253952, 254267, 254291, 253839, 253206, 252931, 253142, 253335, 252980, 252236, 251774, 251926, 252349, 252575, 252545, 252460, 252461, 252647, 253075, 253503, 253474, 252891]
52898B52891o52l77m72j073j373p81K00O82N13J68p1l13n65n92l06O9K73K36L4
52879B48491j94k81j05L12P98J136J173J017R98J329J815K088K140K306K688K882
52863B68593K442J391J63q23j397j622j693j738j618j052p6P64Q03j04j423k363
52847B60247k535k225k019k209k682l287l973m397l915k337m76N85O37L50K83
52832B32047L53K60o9n09q57q74n47k69l73o45p05o77q91j043m57P51J559J358
52814B28412O97L85M87O93J047J684K218J980Q48n09j212q89J3N31O9r99j869
52797B33586k313k663k888k520j634j041j112j143m27O70J343J398J087M22n14
52782B22251j031n17N87J234J133Q85Q94Q95O13K25Jn4n4q5k21l78l06k5q8q71
$$ y = [252891, 252239, 251862, 251390, 250317, 248944, 248163, 248363, 249045, 249558, 249726, 249655, 249342, 248777, 248185, 247879, 247948, 248221, 248457, 248491, 248297, 248016, 247911, 248223, 249021, 250157, 251330, 252347, 253345, 254674, 256489, 258577, 260717, 263023, 265711, 268593, 271035, 272426, 272589, 271766, 270369, 268747, 267054, 265316, 263698, 262646, 262570, 263334, 264137, 264033, 262610, 260247, 257712, 255487, 253468, 251259, 248577, 245290, 241317, 236920, 233005, 230668, 230192, 230777, 231414, 231764, 232047, 232400, 232660, 232591, 232082, 231225, 230351, 229804, 229535, 229162, 228517, 227812, 227135, 226244, 225201, 224744, 225495, 227054, 228412, 229109, 229494, 229981, 230674, 231721, 233405, 235623, 237603, 238451, 237942, 236730, 235841, 235854, 236385, 236454, 235455, 233586, 231273, 228610, 225722, 223202, 221568, 220527, 219415, 218272, 217845, 218515, 219858, 221256, 222343, 222765, 222251, 221220, 220703, 221290, 222524, 223657, 224542, 225436, 226331, 226944, 227169, 227170, 227116, 227062, 226977, 226756, 226378, 226072, 226047, 225959, 225088]
52762B25088j845k114j545p47o4P00J463J625R07j12o69n65k4P37J461J780J611
52745B27687J352J389J559J400P96J48NO47J801K670K515J469N62O70J575K317
52729B48562K322J861J423J041M53l00q38r88j151j793k682k914j925l13O16K19
52713B43593q19j246o68K4k60j393k035j208M32J345R84K79J62L18o9q30r87j97
52695B37425P30J014Q63Q77R74O09j42m22K76J288J541Q49l5n65r33j290j144
52678B41915j69Q70Q78n1p53p00n86r22j056l35O07O78p0o36n67k77j1M83J128
52659B40426J354J001O81Q67J330J755K259K897L219K808J875Q78n1r31j583j874
52643B56911k016k137j935j195l99j92m59m91l0M63O23O73R42J290J359J087P30
$$ y = [225088, 223243, 221129, 219584, 218837, 218773, 219473, 220936, 222561, 223468, 223356, 222687, 222122, 222098, 222835, 224296, 226076, 227687, 229039, 230428, 231987, 233387, 234183, 234331, 234336, 234983, 236784, 239454, 241969, 243438, 244000, 244670, 246245, 248562, 250884, 252745, 254168, 255209, 255662, 255362, 254524, 253536, 252385, 250592, 247910, 244996, 243071, 242758, 243374, 243593, 242774, 241528, 240860, 240884, 240624, 239231, 237196, 235988, 236420, 237765, 238749, 239028, 239190, 239508, 239439, 238609, 237622, 237425, 238155, 239169, 240032, 240909, 241883, 242492, 242350, 241928, 242204, 243492, 245033, 245882, 245847, 245282, 244349, 243059, 241915, 241746, 242616, 243494, 243443, 242690, 241990, 241404, 240482, 239426, 239091, 239698, 240376, 240306, 239670, 239103, 238826, 238815, 239298, 240426, 241780, 242781, 243462, 244329, 245659, 247414, 249673, 252570, 255789, 258597, 260472, 261350, 261299, 260368, 258785, 256911, 254895, 252758, 250823, 249628, 249229, 249037, 248578, 248087, 248057, 248520, 249143, 249816, 250758, 252048, 253407, 254494, 255224]
52626B55224M98M02L34J80j37n45q60r81j032j237j645k023j987j278K0J446K394
52609B48773K473J742O56j88m32j28L43N94M51M7k33K8Q57J603J429K66r39j187
52591B56155n01K73N64N77P01R60J236J577J959K012J425N21K4K73Q97J268J016
52574B70937K44n34p40l49m2m22j127j270o91j58k00m35m44n99j411k479k876
52557B57404k412j787j532j425j048m09J92M86L30j97p40r70r94j071j067o04
52541B44156K14Q44J073J265J614J776J430P78J98j76l14j69L9r1m73m35L30J183
52523B53242J337Q37L04J12L00Q91J711K224K115J759J619J462R20M66R56K271
52507B72526L298L363K879K354J571J57j562k856l416l489l376l137k595j567
$$ y = [255224, 255722, 256124, 256458, 256638, 256501, 255956, 255096, 254115, 253083, 251846, 250201, 248178, 246191, 244913, 244933, 246379, 248773, 251246, 252988, 253644, 253456, 253024, 252896, 253239, 253833, 254284, 254331, 254098, 254126, 254983, 256586, 258015, 258281, 257342, 256155, 255654, 255927, 256491, 257068, 257769, 258729, 259965, 261542, 263501, 265513, 266938, 267459, 267483, 267756, 268653, 269921, 270937, 271181, 270647, 269907, 269558, 269516, 269094, 267967, 266697, 266006, 265848, 265648, 265213, 264769, 264170, 262759, 260280, 257404, 254992, 253205, 251673, 250248, 249200, 248791, 248983, 249469, 249799, 249602, 248862, 247892, 246898, 245827, 244760, 244156, 244370, 245214, 246287, 247552, 249166, 250942, 252372, 253150, 253348, 253172, 252858, 252689, 252728, 252637, 252164, 251729, 252059, 253242, 254579, 255416, 255720, 255832, 256132, 257023, 258734, 260958, 263073, 264832, 266451, 267913, 268833, 269299, 270255, 272526, 275824, 279187, 282066, 284420, 285991, 286148, 284586, 281730, 278314, 274825, 271449, 268312, 265717, 264150]
52493B64150j95Q93J076N13N0J28J85m60j539k065j584o47l1J00J10K71N46Q42
52475B62343J161J433J456J200J019J274J830K202K204K110K081J846J214O08
52461B83981O05J104J421J133N09O8j0N5j35q61j986k941l199k832k380k218k263
52444B70051k269k130j873j533j142o97j78K63L02j21n21l48K50N40J11o75j161
52427B58869j010k27R54K060K464J901Q00l7j16L75P93O52J37m7N69J691K649
52410B72477L193L576M055M650N425O507P740Q600Q671P934O485M323J589j154
52396C44071l244m442n008n315n423n080m152l040k484k764l260l094k150j151
52382B93464p65r70j212r52j5J291K378K906L118L411L804M087M351M835N355
$$ y = [264150, 263955, 264848, 265924, 266437, 266487, 266615, 266800, 266340, 264801, 262736, 261152, 260505, 260474, 260574, 260684, 260955, 261501, 262343, 263504, 264937, 266393, 267593, 268612, 269886, 271716, 273918, 276122, 278232, 280313, 282159, 283373, 283981, 284586, 285690, 287111, 288244, 288753, 288821, 288811, 288866, 288731, 287870, 285884, 282943, 279744, 276912, 274532, 272314, 270051, 267782, 265652, 263779, 262246, 261104, 260407, 260229, 260492, 260794, 260673, 260152, 259804, 260054, 260594, 260705, 260030, 258869, 257859, 257632, 258586, 260646, 263110, 265011, 265811, 265774, 265658, 266033, 266826, 267478, 267615, 267568, 268137, 269828, 272477, 275670, 279246, 283301, 287951, 293376, 299883, 307623, 316223, 324894, 332828, 339313, 343636, 345225, 344071, 340827, 336385, 331377, 326062, 320639, 315559, 311407, 308367, 305883, 303119, 299859, 296765, 294615, 293464, 292699, 291729, 290517, 289565, 289550, 290841, 293219, 296125, 299243, 302654, 306458, 310545, 314896, 319731, 325086]
52367C25086N374M785M041L418K651J479J42r19j416j170j64J086J712J360N96
52352C48061J76L26R08J813K752L134K657J852J554K001K726L218L261K906K411
52337C79756K179K478L215M190N346O600P700Q516R276J0194J1057J1528J1707
52324D73742J2070J2937J4226J5578J6525J6734J6430J6377J7084J8134J8615
52313F48452J8181J7385J7019J7419J8305J9070J9257J8984J8828J9131J9552
52302H51583J9541J9072J8629J8548J8693J8636J7893J6076J3208R927P079N014
52290A033899L407J708l35k536m440n718o501p188p897q318q215p758p145o250
52276I66713n022l783k807j821m63J065K326L354M408N273N512N443O044P733
$$ y = [325086, 330460, 335245, 339286, 342704, 345355, 346834, 346976, 346057, 344641, 343471, 343307, 344393, 346105, 347465, 348061, 348237, 348563, 349471, 351284, 354036, 357170, 359827, 361679, 363233, 365234, 367960, 371178, 374439, 377345, 379756, 381935, 384413, 387628, 391818, 397164, 403764, 411464, 419980, 429256, 439450, 450507, 462035, 473742, 485812, 498749, 512975, 528553, 545078, 561812, 578242, 594619, 611703, 629837, 648452, 666633, 684018, 701037, 718456, 736761, 755831, 775088, 794072, 812900, 832031, 851583, 871124, 890196, 908825, 927373, 946066, 964702, 982595, 998671, 1011879, 1021806, 1028885, 1033899, 1037306, 1039014, 1038679, 1036143, 1031703, 1025985, 1019484, 1012296, 1004399, 996081, 987866, 980108, 972963, 966713, 961691, 957908, 955101, 953280, 952817, 953882, 956208, 959562, 963970, 969243, 974755, 980198, 986242, 993975]
52262I93975R850J1543J2637J3410J4050J4649J5294J5870J6119J6077J6086J6164
52250A165724J5836J4787J3235J1454R367O970M632K594N56j793m258o494q511
52237A224099j0336j1660j2402j3142j4306j5302j5352j4893j5156j6294j7046
52226A068210j6538j5393j4535j3827j2692j1396j0652j0301r401p641n783m498
52214I35553l541k438j288m39J94Q99J519J623J266J072J482K293L068L640L970
52199I48873L870L203K319J894K284L174L991M474M758N007N156M983M345L295
52185A001626K015O48q21k440m102n590o843p986q932r217q582p519o833o600
52171I28824o157n188m234l759l300k180o63L52O32P88J208J605J807K143K667
$$ y = [993975, 1003825, 1015368, 1028005, 1041415, 1055465, 1070114, 1085408, 1101278, 1117397, 1133474, 1149560, 1165724, 1181560, 1196347, 1209582, 1221036, 1230403, 1237373, 1242005, 1244599, 1245155, 1243362, 1239104, 1232610, 1224099, 1213763, 1202103, 1189701, 1176559, 1162253, 1146951, 1131599, 1116706, 1101550, 1085256, 1068210, 1051672, 1036279, 1021744, 1007917, 995225, 983829, 973177, 962876, 953475, 945834, 940051, 935553, 932012, 929574, 928286, 927847, 928041, 928940, 930459, 932082, 933348, 934420, 935902, 938195, 941263, 944903, 948873, 952743, 955946, 958265, 960159, 962443, 965617, 969608, 974082, 978840, 983847, 989003, 993986, 998331, 1001626, 1003641, 1004289, 1003468, 1001028, 996926, 991336, 984493, 976507, 967575, 958358, 949776, 942257, 935424, 928824, 922667, 917479, 913245, 909486, 906186, 904006, 903343, 903695, 904327, 905115, 906323, 907928, 909735, 911878, 914545]
52156I14545K761K008R75M76N15N31L49K26K31K72N56J384K490L178L174K834
52140I36505K522K282K132K129K137J989J967K578L806N125O344P842R791J1824
52126I98973J3698J5691J7976K0094K1579K2624K3684K4767K5624K6337K7094
52115A238141K7589K7208K5887K4344K3384K3180K3233K2805K1449J9371J7287
52104A493878J5790J4894J4216J3404J2277J0835R270P812O295M162J043k777
52092A601099o658j0107j2868j4905j6559j8332k0178k1348k1283k0325j9151
52081A419385j7863j6186j4267j2631j1449j0473r543q558p089m662j603J104
52069A306165K976M561O595R054J1206J2316J2272J1833J2160J3620J5195J5690
$$ y = [914545, 917306, 919314, 920289, 920765, 921280, 921811, 922160, 922386, 922617, 922889, 923445, 924829, 927319, 930497, 933671, 936505, 939027, 941309, 943441, 945570, 947707, 949696, 951663, 954241, 958047, 963172, 969516, 977358, 987149, 998973, 1012671, 1028362, 1046338, 1066432, 1088011, 1110635, 1134319, 1159086, 1184710, 1211047, 1238141, 1265730, 1292938, 1318825, 1343169, 1366553, 1389733, 1412966, 1435771, 1457220, 1476591, 1493878, 1509668, 1524562, 1538778, 1552182, 1564459, 1575294, 1584564, 1592376, 1598671, 1602833, 1603876, 1601099, 1594441, 1584334, 1571466, 1556561, 1540002, 1521670, 1501492, 1480144, 1458861, 1438536, 1419385, 1401522, 1385336, 1371069, 1358438, 1346989, 1336516, 1326973, 1318415, 1311326, 1306664, 1305061, 1306165, 1309141, 1313702, 1320297, 1329351, 1340557, 1352873, 1365145, 1376978, 1389138, 1402758, 1417953, 1433643]
52057A433643J5430J5793J7021J7546J6162J3727J1855J0628Q825N979K996O65
$$ y = [1433643, 1449073, 1464866, 1481887, 1499433, 1515595, 1529322, 1541177, 1551805, 1560630, 1566609, 1569605, 1570270]
$$ [...]
##END NTUPLES=NMR SPECTRUM
##END=
