##TITLE=AC1738_SEN00011_9276187_vwu7jyrfVx
##JCAMPDX= 6.0         $$ Bruker NMR JCAMP-DX V2.0
##DATA TYPE= NMR SPECTRUM
##DATA CLASS= NTUPLES
##ORIGIN= BRUKER
##OWNER= Administrator
$$ 1.72 TOPSPIN		Version 2.1
$$ 2015-07-18 18:23:48.994 -0700  Administrator@X
$$ Compression mode = diff/dup
##.OBSERVE FREQUENCY= 400.02188249412
##.OBSERVE NUCLEUS= ^1H
##.ACQUISITION MODE= SIMULTANEOUS (DQD)
##.ACQUISITION SCHEME= undefined
##.AVERAGES= 8
##.DIGITISER RES= 22
##SPECTROMETER/DATA SYSTEM= spect
##.PULSE SEQUENCE= zg30
##.SOLVENT NAME= COFFEE_meoh
##.SHIFT REFERENCE= INTERNAL, COFFEE_meoh, 1, 14.98509
##AUDIT TRAIL= $$ (NUMBER, WHEN, WHO, WHERE, PROCESS, VERSION, WHAT)
$$ ##TITLE= Audit trail, TOPSPIN		Version 2.1
$$ ##JCAMPDX= 5.01
$$ ##ORIGIN= Bruker BioSpin GmbH
$$ ##OWNER= Administrator
$$ $$ E:\/data/COFFEE/nmr/AC1738_SEN00011_9276187_vwu7jyrfVx/30/pdata/1/auditp.txt
$$ ##AUDIT TRAIL=  $$ (NUMBER, WHEN, WHO, WHERE, PROCESS, VERSION, WHAT)
(   1,<2015-07-18 18:23:41.244 -0700>,<Administrator>,<X>,<go>,<TOPSPIN 2.1>,
      <created by zg
	started at 2015-07-18 18:22:35.307 -0700,
	POWCHK enabled, PULCHK disabled,
       configuration hash MD5:
       21 0F 79 D6 B3 7B B4 F6 88 20 88 DB 03 48 BD 9F
       data hash MD5: 64K
       9C 29 25 2B 7D 67 F8 5C CE 09 E0 46 78 74 09 FE>)
(   2,<2015-07-18 18:23:44.635 -0700>,<Administrator>,<X>,<proc1d>,<TOPSPIN 2.1>,
      <Start of raw data processing
       efp LB = 0 FT_mod = 6 PKNL = 1 PHC0 = 0 PHC1 = 0 SI = 32K 
       data hash MD5: 32K
       CA CA 15 FF 6A 3F 62 64 66 13 37 33 B1 EF FC E3>)
(   3,<2015-07-18 18:23:44.932 -0700>,<Administrator>,<X>,<proc1d>,<TOPSPIN 2.1>,
      <pk PHC0 = 88.38501 PHC1 = 0 
       data hash MD5: 32K
       EC A9 6B 8D 16 0E 59 2E F3 36 F7 C5 A1 68 6D 0B>)
(   4,<2015-07-18 18:23:45.041 -0700>,<Administrator>,<X>,<proc1d>,<TOPSPIN 2.1>,
      <abs ABSG = 1 
       data hash MD5: 32K
       82 CD 3E 79 FF 19 07 FC 1B B3 18 39 96 EF 1B 4B>)
(   5,<2015-07-18 18:23:45.119 -0700>,<Administrator>,<X>,<proc1d>,<TOPSPIN 2.1>,
      <abs ABSG = 2 
       data hash MD5: 32K
       9B C8 88 CB C5 5F 84 0D 1F 9B E7 83 1C 14 87 D3>)
(   6,<2015-07-18 18:23:45.182 -0700>,<Administrator>,<X>,<proc1d>,<TOPSPIN 2.1>,
      <abs ABSG = 3 
       data hash MD5: 32K
       4B E0 84 70 C3 92 76 A3 8E 65 71 85 6B CD 54 C8>)
(   7,<2015-07-18 18:23:45.244 -0700>,<Administrator>,<X>,<proc1d>,<TOPSPIN 2.1>,
      <abs ABSG = 4 
       data hash MD5: 32K
       D5 B1 52 AC 24 29 45 6C 63 89 78 09 2A 8F F8 0F>)
(   8,<2015-07-18 18:23:45.307 -0700>,<Administrator>,<X>,<proc1d>,<TOPSPIN 2.1>,
      <abs ABSG = 5 
       data hash MD5: 32K
       16 37 6A F4 0C 2E A1 CF AC E2 FB 3E 8B 50 55 97>)
$$ ##END=
$$ 
$$ $$ hash MD5
$$ $$ 6A 14 82 D9 E2 B5 BF A1 96 8E 7A DB 15 A7 0E 7A
##$RELAX= 
##$RELAX= 
##$RELAX= 
##$RELAX= 
##$RELAX= 
##$RELAX= 
##$RELAX= 
$$ Bruker specific parameters
$$ --------------------------
##$DU= <E:\>
##$EXPNO= 30
##$NAME= <AC1738_SEN00011_9276187_vwu7jyrfVx>
$$ [...]
150 150 150 150 150 150 150 150
##$TP07= 0
##$TPNAME0= <>
##$TPNAME1= <>
##$TPNAME2= <>
##$TPNAME3= <>
##$TPNAME4= <>
##$TPNAME5= <>
##$TPNAME6= <>
##$TPNAME7= <>
##$TPOAL= (0..7)
0.5 0.5 0.5 0.5 0.5 0.5 0.5 0.5
##$TPOFFS= (0..7)
0 0 0 0 0 0 0 0
##$TUNHIN= 0
##$TUNHOUT= 0
##$TUNXOUT= 0
##$USERA1= <user>
##$USERA2= <user>
##$USERA3= <user>
##$USERA4= <user>
##$USERA5= <user>
##$V9= 5
##$VALIST= <valist>
##$VCLIST= <CCCCCCCCCCCCCCC>
##$VD= 0
##$VDLIST= <DDDDDDDDDDDDDDD>
##$VPLIST= <PPPPPPPPPPPPPPP>
##$VTLIST= <TTTTTTTTTTTTTTT>
##$WBST= 2048
##$WBSW= 25
##$XGAIN= (0..3)
0 0 0 0
##$XL= 0
##$YL= 0
##$YMAX_a= 602398
##$YMIN_a= -525754
##$ZGOPTNS= <>
##$ZL1= 120
##$ZL2= 120
##$ZL3= 120
##$ZL4= 120
##$ABSF1= 14.98509
##$ABSF2= -5.573092
##$ABSG= 5
##$ABSL= 3
##$ALPHA= 0
##$AQORDER= 0
##$ASSFAC= 0
##$ASSFACI= 0
##$ASSFACX= 0
##$ASSWID= 0
##$AUNMP= <proc_prof1d_extract_pilot.lims>
##$AXLEFT= 0
##$AXNAME= <>
##$AXNUC= <1H>
##$AXRIGHT= 0
##$AXTYPE= 0
##$AXUNIT= <>
##$AZFE= 0.1
##$AZFW= 0.1
##$BCFW= 0
##$BC_mod= 0
##$BYTORDP= 0
##$COROFFS= 0
##$CY= 15
##$DATMOD= 1
##$DC= 0
##$DFILT= <>
##$DTYPP= 0
##$F1P= 0
##$F2P= 0
##$FCOR= 0.5
##$FTSIZE= 32768
##$FT_mod= 6
##$GAMMA= 0
##$GB= 0
##$INTBC= 1
##$INTSCL= 1
##$ISEN= 128
##$LB= 0
##$LEV0= 0
##$LPBIN= 0
##$MAXI= 10000
##$MC2= 0
##$MEAN= 0
##$ME_mod= 0
##$MI= 0
##$NCOEF= 0
##$NC_proc= -8
##$NLEV= 6
##$NOISF1= 0
##$NOISF2= 0
##$NSP= 0
##$NTH_PI= 0
##$NZP= 0
##$OFFSET= 14.98509
##$PC= 1
##$PHC0= 88.38501
##$PHC1= 0
##$PH_mod= 1
##$PKNL= yes
##$PPARMOD= 0
##$PPDIAG= 0
##$PPIPTYP= 0
##$PPMPNUM= 2147483647
##$PPRESOL= 1
##$PSCAL= 4
##$PSIGN= 0
##$PYNMP= <proc.py>
##$REVERSE= no
##$SF= 400.02
##$SI= 32768
##$SIGF1= 0
##$SIGF2= 0
##$SINO= 400
##$SIOLD= 32768
##$SPECTYP= <>
##$SREGLST= <1H.CDCl3>
##$SSB= 0
##$STSI= 32768
##$STSR= 0
##$SW_p= 8223.68421052631
##$SYMM= 0
##$S_DEV= 0
##$TDeff= 65536
##$TDoff= 0
##$TI= <>
##$TILT= no
##$TM1= 0
##$TM2= 0
##$TOPLEV= 0
##$USERP1= <user>
##$USERP2= <user>
##$USERP3= <user>
##$USERP4= <user>
##$USERP5= <user>
##$WDW= 1
##$XDIM= 32768
##$YMAX_p= 448914425
##$YMIN_p= -642898
##$CURPLOT= <Network HP LaserJet P1505>
##$CURPRIN= <$Network HP LaserJet P1505>
##$DFORMAT= <normdp>
##$LAYOUT= <+/1D_H.xwp>
##$LFORMAT= <normlp>
##$PFORMAT= <normpl>
##$SURQMSG= 1
$$ End of Bruker specific parameters
$$ ---------------------------------
##NTUPLES= NMR SPECTRUM
##VAR_NAME=  FREQUENCY,     SPECTRUM/REAL,   SPECTRUM/IMAG
##SYMBOL=    X,             R,               I
##VAR_TYPE=  INDEPENDENT,   DEPENDENT,       DEPENDENT
##VAR_FORM=  AFFN,          ASDF,            ASDF
##VAR_DIM=   32768,         32768,           32768
##UNITS=     HZ,            ARBITRARY UNITS, ARBITRARY UNITS
##FACTOR=    0.250966925370066, 1,           1
##FIRST=     8223.43324360094, -53006,       -142815
##LAST=      0,             59400,           -291229
##MIN=       0,             -642898,         0
##MAX=       8223.43324360094, 448914425,    0
$$ Real data points
##PAGE= N=1
##DATA TABLE= (X++(R..R)), XYDATA
$$ [...]
19553A21359b91460C54922A63259J38816a14415K7351K2156l3535A56222j7515
$$ 121359 -291460 354922 163259 302075 -114415 -87064 -64908 -98443 156222 138707
19543A38707P4294d42154b3117m09825h7851k75709a17705r8284j71805A34124
$$ 138707 213001 -442154 -23117 -432942 -87851 -363560 -117705 -215989 -387794 134124
19532B20768D5873d9232B18141G8752B7309e0597B354J35869a24437j6361B08498
$$ 220768 45873 -49232 218141 78752 27309 -50597 2354 138223 -124437 -140798 208498
19520g0562B48715i6195q0366H3209c4807D3992K0139a10813M1487o8053o523
$$ -70562 248715 -96195 -176561 83209 -34807 43992 64131 -110813 -69326 -137379 -143902
19509a43902c6687B5083b63990b7490j53603J67C6324K063o735a33546N4011C47210
$$ -143902 -36687 25083 -263990 -27490 -181093 -180926 36324 38387 31652 -133546 -79535 347210
19496G0407K18636a98193i3378A9580a31522A45435h6030j24542r8492M9529K402
$$ 70407 289043 -198193 -93378 19580 -131522 145435 -86030 -210572 -309064 -259535 -257133
19485b57133A86459c23175g8026I969c61178j80477d8293j95632n8816a22495
$$ -257133 186459 -323175 -78026 9969 -361178 -541655 -48293 -243925 -302741 -122495
19474H8071b51460C5116b01800k04970g3353C25707C2961c15783A18494l1957
$$ 88071 -251460 35116 -201800 -406770 -73353 325707 32961 -315783 118494 86537
19464H6537e7876p321j59864m9041A33242o0271r095J5161J5610i550j5567j82942
$$ 86537 -57876 -65197 -225061 -274102 133242 72971 63876 79037 94647 -9550 -25117 -208059
19452b08059P0826A77836C8362B422R7279A6571E80a1884A26289C9307R5364K6759
$$ -208059 -137233 177836 38362 2422 99701 16571 580 -11884 126289 39307 134671 161430
19440A61430l7869a60397H8119d942A99197a72341L5234N4358r1555b9732l08156
$$ 161430 123561 -160397 88119 -4942 199197 -172341 -137107 -82749 -174304 -29732 -337888
19429c37888I5279j2425k874K85194a55889j45805J19393r7770A71841B500a25737
$$ -337888 95279 82854 79980 365174 -155889 -301694 -182301 -280071 171841 2500 -125737
19417A80193a10448D5402J41312E1455J35324b34985J05272j21628I5098C8574
$$ 180193 -110448 45402 186714 51455 186779 -234985 -129713 -251341 95098 38574
19406e7480E4035a0961A3056b1752C40387A54399k4705e0478k20264I6002a07275
$$ -57480 54035 -10961 13056 -21752 340387 154399 129694 -50478 -270742 96002 -107275
19394A39419m4173J53001I8747a32946B34920a94873L7102A7257K894a27822k51777
$$ 139419 95246 248247 98747 -132946 234920 -194873 -157771 17257 20151 -127822 -379599
19383c79599C35429A37358A752b82251a767B19724c5972q1829A08799a78133a2858
$$ -379599 335429 137358 1752 -282251 -1767 219724 -35972 -117801 108799 -178133 -12858
19371A65753a68254B15321d1846k60380g4646p8557I7782P5939a97641D7752c5162
$$ 165753 -168254 215321 -41846 -302226 -74646 -153203 97782 173721 -197641 47752 -35162
19359A62390b19949G1535F813C121Q3844J05144a13997N1837B19731C6436a71790
$$ 162390 -219949 71535 6813 3121 86965 192109 -113997 -62160 219731 36436 -171790
19347C1156a12495G4767b07121O8684A12856e7791C960a20945L9911B9255i9589
$$ 31156 -112495 74767 -207121 -138437 112856 -57791 3960 -120945 -81034 29255 -99589
19335G0315F483K02889a39805l3152f18j59334o4469C694K62621q3187b41792
$$ 70315 6483 209372 -139805 -172957 -618 -159952 -224421 3694 266315 183128 -241792
19323a55474k2439l3721M8740B90888a84533P5530m9815M6320q7587j38507k5832
$$ -155474 -177913 -211634 -162894 290888 -184533 -109003 -158818 -112498 -200085 -338592 -364424
19312c64424B77258b51231a15540m7942A39194b21607L8587B21340K03473F2289
$$ -364424 277258 -251231 -115540 -163482 139194 -221607 -183020 221340 424813 62289
19301a10768B13899a76503A36255a01075o931k04205B30830b4979p6670l6696
$$ -110768 213899 -176503 136255 -101075 -108006 -312211 230830 -24979 -101649 -138345
19291a38345i20H6463c6792j35958f9891p0814J5023p5596a2857l26980e3436
$$ -138345 -920 86463 -36792 -172750 -69891 -140705 -125682 -201278 -12857 -339837 -53436
19279a43918p0599J6268Q8297m9919A33339A9171B453b3870o9331K3949j34374
$$ -143918 -214517 -198249 -109952 -159871 133339 19171 2453 -23870 -93201 -69252 -203626
19268b03626B36075A8978J9526c338j85978D3338a08302C4108d06509a94215m2543
$$ -203626 236075 18978 38504 -3338 -189316 43338 -108302 34108 -406509 -194215 -236758
19257b36758j0642c3167G9945e0842B25329c20977a8110k05248A69812E4435J56322
$$ -236758 -247400 -33167 79945 -50842 225329 -320977 -18110 -223358 169812 54435 210757
19246B10757n5051e986n0009j09187C07467a33366l327f3214K3432B94810a57176
$$ 210757 155706 -5986 -55995 -165182 307467 -133366 -136693 -63214 -39782 294810 -157176
19234e50356D3644a69836c2887j99987A03632a688B9862C81e880j68325l8678
$$ -550356 43644 -169836 -32887 -232874 103632 -1688 29862 381 -5880 -174205 -212883
19223b12883B22622g5260C3335d44679K10408R9648B4089a36887F8703A3194L2178
$$ -212883 222622 -75260 33335 -444679 -234271 -134623 24089 -136887 68703 13194 45372
19212D5372J52089p6144c91025a85354O2386d1709j03774j74819c046I2328J30492
$$ 45372 197461 121317 -391025 -185354 -122968 -41709 -145483 -320302 -3046 92328 222820
19201B22820q2253g7401m1521B4207J00236J05650E9197N0090a19839d1613j47732
$$ 222820 140567 -77401 -118922 24207 124443 230093 59197 109287 -119839 -41613 -189345
19190a89345A72791a02110A87235a3544j74668A03460i6126A60165G4590b02513
$$ -189345 172791 -102110 187235 -13544 -188212 103460 -96126 160165 74590 -202513
19179B9781a12219A85261a79983k2943K9653j1683k78951K19954A07964a22874
$$ 29781 -112219 185261 -179983 -202926 -173273 -184956 -463907 -243953 107964 -122874
19168a85466d6968C9555f5564q8180C89662A70873b02801F455g4207m77419K55908
$$ -185466 -46968 39555 -65564 -153744 389662 170873 -202801 6455 -74207 -551626 -295718
19157b95718a6664l11790a04763J4628k65959A22957a46191K8681J6701j23010
$$ -295718 -16664 -328454 -104763 -90135 -356094 122957 -146191 -117510 -100809 -223819
19147b23819D2168L15739b84410I7273b0532C7196K8244g0692j11436A95081h5649
$$ -223819 42168 357907 -284410 97273 -20532 37196 65440 -70692 -182128 195081 -85649
19135a86002J7129m32360C2853i6249A376J72052R0478C9351c97042F9698e2185
$$ -186002 -168873 -601233 32853 -96249 1376 173428 263906 39351 -397042 69698 -52185
19123a14018k6458e6564q516A41598j4559f482r8307p0127E2034J60435a78088
$$ -114018 -140476 -56564 -65080 141598 127039 -6482 -104789 -174916 52034 212469 -178088
19111c21465A30635M7324c71165i7828o8619A20780a13495j85462i4705k33526
$$ -321465 130635 177959 -371165 -97828 -166447 120780 -113495 -298957 -94705 -328231
19101c28231a41885A22919J9878a39982A43072L5368m4331A8389b73838B58911
$$ -328231 -141885 122919 142797 -139982 143072 178440 134109 18389 -273838 258911
19090A51359J08132N2636A12862B3537a47469j9755j52873J21150A6812i2947
$$ 151359 259491 312127 112862 23537 -147469 -167224 -320097 -198947 16812 -92947
19079b26259B09741j1110r6101a5725j3691n995j9544q5189k04315R4333c8285
$$ -226259 209741 198631 102530 -15725 -29416 -35411 -54955 -140144 -344459 -250126 -38285
19067A7489b26608H7002J17841b53138B15771a01046A8577i9191j83221k33227
$$ 17489 -226608 87002 204843 -253138 215771 -101046 18577 -99191 -282412 -515639
19057e15639a93025j02412e2272k1845A3125M7518i4748k60297o848a14007k21719
$$ -515639 -193025 -295437 -52272 -74117 13125 60643 -94748 -355045 -361893 -114007 -335726
19046c35726C2520a51948j93291B65681C5657m849J93540E9300j4269g0684q0553
$$ -335726 32520 -151948 -345239 265681 35657 30808 224348 59300 45031 -70684 -151237
19035a51237m553c4177k47967h009j83443I9917O2918c4763B07600L8097H2983
$$ -151237 -155790 -34177 -282144 -8009 -191452 99917 162835 -34763 207600 245697 82983
19023i8506k4377j51699B14737F4938J08821a14371I0737b63698g7545l32432
$$ -98506 -122883 -274582 214737 64938 173759 -114371 90737 -263698 -77545 -409977
19013d09977g7033o4809E1599a00010d0409J1916M772C56789c31646A12830L2579
$$ -409977 -77033 -141842 51599 -100010 -40409 -28493 -23721 356789 -331646 112830 145409
19002A45409Q5415e4627A86372d6233A33353M3031e8920k38682d2806A83422q7873
$$ 145409 230824 -54627 186372 -46233 133353 176384 -58920 -297602 -42806 183422 95549
18991I5549D1765d53084i4600k97233B62905G319a50649B70298b48638b3847A42963
$$ 95549 41765 -453084 -94600 -391833 262905 7319 -150649 270298 -248638 -23847 142963
18979b07591L9159B36424n5008h5951b3464j0614C3027a77234C7512b23721J00029
$$ -207591 -168432 236424 181416 -85951 -23464 -34078 33027 -177234 37512 -223721 -123692
18968a23692A13683f7364j73381A44144C4336b53136a8707G3248Q019K22142d11586
$$ -123692 113683 -67364 -240745 144144 34336 -253136 -18707 73248 81267 303409 -411586
18956E3698i0589A76802c697j21909o4744Q2595k34378D3003J14058J04740b78266
$$ 53698 -90589 176802 -3697 -125606 -190350 -107755 -342133 43003 157061 261801 -278266
18944h5067E2583K23485a88459f3363D6151d5386l02940K1770g9804k6422j03225
$$ -85067 52583 276068 -188459 -63363 46151 -45386 -348326 -326556 -79804 -106226 -209451
18933b09451h3046L6938L462B20949l4110a31999r6154j45330f0723k16285G9836
$$ -209451 -83046 -46108 -42646 220949 186839 -131999 -228153 -373483 -60723 -277008 79836
18921b68275A48112D2326b1553D0391B0025h8024l0476r6493A54904a25150H4856
$$ -268275 148112 42326 -21553 40391 20025 -88024 -118500 -214993 154904 -125150 84856
18909d8401K2599l62365A88074a12535Q785j2483m9868h0567E0810c43964J35237
$$ -48401 -25802 -388167 188074 -112535 -103750 -116233 -166101 -80567 50810 -343964 -208727
18898b08727A26498A419J83740b19382B21112d0927j97756D8404a36583A4732
$$ -208727 126498 1419 185159 -219382 221112 -40927 -238683 48404 -136583 14732
18887c59045D0981K08434c39255a64960H0803a26546A66800a20755A101b6788
$$ -359045 40981 249415 -339255 -164960 80803 -126546 166800 -120755 1101 -26788
18876B0211a60448C3554d61m0821I8277O3983B5998a06169l5868e6267m3164I8501
$$ 20211 -160448 33554 -461 -41282 98277 162260 25998 -106169 -142037 -56267 -99431 98501
18863d22002b8531l51357f6181G5070C4258b9127j87538E6861N6070a79627j19890
$$ -422002 -28531 -379888 -66181 75070 34258 -29127 -216665 56861 112931 -179627 -299517
18852b99517C31487j0910a41174A22357b04430B3846J39654h0828K1825a1819
$$ -299517 331487 320577 -141174 122357 -204430 23846 163500 -80828 -59003 -11819
18841b48506J02212N2838j62648E4598a81873F6884a1933E0342a06341A75996
$$ -248506 -146294 -93456 -256104 54598 -181873 66884 -11933 50342 -106341 175996
18830A30557e60887C89858a88649e7050D47611D4832J98727d9522l1998A86342
$$ 130557 -560887 389858 -188649 -57050 447611 44832 243559 -49522 -81520 186342
18819E310c16243b8997A21247n9729K18437A23574g3324B2057K16636j13587O2009
$$ 5310 -316243 -28997 121247 61518 279955 123574 -73324 22057 238693 125106 187115
18808A87115O7819A04029h3837A73354C4713K26392F1842f9747Q879k42887a4716
$$ 187115 254934 104029 -83837 173354 34713 261105 61842 -69747 -60868 -303755 -14716
18796c48217a40507b443j45521F2948a37639r197j58367A61644c3317J2543j76311
$$ -348217 -140507 -2443 -147964 62948 -137639 -146836 -305203 161644 -33317 -20774 -197085
18785a97085P8021d3041F9112a78869C7593J28249Q3009b9526l19451h458A16806
$$ -197085 -119064 -43041 69112 -178869 37593 165842 248851 -29526 -348977 -8458 116806
18773b12858h6590q4695N9096l14236B53766j11264b4346A41515l9435b01022
$$ -212858 -86590 -171285 -112189 -426425 253766 142502 -24346 141515 102080 -201022
18762a85425B12789c3911k59300c5268D8989a34528D4153b00066B5383J45441
$$ -185425 212789 -33911 -293211 -35268 48989 -134528 44153 -200066 25383 170824
18752A70824C069i9173E2438a48776A54075K40263i527F692i8184l0935B70599
$$ 170824 3069 -99173 52438 -148776 154075 394338 -9527 6692 -98184 -129119 270599
18740A57495K9971B5799b10067e4979D08774b73241J29173C2677M8295b4898j04426
$$ 157495 187466 25799 -210067 -54979 408774 -273241 -144068 32677 80972 -24898 -129324
18729a29324d0674k1473A13537m1557L1965a89647B1576a13103A4697J41872a29071
$$ -129324 -40674 -62147 113537 71980 103945 -189647 21576 -113103 14697 156569 -129071
18717a2948j19828f1519A7064P7033c5353j75259L8343A51778a02460e0821A0828
$$ -12948 -132776 -61519 17064 94097 -35353 -210612 -172269 151778 -102460 -50821 10828
18705a69176l4389j42382J3364a40453l8156n5970O8915C66599c00133a9065j74582
$$ -169176 -203565 -345947 -332583 -140453 -178609 -234579 -165664 366599 -300133 -19065 -193647
18694a93647R795I5053B7191i2658d6131l49213f1019l5568F8741a8232m0714
$$ -193647 -183852 95053 27191 -92658 -46131 -395344 -61019 -96587 68741 -18232 -58946
18683e8946k30691E6066a08490a6455q6645k661n8644q7264A24133c7635j53057
$$ -58946 -289637 56066 -108490 -16455 -103100 -105761 -164405 -251669 124133 -37635 -190692
18672a90692R4162J6378n7083c4872B9431c26330h5717k31342D6767N6589a06430
$$ -190692 -96530 -80152 -137235 -34872 29431 -326330 -85717 -317059 46767 103356 -106430
18660A71309a71233A5271c06461E322a26759n4763J6339B52327J00177A10311
$$ 171309 -171233 15271 -306461 5322 -126759 -181522 -165183 252327 352504 110311
18649h4616o5476l2401d4107I1613f8265A11785a00598A68568a48895A24021a72086
$$ -84616 -150092 -182493 -44107 91613 -68265 111785 -100598 168568 -148895 124021 -172086
18637a59283o9062E1771b11082l0136A1812h553F9168c21851E1954q991O3394
$$ -159283 -228345 51771 -211082 -241218 11812 -8553 69168 -321851 51954 42963 106357
18626A06357l8359c35084A20912D442J61265a35128a2212n1871E669N2326B8211
$$ 106357 67998 -335084 120912 4442 165707 -135128 -12212 -64083 5669 57995 28211
18614b22519A76122c80730c4576o3780o0917b5438m2728q4746E5444a69027f3898
$$ -222519 176122 -380730 -34576 -98356 -159273 -25438 -68166 -152912 55444 -169027 -63898
18602h0592B71569b54398f0730m7672M814j71253c6071j65143B08364b13444j18560
$$ -80592 271569 -254398 -60730 -108402 -103588 -274841 -36071 -201214 208364 -213444 -332004
18591c32004D4806c19825H3491b8778j27088f4845m7454i616q2231F8885P2510
$$ -332004 44806 -319825 83491 -28778 -155866 -64845 -112299 -9616 -91847 68885 141395
18580A41395a67043G5792A8545a00948M7754a4724l20596b8557A8409J90805A3592
$$ 141395 -167043 75792 18545 -100948 -53194 -14724 -335320 -28557 18409 209214 13592
18568b66061A16013c6392C5905a96251g1569n7323j17084N6943q4545J17681N8668
$$ -266061 116013 -36392 35905 -196251 -71569 -128892 -245976 -189033 -273578 -155897 -97229
18557i7229A84029c8420r5137C9145h0215j25125f4750I2994i107j47060j40444
$$ -97229 184029 -38420 -133557 39145 -80215 -205340 -64750 92994 -9107 -156167 -296611
18546b96611i2787J6923D3036c0580l53793A31494o1811b07233q3778p6238g6466
$$ -296611 -92787 -75864 43036 -30580 -384373 131494 69683 -207233 -291011 -367249 -76466
18534B35974a10119l24670a20904O586l7512F0475g6113j79159M6358j61835B8065
$$ 235974 -110119 -434789 -120904 -114318 -151830 60475 -76113 -255272 -208914 -370749 28065
18522a3082k7834G5759M6704Q3381C5887K2430O5879j7819a65402B07334F274
$$ -13082 -40916 75759 122463 205844 35887 58317 124196 106377 -165402 207334 6274
18510E1479J14637a10189j7534A675b28697R3499B08892i985C9709K11189n4447
$$ 51479 166116 -110189 -127723 1675 -228697 -135198 208892 -9985 39709 250898 196451
18499A96451a33662B9413c67688D8158a86238d4466F8464a68824g1246G3230A6114
$$ 196451 -133662 29413 -367688 48158 -186238 -44466 68464 -168824 -71246 73230 16114
18487b33840D4690M7056J15020a4107m2950F5419e6661p4451A85011g1558j44962
$$ -233840 44690 91746 206766 -14107 -57057 65419 -56661 -131112 185011 -71558 -216520
18476b16520q759A13416a17748l7678e260k02488E18444b13997P9399k25337A65755
$$ -216520 -225279 113416 -117748 -155426 -5260 -207748 518444 -213997 -134598 -359935 165755
18464b52825A13816k8585a63156k18423H1305l3233c99505F2805e413n6296j5539
$$ -252825 113816 85231 -163156 -381579 81305 48072 -399505 62805 -5413 -61709 -77248
18453g7248B23430q8483a29027d0085m8202K5705F8914b4002k63529A25928l3159
$$ -77248 223430 134947 -129027 -40085 -88287 -62582 68914 -24002 -287531 125928 92769
18442I2769i5892J9871p426A02879i0423A84057f8578G4944a10881c5762j49465
$$ 92769 -95892 -76021 -83447 102879 -90423 184057 -68578 74944 -110881 -35762 -185227
18431a85227B08424b62164a19610p5250B84082a99385d695n2136A68734m080a63597
$$ -185227 208424 -262164 -119610 -194860 284082 -199385 -4695 -56831 168734 164654 -163597
18419b48677D4726i7802A14358e7923A26855c4654k45226B67910G346b9465m31153
$$ -248677 44726 -97802 114358 -57923 126855 -34654 -279880 267910 7346 -29465 -460618
18408d60618D735J82096c0786B23047b16270c166l16444a18530B11597a20765
$$ -460618 4735 186831 -30786 223047 -216270 -3166 -319610 -118530 211597 -120765
18397c0728l20349f6936E7907h8050D4024a36596k57410J96123G8267b69945B5898
$$ -30728 -351077 -66936 57907 -88050 44024 -136596 -394006 -197883 78267 -269945 25898
18385C5474J92742c04801J18289O3295k18195a496o0386A52455a71042E8286P3331
$$ 35474 228216 -304801 -186512 -123217 -341412 -1496 -61882 152455 -171042 58286 131617
18374A31617A9071K22790d129r3344B35135O4008a90247k1106M8015A5754G112
$$ 131617 19071 241861 -4129 -97473 235135 299143 -190247 -211353 -163338 15754 7112
18362a40257K0265I832a80914A48589g5821A55066B6232L7963J5695a97480g9200
$$ -140257 -119992 9832 -180914 148589 -75821 155066 26232 64195 79890 -197480 -79200
18350B4062R1424h4723j90225c7786J0335q9287k03227h2370k23493E2730b51364
$$ 24062 115486 -84723 -274948 -37786 -27451 -116738 -319965 -82370 -305863 52730 -251364
18338A24913a62530A7383N800f42898A10361a34959A16056d02533d7201A38845
$$ 124913 -162530 17383 23183 -642898 110361 -134959 116056 -402533 -47201 138845
18327A07569d286o55A77388b88523B7930K31897h4217m8970O3834Q876B0437f6423
$$ 107569 -4286 -4941 177388 -288523 27930 259827 -84217 -133187 -69353 -60477 20437 -66423
18314C3325c255p1519c3661Q826r5457e9672B64017b20904A47857F540R3786j6285
$$ 33325 -3255 -74774 -33661 -24835 -120292 -59672 264017 -220904 147857 6540 100326 84041
18302H4041Q3904a9697k9205a5932A33686e8506D8657a8395j12436p1324I3059
$$ 84041 167945 -19697 -48902 -15932 133686 -58506 48657 -18395 -130831 -202155 93059
18290a63920e0786k3684A26801i3715j40359j1065N5508F8026k1486J02965F5623
$$ -163920 -50786 -74470 126801 -93715 -234074 -245139 -189631 68026 46540 149505 65623
18278b93518a28549j96419e1183j2815j04o384j69525e8424A4421i1132c9266
$$ -293518 -128549 -324968 -51183 -63998 -64102 -70486 -240011 -58424 14421 -91132 -39266
18266a96848c360r0489B522Q344R0192g4067j61300I4489B1703J74078J13054
$$ -196848 -3360 -93849 2522 10866 101058 -74067 -235367 94489 21703 195781 308835
18255C08835b79243E1365N4963P7629a36660A3573J54844c42698a17491N7690
$$ 308835 -279243 51365 106328 183957 -136660 13573 168417 -342698 -117491 -59801
18245e9801p507j73702A23774g3200D49M6236A8732b87893e0358k57593B82378
$$ -59801 -67308 -241010 123774 -73200 449 46685 18732 -287893 -50358 -307951 282378
18233D01218c29971A9983F043b90667h3129j25148j0370j4266i5893a9884k05590
$$ 401218 -329971 19983 6043 -290667 -83129 -208277 -218647 -232913 -95893 -19884 -225474
18222b25474h3669C7405J30273b78421C4414b75079a306C1338c7701l8924k55382
$$ -225474 -83669 37405 167678 -278421 34414 -275079 -1306 31338 -37701 -76625 -332007
18211c32007J64493j90390H4177F954M8230f0173k28877c6564m7162j8548j10297
$$ -332007 -167514 -357904 84177 6954 55184 -60173 -289050 -36564 -83726 -102274 -212571
18200b12571P7350G5577K6995K7167a08196k15406J17834R9368F9341d4037j67460
$$ -212571 -135221 75577 102572 129739 -108196 -323602 -205768 -106400 69341 -44037 -211497
18189b11497b0263B3232J6893j7663f4172j01156A97146h8814k01528g9481g175
$$ -211497 -20263 23232 40125 22462 -64172 -165328 197146 -88814 -290342 -79481 -7175
18177b19986f3573j3331j03108P5396o866J9670C10763b79087g2315A8037a46962
$$ -219986 -63573 -76904 -180012 -104616 -111482 -91812 310763 -279087 -72315 18037 -146962
18165C8937a71929P9441A04453C8783K26679a21812j637O0017p1598a1527A01045
$$ 38937 -171929 -92488 104453 38783 265462 -121812 -123449 -63432 -135030 -11527 101045
18153D10959D9805a21475k6087f8164h750k2269m4320A26356g8594d156A50071
$$ 410959 49805 -121475 -147562 -68164 -8750 -31019 -75339 126356 -78594 -4156 150071
18141C22698A49340b05855d3373A95567O7905b90018g2530C2431a5745A96369
$$ 322698 149340 -205855 -43373 195567 263472 -290018 -72530 32431 -15745 196369
18130a96834a4353B90707c10889A76438K47828D5420L3822h8784C7725g4844j60698
$$ -196834 -14353 290707 -310889 176438 424266 45420 79242 -88784 37725 -74844 -235542
18119b35542j83695A27803D0096A8313f0432C17270A07859A2387a32879A15492
$$ -235542 -419237 127803 40096 18313 -60432 317270 107859 12387 -132879 115492
18108b78388A48077f9631K5083B69987a93553A15299b21619g319H6010b5643B06597
$$ -278388 148077 -69631 -44548 269987 -193553 115299 -221619 -7319 86010 -25643 206597
18096a53947O6475A3125b83234d2631j5430A2934a76335R650a0542A0627a69202
$$ -153947 -87472 13125 -283234 -42631 -58061 12934 -176335 -166685 -10542 10627 -169202
18084a31901a2928F2553c58296J33007M9765p8798A75869b09554B92060a20572
$$ -131901 -12928 62553 -358296 -225289 -175524 -254322 175869 -209554 292060 -120572
18073a97190G2144N5377e0804A1995J1853f5271I3556h886l1849j83609i2163
$$ -197190 72144 127521 -50804 11995 23848 -65271 93556 -8886 -40735 -224344 -92163
18061F9706G633c15294A16246m6215k0976a2119E3650Q1098J36750b4795B2779
$$ 69706 7633 -315294 116246 70031 49055 -12119 53650 134748 271498 -24795 22779
18049c6908j74212h6421r8707B82507m7127e1282F3474b47361k26197d7517B37419
$$ -36908 -211120 -86421 -185128 282507 235380 -51282 63474 -247361 -473558 -47517 237419
18037c47115a4223A25721E4539j1851c1149A28440d80526B36537a14383p5774
$$ -347115 -14223 125721 54539 42688 -31149 128440 -480526 236537 -114383 -190157
18027a90157P1577k20646c6888m5472A27345E5210J8137j9457J91554a65938A24645
$$ -190157 -118580 -339226 -36888 -82360 127345 55210 73347 53890 245444 -165938 124645
18015a49341A824a28710E8506J5700a46481A6900a33325c3363C46332A52252d6263
$$ -149341 1824 -128710 58506 74206 -146481 16900 -133325 -33363 346332 152252 -46263
18003b25638q12c431E0812h9232G9385k9946J4028g3262m3978j84651A9680a79772
$$ -225638 -226450 -3431 50812 -89232 79385 49439 63467 -73262 -117240 -301891 19680 -179772
17990b01006A8453a57688l8388P0952Q43A62568J8623a10934C86665G5741K4306
$$ -201006 18453 -157688 -196076 -125124 -124281 162568 181191 -110934 386665 75741 100047
17979A00047b40779e7206j63221a6944A44059A1220R4819R669Q7528b7093F6420
$$ 100047 -240779 -57206 -220427 -16944 144059 11220 106039 115708 203236 -27093 66420
17967A03204c9755E6596h8862j00291B38717a42427E9305a1717m4399H3045A8821
$$ 103204 -39755 56596 -88862 -189153 238717 -142427 59305 -11717 -56116 83045 18821
17955a33848j76401J4940D12420E7081L8010k3770d1810G7743c9766p5356a030
$$ -133848 -310249 -295309 412420 57081 95091 71321 -41810 77743 -39766 -115122 -1030
17943e2902F0036J37254b0902A11704R9690n0895g4617r0321N5379I1070D2500
$$ -52902 60036 197290 -20902 111704 211394 160499 -74617 -164938 -109559 91070 42500
17931c1210A07198A0919b00528r0429C25875j13555q4076A2513d11563k5291A42269
$$ -31210 107198 10919 -200528 -290957 325875 212320 128244 12513 -411563 -436854 142269
17919H0472L6880D1887K9692j6577l158c5818B76251n1919a6931B33263a66926
$$ 80472 117352 41887 71579 55002 51844 -35818 276251 224332 -16931 233263 -166926
17907c41904a02330G8663L33849F5917J88341c0050j00150M5277k26579B25654
$$ -341904 -102330 78663 412512 65917 254258 -30050 -130200 -84923 -311502 225654
17896b17130C03142I6173d0914j2309A40886D3405I527h9375K5766B94147j9869
$$ -217130 303142 96173 -40914 -53223 140886 43405 9527 -89375 -63609 294147 274278
17885B74278i5235d2018l9348j32378g2768j40884R4017o1972d5304I7398f672
$$ 274278 -95235 -42018 -81366 -213744 -72768 -213652 -119635 -181607 -45304 97398 -6672
17873h241j38798B92636E7174J72964r708o4002g9645g526B1053D714b75474g6605
$$ -8241 -147039 292636 57174 230138 220430 156428 -79645 -7526 21053 4714 -275474 -76605
17860C90369I1352D0317J09229b92122e1270j01675g2491j56827j2778B3053a73806
$$ 390369 91352 40317 149546 -292122 -51270 -152945 -72491 -229318 -242096 23053 -173806
17848c4092j37375j58314R5737R1367C43710b34967C5914a85838e7644B46684
$$ -34092 -171467 -329781 -234044 -142677 343710 -234967 35914 -185838 -57644 246684
17837F4794i7715m8373O7175n1052O1198C4334J92386J05617j55429c24502E7186
$$ 64794 -97715 -146088 -78913 -129965 -68767 34334 226720 332337 176908 -324502 57186
17825G2554L489a9437k06245j0619C1451a67483B37350A9810c19588A98190a62342
$$ 72554 76043 -19437 -225682 -236301 31451 -167483 237350 19810 -319588 198190 -162342
17813i2383a0759k7704B35561q8701k6142b66802B1430b90330I5349d6172M338
$$ -92383 -10759 -38463 235561 146860 120718 -266802 21430 -290330 95349 -46172 -41834
17802d1834C27496f4269b7330p4514c034j18769M4690D19381Be893l0601H5877
$$ -41834 327496 -64269 -27330 -101844 -3034 -121803 -77113 419381 2 -5893 -36494 85877
17789e6427J6254j09901A1618h1484A13353a36570G6591h5084j99165A07596b27625
$$ -56427 -40173 -150074 11618 -81484 113353 -136570 76591 -85084 -284249 107596 -227625
17777a7256f915B29553d40283K00900l3858k6910e576D089J59144g2185p5590
$$ -17256 -6915 229553 -440283 -239383 -273241 -300151 -5576 4089 163233 -72185 -147775
17766a47775j8034G6187l5719l770L65665d7754j40816G5569k573a64459d5146
$$ -147775 -165809 76187 40468 36698 402363 -47754 -188570 75569 72996 -164459 -45146
17754D6723K34265l6143F7846N8056j7040h0986E4347J38475b41883B38681g9776
$$ 46723 280988 244845 67846 125902 108862 -80986 54347 192822 -241883 238681 -79776
17742A47012o7880a19051j98676d8558C47775j54156D0281N3852b41732c8232
$$ 147012 79132 -119051 -317727 -48558 347775 193619 40281 94133 -241732 -38232
17731F1758c2769a2007A7571b02800E7236K12672F178Q7094b83103G6562J64891
$$ 61758 -32769 -12007 17571 -202800 57236 269908 6178 93272 -283103 76562 241453
17720B41453j19413A1767e7857R732r8789A62664c7532n8975j44101J06759e573
$$ 241453 122040 11767 -57857 -48125 -146914 162664 -37532 -96507 -240608 -133849 -5573
17708G7925a09019k0763A912N331b67127B64043D0581b87524B0001O0170P7765
$$ 77925 -109019 -129782 1912 7243 -267127 264043 40581 -287524 20001 80171 157936
17697A57936k7050C8173M1346f9985A31336O6493j1848d3302J6676j93665f1910
$$ 157936 130886 38173 79519 -69985 131336 197829 185981 -43302 -26626 -220291 -61910
17685A59161J32497n8763e577m0341B72064J31597a61026B607M7154c19508c773
$$ 159161 291658 232895 -5577 -45918 272064 403661 -161026 2607 49761 -319508 -3773
17673C4129a04272C73762d2748o2953A3743L50297b0877k01673B31400a24252
$$ 34129 -104272 373762 -42748 -105701 13743 364040 -20877 -222550 231400 -124252
17662B38270b80475I1135A8102K56446I5219b64535Q6980A29686o3233a7008j06859
$$ 238270 -280475 91135 18102 274548 95219 -264535 -177555 129686 66453 -17008 -123867
17651a23867b6073A27801a0892F5212M0553C9276J58912R5350J08942A53707A8215
$$ -123867 -26073 127801 -10892 65212 105765 39276 198188 293538 402480 153707 18215
17639A8769b51617B21407h1589b5105d203A43620c14381F4047J7581J61807A032
$$ 18769 -251617 221407 -81589 -25105 -4203 143620 -314381 64047 81628 243435 1032
17627c51957J19892A43786g1875R937A16629L07903A06604k1855N1055c52444
$$ -351957 -232065 143786 -71875 -61938 116629 424532 106604 84749 135804 -352444
17616A99741e4590A39610a31047B40243a23253A400b19374A6480J88503a98090
$$ 199741 -54590 139610 -131047 240243 -123253 1400 -219374 16480 204983 -198090
17605g4780j295A18030j8903a37438n8382A09028a34586B27806n3408d7480I3974
$$ -74780 -76075 118030 99127 -137438 -195820 109028 -134586 227806 174398 -47480 93974
17593B82193b14741A03976J78138I8498K29844a21215H6099R9499n7687k7014
$$ 282193 -214741 103976 282114 98498 328342 -121215 86099 185598 127911 100897
17583A00897B3755K72137A28146i2616B47446A14960f0136A76149A6338K15703
$$ 100897 23755 295892 128146 -92616 247446 114960 -60136 176149 16338 232041
17573B32041E4201K46747e7922b3087j19539q3066G1897b37625a3201A09610K57378
$$ 232041 54201 300948 -57922 -23087 -142626 -225692 71897 -237625 -13201 109610 366988
17562C66988E79a00945a8697l8139B9870J44712K8341b6429b476A15424B7200
$$ 366988 579 -100945 -18697 -56836 29870 174582 202923 -26429 -2476 115424 27200
17550a279m427k5117n130k3819A69255E3562J93434J7664J9257o0238l8307Q7551
$$ -1279 -5706 -30823 -35953 -59772 169255 53562 246996 264660 283917 223679 185372 272923
17538B72923f15B5918p620P8797J26457c1807A78524K7425K9532C1588M9717J48992
$$ 272923 -615 25918 18298 97095 223552 -31807 178524 205949 235481 31588 81305 230297
17526B30297j13006R0687h1403B12452p7295i1486j2240m3533f1991d176j91562
$$ 230297 117291 207978 -81403 212452 135157 -91486 -103726 -147259 -61991 -4176 -195738
17515a95738h3693C34023d9040B1684M4696a42744B30793L6256a74947A11494
$$ -195738 -83693 334023 -49040 21684 66380 -142744 230793 267049 -174947 111494
17504a44505O7818E4738N0407J26344H214h596k20872B30072I3748k586D0574
$$ -144505 -76687 54738 105145 231489 8214 -8596 -229468 230072 93748 91162 40574
17492a89680H9334l3164K48044k2791A6241d3351l9482A21322J43287d6174C07592
$$ -189680 89334 56170 304214 281423 16241 -43351 -82833 121322 264609 -46174 307592
17480C23086a02054C03940P4879j68927l2667a12414D80047j15853p8596b32254
$$ 323086 -102054 303940 378819 209892 177225 -112414 480047 364194 285598 -232254
17469C3558L3051c9926B6314L11869A17086P2499b50A43864J17357a67059I7660
$$ 33558 66609 -39926 26314 338183 117086 189585 -250 143864 261221 -167059 97660
17457D26588A57372J24830r9136m7168j2820J23079Q5426j63893a3517B33282
$$ 426588 157372 282202 183066 135898 123078 246157 331583 167690 -13517 233282
17446c2220B31830Q0122K1831q4137A05041Q7292k4948J23767j27689K82164b6182
$$ -32220 231830 311952 333783 249646 105041 192333 167385 291152 163463 445627 -26182
17434A59848J5122K95510k14059g1597B27476A06870A9386K1789N21706A74416
$$ 159848 174970 470480 256421 -71597 227476 106870 19386 41175 562881 174416
17423D82745k12886j00178d8879B15182a17668A31777L25180K2931A64320n7262
$$ 482745 269859 169681 -48879 215182 -117668 131777 456957 479888 164320 107058
17413A07058L05789A75434M6806F9208J82119f2557D520J82307K26257a79069
$$ 107058 412847 175434 222240 69208 251327 -62557 4520 186827 413084 -179069
17402A35186b45365c494F5507J88281J50627f8239E2345H799K5392e5049B26045
$$ 135186 -245365 -3494 65507 253788 404415 -68239 52345 8799 34191 -55049 226045
17390A16672g0686D00273A58968K0398J56071F3642c1827G3159R4884k2334P9941
$$ 116672 -70686 400273 158968 179366 335437 63642 -31827 73159 168043 145709 225650
17379B25650D554a12071C2097J59290f4844D74817A38517k0930Q3481G587K82414
$$ 225650 4554 -112071 32097 191387 -64844 474817 138517 117587 201068 7587 290001
17368B90001A39130M2126J89079f6750G8016d2407B69242r3975J06888D5388K19886
$$ 290001 139130 181256 370335 -66750 78016 -42407 269242 175267 282155 45388 265274
17357B65274E3701J46244J18137A38107m282J08177D0154L87533C9397Q5539f9225
$$ 265274 53701 199945 318082 138107 133825 242002 40154 427687 39397 124936 -69225
17345D74900F1030j03K31396j15181A902J04843L1515c09907g9334C41936r0484
$$ 474900 61030 60927 292323 177142 1902 106745 138260 -309907 -79334 341936 251452
17334B51452j17934R9268d9160D58515A50100I531K87104D6223j9239r637M60744
$$ 251452 133518 232786 -49160 458515 150100 9531 296635 46223 26984 17347 478091
17323D78091F4123P9744a59309G3597J55819l8030Q6423a82707p542K9420A03511
$$ 478091 64123 143867 -159309 73597 229416 191386 277809 -182707 -190249 -160829 103511
17311c23781A55003G6858A1224a33830A42550d8788j2652B5112R0513J87788A45164
$$ -323781 155003 76858 11224 -133830 142550 -48788 -61440 25112 115625 303413 145164
17299C1640K99880g8491q0985B45114M3843q4433J91741J36208A07293Q8295G5033
$$ 31640 331520 -78491 -159476 245114 288957 204524 396265 532473 107293 195588 75033
17287D7993R2273J1797J11733k4065I2666O9641j1660g7007A27377J58236H5319
$$ 47993 140266 152063 263796 239731 92666 162307 150647 -77007 127377 285613 85319
17275B06693n4287B0883M0374M3531K31160p0899J0375A08593F253K44250L57593
$$ 206693 152406 20883 61257 104788 335948 265049 275424 108593 6253 250503 608096
17264F08096B77536j05446A8391Q1113M67692B32476d7184J313C02941N3088A48867
$$ 608096 277536 172090 18391 99504 567196 232476 -47184 -45871 302941 356029 148867
17252A35655B8420L39767d7229n2221D07836A21254m5969J14195q8659j4015D0240
$$ 135655 28420 368187 -47229 -99450 407836 121254 75285 189480 100821 86806 40240
17240A61204J13590j02821J76047j51633L17730j71814q9640J76609a68494A02535
$$ 161204 274794 171973 348020 196387 514117 342303 252663 429272 -168494 102535
17229C07486G5013a03409C07990K9633N1824J56175k17425N1149q6017j22975
$$ 307486 75013 -103409 307990 337623 389447 545622 328197 379346 293329 170354
17219A70354L96414A89391N6016j17183B4488Q518K35749b29155C33933j8473
$$ 170354 566768 189391 245407 128224 24488 33006 268755 -229155 333933 315460
17209C15460q9793J75345I6263c55506C98840C9824K80884K14544A12910J16236
$$ 315460 225667 401012 96263 -355506 398840 39824 320708 535252 112910 229146
17199B29146p6721P8985r5385Q9858A6569M26935N5915L0207a99935D09550j61091
$$ 229146 152425 231410 136025 225883 16569 443504 499419 529626 -199935 409550 248459
17188B48459J44168l9433p5476M4708j35357K36319A07360M56195A79344L60922
$$ 248459 392627 353194 277718 322426 187069 423388 107360 563555 179344 540266
17178E40266Q110j10810j00163E6219K58363J45471L8200k07869p1460A038J84257
$$ 540266 548376 437566 337403 56219 314582 460053 498253 290384 218924 1038 185295
17167A85295L23339j46623q829h0572C02576p3799a7929C0939i2389E77385j95068
$$ 185295 508634 362011 353182 -80572 302576 228777 -17929 30939 -92389 577385 382317
17156C82317E9557Q3193J53529q6830C4257M12110A40590M69412A99862J87018
$$ 382317 59557 142750 296279 209449 34257 446367 140590 610002 199862 386880
17146C86880A59346K16188R1587j59730A06257K51352c079B90026N534J73737
$$ 386880 159346 375534 467121 307391 106257 357609 -3079 290026 295560 469297
17136D69297j51833r6499R5008o6905N23504C32443j26625K31568j88251J74606
$$ 469297 317464 220965 315973 249068 772572 332443 205818 437386 249135 423741
17126D23741j37782K48778j05538j02514m4420K7831J060N5080n7785J254Q3211
$$ 423741 285959 534737 429199 326685 282265 310096 311156 366236 308451 309705 392916
17115C92916M3082j11923j06869J12300j37522K0435J40503j45754J00246e2222
$$ 392916 435998 324075 217206 329506 191984 212419 352922 207168 307414 -52222
17104D02046K3384A70655M79828B83138L0708P1138M0243L9565m9078k8173F4443
$$ 402046 425430 170655 650483 283138 313846 384984 425227 464792 415714 387541 64443
17092D13883K21482J5054j73455k24232J13763K19905M9717B92088J39284j59694
$$ 413883 635365 650419 476964 252732 366495 586400 636117 292088 431372 271678
17082B71678K07198K35661k31707j3692j3272k21084L01420o4790j38159J10000
$$ 271678 478876 714537 482830 469138 455866 234782 536202 471412 333253 443253
17072D43253K62021j53844j00282J23597j15600k575k03356L33768J69038l50651
$$ 443253 705274 551430 451148 574745 459145 456570 253214 586982 756020 405369
17062D05369j08994J12741K55066j84545Q7467j19259K03815j05551L13728m00380
$$ 405369 296375 409116 664182 479637 567104 447845 651660 546109 859837 459457
17052D59457L16027j76383k44339J12227K7744J38821M5325l05714K66725j40360
$$ 459457 775484 599101 354762 466989 494733 633554 678879 373165 639890 499530
17042D99530o8190M7148K06951j33573n4778M8982n2181A93330M36115j24348
$$ 499530 431340 478488 685439 551866 497088 546070 493889 193330 629445 505097
17032E05097L09414l94545L24155Q7161B24000L37735m3156O4563N8l1678k3989
$$ 505097 814511 419966 744121 831282 224000 561735 518579 583142 583200 551522 527533
17021E27533Q5302K3155k58118P59853m23718j96758A74869Q27657m87844k1325
$$ 527533 612835 635990 377872 1137725 714007 517249 174869 1002526 514682 493357
17011D93357J90976N7150k34506K02513A82006N40441o792J49414L3557B65555
$$ 493357 684333 741483 506977 709490 182006 722447 715655 865069 898626 265555
17000E44777k7250L79133j7365p7435k64531n064K91720J54160j02792l91852
$$ 544777 517527 896660 879295 801860 537329 532265 823985 978145 875353 483501
16990D83501K39030L7082J53440j67156j55528M74986j84454m591j4130M2778
$$ 483501 722531 759613 913053 745897 590369 1065355 880901 876310 862180 904958
16980I04958k41576K58351J54602j79127m10830J27378L38652k4513m24780M30819
$$ 904958 663382 921733 1076335 897208 486378 613756 952408 927895 503115 933934
16970I33934l55875M50156j03416j92922J72292k26294K66839j15496Q2464J08021
$$ 933934 578059 1028215 924799 731877 904169 677875 944714 829218 911682 1019703
16960A019703j54757K28667J04515j40789R2501k52996J27301l50528L14420N7718
$$ 1019703 864946 1093613 1198128 1057339 1149840 896844 1024145 673617 988037 1045755
16950A045755N80921q08670N53975l23858l0780l3721K35158J42468l53142R2615
$$ 1045755 1626676 818006 1371981 1048123 1017343 983622 1218780 1361248 1008106 1100721
16940A100721m54749O93283r8945j88308L0992K77082q8043K64309j08019k7493
$$ 1100721 645972 1339255 1240310 1052002 1082994 1360076 1272033 1536342 1428323 1400830
16930A400830o18436L29445N77492m16424K43228l34153N23273k76130j68427
$$ 1400830 782394 1111839 1689331 1272907 1516135 1181982 1705255 1429125 1260698
16921A260698K504K65376m20401J32467J84104J12302K13816l25766r003Q6209
$$ 1260698 1263202 1528578 1108177 1240644 1424748 1537050 1750866 1425100 1416097 1502306
16911A502306P5113Q4439q2953j79522n8724J79703J56542R4062o9609n8737J10409
$$ 1502306 1577419 1661858 1578905 1399383 1340659 1520362 1676904 1770966 1701357 1642620 1753029
16900A753029q2201L47744l10507J18510r51o9661r1685J50810m8095J66695j20601
$$ 1753029 1670828 2018572 1708065 1826575 1825624 1755963 1664278 1815088 1766993 1933688 1813087
16889A813087L95700l04680k5161o9277Q7375J90316L23508k97956J37114j22681
$$ 1813087 2208787 1904107 1878946 1809669 1897044 2087360 2410868 2112912 2250026 2127345
16879B127345m2463j5239M51736j50895K53689k62996k88635L61721j2578J94223
$$ 2127345 2084882 2069643 2521379 2370484 2624173 2361177 2072542 2434263 2421685 2615908
16869B615908J84838j77153L6796j37001K85338J30338l05196M0432M0696P3166
$$ 2615908 2800746 2623593 2660389 2523388 2808726 2939064 2633868 2674300 2714996 2788162
16859B788162N1300J68957r8055j00852M66582q2716k84673L06482n1380K99883
$$ 2788162 2839462 3008419 2910364 2809512 3276094 3193378 2908705 3215187 3163807 3463690
16849C463690l10790J41430K83619k94854j0328K95850P7334l25319L61041J25631
$$ 3463690 3152900 3294330 3577949 3283095 3272767 3568617 3645951 3320632 3681673 3807304
16839C807304J74325q7771q3412N42875m2701N8659K6139J9420J49021K16219
$$ 3807304 3981629 3893858 3810446 4353321 4310620 4369279 4395418 4414838 4563859 4780078
16829D780078k11008K37443j01764o8502K43189K82085l5540L08179n4582j18919
$$ 4780078 4569070 4806513 4704749 4636247 4879436 5161521 5125981 5434160 5379578 5260659
16819E260659l8878K91875M70326l26252q1376M88862Q7721K07589K25716K57504
$$ 5260659 5221781 5513656 5983982 5657730 5576354 6065216 6152937 6360526 6586242 6843746
16809F843746j28349J09293n8142M46911o1160O25206M8105J21367J91131R2202
$$ 6843746 6715397 6824690 6766548 7213459 7152299 7777505 7825610 7946977 8138108 8230310
16799H230310J76524k23979M08943L55606N94944l5574j82606N53837M7073K69441
$$ 8230310 8406834 8182855 8591798 8947404 9542348 9506774 9324168 9878005 9925078 10194519
16789A0194519N37796K43412N90239Q1669J88761N15725J36824N36874K08951
$$ 10194519 10732315 10975727 11565966 11647635 11836396 12352121 12488945 13025819 13234770
16780A3234770L62155N53981Q03122J12336P98550N27044M24552N42141L76124
$$ 13234770 13596925 14150906 14954028 15066364 15864914 16391958 16816510 17358651 17734775
16771A7734775Q13276N17662O73252R84404L53015Q69555Q38645P36624R63109
$$ 17734775 18548051 19065713 19738965 20723369 21076384 21945939 22784584 23521208 24484317
16762B4484317J038880R83877J154522J146335J088913J366181R77299J585930
$$ 24484317 25523197 26507074 27661596 28807931 29896844 31263025 32240324 33826254
16754C3826254J712415J738778J572279K020680J851184J979549K215766K322005
$$ 33826254 35538669 37277447 38849726 40870406 42721590 44701139 46916905 49238910
16746D9238910K610993K841045K892895L031363L056473M019368L273923M318812
$$ 49238910 51849903 54690948 57583843 60615206 63671679 67691047 70964970 75283782
16738G5283782M090841M554861N060479N139421N299822N667773N888699N892051
$$ 75283782 79374623 83929484 88989963 94129384 99429206 105096979 110985678 116877729
16730A16877729O519366O550419O719444O279359O528970O476623N645924M851223
$$ 116877729 123397095 129947514 136666958 142946317 149475287 155951910 161597834 166449057
16722A66449057M733065M020150K615779K017504M50970k43334k028295k129083
$$ 166449057 171182122 175202272 177818051 179835555 180286525 180043191 178014896 175885813
16714A75885813l571903m571930n059107n902644o329613o414038o732152o903210
$$ 175885813 172313910 167741980 162682873 156780229 150450616 144036578 137304426 130401216
16706A30401216o963604o295507o504006o002980o255667n442072n377641n166318
$$ 130401216 123437612 117142105 110638099 104635119 98379452 92937380 87559739 82393421
16698H2393421m854049l895540m405826m207271l165113l548245l260194k631398
$$ 82393421 77539372 73643832 69238006 65030735 61865622 58317377 55057183 52425785
16690E2425785k743303k646275k857289j875404k152811j774960j886941j832069
$$ 52425785 49682482 47036207 44178918 42303514 40150703 38375743 36488802 34656733
16682C4656733j458357j400329j298958j318406j485824o82088j624364o63615
$$ 34656733 33198376 31798047 30499089 29180683 27694859 27012771 25388407 24724792
16674B4724792j213757q63026j116438q35025n04043p77270p89623o58609l36182
$$ 24724792 23511035 22648009 21531571 20696546 20192503 19415233 18625610 17967001 17630819
16665A7630819j030875k23529p60009l93502o57032o78302m1011o22296j36055
$$ 17630819 16599944 16376415 15616406 15222904 14565872 13887570 13846559 13224263 13088208
16656A3088208o86551k29774o25292k79765O4112l27528n78228k72421j77988
$$ 13088208 12401657 12171883 11546591 11266826 11330938 11003410 10425182 10152761 9974773
16647I974773k70051k42388o17214r834j252l58762n14549J69685k25726k44986
$$ 9974773 9704722 9462334 8845120 8835286 8834034 8475272 7960723 8130408 7904682 7659696
16637G659696l31590J0266j62738l58560n0434k68637n8304k76173J05953k72038
$$ 7659696 7328106 7338372 7175634 6817074 6766640 6498003 6439699 6163526 6269479 5997441
16627E997441j50178O1660n41640J07431m0047j40037k46698q7921L1159j65048
$$ 5997441 5847263 5908923 5367283 5474714 5434667 5294630 5047932 4960011 4991170 4826122
16617D826122o5569j17429l21051Q6j5632J68583m78167K23348m06908q3418p209
$$ 4826122 4760553 4643124 4322073 4322159 4306527 4475110 3996943 4220291 3813383 3729965 3722756
16606C722756l4037j13877J58585k3881j01771j01289k0802j12681k34285k72983
$$ 3722756 3688719 3574842 3733427 3709546 3607775 3506486 3485684 3373003 3138718 2865735
16596B865735N72762k49756J2326l00510o4215O7669p0784O7665n15518k0639
$$ 2865735 3438497 3188741 3201067 2900557 2836342 2904011 2833227 2900892 2385374 2364735
16586B364735L20326k37746j2785k42430L48352J53744l04791k55861J87182M9269
$$ 2364735 2685061 2447315 2434530 2192100 2540452 2694196 2389405 2133544 2320726 2369995
16576B369995j37805K58150j26978l54898K09933j81503K16507m40012R1068j60833
$$ 2369995 2232190 2490340 2363362 2008464 2218397 2036894 2253401 1813389 1904457 1743624
16566A743624M60639J17394j96787m1759l1289J20226k27123j67599j36356k2369
$$ 1743624 2204263 2321657 2124870 2083111 2051822 2172048 1944925 1777326 1640970 1618601
16556A618601N61682k33251k64119J7945o864K21615m17590j22656j25007J11016
$$ 1618601 2180283 1947032 1682913 1700858 1693994 1915609 1498019 1375363 1250356 1361372
16546A361372K36141j48586J08332J0874m38203O87187m84078j43246K11498p3107
$$ 1361372 1597513 1448927 1557259 1568133 1129930 1817117 1333039 1189793 1401291 1328184
16536A328184p7796M01905k86595N5109J27623K3275m58021K27447k96992r6742
$$ 1328184 1250388 1652293 1365698 1420807 1548430 1571705 1113684 1341131 1044139 947397
16526I47397K42257j39525L89761k80385p4214j12739R43j43457J92300J05075
$$ 947397 1189654 1050129 1439890 1159505 1085291 972552 973495 830038 1022338 1127413
16516A127413O1763p3341j73705J76495k43391K64593j61891j59215K55191j3575
$$ 1127413 1189176 1115835 942130 1118625 875234 1139827 977936 818721 1073912 1060337
16506A060337K70323E12352L86262o9321R6506J38220j12856j94676j07715K23751
$$ 1060337 1330660 512352 898614 829293 925799 1064019 951163 756487 648772 872523
16496H72523O3567k09231O6439M95085n96060j80667N46702n03640J17532J15259
$$ 872523 936090 726859 793298 1288383 692323 511656 1058358 554718 672250 787509
16486G87509k6740K24119l97696K03830J72698j62900j6108j8185j89854L2124
$$ 787509 760769 984888 587192 791022 963720 800820 784712 766527 576673 608797
16476F08797r4036J55812J40931l44234K39199K13852k37607p3196n590M31749
$$ 608797 514761 670573 811504 467270 706469 920321 682714 609518 603928 1035677
16466A035677m24770K72654j40851k36070J79650j25630L93064D54497K11457
$$ 1035677 610907 883561 742710 506640 686290 560660 953724 454497 665954
16457F65954k22458L40746j0037k71157O9567J67363q6579j7319L2101A87606
$$ 665954 443496 784242 774205 503048 572615 739978 653399 636080 668181 187606
16446F65634P6770R3623j35884L0688r2130j89075N1189L05481j2542k76548J09979
$$ 665634 742404 836027 700143 730831 638701 449626 500815 806296 793754 517206 627185
16435F27185n273k99858J8006Q8379M5280O7636K4664j12004N0416j98298K07482
$$ 627185 621912 322054 340060 428439 473719 541355 566019 454015 504431 306133 513615
16424E13615p8204J4523K96365C64629a5037C43056J13622J5848m4540J01002
$$ 513615 435411 449934 746299 364629 -15037 343056 456678 472526 427986 528988
16414E28988p097j88796J82787B54150L24259B16648J67175q0526J35595K6743
$$ 528988 521891 333095 515882 254150 578409 216648 383823 303297 438892 465635
16404D65635N9395A70095n927k1670K92072j79626L24385J75519A92474N4899
$$ 465635 525030 170095 164168 142498 434570 254944 579329 754848 192474 247373
16394B47373M8443P5926r1468o872r2112K86131j87208F1082O36972C21549A15257
$$ 247373 295816 371742 280274 273402 181290 467421 280213 61082 698054 321549 115257
16382E20394l8834k17953o6661K84732B37440J20626J5543J85198j0780j83149
$$ 520394 481560 263607 196946 481678 237440 358066 373609 558807 548027 364878
16372C64878J4648j36270K12407n2877j94791I3152r596R0319J94269K73260A79892
$$ 364878 379526 243256 455663 402786 207995 93152 83556 173875 368144 641404 179892
16360C45519j03140L09094A01289K05227k5806j2700B8703R8823m1249L72353
$$ 345519 242379 551473 101289 306516 280710 268010 28703 127526 86277 458630
16350D58630A85799J26786C8704j0822M0606K53345A17652K66752j42268O7845
$$ 458630 185799 312585 38704 27882 68488 321833 117652 384404 242136 309981
16340C09981b00244C91842j42344J38178j45411p7549q922m1061L27710A01717
$$ 309981 -200244 391842 249498 387676 242265 164716 155794 114733 442443 101717
16329C17344D7469K30151l8567I9918Q3950J40844i8136B16493J28928r8668J33531
$$ 317344 47469 277620 239053 99918 183868 324712 -98136 216493 345421 246753 380284
16318C80284f6119J9820C8878c5494B56699a61901B34851i1931C90675G6664K49396
$$ 380284 -66119 -46299 38878 -35494 256699 -161901 234851 -91931 390675 76664 326060
16307C26060o1261n4908Q8432l8246p8612G5843a59295A4271K54358m4798n0060
$$ 326060 264799 209891 298323 260077 181465 75843 -159295 14271 268629 223831 173771
16296A73771M8365n8117i2075F02222A61883e6714A81186l47q2692K41542f1643
$$ 173771 222136 164019 -92075 602222 161883 -56714 181186 180839 98147 339689 -61643
16284A00628K09219j00084M2118I1439k3544R4161F3266J15433N2419H2883Q085
$$ 100628 309847 209763 251881 91439 67895 162056 63266 178699 231118 82883 90968
16273I0968N4029F685J23590B612K15951p3118f1383A55502l8268L40148A40200
$$ 90968 144997 6685 130275 2612 218563 145445 -61383 155502 117234 457382 140200
16261D87729B39990E7210h1895E6581d66366A80623l7516b05922C30526j11939
$$ 487729 239990 57210 -81895 56581 -466366 180623 143107 -205922 330526 218587
16251B18587l9900F6819e1208A03220i5427B63244K185h4106D14583A43752l3456
$$ 218587 178687 66819 -51208 103220 -95427 263244 265429 -84106 414583 143752 110296
16240A10296D0796J71735A5581a58677B41136e2069D19042B04496F0342b52300
$$ 110296 40796 212531 15581 -158677 241136 -52069 419042 204496 60342 -252300
16229f8822I4507b43613G7669K24850I2915J44786c0424J3167m3196F9854Q1628
$$ -68822 94507 -243613 77669 302519 92915 237701 -30424 -17257 -60453 69854 151482
16218A51482J65129j33958E1296f7214m17L1985l7615B92946a87630e9430j09307
$$ 151482 316611 182653 51296 -67214 -67631 -35646 -73261 292946 -187630 -59430 -168737
16207a68737a1860B355J63694B7375a1971A71091o5136a97119A65785o5312b92642
$$ -168737 -11860 2355 166049 27375 -11971 171091 105955 -197119 165785 100473 -292642
16195C1941c45263J54731f8013A6011J4893J27193m4480a84440A79622c69702
$$ 31941 -345263 -190532 -68013 16011 30904 158097 113617 -184440 179622 -369702
16184B40291A01905f8375l12667A03013b43743A51527L20570b19185B08782d9159
$$ 240291 101905 -68375 -381042 103013 -243743 151527 472097 -219185 208782 -49159
16173A09271L08601h6924A61391b17233f8519A43145c4142A6643J15038D9156
$$ 109271 417872 -86924 161391 -217233 -68519 143145 -34142 16643 131681 49156
16162E1763c77554G0240b12805A57518E6782a63139a1410m3789P358A21334a35009
$$ 51763 -377554 70240 -212805 157518 56782 -163139 -11410 -55199 -47841 121334 -135009
16150a43281m0982B15501f6513A9061K70154a28283A1643a91821j6000H938J40324
$$ -143281 -184263 215501 -66513 19061 289215 -128283 11643 -191821 -207821 8938 149262
16139A49262e3008G4517h0308C5743P7368e4777B91909H6334k0915b51533c1087
$$ 149262 -53008 74517 -80308 35743 113111 -54777 291909 86334 65419 -251533 -31087
16127G7651q775J31943J45908a28065N3163a139A8973J10687h2235B05618f6678
$$ 77651 68876 200819 346727 -128065 -74902 -1139 18973 129660 -82235 205618 -66678
16115a46547B06816O4919k2128a27801c3877B72335j02591a7120B18706b9972
$$ -146547 206816 271735 249607 -127801 -33877 272335 169744 -17120 218706 -29972
16104e7643H9743J2980J58264p2119a28655A06964M13661B08907c4741o5520I334
$$ -57643 89743 102723 260987 188868 -128655 106964 520625 208907 -34741 -100261 9334
16092a18020I3200c16631B55232l5D9766a43850e4607j85256L2404A43949b18476
$$ -118020 93200 -316631 255232 255197 49766 -143850 -54607 -239863 -207459 143949 -218476
16080A06151c5631r1283A90450r4197a76702d1229j55538i6891C9394a20203A12577
$$ 106151 -35631 -126914 190450 96253 -176702 -41229 -196767 -96891 39394 -120203 112577
16068a10903l34282A44615d9431A94482C8619a08161G4704K19353j14952d5952
$$ -110903 -445185 144615 -49431 194482 38619 -108161 74704 294057 179105 -45952
16057b49097A92631H1683c3400j36275p5714A57354d35391d0805j92391d4867
$$ -249097 192631 81683 -33400 -169675 -245389 157354 -435391 -40805 -233196 -44867
16046A30338J83931I0075K66680e0288j6939j04128k9285k09179J98454h069n0565
$$ 130338 314269 90075 356755 -50288 -67227 -171355 -200640 -409819 -211365 -8069 -58634
16035e8634o4595k6247A8418b11758A84931p4778i0900m4389o3313J733b2741
$$ -58634 -123229 -149476 18418 -211758 184931 110153 -90900 -135289 -198602 -196869 -22741
16023i0643A06091b67209A33146C2252P9459K94323c436C7401J75078b21961M8029
$$ -90643 106091 -267209 133146 32252 111711 406034 -3436 37401 212479 -221961 -173932
16012a73932A26777J39479A28950a25637q28j05421Q818L6898A8489J02721C5736
$$ -173932 126777 266256 128950 -125637 -126465 -231886 -223068 -186170 18489 121210 35736
16000I2282b22787d4213B1348c931A04466c17508m7761M3366i7243j2846k16755
$$ 92282 -222787 -44213 21348 -3931 104466 -317508 -365269 -321903 -97243 -110089 -326844
15989c26844A28429K17534a30250E1101K53957n6273I8905J13170R3118J01886
$$ -326844 128429 345963 -130250 51101 305058 248785 98905 212075 305193 407079
15979D07079N6383A29446f8724A74814a74679n6318C25150D7034a78779k07011
$$ 407079 463462 129446 -68724 174814 -174679 -230997 325150 47034 -178779 -385790
15969c85790J16949A13449l3470a08268L8611q3355M0554A53163o9335J18603
$$ -385790 -268841 113449 79979 -108268 -69657 -153012 -112458 153163 83828 202431
15959B02431A0768f2758k07898A48243a22529A07131L0374c1779l545A26271c89459
$$ 202431 10768 -62758 -270656 148243 -122529 107131 137505 -31779 -35324 126271 -389459
15947b86389b4907o9021d380H461J44732l6136b31234i1274A11907E182J06315
$$ -286389 -24907 -93928 -4380 8461 153193 117057 -231234 -91274 111907 5182 111497
15936A11497d4142C3377a66278B28707b18148g3769r6533A02443J6786a76437
$$ 111497 -44142 33377 -166278 228707 -218148 -73769 -170302 102443 119229 -176437
15925a82282d1089j67903A0255f9485j66017n049k12821A46182b34266A00295
$$ -182282 -41089 -208992 10255 -69485 -235502 -240551 -453372 146182 -234266 100295
15914b81497l2519f1732k42899J9556G3531c33013a58938I3979b2045p650m55125
$$ -281497 -314016 -61732 -304631 -285075 73531 -333013 -158938 93979 -22045 -29695 -484820
15903d84820A95810f030F1394K2195K9788Q3804a40900o6213A51780c1757C08630
$$ -484820 195810 -6030 61394 83589 113377 197181 -140900 -207113 151780 -31757 308630
15891d71628g4719c5643n4657a7634G5090e18122a455A26846a5912C66348e3989
$$ -471628 -74719 -35643 -90300 -17634 75090 -518122 -1455 126846 -15912 366348 -53989
15879i34k18308c4746l42554J79370J9549C64275A8808Q1730b10305k7353A94575
$$ -934 -219242 -34746 -377300 -197930 -178381 364275 18808 100538 -210305 -237658 194575
15867a3891k0188A58617b7283l0794q7448M051A24647d54820F2654K0406B223
$$ -13891 -34079 158617 -27283 -58077 -145525 -141474 124647 -454820 62654 83060 2223
15855a35058p3437A03505e153B09921M1483B3792b03746i5489j52487g5911E0983
$$ -135058 -208495 103505 -5153 209921 251404 23792 -203746 -95489 -247976 -75911 50983
15843E5725a1096A44011d285A42174b25089A79916c16458A56125a04160a526A42070
$$ 55725 -11096 144011 -4285 142174 -225089 179916 -316458 156125 -104160 -1526 142070
15831F6670a11588n5830j55796A03167b6981H2928b24675d1244C37135G1156j3242
$$ 66670 -111588 -167418 -323214 103167 -26981 82928 -224675 -41244 337135 71156 57914
15820E7914N7015a57114l808B19691a11889N5463j94013a09035j13477a02342
$$ 57914 114929 -157114 -160922 219691 -111889 -56426 -250439 -109035 -222512 -102342
15809b72793I8295m1147J14871a78518I5446e5744a518I1043b01265k9690h7061
$$ -272793 98295 57148 172019 -178518 95446 -55744 -1518 91043 -201265 -230955 -87061
15797b8393D379k011g5661G3283c80353C0481a50497j71256J50627A04524a38302
$$ -28393 4379 2368 -75661 73283 -380353 30481 -150497 -321753 -171126 104524 -138302
15785i1691b4822B81632G3891k4676J17277a52867B09212p4696a37173m2566d186
$$ -91691 -24822 281632 73891 49215 166492 -152867 209212 134516 -137173 -179739 -4186
15773g2047E1535c4740F6273i2252j47742A19275h222j58821G5435O6669b44204
$$ -72047 51535 -34740 66273 -92252 -239994 119275 -8222 -167043 75435 142104 -244204
15761a40169C37773c621j20643B03424C052g0611k1777A43739a52794P2788j79047
$$ -140169 337773 -3621 -124264 203424 3052 -70611 -92388 143739 -152794 -80006 -259053
15750b59053H4624K1569a80723F157a56943A85887l5198o0499a4954j61379A00871
$$ -259053 84624 106193 -180723 6157 -156943 185887 150689 90190 -14954 -176333 100871
15738A59552c39883a38286J2362r9190f6931C44144a44526K1484a5443G3712i959
$$ 159552 -339883 -138286 -125924 -225114 -66931 344144 -144526 -123042 -15443 73712 -9959
15726i2927b7940A8267J30130b5931p2042A42802g081m3291j52735A20789b04331
$$ -92927 -27940 18267 148397 -25931 -97973 142802 -7081 -50372 -203107 120789 -204331
15714g4027q303G0135A4249J95796G84R2209d48930e831j24484A5438M7705a55454
$$ -74027 -82330 70135 14249 210045 784 92993 -448930 -5831 -130315 15438 63143 -155454
15701b20491M2380I103a40305k1291j15877A681L5321d587A09861c7984B38254
$$ -220491 -178111 9103 -140305 -161596 -277473 1681 37002 -4587 109861 -37984 238254
15689E3095L03550h323m7423j15958A77740b11344A83694l0283g4156j33179E7984
$$ 53095 356645 -8323 -55746 -171704 177740 -211344 183694 153411 -74156 -207335 57984
15677a67099l8525e5484F6098i6892L9091A11049E3741J78805D3462A7202Q532
$$ -167099 -205624 -55484 66098 -96892 -57801 111049 53741 232546 43462 17202 25734
15666B5734K32407A22525a69425A79660d6345n4967j45207h7736j18912P418C6405
$$ 25734 258141 122525 -169425 179660 -46345 -101312 -246519 -87736 -206648 -199230 36405
15654a23871C6310e5799A53699j5718a51237l1164M6177C24656A36055K32700
$$ -123871 36310 -55799 153699 137981 -151237 -182401 -136224 324656 136055 368755
15644C68755M6671a77218E2529e466j46720A67958B3133b27029j58291a20134
$$ 368755 415426 -177218 52529 -5466 -152186 167958 23133 -227029 -385320 -120134
15633B00935i2461I1193f6748j46984R9721I0607h8472j49581a15406k3138m2671
$$ 200935 -92461 91193 -66748 -213732 -114011 90607 -88472 -238053 -115406 -138544 -181215
15622a81215b3660q85B94857b19407O1210A13093f7140B06233a55902c607A9656
$$ -181215 -23660 -24545 294857 -219407 -158197 113093 -67140 206233 -155902 -3607 19656
15610A22802E6088b65790C1427g3431B0625c54409J59958g14q7492j24131A21401
$$ 122802 56088 -265790 31427 -73431 20625 -354409 -194451 -714 -88206 -212337 121401
15598G6620g0515j57775c1448o4183j36298J8673A40942b29419h3015k8130M9740
$$ 76620 -70515 -228290 -31448 -95631 -231929 -213256 140942 -229419 -83015 -111145 -61405
15587f1405A485a72176I9745K2040a56411g6563A4964K02715J9149j16832a2730
$$ -61405 1485 -172176 99745 121785 -156411 -76563 14964 217679 236828 119996 -12730
15575b26529L9179B9858B148a82549O9718q7407C64380i1161G5762h5044B95133
$$ -226529 -187350 29858 2148 -182549 -112831 -200238 364380 -91161 75762 -85044 295133
15563A69280C8768A89K63393j13761i4682B17741o2425J38040H1836d0848A57967
$$ 169280 38768 189 263582 149821 -94682 217741 155316 293356 81836 -40848 157967
15551c01844Q5784F8054K4528J34282H9269b6043B79208c24652b7652H8526J4735
$$ -301844 -216060 68054 92582 226864 89269 -26043 279208 -324652 -27652 88526 103261
15540A03261J72387A10216J23003a15757J0280m3013B45122p7973a56557F5709
$$ 103261 275648 110216 233219 -115757 -105477 -148490 245122 167149 -156557 65709
15529a18896r2583A70781q0533a96663g241A89984a03558A33869j5379a50449
$$ -118896 -211479 170781 90248 -196663 -7241 189984 -103558 133869 118490 -150449
15518a01414A3200a10015B04708c660B83351a08926j37135J06548A76210J21108
$$ -101414 13200 -110015 204708 -3660 283351 -108926 -246061 -139513 176210 297318
15508B97318k7817a20076A83279h6915D61179b119j98236f0228k232p9655a0613
$$ 297318 269501 -120076 183279 -86915 461179 -2119 -200355 -60228 -62460 -142115 -10613
15496C8248a75238l1310A17646C8524J1783J51074M8085b83342L6687E4786K57787
$$ 38248 -175238 -206548 117646 38524 50307 201381 249466 -283342 -246655 54786 312573
15485C12573l111b56322D7590L38863A50983a82167b0289j46666b5385i783A56111
$$ 312573 309462 -256322 47590 386453 150983 -182167 -20289 -166955 -25385 -9783 156111
15473i2946j46792A04609B9600r772b28106B7810e6092G5464b3567k82810h7427
$$ -92946 -239738 104609 29600 19828 -228106 27810 -56092 75464 -23567 -306377 -87427
15461a98064d1612A28102c08782A60934n0694K6090f6718j45956A3704J1567K01888
$$ -198064 -41612 128102 -308782 160934 110240 136330 -66718 -212674 13704 25271 227159
15450B27159A8445b56909L6558k36475d6957P473j24999O9376k8058n1690g7285
$$ 227159 18445 -256909 -220351 -456826 -46957 -39484 -164483 -95107 -123165 -174855 -77285
15438b49395f6932A94435i8226j472j37883A66290a8630o8670F6777L1471J6572
$$ -249395 -66932 194435 -98226 -99698 -237581 166290 -18630 -87300 66777 98248 114820
15427A14820b19175C61961a00676D3451b33009r4452c1426j08383l16737A95637
$$ 114820 -219175 361961 -100676 43451 -233009 -327461 -31426 -139809 -456546 195637
15416a62951d0143j34860E5843A0671b8601o3369H0183R702R9007h200j57885
$$ -162951 -40143 -175003 55843 10671 -28601 -91970 80183 89885 188892 -8200 -166085
15405a66085j75798f4270e117j65921a8808k23884f3645j41017j06514J05340
$$ -166085 -341883 -64270 -5117 -171038 -18808 -242692 -63645 -204662 -311176 -205836
15395b05836j3570A44737N1848D1017K57458a69826G4992J81415p0861j4274a08695
$$ -205836 -219406 144737 196585 41017 298475 -169826 74992 256407 185546 171272 -108695
15383h0991K2673A18140K05299A11080l6977d77559a68719A54858G216K29573
$$ -80991 -58318 118140 323439 111080 74103 -477559 -168719 154858 7216 236789
15373B36789e8473l72149b09227b2148A32103a1861B82154C6603p432J2884c06159
$$ 236789 -58473 -430622 -209227 -22148 132103 -11861 282154 36603 29171 42055 -306159
15361D9804o712i0733m3198L4826L9473A7592K27495A20870b17721J7051C98583
$$ 49804 43092 -90733 -133931 -99105 -59632 17592 245087 120870 -217721 -200670 398583
15349G727a22925d6630Q694A09522a91717j67176a3896A8617g2270j42394B38963
$$ 7727 -122925 -46630 -37936 109522 -191717 -358893 -13896 18617 -72270 -214664 238963
15337B01214J6283c9028B69944B7828a9108B23224h6004C57146f978j70118A76762
$$ 201214 217497 -39028 269944 27828 -19108 223224 -86004 357146 -6978 -177096 176762
15325D78018j55379j48219G9212A4938b51797a13414B79030I2923J60184o9833
$$ 478018 322639 174420 79212 14938 -251797 -113414 279030 92923 253107 183274
15315A83274a19582b0486A59292d9021C40128f9329j20864D4331a15507D2987
$$ 183274 -119582 -20486 159292 -49021 340128 -69329 -190193 44331 -115507 42987
15304a97075A74089A403M3012b11480d4492B03643E7667h4285I5375a38559O0009
$$ -197075 174089 1403 44415 -211480 -44492 203643 57667 -84285 95375 -138559 -78550
15293g8550A11477a60395r8184P170A20809b49544D3823K78091b59837E495d8629
$$ -78550 111477 -160395 -258579 -251409 120809 -249544 43823 321914 -259837 5495 -48629
15281A57762k0116O8155a56196A01521a9911B7050d322B67587b4532B6837K9265
$$ 157762 137646 205801 -156196 101521 -19911 27050 -4322 267587 -24532 26837 56102
15270E6102P0567b12979D0968j9499R9173O6449C2539J86244a6555J802p2147
$$ 56102 126669 -212979 40968 21469 120642 187091 32539 218783 -16555 -14753 -86900
15259h6900a1631A430J23630L7907E1231d9821B736K71250J77617j46774A50388
$$ -86900 -11631 1430 125060 162967 51231 -49821 2736 273986 451603 304829 150388
15247I07004K76566M59494m34383Q0531k97919A16259J74608A37265J50596a05136
$$ 907004 1183570 1643064 1208681 1289212 991293 116259 290867 137265 287861 -105136
15236A5665J75826f173n9798A64784b6681A28896j6359i173A56719D7424J8643
$$ 15665 191491 -6173 -65971 164784 -26681 128896 112537 -9173 156719 47424 66067
15225F6067b8802C3464c0907A66614E2682J1236j6261i842E7991J6871c15364
$$ 66067 -28802 33464 -30907 166614 52682 63918 47657 -9842 57991 74862 -315364
15213a80238Q7336B35465F7930N2339a50124j6545q0363D2737A1768c4622H9123
$$ -180238 -92902 235465 67930 120269 -150124 -166669 -247032 42737 11768 -34622 89123
15201c4545A97724J26751B9815L39143E0812a29465A52176a83864I66Q2130L20607
$$ -34545 197724 324475 29815 368958 50812 -129465 152176 -183864 966 83096 403703
15190D03703e2922A982K82601A29389O443J89527a27920A79648A0295K68837A02662
$$ 403703 -52922 1982 284583 129389 135832 325359 -127920 179648 10295 279132 102662
15178A21922K17214d843j98856g4939l3090A02871k8938R1725i0504A47907e1263
$$ 121922 339136 -4843 -203699 -74939 -108029 102871 73933 165658 -90504 147907 -51263
15166B2927J41347j7636J50933A21306J21817A2000a82987A03363a42621A98745
$$ 22927 164274 146638 297571 121306 243123 12000 -182987 103363 -142621 198745
15155A25048n8383b43233B79039a2508B01699b9444l7798A72421M983D4563J62372
$$ 125048 66665 -243233 279039 -12508 201699 -29444 -67242 172421 177404 44563 206935
15144B06935a79784B47154j12166o6549L6382J12640C0591K96993A06761g2809
$$ 206935 -179784 247154 134988 68439 104821 217461 30591 327584 106761 -72809
15133f8115E1455j9909K7452i9060A83758i8260D8575J69328a40996A63682E0673
$$ -68115 51455 31546 58998 -99060 183758 -98260 48575 217903 -140996 163682 50673
15121B85866j05909p5788R7391k3777a22256A66433N5361j9246N8204B1897K51096
$$ 285866 179957 104169 201560 177783 -122256 166433 221794 202548 260752 21897 272993
15110B72993D4906b87656d9574H4671k5392J76936A12018b23556A12441P7489
$$ 272993 44906 -287656 -49574 84671 59279 236215 112018 -223556 112441 189930
15100A89930p1376e9070A37675a09731j01225a6248I0932J41003F7089A8872M34432
$$ 189930 118554 -59070 137675 -109731 -210956 -16248 90932 231935 67089 18872 453304
15089D53304b06690g5094I6940Q5011O8607L7476A25105J51334o4027o2761J52631
$$ 453304 -206690 -75094 96940 181951 250558 288034 125105 276439 212412 149651 302282
15078C02282K3509A52133o9759J36658I4479b13385D375N07447j66153h4593A80527
$$ 302282 325791 152133 82374 219032 94479 -213385 4375 511822 345669 -84593 180527
15066F3966F39M45629l4765j7000J47987k20041j23268m0992N4921e8440B61466
$$ 63966 639 446268 411503 394503 542490 322449 199181 158189 213110 -58440 261466
15054A06637O648B177K57207I3754l6993L25796E9805J60529n6611k287a43349
$$ 106637 113285 2177 259384 93754 56761 382557 59805 220334 163723 161436 -143349
15042A5403a92060b8913l4223G2626J46056J2000F4788J4483Q7376L45478j33944
$$ 15403 -192060 -28913 -63136 72626 218682 230682 64788 79271 166647 512125 378181
15031C78181o4482P0245q9029A43995L8341G6471J58062H3083J44819D4145J14453
$$ 378181 313699 383944 294915 143995 182336 76471 234533 83083 227902 44145 158598
15020A58598k976b56102B66015j00304b0010k1088A75415a26832C24458o8437
$$ 158598 155622 -256102 266015 165711 -20010 -41098 175415 -126832 324458 256021
15010B56021L26383B22598j6055J3584G3820a41720A66822l8643J06182A7493
$$ 256021 582404 222598 206543 220127 73820 -141720 166822 128179 234361 17493
14999B50785A1060K19250a67611p5940C40260l4088j8200A11671K90653A76471
$$ 250785 11060 230310 -167611 -243551 340260 306172 287972 111671 402324 176471
14988D5238J89008i3500B48925J29820j49234f883B73382A21366P5469L01353
$$ 45238 234246 -93500 248925 378745 229511 -6883 273382 121366 196835 498188
14978D98188k16633L25578A13119M5408N9914K2068K46214j36549h4391j71378
$$ 498188 281555 607133 113119 158527 218441 240509 486723 350174 -84391 -255769
14968b55769A79242J49018A1592J63550J77637j58892K6701A07601J17159K65617
$$ -255769 179242 328260 11592 175142 352779 193887 220588 107601 224760 490377
14958D90377A69000h6089E26838c2355B14868n0035A7539L20146P5796A13262
$$ 490377 169000 -86089 526838 -32355 214868 164833 17539 337685 413481 113262
14947B43113R0728A44752M49772d7459C50413L88334A67162L64524A13855n1808
$$ 243113 333841 144752 594524 -47459 350413 738747 167162 531686 113855 62047
14937F2047L83432j91061L0257K06205F0916K44791C314O38238A9940J32548K62906
$$ 62047 445479 254418 284675 490880 60916 305707 3314 641552 19940 152488 415394
14926D15394j33681d982r1640A00140J81008q741O1585r2783O7297q3784J12190
$$ 415394 281713 -4982 -96622 100140 281148 272407 333992 241209 308506 224722 336912
14915C36912j22528K273m92L41564H1294L64632K3837n1280q3934J49948D6861
$$ 336912 214384 216657 216165 557729 81294 445926 469763 418483 334549 484497 46861
14903G00267A50126J55199f8954B84661m7629m3358o7782O5828K37630I0463M14414
$$ 700267 150126 305325 -68954 284661 237032 193674 125892 191720 429350 90463 504877
14892E04877j09356R7033D7691P3697K93073k00783o3248J11534L379r5843K99343
$$ 504877 395521 492554 47691 121388 414461 213678 150430 261964 265343 169500 468843
14881D68843P2147G2782M44940j36513l3181m4885J42094A95578J48154K7177
$$ 468843 540990 72782 517722 381209 348028 303143 445237 195578 343732 370909
14871C70909Q5070k2541p1580A28242K34557o6752A32512J34939L3923J12686
$$ 370909 455979 433438 361858 128242 362799 296047 132512 267451 301374 414060
14861D14060n7495K46395M3918k22840j89245K28196j57226J698O23554C01058
$$ 414060 356565 602960 646878 424038 234793 462989 305763 307461 931015 301058
14850E42023j18608K776A55550a81975C29495J21873p4436L27624C37098Q5640
$$ 542023 423415 426191 155550 -181975 329495 451368 376932 704556 337098 422738
14840D22738j92289A07336M53406C1145K52000L9235K22250j71751j16267M5113
$$ 422738 230449 107336 560742 31145 283145 322380 544630 372879 256612 301725
14830C01725K15333k42951J83707J27161j00118r595K12855k89819N3261B09965
$$ 301725 517058 274107 457814 584975 484857 475262 688117 398298 451559 209965
14819C94456j93055J22599N0760K76693j02004k24073j51747M40303k53768K90
$$ 394456 201401 324000 374760 651453 549449 325376 173629 613932 360164 360454
14809C60454l1511J71581q0243Q8810B41634L31514B77192L50292l683j43595
$$ 360454 328943 500524 420281 509091 241634 573148 277192 627484 623801 480206
14799D80206K1449J71693k56766k2119K52856l06850J45238J71648j95780O7414
$$ 480206 501655 673348 416582 394463 647319 340469 485707 657355 461575 528989
14789E28989K59345L683l67142K29021B44290J95528J02776j23860R2748k07956
$$ 528989 788334 792017 424875 653896 244290 439818 542594 418734 511482 303526
14779C03526N3302J94333K91217l96116J71669J54136r5099C22469L22349k22897
$$ 303526 356828 551161 842378 446262 617931 772067 676968 322469 644818 421921
14769D21921J35249M9133j62508L75055j13912j3127K3306k87602J50526j86820
$$ 421921 557170 606303 443795 818850 704938 691811 715117 427515 578041 391221
14759C91221L23144o0241k30723L15382q4212B93608J4508N71832r7371l4738
$$ 391221 714365 654124 423401 738783 654571 293608 308116 879948 782577 747839
14749G47839j19413j57944J40407J68388C65323J87107j55246J22793j55944j61830
$$ 747839 628426 470482 610889 779277 365323 552430 397184 519977 364033 202203
14739B02203N52028l72505J79015R5839k84949J98115K05253o2047J55972m33211
$$ 202203 754231 381726 560741 656580 371631 569746 774999 712952 868924 435713
14729D35713Q0401j81726K62277J4424J33330K4599l23995Q3313L20008k52826
$$ 435713 516114 334388 596665 611089 744419 769018 445023 528336 848344 595518
14719E95518L34666J00296l12527k0188r548r7975J83306L8089O7586m18017J78812
$$ 595518 930184 1030480 717953 697765 688217 590242 773548 811637 879223 461206 640018
14708F40018q578N9934R1464P989M951M0971J50962k06973j18400J8621L41650
$$ 640018 631440 691374 782838 790827 795778 836749 987711 780738 662338 680959 1022609
14697A022609l51207J95905L7430j91105J24318p63R3645L34395l13196m10339
$$ 1022609 671402 867307 904737 713632 837950 837187 930832 1265227 952031 541692
14687E41692L34923k7578Q2069l18018K03383K74758j46996p7220K19722l77058
$$ 541692 876615 849037 931106 613088 816471 1091229 944233 867013 1086735 709677
14677G09677L77618k04665J1409L23165m59287M24797m49370K10804K16029k04022
$$ 709677 1087295 882630 894039 1217204 757917 1182714 733344 944148 1160177 956155
14667I56155J2260K70769k52793Q8360k24807K98401J8666k19135J1993L59882
$$ 956155 968415 1239184 986391 1074751 849944 1148345 1167011 947876 959869 1319751
14657A319751r4511k75409J75143J20421j44778m6762j7147K84820N0104l59164
$$ 1319751 1225240 949831 1124974 1245395 1100617 1053855 1036708 1321528 1371632 1012468
14647A012468l99035M65941m4021R4990J29313j25909p2440M4954K32198p9525
$$ 1012468 613433 1079374 1035353 1130343 1259656 1133747 1061307 1106261 1338459 1258934
14637A258934r5229M0831j01082K84253k56115m1114L41448l39134M8891J16504
$$ 1258934 1163705 1204536 1103454 1387707 1131592 1090478 1431926 1092792 1141683 1258187
14627A258187J53984m1044k25307J02795K99389m60538L81007j623l84635M69905
$$ 1258187 1412171 1371127 1145820 1248615 1548004 1087466 1468473 1466850 1082215 1552120
14617A552120O0537r7459k21160n7933J70977j06787J96368l65675k1780M94853
$$ 1552120 1612657 1515198 1294038 1236105 1407082 1300295 1496663 1130988 1109208 1604061
14607A604061j17778J71135j26886m0030k1189O5119l087R0404P5587n5942o6787
$$ 1604061 1486283 1657418 1530532 1490502 1469313 1534432 1531345 1621749 1697336 1641394 1574607
14596A574607k4570J39591J35253j21289j53040Q5612p2824K79515K5594m8145
$$ 1574607 1550037 1689628 1824881 1703592 1550552 1636164 1563340 1842855 1868449 1820304
14586A820304R0160N8565k08744J16251J35682l1522P9291k0041k70530P1472
$$ 1820304 1910464 1969029 1760285 1876536 2012218 1980696 2059987 2039946 1769416 1840888
14576A840888N50028m86123J57750Q0624k64716K23718m3741Q5889p5554K48023
$$ 1840888 2390916 1904793 2062543 2143167 1878451 2102169 2058428 2144317 2068763 2316786
14566B316786k3543K31773j52134j84833J27258n7314N17071J339P3303J4043
$$ 2316786 2293243 2525016 2372882 2188049 2315307 2257993 2775064 2776403 2849706 2863749
14556B863749L41645P2124J63510J83241O08308P29159J056536K455614N925298
$$ 2863749 3205394 3277518 3441028 3624269 4232577 4961736 6018272 8473886 14399184
14547A4399184R381044J2180656j055914j3681306j0412411n264839k421380r53738
$$ 14399184 23780228 35960884 34904970 21223664 10811253 5546414 3125034 2171296
14539B171296l41628l86346N9323P4402L72756j4125J20315j34708l0753j96355
$$ 2171296 1829668 1443322 1502645 1577047 1949803 1935678 2055993 1921285 1890532 1694177
14529A694177M25838J93947j5395k44929P2489K3282M01930k60248r0896M37961
$$ 1694177 2120015 2313962 2298567 2053638 2126127 2149409 2551339 2291091 2200195 2638156
14519B638156j46584M2993p0772k6726l58565N6105L36263M26612l32466k68192
$$ 2638156 2491572 2534565 2463793 2437067 2078502 2134607 2470870 2897482 2565016 2296824
14509B296824K46718K89371j41067K13772k19344m1794K12600j18688M52927l20600
$$ 2296824 2543542 2832913 2691846 2905618 2686274 2644480 2857080 2738392 3191319 2870719
14499B870719K23814k85032o9060K62781J89588k45893O62440n81821J71776j7527
$$ 2870719 3094533 2809501 2740441 3003222 3192810 2946917 3609357 3027536 3199312 3181785
14489C181785N624L21687k73942M18437k08821j3694K5838O9954J312K46331o56706
$$ 3181785 3187409 3509096 3235154 3653591 3444770 3431076 3456914 3526868 3528180 3774511 3117805
14478C117805K77232J52639P30296m51722J11664K26074o09622J45937M95421
$$ 3117805 3395037 3547676 4277972 3826250 3937914 4163988 3554366 3700303 4195724
14469D195724p4133j38526K70080K79001j33392J92954M1704k64446j88844M77931
$$ 4195724 4121591 3983065 4253145 4532146 4398754 4591708 4633412 4368966 4180122 4658053
14459D658053o9288J47015j47754K57718N9034R7047j1645J56366O9548N1135
$$ 4658053 4588765 4735780 4588026 4845744 4904778 5001825 4990180 5146546 5216094 5267229
14449E267229j46142M65668l5844l2158l6242j5057L08737P1226j29088O1749
$$ 5267229 5121087 5586755 5550911 5518753 5482511 5467454 5776191 5847417 5718329 5780078
14439E780078M23595m3303l11739L88628j49o6834K24192L52570l42196L98802
$$ 5780078 6203673 6160370 5848631 6237259 6237110 6170276 6394468 6747038 6404842 6803644
14429F803644k94513J56897K55802Q670J96086j51859M78593p0138N2693j16669
$$ 6803644 6509131 6666028 6921830 6930500 7126586 6974727 7453320 7383182 7435875 7319206
14419G319206N37976j00824L96144j60429L0998J04658L32056L51274J01752j91944
$$ 7319206 7857182 7756358 8152502 7992073 8023071 8127729 8459785 8811059 8912811 8720867
14409H720867K32355N5658K05853M8028M00897j25345J89541L86912j28547N25786
$$ 8720867 8953222 9008880 9214733 9262761 9663658 9538313 9727854 10114766 9986219 10512005
14399A0512005P1376J66901J17028L90408m7605K30806J2836K34327K27510J61262
$$ 10512005 10583381 10750282 10867310 11257718 11210113 11440919 11453755 11688082 11915592 12076854
14389A2076854O5742J25899O66728J68746K67665R7907M69241m5879K48828L59327
$$ 12076854 12142596 12268495 12935223 13103969 13371634 13469541 13938782 13892903 14141731 14501058
14379A4501058J93880L02111J48888L36210L23425J92795K23889O68351K41432
$$ 14501058 14694938 14997049 15145937 15482147 15805572 15998367 16222256 16890607 17132039
14370A7132039J09728M12001N15185J91178L47398N88831N27156o5971L86403
$$ 17132039 17241767 17653768 18168953 18360131 18707529 19296360 19823516 19757545 20143948
14361B0143948P81438K01180Q83288N99277M22605L35134P96011J96039Q42354
$$ 20143948 20925386 21126566 22009854 22609131 23031736 23366870 24162881 24358920 25201274
14352B5201274M06018R10592M75998Q16414L78051R02393P42944J020424L39352
$$ 25201274 25607292 26517884 26993882 27810296 28188347 29090740 29833684 30854108 31193460
14343C1193460R01946R72788R67826P43932J053594J432897Q62321R55213J410230
$$ 31193460 32095406 33068194 34036020 34779952 35833546 37266443 38128764 39083977 40494207
14334D0494207J062983J356334J402928J161302J842540J208657J859119J459629
$$ 40494207 41557190 42913524 44316452 45477754 47320294 48528951 50388070 51847699
14326E1847699J801603J861241J613102J977392K184140K548416J974343K308908
$$ 51847699 53649302 55510543 57123645 59101037 61285177 63833593 65807936 68116844
14318F8116844K712490K403647L065172K624183L285014L041866L466967L915483
$$ 68116844 70829334 73232981 76298153 78922336 82207350 85249216 88716183 92631666
14310I2631666M049059L718534M886849M220757M712333N519540N064337N513604
$$ 92631666 96680725 100399259 105286108 109506865 114219198 119738738 124803075 130316679
14302A30316679O371969O365334O865278P235470P620952Q117885Q795588Q826711
$$ 130316679 136688648 143053982 149919260 157154730 164775682 172893567 181689155 190515866
14294A90515866R716307J0026750J0369345J1311111J1690066J2153274J2966734
$$ 190515866 200232173 210258923 220628268 231939379 243629445 255782719 268749453
14287B68749453J3243630J3551385J4002353J4245095J4344913J4348537J4243561
$$ 268749453 281993083 295544468 309546821 323791916 338136829 352485366 366728927
14280C66728927J4221289J3701457J2836008J2120133J1094328R244477P132739
$$ 366728927 380950216 394651673 407487681 419607814 430702142 439946619 447079358
14273D47079358J835067k950145l347702k478817j527293j61685l971983n396504
$$ 447079358 448914425 445964280 442616578 440137761 438610468 438448783 434476800 429080296
14265D29080296r455832j3028620j4357843j5419685j5799197j5706091j5718502
$$ 429080296 419624464 406595844 392238001 376818316 361019119 345313028 329594526
14258C29594526j5780976j5209239j4957115j4224658j2924250j2361465j2253804
$$ 329594526 313813550 298604311 283647196 269422538 256498288 244136823 231883019
14251B31883019j1986933j1136907j0630283r794730r615903q755847q079103
$$ 231883019 219896086 208759179 198128896 188334166 178718263 169962416 161883313
14244A61883313p661536p062855p136607o330795o301722n734479n072806n224262
$$ 161883313 154221777 147158922 140022315 133691520 127389798 121655319 116582513 111358251
14236A11358251m789945m456631m376145m099791l551702l273916l729098l097352
$$ 111358251 106568306 102111675 97735530 93635739 90084037 86810121 83081023 79983671
14228G9983671k998900l371592k346792k913190k569410k108239k155797j928404
$$ 79983671 76984771 73613179 71266387 68353197 65783787 63675548 61519751 59591347
14220E9591347k470354j471050k035971j705128j580726j757890j078425j484023
$$ 59591347 57120993 55649943 53613972 51908844 50328118 48570228 47491803 46007780
14212D6007780j649381j360019j491025n04076j357868r48667p46437j693247
$$ 46007780 44358399 42998380 41507355 41003279 39645411 38696744 37950307 36257060
14204C6257060j159996n32988p74777p30650q72949r10751j195088m24404r63009
$$ 36257060 35097064 34564076 33789299 33058649 32185700 31274949 30079861 29655457 28692448
14195B8692448n87124m30044q30881q02768k89510r75179o62025l77582l26356
$$ 28692448 28105324 27675280 26844399 26041631 25752121 24776942 24114917 23737335 23410979
14186B3410979o51383o39260l89542n93926m94919m16211l71727l49545m09794
$$ 23410979 22759596 22120336 21730794 21136868 20641949 20225738 19854011 19504466 19094672
14177A9094672l61612o07161n32091p0083l66697l60277J3885q02654J32903l21239
$$ 19094672 18733060 18125899 17593808 17523725 17157028 16796751 16810636 16007982 16140885 15819646
14167A5819646n96304m9618o46112j40510l16741k44419k81527k59154j85202
$$ 15819646 15223342 15173724 14527612 14387102 14070361 13825942 13544415 13285261 13100059
14158A3100059m78055k57497J57814l14358L2494k60789j57333m32771j66174
$$ 13100059 12622004 12364507 12522321 12207963 12240457 11979668 11822335 11389564 11223390
14149A1223390n2240l98854j91686o3154o5150l28918j7755r627l47020l45912
$$ 11223390 11171150 10772296 10580610 10517456 10452306 10123388 10105633 10096006 9748986 9403074
14139I403074M24244m04441j23593q8031p9515k80313j65134k77820N8654p7614
$$ 9403074 9827318 9422877 9299284 9211253 9131738 8851425 8686291 8408471 8467125 8389511
14129H389511j88999L22775p02952N22103k37878m47222j2351j23999k33673L17668
$$ 8389511 8200512 8523287 7820335 8342438 8104560 7657338 7644987 7520988 7287315 7604983
14119G604983k53832r5319k13972j49723L20611l95599m2309l5461r1740k29211
$$ 7604983 7351151 7255832 7041860 6892137 7212748 6817149 6774840 6739379 6647639 6418428
14109F418428N0736j78347K23729n58381J68467k34168J80678k14648l26606L22054
$$ 6418428 6469164 6290817 6514546 5956165 6124632 5890464 6071142 5856494 5529888 5851942
14099E851942k45436L97603l96267R6141k84325r1175l42j54302k79800M27234
$$ 5851942 5606506 6004109 5607842 5703983 5419658 5328483 5328141 5173839 4894039 5321273
14089E321273l09920o4854O1464r0149j54997j97140K67694L15973l64879j28166
$$ 5321273 5011353 4946499 5007963 4917814 4762817 4565677 4833371 5149344 4784465 4656299
14079D656299k04537p8554J52716K3693k10306k88854J82696j5553k74911K47810
$$ 4656299 4451762 4373208 4525924 4549617 4339311 4050457 4233153 4217600 3942689 4190499
14069D190499j64479K26252j12139j40083l52641K75388k91492K27955l8071r1402
$$ 4190499 4026020 4252272 4140133 4000050 3647409 3922797 3631305 3859260 3821189 3729787
14059C729787m642Q6831J20264l49762J11985j47103Q976k80604R3439K55588
$$ 3729787 3725145 3811976 3932240 3582478 3694463 3547360 3556336 3275732 3369171 3624759
14049C624759j17994M0168n40955K75673n4832R7608L0161j7354m93680O23038
$$ 3624759 3506765 3546933 3005978 3281651 3226819 3324427 3354588 3337234 2843554 3466592
14039C466592l07299K03308o32820L20620k29711M36219l01744K49353k86762
$$ 3466592 3159293 3362601 2729781 3050401 2820690 3256909 2955165 3204518 2917756
14030B917756j44621K83380j94481K76984j40774k54935l1226K01172j9029n68249
$$ 2917756 2773135 3056515 2862034 3139018 2998244 2743309 2712083 2913255 2894226 2325977
14020B325977L81339j79962K02231J38383m17129J27995j5576j06876l78432K25292
$$ 2325977 2707316 2527354 2729585 2867968 2450839 2578834 2563258 2456382 2077950 2303242
14010B303242j09143Q9406q9269o3502O5206j00801K14273l26438J34344l15550
$$ 2303242 2194099 2283505 2194236 2130734 2195940 2095139 2309412 1982974 2117318 1801768
14000A801768L85213j42047j11918J21376O7223m9660J60432P4998J17414J60373
$$ 1801768 2186981 2044934 1933016 2054392 2121615 2071955 2232387 2307385 2424799 2585172
13990B585172M84830J287189M749345Q461240J4062553M461483j0966422j1942488
$$ 2585172 3070002 4357191 9106536 17567776 31630329 36091812 25125390 13182902
13982A3182902n465155k723001p38049n32583k70057n68095O970m8006j93150
$$ 13182902 7717747 4994746 4256697 3724114 3454057 2885962 2892932 2844926 2651776
13973B651776J41466l7540l10377k27259J11877K95242n47497L3442J35234j98346
$$ 2651776 2793242 2755702 2445325 2218066 2329943 2625185 2077688 2111130 2246364 2048018
13963B048018K73821k17338M8924j28797K1884k12221J44694m74209K62111J65957
$$ 2048018 2321839 2104501 2153425 2024628 2046512 1834291 1978985 1504776 1766887 1932844
13953A932844l80192O91287m90115K13220l52185J29976K02041k92258L85635
$$ 1932844 1552652 2243939 1753824 1967044 1614859 1744835 1946876 1654618 2040253
13944B040253k73278q1828J18449r5122j07730k5455L18248k55464j64047L10936
$$ 2040253 1766975 1685147 1803596 1708474 1600744 1575289 1893537 1638073 1474026 1784962
13934A784962l9849k13290K44290k05027J87682l25645k3286L02459j89072Q2277
$$ 1784962 1745113 1531823 1776113 1571086 1758768 1433123 1409837 1712296 1523224 1605501
13924A605501j28367k18080J97033j86704L0676N90206m56266k34431K63264j81880
$$ 1605501 1477134 1259054 1456087 1269383 1300059 1890265 1433999 1199568 1462832 1280952
13914A280952K08446K10495j55987J8604k90829M10206k52603r6457k31258J21374
$$ 1280952 1489398 1699893 1543906 1562510 1271681 1681887 1429284 1332827 1101569 1222943
13904A222943J33864j24119J01772k46352J02578K61253m73310k2675K16900j92958
$$ 1222943 1356807 1232688 1334460 1088108 1190686 1451939 978629 955954 1172854 979896
13894I79896J99784q2528o3903K50137j86342L78321k29189j94530M06666m32759
$$ 979896 1179680 1097152 1033249 1283386 1097044 1475365 1246176 1051646 1458312 1025553
13884A025553m5280L23182l0028R478o8173O4874l59933K36641K16116k68904
$$ 1025553 980273 1303455 1273427 1282905 1214732 1279606 919673 1156314 1372430 1103526
13874A103526j61081L42916k71634J59367j92360q7738P2257j8452L067N075M14005
$$ 1103526 942445 1285361 1013727 1173094 980734 892996 965253 946801 949868 954943 1368948
13863A368948k76216k40708K24491l16060N1966L48050k5053r2785J809j18717
$$ 1368948 1092732 852024 1076515 760455 812421 1160471 1135418 1042633 1044442 925725
13853I25725J31640p7872n2909J51548J62537j67415m8372k79842J44194J63145
$$ 925725 1057365 979493 926584 1078132 1240669 1073254 1024882 745040 889234 1052379
13843A052379l10853K42619N62590p47914L26704j01669k92122Q0071M61638l97197
$$ 1052379 741526 984145 1546735 798821 1125525 1023856 731734 811805 1273443 876246
13833H76246m5902P7557O3199J79297m36683Q0733K14508P6075q6502l57863K91804
$$ 876246 830344 907901 971100 1150397 713714 794447 1008955 1085030 998528 640665 932469
13822I32469j94604J23381j05636j24330M11518m45313M29894j74351m0467M9090
$$ 932469 737865 861246 755610 631280 1042798 597485 1027379 853028 812561 861651
13812H61651P1087m66187J82725K42087j22485K06662q1965l92070O16676l59446
$$ 861651 932738 466551 649276 891363 768878 975540 893575 501505 1118181 758735
13802G58735K84644K08626n20580K19751j00356j12704L54011k9792j87076p1094
$$ 758735 1043379 1252005 731425 951176 850820 738116 1092127 1062335 875259 804165
13792H04165j38922J54463l65509J09475L481N9822K28440j53858J95897l22996
$$ 804165 665243 819706 454197 563672 567153 626975 855415 701557 897454 574458
13782E74458J78765J11408j99632O8314P4498A21629O82666k86337J90973K6845
$$ 574458 753223 864631 664999 733313 807811 121629 804295 517958 708931 735776
13772G35776K1173K4897k26682j03161K53922J75264k88691k3178l1544J05560
$$ 735776 756949 781846 555164 452003 705925 881189 592498 569320 537776 643336
13762F43336j19411j91616L78521n6644o3291J3338r1787J22593j2142l3497O7235
$$ 643336 523925 332309 710830 654186 590895 604233 512446 635039 622897 589400 656635
13751F56635k71671K75718J20389j86783k30432J85898k39544L43071L0866l2402
$$ 656635 384964 660682 781071 594288 363856 549754 310210 653281 684147 651745
13741F51745j47116K10479k02395m9085M05677C81018J29912L67901B47653J80576
$$ 651745 504629 715108 512713 463628 869305 381018 510930 878831 247653 428229
13731D28229J60494J72105j33955j2491k79050N11639l05457o1697k5211k8919
$$ 428229 588723 760828 626873 614382 335332 846971 541514 479817 454606 425687
13721D25687L21069j82713j34352J44171j20007K56397j77063n4882J10021L1282
$$ 425687 746756 564043 429691 573862 453855 710252 533189 478307 588328 619610
13711F19610M7931B82729L36188B84053J38418K36852k20852l329E5649O25944
$$ 619610 667541 282729 618917 284053 422471 659323 438471 435142 55649 681593
13701F81593A71205J51671J64076q4953j92954L09554j51393k1838M07526C12896
$$ 681593 171205 322876 486952 401999 209045 518599 367206 345368 752894 312896
13690E71899J72122j27642k60710J95218j28217J11466k18051j27829M59089j87185
$$ 571899 744021 616379 355669 550887 422670 534136 316085 188256 647345 460160
13680D60160p470k3621J14626j74293K81045j68381B09711Q2505K66075J1661
$$ 460160 452690 429069 543695 369402 650447 482066 209711 292216 558291 569952
13670E69952j93410n7616P8667J28914j10446K9487j80085J33140K53820k02206
$$ 569952 376542 318926 397593 526507 416061 445548 265463 398603 652423 450217
13660D50217B00492J7296J94643K70011k4411A15669J99957Q1888J19611j54315
$$ 450217 200492 217788 412431 682442 658031 115669 315626 397514 517125 362810
13650C62810k8567j50804K82720j95096J75970p7445o7006J83128A27767M100
$$ 362810 334243 183439 466159 271063 447033 369588 302582 485710 127767 131867
13640A31867K51240M0699j83497J58546j26617Q7658j25938g9038B57467R8515
$$ 131867 383107 423806 240309 398855 272238 359896 233958 -79038 257467 355982
13630C55982D9779L03555P6734J58014k37227K3577j21489A26153L89583q3484
$$ 355982 49779 353334 430068 588082 350855 374432 252943 126153 515736 432252
13620D32252j91934L64369A32142J9223L24911A89788N36261k63501B22844K09119
$$ 432252 240318 604687 132142 151365 476276 189788 726049 462548 222844 431963
13610D31963q6630A62027K58646o729K24567j53819m90M0147E2127K64351R0141
$$ 431963 345333 162027 420673 413944 638511 484692 484202 524349 52127 316478 406619
13599D06619r6082J46208m3824o1418J39572L23366k00970B38098J57194A15934
$$ 406619 310537 456745 412921 351503 491075 814441 613471 238098 395292 115934
13588A69618M86253J16776l31792r111K51963C08471K51792B73497j26682D6125
$$ 169618 655871 772647 440855 431744 683707 308471 560263 273497 146815 46125
13577C35193M5403J44304p0946n0852j04730P7315q4781K21407j43562A59567
$$ 335193 380596 524900 453954 403102 298372 375687 290906 512313 368751 159567
13566D57344q3048c4455D39682j842K6524M44J47860B97427j12554P6591J57040
$$ 457344 374296 -34455 439682 437840 464364 464808 612668 297427 184873 261464 418504
13555D18504B00020L9723J55966j38297P3703K1086a3753D03379r9679n9974M0041
$$ 418504 200020 239743 395709 257412 331115 352201 -13753 403379 303700 243726 283767
13544B83767M0990F4764L1414K55531j69394n7745n6403J53949o4932J63037A08651
$$ 283767 324757 64764 96178 351709 182315 124570 68167 222116 157184 320221 108651
13532D8920K54703K18554B25308D1306L01709j52441b7747A75724K4430k9237
$$ 48920 303623 522177 225308 41306 343015 190574 -27747 175724 200154 170917
13522A70917K13893M0012l5619A83072D0111J29212K04712J35262j90174j43861
$$ 170917 384810 424822 389203 183072 40111 169323 374035 509297 319123 175262
13512A75262K13714E7397L33796j52820J17988L2116P8470R6150A34302r827L75111
$$ 175262 388976 57397 391193 238373 356361 388477 466947 563097 134302 124475 499586
13501D99586A27008K28304D9599J88005R7063A26088L37499j28918J11761A35630
$$ 499586 127008 355312 49599 237604 334667 126088 463587 334669 446430 135630
13490A07068R4802k4270K95443k21381J73880B04841K93670j58085J08185j8655
$$ 107068 201870 177600 473043 251662 425542 204841 498511 340426 448611 429956
13480D29956j25198a6198C287M91953j25435j65459J69866j81748i8899E2217
$$ 429956 304758 -16198 3287 495240 369805 204346 374212 192464 -98899 52217
13469B85615O1775M2594b2767B64861F2785q76c6118B39584M03607A42980N8915
$$ 285615 347390 389984 -22767 264861 62785 61909 -36118 239584 643191 142980 201895
13458B01895m3453j414O9336j7431K814J5223J8723j16124n7495J88340E5928
$$ 201895 158442 157028 226364 208933 211747 226970 245693 129569 72074 260414 55928
13446A94326N4825J86025j53325I0485R2187Q9420Q4549H7329l1742L05242A0982
$$ 194326 249151 435176 281851 90485 182672 272092 356641 87329 55587 360829 10982
13434a3483C07508r3378H9306M40855A38391O8979l3623d7397A34995J46255j01534
$$ -13483 307508 214130 89306 530161 138391 207370 173747 -47397 134995 281250 179716
13423A79716b52760A65283K78494A29036P1812I682J65663J22781H808h2358C60317
$$ 179716 -252760 165283 443777 129036 200848 9682 175345 298126 8808 -82358 360317
13411C20556m0880H4382L02391j62265G861J25649E2296R0567D9365K24323M5903
$$ 320556 279676 84382 386773 224508 7861 133510 52296 142863 49365 273688 319591
13400C19591G4695A9935P1723L96275B17469r0838Q2254H3073a09717A08239C9049
$$ 319591 74695 19935 91658 487933 217469 126631 208885 83073 -109717 108239 39049
13388A13205K11056A54829b14981D31798A06272c2435G4822J28376B2000J10009
$$ 113205 324261 154829 -214981 431798 106272 -32435 74822 203198 22000 132009
13378A32009M06621B38622b53791E58313I3332J80677a28351C67477C0890K69851
$$ 132009 538630 238622 -253791 558313 93332 274009 -128351 367477 30890 300741
13368C00741r2309J53141j6167E4836J83065q0795K63307j01451a16767A22989
$$ 300741 208432 361573 345406 54836 237901 157106 420413 318962 -116767 122989
13357I8827L83692j88712j9231L8596m8023J66646j99586m0913M18028e0211C55474
$$ 98827 482519 293807 274576 313172 265149 431795 232209 191296 609324 -50211 355474
13345C44180K11907F6445K91547p5923D3704J60304Q7683l0885J59842L4262j58344
$$ 344180 556087 66445 357992 282069 43704 204008 291691 260806 420648 454910 296566
13334B96566c2352B93292i1353B73525J05592A619d5332B18797k883J51280A19554
$$ 296566 -32352 293292 -91353 273525 379117 1619 -45332 218797 215914 367194 119554
13322B88925J50797r3135L9319I8379J47320A14229n5576L22858j67334K59421
$$ 288925 439722 346587 385906 98379 245699 114229 58653 381511 214177 473598
13312D73598J53050B68297p3641A4817e7971F04239B18268j3702j1367o3548a72282
$$ 473598 626648 268297 194656 14817 -57971 604239 218268 204566 193199 129651 -172282
13300c4678A55475a02725B34243E5954a80838E006b1348B3566J97431p7233O0304
$$ -34678 155475 -102725 234243 55954 -180838 5006 -21348 23566 220997 143764 204068
13289B04068C0902J91530p2569b54722A63593G3042a88212A71525a20176B28991
$$ 204068 30902 222432 149863 -254722 163593 73042 -188212 171525 -120176 228991
13278D89488A80776l214c8177A48952j2991k3022a53217A22226m8946Q5065F1301
$$ 489488 180776 177562 -38177 148952 135961 112939 -153217 122226 73280 158345 61301
13266h553B12593j7400J77291n1786J08541D8789c1764B39640f1532o0272B7749
$$ -8553 212593 195193 372484 320698 429239 48789 -31764 239640 -61532 -121804 27749
13254C4965h0589B38951k4224a58090A89469F2078a06452B84026j35907A3488
$$ 34965 -80589 238951 214727 -158090 189469 62078 -106452 284026 148119 13488
13243B22922D0800K78926a9279r9423B6861K94353c0240A40086M9669F6770L47686
$$ 222922 40800 319726 -19279 -118702 26861 321214 -30240 140086 189755 66770 414456
13232D14456j30675e1370J874A55630B3270M72152A39499M525i546j20031A7531
$$ 414456 283781 -51370 -49496 155630 23270 495422 139499 144024 -9546 -129577 17531
13220A14394P7536A0828K76025a4017A06067a09742C04066j32489m3486a77979
$$ 114394 191930 10828 286853 -14017 106067 -109742 304066 171577 128091 -177979
13209A83422b2840E4494N7264f3158b0037B24514k4308n6844J24133p8866a17021
$$ 183422 -22840 54494 111758 -63158 -20037 224514 200206 143362 267495 188629 -117021
13197C51969a3831A1122a66694A17241a17342j36473A72678a23090A64593G2038
$$ 351969 -13831 11122 -166694 117241 -117342 -253815 172678 -123090 164593 72038
13186E6804J49210E3800L1609l3383K28513A18328h6270C17176o3866h0063B11801
$$ 56804 206014 53800 85409 52026 280539 118328 -86270 317176 253310 -80063 211801
13174e9378I3512N6031a6494D0701R6764A5327J38756a60818G5538a78160e567
$$ -59378 93512 149543 -16494 40701 137465 15327 154083 -160818 75538 -178160 -5567
13162a71278A55379E140J77038e0697A82390M581b6542C81297I9798O9865m3315
$$ -171278 155379 5140 182178 -50697 182390 186971 -26542 381297 99798 169663 126348
13151A26348J63478p8112I8196L8554K35811H6640e8073b0379D02699H8377O4274
$$ 126348 289826 211714 98196 136750 372561 86640 -58073 -20379 402699 88377 152651
13140A52651K68901A91331J07467A07618c113B73925g1553j67240e0264A54051
$$ 152651 421552 191331 298798 107618 -3113 273925 -71553 -238793 -50264 154051
13129H1806j3769N5947J18754a77268B402a8667B47197b5191I2996b13972I2162
$$ 81806 68037 123984 242738 -177268 2402 -18667 247197 -25191 92996 -213972 92162
13117C14030a35027N7465B19214C5858b0631B45300f4530F8817G631L57905N0455
$$ 314030 -135027 -77562 219214 35858 -20631 245300 -64530 68817 7631 365536 415991
13106D15991I9561k9192L21952l2408c1138B7267N3681c7706C45482H1564b47535
$$ 415991 99561 70369 392321 359913 -31138 27267 80948 -37706 345482 81564 -247535
13094a56234l8747F3525k9596K41945a29681J3184j55348F1786c09267B10072
$$ -156234 -194981 63525 33929 275874 -129681 -116497 -271845 61786 -309267 210072
13083a9516j7132A89587H0262c82269B52997E5303j9211b0687o1499I542b89640
$$ -19516 -36648 189587 80262 -382269 252997 55303 36092 -20687 -82186 9542 -289640
13071B03382n2988n2035Q8338c31367N4465A06566O0459J47034E2453e5983p2304
$$ 203382 150394 98359 186697 -331367 -276902 106566 167025 314059 52453 -55983 -128287
13060a28287D79151b28433C745e8092A17611m1359K1390A1205L09206a54893d8677
$$ -128287 479151 -228433 3745 -58092 117611 76252 97642 11205 320411 -154893 -48677
13048E6275J89972E2904g519j1518A34028m3584c9638A83118R6040a27423C98262
$$ 56275 246247 52904 -7519 -19037 134028 90444 -39638 183118 279158 -127423 398262
13036B04700H0228H791J98427c3496I9229k9154K69109r0037C3741L35650g9340
$$ 204700 80228 8791 207218 -33496 99229 70075 339184 249147 33741 369391 -79340
13024C26892A29987C0877K00517K09513A95457g6229A48243A072N6175b63641
$$ 326892 129987 30877 231394 440907 195457 -76229 148243 1072 57247 -263641
13013a4883l2148B72851b2064n5080C72095H7640J9140b53732D27620B00129J37982
$$ -14883 -47031 272851 -22064 -77144 372095 87640 106780 -253732 427620 200129 338111
13002C38111j14514a02232B30848d5901A85219G8189a45364r106B88056h8700
$$ 338111 223597 -102232 230848 -45901 185219 78189 -145364 -154470 288056 -88700
12991g9446H0178O7651c7569k715B94267D100a70567A33122a80829A29839a79419
$$ -79446 80178 147829 -37569 -40284 294267 4100 -170567 133122 -180829 129839 -179419
12979C53947a82895A29531d9320r3674l8969B09032c4973l6184q8216I5822f1035
$$ 353947 -182895 129531 -49320 -142994 -181963 209032 -34973 -71157 -159373 95822 -61035
12967C3628b02439c4338k74242J24857B7167g4662p8232B12780B9418Q3491b65665
$$ 33628 -202439 -34338 -308580 -183723 27167 -74662 -152894 212780 29418 112909 -265665
12955a2411k00489E0850k3597a73872D1659c34128A36946a30531e2701j91306
$$ -12411 -212900 50850 27253 -173872 41659 -334128 136946 -130531 -52701 -244007
12945b44007B05522a9784j55533Q5098A30053A7158K33167b08801M4687B64068
$$ -244007 205522 -19784 -175317 -90219 130053 17158 250325 -208801 -164114 264068
12934F6980a2044j18543G000c4294B78886B1119J16942J69074a64891j15531A43952
$$ 66980 -12044 -130587 7000 -34294 278886 21119 138061 307135 -164891 -280422 143952
12922a24172a554p3589G8992a67993B2760a20816p0045H3754N5116N9459m5151
$$ -124172 -1554 -75143 78992 -167993 22760 -120816 -190861 83754 138870 198329 153178
12911A53178a92079A36848C3654h4345A32477b24378h1270c4329k9104j24175
$$ 153178 -192079 136848 33654 -84345 132477 -224378 -81270 -34329 -63433 -187608
12901a87608N9231l72n0518F6662L1404A0331J62288e2734B10666h7731B77543
$$ -187608 -128377 -128749 -179267 66662 98066 10331 172619 -52734 210666 -87731 277543
12889a94798B74440i5080A9986J6197J78183a05573k35651a43819B97701J01310
$$ -194798 274440 -95080 19986 36183 214366 -105573 -341224 -143819 297701 399011
12879C99011b2927F1206J94684i7776j03431J7150B8538c6999J1425J1737j22035
$$ 399011 -22927 61206 255890 -97776 -201207 -184057 28538 -36999 -25574 -13837 -135872
12868a35872C15895m3058c3170j06525f3008K0243k10059J25951I6711a36384
$$ -135872 315895 272837 -33170 -139695 -63008 -42765 -252824 -126873 96711 -136384
12857c5964A29909K8c8582A1008a1215F8081J13970f6801D6511f9501C224Q9523
$$ -35964 129909 129937 -38582 11008 -11215 68081 182051 -66801 46511 -69501 3224 92747
12845I2747G611N5825g1163B8859J01148h6513O571j7036a9039A06441D8637J82797
$$ 92747 7611 63436 -71163 28859 130007 -86513 -79942 -96978 -19039 106441 48637 231434
12833B31434A1710g3250B17313a56229A79339h5890L9622A2739c21715E0659e8498
$$ 231434 11710 -73250 217313 -156229 179339 -85890 -46268 12739 -321715 50659 -58498
12821A61018C4764d7160C5094A882Q1885a88351A16677b04678a00809p5612k65060
$$ 161018 34764 -47160 35094 1882 83767 -188351 116677 -204678 -100809 -176421 -441481
12810d41481A8173L66603g3827j87463B45443A748h0061A38822A8042c40098h4817
$$ -441481 18173 384776 -73827 -261290 245443 1748 -80061 138822 18042 -340098 -84817
12798B61116p8793g2164n2684G5416b66846A69412a05317G2949e2035j93540A42243
$$ 261116 182323 -72164 -124848 75416 -266846 169412 -105317 72949 -52035 -245575 142243
12786a02320o4953I2742l6029R5231d25087C48571I3202a25501E07g384k3389
$$ -102320 -167273 92742 56713 151944 -425087 348571 93202 -125501 507 -7384 -30773
12775c0773C60815D3687i6462L6338A05547J20970F4473e6312J1329B44231A9067
$$ -30773 360815 43687 -96462 -60124 105547 226517 64473 -56312 -44983 244231 19067
12763C44654h1199K3279m2422A58712B4902O9458k250l1447f7287k2510c6617
$$ 344654 -81199 -57920 -100342 158712 24902 94360 92110 60663 -67287 -89797 -36617
12751c07472a47894A3548c6932A188P9696b3942G9423b53739j79234F8557O9158
$$ -307472 -147894 13548 -36932 1188 80884 -23942 79423 -253739 -432973 68557 137715
12740A37715a30806F201J58303n1771J67361B1780Q9985K00015q5050r3261d9555
$$ 137715 -130806 6201 164504 112733 280094 21780 111765 311780 226730 133469 -49555
12728d0665l1281A98835a50136A53991b0103F9473a9417A93536K8616G880a37793
$$ -40665 -71946 198835 -150136 153991 -20103 69473 -19417 193536 222152 7880 -137793
12716I7131R9052M493L8394J81646A86906J41344j58079K9514J1192J1115k2608
$$ 97131 196183 200676 239070 420716 186906 328250 170171 199685 210877 221992 199384
12705A99384O6439j321F8367J56370J20141j64383j1954b0280B2236R8440a04350
$$ 199384 265823 264502 68367 224737 344878 180495 168541 -20280 22236 120676 -104350
12693e2145k49020a13670B69204C5230d624A39365a74543A53042J2641l0838e8338
$$ -52145 -301165 -113670 269204 35230 -4624 139365 -174543 153042 165683 134845 -58338
12681B63397P275j23232C6009K68237F4912a9223C6454d709B43183P2859b6021
$$ 263397 270672 147440 36009 304246 64912 -19223 36454 -4709 243183 316042 -26021
12669B21907G5719R68b13711H4054A7982b1874A54246L0245k8131J03983K2752
$$ 221907 75719 76687 -213711 84054 17982 -21874 154246 184491 156360 260343 283095
12658B83095e8300G0810O1024A6275b72969J24318f4577p394C22255b9933j33125
$$ 283095 -58300 70810 131834 16275 -272969 -148651 -64577 -71971 322255 -29933 -163058
12647a63058j03040M8950E9159R5531Q7243J46728b78320D5764b0030B8937M40191
$$ -163058 -266098 -217148 59159 154690 241933 388661 -278320 45764 -20030 28937 469128
12636D69128a3633k34333A75787p2863P7269c166B77905O7005j07481K95470C4400
$$ 469128 -13633 -247966 175787 102924 180193 -3166 277905 344910 237429 532899 34400
12624E2087K52877F5953M46258A01891L3382r589P9936B5614J16771J35278A21957
$$ 52087 304964 65953 512211 101891 135273 125684 205620 25614 142385 277663 121957
12612A83814i7358B19249i169l2591H0294J89524a23095B82792a91404A30974
$$ 183814 -97358 219249 -9169 -41760 80294 269818 -123095 282792 -191404 130974
12601c46278D76500A84535d5716B22977A02780J57274n6868I2699L2680b72381
$$ -346278 476500 184535 -45716 222977 102780 260054 203186 92699 125379 -272381
12590A19512K97886p5165b09A31910c2840k8063j23495B51299K45637c67200b5765
$$ 119512 417398 342233 -209 131910 -32840 -60903 -184398 251299 496936 -367200 -25765
12578B1427a23399p9375A77241b27375O4219F5799a14131j2989F3146g2357o0715
$$ 21427 -123399 -202774 177241 -227375 -163156 65799 -114131 -127120 63146 -72357 -133072
12567a33072A25291E653N5373a16667B41697f9035A18393N5705i0522A74171K92834
$$ -133072 125291 5653 61026 -116667 241697 -69035 118393 174098 -90522 174171 467005
12556D67005g858D35597j8937b93661a0281A90957A4486M12838A8166n337D221
$$ 467005 -7858 435597 416660 -293661 -10281 190957 14486 427324 18166 12829 4221
12544E8665e8417A94579r4357a64770A93997D991J55001J4629F4828c0660n1637
$$ 58665 -58417 194579 100222 -164770 193997 4991 159992 174621 64828 -30660 -82297
12533h2297A42274G005J63277G6565k9299J64463J6967b65642B67257E7729b63461
$$ -82297 142274 7005 170282 76565 47266 211729 228696 -265642 267257 57729 -263461
12521a94212G7978a94832K8216M2434A85828a12812k078A16928h4649a7437E5421
$$ -194212 77978 -194832 -166616 -124182 185828 -112812 -114890 116928 -84649 -17437 55421
12509f7459C5095c45140A42574B3820K71681A2589K32819I0579O2607c9287l24900
$$ -67459 35095 -345140 142574 23820 295501 12589 245408 90579 153186 -39287 -364187
12498c64187A42753F1053N7688E8312J16863c3087A06252P6556c2504l7713c3695
$$ -364187 142753 61053 118741 58312 175175 -33087 106252 182808 -32504 -70217 -33695
12486C3746L00365c7806J2756A10915J66096F6826J41934b15413b3998D01537
$$ 33746 334111 -37806 -25050 110915 277011 66826 208760 -215413 -23998 401537
12475A95979D2757a66862L7675d0187r0947r6265D0298f9031C1852d4214B61971
$$ 195979 42757 -166862 -129187 -40187 -131134 -227399 40298 -69031 31852 -44214 261971
12463F460g3871i154l99099b7519B50515a9462l45133F8086n371d0422A22520
$$ 6460 -73871 -9154 -408253 -27519 250515 -19462 -364595 68086 62715 -40422 122520
12451A11980n779P8916a5617q9893p9396B84017h4595N751C57662A00623k9931
$$ 111980 106201 185117 -15617 -105510 -184906 284017 -84595 -78844 357662 100623 70692
12440G0692j7052B5872c1596n7072I5413a79851k40782a2701C3906c8172H4839
$$ 70692 53640 25872 -31596 -88668 95413 -179851 -420633 -12701 33906 -38172 84839
12428C272J56299g7466b3796A10750Q2398J9147c0031A07321Q3965a03793j43066
$$ 3272 159571 -77466 -23796 110750 193148 212295 -30031 107321 191286 -103793 -246859
12417b46859f5768B29336g6474C6809c25344c9682j8709l18504A32146b30463
$$ -246859 -65768 229336 -76474 36809 -325344 -39682 -58391 -376895 132146 -230463
12406b32313B44709J38323a82004I9587l2567L7315J0907f3308A62840j5340A6117
$$ -232313 244709 383032 -182004 99587 67020 104335 115242 -63308 162840 147500 16117
12394i6270A40879b73079A16858N0049A4130J3339N1997N1250B3326a22198D6405
$$ -96270 140879 -273079 116858 166907 14130 27469 79466 130716 23326 -122198 46405
12382A21846B7994L1436a94042i0340A42054b38048f8206G7885A1196a96184B08909
$$ 121846 27994 59430 -194042 -90340 142054 -238048 -68206 77885 11196 -196184 208909
12370f7125m8435L2187l29193K4544A88126D3974L8352J34891J33964n1228R8583
$$ -67125 -115560 -83373 -412566 -388022 188126 43974 82326 217217 351181 299953 398536
12359C98536h8538B31336b12611F1961h9095K5021B84295a44060q4731N7780B0016
$$ 398536 -88538 231336 -212611 61961 -89095 -64074 284295 -144060 -228791 -171011 20016
12347F1117a08059q0519f4367K9308m0431I950a19556A13634b03846C2402b1221
$$ 61117 -108059 -188578 -64367 -35059 -75490 9950 -119556 113634 -203846 32402 -21221
12335d80177A40578b6615j11263C46282A3489a66266f299k878j84268R4599A99428
$$ -480177 140578 -26615 -137878 346282 13489 -166266 -6299 -9177 -193445 -98846 199428
12323B36100C3973Q2465j5379i0467j61987a19301L0928j87009A83180C5403K06942
$$ 236100 33973 116438 101059 -90467 -252454 -119301 -88373 -275382 183180 35403 242345
12312B42345f5436b7887C71453A075N4126L38296A82928a22304b1167E861a34230
$$ 242345 -65436 -27887 371453 1075 55201 393497 182928 -122304 -21167 5861 -134230
12300I0416M8503b08488c0514J3326A9862a75111C9431K79217a0326p3977j36431
$$ 90416 138919 -208488 -30514 -17188 19862 -175111 39431 318648 -10326 -84303 -220734
12289b20734G253b4257A24901n1518d5362A51636h1621A52261l4808b34814A64515
$$ -220734 7253 -24257 124901 73383 -45362 151636 -81621 152261 117453 -234814 164515
12277F8340L0476K9127L4919L47091b1101A90983P1314a16F0331K23189A0448
$$ 68340 98816 127943 162862 509953 -21101 190983 262297 -116 60331 283520 10448
12265C42764p6228A25846n3852M28687H0871a8379B20015A00357O3998i6946G7502
$$ 342764 266536 125846 71994 500681 80871 -18379 220015 100357 164355 -96946 77502
12253A46179d7301B65900b8948G6677j2353f3366C75434E4369g812k02612B47651
$$ 146179 -47301 265900 -28948 76677 64324 -63366 375434 54369 -7812 -210424 247651
12241a80567A55180L650C6245N7074K47198j61506O809J13003o6096d148j14758
$$ -180567 155180 158830 36245 93319 340517 179011 185820 298823 232727 -4148 -118906
12230a18906C88810a1352r9069B27811K26396A31503K5182J40634j15680a61392
$$ -118906 388810 -11352 -110421 227811 454207 131503 156685 297319 181639 -161392
12219C8970J5696M6615K82278j19253k8867D4526K3181R8762N1420K05589A16803
$$ 38970 54666 101281 383559 264306 235439 44526 67707 166469 217889 423478 116803
12207A40005J08183p8667O0746J98283H2877K73843j14443j12885K3081n9020
$$ 140005 248188 169521 230267 428550 82877 356720 242277 129392 152473 93453
12197I3453B4257J4640J94817J93035l0911G3161L8185f3376C33527l4567C8631
$$ 93453 24257 38897 233714 426749 395838 73161 111346 -63376 333527 298960 38631
12185D05744A45004J72401A33698K2108b02604A41122a33114A1022E339J49359
$$ 405744 145004 317405 133698 155806 -202604 141122 -133114 11022 5339 154698
12175A54698J53751a75794B94471b9188C22357I5841J55587J74463I4000e7909
$$ 154698 308449 -175794 294471 -29188 322357 95841 251428 425891 94000 -57909
12164G9061R3864H4705b72475G0884A4730P0088K53483C3404A156b1468C00341
$$ 79061 172925 84705 -272475 70884 14730 84818 338301 33404 1156 -21468 300341
12152g3364G0888a30690j11718L5980B8541K07755O967h2860F4755J01074M8032
$$ -73364 70888 -130690 -242408 -206428 28541 236296 243263 -82860 64755 165829 213861
12141B13861j6659b44222E79900f223H7559Q9424g1790B65661j5284b0401j64180
$$ 213861 197202 -244222 579900 -6223 87559 176983 -71790 265661 250377 -20401 -184581
12130a84581A6772N7361f6195l0289j05476a00461D486g5538A3958f0899j5570
$$ -184581 16772 74133 -66195 -96484 -201960 -100461 4486 -75538 13958 -60899 -76469
12119g6469G9191K7699g2020l74l1988A52778h4785A67185m4089b20944A04146
$$ -76469 79191 106890 -72020 -72394 -104382 152778 -84785 167185 123096 -220944 104146
12107A96386a90926i3284D74169c2806A86899b66059P2806h2705B416J9490K05884
$$ 196386 -190926 -93284 474169 -32806 186899 -266059 -193253 -82705 2416 21906 227790
12096B27790a833j43416d0887D8790N3665L16987i6021k5192c5239a0189p6655
$$ 227790 -1833 -145249 -40887 48790 102455 419442 -96021 -121213 -35239 -10189 -86844
12085h6844A65962J1858h5037A46464D340Q9802O3142g0029q2614A36163b54994
$$ -86844 165962 177820 -85037 146464 4340 94142 157284 -70029 -152643 136163 -254994
12073F70678Q8608P01310k45151E66342I6753c993a225B6230K36315A21214M014
$$ 670678 759286 1460596 1215445 566342 96753 -3993 -1225 26230 262545 121214 125228
12062A25228C7247J68867a73737l12708F4955K48554a28185k9457E02806k07282
$$ 125228 37247 206114 -173737 -486445 64955 313509 -128185 -157642 502806 295524
12052B95524H7128f4428A30414b30698A90078H9341J3867k8897b34456A13612
$$ 295524 87128 -64428 130414 -230698 190078 89341 103208 74311 -234456 113612
12041A96957d7059A72357m129F6852b16665J4341n1595n5225A53966j8982a61975
$$ 196957 -47059 172357 168228 66852 -216665 -202324 -253919 -309144 153966 134984 -161975
12029B997a85993r8412g5835A23012a11987j5269L7563c4448E9257d9640C6975
$$ 2997 -185993 -284405 -75835 123012 -111987 -127256 -89693 -34448 59257 -49640 36975
12017E5158R5180c9511k1611m0534j94093B28496h3852C50706G6772b44977B32362
$$ 55158 150338 -39511 -61122 -101656 -295749 228496 -83852 350706 76772 -244977 232362
12005i0770A92666g1317I8007b56176h5337j28117Q8260A30183d1246n2760j90509
$$ -90770 192666 -71317 98007 -256176 -85337 -213454 -125194 130183 -41246 -94006 -284515
11994b84515k9820A84560g9891n1992E8655R959a96915q0209d7397J0427j23089
$$ -284515 -314335 184560 -79891 -131883 58655 68614 -196915 -277124 -47397 -36970 -160059
11983a60059K3680A59665j2792n9665J24728G3096b9310k01899C07428H8559e3984
$$ -160059 -136379 159665 146873 87208 211936 73096 -29310 -231209 307428 88559 -53984
11971h1018q0183M2960N044H3821a22018a1744n1329n8114H6839C3305f6000k23634
$$ -81018 -161201 -118241 -113197 83821 -122018 -11744 -63073 -121187 86839 33305 -66000 -289634
11959b89634A68320h848A65602b06291A18128a77030f4094F2302A1539L5369J18691
$$ -289634 168320 -8848 165602 -206291 118128 -177030 -64094 62302 11539 46908 165599
11948A65599b05304g2356j08385M1741j99053D6858f5200c0989F4919J21369g6888
$$ 165599 -205304 -72356 -180741 -139000 -338053 46858 -65200 -30989 64919 186288 -76888
11936b03330G7236M0574J01813I5601a69847A29393K079J23906a50867f5328n6306
$$ -203330 77236 117810 219623 95601 -169847 129393 131472 255378 -150867 -65328 -121634
11925a21634m4590k21538A90210a88848Q4477c9852H8576b60527A07646j4388
$$ -121634 -166224 -387762 190210 -188848 -104371 -39852 88576 -260527 107646 93258
11915I3258a11020c18F3070c70666E1115b05673B98525K3989a2166j87317h0828
$$ 93258 -111020 -318 63070 -370666 51115 -205673 298525 322514 -12166 -199483 -80828
11903a03613C68c6090B80606a66247l2787e0735A52626L1879b15411j5736d6734
$$ -103613 368 -36090 280606 -166247 -199034 -50735 152626 184505 -215411 -231147 -46734
11891A43396d5575J9028A26966N6370b78231F9835e8962j45447n8188B49517O5063
$$ 143396 -45575 -26547 126966 183336 -278231 69835 -58962 -204409 -262597 249517 314580
11880C14580a26934A68469a38866A7567a90046H7285a06045l8176P0196F3559
$$ 314580 -126934 168469 -138866 17567 -190046 87285 -106045 -144221 -74025 63559
11869c90549a65086k28891J23428A89112b10390R7998B7522c36364C07255a38274
$$ -390549 -165086 -393977 -270549 189112 -210390 -112392 27522 -336364 307255 -138274
11858c1239A14191b56282i2454j6332l97B19367c74358i2426B01038a90656Q5990
$$ -31239 114191 -256282 -92454 -108786 -109183 219367 -374358 -92426 201038 -190656 -104666
11847a04666H5491J2633a48212q7348b1940l36909A26922J7527b02848J7800B9664
$$ -104666 85491 98124 -148212 -235560 -21940 -358849 126922 144449 -202848 -185048 29664
11835B31278P5018f02j71229A43081a4310n7905j10984j5126j01132J41120D1261
$$ 231278 306296 -602 -171831 143081 -14310 -72215 -183199 -198325 -299457 -158337 41261
11823I4918M82J35339N929c37926c01k5091F1290J75365a02144C72790g6531A06461
$$ 94918 95400 230739 236668 -337926 -301 -25392 61290 236655 -102144 372790 -76531 106461
11810B73177a15149k6838J678d3196J3111j69444P4544J4687G4836c86565e7713
$$ 273177 -115149 -141987 -140309 -43196 -30085 -199529 -124985 -110298 74836 -386565 -57713
11798B70271a45879k20461e9315B26498h0042J9764B53915d6105B1489h6999G3343
$$ 270271 -145879 -366340 -59315 226498 -80042 -60278 253915 -46105 21489 -86999 73343
11786B70825b18245L1901A2206c25049a659F6139a39108A98141e4335B00162N8996
$$ 270825 -218245 -186344 12206 -325049 -1659 66139 -139108 198141 -54335 200162 259158
11775B59158b2664C58508b64627g4184j46533L142O1852O0429B5912a91096G4419
$$ 259158 -22664 358508 -264627 -74184 -220717 -217575 -155723 -95294 25912 -191096 74419
11763d9074q9629d4372A05009B9956a78035E3373N1257N0827B4888L7007c38308
$$ -49074 -138703 -44372 105009 29956 -178035 53373 104630 155457 24888 61895 -338308
11751c64135J62790A73082j3643o8040n202N758d0581l84058A091J96795J66157
$$ -364135 -201345 173082 159439 91399 86197 91955 -40581 -424639 1091 197886 364043
11740C64043h1970r1059B75297c0855A98078B1274b71135D33368a36406F674J21072
$$ 364043 -81970 -173029 275297 -30855 198078 21274 -271135 433368 -136406 6674 127746
11729A27746L084i0686C00184q1619a42566A85194b47036i1809E4971h0251K3144
$$ 127746 130830 -90686 300184 218565 -142566 185194 -247036 -91809 54971 -80251 -57107
11718e7107o0299I8699c278j13371L9904A13857a62502A75688p3782b16009e7627
$$ -57107 -117406 98699 -3278 -116649 -76745 113857 -162502 175688 101906 -216009 -57627
11706A90814G2545a35538j48266a2453D6532Q6310L161k6956L6501b5517D38127
$$ 190814 72545 -135538 -283804 -12453 46532 132842 136003 109047 145548 -25517 438127
11694A94160q7670d983l866A47287a61781B5962a50012B29134H881J50599b28924
$$ 194160 106490 -4983 -8849 147287 -161781 25962 -150012 229134 8881 159480 -228924
11682f4996n9257C11956H2300K7653J5903n8751J0929K24761n2918a88332A91041
$$ -64996 -124253 311956 82300 109953 125856 67105 78034 302795 249877 -188332 191041
11670A97603B3518J78075n1751J11931a57379b337D5475i197j71167m5535H5913
$$ 197603 23518 201593 149842 261773 -157379 -2337 45475 -9197 -180364 -225899 85913
11658d7829r9895G7724a54670B21419h1568H9843Q2052J61198A15506a06603k83952
$$ -47829 -147724 77724 -154670 221419 -81568 89843 171895 333093 115506 -106603 -390555
11647c90555G0228e939j25378C7050J12349R8874m6534b9357A8710m39J80999
$$ -390555 70228 -5939 -131317 37050 149399 248273 201739 -29357 18710 18271 199270
11636A99270H9987R0437q3455k6285K17866A2367P9616a10490I862N685a93790
$$ 199270 89987 180424 96969 70684 288550 12367 91983 -110490 9862 15547 -193790
11624A67730Q4259k8827q0824d7049D0926a53561l7584j4437A7302e9208A9455
$$ 167730 251989 223162 142338 -47049 40926 -153561 -191145 -205582 17302 -59208 19455
11612b24638a7240A26137a61789j77238B14912e7775K7357D7882F602c3835j34141
$$ -224638 -17240 126137 -161789 -339027 214912 -57775 -30418 47882 6602 -33835 -167976
11601a67976C09387D2519O9932D2541f2122A52428D4520d1581G9242c12639B29103
$$ -167976 309387 42519 112451 42541 -62122 152428 44520 -41581 79242 -312639 229103
11589A75224B9771d4724o1337C33560a01607B93864l9700l4348o2850G1790l5601
$$ 175224 29771 -44724 -106061 333560 -101607 293864 254164 219816 156966 71790 36189
11578C6189i6842A59322J55232A12024K97304h75F5792d3170K115A83746l1179
$$ 36189 -96842 159322 314554 112024 409328 -875 65792 -43170 -41055 183746 152567
11567A52567K4458a71787A00722L73537G6377R6769l381O8380j05052J44806g6645
$$ 152567 177025 -171787 100722 474259 76377 173146 169765 238145 133093 277899 -76645
11555e8819B81183q3411b88186B6418K60408g9058G6625h8524Q267A81994b21284
$$ -58819 281183 197772 -288186 26418 286826 -79058 76625 -88524 -80257 181994 -221284
11543a04529d4113B1687b69814A08904B9012L452K24236a45285h161B44934H9469
$$ -104529 -44113 21687 -269814 108904 29012 32464 256700 -145285 -8161 244934 89469
11531F8408M03846f504B32667j9701G3177R0830J73365J1211A44614a05572D04461
$$ 68408 472254 -6504 232667 212966 73177 164007 337372 348583 144614 -105572 404461
11519e9857B06006E1804N812j9494c2320j5074j04368B4680R1075L63987j56372
$$ -59857 206006 51804 57616 38122 -32320 -47394 -151762 24680 115755 479742 323370
11508C23370J2936a60174A56120J84406f4343A89240J96432G9308K7770P2086
$$ 323370 336306 -160174 156120 340526 -64343 189240 385672 79308 107078 179164
11498A79164d9546B15865G1984a0051B15077a11187B11073l4434G6311J51447
$$ 179164 -49546 215865 71984 -10051 215077 -111187 211073 176639 76311 227758
11488B27758j1561a24416C22488F0066J71873f6969B30496M2639o3365D5596K62297
$$ 227758 216197 -124416 322488 60066 231939 -66969 230496 273135 209770 45596 307893
11477C07893p5925B5739K82601A19480m5678b1592q4336E71735c8098A87081j0668
$$ 307893 231968 25739 308340 119480 73802 -21592 -105928 571735 -38098 187081 176413
11466A76413d0492A31117K11585d8175D17634d4722B57150j15076M5679l9476
$$ 176413 -40492 131117 342702 -48175 417634 -44722 257150 142074 187753 148277
11456A48277j0925K78581b77068A37479o1350K59742a30004B13855a9498d258
$$ 148277 137352 415933 -277068 137479 76129 335871 -130004 213855 -19498 -4258
11445E0744J28232o3511J9738K24375K3381A53545n2851m1413P0445k0059A8020
$$ 50744 178976 115465 135203 359578 382959 153545 100694 59281 129726 109667 18020
11433I9052C2971a23355p170f0240p8069N5971I2524e8727l619A52684J22944
$$ 99052 32971 -123355 -130525 -60240 -138309 -82338 92524 -58727 -62346 152684 275628
11422B75628a26170o3706B65771a70490D3195K56445O697j36752f1112C3876L30795
$$ 275628 -126170 -189876 265771 -170490 43195 299640 306337 169585 -61112 33876 364671
11411C64671D8561a19661C67926j19654a75206A71527o3845a20841f802l17758
$$ 364671 48561 -119661 367926 248272 -175206 171527 107682 -120841 -6802 -324560
11401c24560a9434C6191j3068b8737H6244h7371C0024J26743o3633g0897R467
$$ -324560 -19434 36191 23123 -28737 86244 -87371 30024 156767 93134 -70897 -61430
11390f1430j76240A81922j5404o8868i3808C6116a07242n9176d3909A68639i120
$$ -61430 -237670 181922 166518 97650 -93808 36116 -107242 -166418 -43909 168639 -9120
11378B03095D6172b8888A54900h6878K9677B49611F3028e0760j04058D3663j3365
$$ 203095 46172 -28888 154900 -86878 -57201 249611 63028 -50760 -154818 43663 30298
11367C0298a6717j54363K9166A14637c02026H4156b37624D4669J27440B4754d3076
$$ 30298 -16717 -171080 -141914 114637 -302026 84156 -237624 44669 172109 24754 -43076
11355A71927G7597N2416a81532d3432j85428c1894A76249a20124D1267g1611B6823
$$ 171927 77597 130013 -181532 -43432 -228860 -31894 176249 -120124 41267 -71611 26823
11343B18570k8256J4830a12089B47067C7652f647G0M1074a27434B09005h1200
$$ 218570 190314 205144 -112089 247067 37652 -6647 70 41144 -127434 209005 -81200
11331B63587i6006j8336M6005B51472i2776n9128K6321B26908a89365h6843j79606
$$ 263587 -96006 -114342 -68337 251472 -92776 -151904 -125583 226908 -189365 -86843 -266449
11320b66449I313g3163A29919k0526D6245a71095N2C47074A7366J50451J52505
$$ -266449 9313 -73163 129919 109393 46245 -171095 -171043 347074 17366 167817 320322
11309C20322a16109j7615A88119i9833I2954l6482b18006a9994A26288N7291o8425
$$ 320322 -116109 -133724 188119 -99833 92954 56472 -218006 -19994 126288 183579 115154
11298A15154B5601b10262i6144D47302g3818A58647E2722M7641a67937c4429F467
$$ 115154 25601 -210262 -96144 447302 -73818 158647 52722 100363 -167937 -34429 6467
11286H6981b05348e4247A84325q6265B63h4898b343l1254j26174C1186a8354k14328
$$ 86981 -205348 -54247 184325 98060 263 -84898 -2343 -33597 -159771 31186 -18354 -232682
11274b32682r0406J56880A95779b75432a1911A67404d2630C27609a28394j5919
$$ -232682 -323088 -166208 195779 -275432 -11911 167404 -42630 327609 -128394 -144313
11264a44313N2118q2085d8197k31420g6608K1240C05398c37487P5183A618b04457
$$ -144313 -92195 -174280 -48197 -279617 -76608 -55368 305398 -337487 -262304 1618 -204457
11252a36538A64787o8376e7806A51882J09853a19436e2926j1365L0316B30365
$$ -136538 164787 96411 -57806 151882 261735 -119436 -52926 -64291 -33975 230365
11241a13860A0891J58454l8707a89109c5100I570B163a05692k73218a79600g4862
$$ -113860 10891 169345 130638 -189109 -35100 9570 2163 -105692 -378910 -179600 -74862
11229e6485I3560O8926C1181b09920A24332c67964E4329a87477r7789D226a71705
$$ -56485 93560 162486 31181 -209920 124332 -367964 54329 -187477 -285266 4226 -171705
11217A73711a79840O4995D19921k00262C420Q4470K867a67595k26111h6813B32630
$$ 173711 -179840 -114845 419921 219659 3420 87890 90757 -167595 -393706 -86813 232630
11205a98769R8315j79348a0878A61125b09177a04247K8924q6175J8481k02j19808
$$ -198769 -100454 -279802 -10878 161125 -209177 -104247 -75323 -161498 -143017 -143219 -263027
11194b63027l5783J5171a11493l1027n457f3557o726J2345r8145k25775J02644
$$ -263027 -298810 -283639 -111493 -142520 -147977 -63557 -70283 -57938 -156083 -381858 -279214
11183b79214d9169A41727M6109a0941A29685B9797j0545a37735G3317h2855j01461
$$ -279214 -49169 141727 187836 -10941 129685 29797 19252 -137735 73317 -82855 -184316
11172a84316l396j6683Q6783J1485L229n9149m4034D9932B3233q932R9641e8363
$$ -184316 -187712 -204395 -117612 -106127 -102898 -162047 -206081 49932 23233 14301 113942 -58363
11159b26369r7706R3864A68009a69621A4528c12918g048k0482j30919A16520R844
$$ -226369 -324075 -230211 168009 -169621 14528 -312918 -7048 -27530 -158449 116520 126364
11148A26364a94698F1754a40926G4404J81879h8922K2762G258a95139H7518a09177
$$ 126364 -194698 61754 -140926 74404 256283 -88922 -66160 7258 -195139 87518 -109177
11136F9780L0687c0892D0664J13265D1254j8588K64961I5315A6452c8396A27615
$$ 69780 100467 -30892 40664 153929 41254 22666 287627 95315 16452 -38396 127615
11124C4305K46261a28813D12041g5586A71742G6969i2660A95712h9207C09182
$$ 34305 280566 -128813 412041 -75586 171742 76969 -92660 195712 -89207 309182
11113B70117J21313j07030a01402B60306J04909K3828e3047B96372A15067E2506
$$ 270117 391430 284400 -101402 260306 365215 389043 -53047 296372 115067 52506
11102A85271C6843L93905Q7271k08819j16791h7746m3971O476H4077J77089j3481
$$ 185271 36843 430748 518019 309200 192409 -87746 -131717 -125241 84077 261166 247685
11091B47685r0249N1746J08989C3204P8624k593K34106k7805F4802P5769E7008
$$ 247685 157436 209182 318171 33204 111828 109235 343341 315536 64802 140571 57008
11079B97387A24868J33590j9455f2511D24491m9644J46317B36555J26420P0374
$$ 297387 124868 258458 239003 -62511 424491 374847 521164 236555 362975 433349
11069D33349N2255j00203m7865J44052K3363L56839C85968j4014K76457j16334
$$ 433349 485604 385401 337536 481588 504951 861790 385968 371954 648411 532077
11059E32077q6377K64442j61485K55935A29048M19445K79873M3974r4950L40743
$$ 532077 445700 710142 548657 804592 129048 548493 828366 872340 777390 1118133
11049A118133k14105O9017m5647k45758J56279l23554O76970j69507j90901k89720
$$ 1118133 904028 973045 927398 681640 837919 514365 1191335 1021828 830927 541207
11039E41207J2587M88829k18863R617L17517m99307J29409K2344j21768J35555
$$ 541207 553794 1042623 823760 833377 1150894 651587 780996 803340 681572 817127
11029H17127J1679j12339J21944j297m603R2778D37823N91980l57118J84188j5772
$$ 817127 828806 716467 838411 837114 832511 925289 437823 1029803 672685 856873 841101
11018H41101K933k71098J3095j03396L26878k52516K59490j62579j00946L37909
$$ 841101 844034 572936 586031 482635 809513 556997 816487 653908 552962 890871
11008H90871l68715L94382k20308l3670K0772o6905J22077n8901K78198D70784
$$ 890871 522156 916538 696230 662560 683332 616427 738504 679603 957801 470784
10997G66676j28852q4711K9711p9774L35769l25989K66703Q9002k59408J17725
$$ 766676 637824 553113 582824 503050 838819 512830 779533 868535 609127 726852
10987G26852L14935J07131k92137N63283l58116J96807k50802M18213K4006j27810
$$ 726852 1041787 1148918 856781 1420064 1061948 1258755 1007953 1426166 1450172 1322362
10977A322362O36609K92485J48793J46508l8486P04270m711Q4521j00081j51936
$$ 1322362 1958971 2251456 2400249 2546757 2508271 3212541 3207830 3292351 3192270 3040334
10967C040334j87223n99013K87460l95411l54152P0128j20376k15778N62917j90551
$$ 3040334 2853111 2254098 2541558 2146147 1791995 1862123 1741747 1525969 2088886 1898335
10957A898335k29866K07332j16522k50437j49898k68843o8843J17044m06457j25637
$$ 1898335 1668469 1875801 1759279 1508842 1358944 1090101 1021258 1138302 731845 606208
10947F06208J15344l46970O5748K95187l24534d5466A52255J97394G6501K80642
$$ 606208 721552 374582 440330 735517 410983 -45466 152255 349649 76501 357143
10937C57143J47586j69103j34310a20171G843K16059a05175A16592b62889D5569
$$ 357143 504729 335626 201316 -120171 7843 223902 -105175 116592 -262889 45569
10926a56705A95807J115G0505L2074J96492c9963j1785j10490l813B88785b3953
$$ -156705 195807 196922 70505 102579 299071 -39963 -51748 -162238 -166051 288785 -23953
10914a88191G477J08924c1670o6045A44093m4243i3163I2614a79159K194q4545
$$ -188191 7477 116401 -31670 -97715 144093 99850 -93163 92614 -179159 -176965 -261510
10903b61510J01823f8376A5944K64518j1686O5834D1717Q4892g7284j43840h2638
$$ -261510 -159687 -68376 15944 280462 268776 334610 41717 126609 -77284 -221124 -82638
10891A37760j5057m1670h9785d842A6750J24560e574l93280J71414B73599b37893
$$ 137760 122703 81033 -89785 -4842 16750 141310 -5574 -398854 -227440 273599 -237893
10879a70356F2378c46916g9484l86746A6936b23542b4719E36899a7337F7612p769
$$ -170356 62378 -346916 -79484 -466230 16936 -223542 -24719 536899 -17337 67612 59843
10868E9843b39238J18824N3883G6826a36086a5043J979A45740b7729q7142E6303
$$ 59843 -239238 -120414 -66531 76826 -136086 -15043 -13064 145740 -27729 -114871 56303
10856f4059C2336N8780k4186A2737J51511a63343l7571G2510b22981j43662P8409
$$ -64059 32336 91116 66930 12737 164248 -163343 -200914 72510 -222981 -366643 -288234
10845b88234B03214a5544B50692A18748a13270H9444c728k3637k90385A46557
$$ -288234 203214 -15544 250692 118748 -113270 89444 -3728 -27365 -317750 146557
10834i858k7581j5688C4302J14765p2298J2787a54937d938C04913c37541J63280
$$ -9858 -37439 -53127 34302 149067 76769 89556 -154937 -4938 304913 -337541 -174261
10823a74261j58325a3718m45097A85344j8670B6534a22214d8171M302A6283J83689
$$ -174261 -332586 -13718 -458815 185344 166674 26534 -122214 -48171 -43869 16283 199972
10812A99972F2677b54750j21915A55797a24926L4362d2418p6165N6932l8470A39122
$$ 199972 62677 -254750 -376665 155797 -124926 -90564 -42418 -118583 -61651 -100121 139122
10800A22313i4364b0466C3248J56539c4450j23290l4848Q7674j54411b9428G5092
$$ 122313 -94364 -20466 33248 189787 -34450 -157740 -192588 -104914 -259325 -29428 75092
10788d5416C00177a34816e4804A68991E6284P121g0955A88168b7663H5896d066
$$ -45416 300177 -134816 -54804 168991 56284 63405 -70955 188168 -27663 85896 -4066
10776a39316j3544q4595C67640A5031J64981H6366C8952J31003a24444i70j11482
$$ -139316 -152860 -237455 367640 15031 180012 86366 38952 169955 -124444 -970 -112452
10765a12452D2168J42906D7053i9483A70417c70951B2106J04668a50183o8380
$$ -112452 42168 185074 47053 -99483 170417 -370951 22106 126774 -150183 -218563
10755b18563q6778M6600g1151J0193E3097b48047J23348C5478a98871L1941B5675
$$ -218563 -305341 -258741 -71151 -60958 53097 -248047 -124699 35478 -198871 -166930 25675
10743a37411C329J28540a93551c6694n681r101k93741A67353l5847E8056b2878
$$ -137411 3329 131869 -193551 -36694 -42375 -51476 -345217 167353 131506 58056 -22878
10731d5369j5228B93927I7267C3744a83801c9984H0223k2489J10267f0206A53623
$$ -45369 -60597 293927 97267 33744 -183801 -39984 80223 57734 168001 -60206 153623
10719B642b8832k75448H4740c6970a165A33477a00442A391J28620G695J23471
$$ 2642 -28832 -304280 84740 -36970 -1165 133477 -100442 1391 130011 7695 131166
10708A31166c53333E75968I546a26418b1380j29746b6904j06665f4328C58637
$$ 131166 -353333 575968 9546 -126418 -21380 -151126 -26904 -133569 -64328 358637
10697a99182G7513h3493H7716h0395a1346k08126A86641B862b24990R1581A43964
$$ -199182 77513 -83493 87716 -80395 -11346 -219472 186641 2862 -224990 -133409 143964
10685b3989n5302j7836A35621i1387F3877f1376M420r8701N510A90101F8116L2556
$$ -23989 -79291 -97127 135621 -91387 63877 -61376 -56956 -155657 -150147 190101 68116 100672
10673A00672a11118a4162k889n0221A8681J43143a73545d0117k51059M0437i2986
$$ 100672 -111118 -14162 -17051 -67272 18681 161824 -173545 -40117 -291176 -250739 -92986
10661b33967B91684b965l22706k3744e3315k784a7462j33674A2202c62204D8787
$$ -233967 291684 -2965 -325671 -349415 -53315 -56099 -17462 -151136 12202 -362204 48787
10649E2629a70169C6497g2575G7296M3467c02051a18310B9381f4543j93719D3252
$$ 52629 -170169 36497 -72575 77296 120763 -302051 -118310 29381 -64543 -258262 43252
10637d3224A18816l1866a00322j22752A31157Q6507a70229B6914a85332R1934
$$ -43224 118816 86950 -100322 -223074 131157 217664 -170229 26914 -185332 -93398
10627i3398C4774a22235a6571j24545e7732o0578a6032C1923a87155C8392a48009
$$ -93398 34774 -122235 -16571 -141116 -57732 -118310 -16032 31923 -187155 38392 -148009
10615c8409C21889D5372d1283H4199e625j30953E1831k1586a19357B07686a12457
$$ -38409 321889 45372 -41283 84199 -5625 -136578 51831 30245 -119357 207686 -112457
10603h539j16256F4072a60130K5389O1686K0824j13754P0767H0787a64748J5880
$$ -8539 -124795 64072 -160130 -134741 -73055 -52231 -165985 -95218 80787 -164748 -148868
10592a48868A4170a29760m7720f3200k4696B18440b12643O5071Q415A156a42385
$$ -148868 14170 -129760 -177480 -63200 -87896 218440 -212643 -147572 -139157 1156 -142385
10580E5664g5756L2062B89771I5969b99094B11588f6469m9706G7681a65355A90103
$$ 55664 -75756 -43694 289771 95969 -299094 211588 -66469 -116175 77681 -165355 190103
10568g8007c3510B6747h0839A22506b2774A4266a79653M491A23506l7795n976
$$ -78007 -33510 26747 -80839 122506 -22774 14266 -179653 -175162 123506 85711 79735
10557G9735Q687a27844r8992J6006l65670a04043D5083i6161A20243m2245g1500
$$ 79735 88422 -127844 -226836 -210830 -576500 -104043 45083 -96161 120243 77998 -71500
10545a57760k5426g7454A63909i1643A36148A1298K87412f1945B6548d4872k08076
$$ -157760 -183186 -77454 163909 -91643 136148 11298 298710 -61945 26548 -44872 -252948
10534b52948d0081m3166I1766c67722B98029b22550C44999b67229e3743l0735
$$ -252948 -40081 -83247 91766 -367722 298029 -222550 344999 -267229 -53743 -84478
10524h4478B11860m7196a84756B80974d9769l2772F9476J14260a04150d0987a0928
$$ -84478 211860 164664 -184756 280974 -49769 -82541 69476 183736 -104150 -40987 -10928
10512a78437g6539j8373B5026J63058a93585A06333J55775h7524A55452b52517
$$ -178437 -76539 -94912 25026 188084 -193585 106333 262108 -87524 155452 -252517
10501B65390F5101J828b02556b4881I6574J56251b929q0462k31145A96924i0146
$$ 265390 65101 66929 -202556 -24881 96574 252825 -2929 -83391 -314536 196924 -90146
10489I854J27570n901c9716a5068q1999l4624C57070F5371K49180J91862j36158
$$ 9854 137424 131523 -39716 -15068 -97067 -131691 357070 65371 314551 506413 370255
10478C70255J78356k11810Q456D9575K5447d3395l4640j6945A29731Q7363l8294
$$ 370255 548611 336801 345257 49575 75022 -43395 -78035 -94980 129731 217094 178800
10467A78800i0218k8342C1709b5934r8435j39M2570o9616f422p5573A16890a33067
$$ 178800 -90218 -118560 31709 -25934 -124369 -124508 -81938 -151554 -6422 -81995 116890 -133067
10454a60288A89685n9810A1245M42789I6349c45547A25391C9198D597K60769a00462
$$ -160288 189685 129875 11245 454034 96349 -345547 125391 39198 4597 265366 -100462
10442A11644a43739C20161b7137F0222j7922A5699J80779a88557B9446N4676f5942
$$ 111644 -143739 320161 -27137 60222 42300 15699 196478 -188557 29446 84122 -65942
10430a98699l5357b7145p6246H1386p052i1619l5444L636K2470A0a56208B21122
$$ -198699 -234056 -27145 -103391 81386 74334 -91619 -127063 -123427 -100957 10 -156208 221122
10417f0596A08187l2188J46286C6644M0471a05180l3314L8046k4450K1541G5958
$$ -60596 108187 75999 222285 36644 77115 -105180 -138494 -100448 -124898 -103357 75958
10405b0556C2654j0160b42745A92860K2692a79698C49843D3526K07000j22701
$$ -20556 32654 22494 -242745 192860 215552 -179698 349843 43526 250526 127825
10395A27825N4256Q7675d2589B76842a35227A64756j1745e6021B23276N789g164
$$ 127825 182081 269756 -42589 276842 -135227 164756 153011 -56021 223276 229065 -7164
10383d1188E98748f7790A6503K66994A8637L74034j39619J18614j44889k2703
$$ -41188 598748 -67790 16503 283497 18637 392671 253052 371666 226777 204074
10373B04074n3811J25248P7389j22465K43620o0243N2467n8568j02729K00259
$$ 204074 150263 275511 352900 230435 474055 413812 466279 407711 304982 505241
10363E05241j95738L046L6496N4450A65517B4021K64418O4944I8923J63691A26455
$$ 505241 309503 312549 349045 403495 165517 24021 288439 353383 98923 262614 126455
10351C03864M43189j82467K6095B45086M7363j27372m6722J84819q2082l1n5987
$$ 303864 747053 564586 590681 245086 292449 165077 118355 303174 221092 221061 165074
10340A65074K49097r4632j34469a13763A00250K69945r3401o4301q0043m6519
$$ 165074 414171 319539 185070 -113763 100250 370195 276794 212493 132450 85931
10330H5931a87090A02937h6456A26771m0287J4456e3340E9292M4421J5545J20618
$$ 85931 -187090 102937 -86456 126771 86484 100940 -53340 59292 103713 119258 239876
10319B39876B8900D454J36300M4140O5610H6273i178A876O666J08028D6069f4752
$$ 239876 28900 4454 140754 184894 250504 86273 -9178 1876 8542 116570 46069 -64752
10306H1369b64559B12830g1210O39C4967g7068A39299N1921A4746i2738b341n2456
$$ 81369 -264559 212830 -71210 -70571 34967 -77068 139299 191220 14746 -92738 -2341 -54797
10294e4797j4511k38131B66357d0721m637k83889B67730g1680H0198A1102a35778
$$ -54797 -69308 -307439 266357 -40721 -45358 -329247 267730 -71680 80198 11102 -135778
10282B3104a36044N9732q0758B14170K4867a11462A07582b23446A43403c87922
$$ 23104 -136044 -76312 -157070 214170 239037 -111462 107582 -223446 143403 -387922
10271A49204g2995k75623F0191a32368j15181D1893N416b0433j36810B096M56286
$$ 149204 -72995 -348618 60191 -132368 -247549 41893 47309 -20433 -157243 2096 458382
10260D58382j34445R4966A80929G7611J08353F5669B9817K17311E0672a95135
$$ 458382 323937 418903 180929 77611 185964 65669 29817 247128 50672 -195135
10249a92505F6605P7086J7718C9610c57729J72344A36340b63753R1439C8506J60996
$$ -192505 66605 143691 161409 39610 -357729 -185385 136340 -263753 -172314 38506 199502
10238A99502c03035a0555A5338a59784A22505j8829K03326h8561q5380j27686
$$ 199502 -303035 -10555 15338 -159784 122505 103676 307002 -88561 -173941 -301627
10228c01627a09356j86692B56463f9485q1472P4268o4667F9328a91172B03176
$$ -301627 -109356 -296048 256463 -69485 -150957 -76689 -141356 69328 -191172 203176
10217c27j74435a7415k42158c0209j0618C1771n208a43358A35314c6639j34643
$$ -327 -174762 -17415 -259573 -30209 -40827 31771 26563 -143358 135314 -36639 -171282
10206a71282B11430r6772b78836a03932E295f5079n2948j62634H8433j3028c9591
$$ -171282 211430 114658 -278836 -103932 5295 -65079 -118027 -280661 88433 75405 -39591
10194a17833D7196b53587B21637a31235A96807c0496l09928A06688E1392B5100
$$ -117833 47196 -253587 221637 -131235 196807 -30496 -340424 106688 51392 25100
10183d1043j63777E2931J21774E7451j5439a33769q7521B53232a25367A09850
$$ -41043 -204820 52931 174705 57451 42012 -133769 -221290 253232 -125367 109850
10172b01973A0872b32674F4229e7712j18512o2451J00629k79437I5856b17242
$$ -201973 10872 -232674 64229 -57712 -176224 -238675 -138046 -417483 95856 -217242
10161g4036k9309o8868a7453H7490b7324l8694q0817q657A96894G6143B9059a50858
$$ -74036 -103345 -172213 -17453 87490 -27324 -66018 -146835 -155492 196894 76143 29059 -150858
10148A16275J17774N3833G0077b54375i5387j225I2631D0207Q1638n2354a92980
$$ 116275 234049 287882 70077 -254375 -95387 -96612 92631 40207 121845 69491 -192980
10136e1367j89506M6523B70098E2717a09920B3770b2305A48722d52294I4718b57014
$$ -51367 -240873 -194350 270098 52717 -109920 23770 -22305 148722 -452294 94718 -257014
10124D1273e5529j56427Q1802f4025j1467k16137F6694G318L1562a2538k79985
$$ 41273 -55529 -211956 -130154 -64025 -75492 -291629 66694 7318 38880 -12538 -292523
10113b92523a35824K5009a0094m71971J16074d1988B19884O025H813b25869l14143
$$ -292523 -135824 -110815 -10094 -482065 -365991 -41988 219884 225909 8813 -225869 -540012
10102e40012K38293g5310j94319a13736B02785i4281A75915a16275k6335k5443
$$ -540012 -301719 -75310 -269629 -113736 202785 -94281 175915 -116275 -142610 -168053
10092a68053B5780J32815E2332d6532A82639A9887b34874k3300a04913l37394
$$ -168053 25780 158595 52332 -46532 182639 19887 -234874 -258174 -104913 -442307
10082d42307J80452h69H3185b78319G6501d8906l39689B26968a9187g739j13357
$$ -442307 -261855 -869 83185 -278319 76501 -48906 -388595 226968 -19187 -7739 -121096
10071a21096H4041b01039I3389f7639b0009j39861a6401p0458G6977k9920b60370
$$ -121096 84041 -201039 93389 -67639 -20009 -159870 -16401 -86859 76977 47057 -260370
10059A97831b72161G8960b66397N0677D7153c06456J25991C1429Q8100P6219F861
$$ 197831 -272161 78960 -266397 -215720 47153 -306456 -180465 31429 119529 195748 6861
10047e8927A0488d3709B04976a69560h4202b8021j48971E1214a67413F2751a25540
$$ -58927 10488 -43709 204976 -169560 -84202 -28021 -176992 51214 -167413 62751 -125540
10035b94878O2508A34981f8178j49972E1982e7070j85266A62945F2488b3230j98873
$$ -294878 -232370 134981 -68178 -218150 51982 -57070 -242336 162945 62488 -23230 -222103
10024b22103k52A36225a29376j9908f8099D3620a96435J1738A67211a50908k60779
$$ -222103 -222355 136225 -129376 -149284 -68099 43620 -196435 -184697 167211 -150908 -411687
10013d11687d2701A8891a55094k22098R9964c9547B8336a52705C8528a52852A18952
$$ -411687 -42701 18891 -155094 -377192 -277228 -39547 28336 -152705 38528 -152852 118952
10001A54721h137o2924o1798r0212j31595a66503B9633K761F083J74656g0661
$$ 154721 -8137 -71061 -132859 -223071 -354666 -166503 29633 32394 6083 180739 -70661
9989a54246k9409e0034A64128a86355k62301c7331J6762k87486H3100i4394C19478
$$ -154246 -183655 -50034 164128 -186355 -448656 -37331 -20569 -308055 83100 -94394 319478
9977b22325B5572Q5536n4212b22069P1973L1802A18906a08546p2354P1564A12297
$$ -222325 25572 111108 56896 -222069 -150096 -118294 118906 -108546 -180900 -109336 112297
9965c9121E58238D5968K7088a50324B18626a76183N5193n9208h2931G077e3450
$$ -39121 558238 45968 73056 -150324 218626 -176183 -120990 -180198 -82931 7077 -53450
9953c069p0002j97432D7340a66386M9481B02301E5785a44588F3571e2005B92743
$$ -3069 -73071 -270503 47340 -166386 -116905 202301 55785 -144588 63571 -52005 292743
9941g1970N302A6689J66182a67918A10576f1026b6543k17202F7164a91667e5848
$$ -71970 -66668 16689 182871 -167918 110576 -61026 -26543 -243745 67164 -191667 -55848
9929E3597b14100a5087B4177c58724P6354b1292j3140k39518J09389C0387c3106
$$ 53597 -214100 -15087 24177 -358724 -282370 -21292 -34432 -273950 -164561 30387 -33106
9917A5534K61348F5164d45j25774k12183a35216B06010a63487p0575A66274a13147
$$ 15534 276882 65164 -445 -126219 -338402 -135216 206010 -163487 -234062 166274 -113147
9905B3946g1200D2304a83058k5755B36440a07361K3320a616A19679G805b80143
$$ 23946 -71200 42304 -183058 -208813 236440 -107361 -84041 -1616 119679 7805 -280143
9893a06954C38361a95712e9316b7673m37874a00040a1890m53010A48536b86773
$$ -106954 338361 -195712 -59316 -27673 -465547 -100040 -11890 -464900 148536 -286773
9882A07047b25r2725A32608i9450I7265b76806c6427A5236N5235c52049a50525
$$ 107047 -225 -92950 132608 -99450 97265 -276806 -36427 15236 70471 -352049 -150525
9870a71320g0842K294j25232A02811a15993N6443k50637a12945J1220j00854I3658
$$ -171320 -70842 -68548 -193780 102811 -115993 -59550 -310187 -112945 -101725 -202579 93658
9858d77341d9761o5827n0540d3881k27111K0549a7746j183A01982a18230A72813
$$ -477341 -49761 -115588 -166128 -43881 -270992 -250443 -17746 -18929 101982 -118230 172813
9846A08846b19696o4681a30265A935J16666c7461A2698a67712B3674c46596n3114
$$ 108846 -219696 -284377 -130265 1935 118601 -37461 12698 -167712 23674 -346596 -399710
9835c99710h3769j89352G9909M9200P1853h2924k27566A4651a64175A26910b01573
$$ -399710 -83769 -273121 79909 129109 200962 -82924 -310490 14651 -164175 126910 -201573
9823a06493K4148L8526A08494g0869j54582F2985i7880r0625k10677A8696b17744
$$ -106493 -82345 -43819 108494 -70869 -225451 62985 -97880 -188505 -399182 18696 -217744
9811a12053c3003G4976R6011h6082E5622a30227j90312B14648p7762d1892m6332
$$ -112053 -33003 74976 170987 -86082 55622 -130227 -320539 214648 136886 -41892 -88224
9800h8224j54806A4577J60643n5384p738a63564d1489o5590b9222m07556A61920
$$ -88224 -243030 14577 175220 119836 112098 -163564 -41489 -107079 -29222 -436778 161920
9788c48901a5159l43361a51098j59999F8904b5594A168L62216C4103a906j0187
$$ -348901 -15159 -358520 -151098 -311097 68904 -25594 1168 363384 34103 -1906 -12093
9777a2093F0793c66407a39688p5732F4465a68927F1471K7037d6315j16097O4512
$$ -12093 60793 -366407 -139688 -215420 64465 -168927 61471 88508 -46315 -162412 -97900
9766i7900A2284d9515o3435j29404M4711A01747f6876l8984e089j41229A19837
$$ -97900 12284 -49515 -112950 -242354 -197643 101747 -66876 -105860 -5089 -146318 119837
9754A68578p0296j7588Q6475b1448q6789o0320L7916L4999L8247k2081b9209A66810
$$ 168578 98282 80694 167169 -21448 -108237 -168557 -130641 -95642 -57395 -79476 -29209 166810
9741a54344j44982O7295g3859A6629b41599K1148B35523p5222b43295a3513j84943
$$ -154344 -299326 -232031 -73859 16629 -241599 -220451 235523 160301 -243295 -13513 -198456
9730a98456k45159D8553e2007m3830L6535A63623a25790A13538f8956K3472H7543
$$ -198456 -443615 48553 -52007 -95837 -59302 163623 -125790 113538 -68956 -45484 87543
9718a13118D332a96185G3645L48752b00000k25685C34104j45931b33683A12371
$$ -113118 4332 -196185 73645 422397 -200000 -425685 334104 188173 -233683 112371
9707A39951a8820q5209e97k16264f5568A89780F1384h6088B39416j13055b90622
$$ 139951 -18820 -104029 -597 -216861 -65568 189780 61384 -86088 239416 126361 -290622
9695B2450f0695l52517b0502j240A79030J81885b65580F3616i4389l2148k30656
$$ 22450 -60695 -413212 -20502 -21742 179030 360915 -265580 63616 -94389 -126537 -357193
9684c57193a2301m01557A51957a50178r3501f010j55075A69546j2179K58548I718
$$ -357193 -12301 -413858 151957 -150178 -243679 -6010 -161085 169546 157367 415915 9718
9672b38385L6323B16640a95478B15202L0670i7893B09192b67860A49184a87194
$$ -238385 -202062 216640 -195478 215202 245872 -97893 209192 -267860 149184 -187194
9661b75524A51273h2619c7737B59459I9437K3652J57207d2400m46594i1715b7653
$$ -275524 151273 -82619 -37737 259459 99437 123089 280296 -42400 -488994 -91715 -27653
9649F3630i1569B40858a9743j48859j67481p6928a22198N3113K5458j6515b2611
$$ 63630 -91569 240858 -19743 -168602 -336083 -413011 -122198 -69085 -43627 -60142 -22611
9637F729J53052G1561a06614b2931A90393e9532o3671F5971a46598l2776L1405
$$ 6729 159781 71561 -106614 -22931 190393 -59532 -123203 65971 -146598 -179374 -147969
9626a47969F6973a09720j2401A02504h4792p5732B5597c58367b7501o5930a1352
$$ -147969 66973 -109720 -122121 102504 -84792 -160524 25597 -358367 -27501 -93431 -11352
9614a01450F0201a1416A74281q4299a77227b4668l09288a52966M8257j07953D5185
$$ -101450 60201 -11416 174281 89982 -177227 -24668 -333956 -152966 -104709 -212662 45185
9602f6345p5108C942i0315j65651e3650E6749b29791Q1931E8335a16982A22160
$$ -66345 -141453 3942 -90315 -255966 -53650 56749 -229791 -147860 58335 -116982 122160
9590a32592j76012f7743j0832A3829b37528A78560a38254m724A28698b32108J14133
$$ -132592 -308604 -67743 -78575 13829 -237528 178560 -138254 -142978 128698 -232108 -117975
9579a17975j60145Q7021Q6845M3826J1157E2728a2044j09764B90036j01700C5200
$$ -117975 -278120 -191099 -104254 -60428 -49271 52728 -12044 -121808 290036 188336 35200
9567e5711o9733a3276L272H096L73398a91508p2745J26465l2718n329h6823m38417
$$ -55711 -125444 -13276 -10004 8096 381494 -191508 -264253 -137788 -170506 -175835 -86823 -525240
9555e25240g5415a7276D587b70612M04f0753A90310E5537K870a08434j69049h0672
$$ -525240 -75415 -17276 4587 -270612 -270208 -60753 190310 55537 58407 -108434 -277483 -80672
9542C28083g8665H1736b35071B31602a1222l01388j9082R4372E5290j9824K21379
$$ 328083 -78665 81736 -235071 231602 -11222 -312610 -331692 -237320 55290 35466 256845
9531B56845b83117H2875a41316A0283a13992j50368C2586a65767e5615B62712
$$ 256845 -283117 82875 -141316 10283 -113992 -264360 32586 -165767 -55615 262712
9520i0757E6005a62543C306b46517F0256J33306A8509P3825C5645L14841a10730
$$ -90757 56005 -162543 3306 -246517 60256 193562 18509 92334 35645 350486 -110730
9508C308R0723h9837m2324B8331d4243q4554A9265K1461J59925k9847C2093b04145
$$ 3308 94031 -89837 -132161 28331 -44243 -128797 19265 40726 200651 170804 32093 -204145
9495B2137d06675a30653j3946r6597G7350a58411d4232k13924E0820b58022C0598
$$ 22137 -406675 -130653 -144599 -241196 77350 -158411 -44232 -258156 50820 -258022 30598
9483b20546a4469l93307B7090i825o1560r2836o1419I4926Q9385a11743A1379
$$ -220546 -14469 -407776 27090 -9825 -71385 -164221 -225640 94926 184311 -111743 11379
9471f6932K9993P103k67138a30533j16184a04618j13198F7143J38545C5924K5654
$$ -66932 -36939 -29836 -296974 -130533 -246717 -104618 -217816 67143 205688 35924 61578
9460F1578d2295o9827j84198A12327b70116e5054j82713K5816L7359A6040b3785
$$ 61578 -42295 -112122 -296320 112327 -270116 -55054 -237767 -211951 -174592 16040 -23785
9448a72969g1137k40792J19907C47611G7095a31554H3733K02368a07954p496c5188
$$ -172969 -71137 -311929 -192022 347611 77095 -131554 83733 286101 -107954 -115450 -35188
9436C22892a36839C2125i4366A89498A8700b11567R3811j07761J05762g565l52600
$$ 322892 -136839 32125 -94366 189498 18700 -211567 -117756 -225517 -119755 -7565 -360165
9425c60165d7634A10112a23350b308j45682r8693h0283b3359E4660a58650d4280
$$ -360165 -47634 110112 -123350 -2308 -147990 -246683 -80283 -23359 54660 -158650 -44280
9413a24612p8458b8100g41m00405J32652i615A61415n4269J43192b90747A89395
$$ -124612 -203070 -28100 -741 -401146 -268494 -9615 161415 107146 250338 -290747 189395
9401b56726k10896e3958j64025a06718j23709A139i8036k54427a27294B88259
$$ -256726 -467622 -53958 -217983 -106718 -230427 1139 -98036 -352463 -127294 288259
9390a49135N2190A36258B4404h3856L302k5380B3519a34064A46357m7018a45381
$$ -149135 -96945 136258 24404 -83856 -80554 -105934 23519 -134064 146357 99339 -145381
9378b5553B6972K435r259h3168B3574a2527k55361R0631F4716N579J3173b97929
$$ -25553 26972 29407 20148 -83168 23574 -12527 -267888 -177257 64716 70295 83468 -297929
9365B2248h7737a7673k65781P4690l79798J24965b5908o9324A60695D9665d8287
$$ 22248 -87737 -17673 -283454 -208764 -588562 -463597 -25908 -95232 160695 49665 -48287
9353H6037d52080K03528b7021o782k13107c6395G8539a26304k6032d0283G9944
$$ 86037 -452080 -248552 -27021 -33803 -246910 -36395 78539 -126304 -152336 -40283 79944
9341a95921O4572A03980e9420B7030a09746G354a12166A83145G3313i8775B7164
$$ -195921 -131349 103980 -59420 27030 -109746 7354 -112166 183145 73313 -98775 27164
9329a33997A68229a64232A65447l7119a23068H6203b73367B60414B8936b56139
$$ -133997 168229 -164232 165447 128328 -123068 86203 -273367 260414 28936 -256139
9318a96507B99033J3870j22075j1720n5898m070a61269A45690J69452f5687K0091
$$ -196507 299033 312903 190828 179108 123210 119140 -161269 145690 315142 -65687 -45596
9307d5596B93840I2507b26607i927A29585J0652a44453A46827a93486M2220a7418
$$ -45596 293840 92507 -226607 -9927 129585 140237 -144453 146827 -193486 -151266 -17418
9295A11805d01680e0166H3844a50969H8652h6854j11034H5458b0347B8468c53198
$$ 111805 -401680 -50166 83844 -150969 88652 -86854 -197888 85458 -20347 28468 -353198
9283a27425A95535a16396c0390F5601N5339l0905b12843G2315b5364m5088A71171
$$ -127425 195535 -116396 -30390 65601 120940 90035 -212843 72315 -25364 -70452 171171
9271c78441A87520p8036g922C7658e1036j82386e4859A16485i5468A46492a52377
$$ -378441 187520 109484 -7922 37658 -51036 -233422 -54859 116485 -95468 146492 -152377
9259i2245h803A31839g8178n3504m01284K51183J25124P1070B8181Q2237d51667
$$ -92245 -8803 131839 -78178 -131682 -532966 -281783 -156659 -85589 28181 110418 -451667
9247A05067C9978c66569J1235a67827L9415D3835R1422K3844a83887A00160J28948
$$ 105067 39978 -366569 -355334 -167827 -128412 43835 135257 159101 -183887 100160 229108
9236B29108q4532J39691e2564H5310c62252A50176d68371A20546c14380C9532
$$ 229108 144576 284267 -52564 85310 -362252 150176 -468371 120546 -314380 39532
9225b24424d0249m9005H8437g0548j88764d8839j10830A89245J01262a04404j95981
$$ -224424 -40249 -89254 88437 -70548 -259312 -48839 -159669 189245 290507 -104404 -300385
9214c00385R6717B40201b50519C63103a39644M4579L5750j97124n9162c5123B06473
$$ -300385 -203668 240201 -250519 363103 -139644 -95065 -59315 -256439 -315601 -35123 206473
9202A93043J43899C8620K8061b03694j816j89354B83526e7327r0709j86635J53618
$$ 193043 336942 38620 66681 -203694 -205510 -394864 283526 -57327 -148036 -334671 -181053
9191a81053C28584c9666A0547N2765K9508A2837f8040r9807n2051b0779m4227
$$ -181053 328584 -39666 10547 63312 92820 12837 -68040 -167847 -219898 -20779 -65006
9180f5006K7760E7228J44525b20662B1057K12851J56917a15897k25849F153b2028
$$ -65006 -37246 57228 201753 -220662 21057 233908 390825 -115897 -341746 6153 -22028
9168b8457j59937M0588k8812C594L4382d8779A39840h3774C2650a13437B04509
$$ -28457 -188394 -147806 -176618 3594 37976 -48779 139840 -83774 32650 -113437 204509
9156g1821j12963j55618H0877k2206a13556j29298B40992a2941A5967g5760B95772
$$ -71821 -184784 -340402 80877 58671 -113556 -242854 240992 -12941 15967 -75760 295772
9144h2662K750A7809b37407a12843B07383C3130P9507B1713a4075A5338i3681
$$ -82662 -79912 17809 -237407 -112843 207383 33130 112637 21713 -14075 15338 -93681
9132G3105d6508M559l974D24O4510l825c1095B4699a74136q3082c4804j27946
$$ 73105 -46508 -41949 -45923 424 64934 61109 -31095 24699 -174136 -257218 -34804 -162750
9120a62750e8911j57553C02208c8821j58709r8391N8139L8920M5196P5313B49192
$$ -162750 -58911 -216464 302208 -38821 -197530 -295921 -237782 -198862 -153666 -78353 249192
9108G961B402a93999K9838B77691a18639N6685j92060e0798C0485J7415b26834
$$ 7961 2402 -193999 -164161 277691 -118639 -61954 -254014 -50798 30485 47900 -226834
9096a42694c2114B32940j11473b1777j79531J8160L7222O1105G4059a17843l564
$$ -142694 -32114 232940 121467 -21777 -201308 -183148 -145926 -84821 74059 -117843 -121407
9085a21407n8088G293h8347c9311H0177C1841b70488j3932A24668a30330A68994
$$ -121407 -179495 7293 -88347 -39311 80177 31841 -270488 -284420 124668 -130330 168994
9073e0993A19408b45933A61899a68519A50559e5463B6095a45680B66280a13014
$$ -50993 119408 -245933 161899 -168519 150559 -55463 26095 -145680 266280 -113014
9062G546g6703j84194j39734R3697a32599K8610k18223c6472j02322E0720b8515
$$ 7546 -76703 -260897 -400631 -306934 -132599 -103989 -322212 -36472 -138794 50720 -28515
9050a33476C0230a14740A30348a89963M6606A83893J69499a34800N485b6925q3458
$$ -133476 30230 -114740 130348 -189963 -143357 183893 353392 -134800 -129315 -26925 -110383
9039a10383q1386h6604j97982b8799m48429A08081b25835a06113n329r6087b741
$$ -110383 -191769 -86604 -284586 -28799 -477228 108081 -225835 -106113 -111442 -207529 -2741
9027b31707C0436A985P1624e2757A3554f08807a9863h8I8042a91089d5631B68672
$$ -231707 30436 1985 73609 -52757 13554 -608807 -19863 -88 98042 -191089 -45631 268672
9014a39793A74128a14782e0126k45654J33366b5679A37966b72023B57178n6009
$$ -139793 174128 -114782 -50126 -295780 -162414 -25679 137966 -272023 257178 201169
9004B01169F6316a38332B27651r8922d8430I6728C21a07437A31278a54187c6104
$$ 201169 66316 -138332 227651 128729 -48430 96728 321 -107437 131278 -154187 -36104
8992i0100j27170h8219j97657F7746Q1576q558O0088I3872a88686j4747R2199
$$ -90100 -217270 -88219 -285876 67746 149322 140764 200852 93872 -188686 -203433 -111234
8981a11234k40954E1289a1156k52484M081A3279e1231G8451b58350A8706c43385
$$ -111234 -352188 51289 -11156 -263640 -259559 13279 -51231 78451 -258350 18706 -343385
8969a40187B73158b07396p2425B8320e9879j83863k65710I9731e9421m8882k3322
$$ -140187 273158 -207396 -279821 28320 -59879 -243742 -509452 99731 -59421 -108303 -131625
8958a31625p9111e8797p633A01511J6450k3520b85761A9875d6750o0151b6420
$$ -131625 -210736 -58797 -66430 101511 117961 94441 -285761 19875 -46750 -106901 -26420
8946b13400j11839e7864C06229b74503r0106A5134a12940J3346j32833A19543
$$ -213400 -325239 -57864 306229 -274503 -364609 15134 -112940 -99594 -232427 119543
8935A20863a38580e6557P747A00118h7170A20209a00377j04053j22636A73872
$$ 120863 -138580 -56557 -48810 100118 -87170 120209 -100377 -204430 -327066 173872
8924C2715K5411J98807K118n9047a28525R960a9341N972j63265k07967B83225
$$ 32715 58126 256933 259051 200004 -128525 -118565 -19341 -13369 -176634 -384601 283225
8912B65363c740l56053a66562A18390a26614f2083D4519b06412D4057h9267F6927
$$ 265363 -3740 -359793 -166562 118390 -126614 -62083 44519 -206412 44057 -89267 66927
8900f8911D2223L9689f2869n2344j96177B7239a11724m6138q8786h5767k27707
$$ -68911 42223 81912 -62869 -115213 -311390 27239 -111724 -157862 -246648 -85767 -313474
8889c13474A15147f2848J4466k29621a13645N3178F5474g5198j05794j12032L4776
$$ -313474 115147 -62848 -48382 -278003 -113645 -60467 65474 -75198 -180992 -293024 -258248
8878b58248e8329q6510f3660A39507c08459A36004b01692N7746C23599a10248
$$ -258248 -58329 -144839 -63660 139507 -308459 136004 -201692 -143946 323599 -110248
8867E1930b85210E7825Q0213A6379J20618a92636N4912A00977a36749d1828j5024
$$ 51930 -285210 57825 138038 16379 136997 -192636 -137724 100977 -136749 -41828 -56852
8856e6852A40240a13774B54519E6635J67064d7605F4771a43291d3890m9772L9206
$$ -56852 140240 -113774 254519 56635 223699 -47605 64771 -143291 -43890 -93662 -54456
8845e4456j21780b3936l04556A46741f2864J1791n7390a9020j78798m6773l7645
$$ -54456 -176236 -23936 -328492 146741 -62864 -51073 -108463 -19020 -197818 -244591 -282236
$$ [...]
##END NTUPLES=NMR SPECTRUM
##END=
