##TITLE=AC1738_SEN00011_9276187_vwu7jyrfVx
##JCAMPDX= 6.0         $$ Bruker NMR JCAMP-DX V2.0
##DATA TYPE= NMR SPECTRUM
##DATA CLASS= NTUPLES
##ORIGIN= BRUKER
##OWNER= Administrator
$$ 1.72 TOPSPIN		Version 2.1
$$ 2015-07-18 18:36:55.166 -0700  Administrator@X
$$ Compression mode = diff/dup
##.OBSERVE FREQUENCY= 400.02188249412
##.OBSERVE NUCLEUS= ^1H
##.ACQUISITION MODE= SIMULTANEOUS (DQD)
##.ACQUISITION SCHEME= undefined
##.AVERAGES= 64
##.DIGITISER RES= 22
##SPECTROMETER/DATA SYSTEM= spect
##.PULSE SEQUENCE= noesygpps1d.comp
##.SOLVENT NAME= COFFEE_meoh
##.SHIFT REFERENCE= INTERNAL, COFFEE_meoh, 1, 14.96094
##AUDIT TRAIL= $$ (NUMBER, WHEN, WHO, WHERE, PROCESS, VERSION, WHAT)
$$ ##TITLE= Audit trail, TOPSPIN		Version 2.1
$$ ##JCAMPDX= 5.01
$$ ##ORIGIN= Bruker BioSpin GmbH
$$ ##OWNER= Administrator
$$ $$ E:\/data/COFFEE/nmr/AC1738_SEN00011_9276187_vwu7jyrfVx/32/pdata/1/auditp.txt
$$ ##AUDIT TRAIL=  $$ (NUMBER, WHEN, WHO, WHERE, PROCESS, VERSION, WHAT)
(   1,<2015-07-18 18:36:48.807 -0700>,<Administrator>,<X>,<go>,<TOPSPIN 2.1>,
      <created by zg
	started at 2015-07-18 18:25:18.525 -0700,
	POWCHK enabled, PULCHK disabled,
       configuration hash MD5:
       21 0F 79 D6 B3 7B B4 F6 88 20 88 DB 03 48 BD 9F
       data hash MD5: 64K
       38 BC 01 BF 5B 31 75 9D 67 30 82 36 62 1F 3C 2C>)
(   2,<2015-07-18 18:36:53.057 -0700>,<Administrator>,<X>,<proc1d>,<TOPSPIN 2.1>,
      <Start of raw data processing
       efp LB = 0.3 FT_mod = 6 PKNL = 1 PHC0 = 0 PHC1 = 0 SI = 128K 
       data hash MD5: 128K
       BF 3C B8 B9 59 48 6B EE 4E F9 1C 08 A2 5A 5C 09>)
(   3,<2015-07-18 18:36:53.947 -0700>,<Administrator>,<X>,<proc1d>,<TOPSPIN 2.1>,
      <pk PHC0 = -89.01123 PHC1 = 0 
       data hash MD5: 128K
       12 24 6D BF 04 B6 A5 45 14 CB 8A 41 0B BA C1 F1>)
(   4,<2015-07-18 18:36:54.338 -0700>,<Administrator>,<X>,<proc1d>,<TOPSPIN 2.1>,
      <abs ABSG = 1 
       data hash MD5: 128K
       FA 2D 63 59 8B D9 50 49 70 EF F2 B7 B5 1B A0 56>)
(   5,<2015-07-18 18:36:54.432 -0700>,<Administrator>,<X>,<proc1d>,<TOPSPIN 2.1>,
      <abs ABSG = 2 
       data hash MD5: 128K
       9C 9B DB 5E AD 77 C8 55 7E DB 75 14 6E 31 CE 30>)
(   6,<2015-07-18 18:36:54.525 -0700>,<Administrator>,<X>,<proc1d>,<TOPSPIN 2.1>,
      <abs ABSG = 3 
       data hash MD5: 128K
       A4 2D 42 00 77 E7 95 0D D8 2F 89 2A D4 69 B4 F3>)
(   7,<2015-07-18 18:36:54.604 -0700>,<Administrator>,<X>,<proc1d>,<TOPSPIN 2.1>,
      <abs ABSG = 4 
       data hash MD5: 128K
       B6 6E 5D FD BC 9E E4 A3 82 C3 FB AE 6F 1E A1 8C>)
(   8,<2015-07-18 18:36:54.744 -0700>,<Administrator>,<X>,<proc1d>,<TOPSPIN 2.1>,
      <abs ABSG = 5 
       data hash MD5: 128K
       1C 47 4A FA 97 E4 AD 0E 64 76 CF 22 CD 57 94 6D>)
$$ ##END=
$$ 
$$ $$ hash MD5
$$ $$ A5 69 89 F0 7A 65 CF AA 92 0F 9E 02 E2 42 F2 4E
##$RELAX= 
##$RELAX= 
##$RELAX= 
##$RELAX= 
##$RELAX= 
##$RELAX= 
##$RELAX= 
##$RELAX= 
$$ Bruker specific parameters
$$ --------------------------
##$DU= <E:\>
##$EXPNO= 32
$$ [...]
##$TP07= 0
##$TPNAME0= <>
##$TPNAME1= <>
##$TPNAME2= <>
##$TPNAME3= <>
##$TPNAME4= <>
##$TPNAME5= <>
##$TPNAME6= <>
##$TPNAME7= <>
##$TPOAL= (0..7)
0.5 0.5 0.5 0.5 0.5 0.5 0.5 0.5
##$TPOFFS= (0..7)
0 0 0 0 0 0 0 0
##$TUNHIN= 0
##$TUNHOUT= 0
##$TUNXOUT= 0
##$USERA1= <user>
##$USERA2= <user>
##$USERA3= <user>
##$USERA4= <user>
##$USERA5= <user>
##$V9= 5
##$VALIST= <valist>
##$VCLIST= <CCCCCCCCCCCCCCC>
##$VD= 0
##$VDLIST= <DDDDDDDDDDDDDDD>
##$VPLIST= <PPPPPPPPPPPPPPP>
##$VTLIST= <TTTTTTTTTTTTTTT>
##$WBST= 2048
##$WBSW= 25
##$XGAIN= (0..3)
0 0 0 0
##$XL= 0
##$YL= 0
##$YMAX_a= 6628035
##$YMIN_a= -12203451
##$ZGOPTNS= <>
##$ZL1= 120
##$ZL2= 120
##$ZL3= 120
##$ZL4= 120
##$ABSF1= 14.96094
##$ABSF2= -5.597241
##$ABSG= 5
##$ABSL= 3
##$ALPHA= 0
##$AQORDER= 0
##$ASSFAC= 0
##$ASSFACI= 0
##$ASSFACX= 0
##$ASSWID= 0
##$AUNMP= <proc_prof1d_extract.lims>
##$AXLEFT= 0
##$AXNAME= <>
##$AXNUC= <1H>
##$AXRIGHT= 0
##$AXTYPE= 0
##$AXUNIT= <>
##$AZFE= 0.1
##$AZFW= 0.1
##$BCFW= 0
##$BC_mod= 0
##$BYTORDP= 0
##$COROFFS= 0
##$CY= 15
##$DATMOD= 1
##$DC= 0
##$DFILT= <>
##$DTYPP= 0
##$F1P= 0
##$F2P= 0
##$FCOR= 0.5
##$FTSIZE= 131072
##$FT_mod= 6
##$GAMMA= 0
##$GB= 0
##$INTBC= 1
##$INTSCL= 1
##$ISEN= 128
##$LB= 0.3
##$LEV0= 0
##$LPBIN= 0
##$MAXI= 10000
##$MC2= 0
##$MEAN= 0
##$ME_mod= 0
##$MI= 0
##$NCOEF= 0
##$NC_proc= -2
##$NLEV= 6
##$NOISF1= 0
##$NOISF2= 0
##$NSP= 0
##$NTH_PI= 0
##$NZP= 0
##$OFFSET= 14.96094
##$PC= 1
##$PHC0= -89.01123
##$PHC1= 0
##$PH_mod= 1
##$PKNL= yes
##$PPARMOD= 0
##$PPDIAG= 0
##$PPIPTYP= 0
##$PPMPNUM= 2147483647
##$PPRESOL= 1
##$PSCAL= 4
##$PSIGN= 0
##$PYNMP= <proc.py>
##$REVERSE= no
##$SF= 400.020009661733
##$SI= 131072
##$SIGF1= 0
##$SIGF2= 0
##$SINO= 400
##$SIOLD= 131072
##$SPECTYP= <>
##$SREGLST= <1H.CDCl3>
##$SSB= 0
##$STSI= 131072
##$STSR= 0
##$SW_p= 8223.68421052631
##$SYMM= 0
##$S_DEV= 0
##$TDeff= 65536
##$TDoff= 0
##$TI= <>
##$TILT= no
##$TM1= 0
##$TM2= 0
##$TOPLEV= 0
##$USERP1= <user>
##$USERP2= <user>
##$USERP3= <user>
##$USERP4= <user>
##$USERP5= <user>
##$WDW= 1
##$XDIM= 131072
##$YMAX_p= 363382418
##$YMIN_p= -11470
##$CURPLOT= <Network HP LaserJet P1505>
##$CURPRIN= <$Network HP LaserJet P1505>
##$DFORMAT= <normdp>
##$LAYOUT= <+/1D_H.xwp>
##$LFORMAT= <normlp>
##$PFORMAT= <normpl>
##$SURQMSG= 1
$$ End of Bruker specific parameters
$$ ---------------------------------
##NTUPLES= NMR SPECTRUM
##VAR_NAME=  FREQUENCY,     SPECTRUM/REAL,   SPECTRUM/IMAG
##SYMBOL=    X,             R,               I
##VAR_TYPE=  INDEPENDENT,   DEPENDENT,       DEPENDENT
##VAR_FORM=  AFFN,          ASDF,            ASDF
##VAR_DIM=   131072,        131072,          131072
##UNITS=     HZ,            ARBITRARY UNITS, ARBITRARY UNITS
##FACTOR=    0.0627417313425164, 1,          1
##FIRST=     8223.62146879497, 3526,         -59392
##LAST=      0,             5861,            -58692
##MIN=       0,             -11470,          0
##MAX=       8223.62146879497, 363382418,    0
$$ Real data points
##PAGE= N=1
##DATA TABLE= (X++(R..R)), XYDATA
$$ [...]
61636E26420P53N27J90m25j265k204k976l249l081k978l219l444l275k947k832
$$ 526420 527173 527700 527890 527465 526200 523996 521020 517771 514690 511712 508493 505049 501774 498827 495995
61621D95995k717k206j533j258j327j217r36j032j501j640j247j158k059l439
$$ 495995 493278 491072 489539 488281 486954 485737 484801 483769 482268 480628 479381 478223 476164 472725
61607D72725m357m753n256o049o630o671o499o568o875p053o784o032n009m057
$$ 472725 468368 463615 458359 452310 445680 439009 432510 425942 419067 412014 405230 399198 394189 390132
61593C90132l479l383l648l976m001l524k740k127j968k054j978j695j614k071
$$ 390132 386653 383270 379622 375646 371645 368121 365381 363254 361286 359232 357254 355559 353945 351874
61579C51874k776k984k315j287p84j091j669j874j578j036n38l58n47o36j9J014
$$ 351874 349098 346114 343799 342512 341728 340637 338968 337094 335516 334480 333942 333584 333037 332401 332382 333396
61563C33396J308L58q29j137r07j077j324m85J255K135J231k74q72o11l34l2Q50
$$ 333396 334704 335062 334233 333096 332189 331112 329788 329303 330558 332693 333924 333650 332778 332167 331833 331801 332651
61546C32651K037K565K138J430J057J046J284J757K239K383K257K358K926L580
$$ 332651 334688 337253 339391 340821 341878 342924 344208 345965 348204 350587 352844 355202 358128 361708
61532C61708L807L484K849K178J554Q39j72j428k501l007l022k928k938k943k779
$$ 361708 365515 368999 371848 374026 375580 376419 376247 374819 372318 369311 366289 363361 360423 357480 354701
61517C54701k453k131j940j820j558j071o02m16l42J0O16J024R99P50M47M3k93
$$ 354701 352248 350117 348177 346357 344799 343728 343126 342710 342368 342378 342994 344018 345017 345767 346214 346257 345964
61500C45964j18O04J301J593J721J836J550P16P5L78J217J581J262R91J239J626
$$ 345964 345846 346450 347751 349344 351065 352901 354451 355167 355242 355620 356837 358418 359680 360671 361910 363536
61484C63536J597J050K47m60p34m27K20Q36J279J502J344P85J88r5j81l06l62
$$ 363536 365133 366183 366430 365970 365236 364809 365029 365865 367144 368646 369990 370775 370963 370868 370687 370381 370019
61467C70019k00j42n22r58p95j81L6m90j124j164o78k29j58l49l69J52J075J791
$$ 370019 369819 369677 369155 368197 367402 367221 367257 366767 365643 364479 363801 363572 363414 363065 362696 362848 363923 365714
61449C65714J923J747J613J339Q17P31J778L373M149L743L149L088L143K872K750
$$ 365714 367637 369384 370997 372336 373153 373884 375662 379035 383184 386927 390076 393164 396307 399179 401929
61434D01929L326M141M283L643K959K861L341L961M186L715K799K071J807J731
$$ 401929 405255 409396 413679 417322 420281 423142 426483 430444 434630 438345 441144 443215 445022 446753
61420D46753J688K032K905L641L430K415J497J162R88L88o97j942l153m293n173
$$ 446753 448441 450473 453378 457019 460449 462864 464361 465523 466511 466899 466202 464260 461107 456814 451641
61405D51641n380m727l672l026l156l624l786l500l029k530k038j719j637j425
$$ 451641 446261 441534 437862 434836 431680 428056 424270 420770 417741 415211 413173 411454 409817 408392
61391D08392p47l0j5o01q42k83M53P34Q09J195J788K137K190K117J843J331J041
$$ 408392 407645 407615 407600 406999 406157 405874 406327 407061 407870 409065 410853 412990 415180 417297 419140 420471 421512
61374D21512J525K652L734M263M155L500K542J798J643J872K049K139K400K760
$$ 421512 423037 425689 429423 433686 437841 441341 443883 445681 447324 449196 451245 453384 455784 458544
61360D58544K915K971L429M388N268N615N756O355P511Q658R351R747J0196J0557
$$ 458544 461459 464430 467859 472247 477515 483130 488886 495241 502752 511410 520761 530508 540704 551261
61346E51261J0291R267Q146P592P391O775N534M233L289K501J726J329J416J220
$$ 551261 561552 570819 578965 586557 593948 600723 606257 610490 613779 616280 618006 619335 620751 621971
61332F21971l4j886l075l133k836k975l362l397l060k845k979l116k876k268j543
$$ 621971 621937 620051 616976 613843 611007 608032 604670 601273 598213 595368 592389 589273 586397 584129 582586
61317E82586q17r0M97P26O85Q43J517K481L378M353N731P261Q261Q626Q942R280
$$ 582586 581769 581679 582176 582902 583587 584430 585947 588428 591806 596159 601890 609151 617412 626038 634980 644260
61301F44260Q661O364L184N34j403l613o430q748r493r083q781r037r139q368
$$ 644260 652921 659285 662469 663003 661600 657987 651557 642809 633316 624233 615452 606415 597276 588908
61287E88908o932n549m584l864l214k763k579k273j266N57K667M427N592O287
$$ 588908 581976 576427 571843 567979 564765 562002 559423 557150 555884 556441 559108 563535 569127 575414
61273E75414O727P092P442P690P746P731P843Q004Q050Q213Q907R904J0375J0115
$$ 575414 582141 589233 596675 604365 612111 619842 627685 635689 643739 651952 660859 670763 681138 691253
61259F91253J0073J1066J2493J3038J2278J0792Q988O822M611L057K168J098n34
$$ 691253 701326 712392 724885 737923 750201 760993 769981 776803 781414 784471 786639 787737 787203
61246G87203k002k712l330m861p050q630q968q677q533q530q332p991p804p669
$$ 787203 785201 782489 779159 774298 767248 758618 749650 740973 732440 723910 715578 707587 699783 692114
61232F92114p162o134m965m084l444k677j664p72l88l67j30O00J390J570J039
$$ 692114 684952 678818 673853 669769 666325 663648 661984 661212 660824 660457 660327 660927 662317 663887 664926
61217F64926M26L77R20J554J835J600Q27l75j539j987j522p43l62l43r8N99J393
$$ 664926 665352 665729 666649 668203 670038 671638 672465 672090 670551 668564 667042 666299 665937 665594 665496 666095 667488
61200F67488K074L004M562O633Q890J1216J3484J5256J6159J6296J5930J4978
$$ 667488 669562 672566 677128 683761 692651 703867 717351 732607 748766 765062 780992 795970
61188G95970J3278J1133R097P270N399L596K355J769J269L86p08j726k823m200
$$ 795970 809248 820381 829478 836748 842147 845743 848098 849867 851136 851522 850814 849088 846265 842065
61174H42065n483o060n970n951o546p531q359q842r144r366r441r429r541r793
$$ 842065 836582 830522 824552 818601 812055 804524 796165 787323 778179 768813 759372 749943 740402 730609
61160G30609r875r613r275r139q860p732n636l298j529n01O8M85J043J856K391
$$ 730609 720734 711121 701846 692707 683847 676115 670479 667181 665652 665151 665219 665704 666747 668603 670994
61145F70994J608p87l615n431o216p143q703j0071j0419r958r166p856n755l485
$$ 670994 672602 671815 668200 662769 656553 649410 640707 630636 620217 610259 601093 593237 587482 583997
61131E83997k027j364m66J243L177M524N338O263P577Q992J0285J1578J2996J4449
$$ 583997 581970 580606 580140 581383 584560 589084 594422 600685 608262 617254 627539 639117 652113 666562
61117F66562J5876J7333J8688J9539J9761J9856K0338K0965K1040K0415J9616
$$ 666562 682438 699771 718459 737998 757759 777615 797953 818918 839958 860373 879989
61106H79989J8918J7880J6117J3939J1835R643O836L287o30m530q145j1152j3387
$$ 879989 898907 916787 932904 946843 958678 968321 975157 978444 977814 973284 965139 953987 940600
61093I40600j5126j6693j7968j8668j8955j9190j9250j8710j7677j6756j6155
$$ 940600 925474 908781 890813 872145 853190 834000 814750 796040 778363 761607 745452
61082G45452j5496j4650j3935j3356j2307j0591r006q299q047p268n811m439l568
$$ 745452 729956 715306 701371 688015 675708 665117 656111 647812 639765 632497 626686 622247 618679
61069F18679k729j411J09J169J621J912K357K745K819K884L521M763N945O616
$$ 618679 615950 614539 614648 615817 617438 619350 621707 624452 627271 630155 633676 638439 644384 651000
61055F51000P117P959Q983R674J0041J0652J1898J3683J5741J7704J9084J9769
$$ 651000 658117 666076 675059 684733 694774 705426 717324 731007 746748 764452 783536 803305
61043H03305K0456K1834K3526K4587K4989K5548K6423K6868K6852K7594K9766
$$ 803305 823761 845595 869121 893708 918697 944245 970668 997536 1024388 1051982 1081748
61032A081748L2235L3518L3705L3995L4988L6426L8125M0152M2406M4728M7180
$$ 1081748 1113983 1147501 1181206 1215201 1250189 1286615 1324740 1364892 1407298 1452026 1499206
61021A499206M9574N1350N2538N4213N7246O1346O6302P3215Q3152R5313J08119
$$ 1499206 1548780 1600130 1652668 1706881 1764127 1825473 1891775 1964990 2048142 2143455 2251574
61010B251574J21627J37514J57295J82441K15774K60392L17005L84148M60898
$$ 2251574 2373201 2510715 2668010 2850451 3066225 3326617 3643622 4027770 4488668
61001D488668N47365O43131P48728Q69092J011729J180331J373806J589911J816917
$$ 4488668 5036033 5679164 6427892 7296984 8308713 9489044 10862850 12452761 14269678
60992A4269678K010760K089986J979009J673093J255538Q39451M93632K30642
$$ 14269678 16280438 18370424 20349433 22022526 23278064 24117515 24611147 24841789
60984B4841789N3654j7262J5844P9928N4483j39094m77043q66094j225171j525005
$$ 24841789 24895443 24878181 24894025 24973953 25028436 24889342 24412299 23546205 22321034 20796029
60974B0796029j760839j914880j960376j892492j739941j545528j342761j150065
$$ 20796029 19035190 17120310 15159934 13267442 11527501 9981973 8639212 7489147
60966G489147r76440q25105o94448n81086m83209m00310l31138k73808k27198
$$ 7489147 6512707 5687602 4993154 4412068 3928859 3528549 3197411 2923603 2696405
60957B696405j90565j62149j39371j20285j03965q9790p7240o6196n6737m8558
$$ 2696405 2505840 2343691 2204320 2084035 1980070 1890280 1813040 1746844 1690107 1641549
60947A641549m1205l4746k9745k6505k4600k3202k1738k0247j9066j8139j6777
$$ 1641549 1600344 1565598 1535853 1509348 1484748 1461546 1439808 1419561 1400495 1382356 1365579
60936A365579j4458j1628r179p256n255k997j108n6M53P45N63l87j906l731n974
$$ 1365579 1351121 1339493 1330314 1323058 1317803 1314806 1313698 1313642 1314095 1314840 1315403 1315016 1313110 1309379 1303405
60921A303405q643j1224j3300j5173j7379j9907k2286k4154k5360k5857k5892
$$ 1303405 1294762 1283538 1270238 1255065 1237686 1217779 1195493 1171339 1145979 1120122 1094230
60910A094230k5887k5838k5234k3920k2481k1405k0426j9239j8187j7601j7013
$$ 1094230 1068343 1042505 1017271 993351 970870 949465 929039 909800 891613 874012 856999
60899H56999j5887j4630j4008j3828j3207j1963j0833j0277r946r417q741q070
$$ 856999 841112 826482 812474 798646 785439 773476 762643 752366 742420 733003 724262 716192
60887G16192p410o912o912p422q008q255q066p547o957o730p097p709p998p828
$$ 716192 708782 701870 694958 687536 679528 671273 663207 655660 648703 641973 634876 627167 619169 611341
60873F11341p446p049o765o785p007o906o259n687n736n884n322m392m124m500
$$ 611341 603895 596846 590081 583296 576289 569383 563124 557437 551701 545817 540495 536103 531979 527479
60859E27479m413l384k137j273n86m6k37j207j926j685j090r79j138j003q30j214
$$ 527479 523066 519682 517545 516272 515686 515640 515403 514196 512270 510585 509495 508516 507378 506375 505545 504331
60843E04331j937k244k055j948k219k680l277m156n150n814n920n531m660l363
$$ 504331 502394 500150 498095 496147 493928 491248 487971 483815 478665 472851 466931 461400 456740 453377
60829D53377k024j062m09L05J158J854K187K194K039J977K249K703K748K100J268
$$ 453377 451353 450291 449882 450187 451345 453199 455386 457580 459619 461596 463845 466548 469296 471396 472664
60814D72664R28J008Q72K75m03p56p98p48p80j021j519k190k844l221l050k329
$$ 472664 473592 474600 475472 475747 475344 474588 473790 473042 472262 471241 469722 467532 464688 461467 458417 456088
60798D56088j595j540k214l025l593m061m394m166l425l009l319l505k713j576
$$ 456088 454493 452953 450739 447714 444121 440060 435666 431500 428075 425066 421747 418242 415529 413953
60784D13953j435k503l741m395m584m479l945l148k575k225j585o35j16m61j116
$$ 413953 412518 410015 406274 401879 397295 392816 388871 385723 383148 380923 379338 378703 378587 378126 377010
60769C77010j298q88k02O23J593K583L387L909M090L910L547L284L212L275L563
$$ 377010 375712 374824 374622 375245 376838 379421 382808 386717 390807 394717 398264 401548 404760 408035 411598
60754D11598M159M704M604L758K705J939J473J107P91O01O22Q59R58K79j367l192
$$ 411598 415757 420461 425065 428823 431528 433467 434940 436047 436838 437439 438061 438920 439878 440157 438790 435598
60738D35598m236m527m789n210n276m923m817n268n624n223m293l440k916k751
$$ 435598 431362 426835 422046 416836 411560 406637 401820 396552 390928 385705 381412 377972 375056 372305
60724C72305l090l750l982l275k100j358j275j283q49o2M90K53p70j888k335k067
$$ 372305 369215 365465 361483 358208 356108 354750 353475 352192 351343 351281 351771 352024 351254 349366 347031 344964
60708C44964j612j116j41J419K797L137K451J410N78J68J46J86j16o74q67l13
$$ 344964 343352 342236 342095 343514 346311 349448 351899 353309 353887 354055 354201 354387 354271 353597 352730 352417
60692C52417P07J825L044M213M653L987K885K408K779L375L728L933M257M735
$$ 352417 353124 354949 357993 362206 366859 370846 373731 376139 378918 382293 386021 389954 394211 398946
60678C98946N168N216M724M162M347N305N889N070L189J391K19m99q10o72o44
$$ 398946 404114 409330 414054 418216 422563 427868 433757 438827 442016 443407 443626 443127 442317 441645 441001
60663D41001j517l065m121m104l758l974m572m757m217l263k221j222m58j30o2
$$ 441001 439484 436419 432298 428194 424436 420462 415890 411133 406916 403653 401432 400210 399752 399622 399560
60648C99560K35J008J886K196J630N07o52j677k641l375l542l289l289l783m026
$$ 399560 399795 400803 402689 404885 406515 407022 406370 404693 402052 398677 395135 391846 388557 384774 380748
60633C80748l252j803p40m57l96j4N59J002J275J419J294Q04J07n46r20p59NR38
$$ 380748 377496 375693 374953 374496 374100 374086 374645 375647 376922 378341 379635 380439 380546 380000 379080 378321 378326 379264
60615C79264J377J161P33M88M07M68Q88J658K240K101J348N39J0l68q29j351j613
$$ 379264 380641 381802 382535 383023 383430 383898 384786 386444 388684 390785 392133 392672 392682 392314 391485 390134 388521
60598C88521j350p48l61l75k35O07J657J819R29J32L69J146J360Q08K40J82M32
$$ 388521 387171 386423 386062 385687 385452 386059 387716 389535 390464 390596 390965 392111 393471 394279 394519 394701 395133
60581C95133O01N31K14j35M8J142K625L498L537L556M143M776M717M293M573N946
$$ 395133 395734 396265 396479 396344 396392 397534 400159 403657 407194 410750 414893 419669 424386 428679 433252 439198
60565D39198P644Q762R155R133Q830Q270P722P399O866N328K698Jj647k251k716
$$ 439198 446842 455604 464759 473892 482722 490992 498714 506113 512979 518307 521005 521006 519359 517108 514392
60550E14392l488l910l143j288P79K499M022N522O689P243P598Q531J0280J2334
$$ 514392 510904 506994 503851 502563 503342 505841 509863 515385 522074 529317 536915 545446 555726 568060
60536E68060J4105J5372J6026J5814J4660J2932J1056Q965O242K795q73m058o348
$$ 568060 582165 597537 613563 629377 644037 656969 668025 676990 683232 686027 685154 681096 674748
60523F74748p718q382q596q460p908o953n942n299n079m843m082k671r90L43R33
$$ 674748 667030 658648 650052 641592 633684 626731 620789 615490 610411 605568 601486 598815 597825 598168 599101
60508E99101J059J520K857M799O694Q317R986J2046J4666J8001K2001K6076K9513
$$ 599101 600160 601680 604537 609336 616030 624347 634333 646379 661045 679046 701047 727123 756636
60495G56636L2335L5222L8403M1235M3121M4093M4115M2509L8787L3530K7572
$$ 756636 788971 824193 862596 903831 946952 991045 1035160 1077669 1116456 1149986 1177558
60484A177558K0670J1894J310r705j9933k9280l7926m5224n0082n2024n1502m9383
$$ 1177558 1198228 1210122 1211432 1201727 1181794 1152514 1114588 1069364 1019282 967258 915756 866373
60472H66373m6435m3102l9383l5118l0624k6738k3999k1961j9770j7216j4837
$$ 866373 819938 776836 737453 702335 671711 644973 620974 599013 579243 562027 547190
60461E47190j3061j1777j0771j0081r709r281q364o890n129l405k073j456j509
$$ 547190 534129 522352 511581 501500 491791 482510 474146 467256 462127 458722 456649 455193 453684
60448D53684j712j631j439j524j733j581j141j009j298j302o20J05J03l90o71
$$ 453684 451972 450341 448902 447378 445645 444064 442923 441914 440616 439314 438694 438799 438902 438512 437841
60433D37841p36j019j204m64J002J687N89j424k641k332j113O6O86P78P63J078
$$ 437841 437105 436086 434882 434418 435420 437107 437696 436272 433631 431299 430186 430252 430938 431716 432479 433557
60417D33557J578J537O10m78o52K90J555K332K431K130J801J729J886J825J131
$$ 433557 435135 436672 437282 436804 436152 436442 437997 440329 442760 444890 446691 448420 450306 452131 453262
60402D53262Rp69n87M80J813K784L154L106K898K607K289K240K688L299L415K910
$$ 453262 453271 452502 451915 452395 454208 456992 460146 463252 466150 468757 471046 473286 475974 479273 482688 485598
60386D85598K376K247K251J999J673J652J923K275K704L165L262K807K338K495
$$ 485598 487974 490221 492472 494471 496144 497796 499719 501994 504698 507863 511125 513932 516270 518765
60372E18765L074L316K982K492K086J549Q32L33L52O88R87J140J240J404J694
$$ 518765 521839 525155 528137 530629 532715 534264 535096 535429 535781 536469 537456 538596 539836 541240 542934
60357E42934K067K391K761L576M992O452P176P100O936P316Q195R054R376Q958
$$ 542934 545001 547392 550153 553729 558721 565173 572349 579449 586385 593701 601896 610950 620326 629284
60343F29284P982O792N399L465R45j594l618n252o751p804p947p420o906o612
$$ 629284 637266 644058 649457 652922 653867 652273 648655 643403 636652 628848 620901 613481 606575 599963
60329E99963o213n653n249n106n014m943n002m994m655m230m141m117l450k090
$$ 599963 593750 588097 582848 577742 572728 567785 562783 557789 553134 548904 544763 540646 537196 535106
60315E35106o91M48J687L143M379N227O151P480Q958J0349J1777J3233J4448J5547
$$ 535106 534415 534863 536550 539693 544072 549299 555450 562930 571888 582237 594014 607247 621695 637242
60301F37242J7064J8909K0027J9501J7357J3963R347L678k259p632j2142j5650
$$ 637242 654306 673215 693242 712743 730100 744063 753410 757088 754829 747197 735055 719405
60289G19405j7834j8696j8832j8626j7710j5808j3516j1676j0392r252q125p097
$$ 719405 701571 682875 664043 645417 627707 611899 598383 586707 576315 567063 558938 551841
60277E51841o070n008m251m064m147m133m103m108l726k787k033k168k650k355
$$ 551841 545771 540763 536512 532448 528301 524168 520065 515957 512231 509444 507411 505243 502593 500238
60263E00238j258n07p74j466j687j337q97p20q33j084j215r45j95Q18J595J623
$$ 500238 498980 498473 497699 496233 494546 493209 492312 491592 490759 489675 488460 487515 487320 488138 489733 491356
60247D91356Q84J52K99J089J264K41r75j135m19J04J73M50J163J686J652J522
$$ 491356 492240 492392 492691 493780 495044 495285 494310 493175 492756 492860 493033 493483 494646 496332 497984 499506
60231D99506J710J959J899J756K012K752L583M065M074L892L906M095M042L702
$$ 499506 501216 503175 505074 506830 508842 511594 515177 519242 523316 527208 531114 535209 539251 542953
60217E42953L751M687N897O368O111O068O653P266P398P348P512P669P454O986
$$ 542953 546704 551391 557288 563656 569767 575835 582488 589754 597152 604500 612012 619681 627135 634121
60203F34121O568O195N722N218M809M443M028L513K687J355j49j102j312j425
$$ 634121 640689 646884 652606 657824 662633 667076 671104 674617 677304 678659 678510 677408 676096 674671
60189F74671k053l012l830m418m793m680m014l532m052n287o078n842n121m599
$$ 674671 672618 669606 665776 661358 656565 651885 647871 644339 640287 635000 628922 623080 617959 613360
60175F13360m202l587k960k849l180l168k310j100n13q84j637k045j938j556j093
$$ 613360 609158 605571 602611 599762 596582 593414 591104 590004 589491 588607 586970 584925 582987 581431 580338
60160E80338o90o66j197j845j837j022j44M5k79k91M97J738K680K829K208J278
$$ 580338 579648 578982 577785 575940 574103 573081 572937 572982 572703 572412 572909 574647 577327 580156 582364 583642
60144E83642O12O16J329K512L774M714N073M959M773M829N031M984M489L811L484
$$ 583642 584254 584870 586199 588711 592485 597199 602272 607231 612004 616833 621864 626848 631337 635148 638632
60129F38632L797M441M746M318L452K820K765L027L187L175L207L379L494L339
$$ 638632 642429 646870 651616 655934 659386 662206 664971 667998 671185 674360 677567 680946 684440 687779
60115F87779K943K510K135J775J410J103Q08L26l82j023j337j535k022k701l073
$$ 687779 690722 693232 695367 697142 698552 699655 700463 700789 700407 699384 698047 696512 694490 691789 688716
60100F88716l094l420m411n385n400m531l719l423l138k348j347p06m36j16L84
$$ 688716 685622 682202 677791 672406 667006 662475 658756 655333 652195 649847 648500 647794 647358 647242 647626
60085F47626P70Q13N28r3j130k349l113k961k221j766k124k989l675l918m050
$$ 647626 648396 649209 649737 649644 648514 646165 643052 640091 637870 636104 633980 630991 627316 623398 619348
60070F19348m425m984n400n504n324m960m616m669n289n988n889m707l230k501
$$ 619348 614923 609939 604539 599035 593711 588751 584135 579466 574177 568189 562300 557593 554363 551862
60056E51862k649k817k304j321m96L2N60J073J171Q19O73J339K660M065N258O150
$$ 551862 549213 546396 544092 542771 542275 542307 542867 543940 545111 545930 546603 547942 550602 554667 559925 566075
60040E66075O456N974N115M497M030L068J557L09j52l82j202k545l675m204m426
$$ 566075 572531 578505 583620 588117 592147 595215 596772 597081 596929 596547 595345 592800 589125 584921 580495
60025E80495m766n362o056o508o433n968n586n410m944l846k687k368k968l685
$$ 580495 575729 570367 564311 557803 551370 545402 539816 534406 529462 525616 522929 520561 517593 513908
60011E13908l930l882l884l842l509l051k863k918k658j714n87k25p83j209m64
$$ 513908 509978 506096 502212 498370 494861 491810 488947 486029 483371 481657 481070 480845 480062 478853 478389
59996D78389J033J841J370N80N44J115J609K125L276M879N888N691M799M056L720
$$ 478389 479422 481263 482633 483213 483757 484872 486481 488606 491882 496761 502649 508340 513139 517195 520915
59981E20915L466K915J925O37o14j612k408l040l299l047k585k266j973j429q58
$$ 520915 524381 527296 529221 529858 529244 527632 525224 522184 518885 515838 513253 510987 509014 507585 506727
59966E06727p97j282j774j903j788j504q82LO43P06N14N44P26O11O9l93j83O38
$$ 506727 505930 504648 502874 500971 499183 497679 496797 496800 497443 498149 498663 499207 499933 500544 500613 500220 500037 500675
59948E00675J278J048K60q6L75Q33M32n13r97p48l69k58k04p0q9j81K24J292K302
$$ 500675 501953 503001 503261 503175 503550 504383 504815 504302 503305 502557 502188 501930 501726 501656 501567 501386 501610 502902 505204
59929E05204K594K499K815L651M439M885N328O077O907P461P826Q399R280J0069
$$ 505204 507798 510297 513112 516763 521202 526087 531415 537492 544399 551860 559686 568085 577365 587434
59915E87434J0304R857Q795P229N511M326M004L866K864R07j027k297l252m275
$$ 587434 597738 607595 616390 623619 629130 633456 637460 641326 644190 645097 644070 641773 638521 634246
59901F34246m994n036m798m717m443l569k589k177k006j425q02q92j221n17J228
$$ 634246 629252 624216 619418 614701 610258 606689 604100 601923 599917 598492 597690 596798 595577 595060 596288
59886E96288K592K870K923L535M237M455M552M921N138M819M494M681M900M472
$$ 596288 598880 601750 604673 608208 612445 616900 621452 626373 631511 636330 640824 645505 650405 654877
59872F54877L619K878K037P07o22j176j204j632k608l434l798m067m304l994l070
$$ 654877 658496 661374 663411 664118 663496 662320 661116 659484 656876 653442 649644 645577 641273 637279 634209
59857F34209k316k314k587k300j433o65l77j89L61J191J956K740M046N949P716
$$ 634209 631893 629579 626992 624692 623259 622594 622217 622028 622389 623580 625536 628276 632322 638271 645987
59842F45987Q551Q410P707O544M870L149K066J585J074M58L17O60N60n70k146
$$ 645987 654538 662948 670655 677199 682069 685218 687284 688869 689943 690401 690718 691378 691938 691368 689222
59827F89222l402m389n422o291o753p083p417p196o078m773m010l277j634N38
$$ 689222 685820 681431 676009 669718 662965 655882 648465 641269 635191 630418 626408 623131 621497 622035
59813F22035J818J557M04q60j955k612k531k057j975k446k900l057l212l348k978
$$ 622035 623853 625410 625814 624954 622999 620387 617856 615799 613824 611378 608478 605421 602209 598861 595883
59798E95883k181j857k423l112l110k709k660k914k805k089j180n24k89m89r43
$$ 595883 593702 591845 589422 586310 583200 580491 577831 574917 572112 570023 568843 568319 568030 567541 566598
59783E66598j194r60n68n78j009j300j026l04N24J317K097K802L215L171K794
$$ 566598 565404 564444 563876 563298 562289 560989 559963 559659 560183 561500 563597 566399 569614 572785 575579
59768E75579K500K628L044L306L257L273L731M445M906M947M869M904M892M608
$$ 575579 578079 580707 583751 587057 590314 593587 597318 601763 606669 611616 616485 621389 626281 630889
59754F30889M144L791L674L667L626L505L307L033K671K122J249J94n14m30J66
$$ 630889 635033 638824 642498 646165 649791 653296 656603 659636 662307 664429 665678 665872 665358 664928 665094
59739F65094M33o5q85j290j076n52j14m9n36j343j792j491q72n58m00J82J050
$$ 665094 665527 665462 664577 663287 662211 661659 661545 661496 660960 659617 657825 656334 655462 654904 654504 654686 655736
59722F55736J335P40Q4J74P39R91P58N46P77J418K217K891L138K829K168J571
$$ 655736 657071 657811 657895 658069 658808 659799 660557 661103 661880 663298 665515 668406 671544 674373 676541 678112
59706F78112J394J825K814M039N138O039O854P494P696P463P119O835O465N897
$$ 678112 679506 681331 684145 688184 693322 699361 706215 713709 721405 728868 735987 742822 749287 755184
59692G55184N194M411L641L173L052K603J187o34j544j335j242k066l016l162
$$ 755184 760378 764789 768430 771603 774655 777258 778445 777811 776267 774932 773690 771624 768608 765446
59678G65446k941l303m124m631m810n219n743n771n426n489n981n976n004l722
$$ 765446 762505 759202 755078 750447 745637 740418 734675 728904 723478 717989 712008 706032 701028 697306
59664F97306k801k022r46J68P64R01J254K243L564M556M896M851M865M970M746
$$ 697306 694505 692483 691537 691705 692469 693370 694624 696867 700431 704987 709883 714734 719599 724569 729315
59649G29315L891K584J244R1q68j766k909m508o262p557q296q986r820j0252r865
$$ 729315 733206 735790 737034 737125 736257 734491 731582 727074 720812 713255 704959 695973 686153 675901 666036
59634F66036q996p980o568m747l493l662m597m854m135l491l723m519n252n676
$$ 666036 657040 649060 642492 637745 634252 630590 625993 621139 617004 613513 609790 605271 600019 594343
59620E94343n682n144m290l728l827m438n155n506n067l880k584j705j040l19
$$ 594343 588661 583517 579227 575499 571672 567234 562079 556573 551506 547626 545042 543337 542297 541978
59606E41978N3l29q46n15N36J275J372J434J693J658J305J366K003K267J494L64
$$ 541978 542031 541702 540856 540341 540877 542152 543524 544958 546651 548309 549614 550980 552983 555250 556744 557108
59590E57108m0N07J525K521K995K414Q85o55j453j719k005k347k519k619k856
$$ 557108 557068 557575 559100 561621 564616 567030 567915 567260 565807 564088 562083 559736 557217 554598 551742
59575E51742l143l422l940m733n248n028m443m182m240l986l035j649l61L80M26
$$ 551742 548599 545177 541237 536504 531256 526228 521785 517603 513363 509377 506342 504693 504332 504712 505138
59560E05138J50K58R97J698J544O47n9P0P97J546K136K728L371L897M246M612
$$ 505138 505288 505546 506543 508241 509785 510432 510373 510443 511240 512786 514922 517650 521021 524918 529164 533776
59544E33776N121N575N824O187P134Q592J0137J1906J4523J7599J9154J7397J2721
$$ 533776 538897 544472 550296 556483 563617 572209 582346 594252 608775 626374 645528 662925 675646
59531F75646P205K507r25l025l764l636l387l038k059o47K01J25j02J0j90j330
$$ 675646 682851 685358 684433 681408 677644 674008 670621 667583 665524 664877 665078 665203 665101 665111 664921 663591
59515F63591k880l976m715n815p324q519q867q567q161q027q132q070p471o443
$$ 663591 660711 656735 652020 646205 638881 630362 621495 612928 604767 596740 588608 580538 573067 566624
59501E66624n397m444l400k361j703j406r55j21P52J422K078K740K961K534J941
$$ 566624 561227 556783 553383 551022 549319 547913 546958 546837 547589 549011 551089 553829 556790 559324 561265
59486E61265J718J855K094K339K516K570K712L164L541L324L011L744N418O318
$$ 561265 562983 564838 566932 569271 571787 574357 577069 580233 583774 587098 590109 593853 599271 605589
59472F05589N361L606K677K570K146J063l7q01j391j604r53L35J364J745J997
$$ 605589 610950 614556 617233 619803 621949 623012 622975 622174 620783 619179 618226 618561 619925 621670 623667
59457F23667K685L757M854N722O200O275O209O306O524O569O272N577M391K749
$$ 623667 626352 630109 634963 640685 646885 653160 659369 665675 672199 678768 685040 690617 695008 697757
59443F97757R48p75k519m361n995p062p537p525p014o203n640n569n513m910l910
$$ 697757 698705 697930 695411 691050 685055 677993 670456 662931 655917 649714 644074 638505 632992 628082 624172
59428F24172l022k354j677r27j16J029K769M880O919Q785J0664J2549J4200J5315
$$ 624172 621150 618796 617119 616192 616076 617105 619874 624754 631673 640458 651122 663671 677871 693186
59414F93186J5674J5526J5868J7545J9625J9574J5819R495L016k351o601r587
$$ 693186 708860 724386 740254 757799 777424 796998 812817 822312 825328 822977 816376 806789
59402H06789j0866j0573r214o694k819J309L555K722n81n032r632j3571j6179
$$ 806789 795923 785350 776136 769442 766623 767932 771487 774209 773628 768596 758964 745393 729214
59389G29214j7419j7728j7160j5415j2841j0518q972p581n639l421j688p13j67
$$ 729214 711795 694067 676907 661492 648651 638133 629161 621580 615941 612520 610832 610119 609952
59376F09952M08J294K436L312L460L196L409M378N361N640N459N520O020O599
$$ 609952 610360 611654 614090 617402 620862 624058 627467 631845 637206 642846 648305 653825 659845 666444
59362F66444O949P123P344P844Q731R843J0817J1561J2441J3847J5584J6901J7186
$$ 666444 673393 680516 687860 695704 704435 714278 725095 736656 749097 762944 778528 795429 812615
59349H12615J6635J6162J6534J7540J8249J8100J7386J6529J5362J3576J1444
$$ 812615 829250 845412 861946 879486 897735 915835 933221 949750 965112 978688 990132
59338I90132R449P424M731J245k417n727q689j1320j3307j4413j4888j5141j5321
$$ 990132 999581 1007005 1011736 1012981 1010564 1004837 996148 984828 971521 957108 942220 927079 911758
59325I11758j5365j5256j5033j4635j3905j2806j1559j0529r852r209q224p057
$$ 911758 896393 881137 866104 851469 837564 824758 813199 802670 792818 783609 775385 768328
59313G68328o152n441m391l019k146k172k295j641m85M18J218K666M682O339P205
$$ 768328 762176 756735 752344 749325 747179 745007 742712 741071 740586 741004 742222 744888 749570 755909 763114
59298G63114P784Q574R603J0947J2762J4528J5024J3421R894N041n57o090j0609
$$ 763114 770898 779472 789075 800022 812784 827312 842336 855757 865651 870692 870135 864045 853436
59285H53436j3764j5906j7201j7271j5988j3958j1816r539o925m298k221p39O85
$$ 853436 839672 823766 806565 789294 773306 759348 747532 737993 731068 726770 724549 723810 724495
59272G24495K532M742O731P840P909P446P038O703O045M860L165Q95j843m373
$$ 724495 727027 731769 738500 746340 754249 761695 768733 775436 781481 786341 789506 790401 788558 784185
59258G84185o038p080q203r278r468q728q181q533r040q691p666o835o388n775
$$ 784185 778147 771067 762864 753586 744118 735390 727209 718676 709636 700945 693279 686444 680056 674281
59244F74281m783l797l070k329j288j7J275K531L662M316M021K736J166K82L88
$$ 674281 669498 665701 662631 660302 659014 658997 660272 662803 666465 670781 674802 677538 678704 678986 679374
59229F79374Q33Q20L11k66q68j857l197m303m717m504l875l006k264k050k106
$$ 679374 680207 681027 681338 681072 680204 678347 675150 670847 666130 661626 657751 654745 652481 650431 648325
59214F48325j644m48O17O59o4m81j6R00J566J893K428L583N020N940O087O033
$$ 648325 646681 646233 646850 647509 647445 646964 646948 647848 649414 651307 653735 657318 662338 668278 674365 680398
59198F80398O291O478N910M754L933L926M294M473M372M097L637L033K407J685
$$ 680398 686689 693167 699077 703831 707764 711690 715984 720457 724829 728926 732563 735596 738003 739688
59184G39688P77%k19j21l53r02j071p01n57j058j506j163m26j25j98J51J264K690
$$ 739688 740465 740465 740246 740125 739772 738870 737799 737098 736541 735483 733977 732814 732388 732263 732065 732216 733480 736170
59166G36170L903M738N233N549N981O585O873O339N182M116L439K727J488k25
$$ 736170 740073 744811 750044 755593 761574 768159 775032 781371 786553 790669 794108 796835 798323 798098
59152G98098j993l516m662n251n121m476l892l752l859l857l948m641n803o574
$$ 798098 796105 792589 787927 782676 777555 773079 769187 765435 761576 757719 753771 749130 743327 736753
59138G36753o512o213o286o375n848m996m645m868m969m614m052l303k127p89
$$ 736753 730241 724028 717742 711367 705519 700523 695878 691010 686041 681427 677375 674072 671945 671156
59124F71156O6N35J416K926M350N340O472Q090R516J0084J0220J0720J1567J2109
$$ 671156 671222 671757 673173 676099 680449 685789 692261 700351 709867 719951 730171 740891 752458 764567
59110G64567J2019J1458J0645R845R393R288R051Q329P323O299N140L731K361
$$ 764567 776586 788044 798689 808534 817927 827215 836266 844595 851918 858217 863357 867088 869449
59097H69449J339O10Pm77r82j813k868l549l580l388l351l289l110l310m274n558
$$ 869449 870788 871398 871405 870928 869946 868133 865265 861716 858136 854748 851397 848108 844998 841688 837414 831856
59081H31856o508p135p872q838r809j0577j0877j0446r567r004q941q539p154
$$ 831856 825348 818213 810341 801503 791694 781117 770240 759794 750227 741223 732282 723743 716589
59068G16589n483m748n208o103o734o878o493n751n186n147n244m883m136l524
$$ 716589 711106 706358 701150 695047 688313 681435 674942 669191 664005 658858 653614 648731 644595 641071
59054F41071l224l029k891k873k744k244j633j392j464j332p90j95O4l2k26j95
$$ 641071 637847 634818 631927 629054 626310 624066 622433 621041 619577 618245 617455 617260 617324 617292 617066 616871
59038F16871K67R87J528J708J775J931K050K116K499L472M837O337Q010R791J1261
$$ 616871 617138 618125 619653 621361 623136 625067 627117 629233 631732 635204 640041 646378 654388 664179 675440
59023F75440J2173J2830J3587J4400J5135J5648J5282J3119R343N548L035J451
$$ 675440 687613 700443 714030 728430 743565 759213 774495 787614 796957 802505 805540 806991
59011H06991q5j449k051k184k526k791k114n74Q36J695K450L361M167M781N250
$$ 806991 806906 805457 803406 801222 798696 795905 793791 793217 794053 795748 798198 801559 805726 810507 815757
58996H15757N063L620J411l45j363k543m331o016p024p818q902r782r681q629
$$ 815757 820820 824440 825851 825506 824143 821600 817269 811253 804229 796411 787509 777727 768046 759417
58982G59417p243n920m798m003l414k464p85J222K821L778M429N167O144P349
$$ 759417 752174 746254 741456 737453 734039 731575 730790 732012 734833 738611 743040 748207 754351 761700
58968G61700Q587R520R876R635Q934P973P020O248N478M319K662Q33q56k461m219
$$ 761700 770287 779807 789683 799318 808252 816225 823245 829493 834971 839290 841952 842785 841929 839468 835249
58953H35249o176q148r976j1617j2992j3849j3916j3242j2275j1370j0333q783
$$ 835249 829073 820925 810949 799332 786340 772491 758575 745333 733058 721688 711355 702572
58941G02572o891n368m530l943l212k594k460k575k434k020j744j807k087k485
$$ 702572 695681 690313 685783 681840 678628 676034 673574 670999 668565 666545 664801 662994 660907 658422
58927F58422k959l351l515l529l522l484l411l279k772j478L14J607J833J544
$$ 658422 655463 652112 648597 645068 641546 638062 634651 631372 628600 627122 627436 629043 630876 632420
58913F32420J490J638J629J599J852K274K832M090O359Q756J0115J0468J0731
$$ 632420 633910 635548 637177 638776 640628 642902 645734 649824 656183 664939 675054 685522 696253
58900F96253J1222J1635J2174J3357J4668J4715J3115J1199J0358J0627J1297
$$ 696253 707475 719110 731284 744641 759309 774024 787139 798338 808696 819323 830620
58889H30620J2068J2953J3759J4314J4787J5162J4819J3188J0612Q085O127M418
$$ 830620 842688 855641 869400 883714 898501 913663 928482 941670 952282 960367 966494 970912
58877I70912K444J79k056m089o015p757q971r584j0107j0918j1479j0996r788
$$ 970912 973356 973535 971479 967390 961375 953618 944647 935063 924956 914038 902559 891563 881775
58864H81775r089r291r464r040q862r718j0823j0896j0083r628j0014j0598j0828
$$ 881775 872686 863395 853931 844891 836029 826311 815488 804592 794509 784881 774867 764269 753441
58851G53441j0704j0213r349q605q480q632q363p775p497p472p159o705o748p103
$$ 753441 742737 732524 723175 714570 706090 697458 689095 681320 673823 666351 659192 652487 645739 638636
58837F38636o863n967n392n562n698n150m292l634l027k237j506j017m50M63J423
$$ 638636 631773 625806 620414 614852 609154 604004 599712 596078 593051 590814 589308 588291 587841 588304 589727
58822E89727J963J951J588J340J778K865L582L070J974J692K355K762K332J864
$$ 589727 591690 593641 595229 596569 598347 601212 604794 607864 609838 611530 613885 616647 618979 620843
58808F20843J928J873J080J40o0L47N36R6p77j665k052j611p86n38j174j961k232
$$ 620843 622771 624644 625724 625864 625804 626151 626687 626783 626006 624341 622289 620678 619892 619354 618180 616219 613987
58791F13987k176k164j962j184K6J200K106K788L475M519N972P147P270O580O096
$$ 613987 611811 609647 607685 606501 606527 607727 609833 612621 616096 620615 626587 633734 641004 647584 653680
58776F53680O184O240N830N152M177K401q7k317l723m810o057p088p516p723q089
$$ 653680 659864 666104 671934 677086 681263 683664 683577 681260 677537 672727 666670 659582 652066 644343 636254
58761F36254q288p933p230o369n094l411j989j152l68O45J202Q56M11P54J465
$$ 636254 627966 620033 612803 606434 601340 597929 595940 594788 594420 595065 596267 597123 597534 598288 599753
58746E99753J686J689K358L605M536M897N258N826O226O399O741P266P480P237
$$ 599753 601439 603128 605486 609091 613627 618524 623782 629608 635834 642233 648974 656240 663720 670957
58732F70957O974O919O701O024N192M719M716M850M711M119L211K300J540Q84
$$ 670957 677931 684850 691551 697575 702767 707486 712202 717052 721763 725882 729093 731393 732933 733817
58718G33817M18M26J006J821K500K970L216L009K236J228M18k67j376l285n721
$$ 733817 734235 734661 735667 737488 739988 742958 746174 749183 751419 752647 753065 752798 751422 748137 742416
58703G42416p989r649j0983j2521j4084j4776j4234j3399j3335j3785j3675j2757
$$ 742416 734427 724778 713795 701274 687190 672414 658180 644781 631446 617661 603986 591229
58691E91229j1725j0855r686q155o899o188n548m796m411m460m169l154k173j986
$$ 591229 579504 568649 558963 550808 543909 537721 532173 527377 522966 518506 514337 511183 509010 507024
58677E07024k253k164j523o18L76J290J868K300L274N001O731P694Q001Q231Q678
$$ 507024 504771 502607 501084 500466 500842 502132 504000 506300 509574 514575 521306 529000 537001 545232 553910
58662E53910R326R892R583P593M242R17j452l143m598n579n894n998o280o472
$$ 553910 563236 573128 582711 590304 594546 595463 594011 590868 586270 580691 574797 568799 562519 556047
58648E56047o283n906n376m365l107k570l042l498l075k286j964j939j575q36
$$ 556047 549764 543858 538482 534117 531010 528440 525398 521900 518825 516539 514575 512636 511061 510225
58634E10225K3J034J953J979R83J78N66J468J595Q67J02m38r64j169m92Q58K133
$$ 510225 510248 511282 513235 515214 516197 516375 516941 518409 520004 520871 520973 520535 519571 518402 517910 518768 520901
58617E20901L065L851M496M915N351N856N875N037L939L415L415L313K860K148
$$ 520901 523966 527817 532313 537228 542579 548435 554310 559347 563286 566701 570116 573429 576289 578437
58603E78437J215L40J43O95J172J006O78P06P83O91J067K174K981K662K190L060
$$ 578437 579652 579992 580135 580830 582002 583008 583686 584392 585175 585866 586933 589107 592088 594750 596940 600000
58587F00000N132P060Q289R192R769R661R127Q755Q430P756P136P235P759P960
$$ 600000 605132 612192 620481 629673 639442 649103 658230 666985 675415 683171 690307 697542 705301 713261
58573G13261P962Q386R040R319R567J0674J2580J4442J6078J7906J9690K0781
$$ 713261 721223 729609 738649 747968 757535 768209 780789 795231 811309 829215 848905 869686
58561H69686K1456K2585K3933K4191K2823K0570J7991J4761J0776O761L360N06
$$ 869686 891142 913727 937660 961851 984674 1005244 1023235 1037996 1048772 1055533 1058893 1059399
58549A059399j983l980n433o546p462q355r708j1767j3882j5233j6100j7583k0013
$$ 1059399 1057416 1053436 1048003 1041457 1033995 1025640 1015932 1004165 990283 975050 958950 941367 921354
58536I21354k2536k4177k4623k3962k2462k0573j8577j6343j3890j1844j0631
$$ 921354 898818 874641 850018 826056 803594 783021 764444 748101 734211 722367 711736
58525G11736r642q029n888l958k515j390o76n16n87n54o05q17o86p0J58n28j106
$$ 711736 702094 694065 688177 684219 681704 680314 679638 679122 678535 677981 677376 676559 675873 675803 675961 675433 674327
58508F74327m73N82L51j259k608k543j435k18M81L91j79l55K18P85P44P35J475
$$ 674327 673854 674436 674787 673528 670920 668377 666942 666724 667205 667596 667417 667062 667280 668065 668809 669544 671019
58491F71019K422K860L361M686O204O976P666R472J1936J3661J4658J5958J7396
$$ 671019 673441 676301 679662 684348 690552 697528 705194 714666 726602 740263 754921 770879 788275
58478G88275J7882J7498J7222J6846J5243J2538R856P013K720k796p507j0272
$$ 788275 806157 823655 840877 857723 872966 885504 895360 902373 905093 902297 894790 884518
58466H84518j1762j2567j2427j1630j1107j0646q943n824k594K16L487P428J0759
$$ 884518 872756 860189 847762 836132 825025 814379 805436 799612 797018 797234 800721 808149 818908
58453H18908J2544J3060J2429J0243P035M252K131n98m279p559r566j1031j2429
$$ 818908 831452 844512 856941 867184 874219 878471 880602 880004 875725 868166 858600 847569 835140
58440H35140j2958j2167j0892r626p728n066k725j194M52K642M253M626M983O617
$$ 835140 822182 810015 799123 789497 781769 776703 773978 772784 773236 775878 780131 784757 789740 796357
58426G96357Q969J0721J1558J1809J1455J0568R722Q996P483M620J123k047m702
$$ 796357 805326 816047 827605 839414 850869 861437 871159 880155 887638 892258 893381 891334 886632
58413H86632o914q459r353j0010j0411j0091r187q461q021p237o051n108m441
$$ 886632 879718 871259 861906 851896 841485 831394 822207 813746 805725 798488 792437 787329 782888
58400G82888l446k259j650j413n48Q03J363R21O38P89K24j393k800l254l565m226
$$ 782888 779442 777183 775533 774120 773572 774375 775738 776659 777297 778086 778310 776917 774117 770863 767298 763072
58384G63072m273k852l36K836O777J0982J4158J5785J6365J5790J3426J0168Q270
$$ 763072 758799 755947 755611 758447 765224 776206 790364 806149 822514 838304 851730 861898 870168
58371H70168Q478R301R711J0395J1662J2336J1810J1120J1083J1262J1552J2632
$$ 870168 878646 887947 897658 908053 919715 932051 943861 954981 966064 977326 988878 1001510
58359A001510J4083J4201J2634J1033J0249R172P257N735N231M571L183K294K578
$$ 1001510 1015593 1029794 1042428 1053461 1063710 1072882 1080139 1085874 1091105 1095676 1098859 1101153 1103731
58346A103731K975L063M056O159P535P467P879J0073J2450J3349J3653J4635J5585
$$ 1103731 1106706 1109769 1113825 1119984 1127519 1134986 1142865 1152938 1165388 1178737 1192390 1207025 1222610
58333A222610J5668J5863J6906J7361J5928J3734J2370J1395R777Q012O851N635
$$ 1222610 1238278 1254141 1271047 1288408 1304336 1318070 1330440 1341835 1351612 1359624 1366475 1372110
58321A372110L744K124J728K065K633L943N877P080P253P845R274J0040R829J0625
$$ 1372110 1375854 1377978 1379706 1381771 1384404 1388347 1394224 1401304 1408557 1416402 1425676 1435716 1445545 1456170
58307A456170J3179J5356J5772J6065J7580J8914J8925J9080K0451K1402K0765
$$ 1456170 1469349 1484705 1500477 1516542 1534122 1553036 1571961 1591041 1611492 1632894 1653659
58296A653659K0301K1423K2484K2024K1632K2785K3925K3663K3814K5970K8109
$$ 1653659 1673960 1695383 1717867 1739891 1761523 1784308 1808233 1831896 1855710 1881680 1909789
58285A909789K8012K7278K8330L0185L0782L1011L2728L5126L6616L8138M1204
$$ 1909789 1937801 1965079 1993409 2023594 2054376 2085387 2118115 2153241 2189857 2227995 2269199
58274B269199M4840M7670N0592N4295N6738N6514N5997N7770O0603O2264O3480
$$ 2269199 2314039 2361709 2412301 2466596 2523334 2579848 2635845 2693615 2754218 2816482 2879962
58263B879962O5691O7850O8927P0480P3344P5072P4239P3583P5171P6464P5337
$$ 2879962 2945653 3013503 3082430 3152910 3226254 3301326 3375565 3449148 3524319 3600783 3676120
58252C676120P4669P7392Q1212Q3312Q5966R2051R9188J04083J08706J16142J24297
$$ 3676120 3750789 3828181 3909393 3992705 4078671 4170722 4269910 4373993 4482699 4598841 4723138
58241D723138J29934J35141J43416J53119J61157J69396J80860J93470K04149
$$ 4723138 4853072 4988213 5131629 5284748 5445905 5615301 5796161 5989631 6193780
58232F193780K15158K29610K45082K58606K73321K92866L14164L33461L54179
$$ 6193780 6408938 6638548 6883630 7142236 7415557 7708423 8022587 8356048 8710227
58223H710227L80664M09935M38326M70154N10342N55040N99750O49848P11992
$$ 8710227 9090891 9500826 9939152 10409306 10919648 11474688 12074438 12724286 13436278
58214A3436278P82447Q56117R39532J041795J160836J293049J448185J639458
$$ 13436278 14218725 15074842 16014374 17056169 18217005 19510054 20958239 22597697
58206B2597697J868761K139559K474854K903721L441809M106363M934956N958508
$$ 22597697 24466458 26606017 29080871 31984592 35426401 39532764 44467720 50426228
58198E0426228P164497Q516382J0001278J1633500J3433854J5445346J7742909
$$ 50426228 57590725 66107107 76108385 87741885 101175739 116621085 134363994
58191A34363994K0367906K3262046K6290293K9208308L1404993L1705426K8794740
$$ 134363994 154731900 177993946 204284239 233492547 264897540 296602966 325397706
58184C25397706K2207083J2929461K848168o459267j4336316k0624361k5033018
$$ 325397706 347604789 360534250 363382418 356923151 342586835 321962474 296929456
58177B96929456k7184267k7141627k5604237k3485201k1384230j9471107j7718926
$$ 296929456 269745189 242603562 216999325 193514124 172129894 152658787 134939861
58170A34939861j6111172j4651386j3295688j1956134j0574976r177516p847245
$$ 134939861 118828689 104177303 90881615 78925481 68350505 59172989 51325744
58163E1325744o656897n629341m754509m019465l410685k904270k474671k110204
$$ 51325744 44668847 39039506 34284997 30265532 26854847 23950577 21475906 19365702
58155A9365702j808062j559073j349483j173229j029823r13051q13036p27104
$$ 19365702 17557640 15998567 14649084 13475855 12446032 11532981 10719945 9992841
58147I992841o57769o01790n51274n03911m62625m26511l91049l56156l25431
$$ 9992841 9335072 8733282 8182008 7678097 7215472 6788961 6397912 6041756 5716325
58138E716325k98336k71084k44272k22079k04853j89536j76292j67600j62003
$$ 5716325 5417989 5146905 4902633 4680554 4475701 4286165 4109873 3942273 3780270
58129C780270j55575j48513j43619j39594j32662j23681j16768j11777j05013
$$ 3780270 3624695 3476182 3332563 3192969 3060307 2936626 2819858 2708081 2603068
58120B603068r6619r0440q6817q2214p6072p1641o9624o6989o2685n9033n6845
$$ 2603068 2506449 2416009 2329192 2246978 2170906 2099265 2029641 1962652 1899967 1840934 1784089
58109A784089n4241n0840m8373m6819m4449m1769m0904m1059l9227l5411l2590
$$ 1784089 1729848 1679008 1630635 1583816 1539367 1497598 1456694 1415635 1376408 1340997 1308407
58098A308407l1472k9824k7123k5270k4436k2632j9808j8108j7713j6525j4375
$$ 1308407 1276935 1247111 1219988 1194718 1170282 1147650 1127842 1109734 1092021 1075496 1061121
58087A061121j3404j3935j3996j3352j3927j5671j6156j4941j4475j5752j6871
$$ 1061121 1047717 1033782 1019786 1006434 992507 976836 960680 945739 931264 915512 898641
58076H98641j6760j6786j7591j7711j6514j5393j5025j4282j2804j1948j2293
$$ 898641 881881 865095 847504 829793 813279 797886 782861 768579 755775 743827 731534
58065G31534j2640j2234j1654j1083r963q658q224q438q272q069q831r774r325
$$ 731534 718894 706660 695006 683923 673960 665302 657078 648640 640368 632299 623468 613694 604369
58052F04369q123q098q975q796p632p350p878p256n498m785n495n643m722m511
$$ 604369 596246 588148 579173 570377 562745 555395 547517 540261 534763 529978 524483 518840 514118 509607
58038E09607n375n406m194l861n126n783m580l449m194n778o661p207q097q526
$$ 509607 504232 498826 494632 490771 485645 479862 475282 471833 467639 461861 455200 447993 439896 431370
58024D31370p751o549n818n355n057n424o067n711m441l905m465m429k982j578
$$ 431370 423619 417070 411252 405897 400840 395416 389349 383638 379197 375292 370827 366398 363416 361838
58010C61838j400j569j029k35J52M12P10O59O88J865L766M592M057L860M656N072
$$ 361838 360438 358869 357840 357605 357757 358169 358879 359538 360226 362091 365857 370449 374506 378366 383022 388094
57994C88094M638M961O678P845P007N446M641L672J159k056m210n119n553n477
$$ 388094 392732 397693 404371 412216 419223 424669 429310 432982 434141 432085 427875 422756 417203 411726
57980D11726m659l901m000m401m194l544l079k840k769l116l487k795j045J70
$$ 411726 407067 403166 399166 394765 390571 387027 383948 381108 378339 375223 371736 368941 367896 368066
57966C68066j74j183j715j905k116j950j365j245j839k064j478j359k608m048
$$ 368066 367892 366709 364994 363089 360973 359023 357658 356413 354574 352510 351032 349673 347065 343017
57952C43017m145l134k126j392o96j60L57J502L052L664L016K706L892N569O505
$$ 343017 338872 335738 333612 332220 331524 331364 331721 333223 336275 339939 342955 345661 349553 355122 361627
57937C61627P213Q549R847J0171J0107J0605J1099J0494R022P528N879L683J577
$$ 361627 368840 377389 387236 397407 407514 418119 429218 439712 448734 456262 462141 465824 467401
57924D67401K04j191l587o349q184r066r694r802q690o851n424m498l458k434
$$ 467401 467605 466414 462827 456478 448294 439228 429534 419732 411042 404191 398767 394269 390811 388377
57910C88377j938j598q18k11q22k251l102l119l302m074m715m731m528m499m472
$$ 388377 386439 384841 384023 383812 382990 380739 377637 374518 371216 367142 362427 357696 353168 348669 344197
57895C44197m202l657k777j583l73O43J652K685L294L266L033K810K137R95L49
$$ 344197 339995 336338 333561 331978 331605 332248 333900 336585 339879 343145 346178 348988 351125 352120 352469
57880C52469P07J010K01j074j545j422j855k929l608l447k960k410j520l17Q17
$$ 352469 353176 354186 354387 353313 351768 350346 348491 345562 341954 338507 335547 333137 331617 331300 332117
57865C32117J934L361M816N592N528N103M725M672N276O400P089O573N284M131
$$ 332117 334051 337412 342228 347820 353348 358451 363176 367848 373124 379524 386613 393186 398470 402601
57851D02601L280K526K180K439K371Q87j586l514m307m794n735o903p664p629
$$ 402601 405881 408407 410587 413026 415397 416284 414698 411184 406877 402083 396348 389445 381781 374152
57837C74152o751n479m676m684m755m149l266k866k697k016r96l78l8P66J865
$$ 374152 367401 361922 357246 352562 347807 343658 340392 337526 334829 332813 331817 331439 331401 332167 334032
57822C34032K215J598J001J122J563J777J766J579R43j66j256j878k040k055k405
$$ 334032 336247 337845 338846 339968 341531 343308 345074 346653 347596 347430 346174 344296 342256 340201 337796
57807C37796l553n217o234n866m951m785n172m791l341k004j582j447p83J76P66
$$ 337796 334243 329026 322792 316926 311975 307190 302018 297227 293886 291882 290300 288853 288070 288246 289012
57792B89012R44J123J462J835K150K410K806L785N549P405Q181P540O389N775
$$ 289012 289956 291079 292541 294376 296526 298936 301742 305527 311076 318481 326662 334202 340591 346366
57778C46366N815N917N635N051M523M269M071L484K323Q41o96k285l771m697n042
$$ 346366 352181 358098 363733 368784 373307 377576 381647 385131 387454 388295 387599 385314 381543 376846 371804
57763C71804n627p098q803r383q416o826n795n694o042n998m976l215j557m45
$$ 371804 366177 359079 350276 340893 332477 325651 319856 314162 308120 302122 297146 293931 292374 291929
57749B91929M95J592K422K548K368K541K950L057K825K574K273J832J620J887
$$ 291929 292424 294016 296438 298986 301354 303895 306845 309902 312727 315301 317574 319406 321026 322913
57735C22913K067J652J306J950L065L172J930M98k24n45r23j159j043q73r29j092
$$ 322913 324980 326632 327938 329888 332953 336125 338055 338553 338329 337784 336861 335702 334659 333786 332857 331765
57719C31765j266j506j633j417j207j589k331k499j841j186j290k023k876l516
$$ 331765 330499 328993 327360 325943 324736 323147 320816 318317 316476 315290 314000 311977 309101 305585
57705C05585l663l185k516k199j934r84L40P34j75j022n11Q51J578J093m5j191
$$ 305585 301922 298737 296221 294022 292088 291104 291444 292178 292003 290981 290470 291321 292899 293992 293947 292756
57689B92756k054k371j995j258p55p45j017j184q33M07K579N277Q001J0628J3356
$$ 292756 290702 288331 286336 285078 284323 283578 282561 281377 280544 280951 283530 288807 296808 307436 320792
57674C20792J6418J9883K3651K7530L1471L5767M0825M6544N1837N4626N2483
$$ 320792 337210 357093 380744 408274 439745 475512 516337 562881 614718 669344 721827
57663G21827M3899K9507J1955n776k1804l5101m4664m9719n0541m8358m4428l9620
$$ 721827 765726 795233 807188 801412 779608 744507 699843 650124 599583 551225 506797 467177
57651D67177l4574k9659k4910k0442j6677j3697j0907q030n926n329n330m308
$$ 467177 432603 402944 378034 357592 340915 327218 316311 308281 302355 297026 291696 287388
57639B87388k208n41j78m49o26q91j326j294n53L4k75r63j138q46o99p46o14l85
$$ 287388 285180 284639 284461 284012 283386 282495 281169 279875 279322 279356 279081 278118 276980 276134 275435 274689 274075 273690
57621B73690n73j297k041k294k034j615j393j392j304r38n36l85l58k75l88r20
$$ 273690 273117 271820 269779 267485 265451 263836 262443 261051 259747 258809 258273 257888 257530 257255 256867 255947
57605B55947j286p85J37K93m20p83j76M17jq67j001m40k18p04j134q01J6M61K5
$$ 255947 254661 253876 254013 254306 253886 253103 252927 253344 253343 252476 251475 251035 250817 250113 248979 248178 248194 248655 248680
57586B48680r84j664j312j82P14O78m6q02j286j559j679j676j658j717j834k041
$$ 248680 247696 246032 244720 244538 245252 245930 245884 245082 243796 242237 240558 238882 237224 235507 233673 231632
57570B31632k387k717k716k366k019j925j909j698j260p28k64p4k59n44m23K79
$$ 231632 229245 226528 223812 221446 219427 217502 215593 213895 212635 211907 211643 211569 211310 210766 210343 210622
57554B10622J159J660J623J502J962L124M068L645J931L91J29O66J016J229J872
$$ 210622 211781 213441 215064 216566 218528 221652 225720 229365 231296 231687 231816 232482 233498 234727 236599
57539B36599K648K717K129J726J730J572J043N04k2p82j279o59P80J709J617J346
$$ 236599 239247 241964 244093 245819 247549 249121 250164 250668 250646 249864 248585 247926 248706 250415 252032 253378
57523B53378J487J591J323J181J522K004K419K956L293K738J683J489K335K696
$$ 253378 254865 256456 257779 258960 260482 262486 264905 267861 271154 273892 275575 277064 279399 282095
57509B82095J777Q67J235K121K133J439J075J117J016R17J183J213K94r62j397
$$ 282095 283872 284739 285974 288095 290228 291667 292742 293859 294875 295792 296975 298188 298482 297520 296123
57494B96123j104j045j265r38m5M51J46l24m73n36o60n41o2L97N78O77Q80J058
$$ 296123 295019 293974 292709 291771 291726 292177 292323 291999 291526 290990 290330 289789 289727 290124 290702 291379 292259 293317
57476B93317J034Q54P87J165J972K450J741J62q29l90P57J578K034K417K449K038
$$ 293317 294351 295205 295992 297157 299129 301579 303320 303482 302653 302263 303020 304598 306632 309049 311498 313536
57460C13536K014K945L883L625K579J998J892J247P0l78N37K026L156L695L614
$$ 313536 315550 318495 322378 326003 328582 330580 332472 333719 333789 333411 333948 335974 339130 342825 346439
57445C46439K903K183K316L124L429K741J942J996K795L615M013L970L719L690
$$ 346439 349342 351525 353841 356965 360394 363135 365077 367073 369868 373483 377496 381466 385185 388875
57431C88875M100M530M458M116M139M482M460L956L692M144M856N081M561L620
$$ 388875 392975 397505 401963 406079 410218 414700 419160 423116 426808 430952 435808 440889 445450 449070
57417D49070K931L198M409N490N344M200L278L252L762M238M433M192L621L330
$$ 449070 452001 455199 459608 465098 470442 474642 477920 481172 484934 489172 493605 497797 501418 504748
57403E04748L745M263M023L355L379M277N108N422N779O409O699O463O470P116
$$ 504748 508493 512756 516779 520134 523513 527790 532898 538320 544099 550508 557207 563670 570140 577256
57389E77256P622P323O788O857P372P735Q038Q712R493R688R252Q827Q770Q762
$$ 577256 584878 592201 598989 605846 613218 620953 628991 637703 647196 656884 666136 674963 683733 692495
57375F92495Q453P993P809Q027Q234P897P059O392O337O471O180N656N576N959
$$ 692495 700948 708941 716750 724777 733011 740908 747967 754359 760696 767167 773347 779003 784579 790538
57361G90538O148N924N891O536P582Q414Q660Q272P658P714R007J0884J2097J2336
$$ 790538 796686 802610 808501 815037 822619 831033 839693 847965 855623 863337 872344 883228 895325 907661
57347I07661J2382J2759J3127J3188J3160J3114J2785J2325J2331J2738J2686
$$ 907661 920043 932802 945929 959117 972277 985391 998176 1010501 1022832 1035570 1048256
57336A048256J1930J1335J1462J1685J1451J1368J2140J3305J4028J4487J5369
$$ 1048256 1060186 1071521 1082983 1094668 1106119 1117487 1129627 1142932 1156960 1171447 1186816
57325A186816J6485J7009J6815J6604J6857J7492J8360J9296J9840J9718J9493
$$ 1186816 1203301 1220310 1237125 1253729 1270586 1288078 1306438 1325734 1345574 1365292 1384785
57314A384785J9919K0725K0910K0258J9747K0135K0958K1370K1394K1735K2605
$$ 1384785 1404704 1425429 1446339 1466597 1486344 1506479 1527437 1548807 1570201 1591936 1614541
57303A614541K3360K3415K3084K3159K3851K4486K4437K3892K3498K3551K4008
$$ 1614541 1637901 1661316 1684400 1707559 1731410 1755896 1780333 1804225 1827723 1851274 1875282
57292A875282K4958K6413K7713K7963K7237K6661K6979K7746K8281K8773K9749
$$ 1875282 1900240 1926653 1954366 1982329 2009566 2036227 2063206 2090952 2119233 2148006 2177755
57281B177755L0997L1746L1786L1774L2399L3716L5233L6383L6830L6637L6186
$$ 2177755 2208752 2240498 2272284 2304058 2336457 2370173 2405406 2441789 2478619 2515256 2551442
57270B551442L5832L5596L5254L4698L4132L3980L4449L5148L5353L4896L4543
$$ 2551442 2587274 2622870 2658124 2692822 2726954 2760934 2795383 2830531 2865884 2900780 2935323
57259B935323L5148L6568L7901L8646L9073L9581M0220M0927M1617M2084M2297
$$ 2935323 2970471 3007039 3044940 3083586 3122659 3162240 3202460 3243387 3285004 3327088 3369385
57248C369385M2790M4020M5374M5645M4639M3480M3007M2754M2010M0983M0243
$$ 3369385 3412175 3456195 3501569 3547214 3591853 3635333 3678340 3721094 3763104 3804087 3844330
57237C844330L9668L8811L7941L7865L8869M0450M2068M3652M5309M6904M8079
$$ 3844330 3883998 3922809 3960750 3998615 4037484 4077934 4120002 4163654 4208963 4255867 4303946
57226D303946M8634M8829M9229N0070N0871N1027N0563M9986M9478M8825M7969
$$ 4303946 4352580 4401409 4450638 4500708 4551579 4602606 4653169 4703155 4752633 4801458 4849427
57215D849427M7033M5738M3576M0640L7671L5145L2936L0960K9381K8048K6499
$$ 4849427 4896460 4942198 4985774 5026414 5064085 5099230 5132166 5163126 5192507 5220555 5247054
57204E247054K4794K3615K3262K3292K3339K3556K3960K4212K4360K4952K6045
$$ 5247054 5271848 5295463 5318725 5342017 5365356 5388912 5412872 5437084 5461444 5486396 5512441
57193E512441K6865K6922K6677K6687K6854K6869K6681K6114K4947K3666K3176
$$ 5512441 5539306 5566228 5592905 5619592 5646446 5673315 5699996 5726110 5751057 5774723 5797899
57182E797899K3261K2528K0394J7964J6226J4626J2480J0531R810R849R448Q493
$$ 5797899 5821160 5843688 5864082 5882046 5898272 5912898 5925378 5935909 5945719 5955568 5965016 5973509
57170E973509P714P198O521N883N771N822N381M846N208O373P238P414P619Q272
$$ 5973509 5981223 5988421 5994942 6000825 6006596 6012418 6017799 6022645 6027853 6034226 6041464 6048878 6056497 6064769
57156F064769Q817Q661P945P089O231N264L853J448k104o071r530j2421j5312
$$ 6064769 6073586 6082247 6090192 6097281 6103512 6108776 6112629 6114077 6111973 6105902 6096372 6083951 6068639
57143F068639j8337k1029k3060k4457k5194k5062k3886k1372j7157j1571o132
$$ 6068639 6050302 6029273 6006213 5981756 5956562 5931500 5907614 5886242 5869085 5857514 5851382
57132E851382k677k176m692r851j6804k4372l2033m0120m8329n4785n7621n6864
$$ 5851382 5848705 5846529 5841837 5831986 5815182 5790810 5758777 5718657 5670328 5615543 5557922 5501058
57120E501058n3815m9179m3057l6189k9765k4223j9341j5211j1870q294l058M208
$$ 5501058 5447243 5398064 5355007 5318818 5289053 5264830 5245489 5230278 5218408 5210114 5207056 5211264
57108E211264J3182K4404L9101N7741Q0276J07907J43283J88894K46602L18710
$$ 5211264 5224446 5248850 5287951 5345692 5425968 5533875 5677158 5866052 6112654 6431364
57098F431364M08069N16595O44648P91802R57087J138247J331736J533261J736882
$$ 6431364 6839433 7356028 8000676 8792478 9749565 10887812 12219548 13752809 15489691
57089A5489691J932748K105102K231009K281475K230984K077426J859755J653026
$$ 15489691 17422439 19527541 21758550 24040025 26271009 28348435 30208190 31861216
57081C1861216J534754J540603J636835J727228J694050J454871J003996M12144
$$ 31861216 33395970 34936573 36573408 38300636 39994686 41449557 42453553 42865697
57073D2865697k14220p83329j246414j596742j853438k044620k195178k320130
$$ 42865697 42651477 41868148 40621734 39024992 37171554 35126934 32931756 30611626
57065C0611626k423221k498391k532159k508648k418148k264287k063463j837511
$$ 30611626 28188405 25690014 23157855 20649207 18231059 15966772 13903309 12065798
57057A2065798j606396j384975j182484j002977q47088p14209o03249n11967m36983
$$ 12065798 10459402 9074427 7891943 6888966 6041878 5327669 4724420 4212453 3775470
57048C775470l74934l23199k79693k42797k11527j85125j62525j42714j25388
$$ 3775470 3400536 3077337 2797644 2554847 2343320 2158195 1995670 1852956 1727568
57039A727568j10549r7657q5961p5439o6507n8859n1498m3899l6292k8713k0670
$$ 1727568 1617019 1519362 1433401 1357962 1291455 1232596 1181098 1137199 1100907 1072194 1051524
57028A051524j1935k826O606J6922K8547M1407N5536P0629Q3763Q8455P8148N1899
$$ 1051524 1039589 1036763 1043369 1060291 1088838 1130245 1185781 1256410 1340173 1428628 1506776 1558675
57016A558675J6034k0406n1618p6305r4488j05127j07450j03085r5349q6691p7776
$$ 1558675 1574709 1554303 1502685 1426380 1331892 1226765 1119315 1016230 920881 834190 756414
57005G56414o8759o0190n2427m5218l8303l1967k6627k2353j8974j6171j3486
$$ 756414 687655 627465 575038 529820 491517 459550 432923 410570 391596 375425 361939
56994C61939j0706q282o667n304l094K3K909M887O609Q808J1137J2727J3109J1932
$$ 361939 351233 342951 336284 330980 327886 327909 330818 335705 342314 351122 362259 374986 388095 400027
56980D00027Q689L491k412p614j1577j4280j5500j5208j4028j2553j0629q006
$$ 400027 408716 412207 409795 402181 390604 376324 360824 345616 331588 319035 308406 300400
56968C00400n204k962j187Q26L438O477R685J2808J5574J8018K0394K2184K1879
$$ 300400 295196 292234 291047 291873 295311 301788 311473 324281 339855 357873 378267 400451 422330
56955D22330J8350J2101M590l070j0132j5696j9222k1084k1814k1196j8984j5927
$$ 422330 440680 452781 457371 454301 444169 428473 409251 388167 366353 345157 326173 310246
56943C10246j3006j0106o583k848J1K048M608Q427J2757J6686K0279K3775K6450
$$ 310246 297240 287134 280551 277703 277714 279762 284370 292797 305554 322240 342519 366294 392744
56930C92744K6896K4114J8101R827Q61p384j4424k0409k5194k8135k8876k7854
$$ 392744 419640 443754 461855 471682 472543 465159 450735 430326 405132 376997 348121 320267
56918C20267k5851k3433k0941j8622j6551j4619j2701j0703q593o577n090m247
$$ 320267 294416 270983 250042 231420 214869 200250 187549 176846 168253 161676 156586 152339
56906A52339l558k535j361n48j57J59N37R17J453K397L652M989O520Q375J0056
$$ 152339 148781 146246 144885 144337 144180 144339 144876 145793 147246 149643 153295 158284 164804 173179 183235
56891A83235J0913J1240J2153J4199J6568J7944J7613J5650J2532Q814M910R80
$$ 183235 194148 205388 217541 231740 248308 266252 283865 299515 312047 320861 325771 326751
56879C26751k779n839p669q276q092p338n933l878j378J455M589P798J0856J3946
$$ 326751 323972 318133 310464 302188 294096 286758 280825 276947 275569 277024 281613 289411 300267 314213
56865C14213J7474K1455K5519K9476L3324L6527L7693L5393K9276K0392J0473
$$ 314213 331687 353142 378661 408137 441461 477988 515681 551074 580350 600742 611215
56854F11215Q07q286j6764k3764k7733k7940k5372k1600j7198j1850n598Q88P165
$$ 611215 612022 603736 586972 563208 535475 507535 482163 460563 443365 431515 425917 426805 433970
56841D33970J3445K0052K7021L4265M1727M9214N6280O1976O4445O1245N0934
$$ 433970 447415 467467 494488 528753 570480 619694 675974 737950 802395 863640 914574
56830I14574L4485J4742n373k3756l8849m9587n5814n8090n6948n2745m6179l8379
$$ 914574 949059 963801 958428 934672 895823 846236 790422 732332 675384 622639 576460 538081
56818E38081l0313k2455j4939p651k52P353J4762K1628K8208L4697M0322M3577
$$ 538081 507768 485313 470374 462723 462471 469824 484586 506214 534422 569119 609441 653018
56806F53018M3182L8223K8024J3045m219k0352l3262m2612m8365n0213m8597m4909
$$ 653018 696200 734423 762447 775492 771273 750921 717659 675047 626682 576469 527872 482963
56794D82963m0097l4034k6818j9696j3843r021m198J018O205J0948J5082J8465
$$ 482963 442866 408832 382014 362318 348475 339454 335256 336274 342479 353427 368509 386974
56782C86974K1098K3095K3997K2464J7405R342P1q881j6903k3589k8228l0363
$$ 386974 408072 431167 455164 477628 495033 504375 504446 495565 478662 455073 426845 396482
56770C96482l0414k9277k7471k4980k1913j8858j6374j4430j2668j1083r959r177
$$ 396482 366068 336791 309320 284340 262427 243569 227195 212765 200097 189014 179055 169878
56758A69878q164o726n360m397l450k224j318j495k431k987k582j704j068r14
$$ 169878 161714 154988 149628 145231 141781 139557 138239 136744 134313 131326 128744 127040 125972 125058
56744A25058j052j084o50R1M10o9o42l97M60R30O62K29R0J28K86P04J135J074
$$ 125058 124006 122922 122272 122363 122773 122704 122062 121665 122125 123055 123717 123946 124036 124164 124450 125154 126289 127363
56726A27363O35M86P12O63J76O8R38K221K987L035K735K282J635Q68J23m92p56
$$ 127363 127998 128484 129196 129859 130035 130103 131041 133262 136249 139284 142019 144301 145936 146804 146927 146435 145679
56709A45679l93M92J421K106K606K890K721K200J808J759J721J419J040Q06O08
$$ 145679 145286 145778 147199 149305 151911 154801 157522 159722 161530 163289 165010 166429 167469 168275 168883
56694A68883L12Jk37m14n07n31p75j413j963j728q21j27j48n74r47j095q58k09
$$ 168883 169195 169196 168959 168545 168038 167507 166732 165319 163356 161628 160807 160680 160532 159958 159011 157916 157058 156849
56676A56849K47k18j210j430m23Q15J312J286J314J297R96Q16J239J940K240K027
$$ 156849 157096 156878 155668 154238 153815 154630 155942 157228 158542 159839 160835 161651 162890 164830 167070 169097
56660A69097J639J207O59J19k64n45o84l45N56J451J709J291N99K5r0M92J512
$$ 169097 170736 171943 172602 172721 172457 171912 171228 170883 171439 172890 174599 175890 176489 176514 176424 176916 178428
56643A78428K268K321J847J099J00q93j325j091p79p99q65p48q18j316j751j674
$$ 178428 180696 183017 184864 185963 186063 185170 183845 182754 181975 181176 180311 179563 178745 177429 175678 174004
56627A74004j482j799k445k765k576k192j826j538j457j480j108j53O86O26j08
$$ 174004 172522 170723 168278 165513 162937 160745 158919 157381 155924 154444 153336 153183 153869 154495 154387
56612A54387n84m23p7lj17j98k80n45r31j099p40j4M72L10j20j16L94Q51R09P36
$$ 154387 153803 153380 153303 153300 153183 152985 152705 152160 151229 150130 149390 149376 149848 150158 150038 149922 150316 151167 152076 152812
56592A52812M87J20j51k8J80j60q43q66J02J205J811K376L290L813L126J650M81
$$ 152812 153299 153419 153268 153240 153420 153260 152417 151551 151653 152858 154669 157045 160335 164148 167274 168924 169405
56575A69405M3J31O83J606K335K427K318K630L137L239L154L687M950O196O902
$$ 169405 169448 169579 170262 171868 174203 176630 178948 181578 184715 187954 191108 194795 199745 205941 212843
56560B12843P290P678Q011Q133Q004P512O409M569K172k85k172l206l791m507
$$ 212843 220133 227811 235822 243955 251959 259471 265880 270449 272621 272336 270164 266958 263167 258660
56546B58660n196n102m105l098k818k984l018k881k652k052j028k47k86p87j066
$$ 258660 253464 248362 244257 241159 238341 235357 232339 229458 226806 224754 223726 223479 223193 222406 221340
56531B21340j048r76q30p16j197k393l256k769j419n86p01r89q61n50m62p18j402
$$ 221340 220292 219316 218486 217770 216573 214180 210924 208155 206736 206150 205449 204460 203599 203049 202587 201869 200467
56514B00467k493l466l600k854j939j531j637j759j322j60J203J913J721J217
$$ 200467 197974 194508 190908 188054 186115 184584 182947 181188 179866 179706 180909 182822 184543 185760
56500A85760R20O26Ro80j025j079j054p81p0P80J321J454J277P74J47j05J88O17
$$ 185760 186680 187306 187315 186635 185610 184531 183477 182696 182626 183406 184727 186181 187458 188232 188379 188274 188462 189079
56482A89079Q60J016R76L29o65r62j91O77Q34Q00J259J770J715J533J771J763
$$ 189079 189939 190955 191931 192260 191595 190633 190442 191119 191953 192753 194012 195782 197497 199030 200801 202564
56466B02564O74p69j143m28J27J0j65n9n8k71k82J0K99N70J010J340J156P49O68
$$ 202564 203238 202469 201326 200898 201025 201035 200870 200811 200753 200482 200200 200210 200509 201079 202089 203429 204585 205334 206002
56447B06002P67O10M83Q70J273P86l33q56l63L99Q11R53Q95N20J28J49K82o1n74
$$ 206002 206769 207379 207862 208732 210005 210791 210458 209602 209239 209638 210449 211402 212297 212817 212945 213094 213376 213315 212741
56428B12741m80N0N9n88j037r61r14j021o22M17J176R97L69P3K26N40P97P84M27
$$ 212741 212261 212311 212370 211782 210745 209784 208870 207849 207227 207644 208820 209817 210186 210259 210485 211025 211822 212606 213033
56409B13033J26L37P83Q14M98M84Q42R98Q41R23J412J789J748J542J332R62N41
$$ 213033 213159 213496 214279 215093 215591 216075 216917 217915 218756 219679 221091 222880 224628 226170 227502 228464 229005
56392B29005L63L00k0l96l07J47M25N53R20J216P86j0m7Q12J495J451J302J464
$$ 229005 229368 229668 229648 229252 228945 229092 229517 230070 230990 232206 232992 232982 232935 233747 235242 236693 237995 239459
56374B39459J437J014R55J709K456K225J210K88j95m87o70m91K12J203J858J599
$$ 239459 240896 241910 242865 244574 247030 249255 250465 250753 250558 250071 249401 248910 249122 250325 252183 253782
56358B53782N95k15j79L02N78Q28J528K357K584K260J972J700J027K81K44P73
$$ 253782 254377 254162 253983 254285 254863 255691 257219 259576 262160 264420 266392 268092 269119 269400 269644 270417
56342B70417Q71J88o02q82o44oQ21J232R69Q61J768L076L516L085K792K808K512
$$ 270417 271288 271476 270874 269992 269348 269342 270163 271395 272364 273225 274993 278069 281585 284670 287462 290270 292782
56325B92782K113K450L098K602Q26n98o28j5K85L92O61R35J082J170Q91oo76k6
$$ 292782 294895 297345 300443 303045 303871 303273 302645 302630 302915 303307 303968 304903 305985 307155 308046 308040 307364 307338
56307C07338J380J976J748K227L717M622M122L491L926M848N267N145M592L319
$$ 307338 308718 310694 312442 314669 318386 323008 327130 330621 334547 339395 344662 349807 354399 357718
56293C57718J810J370K156K683K128J511J714K108K161K625L933N052N251N421
$$ 357718 359528 360898 363054 365737 367865 369376 371090 373198 375359 377984 381917 386969 392220 397641
56279C97641O298O945O468N777O039O609O291N538N753P072Q495R577J0612J1599
$$ 397641 403939 410884 417352 423129 429168 435777 442068 447606 453359 460431 468926 478503 489115 500714
56265E00714J2255J2728J3382J4295J5598J7582J9932K1830K3429K6036L0111
$$ 500714 512969 525697 539079 553374 568972 586554 606486 628316 651745 677781 707892
56254G07892L4351L7742M1135M5638N0704N5185N9210O3554O7966P1565P4234
$$ 707892 742243 779985 821120 866758 917462 972647 1031857 1095411 1163377 1234942 1309176
56243A309176P6374P7738P7626P5756P2092O6427N8896N0226M0748L0022J8108
$$ 1309176 1385550 1463288 1540914 1616670 1688762 1755189 1814085 1864311 1905059 1935081 1953189
56232A953189O213m782j5422k6325l6794m5721n3010n9006o3476o6120o7362o7666
$$ 1953189 1959402 1954620 1939198 1912873 1876079 1830358 1777348 1718342 1654866 1588746 1521384 1453718
56220A453718o6843o4751o1845n8401n4216m9762m6347m4322m2379l9503l6336
$$ 1453718 1386875 1322124 1260279 1201878 1147662 1097900 1051553 1007231 964852 925349 889013
56209H89013l3679l1109k8264k6063k5217k4710k3158k0726j8384j6302j4192
$$ 889013 855334 824225 795961 769898 744681 719971 696813 676087 657703 641401 627209
56198F27209j2377j1164j0012q397o706n384m177l050k670l082l142k279j446
$$ 627209 614832 603668 593656 585259 578553 573169 568992 565942 563272 560190 557048 554769 553323
56185E53323j343j125o4J046J339J344J659J708J158J025J904K649K357K167L291
$$ 553323 551980 550855 550791 551837 553176 554520 556179 557887 559045 560070 561974 564623 566980 569147 572438
56170E72438M836N395N382N920O706O976P324Q565R849R952R479R857J1013J1930
$$ 572438 577274 582669 588051 593971 600677 607653 614977 623542 633391 643343 652822 662679 673692 685622
56156F85622J2625J3765J5146J6292J7732K0075K2789K5400K8845L4020M0139
$$ 685622 698247 712012 727158 743450 761182 781257 804046 829446 858291 892311 932450
56145I32450M6252N3271O2726P4618Q8080J02877J18454J32762J43837J51380
$$ 932450 978702 1031973 1094699 1169317 1257397 1360274 1478728 1611490 1755327 1906707
56135A906707J55110J53227J44656J31465J16966J02659Q9007P7474O9156O2590
$$ 1906707 2061817 2215044 2359700 2491165 2608131 2710790 2799797 2877271 2946427 3009017
56125C009017N5364M6911L7650K6862J3966O27j1124k1823l3280m5632n8254p2204
$$ 3009017 3064381 3111292 3148942 3175804 3189770 3190397 3179273 3157450 3124170 3078538 3020284 2948080
56113B948080q8673j05913j20631j31660j39598j43772j42621j36580j27718j16952
$$ 2948080 2859407 2753494 2632863 2501203 2361605 2217833 2075212 1938632 1810914 1693962
56103A693962j04111r0287p7429o5983n5261m5560l7735l1300k5249j9978j6256
$$ 1693962 1589851 1499564 1422135 1356152 1300891 1255331 1217596 1186296 1161047 1141069 1124813
56092A124813j3305j0078p208n432l633r28J043Q62N86K822O107O961N407M588
$$ 1124813 1111508 1101430 1094222 1088790 1085157 1084229 1085272 1086134 1086720 1089542 1095649 1102610 1108017 1112605
56078A112605N645O888P549Q668J0292J1206J1398J1949J2707J2793J2824J3882
$$ 1112605 1118250 1125138 1132687 1141355 1151647 1162853 1174251 1186200 1198907 1211700 1224524 1238406
56066A238406J5153J5397J5642J7390J9396J9538J8684J9114K0313K0082J8679
$$ 1238406 1253559 1268956 1284598 1301988 1321384 1340922 1359606 1378720 1399033 1419115 1437794
56055A437794J8157J8475J8093J7501J8254J9513J9341J8554J9382K1402K2621
$$ 1437794 1455951 1474426 1492519 1510020 1528274 1547787 1567128 1585682 1605064 1626466 1649087
56044A649087K3451K5510K7855K8575K8785L0681L3098L3681L3834L6577M0957
$$ 1649087 1672538 1698048 1725903 1754478 1783263 1813944 1847042 1880723 1914557 1951134 1992091
56033A992091M3802M5509M8611N2048N2757N1778N2713N5084N5365N3744N3623
$$ 1992091 2035893 2081402 2130013 2182061 2234818 2286596 2339309 2394393 2449758 2503502 2557125
56022B557125N5112N5421N5060N7056O0616O2267O2751O5923P1247P4568P6031
$$ 2557125 2612237 2667658 2722718 2779774 2840390 2902657 2965408 3031331 3102578 3177146 3253177
56011C253177P9820Q6168R1099R4176R8847J05046J09185J11809J17292J25566
$$ 3253177 3332997 3419165 3510264 3604440 3703287 3808333 3917518 4029327 4146619 4272185
56001D272185J32093J36455J42791J51523J58987J65569J75501J88240J99012
$$ 4272185 4404278 4540733 4683524 4835047 4994034 5159603 5335104 5523344 5722356
55992E722356K08161K20681K36361K50218K62869K80035L01467L21279L39745
$$ 5722356 5930517 6151198 6387559 6637777 6900646 7180681 7482148 7803427 8143172
55983H143172L63342L92573M21669M51026M87350N30788N75106O21378O77670
$$ 8143172 8506514 8899087 9320756 9771782 10259132 10789920 11365026 11986404 12664074
55974A2664074P44574Q15879Q94115R89493J103154J229001J372663J549916J766539
$$ 12664074 13408648 14224527 15118642 16108135 17211289 18440290 19812953 21362869 23129408
55965B3129408K021592K331701K728964L234498L860544M637863N606256O770530
$$ 23129408 25151000 27482701 30211665 33446163 37306707 41944570 47550826 54321356
55957E4321356Q098156R567684J1188280J2974301J4947765J7167124J9692300
$$ 54321356 62419512 71987196 83175476 96149777 111097542 128264666 147956966
55950A47956966K2505392K5504066K8500954L1016808L2003807L0064100K4356744
$$ 147956966 170462358 195966424 224467378 255484186 287487993 317552093 341908837
55943C41908837J5423305M973647n226012j4195822k1591702k7106762l0335663
$$ 341908837 357332142 362305789 357079777 342883955 321292253 294185491 263849828
55936B63849828l1159440k9996157k7580498k4589871k1485572j8543739j5896021
$$ 263849828 232690388 202694231 175113733 150523862 129038290 110494551 94598530
55929I4598530j3558226j1497142r692346q135975o809055n687940m757707l999580
$$ 94598530 81040304 69543162 59850816 51714841 44905786 39217846 34460139 30460559
55921C0460559l379797k866222k443214k099372j815345j574682j373377j208530
$$ 30460559 27080762 24214540 21771326 19671954 17856609 16281927 14908550 13700020
55913A3700020j069219r46856q42767p57529o83545o15184n55691n07334m64591
$$ 13700020 12630801 11683945 10841178 10083649 9400104 8784920 8229229 7721895 7257304
55904G257304m23301l86903l57714l31060l03640k79000k59512k41303k22013
$$ 7257304 6834003 6447100 6089386 5758326 5454686 5175686 4916174 4674871 4452858
55895D452858k05422j93581j82207j68506j56004j47230j39015j29214j20862
$$ 4452858 4247436 4053855 3871648 3703142 3547138 3399908 3260893 3131679 3010817
55886C010817j15467j09250j00164r1841q6496q0716p2284o4587o0121n6133n0903
$$ 3010817 2895350 2786100 2685936 2594095 2507599 2426883 2354599 2290012 2229891 2173758 2122855
55875B122855m8032m9996n3296n4534n5790n9436o2802o2703o0712n9569n8361
$$ 2122855 2074823 2024827 1971531 1916997 1861207 1801771 1738969 1676266 1615554 1555985 1497624
55864A497624n5270n1349m7943m3963l8886l4844l2914l1036k8106k6074k5660
$$ 1497624 1442354 1391005 1343062 1299099 1260213 1225369 1192455 1161419 1133313 1107239 1081579
55853A081579k4299k1014j8819j9494k0362j9285j8369j9507k0608j9738j8861
$$ 1081579 1057280 1036266 1017447 997953 977591 958306 939937 920430 899822 880084 861223
55842H61223j9816k0460j8603j6256j6085j6824j5939j4111j3367j3271j2374
$$ 861223 841407 820947 802344 786088 770003 753179 737240 723129 709762 696491 684117
55831F84117j1198j0685r897q045o575o651o919o293o329q255j0197j0139r247
$$ 684117 672919 662234 652337 644292 637717 631066 624147 617854 611525 603270 593073 582934 573687
55818E73687r478j0170r799q978q964r091q240p003o105m697k373p66q58q57Q48
$$ 573687 564209 554039 544240 535262 526298 517207 508967 501964 495859 491162 488789 488023 487165 486308 487156
55803D87156K886L462L503M630N989N930M954M332L335O74k751n123o533q119
$$ 487156 490042 493504 497007 501637 507626 513556 518510 522842 526177 526851 524100 518977 512444 504325
55789E04325r550r750r121q772q478p396n992n398n651o166p011q264r139r151
$$ 504325 494775 485025 475904 467132 458654 451258 445266 439868 434217 428051 421040 412776 403637 394486
55775C94486r059r373r215p941o461n602m597k672p68j39m87q53j101j313j021
$$ 394486 385427 376054 366839 358898 352437 346835 342238 339566 338798 338659 338172 337319 336218 334905 333884
55760C33884l06k80j361k384k436j991j362J29K363L731L418K498J569n04m103
$$ 333884 333578 333298 331937 329553 327117 325126 323764 323893 326256 329987 333405 335903 337472 336968 332865
55745C32865p303q520q694r139r241q158o850o462o288n288m031l402k949k221
$$ 332865 325562 317042 308348 299209 289968 281810 274960 268498 262210 256922 252891 249489 246540 244319
55731B44319k021k676k842j788j027j770k788k757k672l659m404l412j967k128
$$ 244319 242298 239622 236780 234992 233965 232195 229407 226650 223978 220319 215915 212503 210536 208408
55717B08408l174k920j414m95n65n04j34k29n66k53M71P59Q64J380J583N73p24
$$ 208408 205234 202314 200900 200405 199840 199336 199202 198973 198407 198154 198625 199384 200248 201628 203211 203784 203060
55700B03060p60K0p8j289k392k878l144l017k114j132r71j028j89J072J407Q76
$$ 203060 202300 202320 202242 200953 198561 195683 192539 189522 187408 186276 185305 184277 184088 185160 186567 187443
55684A87443O51R43J057J006J284J530J182R47J822L138L470K983K997L574L492
$$ 187443 188094 189037 190094 191100 192384 193914 195096 196043 197865 201003 204473 207456 210453 214027 217519
55669B17519K429J343P15J07o56j248j803k740l810m389m436m093l038j367k83
$$ 217519 219948 221291 222006 222113 221457 220209 218406 215666 211856 207467 203031 198938 195900 194533 194250
55654A94250n49j099o54K90O36P87J606K265J305p91k251k776l482m514m890m549
$$ 194250 193701 192602 191948 192238 192874 193661 195267 197532 198837 198046 195795 193019 189537 185023 180133 175584
55638A75584m489m843m789m292m084l986l100j707j058j330j457j081q63q47l10
$$ 175584 171095 166252 161463 157171 153087 149101 146001 144294 143236 141906 140449 139368 138505 137658 137348
55623A37348O02Q08J44k92J12Q33J332J488R33m93j737j536l86M6n80j075r56
$$ 137348 137950 138758 138902 138610 138722 139555 140887 142375 143308 142815 141078 139542 139156 139202 138622 137547 136591
55606A36591j037j645j960j608j225j097p42j88k16q95j249p89j40J60K35N8o18
$$ 136591 135554 133909 131949 130341 129116 128019 127277 127089 126873 125978 124729 123940 123800 123960 124195 124253 123635
55589A23635j321j149k30L73L40L70O23M37j39l9J118K362K922L273M038N011
$$ 123635 122314 121165 120935 121308 121648 122018 122641 123078 122939 122900 124018 126380 129302 132575 136613 141624
55573A41624N747O216O474O494O550O846O812N774M320L704L812L101Q02k061
$$ 141624 147371 153587 160061 166555 173105 179951 186763 192537 196857 200561 204373 207474 208276 206215
55559B06215m223n447n944n715n082m778n058n447n649n770n649m929l959l526
$$ 206215 201992 196545 190601 184886 179804 175026 169968 164521 158872 153102 147453 142524 138565 135039
55545A35039l573l276k490j926j773j322k56Q62J619K134K233J477K33m72m37
$$ 135039 131466 128190 125700 123774 122001 120679 120423 121285 122904 125038 127271 128748 128981 128509 128072
55530A28072m49q11r71q67j197k023k445k158j923k009j592m15L26l86j947l118
$$ 128072 127623 126812 125841 124974 123777 121754 119309 117151 115228 113219 111627 111212 111538 111152 109205 106087
55514A06087l460l064j940n14J95k11q52q55n42n92q40p55m52l78m30k29N9j55
$$ 106087 102627 99563 97623 97109 97304 97093 96241 95386 94844 94252 93412 92657 92205 91827 91397 91168 91227 91072
55496I1072j066k159k618j908l19J069J375Q26K76j0l58o65l57N17J180J301J383
$$ 91072 90006 87847 85229 83321 83002 84071 85446 86272 86548 86538 86180 85515 85158 85675 86855 88156 89539
55479H9539J750J984J754J331R75N00k08q48j160j157q26k38J43n7m35m12k68
$$ 89539 91289 93273 95027 96358 97333 97833 97625 96777 95617 94460 93634 93396 93539 93482 93047 92635 92367
55462I2367o62j262j108l12k5o19j150r20l50P2M56P36M19m32r68q29n72n18j98
$$ 92367 91705 90443 89335 89023 88998 88379 87229 86309 85959 86031 86487 87223 87642 87210 86242 85413 84841 84323 84125
55443H4125N52J062R09N29L00l2n46p35m22j57k92n11n87o81o56j26N47N28J4
$$ 84125 84677 85739 86648 87177 87477 87445 86899 86164 85742 85585 85293 84782 84195 83514 82858 82732 83279 83807 83821
55424H3821J45J070J577J129P60J208J704J482J054R66O67k29q38m29J59j23p07
$$ 83821 83966 85036 86613 87742 88502 89710 91414 92896 93950 94916 95583 95354 94516 94087 94246 94123 93416
55407I3416m01N88J018N07l19j073j835k392k313j666q18J08R17R60n9j292j594
$$ 93416 93015 93603 94621 95128 94809 93736 91901 89509 87196 85530 84712 84820 85737 86697 86638 85346 83752
55390H3752q45K09J028J465J373P79J72J3K07M94Q38J015N30m66r42l22N84P17
$$ 83752 82907 83116 84144 85609 86982 87761 87933 87946 88153 88647 89485 90500 91030 90564 89622 89300 89884 90601
55372I0601J79k44l59m50m78k53j8p2k23k37m25j018j502j358q91o32l85K34Q58
$$ 90601 90780 90536 90177 89727 89249 88996 88978 88906 88683 88446 88021 87003 85501 84143 83252 82620 82235 82469 83327
55353H3327R24P66J140J854J863P15q55j864j988j540r83n69j72L90R08R72O65
$$ 83327 84251 85017 86157 88011 89874 90589 89734 87870 85882 84342 83359 82790 82618 83008 83916 84888 85553
55336H5553M84M82K18k07l8Q16J336Q83J97J52M01J76l69n85m73m26l63k4K88
$$ 85553 86037 86519 86737 86530 86492 87308 88644 89527 89724 89876 90277 90453 90084 89499 89026 88600 88237 88213 88501
55317H8501J48k39m83p19j071j021k40M82K57m42m22M22J054Q67L04m1RM74J205
$$ 88501 88649 88410 87927 87208 86137 85116 84876 85358 85615 85173 84751 85173 86227 87094 87398 87357 87366 87840 89045
55298H9045J649J325N07j76o38j137j448j044k6Q66J156R67M92j78p81r42o11
$$ 89045 90694 92019 92526 92350 91712 90575 89127 88083 88057 88923 90079 91046 91538 91360 90579 89637 89026
55281H9026q5L14M00K26J97O88J270J056L3o37k21M99M60j25l66j68j27l33l34
$$ 89026 88941 89255 89655 89881 90078 90766 92036 93092 93125 92488 92267 92766 93226 93101 92735 92567 92440 92107 91773
55262I1773n5J46J41P5qo3J42N01M35j36k91N75J581J512N91k2k5m1k14KO37R10
$$ 91773 91718 91864 92005 92080 92072 92009 92151 92652 93087 92951 92660 93235 94816 96328 96919 96897 96872 96831 96617 96619 97256 98166
55240I8166L73n19j115j238j064r02j014j251j027j36P85J036O33j03j028j681
$$ 98166 98539 98020 96905 95667 94603 93701 92687 91436 90409 90273 91058 92094 92727 92624 91596 89915
55224H9915j177M97J872J781R48O32N50l20j515j538l67L09l71j267j024K13J431
$$ 89915 88738 89235 91107 92888 93836 94468 95018 94698 93183 91645 91278 91587 91216 89949 88925 89138 90569
55207I0569K036K020J601J101O80O0r06j613j334k99O01J026J242J274R82O90
$$ 90569 92605 94625 96226 97327 98007 98067 97161 95548 94214 93915 94516 95542 96784 98058 99040 99730
55191I9730P04M94m97j449r95O70J833J568O55M4k37l53j16L45L72k51r72j338
$$ 99730 100434 100928 100431 98982 97987 98657 100490 102058 102713 102757 102520 102167 102051 102396 102768 102517 101545 100207
55173A00207j360r63n1P68O34k12n84j22K60r9p15r49p94l41M64J232J323R85
$$ 100207 98847 97884 97833 98601 99235 99023 98439 98317 98577 98478 97763 96814 96020 95679 96143 97375 98698 99683
55155I9683J141J818J912R75m6m30o49j163j378p68N2J72l61r31j221j118n32
$$ 99683 100824 102642 104554 105529 105483 105053 104404 103241 101863 101095 101147 101319 100958 100027 98806 97688 97156
55138I7156J25J14m86o46O9P86P24L31K76L55J61p6j27l68r07r85j72O95O97J76
$$ 97156 97281 97395 96909 96263 96332 97118 97842 98173 98449 98804 98965 98889 98762 98394 97487 96502 96330 97025 97722 97898
55118I7898l6O6J27L97J098J496Q67j49l60K19O12N19M63N58L79jL5N43R05Q55
$$ 97898 97862 97928 98055 98452 99550 101046 101913 101764 101404 101623 102235 102754 103217 103775 104154 104153 104188 104731 105636 106491
55098A06491P60P61N98L32L62N69K67n95j049l62Q68J347N69p22j370q70L22J374
$$ 106491 107251 108012 108610 108942 109304 109873 110140 109545 108496 108134 109002 110349 110918 110196 108826 107956 108278 109652
55080A09652J867J899J531N76q66k104k485k105j546j134q17m88q4M43Q93Q26
$$ 109652 111519 113418 114949 115525 114659 112555 110070 107965 106419 105285 104468 103980 103896 104339 105232 106058
55064A06058J30o38q96p04m34r6M42Q99Q42L96J19K35M96P13R11R40M54n12j348
$$ 106058 106188 105550 104654 103950 103516 103420 103862 104761 105603 105999 106118 106353 106849 107562 108473 109413 109867 109355 108007
55045A08007j453q61j97l4l07m08M0O17O30J29j16K09N01K31k54m14m21o65q81
$$ 108007 106554 105693 105496 105462 105155 104747 104787 105404 106034 106163 106047 106256 106757 106988 106734 106320 105899 105234 104353
55026A04353n58Q1L29J05mK49M74M15L08K73O2l48m87o4N47Q76R93J200J362J064
$$ 104353 103795 103876 104205 104310 104306 104555 105029 105444 105752 106025 106087 105739 105252 105188 105735 106611 107604 108804 110166 111230
55006A11230L40k13j44K88M66J63k19j91J82L01k65j183j546q03N29J263P94j81
$$ 111230 111570 111357 111213 111501 111967 112130 111911 111720 111902 112203 111938 110755 109209 108406 108935 110198 110992 110811
54988A10811m66K06R60J024O32M66P36J241J819K179J758M80o58o20K59P52M78
$$ 110811 110345 110551 111511 112535 113167 113633 114369 115610 117429 119608 121366 121846 121188 120568 120827 121579 122057
54971A22057J87L50N60N12M76N08K04l24l07L61O55M0n42j38O08M78m23r55o98
$$ 122057 122244 122594 123154 123666 124142 124650 124854 124530 124223 124584 125239 125279 124737 124599 125207 125685 125262 124307 123609
54952A23609k18J66O98J283J304N26n42j320j590j352q24n44q22j140p42K54J009
$$ 123609 123391 123557 124255 125538 126842 127368 126826 125506 123916 122564 121740 121196 120374 119234 118492 118746 119755
54935A19755J157J053Q53K55o16q90m8J367K477L152L797M505M916M836M587M678
$$ 119755 120912 121965 122818 123073 122457 121567 121519 122886 125363 128515 132312 136817 141733 146569 151156 155834
54919A55834N242N869O001N527M891M411L688K031n73l239n023n682n639n421
$$ 155834 161076 166945 172946 178473 183364 187775 191463 193494 192921 189682 184659 178977 173338 167917
54905A67917n282n095m551l615k787k677l257l785l561k629j625j085r88r27o42
$$ 167917 162635 157540 152989 149374 146587 143910 140653 136868 133307 130678 129053 127968 126980 126053 125411
54890A25411l03j90j56L24J405K464K733K248J854K290L502M909O067O883P299
$$ 125411 125108 124918 124762 125086 126491 128955 131688 133936 135790 138080 141582 146491 152558 159441 166740
54875A66740P101O212N054M188L570K489N84j498k909l741m733n944o592o245
$$ 166740 173841 180053 185107 189295 192865 195354 195938 194440 191531 187790 183057 177113 170521 164276
54861A64276n386m571l829l220l157l580l589k657j521j082r55j62J078J446L69
$$ 164276 158890 154319 150490 147270 144113 140533 136944 134287 132766 131684 130729 130567 131645 133091 133460
54846A33460j234k250k576k632k470j965j365j078j070r20m55m7k02r54j763j981
$$ 133460 132226 129976 127400 124768 122298 120333 118968 117890 116820 115900 115445 115398 115196 114242 112479 110498
54830A10498j395l14Q53J816K267J828M93j026j721j142K28J375J543P61k74r34
$$ 110498 109103 108789 109642 111458 113725 115553 116046 115020 113299 112157 112385 113760 115303 116064 115790 114856
54814A14856j178j205q62Q4J126J240K21q40q07J67J077J346J156P92L82J35L31
$$ 114856 113678 112473 111611 111695 112821 114061 114282 113442 112635 112802 113879 115225 116381 117173 117555 117690 118021
54797A18021R09J437J500J043M00R8L60P26M86l50q88m35O60J496J614J197O86
$$ 118021 118930 120367 121867 122910 123310 123408 123768 124494 124980 124630 123742 123307 123967 125463 127077 128274 128960
54780A28960N44J001J797K476L067L899M626M371L128K130K152K492K433K656
$$ 128960 129504 130505 132302 134778 137845 141744 146370 150741 153869 155999 158151 160643 163076 165732
54766A65732L997N655O111N383M784M671L995K271M23p62j723l049m326m825m615
$$ 165732 169729 175384 181495 186878 191662 196333 200328 202599 203022 202260 200537 197488 193162 188337 183722
54751A83722m316m220m219m239m240m061l595k919k172j472r80p59n48j07L50
$$ 183722 179406 175186 170967 166728 162488 158427 154832 151913 149741 148269 147289 146530 145982 145875 146225
54736A46225M75L99M86O09L28k30l66K03J000J600K169L015M133N287O133O191
$$ 146225 146700 147099 147585 148194 148522 148292 147926 148129 149129 150729 152898 155913 160046 165333 171466 177657
54720A77657N264L889K874K334J737Q27j78j257k665m170n048n035m664m408m235
$$ 177657 182921 186810 189684 192018 193755 194582 194404 193147 190482 186312 181264 176229 171565 167157 162922
54705A62922m137m343m655m345l152j727p59k15K14N14O57Q02Q36K98p94j607
$$ 162922 158785 154442 149787 145442 142290 140563 139804 139589 139803 140317 140974 141776 142612 142910 142116 140509
54689A40509j507r10o25q19j121j341j510j554j433j337j354j230q40n38o58r46
$$ 140509 139002 138092 137467 136648 135527 134186 132676 131122 129689 128352 126998 125768 124928 124390 123732 122786
54673A22786r14m90N9N58R90J333J604J803J696J008j0o81p64o89p52o94l75k25
$$ 122786 121872 121382 121441 121999 122989 124322 125926 127729 129425 130433 130423 129742 128978 128289 127537 126843 126468 126243
54655A26243m84o56k68L36N61M01J23l49r84j093j40J167J590J063P40J273J912
$$ 126243 125759 125103 124835 125171 125732 126133 126256 125907 124923 123830 123690 124857 126447 127510 128250 129523 131435
54638A31435J624M53o19q00j74M60K98o95j674j803j206o65n03k20O00J577K011
$$ 131435 133059 133512 132893 132093 131919 132379 132677 131982 130308 128505 127299 126634 126131 125911 126511 128088 130099
54621A30099J739J131M35m06j238j489p47N47J391J288O92K74O9k51n52k96N63
$$ 130099 131838 132969 133404 132998 131760 130271 129524 130071 131462 132750 133442 133716 133785 133534 132982 132686 133249
54604A33249J326J410J016O65M71K06j55l92m10m21o44r72r46k38P79J243Q50
$$ 133249 134575 135985 137001 137666 138137 138343 138188 137796 137386 136965 136321 135349 134403 134165 134944 136187 137037
54587A37037M05P36J377J142o5r61o86M3J21l77n93k20K72M67L31k3l59k91K38
$$ 137037 137442 138178 139555 140697 140632 139671 138985 139028 139149 138772 138179 137959 138231 138698 139029 139006 138647 138356 138594
54568A38594O76N76K89M25Q66R53N20Q5Q5M40Q90J237J245P96K20O6M59J008J352
$$ 138594 139270 139846 140135 140560 141426 142379 142899 142984 143069 143509 144399 145636 146881 147677 147897 147963 148422 149430 150782
54549A50782J436J283Q75L67J04L14R08J622K119K050J304K50l85p1J042K102
$$ 150782 152218 153501 154376 154743 154847 155161 156069 157691 159810 161860 163164 163414 163029 162958 164000 166102
54533A66102K145J045j97m94l3j1q90j664j264q6N91K39n85j198j333r53k59J81
$$ 166102 168247 169292 169095 168601 168568 168557 167667 166003 164739 164653 165244 165483 164898 163700 162367 161414 161155 161336
54515A61336j5m25l37J94M42P8n42j080j472j490q91j38j56j000j540r44J86P15
$$ 161336 161321 160896 160559 160753 161195 161273 160731 159651 158179 156689 155798 155660 155504 154504 152964 152020 152206 152921
54497A52921N04L27O11R51R00O29N81Q37J046Q76M03Ko5J27L48N40P99J104J253
$$ 152921 153425 153752 154363 155314 156214 156843 157424 158261 159307 160183 160586 160588 160523 160650 160998 161538 162337 163441 164694
54478A64694J140R42R58J314J786J910J385M64j84j56K71N63N94O80J111J832
$$ 164694 165834 166776 167734 169048 170834 172744 174129 174593 174409 174253 174524 175087 175681 176361 177472 179304
54462A79304K518K714K115R54m5l91l51m44o75p02n44n72p82p01j62L41L08j30
$$ 179304 181822 184536 186651 187605 187560 187169 186818 186374 185699 184997 184453 183881 183099 182398 182236 182577 182885 182755
54444A82755n08o52o97p78q58q40o29k17K18M44M15L05K33J58K7j25k57l46l03
$$ 182755 182247 181595 180898 180120 179262 178422 177793 177576 177794 178238 178653 178958 179191 179349 179376 179251 178994 178648 178345
54425A78345l2L72O52N78R8n91j012o84K76J038R53L57M1J11%m66p48n41k68k74
$$ 178345 178313 178685 179337 179915 180013 179422 178410 177726 178002 179040 179993 180350 180391 180502 180502 180036 179288 178747 178479 178205
54405A78205j95K72N67L5q69r85p4Q12Q26M26N62J287J864J930J876J964J851
$$ 178205 178010 178282 178849 178884 178015 177030 176956 177768 178594 179020 179582 180869 182733 184663 186539 188503 190354
54388A90354J212M02o3k75o75j184j293r69p86r48q84k31M14L23j54p0P06J262
$$ 190354 191566 191968 191905 191630 190955 189771 188478 187509 186723 185775 184891 184660 185074 185397 185243 185173 185879 187141
54370A87141R36J43k74k0N97J195J571J683J575J308Q94M48L20P37J394J664J353
$$ 187141 188077 188220 187946 187926 188523 189718 191289 192972 194547 195855 196749 197197 197517 198254 199648 201312 202665
54353B02665Q67O11N67N55N25L60k22j281k388l029l150l041k863k552k065j520
$$ 202665 203532 204143 204710 205265 205790 206150 205928 204647 202259 199230 196080 193039 190176 187624 185559 184039
54337A84039j024o15l50l33n33p10o05k43J4j33n30p43o61o08p44p36l17J31N9
$$ 184039 183015 182400 182050 181717 181184 180474 179869 179626 179640 179507 178977 178234 177573 176965 176221 175485 175168 175299 175358
54318A75358m08o86o61p77j145j333j220j329j872k117j364r2O22N64M85P84Q87
$$ 175358 174950 174264 173603 172826 171681 170348 169128 167799 165927 163810 162446 162354 162976 163540 164025 164809 165696
54301A65696K12q70j439j050%J077J615J305M09l34l91k0K06K52N15Q88O87j89
$$ 165696 165908 165038 163599 162549 162549 163626 165241 166546 166955 166621 166230 166210 166416 166668 167183 168071 168758 168569
54283A68569p22p2J057J230K76m84j54N56N44r7m43j65K57M29L61qp66j497j490
$$ 168569 167847 167775 168832 170062 170338 169854 169700 170256 170800 170703 170260 170095 170352 170781 171142 171134 170368 168871 167381
54264A67381o86J91O63J002J524J911J737J218R00R20R64Q48O45L70l2l87k81
$$ 167381 166695 166886 167549 168551 170075 171986 173723 174941 175841 176761 177725 178573 179218 179588 179556 179169 178888
54247A78888M31J268J461O52p31j780j894j256n70l58o09j034j335j308r22m51
$$ 178888 179319 180587 182048 182700 181969 180189 178295 177039 176469 176111 175502 174468 173133 171825 170903 170452
54231A70452k38k03J11P98J173N36p90j611j176KQ15P57K68QK03O97J283J702
$$ 170452 170214 170011 170122 170920 172093 172629 171839 170228 169052 169054 169869 170626 170894 170902 171105 171802 173085 174787
54213A74787J622R16l0o55q63j062j485j863j886j680j501j216n27M16J019Q77
$$ 174787 176409 177325 177295 176640 175777 174715 173230 171367 169481 167801 166300 165084 164557 164973 165992 166869
54197A66869J76n97j067j092p22j37M03P05P25N23K09j75o72j255j631j499r68
$$ 166869 167045 166448 165381 164289 163567 163430 163833 164538 165263 165786 165995 165820 165148 163893 162262 160763 159795
54180A59795m42l4M71R64Q40n9q72n99O72J951K542K454J883R64M1m87o76r16
$$ 159795 159353 159319 159790 160754 161594 161535 160663 160064 160736 162687 165229 167683 169566 170530 170571 170084 169408 168492
54162A68492j235j272r55o50n27l38l0rm84r91r67m58J7J22l9j83j78j46k75m98
$$ 168492 167257 165985 165030 164380 163853 163515 163485 163476 162992 162001 161034 160576 160593 160715 160676 160493 160315 160169 159894 159396
54142A59396n18l07k57n36n87J74J417K256K351K040J579J038P83J125J458Q40
$$ 159396 158878 158571 158314 157778 157191 157365 158782 161038 163389 165429 167008 168046 168829 169954 171412 172252
54126A72252m02p78K23J258J027J2n10k88N4K99O37Q27M41k59n91m17j02K69P67
$$ 172252 171850 171072 171295 172553 173580 173592 173082 172794 172848 173147 173784 174611 175052 174793 174202 173785 173683 173952 174719
54107A74719J030P00K77N27J128J000O4m58J07P97M08p91j532j266o08l09l90
$$ 174719 175749 176449 176726 177253 178381 179381 179445 178987 179094 179891 180299 179508 177976 176710 176102 175793 175403
54090A75403l68J73J263K544L453L578K981K175J765J998K559K940L048L296L882
$$ 175403 175035 175208 176471 179015 182468 186046 189027 191202 192967 194965 197524 200464 203512 206808 210690
54075B10690M291L921L006K334K053J409j24j960l104l361l338l419l284k601
$$ 210690 214981 218902 221908 224242 226295 227704 227580 225620 222516 219155 215817 212398 209114 206513
54061B06513j754j500j963k329j768m71N34N73j4m58m39r6M82J311K227K936L326
$$ 206513 204759 203259 201296 198967 197199 196728 197262 197835 197821 197363 196924 196828 197310 198621 200848 203784 207110
54044B07110L427L124K401J771J962L007M123M724N106N813O646O863O240N475
$$ 207110 210537 213661 216062 217833 219795 222802 226925 231649 236755 242568 249214 256077 262317 267792
54030B67792N346N808O165N973N465N047M734M312L863L748M060M464M569M246
$$ 267792 273138 278946 285111 291084 296549 301596 306330 310642 314505 318253 322313 326777 331346 335592
54016C35592L483K352J246O74N67J22j235l107m731n955p026p761p751p225o896
$$ 335592 339075 341427 342673 343347 343914 344036 342801 339694 334963 329008 321982 314221 306470 299245 292349
54001B92349o841o379n247m168l794l792l574l315l580m253m527l968k949k100
$$ 292349 285508 279129 273882 269714 265920 262128 258554 255239 251659 247406 242879 238911 235962 233862
53987B33862j689j615j609j395r35n57o37j131j611j739j497j062p13p57j185
$$ 233862 232173 230558 228949 227554 226619 226062 225425 224294 222683 220944 219447 218385 217672 216915 215730
53972B15730j441r40J18Q59P54J99j34p0J49L82N97N76J41l76l90J96Q89J356
$$ 215730 214289 213349 213467 214326 215080 215279 215145 215075 215224 215606 216203 216779 216920 216544 216154 216350 217239 218595
53954B18595J853K632L292L191K396J777K091L193M284M728M527M154M067M420
$$ 218595 220448 223080 226372 229563 231959 233736 235827 239020 243304 248032 252559 256713 260780 265200
53940B65200N021N552N818N897O115O749P641Q195Q034P613P785Q607Q994P964
$$ 265200 270221 275773 281591 287488 293603 300352 307993 316188 324222 331835 339620 348227 357221 365185
53926C65185N905M051K945K047Q89k43r71j506k073k172j081J053L190M461M846
$$ 365185 371090 375141 378086 380133 381022 380779 379808 378302 376229 374057 372976 374029 377219 381680 386526
53911C86526M833M810M886M958M840M445L937L547L248K818K138J246J65j120
$$ 386526 391359 396169 401055 406013 410853 415298 419235 422782 426030 428848 430986 432232 432397 431277
53897D31277k455l542m174m325m075l647l485l926m772n466n773o040o609p299
$$ 431277 428822 425280 421106 416781 412706 409059 405574 401648 396876 391410 385637 379597 372988 365689
53883C65689p682p656p475p275o903o200n272m385l776l622m030m859n625n798
$$ 365689 358007 350351 342876 335601 328698 322498 317226 312841 309065 305443 301413 296554 290929 285131
53869B85131n297m586m134l877l398k575j767j365j409j792k481l305l805l650
$$ 285131 279834 275248 271114 267237 263839 261264 259497 258132 256723 254931 252450 249145 245340 241690
53855B41690l101k622k161j307j76M26K9q48j430j653j879j997j617j003r41j468
$$ 241690 238589 235967 233806 232499 232323 232749 232778 231930 230500 228847 226968 224971 223354 222351 221410 219942
53839B19942j553o13M64N31j31l34M3j00j124j750q53P94J559J184Q83J415K152
$$ 219942 218389 217776 218240 218771 218640 218306 218349 218249 217125 215375 214522 215316 216875 218059 218942 220357 222509
53822B22509K240J730J169P43L65J45K68N94Q15Q92J020J264J459J509J592K003
$$ 222509 224749 226479 227648 228391 228756 228901 229169 229763 230578 231470 232490 233754 235213 236722 238314 240317
53806B40317K819L743M365M578M596M479M050L471L489M506N772O175N728N411
$$ 240317 243136 246879 251244 255822 260418 264897 268947 272418 275907 280413 286185 292360 298088 303499
53792C03499N568N395M287K838K002J917K143K439K654K387J407J45q50j605k359
$$ 303499 309067 314462 318749 321587 323589 325506 327649 330088 332742 335129 336536 336681 335831 334226 331867
53777C31867k876k729k154j882k310l237m327n269n698n496n075m885m778m395
$$ 331867 328991 326262 324108 322226 319916 316679 312352 307083 301385 295889 290814 285929 281151 276756
53763B76756l927l839m011l853l267k783k672k616k443k443k750k963k743k291
$$ 276756 272829 268990 264979 261126 257859 255076 252404 249788 247345 244902 242152 239189 236446 234155
53749B34155j884j390o50K8J81j22l20l2M92O77K49m03o26k14L47N10K82j1k75
$$ 234155 232271 230881 230231 230259 230440 230318 229998 229966 230458 231135 231384 230981 230355 230141 230488 230998 231280 231269 230994
53730B30994n45n45L4Q72J255J059R12J166J334R29L40L28R32J405J206O26L50
$$ 230994 230449 229904 229938 230810 232065 233124 234036 235202 236536 237465 237805 238133 239065 240470 241676 242302 242652
53713B42652P21J546K449L196L687L819L534L010K610K565K800L090L225K971
$$ 242652 243373 244919 247368 250564 254251 258070 261604 264614 267224 269789 272589 275679 278904 281875
53699B81875K240J438J283J970K804L057K887K919L231L298K892K387K116J950
$$ 281875 284115 285553 286836 288806 291610 294667 297554 300473 303704 307002 309894 312281 314397 316347
53685C16347J613J031L06l37n82l32Ql5l85o38p14q06q34n59k07k46n45n23j71
$$ 316347 317960 318991 319297 318960 318378 318046 318054 318019 317634 316996 316282 315476 314642 314083 313876 313630 313085 312562 312391
53666C12391j43n92q54n77l63p29j193j061n41l57o13p54m52L5K95J07m32q61
$$ 312391 312248 311656 310802 310225 309862 309133 307940 306879 306338 305981 305368 304614 304162 304197 304492 304599 304167 303306
53648C03306o60nK07m73j254j018K22J472K138K525K950L105K650J897J518J743
$$ 303306 302646 302641 302848 302375 301121 300103 300325 301797 303935 306460 309410 312515 315165 317062 318580 320323
53632C20323K120K104J698J450J749K260K271J609R29R67J798K954L922M293L847
$$ 320323 322443 324547 326245 327695 329444 331704 333975 335584 336513 337480 339278 342232 346154 350447 354294
53617C54294K856K060J973K431L124M170N643O884P001O095N245N192N578N744
$$ 354294 357150 359210 361183 363614 366738 370908 376551 383435 390436 396531 401776 406968 412546 418290
53603D18290N693N782N908N573M677L669K856K019J006K75L22P08L44j068k449
$$ 418290 423983 429765 435673 441246 445923 449592 452448 454467 455473 455748 456070 456778 457122 456054 453605
53588D53605k657j954j553j932k391k285j914j870k186k541k789k830k357j322
$$ 453605 450948 448994 447441 445509 443118 440833 438919 437049 434863 432322 429533 426703 424346 423024
53574D23024l75l08j145k203k880l002k597j857j253j201j536j671j290o07j6
$$ 423024 422649 422341 421196 418993 416113 413111 410514 408657 407404 406203 404667 402996 401706 401099 401083
53559D01083L02L77M54Q91J733K370K093J034K11L88J222J760J572J075Q52J022
$$ 401083 401385 401762 402216 403107 404840 407210 409303 410337 410548 410936 412158 413918 415490 416565 417417 418439
53543D18439J352J729K287L133M090M789M975M709M367M446N143O119O816P105
$$ 418439 419791 421520 423807 426940 431030 435819 440794 445503 449870 454316 459459 465578 472394 479499
53529D79499P463Q304R385J0136J0402J0542J0944J1784J3096J4671J5961J6549
$$ 479499 486962 495266 504651 514787 525189 535731 546675 558459 571555 586226 602187 618736
53517F18736J6714J7165J8151J9273K0113K0675K1179K1854K2903K4219K5232
$$ 618736 635450 652615 670766 690039 710152 730827 752006 773860 796763 820982 846214
53506H46214K5565K5644K6048K6408K5936K4955K4780K5728K6437K5746K4192
$$ 846214 871779 897423 923471 949879 975815 1000770 1025550 1051278 1077715 1103461 1127653
53495A127653K2977K2362K2015K2037K2596K3106K2908K2301K1932K1612K0740
$$ 1127653 1150630 1172992 1195007 1217044 1239640 1262746 1285654 1307955 1329887 1351499 1372239
53484A372239J9578J8939J8841J8599J8143J8081J8434J8421J7688J6727J5817
$$ 1372239 1391817 1410756 1429597 1448196 1466339 1484420 1502854 1521275 1538963 1555690 1571507
53473A571507J4516J2524J0190P782N091K109o09k800m988p616j0224j2098j3267
$$ 1571507 1586023 1598547 1608737 1616519 1621610 1623719 1623110 1620310 1615322 1607706 1597482 1585384 1572117
53460A572117j4311j5434j6274j6584j6701j7340j8930k1099k2838k3444k3253
$$ 1572117 1557806 1542372 1526098 1509514 1492813 1475473 1456543 1435444 1412606 1389162 1365909
53449A365909k3091k3207k3224k3039k2987k2999k2384k0821j8892j7205j5555
$$ 1365909 1342818 1319611 1296387 1273348 1250361 1227362 1204978 1184157 1165265 1148060 1132505
53438A132505j3521j1397r871r004q148o777m966l084j374J13J425K628L734M770
$$ 1132505 1118984 1107587 1097716 1088712 1080564 1073787 1068821 1065737 1064363 1064476 1065901 1068529 1072263 1077033
53424A077033N868P129Q465R833J1559J3977J6694J8797J9954K0855K2228K3955
$$ 1077033 1082901 1090030 1098495 1108328 1119887 1133864 1150558 1169355 1189309 1210164 1232392 1256347
53412A256347K5538K6951K8501L0116L1385L2195L2892L3867L5290L7175L9336
$$ 1256347 1281885 1308836 1337337 1367453 1398838 1431033 1463925 1497792 1533082 1570257 1609593
53401A609593M1404M3225M5163M7666N0602N3345N5497N7153N8471N9362N9774
$$ 1609593 1650997 1694222 1739385 1787051 1837653 1890998 1946495 2003648 2062119 2121481 2181255
53390B181255N9926O0077O0219O0200N9992N9642N8994N7678N5515N2852N0351
$$ 2181255 2241181 2301258 2361477 2421677 2481669 2541311 2600305 2657983 2713498 2766350 2816701
53379B816701M8392M6690M4516M1245L6758L1499K6264K1707J7822J3957R460
$$ 2816701 2865093 2911783 2956299 2997544 3034302 3065801 3092065 3113772 3131594 3145551 3155011
53368C155011M173j806q574j6234k4362l2142l9078m5236n0690n5150n8353o0448
$$ 3155011 3159184 3157378 3148804 3132570 3108208 3076066 3036988 2991752 2941062 2885912 2827559 2767111
53356B767111o1774o2416o2258o1321n9918n8488n7287n6176n4758n2987n1510
$$ 2767111 2705337 2642921 2580663 2519342 2459424 2400936 2343649 2287473 2232715 2179728 2128218
53345B128218n1049n1375n1327n0027m7732m5317m3288m1573l9890l7936l5418
$$ 2128218 2077169 2025794 1974467 1924440 1876708 1831391 1788103 1746530 1706640 1668704 1633286
53334A633286l2299k8979k5961k3426k1276j9422j7737j5948j4000j2386j1764
$$ 1633286 1600987 1572008 1546047 1522621 1501345 1481923 1464186 1448238 1434238 1421852 1410088
53323A410088j2136j2773j3050j3018j2956j2737j1968j0713r576q970q602p954
$$ 1410088 1397952 1385179 1372129 1359111 1346155 1333418 1321450 1310737 1301161 1292191 1283589 1275635
53311A275635o998o086n252m078k342l22J605L351M911O149P143Q356J0104J2118
$$ 1275635 1268637 1262551 1257299 1253221 1250879 1250557 1252162 1255513 1260424 1266573 1273716 1282072 1292176 1304294
53297A304294J4013J5879J7948J9955K1432K2470K3612K5112K6735K8195K9247
$$ 1304294 1318307 1334186 1352134 1372089 1393521 1415991 1439603 1464715 1491450 1519645 1548892
53286A548892K9434K8468K6819K5312K4091K2659K0885J9218J7696J5653J2736
$$ 1548892 1578326 1606794 1633613 1658925 1683016 1705675 1726560 1745778 1763474 1779127 1791863
53275A791863R494O492L513J64l311o396r068j1621j4138j6603j9219k2087k4862
$$ 1791863 1801357 1807849 1811362 1811526 1808215 1801819 1792751 1781130 1766992 1750389 1731170 1709083 1684221
53262A684221k7156k9047l0761l2105l2774l2962l3249l3901l4639l4973l4538
$$ 1684221 1657065 1628018 1597257 1565152 1532378 1499416 1466167 1432266 1397627 1362654 1328116
53251A328116l3316l1806l0725l0290l0030k9553k9112k9098k9284k9062k8153
$$ 1328116 1294800 1262994 1232269 1201979 1171949 1142396 1113284 1084186 1054902 1025840 997687
53240I97687k6776k5387k4500k4395k4614k4157k2536k0320j8293j6583j5057
$$ 997687 970911 945524 921024 896629 872015 847858 825322 805002 786709 770126 755069
53229G55069j3928j3291j2579j1336j0102r660r711r325q578q595r881j1614j2826
$$ 755069 741141 727850 715271 703935 693833 684173 674462 665137 656559 647964 638083 626469 613643
53216F13643j3477j3974j4352j4415j4174j3743j3142j2405j1618j0721r702q896
$$ 613643 600166 586192 571840 557425 543251 529508 516366 503961 492343 481622 471920 463024
53204D63024q677q778q579q025p717p885q039p857p698p911q260q485q767r153
$$ 463024 454347 445569 436990 428965 421248 413363 405324 397467 389769 381858 373598 365113 356346 347193
53190C47193r034p849o011m507l817l633l497l292l137l172l325l176k274q22
$$ 347193 338159 330310 324299 319792 315975 312342 308845 305553 302416 299244 295919 292743 290469 289647
53176B89647K35O3j267k960m172m372l511k196j284j002p70j92L11K72M4J84M50
$$ 289647 289882 289945 288678 285718 281546 277174 273663 271467 270183 269181 268411 268219 268530 268802 268846 269030 269480
53159B69480J43p58j570j935k087k144j875j291q00n77l92j34QL7K36N53N32J28
$$ 269480 269623 268865 267295 265360 263273 261129 259254 257963 257163 256586 256194 256060 256068 256105 256341 256894 257426 257554
53141B57554p4K41N94M79J17o8j87m63n67q8O41R20P23O34Q36R41Q09P66Q92P89
$$ 257554 257480 257721 258315 258794 258911 258843 258656 258193 257626 257538 258179 259099 259822 260456 261292 262233 263042 263808 264700 265489
53121B65489L28kK36Q81J573K194K625K522J767P91O3l74o41o41l91l20p54j431
$$ 265489 265817 265815 266051 266932 268505 270699 273324 275846 277613 278404 278467 278093 277452 276811 276420 276100 275346 273915
53103B73915j913k200k457k456j898j086o55p52j028j222j264r36j55N03L44m10
$$ 273915 272002 269802 267345 264889 262991 261905 261250 260498 259470 258248 256984 256048 255893 256396 256740 256330
53087B56330q66p49o49q52q78m83k22m71o69k42M34P07P21J002J380J240O38K70
$$ 256330 255464 254715 254066 253214 252336 251853 251631 251160 250491 250249 250683 251390 252111 253113 254493 255733 256371 256641
53069B56641L43L10j99q35j140j083q04l74L5J13j35k92j26N7j37o13q84o34k4
$$ 256641 256984 257294 257095 256260 255120 254037 253233 252859 252894 253007 252872 252580 252454 252511 252374 251761 250877 250243 250219
53050B50219N13O94O30O63Q50Q42M21p0j96j18l25p34p17j32L19J28j83J82J053
$$ 250219 250732 251426 252056 252719 253569 254411 254832 254762 254566 254448 254123 253389 252672 252540 252859 252987 252804 252986 254039
53031B54039J437Q44j21n90l93j7Q1k04p47j284j469j134n34j23J1K27P50J249
$$ 254039 255476 256320 256199 255609 255216 255199 255280 255076 254329 253045 251576 250442 249908 249785 249796 250023 250773 252022
53013B52022J270R31P88J041J229Q58L2p29j093j098q97n51p6M29P64P36M20K43
$$ 252022 253292 254223 255011 256052 257281 258139 258171 257442 256349 255251 254354 253803 253727 254156 254920 255656 256076 256319
52995B56319N32J002R60J99o44q03k33M54P39O36N68R74J854K603K522J653Q55
$$ 256319 256851 257853 258813 259012 258368 257565 257332 257786 258525 259161 259729 260703 262557 265160 267682 269335 270190
52978B70190Q55J497K179K586K708K450J787J040O01M63M27N01P12P75M81J80
$$ 270190 271045 272542 274721 277307 280015 282465 284252 285292 285893 286356 286783 287284 287996 288771 289252 289432
52962B89432L21O47N38Ml28k66l63r96j796k237k301k187j878j280n59l6L3m63
$$ 289432 289753 290400 290938 290942 290614 290348 289985 288989 287193 284956 282655 280468 278590 277310 276751 276715 276748 276285
52944B76285j349k100k254j937j602j309p86j37J51O4J35M63L89l77j129j176
$$ 276285 274936 272836 270582 268645 267043 265734 264948 264811 264962 265026 265161 265624 266013 265636 264507 263331
52928B63331q64q51r36n20J74K89k99p53n23m7O9o1L4L96O40O00N41P00Q93P25
$$ 263331 262467 261616 260680 260160 260334 260623 260324 259571 259048 259001 259070 259009 259043 259439 260079 260679 261220 261920 262813 263538
52908B63538J76k33l9M79N87R3l66k54J10J73O2K22M62J29p39j246q80j89J24
$$ 263538 263714 263481 263442 263921 264508 264601 264235 263981 264091 264264 264326 264548 265010 265139 264400 263154 262274 262085 262209
52889B62209J85N09J004J125P12J55k41m83n22k10K21J93m18r02n42M49J156J119
$$ 262209 262394 262903 263907 265032 265744 265899 265658 265175 264653 264443 264664 264857 264439 263537 262995 263444 264600 265719
52871B65719P96Q60J408J987K226K191K202K460K801K805K142R25l34j142j370
$$ 265719 266515 267375 268783 270770 272996 275187 277389 279849 282650 285455 287597 288522 288188 287046 285676
52856B85676j222r64p83p83j026j539k301l163l831m050l810l306k709k115j686
$$ 285676 284454 283490 282707 281924 280898 279359 277058 273895 270064 266014 262204 258898 256189 254074 252388
52841B52388j495j279o89P3K74m00j250j354p01j00ll8K82Q47J103O99j66q89
$$ 252388 250893 249614 248925 248998 249272 248872 247622 246268 245567 245467 245464 245426 245708 246555 247658 248357 248191 247302
52823B47302r61n49m64j237k277k445j485l66K3o7J27O23P95M93M34J202K322
$$ 247302 246341 245792 245328 244091 241814 239369 237884 237518 237541 237474 237601 238224 239019 239512 239946 241148 243470
52806B43470K760K129J037J88m68j419k636l423l288k590k035j824j646j305r21
$$ 243470 246230 248359 249396 249584 249116 247697 245061 241638 238350 235760 233725 231901 230255 228950 228029
52791B28029n74k72j83n09j001j055m76K39N77O65R52J555K142K354K060J319
$$ 228029 227455 227183 227000 226491 225490 224435 223959 224198 224775 225440 226392 227947 230089 232443 234503 235822
52775B35822L82l86p41p05m28J0M63O24K54m57r85r84o25l62l68l10K13J051J543
$$ 235822 236204 235818 235077 234372 233944 233954 234417 235041 235295 234838 233853 232869 232244 231882 231514 231204 231417 232468 234011
52756B34011J286N96J3l69p33r55o77L2O33Q05P87R08J141J290J325J361J532
$$ 234011 235297 235893 235906 235537 234804 233849 233172 233204 233837 234642 235429 236337 237478 238768 240093 241454 242986
52739B42986J938K518K910K711J939J032M10K63O22J238J510J062L40P1K00np31
$$ 242986 244924 247442 250352 253063 255002 256034 256444 256707 257329 258567 260077 261139 261479 261550 261750 261745 261014
52722B61014j331j378j225j120p22JK04p15k013k430j732o97RK24r9p86j179p68
$$ 261014 259683 258305 257080 255960 255238 255239 255443 254728 252715 250285 248553 247856 247865 248089 247990 247204 246025 245257
52704B45257j8K45Q9L16J071J517J129M88M36J016J640J810J369L90p72j542j473
$$ 245257 245239 245484 245573 245889 246960 248477 249606 250094 250530 251546 253186 254996 256365 256755 255983 254441 252968
52687B52968n43Q87K179K642K058J021L53J81p9p22j294j273p32p2N45J110J427
$$ 252968 252425 253312 255491 258133 260191 261212 261565 261746 261667 260945 259651 258378 257646 257574 258119 259229 260656
52670B60656J197M23n36j230j381j022m97j34J27O07J298J654J192J61n80l59
$$ 260656 261853 262276 261740 260510 259129 258107 257610 257476 257603 258210 259508 261162 262354 262515 261935 261576
52654B61576P28J960K609K508K040J635J323Q85K61l65q22j095j258j434j744
$$ 261576 262304 264264 266873 269381 271421 273056 274379 275264 275525 275160 274338 273243 271985 270551 268807
52639B68807k071j936r72M75J509J569R95N79P39J201J332P87q5n12j29N67P69
$$ 268807 266736 264800 263828 264303 265812 267381 268376 268955 269694 270895 272227 273014 272929 272417 272288 272855 273624
52622B73624K71m81j063j393j474j274j003j038j327j328p73j88j91n78n51J77
$$ 273624 273895 273414 272351 270958 269484 268210 267207 266169 264842 263514 262741 262553 262362 261784 261233 261410
52606B61410R47R58K35m55m88lM58P08J019J493J666J114K31n2N57J277J218M57
$$ 261410 262357 263315 263550 263095 262607 262604 263062 263770 264789 266282 267948 269062 269293 269241 269798 271075 272293 272750
52588B72750j35MN56Q44O05J24j46Q2Q14J766K376K065P69q22j710j456n19K53
$$ 272750 272615 272619 273175 274019 274624 274748 274602 274684 275498 277264 279640 281705 282474 281652 279942 278486 277967 278220
52570B78220M11R1l43o76q53q66p13m86m03o92j320j891j953j429o54m4J49j65
$$ 278220 278631 278722 278379 277703 276850 275984 275271 274785 274382 273690 272370 270479 268526 267097 266443 266399 266548 266383
52552B66383q18j297j193p48o20r32j086o98k24k38n75o70l80M4N29J074J340
$$ 266383 265565 264268 263075 262327 261707 260775 259689 258991 258767 258529 257954 257284 256904 256948 257477 258551 259891
52535B59891J027M95L57N40M67R3NM01P50O58L79J80r4m03k34N56J197J056P66
$$ 259891 260918 261413 261770 262310 262777 262870 262875 263276 264026 264684 265063 265243 265149 264746 264512 265068 266265 267321 268087
52516B68087J466L076M206L909K798K115K203K463K513K635L016L087K122K50
$$ 268087 269553 272629 276835 280744 283542 285657 287860 290323 292836 295471 298487 301574 303696 303946
52502C03946j592k665k971k814k436k209k544l154l080k020j081j360k257k183
$$ 303946 302354 299689 296718 293904 291468 289259 286715 283561 280481 278461 277380 276020 273763 271580
52488B71580q00N63Q24M00K14M45P78J129J429J350Q19L71M17O09M95K97M68Q85
$$ 271580 270780 271343 272167 272567 272781 273226 274004 275133 276562 277912 278731 279102 279519 280128 280623 280920 281388 282273
52470B82273J156J359J747K039J766J218J204J895K607K852K815K682K128R37
$$ 282273 283429 284788 286535 288574 290340 291558 292762 294657 297264 300116 302931 305613 307741 308678
52456C08678l90j137j260j430k237l541m583m621l626k346j639j645j822j730
$$ 308678 308288 307151 305891 304461 302224 298683 294100 289479 285853 283507 281868 280223 278401 276671
52442B76671j487j360j252q86l54r9k92n80o16n50o83q10m21M18R30O69K58N46
$$ 276671 275184 273824 272572 271686 271332 271233 270941 270361 269745 269195 268512 267702 267281 267699 268629 269298 269556 270102
52424B70102J386J850J563J088R53R33O05Mn01o19j59R02K121K832L002L412M533
$$ 270102 271488 273338 274901 275989 276942 277875 278480 278484 277983 277364 277205 278107 280228 283060 286062 289474 294007
52407B94007N748O172N959O142P295Q793R452Q569O421L973K028N15j153l063
$$ 294007 299755 305927 311886 318028 325323 334116 343568 352137 358558 362531 364559 365074 363921 360858
52393C60858m591n386n876o365o329n339m109l639l690l115j652k87K61M07P39
$$ 360858 356267 350881 345005 338640 332311 326972 322863 319224 315534 312419 310767 310480 310741 311148 311887
52378C11887J085J111J102J529K257K870L384M058M713M786M124L249K745K641
$$ 311887 312972 314083 315185 316714 318971 321841 325225 329283 333996 338782 342906 346155 348900 351541
52364C51541K470J856R71M15N52J044J194P54J28j63O8P23J532J994J652P25J02
$$ 351541 354011 355867 356838 357253 357805 358849 360043 360797 360925 360762 360830 361553 363085 365079 366731 367456 367558
52347C67558L93J235J903K242K606L002K947K276J597J654K478L411L903M060
$$ 367558 367951 369186 371089 373331 375937 378939 381886 384162 385759 387413 389891 393302 397205 401265
52333D01265M408N275O471P520Q148Q554R220J0459J2085J3525J4298J4484J4634
$$ 401265 405673 410948 417419 424939 433087 441641 450861 461320 473405 486930 501228 515712 530346
52320E30346J5160J5866J6252J6204J6111J6305J6647J6840J6939J7217J7685
$$ 530346 545506 561372 577624 593828 609939 626244 642891 659731 676670 693887 711572
52309G11572J8097J8476J9218K0511K1851K2588K2753K2965K3374K3243K1929
$$ 711572 729669 748145 767363 787874 809725 832313 855066 878031 901405 924648 946577
52298I46577J9914J8297J7352J6197J4085J1429R129P359N558L468J520R6j050
$$ 946577 966491 984788 1002140 1018337 1032422 1043851 1052980 1060339 1065897 1069365 1070885 1070981 1069931
52285A069931k380l929n346o384p049p376p395p244p100o862o185m960l594k595
$$ 1069931 1067551 1063622 1058276 1051892 1044843 1037467 1030072 1022828 1015728 1008866 1002681 997721 994127 991532
52271I91532j927j105O7J262K270L526N507P828R468R967R927J0258J1271J2660
$$ 991532 989605 988500 988567 989829 992099 995625 1001132 1008960 1018428 1028395 1038322 1048580 1059851 1072511
52257A072511J3964J4823J5212J5623J6670J8188J9122J8670J7163J5435J3691
$$ 1072511 1086475 1101298 1116510 1132133 1148803 1166991 1186113 1204783 1221946 1237381 1251072
52246A251072J1601R212O987N026K924N37j697l445m993o763q681j0299j1351
$$ 1251072 1262673 1271885 1278872 1283898 1286822 1287359 1285662 1282217 1277224 1270461 1261780 1251481 1240130
52233A240130j1996j2609j3522j4747j5837j6155j5467j4290j3575j3990j5291
$$ 1240130 1228134 1215525 1202003 1187256 1171419 1155264 1139797 1125507 1111932 1097942 1082651
52222A082651j6352j6018j4207j2002j0407r334q143o813n899n457m834l690k452
$$ 1082651 1066299 1050281 1036074 1024072 1013665 1004331 996188 989375 983476 978019 973185 969495 967043
52209I67043j501o02M14J117J171J085J549K370K845K891L054L407L391K955L021
$$ 967043 965542 964940 965354 966471 967642 968727 970276 972646 975491 978382 981436 984843 988234 991189 994210
52194I94210M221N766O293N581M733M640M946M782L911K707J411J7j304k347l427
$$ 994210 998431 1004197 1010490 1016071 1020804 1025444 1030390 1035172 1039083 1041790 1043201 1043218 1041914 1039567 1036140
52179A036140n106p185q631q914q749q949r117q350o829n652n160m539l323k231
$$ 1036140 1031034 1023849 1015218 1006304 997555 988606 979489 971139 964310 958658 953498 948959 945636 943405
52165I43405j911j755p88Q31K049K414K458K665K851K681K218J723J374J314J592
$$ 943405 941494 939739 938951 939782 941831 944245 946703 949368 952219 954900 957118 958841 960215 961529 963121
52150I63121J885J610O19m61q20l06N40J181J638K273L152L780L595K698J832
$$ 963121 965006 966616 967235 966774 965954 965648 966188 967369 969007 971280 974432 978212 981807 984505 986337
52135I86337J575J790K103K584L600N097O634Q126J0054J2666J5421J7632J9305
$$ 986337 987912 989702 991805 994389 997989 1003086 1009720 1017846 1027900 1040566 1055987 1073619 1092924
52122A092924K0874K2290K3099K3399K4023K5381K6653K6792K5973K5329K5317
$$ 1092924 1113798 1136088 1159187 1182586 1206609 1231990 1258643 1285435 1311408 1336737 1362054
52111A362054K5178K4227K2913K2003K1365K0352J9001J7955J7304J6455J5259
$$ 1362054 1387232 1411459 1434372 1456375 1477740 1498092 1517093 1535048 1552352 1568807 1584066
52100A584066J4319J3818J2916J0927Q411O263M261J490k090n489q133j0526j3165
$$ 1584066 1598385 1612203 1625119 1636046 1644457 1650720 1654981 1656471 1654381 1648892 1640759 1630233 1617068
52087A617068j5632j7252j8059j8557j8921j8945j8583j8021j7343j6489j5491
$$ 1617068 1601436 1584184 1566125 1547568 1528647 1509702 1491119 1473098 1455755 1439266 1423775
52076A423775j4402j3113j1503r719p999o262m283k154j77J720M004O767R389
$$ 1423775 1409373 1396260 1384757 1375038 1367039 1360777 1356494 1354340 1354163 1355883 1359887 1366654 1376043
52063A376043J1261J2502J3595J4546J4962J4838J4771J5249J6111J6904J7400
$$ 1376043 1387304 1399806 1413401 1427947 1442909 1457747 1472518 1487767 1503878 1520782 1538182
52052A538182J7478J6819J5126J2581R749P042M490K013m75l194o361r623j2067
$$ 1538182 1555660 1572479 1587605 1600186 1609935 1616977 1621467 1623480 1623005 1619811 1613450 1603827 1591760
52039A591760j3121j3298j3624j4446j5249j5704j6276j7408j8583j8836j8118
$$ 1591760 1578639 1565341 1551717 1537271 1522022 1506318 1490042 1472634 1454051 1435215 1417097
52028A417097j7484j7753j8555j9040j9035j8949j8896j8601j8097j7775j7636
$$ 1417097 1399613 1381860 1363305 1344265 1325230 1306281 1287385 1268784 1250687 1232912 1215276
52017A215276j7125j6015j4832j4063j3423j2487j1538j1134j1130j0938j0637
$$ 1215276 1198151 1182136 1167304 1153241 1139818 1127331 1115793 1104659 1093529 1082591 1071954
52006A071954j1013j2324j3753j4482j4696j5104j5874j6488j6438j5632j4325
$$ 1071954 1060941 1048617 1034864 1020382 1005686 990582 974708 958220 941782 926150 911825
51995I11825j2977j2088j1810j1732j1367j0746j0345j0483j1090j1996j3127
$$ 911825 898848 886760 874950 863218 851851 841105 830760 820277 809187 797191 784064
51984G84064j4310j5128j5212j4700j4274j4582j5509j6096j5473j3860j2349
$$ 784064 769754 754626 739414 724714 710440 695858 680349 664253 648780 634920 622571
51973F22571j1541j0884r561p651n852m340k556k40K065L680M526M876M823M381
$$ 622571 611030 600146 590585 582934 577082 572742 570186 569946 572011 575691 580217 585093 589916 594297
51959E94297L737L006J943L79j292k505l281m039m775n035m747m370l990k923
$$ 594297 598034 601040 602983 603362 602070 599565 596284 592245 587470 582435 577688 573318 569328 566405
51945E66405o94K120M609O590Q340R661J0052R711R469R686R948R947R782R225
$$ 566405 565711 567831 572440 579030 587370 597031 607083 616794 626263 635949 645897 655844 665626 674851
51931F74851P563M723J736n40k476m728o899q129q572r172j0117j0591j0136r226
$$ 674851 682414 687137 688873 688333 685857 681129 674230 666101 657529 648357 638240 627649 617513 608287
51917F08287q227o709m248j211J701M080N533N476L801J383p15k297l838n544
$$ 608287 600060 593351 589103 587892 589593 593673 599206 604682 608483 609866 609151 606854 603016 597472
51903E97472p112q232q714q321p052n645n193o076p605q898r810j0739j1777j2404
$$ 597472 590360 582128 573414 565093 558041 552396 547203 541127 533522 524624 514814 504075 492298 479894
51889D79894j2091j0955r593q317o859m941k872j216j07P94J781K965M567O657
$$ 479894 467803 456848 447255 438938 432079 427138 424266 423050 422943 423737 425518 428483 433050 439707
51875D39707Q562R207Q351O969O007N324M267K794J393L11n20r92r70p93j045
$$ 439707 448269 457476 465827 472796 478803 484127 488394 491188 492581 492892 492372 491380 490410 489617 488572
51860D88572j752k352k412j935j004K66J411J752J142J52o31j178j797k675l777
$$ 488572 486820 484468 482056 480121 479117 479383 480794 482546 483688 483840 483209 482031 480234 477559 473782
51845D73782m920n784o128o062n922n811n540n079m632m243l675k852k056j487
$$ 473782 468862 463078 456950 450888 444966 439155 433615 428536 423904 419661 415986 413134 411078 409591
51831D09591r86m02J16M10O49J010J257R95K15p27j549k139k340j962j125k40
$$ 409591 408605 408203 408319 408729 409378 410388 411645 412640 412855 412128 410579 408440 406100 404138 403013 402773
51815D02773L87P56R58R97R28R20J035J051P00O0m85p05p33q02q71o57k2Q22J461
$$ 402773 403160 403916 404874 405871 406799 407719 408754 409805 410505 410565 410080 409375 408642 407840 406969 406312 406290 407112 408573
51796D08573J605J292Q28N08K85j56r16j557j576j103q21j056j403j349r96p94
$$ 408573 410178 411470 412298 412806 413091 412935 412019 410462 408886 407783 406962 405906 404503 403154 402158 401364
51780D01364q52q24m61J36P04J082J276J542K235L356M388M898N145N683O436
$$ 401364 400512 399688 399227 399363 400067 401149 402425 403967 406202 409558 413946 418844 423989 429672 436108
51765D36108O732O279N607N300N196M672L422J648l01k167l775n065o050o653
$$ 436108 442840 449119 454726 460026 465222 469894 473316 474964 474663 472496 468721 463656 457606 450953
51751D50953o748o481o324o546o786o423n297l754k171o82N96J465J897K210K760
$$ 450953 444205 437724 431400 424854 418068 411645 406348 402594 400423 399741 400337 401802 403699 405909 408669
51736D08669L562M350M948N391N677N556M719L265J764Q08M90N07O40R16J286
$$ 408669 412231 416581 421529 426920 432597 438153 442872 446137 447901 448709 449199 449706 450346 451262 452548
51721D52548J463J215O30r8r80k066l130l754l736l168k283j435j133j597k273
$$ 452548 454011 455226 455856 455758 454778 452712 449582 445828 442092 438924 436641 435206 434073 432476 430203
51706D30203k254j399n48l35k85L92J474J964J524Q85P08P52N71K67R7j96r19
$$ 430203 427949 426550 426002 425667 425382 425774 427248 429212 430736 431621 432329 433081 433652 433919 434016 433820 432901
51689D32901j698j855j452j267j764k671l547m209m450m034l118k295j864j512
$$ 432901 431203 429348 427896 426629 424865 422194 418647 414438 409988 405954 402836 400541 398677 397165
51675C97165q84m8P88J613K383K820K861K918L410M305N377O523P477P632O628
$$ 397165 396281 396233 397021 398634 401017 403837 406698 409616 413026 417331 422708 429231 436708 444340 450968
51660D50968M962L454K312J097m97k206l472l803l005j347N59K300L869N193N790
$$ 450968 455930 459384 461696 462793 462296 460090 456618 452815 449810 448463 449022 451322 455191 460384 466174
51645D66174N265L799J756q08l733o341q062r207j0296j0861r920p608n301l929
$$ 466174 471439 475238 476994 476186 472453 466112 458050 448843 438547 427686 417766 410158 404857 400928
51631D00928l074k132j376j223j146k97J109J894J432M25l5K35N10K26k63k61
$$ 400928 397854 395722 394346 393123 391977 391680 392789 394683 396115 396540 396505 396740 397250 397476 397213 396952
51615C96952K55N61K32k39l00k99r24j964k479k186j812j828j686q21L16R11J000
$$ 396952 397207 397768 398000 397761 397461 397162 396238 394274 391795 389609 387797 385969 384283 383462 383778 384689 385689
51598C85689J368K406L721M824N690O568P501Q105P772O222L913J699pj447k761
$$ 385689 387057 389463 393184 398008 403698 410266 417767 425872 433644 439866 443779 445478 445471 444024 441263
51583D41263l549l446k774k162j689q45Q39L327O171Q749J0586J1691J2529J3481
$$ 441263 437714 434268 431494 429332 427643 426798 427637 430964 437135 445884 456470 468161 480690 494171
51569D94171J4521J5437J6064J6206J5735J5074J5093J6148J7579J8602J9337
$$ 494171 508692 524129 540193 556399 572134 587208 602301 618449 636028 654630 673967
51558F73967K0497K2350K4515K6450K7486K6679K3465J8463J2970P551J744m767
$$ 673967 694464 716814 741329 767779 795265 821944 845409 863872 876842 884393 886137 881370
51546H81370j1346j7032k1465k4899k7715l0151l2111l3052l2350l0027k6826
$$ 881370 870024 852992 831527 806628 778913 748762 716651 683599 651249 621222 594396
51535E94396k3445k0087j6927j4482j3045j2077j0701q711o689n186m185l426
$$ 594396 570951 550864 533937 519455 506410 494333 483632 474921 468232 463046 458861 455435
51523D55435k853k568k498k332j737o59N42J325J479J375J539J950J982J157k69
$$ 455435 452582 450014 447516 445184 443447 442788 443330 444655 446134 447509 449048 450998 452980 454137 453868
51508D53868j690k881m006m996n408n029m224l409k587j715j151j224j558j523
$$ 453868 452178 449297 445291 440295 434887 429858 425634 422225 419638 417923 416772 415548 413990 412467
51494D12467j202j264j807k067j564q36o20q56j055j175j486j891j998j806j725
$$ 412467 411265 410001 408194 406127 404563 403727 403107 402251 401196 400021 398535 396644 394646 392840 391115
51479C91115j944k265k473k461k060j213k85K10K11J2k99q76j591k024k004j785
$$ 391115 389171 386906 384433 381972 379912 378699 378414 378624 378835 378847 378548 377672 376081 374057 372053 370268
51463C70268j558j317j200j516k200k724k677k115j201K7J304K034J923J428J312
$$ 370268 368710 367393 366193 364677 362477 359753 357076 354961 353760 353787 355091 357125 359048 360476 361788
51448C61788J925L147M688O182P274P973Q683R635J0437J0460R477P764N759L954
$$ 361788 363713 366860 371548 377730 385004 392977 401660 411295 421732 432192 441669 449433 455192 459146
51434D59146K829K516K567K333J471n1k155m503o420p418p746p962q054p485o096
$$ 459146 461975 464491 467058 469391 470862 470811 468656 464153 457733 450315 442569 434607 426553 419068 412972
51419D12972m466l110j907o24M63R32R44J104J633K173K412K422K218J529L58
$$ 412972 408506 405396 403489 402865 403328 404260 405204 406308 407941 410114 412526 414948 417166 418695 419053
51404D19053o24p21q8N38Q71J251J780J953J515J088J441K487L614M686N992P310
$$ 419053 418429 417708 417620 418158 419029 420280 422060 424013 425528 426616 428057 430544 434158 438844 444836 452146
51388D52146P955P945Q357J0065J2736J5625J8806K2842K7455L1373L3702L4899
$$ 452146 460101 468046 476403 486468 499204 514829 533635 556477 583932 615305 649007 683906
51376F83906L6130L7996M0057M1258M0530L7291L1695K4496J6452P958q09r525
$$ 683906 720036 758032 798089 839347 879877 917168 948863 973359 989811 997769 996960 987435
51364I87435j7724k5047l1284l6200l9491m1007m0993m0018l8588l6788l4322
$$ 987435 969711 944664 913380 877180 837689 796682 755689 715671 677083 640295 605973
51353F05973l1015k7261k3822k1126j8852j6345j3389j0472q336p368p331p553
$$ 605973 574958 547697 523875 502749 483897 467552 454163 443691 435355 427987 420656 413103
51341D13103p384o630n618m742m025l290k641k405k553k558k080j527j534k106
$$ 413103 405719 399089 393471 388729 384704 381414 378773 376368 373815 371257 369177 367650 366116 364010
51327C64010k613k561j988j153k57M52P56P69Q57J116J239J073R32J081J289J255
$$ 364010 361397 358836 356848 355695 355438 355890 356646 357415 358272 359388 360627 361700 362632 363713 365002 366257
51311C66257J196J571K340K940K950K464J809J198O58O0p85j785k443k352j814
$$ 366257 367453 369024 371364 374304 377254 379718 381527 382725 383383 383443 382658 380873 378430 376078 374264
51296C74264j617k126k920l353l187k570j776j093p25n35j51N42J198J492J607
$$ 374264 372647 370521 367601 364248 361061 358491 356715 355622 354897 354362 354211 354753 355951 357443 359050
51281C59050J936K498K955L131L214L376L490L343K972K576K231J855J477J303
$$ 359050 360986 363484 366439 369570 372784 376160 379650 382993 385965 388541 390772 392627 394104 395407
51267C95407J465J831K214K626L039L042K110L90j159j705j473j392j992k898
$$ 395407 396872 398703 400917 403543 406582 409624 411734 412124 410965 409260 407787 406395 404403 401505
51253D01505l416l244k610j954j569j413j193p94n42q20j459j777j340n11p2m62
$$ 401505 398089 394845 392235 390281 388712 387299 386106 385312 384770 383950 382491 380714 379374 378863 378791 378329
51237C78329j367k056k034j491j044j050j289j395j333j223r39l38K80M00Km13
$$ 378329 376962 374906 372872 371381 370337 369287 367998 366603 365270 364047 363108 362770 363050 363450 363452 363039
51221C63039n54o41q41q54k94Q18K111L133L490L090K477K463L179L817L626K803
$$ 363039 362485 361844 361003 360149 359855 360673 362784 365917 369407 372497 374974 377437 380616 384433 388059 390862
51205C90862K070J704J457J216J214J591K120K411K149J248Or86j349j361j611
$$ 390862 392932 394636 396093 397309 398523 400114 402234 404645 406794 408042 408048 407062 405713 404352 402741
51190D02741k205k633k421j735j205j204j438j317p41l35o36j212j057J57J638
$$ 402741 400536 397903 395482 393747 392542 391338 389900 388583 387842 387507 386871 385659 384602 384759 386397
51175C86397K473K475J856P08o27j330r35j25J07j95k09K21M03J05R4R19K018
$$ 386397 388870 391345 393201 393909 393282 391952 391017 390892 390999 390804 390595 390816 391219 391324 391418 392337 394355
51158C94355K541K508K560K941L348L514L369K800J745N59j85k66mQ8l19j260
$$ 394355 396896 399404 401964 404905 408253 411767 415136 417936 419681 420240 420055 419789 419785 419873 419554 418294
51142D18294k391l157l295l120l051k955k308j048J05M14k1l99j35O04J209J343
$$ 418294 415903 412746 409451 406331 403280 400325 398017 396969 397074 397488 397467 397068 396933 397537 398746 400089
51126D00089J232J295J695K316L035L746M184M027L285K444K003K040K315K645
$$ 400089 401321 402616 404311 406627 409662 413408 417592 421619 424904 427348 429351 431391 433706 436351
51112D36351K938L058K875K423J865J351J072J243J809K263K078J298M47j10l91
$$ 436351 439289 442347 445222 447645 449510 450861 451933 453176 454985 457248 459326 460624 461071 460961 460570
51097D60570m06k2O96J345J589J472J085L13q06j753k028j795j566j369p58K37
$$ 460570 460164 460142 460838 462183 463772 465244 466329 466642 465836 464083 462055 460260 458694 457325 456567 456804
51081D56804Q16L58p14j450j532j404j370j090j55J213K351K933L184L438L729
$$ 456804 457620 457978 457264 455814 454282 452878 451508 450418 450263 451476 453827 456760 459944 463382 467111
51066D67111L922M092M529N380O435P433Q473R965J2023J4038J5116J4889J3832
$$ 467111 471033 475125 479654 485034 491469 498902 507375 517340 529363 543401 558517 573406 587238
51053E87238J2693J1860J1378J1322J1778J2467J2720J2109J0947R927R236Q225
$$ 587238 599931 611791 623169 634491 646269 658736 671456 683565 694512 704439 713675 721900
51041G21900O056K601j384m914p472r025r639r348q499p888q250r548j1007j1844
$$ 721900 727956 730557 729173 724259 716787 707762 698123 688775 680276 672388 664138 654590 643583 631739
51027F31739j1879j1387j0642r759q738p449n720l629j599P9J645L424N107N985
$$ 631739 619860 608473 597831 588072 579334 571885 566165 562536 560937 561016 562661 566085 571192 577177
51013E77177N970N825O111O470O364O034O136O753P476Q247R376J0659J1334J1128
$$ 577177 583147 588972 595083 601553 607917 613951 620087 626840 634316 642563 651939 662598 673932 685060
50999F85060J0642J0334R841Q827P875P769Q209Q133P184O106N584N400N059M631
$$ 685060 695702 706036 715877 724704 732579 740348 748557 756690 763874 769980 775564 780964 786023 790654
50985G90654M570N088O128P685R679J1674J3241J4596J6437J8960K1444K3115
$$ 790654 795224 800312 806440 814125 823804 835478 848719 863315 879752 898712 920156 943271
50973I43271K4216K5762K8278L1277L4097L6856M0182M4323M8971N3769N8523
$$ 943271 967487 993249 1021527 1052804 1086901 1123757 1163939 1208262 1257233 1311002 1369525
50962A369525O2921O6597O9550P1992P3689P3991P2718P0414O7383O3092N7069
$$ 1369525 1432446 1499043 1568593 1640585 1714274 1788265 1860983 1931397 1998780 2061872 2118941
50951B118941M9795M2067L3989K5394J6869R336K772l578r637j4241j6752j8024
$$ 2118941 2168736 2210803 2244792 2270186 2287055 2296391 2299163 2295585 2285948 2271707 2254955 2236931
50939B236931j9224k0597k1907k3338k5071k6610k7423k7971k9145l0845l2045
$$ 2236931 2217707 2197110 2175203 2151865 2126794 2100184 2072761 2044790 2015645 1984800 1952755
50928A952755l2363l2705l4111l6559l9288m1728m3691m5091m6001m6802m7746
$$ 1952755 1920392 1887687 1853576 1817017 1777729 1736001 1692310 1647219 1601218 1554416 1506670
50917A506670m8388m7908m6087m3579m1061l8443l5265l1668k8410k5922k3857
$$ 1506670 1458282 1410374 1364287 1320708 1279647 1241204 1205939 1174271 1145861 1119939 1096082
50906A096082k1797j9979j8822j8014j6688j4520j2172j0477r571r018q391p521
$$ 1096082 1074285 1054306 1035484 1017470 1000782 986262 974090 963613 954042 945024 936633 929112
50894I29112o435n338m435l598k414p08J132K523L205L247K886K522K622L321
$$ 929112 922677 917339 912904 909306 906892 906184 907316 909839 913044 916291 919177 921699 924321 927642
50880I27642M287N211O166P268Q293Q973R503J0306J1418J2543J3610J4910J6585
$$ 927642 931929 937140 943306 950574 958867 967840 977343 987649 999067 1011610 1025220 1040130 1056715
50867A056715J8363J9942K1394K3090K5419K8527L2210L6023L9719M3621M8356
$$ 1056715 1075078 1095020 1116414 1139504 1164923 1193450 1225660 1261683 1301402 1345023 1393379
50856A393379N4238O1027O8297P5838Q3672R1884J00574J09794J19433J29184
$$ 1393379 1447617 1508644 1576941 1652779 1736451 1828335 1928909 2038703 2158136 2287320
50846B287320J38661J47492J55332J61865J66830J69982J70992J69388J64562
$$ 2287320 2425981 2573473 2728805 2890670 3057500 3227482 3398474 3567862 3732424
50837C732424J55939J43300J27036J07901Q6513O3247L8745J4229q898k9649m7527
$$ 3732424 3888363 4031663 4158699 4266600 4353113 4416360 4455105 4469334 4460436 4430787 4383260
50826D383260o2185p3300q0620q4019q3574p9841p3917o7030o0068n3654m8463
$$ 4383260 4321075 4247775 4167155 4083136 3999562 3919721 3845804 3778774 3718706 3665052 3616589
50815C616589m5223m4381m5953m9655n5049o1696o9297p7608q6118r4077j00991
$$ 3616589 3571366 3526985 3481032 3431377 3376328 3314632 3245335 3167727 3081609 2987532 2886541
50804B886541j06822j11386j13877j13459j10205j04987r8537r1039q2609p3636
$$ 2886541 2779719 2668333 2554456 2440997 2330792 2225805 2127268 2036229 1953620 1879984
50794A879984o4408n4922m5328l6315k8576k2050j6003r915m075Q39M547P274
$$ 1879984 1815576 1760654 1715326 1679011 1650435 1628385 1612382 1602467 1598392 1599231 1603778 1611052
50782A611052R087R597Q581O675M868L372J536j018l773o141q231j0367j2357
$$ 1611052 1620139 1629736 1638317 1644992 1649860 1653232 1654768 1653750 1649977 1643836 1635605 1625238 1612881
50769A612881j3940j5564j7962k1061k3993k6103k7426k8195k8549k8695k8765
$$ 1612881 1598941 1583377 1565415 1544354 1520361 1494258 1466832 1438637 1410088 1381393 1352628
50758A352628k8410k7145k5079k2772k0355j7524j4421j1667r307o565l104L62
$$ 1352628 1324218 1297073 1271994 1249222 1228867 1211343 1196922 1185255 1175948 1169383 1166279 1166641
50746A166641L241O119R832J4144J8297K2404K7232L2717L7866M2304M6909N2538
$$ 1166641 1169882 1176001 1185833 1199977 1218274 1240678 1267910 1300627 1338493 1380797 1427706 1480244
50734A480244N8863O4998P0650P5991Q0826Q4695Q7627R0101R2189R3283R2819
$$ 1480244 1539107 1604105 1674755 1750746 1831572 1916267 2003894 2093995 2186184 2279467 2372286
50723B372286R0749Q7161Q1937P5129O7168N8217M7595L4503J9236L147j2527
$$ 2372286 2463035 2550196 2632133 2707262 2774430 2832647 2880242 2914745 2933981 2937128 2924601
50712B924601k7257m0537n1353n8763o2646o3453o1583n7422n1750m5581l9518
$$ 2924601 2897344 2856807 2805454 2746691 2684045 2620592 2559009 2501587 2449837 2404256 2364738
50701B364738l3594k7785k2495j8553j6768j7404k0061k4162k9505l5929m2573
$$ 2364738 2331144 2303359 2280864 2262311 2245543 2228139 2208078 2183916 2154411 2118482 2075909
50690B075909m8143n2114n5027n7209n7915n6400n3133m9118m4412l8351l1017
$$ 2075909 2027766 1975652 1920625 1863416 1805501 1749101 1695968 1646850 1602438 1564087 1533070
50679A533070k3434j6257r125j506O543J4646K2484K9639L5696M0686M4923M8320
$$ 1533070 1509636 1493379 1484254 1482748 1489291 1503937 1526421 1556060 1591756 1632442 1677365 1725685
50667A725685N0394N0973N0314M8448M5142M0683L5952L1538K7420K3675K0749
$$ 1725685 1776079 1827052 1877366 1925814 1970956 2011639 2047591 2079129 2106549 2130224 2150973
50656B150973J8663J6756J4623J2584J0813Q834O433M396L594L848M416N133O464
$$ 2150973 2169636 2186392 2201015 2213599 2224412 2233246 2239679 2244075 2247669 2251517 2255933 2261066 2267530
50643B267530Q677J1683J5313J9224K2800K5778K8642L1803L4703L6329L6414
$$ 2267530 2276207 2287890 2303203 2322427 2345227 2371005 2399647 2431450 2466153 2502482 2538896
50632B538896L5460L3819L1489K8690K5915K3377K0994J8855J6899J4000Q182
$$ 2538896 2574356 2608175 2639664 2668354 2694269 2717646 2738640 2757495 2774394 2788394 2796576
50621B796576j555j3896k6038l5803m2712m7189m9239m8243m3924l7076k9099
$$ 2796576 2795021 2781125 2755087 2719284 2676572 2629383 2580144 2531901 2487977 2450901 2421802
50610B421802k1055j3537p152k544J11R70j74l841r834j6953k4101l1228l8698
$$ 2421802 2400747 2387210 2380058 2377514 2377625 2378595 2378421 2374580 2364746 2347793 2323692 2292464 2253766
50597B253766m6273n3152n8706o2708o5195o6457o6833o6210o4166o0819n6941
$$ 2253766 2207493 2154341 2095635 2032927 1967732 1901275 1834442 1768232 1704066 1643247 1586306
50586A586306n2965m8680m4247m0596l7995l5285l1567k7824k5531k4249k2138
$$ 1586306 1533341 1484661 1440414 1399818 1361823 1326538 1294971 1267147 1241616 1217367 1195229
50575A195229j8602j4899j2080r789p368m814k144J026M692Q110J0798J3054J5125
$$ 1195229 1176627 1161728 1149648 1139859 1132491 1127677 1125533 1126559 1131251 1139361 1150159 1163213 1178338
50562A178338J6691J7781J9394K2418K6485L0507L3989L7231M0553M3829M6594
$$ 1178338 1195029 1212810 1232204 1254622 1281107 1311614 1345603 1382834 1423387 1467216 1513810
50551A513810M8331M8902M8832M8812M8769M7912M5938M3663M2117M1564M1698
$$ 1513810 1562141 1611043 1659875 1708687 1757456 1805368 1851306 1894969 1937086 1978650 2020348
50540B020348M2341M3534M5367M8091N1998N6875O1959O6721P1210P5451P9199
$$ 2020348 2062689 2106223 2151590 2199681 2251679 2308554 2370513 2437234 2508444 2583895 2663094
50529B663094Q2686Q6896R2374R8358J03747J08435J12864J16683J18828J18782
$$ 2663094 2745780 2832676 2925050 3023408 3127155 3235590 3348454 3465137 3583965 3702747
50519C702747J16754J12677J05939R6350Q4485P0769N4943L6957J7728j595k0685
$$ 3702747 3819501 3932178 4038117 4134467 4218952 4289721 4344664 4381621 4399349 4397754 4377069
50508D377069l9709n8076p4359q7547r7863j05919j11416j13198j10513j03770
$$ 4377069 4337360 4279284 4204925 4117378 4019515 3913596 3802180 3688982 3578469 3474699
50498C474699r3899q1402o6445m9653l2378j5978j174J1776K2457L0045L3630
$$ 3474699 3380800 3299398 3232953 3183300 3150922 3134944 3133770 3145546 3168003 3198048 3231678
50487C231678L2652K7014J6805K152j6319l6887n7108p5204r0801j04017j14368
$$ 3231678 3264330 3291344 3308149 3310301 3293982 3257095 3199987 3124783 3033982 2929965 2815597
50476B815597j21150j24573j25549j24357j20489j14052j06391r8784r1186q2959
$$ 2815597 2694447 2569874 2444325 2319968 2199479 2085427 1979036 1880252 1789066 1706107
50466A706107p4333o6394n9826n4239m8787m2990l7004l1379k6560k2508j8883
$$ 1706107 1631774 1565380 1505554 1451315 1402528 1359538 1322534 1291155 1264595 1242087 1223204
50455A223204j5648j3172j1545j0190q490o526m803l428j968q0K108M296O393
$$ 1223204 1207556 1194384 1182839 1172649 1164159 1157633 1152830 1149402 1147434 1147354 1149462 1153758 1160151
50442A160151Q574J0992J3402J5116J5564J4953J4120J3624J3236J2474J1329
$$ 1160151 1168725 1179717 1193119 1208235 1223799 1238752 1252872 1266496 1279732 1292206 1303535
50431A303535J0298R965J0727J2604J5157J7725J9956K1859K3386K4427K5282
$$ 1303535 1313833 1323798 1334525 1347129 1362286 1380011 1399967 1421826 1445212 1469639 1494921
50420A494921K6565K8442L0424L2183L4038L6350L9041M2084M5761M9943N3804
$$ 1494921 1521486 1549928 1580352 1612535 1646573 1682923 1721964 1764048 1809809 1859752 1913556
50409A913556N6865N9742O2959O5621O6213O4485O1569N8402N4956N0835M5748
$$ 1913556 1970421 2030163 2093122 2158743 2224956 2289441 2351010 2409412 2464368 2515203 2560951
50398B560951L9306L1238K1953J2156J948q960k0282l1260m1789n2282o2136o9468
$$ 2560951 2600257 2631495 2653448 2665604 2667552 2658592 2638310 2607050 2565261 2512979 2450843 2381375
50386B381375p2979p3261p1655o8577o3647n6844m8695l9741l0496k1659j3639
$$ 2381375 2308396 2235135 2163480 2094903 2031256 1974412 1925717 1885976 1855480 1833821 1820182
50375A820182o178J012P322J1575J3104J2031Q691L376l437j1190j9639k8612
$$ 1820182 1814004 1815016 1822338 1833913 1847017 1859048 1867739 1871115 1867678 1856488 1836849 1808237
50363A808237l7365m4668m9764n2873n4550n4998n4211n2551n0692m9002m7229
$$ 1808237 1770872 1726204 1676440 1623567 1569017 1514019 1459808 1407257 1356565 1307563 1260334
50352A260334m4912m2001l8954l6133l3304k9918k5866k1700j7995j4677j1206
$$ 1260334 1215422 1173421 1134467 1098334 1065030 1035112 1009246 987546 969551 954874 943668
50341I43668p372l640o51J472L172M774N810N310K874p29m258p123r449j1171
$$ 943668 936296 932656 932005 933477 936649 941423 947233 952543 955417 954688 950430 943307 933858 922687
50327I22687j1747j1042r817q849p911o217l747j412J09J118K299L859N514O990
$$ 922687 910940 899898 890081 881232 873321 867104 863357 861945 862054 863172 865471 869330 874844 881834
50313H81834Q065Q438Q021P323P168P810Q695R153R181R268R680J0195J0513J0579
$$ 881834 889899 898337 906358 913681 920849 928659 937354 946507 955688 964956 974636 984831 995344 1005923
50299A005923J0421R987R442R337J0131J1526J2655J3013J3021J3542J4984J7033
$$ 1005923 1016344 1026331 1035773 1045110 1055241 1066767 1079422 1092435 1105456 1118998 1133982 1151015
50287A151015J9243K1754K5198K9545L2957L2306K5563J3839O15j1086k0329k7282
$$ 1151015 1170258 1192012 1217210 1246755 1279712 1312018 1337581 1351420 1352035 1340949 1320620 1293338
50275A293338l1619l2733l0865k7102k2387j7323j2801r721p892o089l708j578
$$ 1293338 1261719 1228986 1198121 1171019 1148632 1131309 1118508 1108787 1100895 1094806 1091098 1089520
50263A089520n19J05J470L491N060N949P235R633J2473J4825J6829J9214K2199
$$ 1089520 1089001 1089106 1090576 1094067 1099127 1105076 1112311 1121944 1134417 1149242 1166071 1185285 1207484
50250A207484K5610K9594L4312L9202M3404M6738M9521N1527N2061N1070M9183
$$ 1207484 1233094 1262688 1297000 1336202 1379606 1426344 1475865 1527392 1579453 1630523 1679706
50239A679706M6535M2554L7476L2992L0512K9313K7392K3692J8530J2101L770
$$ 1679706 1726241 1768795 1806271 1839263 1869775 1899088 1926480 1950172 1968702 1980803 1984573
50228A984573o764j8513k9913m0069m8809n5929o0872o3166o2865o0546n6917
$$ 1984573 1977809 1959296 1929383 1889314 1840505 1784576 1723704 1660538 1597673 1537127 1480210
50217A480210n2425m7233m1726l6924l4048l3433l4161l4869l4836l4114l2908
$$ 1480210 1427785 1380552 1338826 1301902 1267854 1234421 1200260 1165391 1130555 1096441 1063533
50206A063533l1158k8769k5948k3138k0637j8425j6377j4571j3256j2522j2145
$$ 1063533 1032375 1003606 977658 954520 933883 915458 899081 884510 871254 858732 846587
50195H46587j1797j1240j0333r025p569o501o183o367o465o180n708n346n049
$$ 846587 834790 823550 813217 804192 796623 790122 783939 777572 771107 764927 759219 753873 748824
50182G48824m453l331k040j372j729k428k308j147k3O7m85n70Q5P48Q84P50P57
$$ 748824 744371 741040 739000 737628 735899 733471 731163 730016 729993 730060 729575 729005 729090 729838 730722 731472 732229
50165G32229R62J460K542M103N333N538M984M652N229O599Q102R207R976J0921
$$ 732229 733191 734651 737193 741296 746629 752167 757151 761803 767032 773631 781733 790940 800916 811837
50151H11837J2274J3472J3732J3049J2141J1573J1424J1870J3210J5154J6846
$$ 811837 824111 837583 851315 864364 876505 888078 899502 911372 924582 939736 956582
50140I56582J8088J9924K3391K8204L3363L8633M4633N1709N9448O7370P5465
$$ 956582 974670 994594 1017985 1046189 1079552 1118185 1162818 1214527 1273975 1341345 1416810
50129A416810Q3849R2150R9328J03991J05158J03067R9061R4402Q9427Q4095P8848
$$ 1416810 1500659 1592809 1692137 1796128 1901286 2004353 2103414 2197816 2287243 2371338 2450186
50118B450186P4201O9782O4479N7511M8669L7561K3430O050j3664l4074n3473
$$ 2450186 2524387 2594169 2658648 2716159 2764828 2802389 2825819 2831869 2818205 2784131 2730658
50107B730658p0418q4112r4737j02946j08836j11825j11657j08883j04160r7748
$$ 2730658 2660240 2576128 2481391 2378445 2269609 2157784 2046127 1937244 1833084 1735336
50097A735336r0088q2261p5186o8706o2150n5516m9497m4413l9808l5226l0835
$$ 1735336 1645248 1562987 1487801 1419095 1356945 1301429 1251932 1207519 1167711 1132485 1101650
50086A101650k6999k3641k0366j7041j3949j1409r447p903o614n433m161k754
$$ 1101650 1074651 1051010 1030644 1013603 999654 988245 978798 970895 964281 958848 954687 951933
50074I51933j527r46j062j315j159o57k99l24n56q16j087j329j532j961k883l953
$$ 951933 950406 949460 948398 947083 945924 945267 944968 944644 944088 943272 942185 940856 939324 937363 934480 930527
50058I30527m351l854l262l436m307n219n842o179n974m887l237j909j332j048
$$ 930527 926176 922322 919060 915624 911317 906098 900256 894077 888103 883216 879979 878070 876738 875690
50044H75690m72M59J572K945M603O095O909P273Q031R630J1556J2889J3299J3268
$$ 875690 875218 875677 877249 880194 884797 890892 897801 905074 913105 922735 934291 947180 960479 973747
50030I73747J3532J4389J5498J6256J6334J5942J5509J5137J4496J3414J2404
$$ 973747 987279 1001668 1017166 1033422 1049756 1065698 1081207 1096344 1110840 1124254 1136658
50019A136658J2412J3941J6584J9409K1736K3542K5339K7774L1194L5405L9854
$$ 1136658 1149070 1163011 1179595 1199004 1220740 1244282 1269621 1297395 1328589 1363994 1403848
50008A403848M4130M8073N1320N3039N2568N0233M7125M4007M0804L7330L4065
$$ 1403848 1447978 1496051 1547371 1600410 1652978 1703211 1750336 1794343 1835147 1872477 1906542
49997A906542L1751L0268K8300K4215J7131P170n129j9314l4746n0049o3313p3255
$$ 1906542 1938293 1968561 1996861 2021076 2038207 2045377 2040248 2020934 1986188 1936139 1872826 1799571
49985A799571p9980q4260q6299q5681q2459p7544p1800o5416n8523n1777m5775
$$ 1799571 1719591 1635331 1549032 1463351 1380892 1303348 1231548 1166132 1107609 1055832 1010057
49974A010057m0399l5309l0693k6831k3350j9784j6615j4691j3634j1981r223
$$ 1010057 969658 934349 903656 876825 853475 833691 817076 802385 788751 776770 767547
49963G67547o668n695n959o092n481m502l458k224q35M26J571K899M358N474N993
$$ 767547 760879 755184 749225 743133 737652 733150 729692 727468 726633 727059 728630 731529 735887 741361 747354
49948G47354O129O036N544M564L382K301J383O20J14k11p85k061m034o174p763
$$ 747354 753483 759519 765063 769627 773009 775310 776693 777313 777427 777216 776431 774370 770336 764162 756399
49933G56399q423q570r191j0795j2574j3120j2039j0415r410q957q178o688m964
$$ 756399 747976 739406 730215 719420 706846 693726 681687 671272 661862 652905 644727 638039 633075
49920F33075l600k711k014j156L2J331K231K475K459K822L682M559N003N040N057
$$ 633075 629475 626764 624750 623594 623626 624957 627188 629663 632122 634944 638626 643185 648188 653228 658285
49905F58285N456O465P946R343J0094J0183J0130J0253J0213R428P830N987M479
$$ 658285 663741 670206 678152 687495 697589 707772 717902 728155 738368 747796 755626 761613 766092
49892G66092L275J860q2k287m293o028p719r286j0270j0498j0404j0390j0254
$$ 766092 769367 771227 771145 768858 764565 758537 750818 741532 731262 720764 710360 699970 689716
49879F89716r667q903q549q590q437p855p208o678n823m297k527j245o45l58J6
$$ 689716 680049 671146 662597 654007 645570 637715 630507 623829 618006 613709 611182 609937 609292 608934 608950
49864F08950P45K074M015O049P493Q160Q415Q636Q936R425J0229J1125J1450J0748
$$ 608950 609695 611769 615784 621833 629326 637486 645901 654537 663473 672898 683127 694252 705702 716450
$$ [...]
##END NTUPLES=NMR SPECTRUM
##END=
