##TITLE=AC1738_SEN00011_9276187_vwu7jyrfVx
##JCAMPDX= 6.0         $$ Bruker NMR JCAMP-DX V2.0
##DATA TYPE= NMR SPECTRUM
##DATA CLASS= NTUPLES
##ORIGIN= BRUKER
##OWNER= Administrator
$$ 1.72 TOPSPIN		Version 2.1
$$ 2015-08-07 22:51:30.391 -0700  Administrator@X
$$ Compression mode = diff/dup
##.OBSERVE FREQUENCY= 400.02188249412
##.OBSERVE NUCLEUS= ^1H
##.ACQUISITION MODE= SIMULTANEOUS (DQD)
##.ACQUISITION SCHEME= undefined
##.AVERAGES= 8
##.DIGITISER RES= 22
##SPECTROMETER/DATA SYSTEM= spect
##.PULSE SEQUENCE= zg30
##.SOLVENT NAME= COFFEE_meoh
##.SHIFT REFERENCE= INTERNAL, COFFEE_meoh, 1, 14.98509
##AUDIT TRAIL= $$ (NUMBER, WHEN, WHO, WHERE, PROCESS, VERSION, WHAT)
$$ ##TITLE= Audit trail, TOPSPIN		Version 2.1
$$ ##JCAMPDX= 5.01
$$ ##ORIGIN= Bruker BioSpin GmbH
$$ ##OWNER= Administrator
$$ $$ E:\/data/COFFEE/nmr/AC1738_SEN00011_9276187_vwu7jyrfVx/40/pdata/1/auditp.txt
$$ ##AUDIT TRAIL=  $$ (NUMBER, WHEN, WHO, WHERE, PROCESS, VERSION, WHAT)
(   1,<2015-08-07 22:51:23.016 -0700>,<Administrator>,<X>,<go>,<TOPSPIN 2.1>,
      <created by zg
	started at 2015-08-07 22:50:16.813 -0700,
	POWCHK enabled, PULCHK disabled,
       configuration hash MD5:
       21 0F 79 D6 B3 7B B4 F6 88 20 88 DB 03 48 BD 9F
       data hash MD5: 64K
       A2 56 CA D0 6E E0 BC 10 9F 9C 59 1C AB 0C 8F 50>)
(   2,<2015-08-07 22:51:26.250 -0700>,<Administrator>,<X>,<proc1d>,<TOPSPIN 2.1>,
      <Start of raw data processing
       efp LB = 0 FT_mod = 6 PKNL = 1 PHC0 = 0 PHC1 = 0 SI = 32K 
       data hash MD5: 32K
       F8 E0 42 B0 3A B6 14 E7 99 21 BD 4B EB A1 69 7A>)
(   3,<2015-08-07 22:51:26.531 -0700>,<Administrator>,<X>,<proc1d>,<TOPSPIN 2.1>,
      <pk PHC0 = 91.84021 PHC1 = 0 
       data hash MD5: 32K
       86 AE D3 6C B5 EE B8 45 E5 87 5B BB E2 75 96 26>)
(   4,<2015-08-07 22:51:26.641 -0700>,<Administrator>,<X>,<proc1d>,<TOPSPIN 2.1>,
      <abs ABSG = 1 
       data hash MD5: 32K
       47 3D 98 49 9D 38 A7 85 33 85 59 30 DD 4B E0 3C>)
(   5,<2015-08-07 22:51:26.703 -0700>,<Administrator>,<X>,<proc1d>,<TOPSPIN 2.1>,
      <abs ABSG = 2 
       data hash MD5: 32K
       FB 3B E2 84 8B 97 38 B7 C7 11 F1 32 38 E2 C9 F1>)
(   6,<2015-08-07 22:51:26.766 -0700>,<Administrator>,<X>,<proc1d>,<TOPSPIN 2.1>,
      <abs ABSG = 3 
       data hash MD5: 32K
       04 7F 6D 9F E0 BE 4C D4 CF 92 DD E2 93 C1 0C 8F>)
(   7,<2015-08-07 22:51:26.828 -0700>,<Administrator>,<X>,<proc1d>,<TOPSPIN 2.1>,
      <abs ABSG = 4 
       data hash MD5: 32K
       64 FE 6F 86 D0 60 C8 2B 10 A4 46 C8 74 FC 68 5B>)
(   8,<2015-08-07 22:51:26.875 -0700>,<Administrator>,<X>,<proc1d>,<TOPSPIN 2.1>,
      <abs ABSG = 5 
       data hash MD5: 32K
       54 B9 9F 75 4A 49 0E 7B 0C 93 29 64 1B 84 01 77>)
$$ ##END=
$$ 
$$ $$ hash MD5
$$ $$ 7B 92 BF C5 7F F4 0B 85 D6 7E 40 84 A2 04 56 09
##$RELAX= 
##$RELAX= 
##$RELAX= 
##$RELAX= 
##$RELAX= 
##$RELAX= 
##$RELAX= 
$$ Bruker specific parameters
$$ --------------------------
##$DU= <E:\>
##$EXPNO= 40
##$NAME= <AC1738_SEN00011_9276187_vwu7jyrfVx>
$$ [...]
150 150 150 150 150 150 150 150
##$TP07= 0
##$TPNAME0= <>
##$TPNAME1= <>
##$TPNAME2= <>
##$TPNAME3= <>
##$TPNAME4= <>
##$TPNAME5= <>
##$TPNAME6= <>
##$TPNAME7= <>
##$TPOAL= (0..7)
0.5 0.5 0.5 0.5 0.5 0.5 0.5 0.5
##$TPOFFS= (0..7)
0 0 0 0 0 0 0 0
##$TUNHIN= 0
##$TUNHOUT= 0
##$TUNXOUT= 0
##$USERA1= <user>
##$USERA2= <user>
##$USERA3= <user>
##$USERA4= <user>
##$USERA5= <user>
##$V9= 5
##$VALIST= <valist>
##$VCLIST= <CCCCCCCCCCCCCCC>
##$VD= 0
##$VDLIST= <DDDDDDDDDDDDDDD>
##$VPLIST= <PPPPPPPPPPPPPPP>
##$VTLIST= <TTTTTTTTTTTTTTT>
##$WBST= 2048
##$WBSW= 25
##$XGAIN= (0..3)
0 0 0 0
##$XL= 0
##$YL= 0
##$YMAX_a= 600243
##$YMIN_a= -511537
##$ZGOPTNS= <>
##$ZL1= 120
##$ZL2= 120
##$ZL3= 120
##$ZL4= 120
##$ABSF1= 14.98509
##$ABSF2= -5.573092
##$ABSG= 5
##$ABSL= 3
##$ALPHA= 0
##$AQORDER= 0
##$ASSFAC= 0
##$ASSFACI= 0
##$ASSFACX= 0
##$ASSWID= 0
##$AUNMP= <proc_prof1d_extract_pilot.lims>
##$AXLEFT= 0
##$AXNAME= <>
##$AXNUC= <1H>
##$AXRIGHT= 0
##$AXTYPE= 0
##$AXUNIT= <>
##$AZFE= 0.1
##$AZFW= 0.1
##$BCFW= 0
##$BC_mod= 0
##$BYTORDP= 0
##$COROFFS= 0
##$CY= 15
##$DATMOD= 1
##$DC= 0
##$DFILT= <>
##$DTYPP= 0
##$F1P= 0
##$F2P= 0
##$FCOR= 0.5
##$FTSIZE= 32768
##$FT_mod= 6
##$GAMMA= 0
##$GB= 0
##$INTBC= 1
##$INTSCL= 1
##$ISEN= 128
##$LB= 0
##$LEV0= 0
##$LPBIN= 0
##$MAXI= 10000
##$MC2= 0
##$MEAN= 0
##$ME_mod= 0
##$MI= 0
##$NCOEF= 0
##$NC_proc= -8
##$NLEV= 6
##$NOISF1= 0
##$NOISF2= 0
##$NSP= 0
##$NTH_PI= 0
##$NZP= 0
##$OFFSET= 14.98509
##$PC= 1
##$PHC0= 91.84021
##$PHC1= 0
##$PH_mod= 1
##$PKNL= yes
##$PPARMOD= 0
##$PPDIAG= 0
##$PPIPTYP= 0
##$PPMPNUM= 2147483647
##$PPRESOL= 1
##$PSCAL= 4
##$PSIGN= 0
##$PYNMP= <proc.py>
##$REVERSE= no
##$SF= 400.02
##$SI= 32768
##$SIGF1= 0
##$SIGF2= 0
##$SINO= 400
##$SIOLD= 32768
##$SPECTYP= <>
##$SREGLST= <1H.CDCl3>
##$SSB= 0
##$STSI= 32768
##$STSR= 0
##$SW_p= 8223.68421052631
##$SYMM= 0
##$S_DEV= 0
##$TDeff= 65536
##$TDoff= 0
##$TI= <>
##$TILT= no
##$TM1= 0
##$TM2= 0
##$TOPLEV= 0
##$USERP1= <user>
##$USERP2= <user>
##$USERP3= <user>
##$USERP4= <user>
##$USERP5= <user>
##$WDW= 1
##$XDIM= 32768
##$YMAX_p= 444614021
##$YMIN_p= -649867
##$CURPLOT= <Network HP LaserJet P1505>
##$CURPRIN= <$Network HP LaserJet P1505>
##$DFORMAT= <normdp>
##$LAYOUT= <+/1D_H.xwp>
##$LFORMAT= <normlp>
##$PFORMAT= <normpl>
##$SURQMSG= 1
$$ End of Bruker specific parameters
$$ ---------------------------------
##NTUPLES= NMR SPECTRUM
##VAR_NAME=  FREQUENCY,     SPECTRUM/REAL,   SPECTRUM/IMAG
##SYMBOL=    X,             R,               I
##VAR_TYPE=  INDEPENDENT,   DEPENDENT,       DEPENDENT
##VAR_FORM=  AFFN,          ASDF,            ASDF
##VAR_DIM=   32768,         32768,           32768
##UNITS=     HZ,            ARBITRARY UNITS, ARBITRARY UNITS
##FACTOR=    0.250966925370066, 1,           1
##FIRST=     8223.43324360094, -20262,       -62711
##LAST=      0,             -167728,         -54935
##MIN=       0,             -649867,         0
##MAX=       8223.43324360094, 444614021,    0
$$ Real data points
##PAGE= N=1
##DATA TABLE= (X++(R..R)), XYDATA
$$ [...]
19545B14140a83519l9297A30960D2107b86312G2313M5734J22705A7457f3820m7269
19534a11089N2380J1207B66468c9158j21493g9247F5929d4415A41662c2720A46681
19522A57324i4895j05927j3701e9618j09032A39218c77797C6269J55835f1051
19511F9530c79267C3746a51275D0300i8632k65460b7390A78520a62032A83767
19500B3036a69290r2788e0346D8710a49286A97219K2836A05971c02833C4454c9658
19488F5598A9466a14376j6068B55952c78573A14947o439K2274a67473j71691a4290
19476b56160a8480j15529M2150k75307i4040A11400c9590k78109g1553b9597j64430
19465a94027P5851k64458a5423j88334e9294j99802p3870A34458n3557J67360
$$ y = [214140, -183519, -222816, 130960, 42107, -286312, 72313, 118047, 240752, 17457, -63820, -111089, -58709, -47502, 266468, -39158, -160651, -79247, 65929, -44415, 141662, -32720, 146681, 157324, -94895, -200822, -214523, -59618, -168650, 139218, -377797, 36269, 192104, -61051, 69530, -379267, 33746, -151275, 40300, -98632, -364092, -27390, 178520, -162032, 183767, 23036, -169290, -262078, -50346, 48710, -149286, 197219, 220055, 105971, -302833, 34454, -39658, 65598, 19466, -114376, -130444, 255952, -378573, 114947, 108508, 130782, -167473, -339164, -14290, -256160, -18480, -134009, -91859, -367166, -94040, 111400, -39590, -317699, -71553, -29597, -194027, -118176, -382634, -15423, -203757, -59294, -259096, -332966, 134458, 80901, 248261]
19455B48261a81654h0010E8345M2839a66588A903J28463h2094l33601a01287j08735
19444b10022A40855a00990M2930e235A20462b32526c6754l2418j01341C8619K59947
19433B98566o0467g9256l3395L5289A35152d3955j10762j23773R0581L7988p7417
19422b27338C4965f1636b2891B22148a94500A16294e3068l8824E152i8376F1453
19410b14240R4533G0286c1562l0356j39622a0709A7504J55912K1700c4510j78076
19399b12586B04856D3553i1437k56063J64260m1394d5650A1693b06069D50b63055
19387b71780f1264m1523l6324j26516B21240b19756J09121B532g4129J2785q4561
19376a45905b5479m94977a23730c4284I1445b7869j15386j02280a17374L4714
$$ y = [248261, -181654, -80010, 58345, 101184, -166588, 1903, 130366, -82094, -415695, -101287, -210022, 140855, -100990, -58060, -5235, 120462, -232526, -36754, -69172, -170513, 38619, 298566, 238099, -79256, -112651, -77362, 135152, -43955, -154717, -278490, -187909, -149921, -227338, 34965, -61636, -22891, 222148, -194500, 116294, -53068, -91892, 5152, -98376, 61453, -214240, -119707, 70286, -31562, -61918, -201540, -10709, 17504, 173416, 195116, -34510, -212586, 204856, 43553, -91437, -347500, -183240, -224634, -45650, 11693, -206069, 450, -263055, -271780, -61264, -102787, -139111, -265627, 221240, -219756, -110635, 2532, -74129, -61344, -145905, -25479, -520456, -123730, -34284, 91445, -27869, -143255, -245535, -117374, -82660]
19366h2660c2745A10712D416a82955K8906L6628j75284C42246c24442i9917d7736
19354A66916C1584N4781a71737i370K411A04132c71222a06417D4200a92613R1906
19343a00707k05083a826A73998P1303c93306A15441n0289b15981h7396k88139
19333c75535B2155d05911A68969a27764E7412J6091J34020a56770g2968m5342
19323a18310D11130b444j66492L4946j69818a03239G8773a87731A01552M3336
19313A44888M4755A0729a08731A72341i1612l32650J95235B7546J70625a20911
19302a98345B89001B2226N9537P0757j7076d819j15617A61278d5143j94519R2431
19291a47231A5071c36114c7959k49488P4707O3995j77040c5984N344j62705A92176
$$ y = [-82660, -32745, 110712, 4416, -182955, -154049, -117421, -292705, 342246, -324442, -99917, -47736, 166916, 31584, 86365, -171737, -9370, -6959, 104132, -371222, -106417, 44200, -192613, -100707, -305790, -1826, 173998, 245301, -393306, 115441, 65152, -215981, -87396, -375535, 22155, -405911, 168969, -127764, 57412, 73503, 207523, -156770, -72968, -118310, 411130, -2444, -168936, -133990, -303808, -103239, 78773, -187731, 101552, 144888, 189643, 10729, -108731, 172341, -91612, -424262, -229027, 27546, 198171, -120911, -198345, 289001, 22226, 81763, 152520, 135444, -4819, -120436, 161278, -45143, -239662, -147231, 15071, -336114, -37959, -287447, -212740, -148745, -325785, -35984, -30640, -193345, 192176]
19279A58310d4915k38956e3864n0017O292m3244c3959k415j15264B65077b05777
19267F450a76244A82634b76996m7406f0815a2527r7735o2939O7786l6036A17646
19255A0197K20136a94788C8476a18511B72052a9705k0050l20981k184b0396E9124
19243B53775J4202a74983j59835a16618I5700m7118P5048b06729A80379a43893
19232A17560Q445b6506E9763a3306j9969A20544b12256R7479K0483F9696l3015
19221C6681J11103a46342D95986B5206N702b67869c8375F7558d0699C4387f5908
19209C62519c20224I6211L47373a64634A01285a31120A31985b85386P084R7636
19199a80666l2663F9556b15500C21380a74499J401A22486b38593q4254N311g6872
$$ y = [158310, -44915, -283871, -53864, -103881, -97589, -140833, -33959, -36374, -151638, 265077, -205777, 6450, -176244, 182634, -276996, -324402, -60815, -12527, -110262, -173201, -105415, -141451, 117646, 10197, 230333, -194788, 38476, -118511, 272052, -19705, -39755, -360736, -362920, -20396, 59124, 253775, 267977, -174983, -334818, -116618, 95700, 48582, 123630, -206729, 180379, -143893, 117560, 126005, -26506, 59763, -13306, -33275, 120544, -212256, -114777, -94294, 69696, 36681, 147784, -146342, 495986, 25206, 30908, -267869, -38375, 67558, -40699, 34387, -65908, 362519, -320224, 96211, 443584, -164634, 101285, -131120, 131985, -285386, -278302, -180666, -213329, 69556, -215500, 321380, -174499, -173098, 122486, -238593, -322847, -317536, -76872]
19187d43128g0576j53451R837g6730A03169D7576b4692R571l69824a91671l4720
19176b26391I6342l6205K182J27071b05793D253c343A77370b36725l318J19092
19165a20951P949b4173F8555O1608E0176e8401B04446P7152h002n6712j85042
19154b49756a01233j64454l05768c3857k50978M9100A5850a11952n1399A04441
19143I0955C3654a1549k23739G4880P269J06027F7781a49648O0992C116a1936
19131B92502a68787k54784A72879b62818Q3654L9694q07D2181f9607d634r6476
19120a01110k9343n9515I8930b50066H9257P0909b01108k1703h5175G1756a40400
19108i5824n9238I4738C08R8515c2633E3648B2421a22773G7683c49426a49238
$$ y = [-443128, -70576, -224027, -214190, -76730, 103169, 47576, -24692, -15121, -384945, -191671, -226391, 96342, 60137, 62319, 189390, -205793, 4253, -3343, 177370, -236725, -240043, -120951, -113002, -24173, 68555, 130163, 50176, -58401, 204446, 281598, -8002, -64714, -249756, -101233, -265687, -571455, -33857, -284835, -235735, 15850, -111952, -163351, 104441, 90955, 33654, -11549, -235288, 74880, 82149, 188176, 67781, -149648, -88656, 3116, -11936, 292502, -168787, -423571, 172879, -262818, -179164, -139470, -140277, 42181, -69607, -4634, -101110, -130453, -189968, 98930, -250066, 89257, 160166, -201108, -222811, -85175, 71756, -140400, -95824, -155062, 94738, 308, 98823, -32633, 53648, 22421, -122773, 77683, -349426, -149238]
19096F7297b29208a10188H6288a49790A07754b1436k13656F6775f744j52705O9551
19085h9898j28577R5662A03915a30196A22196c68423a01111l9245k1497A61447
19074A21864B7211b38690G4736K3882b07103B77482a02711A48358l3314l286b26985
19062A49859A0380P7941A0031g6087j52871P1421p7660H9607a7937F7937A3032
19050i8448k68154g7569b5163j80048i3186M2181H4558b35488H1068a2842B30020
19038d9834A28503h3104F658J04368b97198R2131b5821o8826I7406l1853j6647
19027D8906J65156c3279H4014O5282c8797k3194F3610a27293A15404a6539k36101
19016b52640A38865b14409N3443a1216m8868B6608b14689C7139a70338h226j78021
$$ y = [67297, -229208, -110188, 86288, -149790, 107754, -21436, -235092, 66775, -6744, -159449, -89898, -218475, -122813, 103915, -130196, 122196, -368423, -101111, -140356, -161853, 161447, 121864, 27211, -238690, 74736, 98618, -207103, 277482, -102711, 148358, 115044, 111758, -226985, 149859, 10380, 88321, 10031, -76087, -228958, -157537, -235197, 89607, -17937, 67937, 13032, -98448, -366602, -77569, -25163, -205211, -93186, -51005, 84558, -235488, 81068, -12842, 230020, -49834, 128503, -83104, 6658, 111026, -297198, -205067, -25821, -94647, 97406, 65553, 48906, 214062, -33279, 84014, 149296, -38797, -61991, 63610, -127293, 115404, -16539, -252640, 138865, -214409, -160966, -11216, -60084, 26608, -214689, 37139, -170338, -8226, -186247]
19005a86247f3301Q8D3063e9857I8673c4281I9101d4508A66141j1493j5152b13009
18992E2138g1755A0332J70573P1425C1301J85514d50501H256K03405L8231a31775
18980C8605b11100J6028E1596a23971C6741b92189J21958A6617b0617j30400H6410
18968b41753A74214a43532C34944a37527j67663b7882F7188Q1128a5025j48662
18958a63687A52412e2878b0312k12646o6721A53618L02022g1312j8109B19635
18947B2949d13624c4286l6731a1186l30403J33749N4875m0404E7398B6198g6422
18935A22826a64063A37350g4360m1422K995j37098f1191m1172b569l1662j2360
18924d6591F5739d4130d320q8627B19243E2936b7004j67456p8962E3878N6349
$$ y = [-186247, -63301, -63213, 43063, -59857, 98673, -34281, 99101, -44508, 166141, 154648, 139496, -213009, 52138, -71755, 10332, 180905, 252330, 31301, 216815, -450501, 8256, 211661, 249892, -131775, 38605, -211100, -195072, 51596, -123971, 36741, -292189, -170231, 16617, -20617, -151017, 86410, -241753, 174214, -143532, 334944, -137527, -305190, -27882, 67188, 148316, -15025, -163687, 152412, -52878, -20312, -232958, -299679, 153618, 455640, -71312, -89421, 219635, 22949, -413624, -34286, -71017, -11186, -341589, -207840, -152965, -193369, 57398, 26198, -76422, 122826, -164063, 137350, -74360, -115782, -112787, -249885, -61191, -102363, -2569, -34231, -46591, 65739, -44130, -4320, -92947, 219243, 52936, -27004, -194460, -273422, 53878, 110227]
18913A10227d07508d3394p2889d112o7291p9614K0289C7647b67362B5140a21526
18901a11790J6249j19369A60461b20991I6734O646D8009h86j78979K1846d2729
18889g5097j89819C19281a00011G2236i1754k72845a33429j07097K4467J9902
18879a96157j54395d0896j41312B50833a66121n6484h945A02121A2079L2113K9862
18868G4054c33287e7387b4304j12471B73759a21381C6157a13864c3378r264f72
18856b96976G7323i1174L0428k27800J22200B4974A420K5692f8383k20013a26540
18844f8043j72214a0770B91986d2887p5360D9144a03391D5369L0876A9924M72360
18833D92284A83577h1989A17346a80172G0711k6524K87609a20228A15285e9028
$$ y = [110227, -407508, -43394, -116283, -4112, -71403, -151017, -130728, 37647, -267362, 25140, -121526, -111790, -95541, -214910, 160461, -220991, 96734, 103380, 48009, -886, -179865, -158019, -42729, -75097, -264916, 319281, -100011, 72236, -91754, -364599, -133429, -240526, -216059, -196157, -350552, -40896, -182208, 250833, -166121, -222605, -8945, 102121, 12079, 44192, 74054, -333287, -57387, -24304, -136775, 273759, -121381, 36157, -113864, -33378, -42642, -672, -296976, 77323, -91174, -60746, -288546, -166346, 24974, 1420, 27112, -68383, -288396, -126540, -68043, -240257, -10770, 291986, -42887, -118247, 49144, -103391, 45369, 76245, 19924, 492284, 183577, -81989, 117346, -180172, 70711, 44187, 331796, -120228, 115285, -59028]
18822F7082P7663J14107d207A92753F8268J43958a01300A72750l4569g8230H85
18810h2070A37991J29392c34038A81740A8607b63702a29793q1683Q8567A492J0171
18799A1663a45534p7855D1998c83450C23738A42622a2278G537J35433o7861c5196
18787A61067b17359m3223c2693l68131A01123O5266M1214H0799L3759f5087G3050
18775h7359j63023d9572m039k15290J13516P6126j66266J06908m6504J3515o2143
18764b33749j27650J38590B1686O4513L8770a05333k00477C3806a60893f2270
18753A13708m546C0557a27268O0492A0744Q6595b2644j66211A69193b51580A57192
18741c45071a42222A31505h653k66485f1127b567F0378a83375K5089A19270m6217
$$ y = [67082, 144745, 258852, -4207, 192753, 68268, 212226, -101300, 172750, 138181, -78230, 885, -82070, 137991, 267383, -334038, 181740, 18607, -263702, -129793, -211476, -122909, 1492, 11663, -145534, -223389, 41998, -383450, 323738, 142622, -12278, 7537, 142970, 75109, -35196, 161067, -217359, -260582, -32693, -400824, 101123, 166389, 207603, 80799, 114558, -65087, 73050, -87359, -250382, -49572, -53611, -268901, -155385, -79259, -245525, -138617, -185121, -171606, -233749, -361399, -222809, 21686, 86199, 124969, -105333, -305810, 33806, -160893, -62270, 113708, 109162, 30557, -127268, -66776, 10744, 97339, -22644, -188855, 169193, -251580, 157192, -345071, -142222, 131505, -8653, -275138, -61127, -2567, 60378, -183375, -158286, 119270, 73053]
18730G3053c593m06977A72568a90294i2173D8531O8850d9892H9054a2955A0930
18718B6796a46340G1778C5775f3456r1893j40462J1942J34274f5501r7428j56501
18707c19430J57840f777j71358B85081a16398D6M9868b20674O2189J6484k9390
18696a71391G6777d06238i1146A6055K1526J3934a69566C13260a43684K4242G0074
18684E056P0229a26070n6504F8102e5230k0686n0146B68334Q819h292j95022O2310
18672a41004A04213j7285J52475H8328a74602A48233l0214f4665I9614b25109
18661A9016K14874q8988K36025E5864J56465a48331B6106P4789D6591d5195j87143
18650b32338E1929J27023E3436a91176f1847A00377M6368a76596q9220g1209A17476
$$ y = [73053, -3593, -410570, 172568, -190294, -92173, 48531, 117381, -49892, 89054, -12955, 10930, 26796, -146340, 71778, 35775, -63456, -155349, -295811, -283869, -149595, -65501, -162929, -319430, -161590, -6777, -178135, 285081, -116398, 46, 49914, -220674, -158485, -142001, -171391, 76777, -406238, -91146, 16055, 37581, 51515, -169566, 313260, -143684, -119442, 70074, 5056, 75285, -126070, -182574, 68102, -55230, -75916, -126062, 268334, 277153, -8292, -203314, -141004, 104213, 86928, 239403, 88328, -174602, 148233, 118019, -64665, 99614, -225109, 19016, 233890, 144902, 380927, 55864, 212329, -148331, 26106, 100895, 46591, -45195, -232338, 51929, 178952, 53436, -191176, -61847, 100377, 146745, -176596, -265816, -71209, 117476]
18638D6943b39885B93850l0972b88944J14103l1907f0254j37006A59807a40475
18627a83796j8813i2179L28A92770a2832A49752f2565A55782n097E2880k4513
18616B8367a7077A66657a04007c3375k53372A24030I447R0490b1831j07661e1594
18604A66501b3278G8966b84745N4561d7733q2437l04938J71479J26261j05528
18594b42896A57598a56000c5996k9935n8223j14427B0481R7579J55139c03995
18583G5193k4720r964a37148e1787E6037d4127j60912B04022a87078j13058F1280
18571d0556M802p3212H7983a03319j86053B72883a64485C5070M77738G0076b20709
18559b15956j98039i665j5136j70802h9566C2516a26432M0861j07238r5453C85289
$$ y = [46943, -239885, 293850, 262878, -288944, -174841, -206748, -60254, -197260, 159807, -140475, -183796, -202609, -92179, -91851, 192770, -12832, 149752, -62565, 155782, 150685, 52880, 28367, -17077, 166657, -104007, -33375, -286747, 124030, 9447, 99937, -21831, -129492, -51594, 166501, -23278, 78966, -284745, -230184, -47733, -130170, -435108, -263629, -137368, -242896, 157598, -156000, -35996, -65931, -124154, -238581, 20481, 118060, 273199, -303995, 75193, 50473, 40509, -137148, -51787, 56037, -44127, -205039, 204022, -187078, -300136, 61280, -40556, -35754, -108966, 87983, -103319, -289372, 272883, -164485, 35070, 512808, 70076, -220709, -215956, -413995, -9665, -24801, -195603, -89566, 32516, -126432, -85571, -192809, -288262, 385289]
18547a46816A85930J62638c68367B18788a64135h1797c7570k27301N5572R0813
18537a18486o4608B9062J92648o4269O7671b1183f428j13019A3564b62230e3956
18525f7008j03265a4483A66448a69164I5965k0522a30247j79184J44064c0714
18514a5090l87372J57686J09321A16190i4630k00028a30477m7505C3167N6775
18504H9942O3753b33l40157A33051a10390A06001a6048A42746a62451d5359B8350
18492B43672b75760H8526a3760j33263j1206L8676j47057h0274F360c30741A70345
18480B70718a33625F0340b57341O2884B12391A02142b22183K3744j27281a25573
18469b5143A43104b2790l22420a0027A56749j0293P7990h3854j57982J05959j423
$$ y = [-146816, 185930, 348568, -368367, 218788, -164135, -81797, -37570, -264871, -209299, -118486, -183094, 29062, 221710, 157441, 225112, -21183, -6428, -119447, 13564, -262230, -53956, -67008, -170273, -14483, 166448, -169164, 95965, 75443, -130247, -309431, -165367, -30714, -15090, -402462, -244776, -135455, 116190, -94630, -294658, -130477, -177982, 33167, 89942, 153695, -233, -340390, 133051, -110390, 106001, -16048, 142746, -162451, -45359, 28350, 243672, -275760, 88526, -13760, -147023, -158229, -119553, -266610, -80274, 6360, -330741, 170345, 270718, -133625, 60340, -257341, -194457, 212391, 102142, -222183, -198439, -325720, -125573, -25143, 143104, -22790, -345210, -10027, 156749, 146456, 224446, -83854, -241836, -135877, -137300]
18458a37300d1916A47414e7228r1525n6883k88420a10328H6180a60118A86339
18447D5781J24036k6715a5150j10217N1385F9704f4063b1156j13005l2092B891
18435i6277A4831L18452p6907i5080D7049a70909E0905f3074k15335R4104o4734
18424b49039E5067K375a82055K0651L415A41687f0260j42713O8609l5341J0874
18413a58831D2669J04232C0734a24320B19775A03069B4583M0362A8778a39649
18402C23606h6891E0456J96755n7383G3211c07072J04795G0306b62622B70652
18391c9084Q48k3031A95816b04442j31711a38884H5252M8050a59046k35725h0549
18379c548C04268b32130J5465l8195a08558a6957H3049l6612N8904k8941a28164
$$ y = [-137300, -41916, 147414, -57228, -148753, -205636, -494056, -110328, 86180, -160118, 186339, 45781, 169817, 143102, -15150, -125367, -73982, 69704, -64063, -21156, -134161, -166253, 2891, -96277, 14831, 333283, 256376, -95080, 47049, -170909, 50905, -63074, -278409, -184305, -249039, 55067, 57442, -182055, -161404, -157989, 141687, -60260, -202973, -134364, -169705, -158831, 42669, 146901, 30734, -124320, 219775, 103069, 24583, 64945, 18778, -139649, 323606, -86891, 50456, 247211, 189828, 73211, -307072, -202277, 70306, -262622, 270652, -39084, -38236, -61267, 195816, -204442, -336153, -138884, 85252, 133302, -159046, -394771, -80549, -3548, 304268, -232130, -216665, -254860, -108558, -16957, 83049, 46437, 105341, 76400, -128164]
18367h6481q3605L2063L2400E061a00635A7651d893j23286A39078c80638O7014
18356c13624J50836m094K5068L8846C1047b4124I5859a00923k0759A20071h6320
18344F0647J6259a4923l14549A85849J51214h4942q2315D551J44331h3144A90162
18332A80482m4285J80950D8261b80893m4346J30513A40465a13534l4050A31085
18321f2219J9947A63590B8209b36333g1714A34660o2974C0701R8686J40812n652
18310B64547d40969A74562a86603C17676c55215i126A31914c2295m2350j8709
18300i3354A24794b69107M6240a380j23511p6609N0788f1406q975j40267q2261
18289b92909j51129e8614a3143I1334A172O8430J67532H4591j3895b42619p57
$$ y = [-86481, -170086, -138023, -105623, 5061, -100635, 17651, -4893, -128179, 139078, -380638, -313624, -162788, -166882, -141814, -102968, 31047, -24124, 95859, -100923, -121682, 120071, -86320, 60647, 76906, -14923, -329472, 185849, 337063, -84942, -167257, 4551, 148882, -83144, 190162, 180482, 136197, 317147, 48261, -280893, -325239, -194726, 140465, -113534, -147584, 131085, -62219, -42272, 163590, 28209, -236333, -71714, 134660, 71686, 30701, 129387, 270199, 264547, -440969, 174562, -186603, 317676, -355215, -9126, 131914, -32295, -74645, -93354, 124794, -269107, -222867, -1380, -124891, -201500, -150712, -61406, -70381, -210648, -292909, -444038, -58614, -13143, 91334, 1172, 69602, 237134, 84591, 70696, -242619, -243376]
18278b43376i6417C7562b58259Q9454b8540H8264b14736C2762g63A61993a94253
18266c412p7692p63C0929J13209a03069K4030G3729a55518g754A4575a21285d6160
18253a84198C69252b39292C1673h8314l28499a46252j48463A47132Q744b76474
18242A60795a43603d0764p5784C0074k410c7113H5592J83913j32597K7968A8631
18230A26480h2261k11506F1588k6458Q7945a05831q941j82335A89670N0733B6402
18218a3104k4210j75960b7395C2327L7334K32224p7332K7038I9506b2186j05944
18207a28130J6194j81456P3723h5254E198O1533L02417G1275j9803a03393K595
18196a00798k6009D20580g1495A04446O852O8618k8651b8051A3116P9416a57742
$$ y = [-243376, -96417, 37562, -258259, -168805, -28540, 88264, -214736, 32762, -763, 161993, -194253, -3412, -81104, -81867, 30929, 144138, -103069, -79039, 73729, -155518, -7754, 14575, -121285, -46160, -184198, 369252, -239292, 31673, -88314, -416813, -146252, -294715, 147132, 155876, -276474, 160795, -143603, -40764, -116548, 30074, 27664, -37113, 85592, 269505, 136908, 164876, 18631, 126480, -82261, -293767, 61588, 35130, 123075, -105831, -114772, -297107, 189670, 240403, 26402, -13104, -37314, -213274, -27395, 32327, 69661, 301885, 224553, 251591, 99506, -22186, -128130, -111936, -293392, -219669, -85254, 5198, 66731, 369148, 71275, 51472, -103393, -100798, -126807, 420580, -71495, 104446, 111298, 179916, 151265, -28051, 13116, 92532, -157742]
18184c34789h006C5510g3819L6344A17699a09397j33110a17185n0324F215d07907
18172e1403A95946I5013J71418b57804f3663j13039I3036c54470d9502A11405
18161A6256K1136b88378A85191b66896f5048k31098A75281a51570C32679g3341
18150i6767B63157c10098a49122c1353A05069M7352l6736B5945b42403k34469
18140d76872B12089a18525j04484J8220M9226A07978h7218k55957h7743C359i7889
18128b42831L4753R7729H3323b24711j49919a83571E9216a58240a4889b611H2611
18116D7779A5319K2063b15349h4653A7852R394a02558n4696G7431d0884B23856
18104C05920a313j76991C63c52215A31653P2588c8035l5708D37398b9980k22249
$$ y = [-334789, -8006, 35510, -73819, -37475, 117699, -109397, -242507, -117185, -167509, 6215, -407907, -51403, 195946, 95013, 266431, -257804, -63663, -176702, 93036, -354470, -49502, 111405, 16256, 37392, -288378, 185191, -266896, -65048, -296146, 175281, -151570, 332679, -73341, -96767, 263157, -310098, -149122, -31353, 105069, 152421, 115685, 25945, -242403, -476872, 212089, -118525, -223009, -204789, -155563, 107978, -87218, -343175, -87743, 3359, -97889, -242831, -208078, -110349, 83323, -224711, -374630, -183571, 59216, -158240, -14889, -2611, 82611, 47779, 15319, 37382, -215349, -84653, 17852, 27246, -102558, -157254, 77431, -40884, 223856, 305920, -1313, -178304, 363, -352215, 131653, 204241, -38035, -73743, 437398, -29980, -252229]
18093b52229A76128J04639a01735j79087a1048j05615K2151D59873b54580R5264
18083a59316M1267m8274G3594J85806G7805A654L4512a91201c1926I8403J32624
18072B31027D4982q333A6109a57481k49843C51404D3983A0033a4206D2066c8643
18060g8058A19272h3160n4905j34368Q3469j44754A63696J6264E5328K23804e9511
18048H0560b20920h3117l05905J28771d1246k86760J45370j00878Q1074A78950
18037B52864b60048I5114h3467l3742A73666g0903K0627k5178m2219O629J0439
18026a00605m3127m6058d7620J599A62130b754r4936D1537J22547J31405b45798
18014c07491J08244B5977J30315a26198a7281m081j95316a7894o5081A07402J36622
$$ y = [-252229, 176128, 280767, -101735, -280822, -11048, -116663, -94512, 459873, -254580, -159316, -118049, -166323, 73594, 259400, 77805, 1654, 36166, -191201, -31926, 98403, 231027, 44982, 36649, 16109, -157481, -407324, 351404, 43983, 10033, -14206, 42066, -38643, -78058, 119272, -83160, -138065, -272433, -188964, -333718, 163696, 179960, 55328, 279132, -59511, 80560, -220920, -83117, -389022, -260251, -41246, -328006, -182636, -283514, -202440, 178950, 252864, -260048, 95114, -83467, -117209, 173666, -70903, -50276, -75454, -117673, -111044, -100605, -143732, -189790, -47620, -46021, 162130, -2754, -97690, 41537, 164084, 295489, -245798, -307491, -199247, 25977, 156292, -126198, -17281, -21362, -216678, -17894, -82975, 107402, 244024]
18003B44024e2240E5932i2684j0384l6828D0587K6836C1521b6128A17113n2978
17992F4135c3140J3652o9034j40783m6024G8917K95735h7563j82817A11933i2498
17980h5532K9291E1057a50580A19995d6572J9601G2996b20322A89558b9602H6190
17968A03904d2373A45607k289a54309m3345i479m01912C5603d853l03085G3699
17956H9302g1974F130a94917h9727q2310G3388a60551A50774D5837j203J78190
17945B22824K1778O8920d9058j33578P8906d7826C0860K9267O7692l6652B5851
17933C69034b28186Q9173a9026k08539j26433d9516l533A43720b4937E9815g8433
17921A62839A431a52855B89946d3914j8183r6835B55697q908F0757h351j81268
$$ y = [244024, -52240, 55932, -92684, -103068, -139896, 40587, 67423, 31521, -26128, 117113, 64135, -33140, -19488, -88522, -229305, -275329, 78917, 374652, -87563, -270380, 111933, -92498, -85532, -56241, 51057, -150580, 119995, -46572, -26971, 72996, -220322, 189558, -29602, 86190, 103904, -42373, 145607, 143318, -154309, -197654, -9479, -411391, 35603, -4853, -307938, 73699, 89302, -71974, 6130, -194917, -89727, -172037, 73388, -160551, 150774, 45837, 44634, 222824, 244602, 313522, -49058, -182636, -103730, -47826, 30860, 60127, 127819, 91167, 25851, 369034, -228186, -139013, -19026, -227565, -353998, -49516, -53049, 143720, -24937, 59815, -78433, 162839, 1431, -152855, 289946, -43914, -62097, -158932, 255697, 246789, 60757, -8351, -189619]
17910a89619c5351m012D0386l402a24220j81425a32079k80978B51461O3614n0987
17899B64088C1411J75772G9587e8653A25048L9812a20518G0050J14721a55804
17888c12040a2849l45809a71172d4492B04877I2102a20674A9945b72751J2663
17878b60088C3715a41859f4460C67387e4171p9901j97072h3674m6741B08694C8212
17866c14347A85637c611l8499B081e5876a4715A53368a50738I7205B1555c56606
17854a76222N3714B75981D686a0077n3442C35564A31021a48430j36791g2175p5523
17843a47698e2651J6628B18614c75485A68614o4980N140Q4392a50628A7099M3387
17832F0486J2051a15969c6230B18111H2916P2606g9061L2240a359A01243D5084
$$ y = [-189619, -35351, -39363, 40386, 36984, -124220, -305645, -132079, -413057, 251461, 315075, 264088, 31411, 207183, 79587, -58653, 125048, 164860, -120518, 70050, 184771, -155804, -312040, -12849, -358658, -171172, -44492, 204877, 92102, -120674, 19945, -272751, -260088, 33715, -141859, -64460, 367387, -54171, -134072, -331144, -83674, -130415, 208694, 38212, -314347, 185637, -3611, -42110, 2081, -55876, -14715, 153368, -150738, 97205, 21555, -356606, -176222, -122508, 275981, 4686, -10077, -63519, 335564, 131021, -148430, -285221, -72175, -147698, -52651, -36023, 218614, -375485, 168614, 103634, 108774, 193166, -150628, 17099, 60486, 72537, -115969, -36230, 218111, 82916, 155522, -79061, -46821, -1359, 101243, 45084]
17820A1657a5065I3739K10337e24138b0555j83165A63615a61807B12221a40721
17809A2639K76237M484a06385n3159B91505g5649A10828J08631j3350n1040g2317
17797d5275B53011B2032L08651b57656A36886i4443G2646J66217c33073A09158
17786h4412p7928A17728O1156b10049a01894A35696M736c36320B42208a28185
17775c41479D5380K47731a90912A23J84837J66730j55272F262h496r6854b1380
17763D3181c79843P9319a41355A207M726J32341F3716d8369j0880B30286a70855
17751a85054h9716C2421a4645m9566a8166h321B56839A06073b4020o1537j13350
17740a98907k08463a84110h2813A93683f9985B1998K7361b79555A841a22950B59494
$$ y = [11657, -15065, 93739, 304076, -524138, -20555, -203720, 163615, -161807, 212221, -140721, 12639, 288876, 293360, -106385, -159544, 291505, -75649, 110828, 219459, 206109, 155069, -72317, -45275, 253011, 22032, 330683, -257656, 136886, -94443, 72646, 238863, -333073, 109158, -84412, -162340, 117728, 178884, -210049, -101894, 135696, 140432, -336320, 242208, -128185, -341479, 45380, 293111, -190912, 123, 184960, 351690, 196418, 6262, -8496, -105350, -21380, 43181, -379843, -300524, -141355, 1207, 5933, 138274, 63716, -48369, -59249, 230286, -170855, -185054, -89716, 32421, -14645, -64211, -18166, -8321, 256839, 106073, -24020, -85557, -198907, -407370, -184110, -82813, 193683, -69985, 21998, 49359, -279555, 1841, -122950, 259494]
17728A25920d2210D91824G3620i7889d1061j11308N4377C11785e9320k22291a23853
17716a69510D8980A8476b49982A25924e395B61299d3829B0514A135P3088K874
17705G7097C4806L7332a65916c6641E7876a89401B22596b1544A68308J723p0513
17694I9518e940E37658b6915G1239J33861a66287d0138F4308d41C3913b9442k87443
17682c16885a2272p3105C94722b50479b0581j64424I6923g4477l7618A67738J09791
17671B77529c05775l1024P5089K4762B3396J0045L04411A56045A68K2183J32277
17660A54628o4241b43394i5841A44309J24555i7483a9753j20081e1217j17866
17650a69083b5751A30104a70317j18940A35684b82192E2079e4290j5739A65385
$$ y = [125920, -42210, 491824, 73620, -97889, -41061, -152369, -97992, 311785, -59320, -281611, -123853, -169510, 48980, 18476, -249982, 125924, -5395, 261299, -43829, 20514, 1135, 74223, 77097, 34806, 72138, -165916, -36641, 57876, -189401, 222596, -21544, 168308, 170031, 99518, -5940, 537658, -26915, 71239, 205100, -166287, -40138, 64308, -441, 33913, -29442, -316885, -12272, -85377, 394722, -250479, -20581, -185005, 96923, -74477, -112095, 167738, 277529, -305775, -336799, -261710, -236948, 23396, 33441, 337852, 156045, 168, 22351, 154628, 90387, -243394, -95841, 144309, 268864, -97483, -19753, -139834, -51217, -169083, -25751, 130104, -170317, -289257, 135684, -282192, 52079, -54290, -70029, 165385]
17639B58870d2826B55516a1575j03033B01413H3848K25257a5332r7038J5929c587
17627A65945B4099J63735J82878j00506j4159f8931E0166K00486B818J41481a39553
17615f1139p3557D6963a34549m7264D7717d0095B24819f4763j08661B60167m1089
17604B19078H9459Q0720O345a26946a1405A4245L10473b44038g2359D475L5456
17593C9931K06533N2725d8858j1757A71932e1875G652L4077b68929A92151I5006
17581b30064c8617q0442e335j48784B02667b25637G3420A951M5081K5271Q3275
17570A55578J41503B0209a7625C6293a34146c5387j38381j29086D4538K32293
17560B76831j21700k5966k31K39354b23387B91828k7400E0051a50742n5944M4448
$$ y = [258870, -42826, 255516, -11575, -114608, 201413, 83848, 309105, -15332, -112370, -96441, -3587, 165945, 24099, 187834, 370712, 270206, 256047, -68931, 50166, 250652, 2818, 144299, -139553, -61139, -134696, 46963, -134549, -181813, 47717, -40095, 224819, -64763, -173424, 260167, 219078, 89459, 170179, 176524, -126946, -11405, 14245, 324718, -244038, -72359, 4475, 39931, 246464, 299189, -48858, -60615, 171932, -51875, 7652, 41729, -268929, 192151, 95006, -230064, -38617, -119059, -5335, -154119, 202667, -225637, 73420, 1951, 47032, 72303, 155578, 297081, 20209, -17625, 36293, -134146, -35387, -173768, -302854, 44538, 276831, 155131, 129165, 128934, 368288, -223387, 291828, 264428, 50051, -150742, -206686, -162238]
17549a62238g002G426L09074c12549A6798h788A61457B1575o392a3875B12464
17537B44449A7063J50844F3513j4300M642d8979l6742C52099a5394j95150J04462
17526a06082j89543G6538K8217O9172N1904k6352f2244B50467b33378A70773f1710
17514C6532K10287G0481a31133B34612j8604B5042c8564a1185A40880o6826f9122
17502a15153E6826P7342a04747B02115K34881A13026n4477c81843A2240J58915
17492A71155J12668A24993K48768j44606C6549K87818j36455f6520B75946d6163
17481a64266H415K5801a07351H0859e9175B10452a23112B31980p549a12558B73135
17469f905A23869n4473J76290m0313O0436B3588J35338D5214i6303F5201J57761
$$ y = [-162238, -7002, 7426, 316500, -312549, 16798, -8788, 161457, 21575, 15183, -13875, 212464, 244449, 17063, 167907, 63513, 49213, 53855, -48979, -85721, 352099, -15394, -210544, -106082, -295625, 76538, 104755, 173927, 225831, 199479, -62244, 250467, -233378, 170773, -61710, 36532, 246819, 70481, -131133, 234612, 216008, 25042, -38564, -11185, 140880, 74054, -69122, -115153, 56826, 134168, -104747, 202115, 436996, 113026, 58549, -381843, 12240, 171155, 283823, 124993, 373761, 229155, 36549, 324367, 187912, -66520, 275946, -46163, -164266, 8415, 34216, -107351, 80859, -59175, 210452, -123112, 231980, 224431, -112558, 273135, -6905, 123869, 69396, 245686, 205373, 265809, 23588, 158926, 45214, -96303, 65201, 222962]
17458B22962j7693J99390j40095j24232Q0283C4855L78647o7959E0173E65L71386
17447C71951F5038i4158A32115K9365B645K62774M93286C02805N2137j61086J78033
17436C71889l0414r9649i7336A70823C9184M27513H3438o427J73667l5686f7851
17424A78561K137E5739N03906A32851J50017j500b9476D72804J4666o0972M0381
17413D66879A10867Q3964q9995l8626O9554J63513l6852j06894J14806F6280f5913
17401B29737J4519H0083a29773G6757L11898J37285A25106J36037I3296d6835
17390I3942J48351R033O1608D3905N6639N7814N7226K01624K3906b2113B5857
17378i9488A8418J69190B2219R6968E6681B3901K22101l4031P1158A3490K12088
$$ y = [222962, 205269, 404659, 264564, 140332, 220615, 34855, 413502, 345543, 50173, 565, 371951, 65038, -94158, 132115, 161480, 2645, 265419, 758705, 302805, 354942, 193856, 371889, 341475, 241826, -97336, 170823, 39184, 466697, 83438, 77011, 250678, 214992, -67851, 178561, 180698, 55739, 559645, 132851, 282868, 281368, -29476, 472804, 487470, 426498, 466879, 110867, 194831, 104836, 66210, 135764, 299277, 262425, 155531, 270337, 66280, -65913, 229737, 244256, 80083, -129773, 76757, 388655, 525940, 125106, 261143, 93296, -46835, 93942, 242293, 251326, 312934, 43905, 100544, 158358, 215584, 417208, 441114, -22113, 25857, -99488, 18418, 187608, 22219, 119187, 56681, 23901, 246002, 211971, 283129, 13490, 225578]
17367B25578q1153F1238K31536j24852L250J73334j41685F5148k4662J8416M4463
17356A03365b6935B71027j00320k7549J41123A15905J20056L382K90014B47220
17345C79829j89238E5686a84668B21243a29584B79279c6934B42111a16746F114
17334A22564K15243j7968a51898B15739q2712J5933e2990A59954R9914b4002B84745
17322C93976A60009B4937R3627P0190a81637D9303K48086A37939c77061H9854
17311A97130q0179J10316a01472J8961o7922D2954O3474O3267a25463A64775R9735
17300B64510J3306p7092m0656L85234j6820l9512A75615c5378B65388J30515I3849
17288C0804K50221r2979B4039L46052i3311J5199A85453L3923l8398m4899l3037
$$ y = [225578, 144425, 61238, 292774, 167922, 171172, 344506, 202821, 65148, 40486, 58902, 103365, -26935, 271027, 170707, 143158, 284281, 115905, 235961, 239343, 529357, 247220, 379829, 190591, 55686, -184668, 221243, -129584, 279279, -36934, 242111, -116746, 6114, 122564, 337807, 319839, -151898, 215739, 133027, 148960, -52990, 159954, 259868, -24002, 284745, 393976, 160009, 24937, 118564, 188754, -181637, 49303, 297389, 137939, -377061, 89854, 197130, 116951, 227267, -101472, -82511, -150433, 42954, 106428, 169695, -125463, 164775, 264510, 277816, 200724, 160068, 545302, 528482, 488970, 175615, -35378, 265388, 395903, 93849, 30804, 281025, 188046, 24039, 370091, -93311, -78112, 185453, 219376, 180978, 136079, 103042]
17277A03042J36525J68184f4124C80978A80090a7105A62145K34052F8473a72974
17266D43574k21506o5348Q9701A4276K22639K43312A29014J4534R0880p9160L94195
17255E49463C6693q691K38652A17823L9352g9786K3854p8982A53400R3731a13316
17243b38524A59191n5263J59668D1898K92802M6767I6037J52563q6288J13288
17233B75600m963Q1713j07783K67178k43473M9246M1250j38671I6895K09217b0558
17221H0980M3044j4180J45745k0807H5747J68627a18238A14567D3174J69082M533
17210B16789L01395j21128F8670K21538a10477A94103J62849Q2420k05781J8643
17200B52234K11627A40639C6790K60797N1586j16380m0184M5264J09642A33894
$$ y = [103042, 239567, 407751, -64124, 380978, 180090, -17105, 162145, 396197, 68473, -172974, 443574, 222068, 156720, 246421, 14276, 236915, 480227, 129014, 143548, 234428, 155268, 549463, 36693, 28002, 266654, 117823, 157175, -79786, -55932, -134914, 153400, 247131, -113316, -238524, 159191, 103928, 263596, 41898, 334700, 381467, 96037, 248600, 162312, 275600, 270637, 352350, 244567, 511745, 268272, 317518, 358768, 220097, 96895, 306112, -20558, 80980, 124024, 109844, 255589, 234782, 85747, 254374, -118238, 114567, 43174, 212256, 216789, 518184, 397056, 68670, 290208, -110477, 194103, 356952, 439372, 233591, 252234, 463861, 140639, 36790, 297587, 349173, 232793, 192609, 237873, 347515, 133894]
17189B95084j07886a1859B11957m9079j8876M56973k26311l5122J92133j93329
17179C38346H3862L10458j69960p6318n0264L3763Q1999j00002J47038N4555M904
17168C20035J0852J44616G1361L40387j80030K4417K32535j52412j05383P3140
17158C04015j8374k7714p2060J48035N8660A81045L6199k1673q7000J27609J64565
17147D00745b67327D44624j63512J06720j83521l9762K0388L34498r6324L937
17137D27048q3406A30870O10082A63692K14641A12602L36274k13950D6923K49459
17127B96382K95968j14677N8852M751H3369L78766k14309K43773k16740Q1656
17117C56515j14665K32753R5333n0910j93086K65337k26792j07379J94916p6239
$$ y = [295084, 187198, -11859, 211957, 162878, 144002, 600975, 374664, 339542, 531675, 338346, 83862, 394320, 224360, 148042, 97778, 131541, 213540, 113538, 260576, 315131, 320035, 330887, 475503, 71361, 411748, 231718, 256135, 488670, 336258, 230875, 304015, 285641, 257927, 185867, 333902, 392562, 181045, 217244, 195571, 108571, 236180, 400745, -267327, 444624, 281112, 387832, 204311, 164549, 184937, 519435, 423111, 427048, 343642, 130870, 740952, 163692, 378333, 112602, 448876, 234926, 46923, 296382, 592350, 477673, 536525, 541276, 83369, 462135, 247826, 491599, 274859, 356515, 241850, 474603, 569936, 519026, 325940, 591277, 364485, 257106, 452022, 375783]
17107C75783j20767L03291P6037k12003j1922K08261k02014l7344N9072J9405
17097D57799q8108J05257M5735d2011D96268n8039J26328J00910l02301J58154
17087E21320O134j43835I4506M52778B52679K04279O0445K74004j13719k59086
17077D18602K41528p4590J3615j65447j56724j5508J78621K13665j65044L8792
17067E27510p4050j40436L02263k31113J03491A76265O97623k83359j95048J43559
17057E39040k43532A13386J52248K42533m0058j42099L63157B88315N0270N10783
17047H49368r2191k43582K1186n6558p682K58380j99732k19704R0813L26025l31746
17036C94577k8328J39691L24189C99079L54606j13232r4077L32185l04756K0023
$$ y = [375783, 255016, 558307, 634344, 422341, 410419, 618680, 416666, 379322, 438394, 457799, 369691, 474948, 520683, -42011, 496268, 438229, 564557, 665467, 363166, 521320, 527454, 383619, 94506, 547284, 252679, 456958, 517403, 791407, 677688, 418602, 660130, 585540, 599155, 433708, 276984, 261476, 440097, 653762, 488718, 527510, 453460, 313024, 615287, 384174, 487665, 176265, 873888, 590529, 395481, 539040, 295508, 113386, 265634, 508167, 468109, 326010, 689167, 288315, 338585, 849368, 757177, 513595, 534781, 478223, 470541, 728921, 529189, 309485, 400298, 726323, 394577, 366249, 505940, 830129, 399079, 753685, 640453, 546376, 878561, 573805, 593828]
17026E93828m9854R8987K29802K8549j40091n8875j02257B85400N19446B70182
17015F07804k13460L02445N3492J10337l8930P507j56979k0707n5978J77779p3193
17004G00117K28236j52178k55410L59923K29019l74148K81930j93948l04096M45057
16994I64502l22957O4419j35021J74687k1456J90132K35173k00230j7347J9618
16984I51520m081k23863N14364n7519n13342J66856N2426j67271J43664Q7036
16974I49790J50347k84208R2211R32M27802n17916L94508J04831m30916K04063
16964A091444q1763q5808O0439K72563j29801k55831M70260m40815K54183m37392
16954G17479J27906p6934N74939m29107K18227j7416J67549k96833J80200q5952
$$ y = [593828, 543974, 642961, 872763, 901312, 761221, 702346, 600089, 285400, 804846, 270182, 607804, 394344, 696789, 750281, 860618, 821688, 829195, 672216, 651509, 595531, 773310, 700117, 928353, 776175, 520765, 880688, 1109707, 735559, 1017489, 823541, 519445, 964502, 641545, 705964, 570943, 745630, 724174, 914306, 1149479, 949249, 931902, 951520, 947439, 723576, 1237940, 1180421, 667079, 833935, 886361, 719090, 862754, 949790, 1100137, 815929, 908140, 909072, 1336874, 818958, 1213466, 1318297, 887381, 1091444, 1009681, 923873, 984312, 1256875, 1127074, 871243, 1341503, 900688, 1154871, 717479, 845385, 768451, 1343390, 914283, 1132510, 1115094, 1282643, 985810, 1166010, 1080058]
16944A080058K27221K6034K1620l7295j48006J8484P5636J85971j76183m5911
16934A227629K91028j70039j02510K0206J47582J47046j10479j96825L3633K82426
16924A569697l4831j81328K75421o4068q5091j6300R4246K38890l35320K10360
16914A671676n9031K12400q916k36687j96209L64344p8691J20552j98567L18147
16904A909018o1535j05495L11747l1054j69448k2647L16351j20581k72487P7924
16894A831793J95191m0046j24102K32230q7075k17153n542M58547L4681j43733
16884B134791M0332k71825K34722J81748p6448K06516l7276J91797N2409J34402
16874B791168k52558p495L02824j99236L1749l4300K29458j03563k808K21542
$$ y = [1080058, 1307279, 1333313, 1354933, 1317638, 1169632, 1188116, 1263752, 1449723, 1273540, 1227629, 1518657, 1348618, 1246108, 1266314, 1413896, 1560942, 1450463, 1253638, 1287271, 1569697, 1534866, 1353538, 1628959, 1564891, 1479800, 1463500, 1557746, 1796636, 1461316, 1671676, 1612645, 1825045, 1816129, 1579442, 1383233, 1747577, 1668886, 1789438, 1590871, 1909018, 1847483, 1741988, 2053735, 2022681, 1853233, 1830586, 2146937, 2026356, 1753869, 1831793, 2026984, 1986938, 1862836, 2095066, 2007991, 1790838, 1785296, 2243843, 2278524, 2134791, 2175123, 1903298, 2138020, 2319768, 2243320, 2449836, 2412560, 2604357, 2656766, 2791168, 2538610, 2531115, 2833939, 2634703, 2666452, 2632152, 2861610, 2758047, 2755239, 2976781]
16864B976781j39618l89804P07766j86759k13308J31463L02357j5734k1096L57359
16854C509407m44456K86649o2105N63415l52833L22054k64944O3592L77340k84234
16844C713885P7950J21945L30996k63198J43945J76498k26835K38974J48211J36768
16834D599139M3140j13107O0849j05025K64159K19303j82346L24380J90450o9411
16824E231531N96653l92285j28653N55614O818J39894j52743R3716O04477k43749
16814F311273J58633J67404L37854Q7077O5888j3098L27708J46552M22888L2178
16804H044357K10465k21860K81114J13012M74223J74542L3057K43194K93316K72891
16794I918311J49991L66048J63155J32610N56463M4698M66361L00085K59758M67924
$$ y = [2976781, 2837163, 2447359, 3155125, 2968366, 2755058, 2886521, 3188878, 3173144, 3152048, 3509407, 3064951, 3351600, 3289495, 3852910, 3500077, 3822131, 3557187, 3620779, 3998119, 3713885, 3791835, 3913780, 4244776, 3981578, 4125523, 4302021, 4075186, 4314160, 4462371, 4599139, 4642279, 4529172, 4590021, 4484996, 4749155, 4968458, 4786112, 5110492, 5300942, 5231531, 5828184, 5435899, 5307246, 5862860, 5869678, 6009572, 5856829, 5950545, 6555022, 6311273, 6469906, 6637310, 6975164, 7062241, 7128129, 7115031, 7442739, 7589291, 8012179, 8044357, 8254822, 8032962, 8314076, 8427088, 8901311, 9075853, 9108910, 9352104, 9645420, 9918311, 10068302, 10434350, 10597505, 10730115, 11286578, 11331276, 11797637, 12097722, 12357480, 12825404]
16784A2825404K38009L75243M52133K28997O25664M03546J11454N33769O46603
16775A6440822P56750N72295N33518M28701O04975O85147N00605N11787Q22913
16766B1857513Q04418J042585O64057Q17058P67835J118294J595635O29247Q15161
16757C0111803J340416J310694J496999J410896J811033J563518J558427J609431
16749D2213217K275940J925038K047296K327412K538818K647873K367480K942821
16741F1285895L224971L131178L516550L737294L553667M546527M346100M299484
16733I1641666M872108M800955N202791N065245N068794N897449N415742N038050
16725A33002800N389277M820063M397186M688074L490414L026360K156693J186361
$$ y = [12825404, 13063413, 13438656, 13890789, 14119786, 14745450, 15148996, 15260450, 15794219, 16440822, 17197572, 17769867, 18303385, 18732086, 19337061, 20022208, 20522813, 21034600, 21857513, 22661931, 23704516, 24368573, 25185631, 25953466, 27071760, 28667395, 29296642, 30111803, 31452219, 32762913, 34259912, 35670808, 37481841, 39045359, 40603786, 42213217, 44489157, 46414195, 48461491, 50788903, 53327721, 55975594, 58343074, 61285895, 64510866, 67642044, 71158594, 74895888, 78449555, 82996082, 87342182, 91641666, 96513774, 101314729, 106517520, 111582765, 116651559, 122549008, 127964750, 133002800, 138392077, 143212140, 147609326, 152297400, 155787814, 158814174, 160970867, 162157228]
16717A62157228L91713j79830j048359k035925l190966l452836m200324m629019
16709A43811682m996248n566987n461643n332103n494058o118177n072952n631138
16701A00138376n038760m956963m505238m528831m089519m349209l702977l719043
16693F5247836l027976l009901l077469k836153k682505k156990k493338k325927
16685D3637577j941516k491621j346307j406381j976912j351406j204513j283749
16677C0635172j561933j389223j099394p61017j216944q37851p17409j059448
16669B1991953o54055q42335r18363l39435q46224n45214r98132k59252o69193
16660A5919750k08394m81965r18422l4358n34481o11565k81048k99363m65809
$$ y = [162157228, 162548941, 162369111, 161320752, 159284827, 156093861, 152641025, 148440701, 143811682, 138815434, 133248447, 127786804, 122454701, 116960643, 110842466, 105769514, 100138376, 95099616, 90142653, 85637415, 81108584, 77019065, 72669856, 68966879, 65247836, 62219860, 59209959, 56132490, 53296337, 50613832, 48456842, 45963504, 43637577, 41696061, 39204440, 37858133, 36451752, 34474840, 33123434, 31918921, 30635172, 29073239, 27684016, 26584622, 25823605, 24606661, 23768810, 23051401, 21991953, 21337898, 20495563, 19577200, 19237765, 18391541, 17846327, 16848195, 16588943, 15919750, 15711356, 15229391, 14310969, 14276611, 13742130, 13130565, 12849517, 12550154, 12084345]
16651A2084345m95295K40096p17284j26223m45532n58145J23735J1201o52356
16642I464542k74754P3616k19516n45624n5698k73149k44282L9878m82383k73060
16632G209570j47766l03585J29436j64560k87014L2018j73439k03105L2858m60239
16622E664174M81874o69940j48695K45059M427k55154k20627J6172j91826O3932
16612D989396n03063K42429k18253N5344m00109K24767k95002L9215J2371j03439
16602D043656p7006J24621P724j78861l42771L6143Q494Q1118j01979l429l18007
16591C279703q9149k2808O0530j34508K1019m5453J5691J84730l79580R7477m03003
16580B584649n8514K1737J45884J86194o62267L57467M2760L03857m55889O1856
$$ y = [12084345, 11589050, 11829146, 11111862, 10985639, 10540107, 9981962, 10105697, 10116898, 9464542, 9189788, 9263404, 9043888, 8498264, 8442566, 8169417, 7925135, 7965013, 7482630, 7209570, 7061804, 6758219, 6887655, 6723095, 6436081, 6468099, 6294660, 6091555, 6124413, 5664174, 6146048, 5476108, 5327413, 5572472, 5576899, 5321745, 5101118, 5117290, 4925464, 4989396, 4486333, 4728762, 4510509, 4565853, 4165744, 4390511, 4095509, 4134724, 4147095, 4043656, 3966650, 4091271, 4098995, 3920134, 3577363, 3613506, 3622000, 3703118, 3601139, 3597710, 3279703, 3190554, 3167746, 3228276, 3093768, 3114787, 3069334, 3085025, 3269755, 2890175, 2987652, 2584649, 2526135, 2547872, 2693756, 2879950, 2217683, 2575150, 2617910, 2921767, 2465878, 2527734]
16570B527734k80360k12052M18694l09541L35891o71053L71104K9055k08946J9648
16560B020174L70291k01935n95353J70371n6687R4761P5632K47320k3306j48523
16550A952745j96939N2572j75208L9552j52713k8786M90113l30529O3m9883m0273
16539A560714k34159M31733j98626k15569J30031k75642K02366j4818j94827K52530
16529A443733k42358J23038o8993j29375K23823j96322J30442j01767L44228k35036
16519A291413L21200l16190M638J56741k09603j04029Q4048J0549n4050J26051
16509A310768m02630M41132k21981K42367J03083l70245l51653M13961j25574
16500A039228j16043Q5406K52816k47661l10355J65132J22947k98564J43444k2398
$$ y = [2527734, 2247374, 2035322, 2454016, 2144475, 2480366, 1809313, 2180417, 2209472, 2000526, 2020174, 2390465, 2188530, 1593177, 1763548, 1706861, 1801622, 1877254, 2124574, 2101268, 1952745, 1755806, 1808378, 1633170, 1672722, 1520009, 1491223, 1981336, 1650807, 1650870, 1600987, 1560714, 1326555, 1758288, 1559662, 1344093, 1474124, 1198482, 1400848, 1386030, 1191203, 1443733, 1201375, 1324413, 1255420, 1126045, 1349868, 1153546, 1283988, 1182221, 1526449, 1291413, 1612613, 1296423, 1301061, 1457802, 1248199, 1144170, 1228218, 1238767, 1184717, 1310768, 908138, 1349270, 1127289, 1369656, 1472739, 1102494, 750841, 1164802, 1039228, 923185, 1008591, 1261407, 1013746, 703391, 868523, 991470, 692906, 836350, 813952]
16490H13952L29623j69061J3930j6413m5142K0236j8144K08288j1433j22952D83551
16478H26372j42872M11128l00163m2284k05626Q9723M2096p9029O68983n96731
16468F71597o502L44514C68856M33155k87421L90471k89833L69822l72685Q0750
16458F93115J992K85396D40199L16038k4646K26766j07028m5964k34511j32865
16448D37989L00492j38846K8730k18021L2369M5654j26579R6679K31046j13460
16438E76053j74801K2475K10831o3830M2189k18023n1359J80992O1311B19128
16427E96725l7912p7688L9396j06213Q8326k25325L44763r9977o5807P0709Q7974
16416F14971j48026J4978J06153k77170j25499L32015l5411J70798K4503k87075
$$ y = [813952, 1143575, 974514, 988444, 972031, 926889, 947125, 928981, 1137269, 1125836, 1002884, 483551, 826372, 683500, 1094628, 794465, 752181, 546555, 636278, 678374, 599345, 1268328, 671597, 665095, 1009609, 368856, 802011, 514590, 905061, 615228, 985050, 612365, 693115, 695107, 980503, 440199, 756237, 731591, 958357, 851329, 805365, 570854, 437989, 738481, 599635, 628365, 410344, 442713, 488367, 361788, 458467, 689513, 576053, 401252, 423727, 634558, 570728, 612917, 394894, 343535, 524527, 585838, 219128, 596725, 558813, 481125, 520521, 414308, 502634, 277309, 622072, 522095, 456288, 526997, 614971, 466945, 481923, 588076, 310906, 185407, 517422, 482011, 652809, 677312, 390237]
16406C90237l9829J53416J27260B42674r6719M89197K23130o6878j20332A73324
16395D34713R993l9748Q6490j36402q0749J5583j9888A07822K05071L6100A24159
16383C40012l0349J6696L118O6079j8382K67852A81883K04546A76392L38516A87579
16371C09314A22613L23373p6301j1083A02109K75967P1433j25440n5055K70566
16361E39580p5156j29542J53696d0935B90929J63301n3319j06815q6130K8470
16351B36436L06833A55359K04840o3639n7926J60246A17097E5596J96399L8313
16341B90308J07554A11670K09258L79134C25067H2767P7964M61177k34314K2772
16331D10366k087o0153J48219l5596p7162m8230L8766r8437N4579k9215A20397
$$ y = [390237, 350408, 503824, 631084, 242674, 145955, 635152, 858282, 791404, 671072, 173324, 434713, 444706, 404958, 491448, 355046, 274297, 289880, 269992, 107822, 312893, 348993, 124159, 340012, 309663, 326359, 329477, 395556, 377174, 645026, 181883, 386429, 176392, 514908, 187579, 309314, 122613, 445986, 369685, 358602, 102109, 378076, 449509, 324069, 269014, 539580, 464424, 334882, 488578, -40935, 290929, 454230, 400911, 294096, 207966, 236436, 543269, 155359, 360199, 296560, 238634, 398880, 117097, 55596, 251995, 290308, 397862, 111670, 320928, 700062, 325067, 82767, 160731, 621908, 387594, 410366, 408279, 348126, 496345, 460749, 383587, 335357, 374123, 275686, 330265, 301050, 120397]
16319C39173J13396d6815C10060J03337j51147O9462A49560K19070j42239J3822
16309B40213P0684B5554L88838j37628A33624K943M33781k72824j2387c4213C92501
16297H8710L39317A28066J6659p1633h2131A77200l5026e8169b2858A81127J81037
16286C62164j34749G8927O0993N0652P5734J603r5409K15066H2863K34969j02439
16275B15393a88642B71788a38182d154A99753h3807c4432B10975I5974l4412M8091
16264A09653M9039l2361K80121A09482l0874i7520A12869R8130r8798k9598D0573
16252A43626m1643J93762a78893P0087A74914J05858A442a44215B02138I5826
16241A00006M7123L1409A5835M4128J98445B1495J0825L62894b16462f0297B86779
$$ y = [339173, 452569, -46815, 310060, 413397, 262250, 331712, 149560, 368630, 226391, 240213, 310897, 25554, 414392, 276764, 133624, 136567, 570348, 297524, 285137, -34213, 392501, 88710, 428027, 128066, 144725, 73092, -82131, 177200, 142174, -58169, -22858, 181127, 362164, 227415, 78927, 139920, 190572, 266306, 267909, 172500, 387566, 82863, 317832, 215393, -188642, 271788, -138182, -4154, 199753, -83807, -34432, 210975, 95974, 61562, 109653, 158692, 126331, 406452, 109482, 78608, -97520, 112869, 210999, 112201, 82603, 40573, 143626, 101983, 295745, -178893, -108806, 174914, 280772, 1442, -144215, 202138, 95826, 100006, 147129, 178538, 15835, 59963, 258408, 21495, 32320, 395214, -216462, -60297, 286779]
16229A47484e025B2303c2746A25920j3315O6005R456a68426k26326d2531C64927
16217A4566O5012L09552F8156L1476e1446A87794l4605J5720F7061g9341E6772
16205C71929a38097D29837A17830K74816A1065K03479I7791J15939j4116H0154
16194B84119D086a5634B0243J14971J13915a7427F26294B1756c4050C5640L8520
16183G4160A7384K08225d79163E8483B8345b93063H579d7131B31294F1532B9683
16171A43635L18731j52976D516L1399J16707Q587J07467I9949o828F25K7369a84145
16158A39666a77921d8061B69885a24819B40379g2403B42980a12062L4100C38385
16147B19144L8001c04419G4127e9459j45272E7108P0826a53905C88604f1480A73480
$$ y = [147484, -5025, 22303, -32746, 125920, 112605, 178610, 188066, -168426, -394752, -42531, 364927, 14566, 79578, 389130, 68156, 99632, -51446, 187794, 153189, 168909, 67061, -79341, 56772, 371929, -138097, 429837, 117830, 392646, 11065, 214544, 97791, 213730, 199614, 80154, 284119, 4086, -15634, 20243, 135214, 249129, -17427, 626294, 21756, -34050, 35640, 74160, 17384, 225609, -479163, 58483, 28345, -293063, 8579, -47131, 231294, 61532, 29683, 143635, 462366, 309390, 4516, 35915, 152622, 161209, 268676, 99949, 93121, 625, 27994, -184145, 139666, -177921, -48061, 269885, -124819, 240379, -72403, 242980, -112062, -77962, 338385, 219144, 257145, -304419, 74127, -59459, -204731, 57108, 127934, -153905, 388604, -61480, 173480]
16135B20121e3994C5212a51799C17678I5623g0465K4396j57585e5943K113k6382
16124h0212A04301J3506k1938B540a18375m2909e9876D5380a45799B5665e8856
16112B64412a64406B45393e4799p0172F2217b19199b4657C19149p5726m6732b79506
16100A74448i1526C4783a35979B35779b19704A47134E0740A6239f5391A90401
16089D4751g0491B05375a98741c5051A71275i3063A11741e5347D5768b71546g2351
16077C41552i3103D7691h0480D7995c47623a07455j31410F862a01629j3248q1464
16066a96341B64845q5576R7976A08448b00632Q6055A5224J40922n6638b38748
16055F0083c0586p5135j7977A14324m5360J45890N0262p8116G8505B8029a33572
$$ y = [220121, -53994, 35212, -151799, 317678, 95623, -70465, -46069, -203654, -55943, -53830, -80212, 104301, 117807, 95869, 2540, -118375, -161284, -59876, 45380, -145799, 25665, -58856, 264412, -164406, 245393, -54799, -124971, 62217, -219199, -24657, 319149, 243423, 196691, -279506, 174448, -91526, 34783, -135979, 235779, -219704, 147134, 50740, 16239, -65391, 190401, 44751, -70491, 205375, -198741, -35051, 171275, -93063, 111741, -55347, 45768, -271546, -72351, 341552, -93103, 47691, -80480, 47995, -347623, -107455, -238865, 6862, -101629, -114877, -196341, 264845, 179269, 277245, 108448, -200632, -114577, 15224, 156146, 99508, -238748, 60083, -30586, -105721, -123698, 114324, 68964, 214854, 265116, 187000, 78505, 28029, -133572]
16043E8789a12104j6579j4752j50254B55096m6277c51258f6522k38804C32089
16032e4274j01771f2877A37624a9326A0889b17171n0448B30600b11300F382a44500
16020e0278r2928A30906q59a84426e4535j27444e940A80231G4757C817b07988
16008I2438d7262A01848b72130A88196G9669I41b17975k57467A6346N8144b16387
15996A08637b68124e2124k03705C15161c38451B03128i0031l3775b4593E966h5564
15984B06075g9762C55262J82788M7718A02233D1176L24153h0917j97255C4941
15973C6337i9646A35533O4371P5090G1260f8305B71278C9325b05028A30316J6795
15962A47111n1266e5834A40335f3083a9620l691p5436j27817C55838a44153j04355
$$ y = [58789, -112104, -128683, -143435, -293689, 255096, 208819, -351258, -66522, -305326, 332089, -54274, -156045, -62877, 137624, -19326, 10889, -217171, -267619, 230600, -211300, 6382, -144500, -50278, -143206, 130906, 130047, -184426, -54535, -181979, -5940, 180231, 74757, 3817, -207988, 92438, -47262, 101848, -272130, 188196, 79669, 941, -217975, -475442, 16346, 74490, -216387, 108637, -268124, -52124, -255829, 315161, -338451, 203128, -90031, -123806, -24593, 5966, -85564, 206075, -79762, 355262, 538050, 585768, 102233, 41176, 365329, -80917, -278172, 34941, 36337, -99646, 135533, 199904, 274994, 71260, -68305, 271278, 39325, -205028, 130316, 147111, 95845, -55834, 140335, -63083, -19620, -23311, -98747, -226564, 355838, -144153, -248508]
15951b48508f8790j17651C57712e3013A00821K2466a67512P0018r6648G5534A4956
15939f4122j09905l6598R3337B23924a02410b552C51354A22527O024a13757B66539
15927C18716j38906e6010B04470a44820h723E619h8719j5709C9198J97619D9105
15915B9013a39387f4498n2312H29M0680i5644P908q9183N5190k24648D6267h2202
15902a01474m21059C20851D8797i3387A13376b54620O9392Q4403A03300a19318
15891B13106B8042b42833B12019a92925n5384a5943k56247N1846E0748H562K93122
15880C01684b771k36106P0230G755d5594H1220K92590e5382Q499B23664b52665
15868b50633C09693H875R7566c5738q5501H3697a212C1527L764i8789j45014j34539
$$ y = [-248508, -68790, -186441, 357712, -53013, 100821, 123287, -167512, -97494, -194142, 75534, 14956, -64122, -174027, -210625, -117288, 223924, -102410, -2552, 351354, 122527, 128551, -113757, 266539, 318716, 179810, -56010, 204470, -144820, -8723, 5619, -88719, -104428, 39198, 236817, 49105, 29013, -139387, -64498, -116810, 829, 41509, -95644, -87736, -176919, -121729, -346377, 46267, -82202, -101474, -522533, 320851, 48797, -93387, 113376, -254620, -185228, -100825, 103300, -119318, 213106, 28042, -242833, 212019, -192925, -248309, -15943, -272190, -220344, 50748, 8562, 301684, -2771, -238877, -168647, 7755, -45594, 81220, 373810, -55382, -46883, 223664, -252665, -250633, 309693, 8875, 106441, -35738, -121239, 83697, -1212, 31527, 35291, -98789, -243803, -378342]
15856c78342J17213j05372A69849a15550C6088J32359q2377i052k49762A35827
15845a50858C3110a11064A96302b14296j67871H4925K26070e8164C18505a9454
15834a70192K4710A59659e1673k00027a15922B14214L0532c58498A82595J89037
15824C71632a04156j10726A02488b46385A88186i3563E3677d58145f7603j6705
15814h4308A3691J38782C4343a21103C059i7433A02868M1975a58137c1736n3119
15803h4855b8111F1047a70797J5824B97253n8990a22354N3434A24252E0787a89978
15791h6028f605k12627J03030L4134p5863q357j75346C68363f059k00914L0676
15780a76297N0008f2670p9506j45958J18298P6892A35582D3402b14504P3092m4476
$$ y = [-378342, -261129, -366501, 169849, -115550, 36088, 168447, 86070, -9052, -258814, 135827, -150858, 33110, -111064, 196302, -214296, -382167, 84925, 310995, -58164, 318505, -19454, -170192, -145482, 159659, -51673, -251700, -115922, 214214, 244746, -358498, 182595, 371632, -104156, -214882, 102488, -246385, 188186, -93563, 53677, -458145, -67603, -84308, 13691, 152473, 34343, -121103, 3059, -97433, 102868, 144843, -158137, -31736, -84855, -28111, 61047, -170797, -154973, 297253, 238263, -122354, -68920, 124252, 50787, -189978, -86028, -6605, -219232, -116202, -82068, -157931, -166288, -341634, 368363, -6059, -206973, -176297, -126289, -62670, -142176, -288134, -169836, -92944, 135582, 43402, -214504, -141412, -185888]
15769a85888B72000a32898f1012q799J5388j05528D2410N8885R3384a61006B15278
15757A01913a14467C1860J50450a16847j5516d8337j15134P6556A37591O0641
15747A98232G8301a46030b1967C00768D1200L13514c9008n9607O668B5412P2128
15736I7540J44943f9404I14b02106O9511r295j9364q2527e341G3322K20253A6174
15723a66090h1183K4886l9832F5625a78510a6389k9060A81507b33810B17194b31484
15711a2891H8226e503F6140L2162L5960D8792d6102A1436J9200A495Q5820d5330
15698a0646j86889m6081Q3947A24127J17979p1982b03697f5605G8481a92691B53924
15686C4289a69815F5262a91306A80681h0174B88698a21179N744A99229g9934J3630
$$ y = [-185888, 272000, -132898, -61012, -69811, -54423, -159951, 42410, 101295, 194679, -161006, 215278, 101913, -114467, 31860, 182310, -116847, -132363, -48337, -163471, -86915, 137591, 198232, 78301, -146030, -21967, 300768, 41200, 354714, -39008, -98615, -91947, 25412, 97540, 242483, -69404, 914, -202106, -132595, -141890, -161254, -243781, -5341, 73322, 293575, 16174, -166090, -81183, -56297, -96129, 65625, -178510, -16389, -45449, 181507, -233810, 217194, -231484, -12891, 88226, -5503, 66140, 98302, 134262, 48792, -46102, 11436, 30636, 1495, 87315, -45330, -10646, -197535, -243616, -159669, 124127, 242106, 170124, -203697, -65605, 78481, -192691, 253924, 34289, -169815, 65262, -191306, 180681, -80174, 288698, -121179, -115435, 199229, -79934, -66304]
15675f6304k3297H2135A0716e4354k1834A83231I0856b12545B51788e4911C30356
15663B77523q2343b22587e960A0061K05726b51401O3154B091J84137d3381A3555
15651a0478k77430P8462A32233g6900A65976a34617B4552a35123B7584K789K88142
15640C18515K6615F9087a81775c9077C4760N254A0575a34819A55377d780k14132
15629b18912J05431b0079j10839A15437b36066B26607a60819g4156b8982B90586
15618a64477B8113l129i2782j17653A95616c06748Q1184I900R7659l7816a91701
15606A55952E7378B912a2628n7401c4314G4830a06915B07296e973B34099C6022
15594a03797m4721O2393k77084E6168h3296m2212E471c994H1200J24035a64724
$$ y = [-66304, -89601, 82135, 10716, -54354, -76188, 183231, 90856, -212545, 251788, -54911, 330356, 277523, 195180, -222587, -5960, 10061, 215787, -251401, -188247, 2091, 186228, -43381, 13555, -10478, -287908, -209446, 132233, -76900, 165976, -134617, 24552, -135123, 27584, 30373, 318515, 345130, 69087, -181775, -39077, 34760, 40014, 10575, -134819, 155377, -4780, -218912, -113481, -20079, -130918, 115437, -236066, 226607, -160819, -74156, -28982, 290586, -164477, 28113, 24984, -92782, -210435, 195616, -306748, -225564, 9900, 107559, 69743, -191701, 155952, 57378, 2912, -12628, -70029, -34314, 74830, -106915, 207296, -5973, 234099, 36022, -103797, -148518, -86125, -363209, 56168, -83296, -125508, 5471, -3994, 81200, 205235, -164724]
15582A39935a61244q5137f5139K1472a098j8303n12958H6970a27967D5753J31697
15571A77450a03391q295B4303a53471B77196c72445B8537e2787j8587B07681B7006
15559b4337j32505A72372i5460k31945D0000g685k22216A2268K3056c75328A62486
15547b43056A03788M2017O293F076J20067c36577B1398i1702k89335J68123B26835
15535B41902c2642Q864A76681B6945b06427c2675l48147d3555B18681N8896H8276
15523A5429J5237b61271F261N0164Q1312K2677O9954J1797i584k5025r0707A48367
15510c68472a5698k1645A65175a71472M7780B24004C7895a63151I0490b67263
15499b90394d6008B13071b19921R5398B91843g7869L0879A80737a26596I0596
$$ y = [139935, -161244, -246381, -65139, -43667, -1098, -19401, -532359, 86970, -127967, 45753, 177450, -103391, -111686, 24303, -153471, 277196, -372445, 28537, -52787, -71374, 207681, 27006, -24337, -156842, 172372, -95460, -327405, 40000, -7685, -229901, 12268, 35324, -375328, 162486, -243056, 103788, 145805, 152098, 6076, 126143, -336577, 21398, -91702, -381037, -212914, 226835, 241902, -32642, -23778, 176681, 26945, -206427, -32675, -380822, -43555, 218681, 277577, 88276, 15429, 30666, -261271, 6261, 56425, 137737, 160414, 230368, 242165, -9584, -34609, -125316, 148367, -368472, -15698, -37343, 165175, -171472, -123692, 224004, 37895, -163151, 90490, -267263, -290394, -46008, 213071, -219921, -124523, 291843, -77869, -46990, 180737, -126596, 90596]
15488b73303B49945G6064P3018p2570N551J68234p7859a00749p7761k14264B58060
15476b99070b438B8826e0B09085b44526o780A85736i1744J5986D68761E6636a20157
15463d670q0311k43600B6297J23655a23469e5007o2869k93145F3796a35742H45
15451A41656E9074M1035g9584C52417a41979E1311d1884l65356a45746f0710B41013
15439C91467a09858M6293A41872D8867k2283K6652J84104b35686q8427P0223E0699
15427G1544N4838k2659c99302B294e45851C40201j67323b74890A19J3873h899
15415H1885q47b2832A2864c81916h6099k2753A06218f0543B68833E8705M753b16117
15402A19123B8931a82783A89835c81490I7276P1947K4152f5347H6086L5267a7317
$$ y = [-273303, 249945, 76064, 149082, 76512, 82063, 250297, 172438, -100749, -178510, -392774, 258060, -299070, -2438, 28826, -50, 209085, -244526, -251306, 185736, -91744, -75758, 468761, 56636, -120157, -4670, -84981, -328581, 26297, 149952, -123469, -55007, -117876, -411021, 63796, -135742, 845, 141656, 59074, 100109, -79584, 352417, -141979, 51311, -41884, -407240, -145746, -60710, 241013, 391467, -109858, -63565, 141872, 48867, 26584, 53236, 237340, -235686, -324113, -253890, 50699, 71544, 126382, 103723, -399302, 2294, -545851, 340201, 172878, -274890, 119, 13992, -8899, 81885, 81038, -22832, 12864, -381916, -86099, -108852, 106218, -60543, 268833, 58705, 63458, -216117, 119123, 28931, -182783, 189835, -381490, 97276, 169223, 193375, -65347, 86086, 121353, -17317]
15390i0005F5738b5630C3101b13208A4437c215k86469a26641b7206p8329G3314
15378G797L17198r4403N192R762I0669e111j09734p1827b9342A61254h6705A12375
15365A3431R7639m1402K3235b32978C45148A42489B2844b3191k6026C0751K34247
15354B64998F4106c0272A49170J96940c6928D9866L750J39967D4623a15555C20960
15342b91494A01633g671k47469c6003A9423J7683B880g1422B58964a04471m3484
15331a47955a6754n7725C26233F1068K87560a26805N7836I4987J35032b5562D5032
15319d5706k5009I1177K4479a49737A21499J20297D2698J5962Q92i8892O817B61059
15306C99883c1810j23324c0575q152A5345k740P168b9008C5018O8467j1372a78791
$$ y = [-90005, 65738, -25630, 33101, -213208, 14437, -3215, -289684, -126641, -27206, -105535, 73314, 7797, 324995, 230592, 235784, 245546, 90669, -5111, -114845, -186672, -29342, 161254, -86705, 112375, 13431, 111070, 69668, 92903, -232978, 345148, 142489, 22844, -23191, -49217, 30751, 264998, 64106, -30272, 149170, 346110, -36928, 49866, 53616, 193583, 44623, -115555, 320960, -291494, 101633, -7671, -255140, -36003, 19423, 37106, 2880, -71422, 258964, -104471, -147955, -16754, -74479, 326233, 61068, 348628, -126805, -68969, 94987, 230019, -25562, 45032, -45706, -70715, 91177, 115656, -149737, 121499, 241796, 42698, 58660, 59552, -98892, -92075, 261059, 399883, -31810, -155134, -30575, -38727, 15345, 12605, 19773, -29008, 35018, 103485, 92113, -178791]
15293A09917C3070e2230A50043o0613D2746f2324B15201C3775a67912J958C7291
15281A18090a04241A09175e5307A41791C2512g2224G1667k2371M6016P3768k1986
15270A47094a3416r0145B93437G3430B0668J10199a442E5667a48140P912e3759
15258H5696a53153j08815B59042h7071B53515j07054O2303N7712C6904O08937
15248F45841N08468J94792n05686P94132H16834l03928k44985H0268f1648A61055
15237e4241B37170J64587j69225k4564K2550k5933q6328L4447a13870E7181a2062
15225a11621q6648k2451B3666L09622a62628G2859c7636B18086B4502i907A09791
15213b3060H0320i2996G2653J77051a4553M225B03984a42772o1184B82043C0130
$$ y = [109917, 33070, -52230, 150043, 89430, 42746, -62324, 215201, 33775, -167912, -165954, 37291, 118090, -104241, 109175, -55307, 141791, 32512, -72224, 71667, 49296, 95312, 169080, 147094, -13416, -103561, 293437, 73430, 20668, 130867, -1442, 55667, -148140, -140228, -53759, 85696, -153153, -261968, 259042, -87071, 253515, 146461, 208764, 266476, 36904, 645841, 1154309, 1349101, 843415, 1637547, 816834, 512906, 267921, 80268, -61648, 161055, -54241, 237170, 401757, 232532, 207968, 230518, 204585, 118257, 152704, -113870, 57181, -12062, -111621, -198269, -220720, 23666, 333288, -162628, 72859, -37636, 218086, 24502, -9907, 109791, -23060, 80320, -92996, 72653, 249704, -14553, -10328, 203984, -142772, -203956, 282043, 30130]
15201A4913b766k55664C14909e171o9418J8699A97400J20438a43315A91771J12787
15190C04558a86593E1896a29238j98998H871J38971b55017A88873a2735j17132
15180a29867A03601J99619P6837A76605L4162E1922c9958C06766l3456j17429
15170A55881e3400B9932a0317A25380c9821j03900A11775c66o0680C52253A8562
15158B22045m2787Q152i2984A8446J51317h4203j45682A94897N3397O1682j06328
15147B03648M2979a61353B12393a69396B66300A33135L29794a68215e5359D97
15136F4469a97119A51495Q3001G1180I395a30397h691H7863b4607r9318r9929
15125b23854B7244M50015a11703j45675B08543J20633e6431A20907d7523D64425
$$ y = [14913, -2766, -258430, 314909, -5171, -74589, -55890, 197400, 317838, -143315, 191771, 304558, -186593, 51896, -129238, -328236, 8871, 147842, -255017, 188873, -12735, -129867, 103601, 303220, 380057, 176605, 210767, 51922, -39958, 306766, 273310, 155881, -53400, 29932, -10317, 125380, -39821, -143721, 111775, -366, -61046, 352253, 18562, 222045, 179258, 187410, -92984, 18446, 169763, -84203, -229885, 194897, 248294, 309976, 203648, 246627, -161353, 212393, -169396, 266300, 133135, 462929, -168215, -55359, 497, 64469, -197119, 151495, 234496, 71180, 9395, -130397, -8691, 87863, -24607, -123925, -223854, 27244, 477259, -111703, -257378, 208543, 329176, -56431, 120907, -47523, 464425]
15114A21640J35376Q4143a79926D4331a04258A79053m8661K23473b7751j80867
15104b08618R2873H3613a93824d5413k9241A4447K9935J10870P5878J43716j85059
15093A89787l3598J40690E0949P0309L71396A07688J09941J5671H5305K09940
15083B95245I9648K92485j60109N3573A02023J93340P3221i5009k2246A06537
15072B03705J72029a8990B42056c7410C73082A23381i0378m6731B01691I4996
15061i6240C97738e497B90112b39717B27629D4020M57057g3587q394C12565i7235
15049D69874D1333g6866A54327a61649A2450J34894o2902G232a35954G8989J75950
15038B54939A14645N014J70330c2647E87784B57761E9552M5440R143E4214K32894
$$ y = [121640, 257016, 341159, -179926, 44331, -104258, 179053, 130392, 353865, -27751, -208618, -115745, 83613, -193824, -45413, -74654, 14447, 44382, 155252, 231130, 374846, 189787, 156189, 296879, 50949, 121258, 492654, 107688, 217629, 233300, 85305, 295245, 99648, 392133, 232024, 285597, 102023, 295363, 368584, -95009, -117255, 106537, 203705, 375734, -18990, 242056, -37410, 373082, 123381, -90378, -137109, 201691, 94996, -96240, 397738, -5497, 290112, -239717, 227629, 44020, 501077, -73587, -81981, 312565, -97235, 469874, 41333, -76866, 154327, -161649, 12450, 147344, 84442, 7232, -135954, 78989, 254939, 114645, 119659, 289989, -32647, 587784, 257761, 59552, 104992, 114135, 54214, 287108]
15027B87108A27892J11994J18483m7288d3749A67688J00891l5405a50542D6316
15016I6392q646M2325A5865i8949B86037N6740n3037m4389M38552B29335H0185
15004I6875q825M5055J9371H926O7875l3798J16974L82272A08897J30939A13910
14992E9099K75817a46A74004m3479K74617R792a21567A03431d548C17502A02397
14980D62061A93885J05198N9068j49446j3073E0695K53820j15462G0032a01381
14969A95649J18024E1154L88855B03483J68332A78575P2776j04235l9305J44188
14959B51999N3031e318C87892n2287G789K46152m7331q0146Q4839l2835L98158
14948E76626k72859b55088A21549J97101H2023L00277A48676o7861K22021L5219
$$ y = [287108, 127892, 239886, 358369, 311081, -43749, 167688, 268579, 233174, -150542, 46316, 96392, 87746, 130071, 15865, -98949, 286037, 342777, 289740, 245351, 683903, 229335, 80185, 96875, 88050, 133105, 152476, 8926, 76801, 43003, 159977, 542249, 108897, 239836, 113910, 59099, 334916, -146, 174004, 130525, 405142, 414934, -121567, 103431, -4548, 317502, 102397, 462061, 193885, 299083, 358151, 208705, 195632, 50695, 304515, 189053, 70032, -101381, 195649, 313673, 51154, 440009, 203483, 371815, 178575, 251351, 147116, 107811, 251999, 305030, -5318, 387892, 335605, 7789, 253941, 206610, 126464, 211303, 178468, 576626, 303767, -255088, 121549, 318650, 82023, 382300, 148676, 80815, 302836, 338055]
14938C38055B260J16790L4443E8836L15166A68533C1697K47488P367Q9551o6774
14927C09329p7427L04553H4986K69535j21004p508I6959K71483p4944P4352j29781
14916B38069K59737k01196C0602M26865k15135M4630k7924O8368o7363J14740
14906C74783o5856r9728H4483L64367A14557J78307f7999B69830j6182l2392I5977
14894E57348j33464a33454A92726j0230N1217L7176J93384A22649M29252o5927
14884D85974I318J25201L19646A70799M3699K24538A61377L38365A73210K38206
14874D11416p3402Q5856A66690J54941A27187a45946C70605A41692R8140L80442
14864F20274l1785j37354Q4471A71405J32658M35797A63471C7174L40452P483
$$ y = [338055, 2260, 119050, 153493, 58836, 374002, 168533, 31697, 279185, 286552, 376103, 309329, 231902, 536455, 84986, 354521, 233517, 226009, 96959, 368442, 293498, 367850, 238069, 497806, 296610, 30602, 457467, 242332, 286962, 259038, 327406, 260043, 374783, 308927, 209199, 84483, 448850, 114557, 292864, -67999, 269830, 253648, 221256, 95977, 557348, 423884, -133454, 192726, 182496, 233713, 270889, 464273, 122649, 551901, 485974, 9318, 134519, 454165, 170799, 214498, 439036, 161377, 499742, 173210, 411416, 338014, 423870, 166690, 321631, 127187, -145946, 370605, 141692, 239832, 620274, 588489, 451135, 535606, 171405, 304063, 739860, 163471, 37174, 377626, 385109]
14854C85109J09594K27911r6495A38287l4129M26402j17087O4638j78663j00857
14844A98591J65170M5744J03240L69029l97646N0058k38612K94911A85253L27996
14834E13249R6215J6513j10668o9539K03847j44366M2032J31800A15781J96778
14824C12559J71419j11099I7974O48793B51928J49225j66172L69903J21393k88834
14814D37443N2156j29412j8527A70135k5432M65879k85763j01535K59325K56580
14804G39189e5417E75595r5051j75750J64642p3089K07604j44340j26658A04176
14793D64614P7760j75972M77502k37836r4789J98026j56038j93767l527L98308
14783G54281r3327k49405L3341L6179j00541L80339j97774j54146J6890J03797
$$ y = [385109, 494703, 722614, 626119, 138287, 104158, 530560, 413473, 478111, 299448, 198591, 363761, 409505, 512745, 881774, 484128, 534186, 295574, 590485, 185253, 513249, 609464, 625977, 515309, 445770, 649617, 505251, 547283, 679083, 115781, 312559, 483978, 372879, 97974, 746767, 251928, 401153, 234981, 604884, 726277, 437443, 489599, 360187, 341660, 170135, 144703, 610582, 324819, 223284, 482609, 739189, -55417, 575595, 480544, 304794, 469436, 396347, 603951, 459611, 332953, 104176, 464614, 542374, 366402, 843904, 606068, 511279, 709305, 553267, 359500, 355973, 754281, 660954, 411549, 444890, 481069, 380528, 760867, 563093, 408947, 425837, 529634]
14773E29634J6810J23983k34890J68946K10319B65981J93113K2377N8900K53273
14763G93644k15761j70403N55178k75766r064j16209k49335N82725B17928J75460
14753C93388K6075M40664j84846k82966l1238K00291A17132L51628J22781M71994
14743A063535D97327N7454Q3617K41684M1487l67830K17555m6316k75790L80931
14733H30119J6069D07605L93618R5328j36341N6597j33747p2379M3351O525j53959
14722E06598K14881J81491k41540q7368K73602j09116j03896N9475J34261k89608
14712E38780K88747K3943j24268L6424r8951J30244J84422k49750J53757j59127
14702G24221O8707Q1567o1191k48084M15966k60677j31767M56247k29059k23317
$$ y = [529634, 546444, 670427, 435537, 604483, 814802, 265981, 459094, 481471, 540371, 793644, 577883, 407480, 962658, 686892, 677828, 561619, 312284, 895009, 217928, 393388, 419463, 860127, 675281, 392315, 361077, 561368, 117132, 468760, 591541, 1063535, 497327, 554781, 638398, 880082, 921569, 553739, 771294, 724978, 449188, 830119, 846188, 407605, 801223, 896551, 760210, 816807, 683060, 610681, 654032, 660557, 506598, 721479, 902970, 661430, 574062, 847664, 738548, 634652, 694127, 828388, 538780, 827527, 851470, 727202, 763626, 664675, 794919, 979341, 729591, 883348, 724221, 792928, 874495, 813304, 565220, 981186, 720509, 588742, 1044989, 815930, 592613]
14692E92613J38067J67886l1395m8478J19737k72493K9054J82700l71447N77914
14682A084158j58579J85797j6268K031j21727P7994n7792N3928k95082L44069
14672A098529R3373m63619J48802j24009K71481J01557j55174q0531M01597l42831
14662I49175k01143K44641K2423j55401L1485M4004L85128j08467r9974M1879
14652A153750k44449M82767m35706K02730j83317J06666j85321M64085k92365
14643A068840m4471J54279M1409k0583m9999k6769K87646l63109K16398n3804
14633A209837j00082N3331J64153j13870k24371K28457n6133J27949J44129m5271
14623A388129R2610l10272J11578K5776j29342O4067M5663Q5262K52360j00778
$$ y = [592613, 730680, 898566, 867171, 818693, 938430, 665937, 694991, 877691, 506244, 1084158, 925579, 1111376, 1095108, 1097139, 975412, 1053406, 995614, 1049542, 754460, 1098529, 1191902, 728283, 877085, 753076, 1024557, 1126114, 970940, 890409, 1292006, 949175, 748032, 992673, 1015096, 859695, 891180, 935184, 1320312, 1211845, 1111871, 1153750, 909301, 1392068, 956362, 1159092, 975775, 1082441, 897120, 1361205, 1068840, 1024369, 1178648, 1220057, 1199474, 1149475, 1122706, 1410352, 1047243, 1263641, 1209837, 1109755, 1163086, 1327239, 1213369, 988998, 1217455, 1161322, 1289271, 1433400, 1388129, 1480739, 1170467, 1282045, 1307821, 1178479, 1242546, 1288209, 1373471, 1625831, 1525053]
14613A525053m12867K71885J15080m5733r0587L23511j90264K19814k44365J63230
14603A634757p9083k8800l6704L4386j33254r0561K61329M6700q5207J5333J48751
14592A687647k18147M09140k9190J22058k5995j29806r7817K66349j03592n8637
14582A822010k61275J18424J94977n5167J05287j42305J75183j03882J39932j67466
14572A825718K46868L2746P6670K87447k15925j03727J94753J41551j7535p866
14562B460700p9542r9245L46030m9061l8553K38012M40085k88773P96671j51763
14552C574561Q55569q3857R77316K141348L491726P824073K0381375M381543A8071001
14542H098164l932488j618319m99591k52698l6863K37724l08741J35072J17447
$$ y = [1525053, 1112186, 1384071, 1499151, 1453418, 1362831, 1686342, 1496078, 1715892, 1471527, 1634757, 1555674, 1526874, 1490170, 1524556, 1391302, 1300741, 1562070, 1608770, 1523563, 1538896, 1687647, 1469500, 1878640, 1849450, 1971508, 1945513, 1815707, 1717890, 1984239, 1880647, 1822010, 1560735, 1679159, 1874136, 1818969, 1924256, 1781951, 1957134, 1853252, 1993184, 1825718, 2072586, 2105332, 2182002, 2469449, 2253524, 2149797, 2344550, 2486101, 2468566, 2460700, 2381158, 2281913, 2627943, 2578882, 2540329, 2778341, 3218426, 2929653, 3726324, 3574561, 4430130, 4346273, 5323589, 7464937, 10956663, 18780736, 39162111, 43543654, 18071001, 8098164, 4165676, 2547357, 2047766, 1795068, 1758205, 1995929, 1687188, 1822260, 1939707]
14533A939707K37153k19525J1460K25004j92288j7928K33431j90573K30512J91174
14523B448127n9906q1011j09747M43924l95614L89614k38041j75140K52851J06252
14513B581309n6199J29408K61408o2161j45619R454K45102l53447L17860j17202
14503B809913P5544m56429O82169p4243j13388K77845Q9612j13926k25516K68455
14493C220036R2270k85311K7690N5425J86881J0575K92617L0159r3292l5466j5155
14482C486429L79060n20930L98164r752N2269J05574l24649N53119l35071p7476
14472C706737O22561l45045q4625O6445L69282j60508Q6135L27081k66274k11313
14462D110476L49578J65615L87704l21082k56146O75883m26778M61595j8721l06078
$$ y = [1939707, 2176860, 1957335, 1968795, 2193799, 2001511, 1983583, 2217014, 2026441, 2256953, 2448127, 2388221, 2307210, 2197463, 2641387, 2245773, 2635387, 2397346, 2222206, 2475057, 2581309, 2525110, 2654518, 2915926, 2853765, 2708146, 2717600, 2962702, 2609255, 2927115, 2809913, 2885457, 2429028, 3111197, 3036954, 2923566, 3201411, 3291023, 3177097, 2951581, 3220036, 3312306, 3026995, 3054685, 3110110, 3296991, 3307566, 3600183, 3630342, 3537050, 3501584, 3486429, 3865489, 3344559, 3742723, 3732971, 3785240, 3890814, 3566165, 4119284, 3784213, 3706737, 4329298, 3984253, 3899628, 3966073, 4335355, 4174847, 4260982, 4588063, 4321789, 4110476, 4460054, 4625669, 5013373, 4692291, 4436145, 5112028, 4685250, 5146845, 5128124, 4822046]
14452D822046M10199Q1640j63748m6645K88798N8345j88422K08253K52L71444
14442E842162l34447J02866K32801K81323j82474J1557k44678O41244K74460j94515
14432F430299q7522Q7443J23950M24327l5961M2419J04435K67403j8029k25295
14422G113469K64343j61297K76426J17514M63702p8465o3904M67340p4181J87013
14412H511960p7273Q1445k0511M10879K59734L2972j90499L76497m6314R3650
14402I432540M57902L26779K19492k96051L19002J51953L49499R7589L36818Q6547
14392A1482070J02746K37160O2144K14158K79125n0957N24055L92612l41042N30271
14382A3432342K82712L46038M24018L9423Q3924O35879J91603n3614O99181r4489
$$ y = [4822046, 5232245, 5313885, 5150137, 5103492, 5392290, 5450635, 5262213, 5470466, 5470718, 5842162, 5507715, 5610581, 5843382, 6124705, 5942231, 5953788, 5709110, 6350354, 6624814, 6430299, 6342777, 6430220, 6554170, 6978497, 6942536, 6984955, 7089390, 7356793, 7338764, 7113469, 7377812, 7216515, 7492941, 7610455, 8074157, 7995692, 7931788, 8399128, 8324947, 8511960, 8434687, 8516132, 8495621, 8906500, 9166234, 9199206, 9008707, 9385204, 9338890, 9432540, 9890442, 10217221, 10436713, 10140662, 10459664, 10611617, 10961116, 11058705, 11395523, 11482070, 11584816, 11821976, 11884120, 12098278, 12377403, 12326446, 12850501, 13243113, 12902071, 13432342, 13715054, 14061092, 14485110, 14524533, 14608457, 15244336, 15435939, 15382325, 16081506, 15987017]
14372A5987017N21598O15936L26048J78275K98345N72597K9458O42781M77925
14363A9649980P64294J29715N38809K98830L67783N35429M87173P05812N24383
14354B4002208K71158R56879K07180O42671R04601P45692L80440R29045O84239
14345B9724113Q86135N38698N30339J117409N13922J231013J014589Q73399Q26724
14336C7256341J387430J034839J286163R44655J341381J100273J538829J405607
14328D7295518J269891J967663J358302J895927J585866J967117J623884K247688
14320F1211856J938683K213671K314735K807069K411264K607887K840451K979340
14312H1324956L284942L320046L097226M113043L846489L789146M785934M291579
$$ y = [15987017, 16508615, 17124551, 17450599, 17628874, 17927219, 18499816, 18529274, 19172055, 19649980, 20414274, 20543989, 21082798, 21381628, 21749411, 22284840, 22772013, 23477825, 24002208, 24273366, 25230245, 25437425, 26080096, 26984697, 27730389, 28110829, 29039874, 29724113, 30610248, 31148946, 31679285, 32796694, 33310616, 34541629, 35556218, 36429617, 37256341, 38643771, 39678610, 40964773, 41909428, 43250809, 44351082, 45889911, 47295518, 48565409, 50533072, 51891374, 53787301, 55373167, 57340284, 58964168, 61211856, 63150539, 65364210, 67678945, 70486014, 72897278, 75505165, 78345616, 81324956, 84609898, 87929944, 91027170, 95140213, 98986702, 102775848, 107561782, 111853361]
14304A11853361N149991M902752N687780N701950O221325O134069P245141P164554
14296A60060923P841523Q127796Q579354R222012R720982R821120J1182924J1052256
14288B35608890J1719065J2357353J2496595J3331138J3648193J3783935J4225297
14281C27170466J4677320J4426263J3931810J4085197J3658928J1942894J1400972
14274D21293850R136330P369463L337437J691077J785864l10932l952571l851592
14266D36498926o564326r260938j1482318j2706791j4139329j4915743j5499721
14259C51929760j5456221j5627370j5312394j4957773j4626528j2609297j3379162
14252B49961015j2807426j2322218j1751615j0516528j0350565r672818q908251
$$ y = [111853361, 117003352, 121906104, 127593884, 133295834, 139517159, 145651228, 152896369, 160060923, 167902446, 176030242, 184609596, 193831608, 203552590, 213373710, 224556634, 235608890, 247327955, 259685308, 272181903, 285513041, 299161234, 312945169, 327170466, 341847786, 356274049, 370205859, 384291056, 397949984, 409892878, 421293850, 430430180, 437799643, 441137080, 442828157, 444614021, 444303089, 440350518, 436498926, 429934600, 420673662, 409191344, 396484553, 382345224, 367429481, 351929760, 336473539, 320846169, 305533775, 290576002, 275949474, 263340177, 249961015, 237153589, 224831371, 213079756, 202563228, 192212663, 182539845, 173631594]
14245A73631594q668015p788465p568898p480043o766482n820842o185682m867751
14237A18485416n436519n358122m580798m062418m717731l870709k792540l860764
14229H3805815l500003l059542l043363k588852k999721k478354k651862j963498
14221F1520620k339895j786636k010576j807275j520262j972456j579962j425999
14213D7077559j289393j326004j389466j552861j340156r54716o09425j151588
14205C7463950j335588p25529j231006q23818n29492q89897r53380p59405j093904
14196B9121931p32647q01092o42739p36896k38523p83579p55649n21821o54553
14187B3254432n39285l79428n20845m65827n06486n14035m46749n16076p28363
$$ y = [173631594, 164963579, 157175114, 149606216, 142126173, 135359691, 129538849, 123353167, 118485416, 113048897, 107690775, 103109977, 99047559, 94329828, 90459119, 87666579, 83805815, 80305812, 77246270, 74202907, 71614055, 68614334, 66135980, 63484118, 61520620, 59180725, 57394089, 55383513, 53576238, 52055976, 50083520, 48503558, 47077559, 45788166, 44462162, 43072696, 41519835, 40179679, 39224963, 38615538, 37463950, 36128362, 35402833, 34171827, 33348009, 32818517, 31928620, 30975240, 30215835, 29121931, 28389284, 27588192, 26945453, 26208557, 25970034, 25186455, 24430806, 23908985, 23254432, 22715147, 22335719, 21814874, 21349047, 20842561, 20328526, 19881777, 19365701, 18637338]
14178A8637338K18500o53726j17373k00341m92444m09446n59947R8617o11068
14169A5910110k80130l24143j62561l15642l34138j00624k82556l33227m66592
14160A3310497j5780l78193l11522R8784J28098n91163m72021l0861m15775J91330
14150A1513394L6170l95328k67873M3778J73460m74438n54520M315l66608K87053
14140I999403k38327l43942k0256r7935k81093k92815M63098l94490m39127o119
14130H348397m4394j1464l46282j44982k76779J29880q0043N8539j83941j60719
14120G288212j79251j5742J44922m74190O4521J67935o58725L30489j40777k08729
14110F318665l17128M10047j59787m10332K17719p8714J28073k00698k3590r2191
$$ y = [18637338, 18855838, 18202112, 18084739, 17884398, 17391954, 16982508, 16422561, 16521178, 15910110, 15629980, 15305837, 15143276, 14827634, 14493496, 14392872, 14110316, 13777089, 13310497, 13294717, 12916524, 12605002, 12703786, 12831884, 12240721, 11768700, 11737839, 11322064, 11513394, 11549564, 11154236, 10886363, 10930141, 11103601, 10629163, 10074643, 10078958, 9712350, 9999403, 9761076, 9417134, 9396878, 9298943, 9017850, 8725035, 9188133, 8793643, 8354516, 8348397, 8304003, 8292539, 7946257, 7801275, 7524496, 7654376, 7574333, 7632872, 7448931, 7288212, 7108961, 7093219, 7238141, 6763951, 6828472, 6996407, 6337682, 6668171, 6527394, 6318665, 6001537, 6411584, 6251797, 5841465, 6059184, 5980470, 6108543, 5907845, 5884255, 5792064]
14100E792064l87832J96833k3027j99630J84341m11942o0907n5234J53582k0320
14090E167928l60924J5541M396l04443J63795L29555l24923q8365K10956J85937
14080D999453j92052k52863k31510J14508J42954m04823k52643L03506K9396k83186
14070C972740p4668J19535n2586l06492L29146o8412J0736p489o1624l07123K17508
14059C771271J45384p742j03206k27604j93243N5489J86418j4549l83371j30478
14049C098369J81914J93776m06588P5430L80739m52021O7791m35374L97656P8585
14039C180277M2669n63621L36051M2362K61603m85937j0034N19037k085m71300
14029B849022L00372n45029J20426k334j0663J55897j61003K0899j32576k2501
$$ y = [5792064, 5404232, 5601065, 5578038, 5378408, 5562749, 5150807, 5089900, 5034666, 5188248, 5167928, 4807004, 4822545, 4826941, 4522498, 4686293, 5015848, 4690925, 4602560, 4813516, 4999453, 4807401, 4554538, 4323028, 4437536, 4580490, 4175667, 3923024, 4226530, 4255926, 3972740, 3898072, 4017607, 3965021, 3658529, 3987675, 3919263, 3929999, 3922510, 3860886, 3553763, 3771271, 3916655, 3908913, 3805707, 3578103, 3384860, 3440349, 3626767, 3612218, 3228847, 3098369, 3280283, 3474059, 3067471, 3142901, 3523640, 3071619, 3139410, 2704036, 3101692, 3180277, 3222946, 2659325, 2995376, 3037738, 3299341, 2813404, 2803370, 3322407, 3320322, 2849022, 3149394, 2604365, 2724791, 2722457, 2711794, 2867691, 2706688, 2727587, 2595011, 2572510]
14019B572510j61912j9120m3078J53606m87883L13177K81403l34790L0807L8697
14009B343417J30599j88093k80081J6048K10826j44334k58271K55199J4885O5397
13999B165592J5142r6753k64644N71376m53306N4792K50449n7447o9752P59558
13989B875007O52437K652645N920892J8120627J8048778B2322709A1058541m041429
13981G017112j975201j050059m98093l02683j58454p3510n16638J62056j02223
13972B502307K5089k75585P491M6290k99366Q9426K1406K99318j66345o5042k51566
13961A933423J77058N0559r298k4887j42327k68637L7786j3815j24279J66654
13951A782237J07250l26Q7177k85049O0469K0104n0542K26346m33246J50700j34996
$$ y = [2572510, 2410598, 2391478, 2348400, 2502006, 2014123, 2327300, 2608703, 2273913, 2304720, 2343417, 2474016, 2285923, 2005842, 2021890, 2232716, 2088382, 1830111, 2085310, 2100195, 2165592, 2180734, 2083981, 1819337, 2390713, 1937407, 1992199, 2242648, 2185201, 2115449, 2875007, 3527444, 6180089, 12100981, 30221608, 48270386, 22322709, 11058541, 7017112, 5041911, 3991852, 3493759, 3191076, 3032622, 2959112, 2442474, 2604530, 2502307, 2527396, 2251811, 2259302, 2305592, 2006226, 2095652, 2117058, 2416376, 2250031, 2184989, 1933423, 2110481, 2161040, 2151742, 2126855, 1984528, 1715891, 1753677, 1739862, 1615583, 1782237, 1889487, 1889161, 1976338, 1691289, 1751758, 1771862, 1721320, 1947666, 1514420, 1665120, 1530124]
13940A530124R9530k60877J36097J55376m4756J52138K5547j12692M1169k16433
13930A505223J45944o1205K52l39948M38408k68328n7869j12828M48136K5627
13920A723412m69025K66106m0859j59027O1569j39582L28676k93259j3585J87834
13910A452260l51807J64226J22625L6775l75181J84188J87767J17840k67727k91399
13900I79567L05184p9190k1962J43472J94658p3459j18708k31935k00755J92418
13890A089290o4319q4993M26357Q2262q5757p447j35595j65535M52867l92345
13880A114785M3094k33800J97888k37959N80094l67170m5191j79987K13784K10395
13870A295933l31402q6508K09043k26358K97242J12077k61961J24117p8462p4472
$$ y = [1530124, 1629654, 1368777, 1504874, 1660250, 1615494, 1767632, 1793179, 1680487, 1721656, 1505223, 1651167, 1589962, 1590214, 1250266, 1688674, 1420346, 1362477, 1249649, 1697785, 1723412, 1254387, 1520493, 1479634, 1320607, 1382176, 1242594, 1571270, 1278011, 1264426, 1452260, 1100453, 1264679, 1387304, 1424079, 1048898, 1233086, 1420853, 1538693, 1270966, 979567, 1284751, 1205561, 1183599, 1327071, 1521729, 1448270, 1329562, 1097627, 896872, 1089290, 1024971, 939978, 1366335, 1448597, 1362840, 1355393, 1219798, 1054263, 1507130, 1114785, 1157879, 924079, 1121967, 884008, 1464102, 1096932, 1051741, 871754, 1085538, 1295933, 964531, 878023, 1087066, 860708, 1157950, 1270027, 1008066, 1132183, 1053721, 979249]
13860I79249l79625K05494j42350M31012k80455J52717J8751J62533l15917J94310
13850A025719J240l32174O74196j88917m54101M17439k32777j26219M9713n7287
13840G76832l5855p1893L01195k25715K09796m0593J28756m6724j54083k4353
13830H17363K85335l55340m1500j73331N11532L8438k46003j5336p2267K19128
13820I68019L0856q6844k96830L57251J81105E74489L51529J6923k53909j97906
13810D91126O03921m82571L39076p0855l03256K47449l36087J06490L85017l26191
13800F54119J50055n3513l9341p6043l3562K3523K25355N6615k85462P4674J88335
13789H84755O3026m36501L06912k32329L59823j35762l47758K05446J44979K69720
$$ y = [979249, 599624, 805118, 662768, 1093780, 813325, 966042, 984793, 1147326, 831409, 1025719, 1026959, 694785, 1368981, 1180064, 725963, 1143402, 910625, 784406, 834119, 776832, 740977, 669084, 970279, 744564, 954360, 913767, 1042523, 995799, 841716, 817363, 1102698, 747358, 705858, 532527, 1044059, 1082497, 836494, 821158, 748891, 968019, 998875, 912031, 615201, 972452, 1153557, 574489, 926018, 942941, 689032, 491126, 1095047, 612476, 951552, 880697, 577441, 824890, 488803, 595293, 980310, 654119, 804174, 750661, 711320, 635277, 601715, 625238, 850593, 907208, 621746, 696420, 884755, 947781, 511280, 818192, 585863, 945686, 809924, 462166, 667612, 812591, 1082311]
13779A082311l15424j33711j05981R8823j93883M00446r6420P511k35519j0587
13769D97566J61985n7277j10400K33200j16323J26382k39959A92458K47464M18533
13759H58455j81284L16081j99258l41676B24386L18493K68887l89322J80174L4399
13749F37017J30722r2388J21464k28119j28579J38461n7568R5020j25002K05611
13739F96639k23129n4702J19291N6426j1617B86092J87674O1755k4850L2125P0694
13728F13490j0663J79430k28997L2465j28350K25495k75208K9451N2909R9154
13718E89176l6184A33509O14325k85209O3924L43825D13207K24829j2914o3151
13708E61971J37783k91312q2289N28850j42113j90266O10K25162j6863j17792
$$ y = [1082311, 766887, 633176, 527195, 626018, 432135, 832581, 736161, 743672, 508153, 497566, 659551, 602274, 491874, 725074, 608751, 735133, 495174, 192458, 439922, 858455, 677171, 993252, 793994, 452318, 224386, 542879, 811766, 422444, 602618, 637017, 767739, 675351, 796815, 568696, 440117, 578578, 521010, 616030, 491028, 696639, 473510, 418808, 538099, 594525, 582908, 286092, 473766, 535521, 510671, 542796, 613490, 602827, 782257, 553260, 585725, 457375, 682870, 407662, 437113, 490022, 589176, 552992, 133509, 747834, 462625, 526549, 870374, 413207, 638036, 625122, 561971, 699754, 408442, 326153, 855003, 712890, 522624, 523234, 748396, 731533, 613741]
13698F13741k72059R118O3874k265n5967L95486k34802R4090j76780o3298K91133
13687F62271l14901j07191M91793l31814P5492j10239n1654J81120k12141K6682
13677C09418K18082k32338j36946N18156B75025P4288K09638B55296J50323o8368
13667C37251K75637J32170A95918K89701P3878N2376k11225K6004L97003k61995
13657E61660j09157j87545J88979K27236k36515K66866j58807A97547P2416K60027
13647E29990B11512m3372K49940L27946C10798l8060K76514B28640o6777K14383
13637C76246j84267J43344L04498A34268J64846j35625L45836J10292k16545P5274
13627D78346j71586k9227J02478J09359j53495E5586N34250B15876N25794A85222
$$ y = [613741, 341682, 350800, 414674, 412409, 356442, 751928, 517126, 611216, 434436, 371138, 662271, 347370, 240179, 731972, 400158, 475650, 365411, 313757, 494877, 282736, 309418, 527500, 295162, 158216, 676372, 275025, 349313, 558951, 255296, 405619, 337251, 612888, 745058, 195918, 485619, 559497, 611873, 400648, 426652, 823655, 561660, 452503, 264958, 453937, 681173, 444658, 711524, 552717, 197547, 269963, 529990, 211512, 168140, 418080, 746026, 310798, 272738, 549252, 228640, 161863, 376246, 191979, 335323, 639821, 134268, 299114, 163489, 509325, 619617, 403072, 478346, 306760, 277533, 380011, 489370, 335875, 55586, 589836, 215876, 741670, 185222]
13616C69309J03652L707B02048K50774L4794O0948A95671M28015k48072r8710
13606B76904L64242B85895k1100J26982j22999j04061O38782l87796K3487L9506
13596D78696B34844o6042M3347Q4337K18278A41928M0341L2560J36434J0040H9932
13584F9603J48105J14233L9835j08745J34086b2430C56811j25196J4076j03476
13574A42215L6714a0182F51578k73457A05818J86430o8232E3789K94622o9553
13564B78858c3444E4447L62690L2743J0329J12841k11308j72431L477L2917J62423
13553C88128C0103Q4896J00966J6964P6305L16459r8786B62570P3019A03497L47995
13542D51492j69167Q7597o0071J5513j40265N360J74239j20264K35197B7521J60521
$$ y = [369309, 472961, 476668, 202048, 452822, 487616, 548564, 195671, 623686, 375614, 276904, 641146, 285895, 264795, 391777, 268778, 164717, 803499, 415703, 439190, 478696, 234844, 168802, 212149, 296486, 514764, 141928, 182269, 214829, 351263, 361303, 89932, 69603, 217708, 331941, 371776, 263031, 397117, -22430, 356811, 231615, 245691, 142215, 178929, -10182, 651578, 378121, 105818, 292248, 224016, 53789, 348411, 278858, -33444, 54447, 417137, 449880, 460209, 573050, 361742, 189311, 192788, 225705, 388128, 30103, 114999, 215965, 232929, 309234, 625693, 526907, 262570, 335589, 103497, 451492, 282325, 369922, 309851, 325364, 185099, 190459, 364698, 244434, 479631, 27521, 188042]
13531A88042J2218p824J85435r4434J461b6696B62114J55724j43374a36945C12713
13519a06462A17652L35946A87528O4217J99217A82499M62786C16976A50017P5196
13509B25213K48986l0998A60082B1931N74251k10406j24840r0681H512a90592
13498D1771a0899C38388J22738j44751l2714J05856A10232d6628C8443K03260
13488B41703A10462L84161F9272M91613A89815L04049j30935K33850J84355B98759
13477A95732i1225C94657m7699R9869l4748j59373P1836m2555D1933g2215A1774
13465C83440A53198J32516j11177j9956L1533j7001R0736k9578q3675f4330A26375
13453D38243A88081J49699l9910A32715L54818i5409B62885f851G4776k050L80793
$$ y = [188042, 200260, 192436, 377871, 283437, 284898, -26696, 262114, 417838, 274464, -136945, 312713, -106462, 117652, 453598, 187528, 251745, 450962, 182499, 645285, 316976, 150017, 225213, 474199, 443201, 160082, 21931, 596182, 385776, 260936, 170255, 8512, -190592, 41771, -10899, 338388, 461126, 316375, 283661, 389517, 110232, -46628, 38443, 241703, 110462, 494623, 69272, 560885, 189815, 493864, 362929, 596779, 781134, 298759, 195732, -91225, 394657, 346958, 446827, 412079, 252706, 324542, 281987, 41933, -72215, 11774, 383440, 153198, 285714, 174537, 154581, 186114, 169113, 259849, 230271, 146596, -64330, 126375, 438243, 188081, 337780, 297870, 132715, 487533, -95409, 262885, -6851, 74776, 72726, 453519]
13442D53519B6576M17080A75330J13394N9101D3678Q0801m3508f72C1239N5380
13431H6619O2363d3718B60815r0352O9460a37875B51583P9232h670A05456a22244
13419D59368n42E887J6257K03026c5145F0256J01998K51973A61575O178e8957
13407b36555A93079P0058j1798J57469h9304j12746D9428d4679B81792O311l5522
13396B52581A15205J32565d6262A69740C6981L04735I5337J19613c5228k8164
13386f3392C80207j85920p1394Q7829N6960D329O3925K21441J44147j74146q6214
13375A73482o0205J89939q7626K2824M3011A01920c11089C17461n5677K4067A10441
13363A53994K67087r5702J04966A3721K23369l6129c2153B61382j16004K03907
$$ y = [453519, 26576, 443656, 175330, 288724, 347825, 43678, 124479, 80971, -672, 31239, 86619, 148982, -43718, 260815, 170463, 239923, -137875, 251583, 330815, -8670, 105456, -122244, 459368, 458826, 5887, 22144, 225170, -35145, 60256, 162254, 414227, 161575, 167753, -58957, -236555, 193079, 263137, 251339, 408808, -89304, -202050, 49428, -44679, 281792, 288103, 252581, 115205, 247770, -46262, 169740, 36981, 341716, 95337, 214950, -35228, -63392, 380207, 194287, 122893, 210722, 267682, 4329, 68254, 289695, 433842, 259696, 173482, 113277, 303216, 215590, 238414, 281425, 101920, -311089, 317461, 261784, 285851, 110441, 153994, 421081, 325379, 430345, 13721, 237090, 200961, -32153, 261382, 145378, 349285]
13353C49285A50236p711R3525a62309B2207L05250j35546K725c5815C34617B3321
13341A84296J83901j14700P0823o0036G8788K37389o6374J63046j76476q1942
13331A54431J87076j25062A2267K88865A06720a08626i583A33477R1343J08397
13321C33217k3260Q182E7130L79008p0196m5535K62776A47717K11771j65463H8342
13309B59685A08151J88620A10009f4159E3373A8406J96655c7064B27288E3650
13298B76563i979A6704J54945m7814J02774j07681A5334L51533j06233A26801
13287B84659b66434B16514r0597K6573C1798L6941k9420a43014F13174C05491
13276C44369C5442J59185p4588R0164J36832D9842K56503e1774B40936a68223
$$ y = [349285, 150236, 142525, 236050, -162309, 22207, 327457, 191911, 194636, -35815, 334617, 23321, 184296, 368197, 253497, 324320, 264284, 78788, 316177, 249803, 412849, 236373, 154431, 341507, 216445, 12267, 301132, 106720, -108626, -9583, 133477, 224820, 333217, 309957, 318139, 57130, 436138, 365942, 320407, 583183, 147717, 359488, 194025, 88342, 259685, 108151, 296771, 110009, -64159, 53373, 18406, 215061, -37064, 227288, 53650, 276563, -9979, 16704, 171649, 123835, 226609, 118928, 15334, 366867, 260634, 126801, 284659, -266434, 216514, 125917, 152490, 31798, 68739, 39319, -143014, 613174, 305491, 344369, 35442, 194627, 120039, 210203, 347035, 49842, 306345, -51774, 240936, -168223]
13265A27464c9975B81122g0634j68754H2127J2583J35182d1727B04227c4027N076
13254b8951C30470j58494a31196F27742A23311L1257P1537H0465f4846D01335
13243A99506h57j63576A10443J49466G4092f8863A20674b037I2008K99199A04478
13231h9089A72526H5100N6182O5303i7496B86752o5384b345l37932g2878I6971
13219b43377B55587e8834A04003i0922D3065A4375N4126P9856K19788g6604B06001
13207A64438C2445b8024B21185d6346J6181G9331l4266K12246A12584a70696g4221
13195f6600j1549D9664O0993a4837B29155a69140A84035f6132F6716A0550Q2469
13184I3019G297J97210q3956K7068J30815A7750a09357B9846a2164B60392c4821
$$ y = [127464, -39975, 281122, -70634, -239388, 82127, 94710, 229892, -41727, 204227, -34027, -28951, 330470, 171976, -131196, 627742, 123311, 154568, 226105, 80465, -64846, 401335, 199506, -857, -164433, 110443, 259909, 74092, -68863, 120674, -2037, 92008, 391207, 104478, -89089, 172526, 85100, 141282, 206585, -97496, 286752, 221368, -2345, -340277, -72878, 96971, -243377, 255587, -58834, 104003, -90922, 43065, 14375, 68501, 148357, 368145, -76604, 206001, 164438, 32445, -28024, 221185, -46346, -30165, 79331, 45065, 257311, 112584, -170696, -74221, -66600, -78149, 49664, 110657, -14837, 229155, -169140, 184035, -66132, 66716, 10550, 93019, 7297, 204507, 120551, 147619, 278434, 17750, -109357, 29846, -12164, 260392, -34821]
13172a14276C3068K87637r4162a26214A99109o3702b8611E5315O0601b14296B00598
13160f3945A40159J7560a6053j08312e1316A20643a00195R284K367E33446f1578
13148A20705a61776j77005B7570d5581r8396B32764A2089L828M47689b8811B48355
13136C23546E2134g3624C11394b2856j4578D17498f7107c0321A03675i8020k57286
13125c55306B76806E8165L00777m7944l9123A9819P8238K87735j12004a5866k2105
13114c7971k33886C9137a6248C5490g6068A87512d575j11673j16637R5207q6005
13103b23683D46K62562q2623a18801D8637M6321i8284A05996N6291G5105j5281
13092E9824e8440B4350a04250C2099d8517H1363a27903a0558A05151P2953B6181
$$ y = [-114276, 33068, 320705, 226543, -126214, 199109, 135407, -28611, 55315, 115916, -214296, 200598, -63945, 140159, 157719, -16053, -124365, -51316, 120643, -100195, -90911, -88544, 533446, -61578, 120705, -161776, -338781, 27570, -45581, -143977, 232764, 12089, 15917, 463606, -28811, 248355, 323546, 52134, -73624, 311394, -22856, -37434, 417498, -67107, -30321, 103675, -98020, -355306, 276806, 58165, 358942, 310998, 271875, 19819, 98057, 385792, 273788, -15866, -37971, -271857, 39137, -16248, 35490, -76068, 187512, -4575, -116248, -232885, -137678, -223683, 446, 263008, 180385, -118801, 48637, 94958, -98284, 105996, 162287, 75105, 59824, -58440, 24350, -104250, 32099, -48517, 81363, -127903, -10558, 105151, 178104, 26181]
13080A16904J32679a50037c0015C43752n0486j04138d6922B09474q9692K42608
13070C62390A39774B6360K57598L5860A48721A1633K01525M6130p9911J53590
13060C32967H1331J64427l1070b50288C81680a3262C98153H129a65732B80141
13049A80808o2682a43845B6989K18064i227k331A04326J28086D2616J96957b52825
13037i905C56604A02608h6712p0111A45234b1430o3360a6664A4726K40970a17983
13025B86458M0383p4528F4407K7538J02323c27361H5280b98706A41134D5668A1720
13013B03193a83879D57830j73716a41053a9923C35215A22055k6552J33364d99380
13002B1487J49462E698J07500a8578j60406k132B50091a25577A89730H9125B5594
$$ y = [116904, 249583, -150037, -30015, 343752, 293266, 189128, -46922, 209474, 119782, 362390, 139774, 26360, 283958, 319818, 148721, 11633, 213158, 259288, 179377, 332967, 81331, 245758, 214688, -250288, 381680, -13262, 398153, 8129, -165732, 280141, 180808, 118126, -143845, 26989, 245053, -9227, -11558, 104326, 232412, 42616, 239573, -252825, -9905, 356604, 102608, -86712, -156823, 145234, -21430, -84790, -16664, 14726, 255696, -117983, 286458, 326841, 252313, 64407, 91945, 194268, -327361, 85280, -298706, 141134, 45668, 11720, 203193, -183879, 457830, 284114, -141053, -19923, 335215, 122055, 95503, 228867, -499380, 21487, 170949, 5698, 113198, -18578, -178984, -181116, 250091, -125577, 189730, 89125, 25594]
12990B74986m6817h3938A88941J74589F7558a27938A52372o0047K49385D1889
12979a06084D056Q1269k0220b8323H0229a33986D318n81i1146o2430I3070f3060
12966i9323M6686C23284d9943A17974B6050a63110D7871a46779e3842o4121b6782
12954f9366A29751J31890p4994L1471b03583j55022d4598m515C1809a52992h692
12942D1502J82341J00924F8665R4985a83394h8668j43604H9716J57453Q09H4115
12930b29751B66469M7282B5438L451b9914R981I7057O9637m1035j2880C3379b7910
12917H8052a5735G979a42657a504A6678K39342b05856A15782K5889L9887F6944
12905A5918e6371A61809A5998b14768B7517K52297o2875D2826J26813b37752h9042
$$ y = [274986, 228169, -83938, 188941, 363530, 67558, -127938, 152372, 92325, 341710, 41889, -106084, 4056, 85325, 65105, -28323, 80229, -133986, 4318, 3737, -91146, -153576, 93070, -63060, -99323, -52637, 323284, -49943, 117974, 26050, -163110, 47871, -146779, -53842, -117963, -26782, -69366, 129751, 261641, 186647, 218118, -203583, -358605, -44598, -49113, 31809, -152992, -8692, 41502, 223843, 324767, 68665, 163650, -183394, -88668, -232272, 89716, 247169, 247978, 84115, -229751, 266469, 313751, 25438, 28889, -29914, -19933, 97057, 166694, 125659, 112779, 33379, -27910, 88052, -15735, 7979, -142657, -1504, 16678, 256020, -205856, 115782, 141671, 181558, 66944, 15918, -56371, 161809, 15998, -214768, 27517, 279814, 216939, 42826, 169639, -237752, -89042]
12893b62439B054K58476A02749J01807D3253b8652B01705l3107i3583C72828a84286
12881c13134B42797F7545M3559b37808D26370c63988A60595o2884i9622d4309
12870H90L67223E9593a59771D51989I7742d934B20616A9532a37453A0822L48898
12859C59720j05178A24052L69589a24973n2705O9609j59994a31564L1108j13659
12849b14115A11605b9643J2368k57343E7687N7198P3451d4881A51157A925K73864
12838B75789j03667D1681d99465F1152c884o1739q6237D4575d0927B66381j05377
12827A61004a69079m9600h0823B36371D406b29000j09096i7515B92093h2399B75677
12815A80207o3459i0797A00504a63336E04R1440A2091a13167L9280E3498O219
$$ y = [-262439, 2054, 260530, 102749, 204556, 43253, -28652, 201705, 168598, -93583, 372828, -184286, -313134, 242797, 67545, 111104, -237808, 426370, -363988, 160595, 97711, -99622, -44309, 890, 368113, 59593, -159771, 451989, 97742, -4934, 220616, 19532, -137453, 10822, 359720, 254542, 124052, 493641, -124973, -177678, -108069, -268063, -131564, -100456, -214115, 111605, -29643, -17275, -274618, 57687, 114885, 188336, -44881, 151157, 1925, 275789, 172122, 41681, -499465, 61152, -3884, -65623, -151860, 44575, -40927, 266381, 161004, -169079, -218679, -80823, 236371, 4406, -229000, -338096, -97515, 292093, -82399, 275677, 180207, 116748, -90797, 100504, -163336, 504, 91944, 12091, -113167, -73887, 53498, 59717]
12804E9717b2049B60914h4638j93159B54646F4114J00734N0989M0744A17263b4627
12792a56664B24485E0122a39522a1145I5070a31806A04707a37005A32490a7276
12781A10987J7924C6727Q8214I294b15302A1776a21260A07331K617a76718P9459
12770i7259H0378a06999k3608A82794j71b06500B9757a09021B39221c1704A52836
12758a28142q5602p7362D13566j32969r5670J21554l6418a24145C6138a6639I7255
12746F0469e1595E4190A0219J57582C1774c18997b7629C12751j51878J33886J9044
12735C13803m2093l4304C8780f6484E3073g0993I5249J05381l2646Q5514G0500
12723I0041R0691C4635o012J51982a47927E2331J3310g2340A16384K3822c9841
$$ y = [59717, -22049, 260914, -84638, -277797, 254646, 64114, 164848, 215837, 256581, 117263, -24627, -156664, 224485, 50122, -139522, -11145, 95070, -131806, 104707, -137005, 132490, -17276, 110987, 128911, 36727, 124941, 9294, -215302, 11776, -121260, 107331, 109948, -176718, -97259, 80378, -106999, -130607, 182794, 182623, -206500, 29757, -109021, 239221, -31704, 152836, -128142, -213744, -291106, 413566, 280597, 184927, 306481, 270063, -124145, 36138, -16639, 97255, 60469, -51595, 54190, 10219, 167801, 31774, -318997, -27629, 312751, 160873, 294759, 313803, 271710, 237406, 38780, -66484, 53073, -70993, 95249, 200630, 167984, 253498, 70500, 90041, 180732, 34635, 28623, 180605, -147927, 52331, 65641, -72340, 116384, 140206, -39841]
12711b1071B49787j00351C2240M33202j49579j55580f138A87065G816K42241C1506
12699b8200A64892a24958B76252e5450A26200b21797J6829b4565H5570L22873
12689D08443A59579h1933B00959g6635C48143a51476G9224c4074k00674A37363
12678B69170h5493B39873j18924J9237P8707B7336M737J44465N9450a78458B42936
12666B12908J8689a23868C42422H2681c3272F1620K1791i6863I0222a96997j99125
12655c96122f9742A10503d529F94K10874n1574a6203D20713A75863p0860a56876
12643B79367A4367a38820D9884g2485B89256h9046M2341k7707C51909A74042M8056
12632B22098J71025m6275K1158A47231i1436C04810A30919J27909A25348O5510
$$ y = [-21071, 249787, 149436, 32240, 465442, 315863, 160283, -6138, 187065, 7816, 250057, 31506, -28200, 164892, -124958, 276252, -55450, 126200, -221797, -204968, -24565, 85570, 408443, 159579, -81933, 200959, -76635, 348143, -151476, 79224, -34074, -234748, 137363, 269170, -85493, 239873, 120949, 140186, 218893, 27336, 32073, 176538, 235988, -178458, 242936, 212908, 231597, -123868, 342422, 82681, -33272, 61620, 83411, -96863, 90222, -196997, -396122, -69742, 110503, -4529, 694, 211568, 159994, -16203, 420713, 175863, 105003, -156876, 279367, 14367, -138820, 49884, -72485, 289256, -89046, -46705, -74412, 351909, 174042, 222098, 393123, 346848, 368006, 147231, -91436, 304810, 130919, 258828, 125348, 190858]
12622A90858A9509O3884J91749a67030J1643A97997e7702J7213B02033a86509
12611A10550R1547R375J1984b03324B10956j5023b0371j04301C58300G6964R8238
12600A75202K97104h1487E24631A84159o37f9154k3873M2012q9715o212F8733
12588B30917F6012A5387J96713A7179J98610j1143c31796H9031a46256j44549
12578b90805a38461N7354k65506a8704k5221B10888P3672A03736a31237A71223
12567a78258E6608K4187j1897a29613B41224g9684A60551l67l4021D9538J20136
12556A69674c04492K8126A04860G507M95762A17396a28956A36938d9679A28937
12545C05093A21358b1863E8919a71885c3684l63454A18788A0678K02377p7435
$$ y = [190858, 19509, 83393, 275142, -167030, -155387, 197997, -57702, -40489, 202033, -186509, 110550, 202097, 211472, 223456, -203324, 210956, 195933, -20371, -124672, 358300, 76964, 175202, 472306, -81487, 524631, 184159, 183522, -69154, -93027, -51015, -140730, -146942, 68733, 230917, 66012, 15387, 212100, 17179, 215789, 204646, -331796, 89031, -146256, -290805, -138461, -81107, -346613, -18704, -43925, 210888, 284560, 103736, -131237, 171223, -178258, 56608, 80795, 68898, -129613, 241224, -79684, 160551, 160184, 126163, 49538, 169674, -304492, -276366, 104860, 7507, 503269, 117396, -128956, 136938, -49679, 128937, 305093, 121358, -21863, 58919, -171885, -33684, -397138, 118788, 10678, 213055, 135620]
12535A35620l3127l0928a40156D05779C5108J26618j7806o383K92010A55053a34450
12523c426j5090G9942K77710H7033a69083f6279j91592F7806A0455K33105q7465
12512A56095a49121O938G2269J22297k6175O2641q5681b8008A62970F0354L19326
12501C79680M345a19289K239A80444o2064M7636h0320B2999J14349k9523a15918
12489c3806B77519A02086j1991M8360a32921A40475i5961j67000A66097n8710
12479A07387C4611a16192B15388c40556P6103H1563l9212O8187K6330b40248a4458
12467A45715a46461j11906A97423a09568F2708a27109H3489J66244n3937b4258
12456B61680h6079A17358D1685g6922j24343J7723F8290K18289b2854j19841e9234
$$ y = [135620, 102493, 71565, -140156, 405779, 35108, 161726, 143920, 137537, 429547, 155053, -134450, -3426, -18516, 79942, 357652, 87033, -169083, -66279, -257871, 67806, 10455, 243560, 156095, -149121, -142183, 72269, 194566, 168391, 231032, 145351, -28008, 162970, 60354, 379680, 384025, -119289, -117050, 180444, 118380, 166016, -80320, 22999, 137348, 107825, -115918, -33806, 277519, 102086, 90095, 138455, -132921, 140475, -95961, -262961, 166097, 107387, 34611, -116192, 215388, -340556, -264453, 81563, 42351, 110538, 136868, -240248, -14458, 145715, -146461, -258367, 197423, -109568, 62708, -127109, 83489, 249733, 195796, -24258, 261680, -86079, 117358, 41685, -76922, -201265, -183542, 68290, 286579, -22854, -142695, -59234]
12444f0495i163q6326j54825H3840J00403E65K980N9092K2974a3422I8981Q5241
12432A84222d6578D8354b39072g6335k23476B21826q5099A3211g6797E4084h5337
12420a37591C8355K7306a66054A6923i7413c5059A49343a57294N1712d7145j1119
12409e8264r986k14489E7529b74478B33966a23199C1081a79152O6528j86504A98347
12397i3752M4603j08395C4989i3143G7342J02157c21501P0452n9013J32229M0529
12386a37304j06410m6665J38732A8182N8008a3582A96404J43389A12057M3614
12376A55671b85292f1588g112F5006P5611c17874D496c08951B89266J14211a4676
12364b81203a08068N1440j11500C72866A15130a00171D3130g0597B19232h2649
$$ y = [-60495, -9163, -95489, -250314, 83840, 184243, 565, 3545, 62637, 85611, -13422, 98981, 184222, -46578, 48354, -239072, -76335, -299811, 221826, 136727, 13211, -76797, 54084, -85337, -137591, 38355, 65661, -166054, 16923, -97413, -35059, 149343, -157294, -105582, -47145, -58264, -68250, -282739, 57529, -274478, 233966, -123199, 31081, -179152, -112624, -299128, 198347, -93752, -49149, -157544, 34989, -93143, 77342, 179499, -321501, -251049, -310062, -177833, -137304, -243714, -290379, -151647, 18182, 76190, -13582, 196404, 339793, 112057, 155671, -285292, -61588, -7112, 65006, 140617, -317874, 4496, -308951, 289266, 403477, -14676, -281203, -108068, -56628, -168128, 372866, 115130, -100171, 43130, -70597, 219232, -82649]
12353A08358d5817A44733E396g3415i065H8616L45560A77342k5024i9182B9017
12341A69990J62033O4621D7969L7657b75205A31558A0412N0485A6628O9494f881
12329B99370A8158g9070D0027a5674j02094A49567B1215L22307d7901k978a6568
12317E4151J47654E5689P7488a61252f8821j81014f9204j88373a6084A82557b48980
12305B3340J91089G7716b31259h1877n5448e3161A65799b7265m9947i498j10199
12294a19697A63639i9627A27970f8804F4613e4993E9346M8726e3011B07975q5797
12283A22178O3548e5261j85176e9050B30321b73913E7941b03654A72571F7418
12272B05021J42955A51294a96317C18653A2940A230L26653j57199J6725Q3049
$$ y = [108358, -45817, 144733, 5396, -73415, -9065, 88616, 434176, 177342, 152318, -99182, 29017, 169990, 332023, 396644, 47969, 85626, -275205, 131558, 10412, 60897, 16628, 86122, -6881, 299370, 18158, -79070, 40027, -15674, -117768, 149567, 21215, 343522, -47901, -50879, -16568, 54151, 201805, 55689, 133177, -161252, -68821, -249835, -69204, -257577, -16084, 182557, -248980, 23340, 214429, 77716, -231259, -81877, -137325, -53161, 165799, -27265, -77212, -9498, -119697, 163639, -99627, 127970, -68804, 64613, -54993, 59346, 108072, -53011, 207975, 122178, 185726, -55261, -240437, -59050, 230321, -273913, 57941, -203654, 172571, 67418, 205021, 347976, 151294, -196317, 318653, 12940, 1230, 327883, 170684, 187409, 270458]
12262B70458j0018K8896p3206B5900J03275L6376c7026A55059l3082a19044A15674
12250B92164d7740A97535P0176H606J65404b57859L0540B93461j33625C5992J52161
12239A88153c332D1036a33371A89276E4851K1034g1056A47436F1841J75515L0786
12228B68142a6096A73917R8512J6674b09814C23268j21046c542B91901O2031H2390
12216C08264I6883J34320c26589g892m1529B30502C9809K23826r4041O8377p8812
12205A59159J9222G213K46936K0837C9421K20224K3576A10060N1162K8857J40012
12194C30091H0665L19981a93071C22578D2063K42451o2438a20381j9693F1763
12183A62204G2434h2810B09669n3921L0994q8981h7429G5202O4907E974J44829
$$ y = [270458, 260440, 289336, 216130, 25900, 129175, 165551, -37026, 155059, 121977, -119044, 115674, 292164, -47740, 197535, 267711, 8606, 174010, -257859, -227319, 293461, 159836, 35992, 188153, -3332, 41036, -133371, 189276, 54851, 75885, -71056, 147436, 61841, 237356, 268142, -16096, 173917, 272429, 289103, -209814, 323268, 202222, -3542, 291901, 353932, 82390, 308264, 96883, 231203, -326589, -7892, -49421, 230502, 39809, 263635, 169594, 237971, 159159, 178381, 7213, 254149, 274986, 39421, 259645, 283221, 110060, 161222, 190079, 330091, 80665, 400646, -193071, 322578, 42063, 284514, 222076, -120381, -140074, 61763, 162204, 72434, -82810, 209669, 155748, 186742, 97761, -87429, 75202, 140109, 5974, 150803]
12172A50803J03669p9641a17689B23138J22184b73964J29009B73331J05931A52127
12161B68362C3285M65652p5381h623E9618N8012R711b49362J19372F5481Q1763
12150A47244R6857C8680J6839K76865i1953j08846H6009K06870n136J21470H7173
12138D9736Q9014a39487B02111q8737a00639F4594L59553a922D8680a16568j87893
12127c04461g8856A72711q1206d0311D0483P9429M3660l4392b12379g6971K4081
12116e2890j56722B1124a70426A57343h8735j31058D7734L9157g046C747b31286
12104b04199g5360l6876A10060b1503j4573j45053g8520k60821G9094b30471A48337
12092C904a23487L415n4121j00104Q0796L0102a2326k71854Q5225M5934H5864
$$ y = [150803, 254472, 174831, -117689, 223138, 345322, -273964, -144955, 273331, 379262, 152127, 268362, 33285, 498937, 423556, -8623, 59618, 117630, 127341, -249362, -129990, 65481, 147244, 244101, 38680, 55519, 332384, -91953, -200799, 86009, 292879, 287743, 409213, 87173, 49736, 138750, -139487, 202111, 113374, -100639, 64594, 424147, -1922, 48680, -116568, -304461, -78856, 172711, 91505, -40311, 40483, 119912, 163572, 129180, -212379, -76971, -52890, -209612, 21124, -170426, 157343, -88735, -219793, 47734, 86891, -7046, 3747, -231286, -204199, -75360, -112236, 110060, -21503, -36076, -181129, -78520, -339341, 79094, -230471, 148337, 3904, -123487, -120072, -174193, -274297, -193501, -163399, -12326, -284180, -198955, -153021, 85864]
12080g9040b252k01354I4931n164R5146Q5277O70760J476380F41559k73975j49592
12069B17992P3306b9041F2526c66026a2441G2617g9717m5371M5693K6738C7718
12057A38588a57057f0391D463M88361I4344J60727c32273F0782a21861C76383
12046I7060O3422F5767A9421g6608k30342B73384c69852H4384O8306a02274B43185
12034a08957o655A15775m8780a5477G3343J86969i2920d5337j44657p5652m8677
12023c14323e3792B72071B3469a30374f0037j2955A06078O3921a49504A83250
12012A09802d5676j05284P4590B25308J81708h2540G9705d731A40336a78891j36703
12001c15594a50470B60393A9148b02607a0161q033j21625D7010Q063a29499c909
$$ y = [-79040, -2252, -203606, 94931, 89767, 184913, 270190, 940950, 2417330, 641559, 367584, 217992, 291298, -29041, 62526, -366026, -12441, 72617, -79717, -125088, -79395, -52657, 37718, 138588, -157057, -60391, 4463, 492824, 94344, 255071, -332273, 60782, -121861, 376383, 97060, 160482, 65767, 19421, -76608, -306950, 273384, -369852, 84384, 152690, -102274, 243185, -108957, -115612, 115775, 66995, -15477, 73343, 260312, -92920, -45337, -189994, -265646, -314323, -53792, 272071, 23469, -130374, -60037, -72992, 106078, 169999, -149504, 183250, 109802, -45676, -150960, -76370, 225308, 407016, -82540, 79705, -4731, 140336, -178891, -315594, -150470, 260393, 19148, -202607, -10161, -18194, -139819, 47010, 55073, -129499, -3909]
11989d5320A29038N082c64724O5213a8488B31183A6451c50108F6161N2341O7732
11978A86234a73027A83671c30164A55148F146b23280D5623b71254O0666j90206
11968d00794I8208d6214j38987L3742m5996c1791D0119d5124a2133q4410P323
11957h9220A4614d86132G0378J2979e243j91161A65678D0370O018a61508j19641
11946b81149a36727O1278D42400A46119C3924Q5404b3561B91295a17568A54525
11935a04646j13660p6437a16953k4340A30246a49272M1181J5292I4550M9621c08072
11923F5783a31894j37712d1721a9875A25515a1688L558H6887J01018n8151J4608
11912A44362h7216k00037b6400k04201M0074I6445J12590b66583f3279A93678
$$ y = [-45320, 129038, 134120, -364724, -299511, -18488, 231183, 16451, -350108, 66161, 118502, 186234, -173027, 183671, -330164, 155148, 6146, -223280, 45623, -271254, -210588, -400794, 98208, -46214, -185201, -151459, -197455, -31791, 40119, -45124, -12133, -96543, -89220, 14614, -486132, 70378, 83357, -5243, -196404, 165678, 40370, 46388, -161508, -281149, -136727, -75449, 442400, 146119, 33924, 119328, -23561, 291295, -117568, 154525, -104646, -218306, -294743, -116953, -141293, 130246, -149272, -108091, -92799, 94550, 144171, -308072, 65783, -131894, -269606, -41721, -19875, 125515, -11688, -8130, 86887, 187905, 129754, 144362, -87216, -287253, -26400, -230601, -190527, 96445, 209035, -266583, -63279, 193678]
11901B88205f8921A90010e27667B33741h0977j19859F309g2081o1815H4717c86715
11889a62192A62139E1430J14855A6489M34284j46615C9171a84847b6840K469j01498
11878a25869l2149O1237C99375A45907C0168d5811k5409J5277r8354A69066f7703
11866I3282b61954a07130j70752C06J01066J40233g4926m9060B63592f6954J4943
11855e2011C69999g3318L0078C93739F2208Q3070a61423G365b28162N8267M9899
11844a19996B21906r3055J44222J10428a52189j73167a31579K6003B09692i8919
11833a1600j23815O3412b5135j19924a6715j77579A57389a44353N4573B7962a28484
11821g262p934l19254O5932G3614e530j85943C03998g4632A77074l2270C2099
$$ y = [288205, -68921, 190010, -527667, 233741, -80977, -200836, 6309, -72081, -133896, 84717, -386715, -162192, 162139, 51430, 166285, 16489, 450773, 304158, 39171, -184847, -26840, -24371, -125869, -158018, -96781, 399375, 145907, 30168, -45811, -71220, -55943, -154297, 169066, -67703, 93282, -261954, -107130, -277882, 306, 101372, 241605, -74926, -123986, 263592, -66954, -52011, 369999, -73318, -43240, 393739, 62208, 145278, -161423, 7365, -228162, -169895, -119996, 221906, 128851, 273073, 383501, -152189, -325356, -131579, -105576, 209692, -98919, -11600, -135415, -72003, -25135, -145059, -16715, -194294, 157389, -144353, -89780, 27962, -128484, -7262, -15196, -334450, -268518, 73614, -5530, -191473, 303998, -74632, 177074, 144804, 32099]
11809d9531j94891K2837A2442f4313j3549B11320H2236b09671H6884a72897I9235
11797A83772c8414o5493B3740b27226A659a89431Q8149B00450q5700b6334j96371
11786b22705a05605B39016a55670l07183A42073a70728e7580C11912n7098d8487
11775B2399P6551B5807p653a71259j8610A56731d6932D87048j32236F7915J92840
11764B60755q7253e5502G0771P6470Q9414J42318b96262h8678j01732A78880a74828
11752i9773j57359i2991p2559H4814a39767A81251k4154g5004A84834N6841A13231
11740b2250k33221d0229A82400b23057B1634Q5703a48061C8928a26844B79136
11729A01921R8998O1030B4728L7664a73243P8811d001I203e3778C13844a5634
$$ y = [-49531, -244422, -221585, 12442, -64313, -77862, 211320, 82236, -209671, 86884, -172897, 99235, 183772, -38414, -103907, 23740, -227226, 1659, -189431, -101282, 200450, 114750, -26334, -222705, -105605, 239016, -155670, -462853, 142073, -170728, -57580, 311912, 254814, -48487, 22399, 98950, 25807, 18154, -171259, -189869, 156731, -46932, 487048, 354812, 67915, 260755, 173502, -55502, 70771, 147241, 236655, 378973, -296262, -88678, -190410, 178880, -174828, -99773, -257132, -92991, -165550, 84814, -139767, 181251, 157097, -75004, 184834, 241675, 113231, -22250, -255471, -40229, 182400, -223057, 21634, 107337, -148061, 38928, -126844, 279136, 101921, 200919, 261949, 24728, 62392, -173243, -94432, -4001, 9203, -53778, 313844, -15634]
11717A23050E7778b30899d6263I4468M1721m9937b59606r6161a13637A53423a05801
11705B06074I1127a57331A83774J65631b53851h0819B76380b70735J08822C9067
11694C4487c5975e32j94822O5832k42367a77229g856r4006r1631M5220A94167
11682C7300e4701C54500A73180k228M5883j00333j7895h1995M0365n7707G4942
11670g5016n74851D3272b10927D29094b4617e879C36478E2144J75363A04928D2225
11658A18214m9641N827b4975A7881J50171c37190a17581A82299A3714h4790D6277
11646B13667J3172a25134M8620m5442D0585j8894b54018E4764P2967D9991A9018
11634a23545A56219c25792N9484J30260O360B08687H4218b0051G1685k6053b5327
$$ y = [123050, 57778, -230899, -46263, 94468, 136189, 86252, -259606, -355767, -113637, 153423, -105801, 206074, 91127, -157331, 183774, 349405, -253851, -80819, 276380, -270735, -161913, 39067, 34487, -35975, -532, -195354, -129522, -371889, -177229, -7856, -101862, -193493, -148273, 194167, 37300, -54701, 354500, 173180, 170952, 216835, 116502, 98607, -81995, -41630, -99337, 74942, -75016, -649867, 43272, -210927, 429094, -24617, -5879, 336478, 52144, 227507, 104928, 42225, 118214, 68573, 74400, -24975, 17881, 168052, -337190, -117581, 182299, 13714, -84790, 46277, 213667, 226839, -125134, -76514, -121956, 40585, 21691, -254018, 54764, 127731, 49991, 19018, -123545, 156219, -325792, -266308, -136048, -129688, 208687, 84218, -20051, 71685, 45632, -25327]
11622E0681R7261o4275O7684j9244q383C9115L19899a11583j64748c9932A7522
11610A08718d23784H4307b4896j04546b8528J117D7863J12914o4855f1702E2320
11598A02038J13879i7967b9792B91311q3235j02063m4107J03631B6986K77419
11588C04405b2033A64636A7999K79958o3096a54042N1543C9767L2452K08593j6000
11577B64812A32349o5480R5579D5222M80176I8319b61187B26572A602Q1930L08821
11566C92353l7525a15527A78280L1257c5769K665H5238K44034b9410B10187o2440
11555A47747E9247a25741A68008E3724M9162J94739J25736b2115A80034e1530
11544F8825N4385o1114J60695B6074J24480D7391O7009M12025k03273g4245j24703
$$ y = [50681, 147942, 83667, 151351, 132107, 123724, 39115, 359014, -111583, -276331, -39932, 17522, 108718, -423784, 84307, -24896, -129442, -28528, -27411, 47863, 160777, 95922, -61702, 52320, 102038, 215917, -97967, -29792, 291311, 208076, 106013, 61906, 165537, 26986, 304405, -22033, 164636, 17999, 297957, 234861, -154042, -102499, 39767, 72219, 280812, 264812, 132349, 66869, 162448, 45222, 525398, 98319, -261187, 226572, 1602, 83532, 392353, 354828, -115527, 178280, 209537, -35769, -33104, 85238, 329272, -29410, 210187, 147747, 59247, -125741, 168008, 53724, 102886, 297625, 423361, -22115, 180034, -51530, 68825, 123210, 62096, 222791, 26074, 150554, 47391, 114400, 526425, 323152, -74245, -198948]
11533a98948E8223d04149j73927A81289a75258C14825D1286K7262P5697a94123
11522A55588h2388n591B18443g959A42240N2393I6714R1463a4134k7299A80139
11510B38758J93507j79842l4527E205R0586J73795n3696D3885e2718C46287E2111
11498C24798H4888K23203H3010n671L4039C1261L56295A19384J90214K7592A25746
11486B922M6700J46433M3914g3608q2641B59837K3290l2800K84195A56160L00540
11475D56700A41966D8843O4166b1904J0685H0968O6463R8150J1729a31524A22928
11463h2278B46164G2076a48282e6349A84413d7635D2080c6563i998B56683G004
11451A7388K55419b64765a17222C70450j42256a1139C57697j01160P0431C9553
$$ y = [-198948, 58223, -404149, -578076, 181289, -175258, 314825, 41286, 68548, 144245, -194123, 155588, -82388, -87979, 218443, -7959, 142240, 194633, 96714, 188177, -14134, -41433, 180139, 238758, 432265, 252423, 217896, 5205, 95791, 269586, 215890, 43885, -52718, 346287, 52111, 324798, 84888, 308091, 83010, 77339, 111378, 31261, 387556, 119384, 309598, 337190, 125746, 2922, 49622, 196055, 239969, -73608, -156249, 259837, 283127, 250327, 534522, 156160, 456700, 141966, 48843, 113009, -21904, -11219, 80968, 147431, 245581, 257310, -131524, 122928, -82278, 246164, 72076, -148282, -56349, 184413, -47635, 42080, -36563, -9998, 256683, 7004, 17388, 272807, -264765, -117222, 370450, 228194, -11139, 357697, 256537, 326968, 39553]
11440A01414a95367B75097b42390F7421b1868I5810b00748C1566Q0571R710b01994
11428A66510C5494J29938a42281A38524a70619a1721j70921f2147I2128A9594
11417a29583J9897A12929A1936b09827A15466a05623A32523F3728M1521b34756
11406b52739i4523A83862P9410j27665i5694B04560C3890a25004D80682A1515
11395B14048f8836K4350B59116j463f1752d897k97022g6127j89605R179D097a98162
11382b00855K0924B08466l172E7025K3823e5904j74648A49217J64022A28834P953
11371A36787O0785a05318k18793A80928b21669B35523a65618k05171C12410c7350
11360a46736b9408q9746j56044a6090A84615B5329Q2582b44448A54014j3090e3156
$$ y = [101414, -195367, 275097, -242390, 67421, -21868, 95810, -200748, 31566, 112137, 121847, -201994, 166510, 35494, 165432, -142281, 138524, -170619, -11721, -182642, -62147, 92128, 19594, -129583, -109686, 112929, 11936, -209827, 115466, -105623, 132523, 63728, 105249, -234756, -252739, -94523, 183862, 263272, 135607, -95694, 204560, 33890, -125004, 480682, 11515, 214048, -68836, -44486, 259116, 257653, -61752, -4897, -301919, -76127, -265732, -256553, 4097, -198162, -200855, -179931, 208466, 205294, 57025, 80848, -55904, -230552, 149217, 313239, 128834, 136787, 197572, -105318, -324111, 180928, -221669, 235523, -165618, -370789, 312410, -37350, -146736, -29408, -119154, -275198, -16090, 184615, 25329, 107911, -244448, 154014, 140924, -53156]
11348B19388I4385a30957D6027a74789b6432A94374G8250P2548g0571k04594P3617
11337b01548B88240h6698j09771a2725A29722h9713k37730A32658o2432b66929
11326a96649E9J54246c2015B49861D7101c4771G2839B1376c8487E8025N2818M1818
11314A52661c96637B46536p7923a20859H2981a25830H2015a04657m0243B93196
11303a95547C539K53635a28050O2177k6664a3459q0432B8705a74790L6870A38324
11291H4056a26500a1992F2274Q2154a44567l43251K07111I9802k6328C328L2089
11280C5417b85806H1738g2744A72757J32626I1388c8215o1937j3817j99504c1287
11268A16784E5270J5625b4274B12251c5891A5595K34461c19015J25325d8735l4099
$$ y = [219388, 94385, -130957, 46027, -174789, -26432, 194374, 78250, 150798, -70571, -275165, -201548, 288240, -86698, -196469, -12725, 129722, -89713, -327443, 132658, 70226, -266929, -196649, 59, 154305, -32015, 249861, 47101, -34771, 72839, 21376, -38487, 58025, 110843, 152661, -396637, 246536, 168613, -120859, 82981, -125830, 82015, -104657, -144900, 293196, -195547, 3539, 257174, -128050, -65873, -92537, -13459, -93891, 28705, -174790, -137920, 138324, 84056, -126500, -11992, 62274, 144428, -144567, -487818, -280707, 99802, 73474, 3328, 35417, -285806, 81738, -72744, 172757, 305383, 91388, -38215, -100152, -113969, -313473, -31287, 116784, 55270, 70895, -24274, 212251, -35891, 15595, 250056, -319015, -193690, -48735, -82834]
11257h2834k46955F1779a44160k52401J13489a5011j34490f3751k12031G7569
11246f7090A30521j5218b97996A15255E3308K32866E8600b27943g9901B73536
11235a94340g4370k24791G6454M12404D4199d6031k14230M1282O4247A75615b3380
11223A8917L3715M3659g6400p4888j57580B01203J34b42027A70824G4062J19295
11212A93357b08936i6721a7778k14047H4972L0740F65Q9430b3382R927D9932b46076
11199b8567B0531d7980H8094b74861a09329c8674j62738R6562j16252g0368D3299
11187b70406c7196A29453j697A9325N9459N9600O3430i1307A04698k156J6731
11176A19273e8410j95831N7109c2760k29018C18665c1692j11711C68070E2674
$$ y = [-82834, -329789, 61779, -144160, -396561, -283072, -15011, -149501, -63751, -275782, 77569, -67090, 130521, 115303, -297996, 115255, 53308, 286174, 58600, -227943, -79901, 273536, -194340, -74370, -299161, 76454, 488858, 44199, -46031, -260261, -218979, -154732, 175615, -23380, 18917, 52632, 96291, -76400, -151288, -308868, 201203, 201337, -242027, 170824, 74062, 193357, -208936, -96721, -17778, -231825, 84972, 115712, 665, 90095, -23382, -13455, 49932, -246076, -28567, 20531, -47980, 88094, -274861, -109329, -38674, -201412, -104850, -221102, -70368, 43299, -270406, -37196, 129453, 127756, 19325, 78784, 138384, 201814, -91307, 104698, 102542, 119273, -58410, -254241, -197132, -32760, -261778, 318665, -31692, -143403, 368070, 52674]
11165E1486a5071l8175j98161b1500A81001a7812C09742b0588D4363L80143A00490
11153f0245B8830c36635h3786q9161A3274J79837b47682B01235h6101h639E5774
11141a15642H8580K40031r4480H5813C7970f3290J4893C62854h6549k76884A40830
11129g45B78393m0710b29096B7837L027a3169B7079a02384B91444D1613e2860
11117b2224A3290i5762B02267k5215L6162I1674J34536j04269K44777c3086B58696
11105a9752A67689b8630A87752M341g4228K8741N251A99029E1121K58329K39567
11094E49017B55040J79724A35910J40870K0263E6711J88608K56250A38970E0042
11083C43163o0905n1979q2236d5425G7529K52232r9587O1554A39939K31077A17288
$$ y = [51486, -15071, -53246, -251407, -21500, 181001, -17812, 309742, -20588, 44363, 424506, 100490, -60245, 28830, -336635, -83786, -172947, 13274, 193111, -247682, 201235, -86101, -8639, 55774, -115642, 88580, 328611, 234131, 85813, 37970, -63290, -48397, 362854, -86549, -363433, 140830, -745, 278393, 237683, -229096, 27837, 30864, -13169, 27079, -102384, 291444, 41613, -52860, -22224, 13290, -95762, 202267, 177052, 213214, 91674, 226210, 121941, 366718, -33086, 258696, -19752, 167689, -28630, 187752, 192093, -74228, -45487, -40236, 199029, 51121, 309450, 549017, 255040, 434764, 135910, 276780, 297043, 56711, 245319, 501569, 138970, 50042, 343163, 282258, 230279, 148043, -45425, 77529, 329761, 230174, 291728, 139939, 371016, 117288]
11071A7773P9926K82733J57110j34368P7906P047K5493k8393j27366R8722M575
11060D61158j16095J7909J30954J91823j72661J10701K89864k82790n160R2597
11050G18300j10978K44216n5019q0934L3432K92926m52835L14197l2365l03784
11040E67156L24555C67132M41283q2462C04368O69931k56782k49935Q0029J10557
11030F58168o8701J72429k05557N7308L4891J70044O5647l9155p8406J47899j10589
11019H03978j36239j73689n8103L85078j20487q562r9929k2807j59451J34059
11009E43848j70921j4839L39720l11925K74278p5619J23591K572P5386Q2552J9532
10998H88175j22211k62191N9174o8718K70651r9392N5230j28636K86334l06694
$$ y = [17773, 97699, 380432, 537542, 403174, 481080, 488127, 513620, 485227, 357861, 456583, 461158, 345063, 362972, 493926, 685749, 513088, 623789, 913653, 630863, 625703, 718300, 607322, 851538, 796519, 715585, 749017, 1041943, 589108, 903305, 870940, 567156, 891711, 367132, 808415, 725953, 304368, 974299, 717517, 467582, 547611, 658168, 589467, 761896, 556339, 613647, 648538, 818582, 884229, 845074, 766668, 914567, 803978, 667739, 494050, 435947, 821025, 700538, 691976, 592047, 569240, 409789, 543848, 372927, 358088, 697808, 385883, 660161, 584542, 708133, 710705, 786091, 868643, 888175, 765964, 503773, 562947, 494229, 764880, 665488, 720718, 592082, 878416, 571722]
10988E71722L31264K57588k42267j5600k5291J39758j7018N61455m27400J71824
10978A306035J60679J30251J52582L59475J72859N12560k3849M06128k92054r8062
10968B786604P0877n28810K22937l81761k16707o13151K15404J26423k02784Q798
10958A487830j21739P6477P82826n15636k08542j89469j18243l4324O8763D93553
10947F57991k70007K41109B79551M0152K5905p8639A01755J63686Q935D9503J37231
10936A86734J37877A52589N5023K73872b11741B28006j10825l7835b56159A04063
10925A14809D2201Q168C135d8013A14035a0209H1319K1295N1175a57295e1579
10913f9859j01185B89437j39086a62771n1025k6032j34939a69710r1309A92958
$$ y = [571722, 902986, 1160574, 918307, 902707, 877416, 1017174, 1000156, 1561611, 1134211, 1306035, 1466714, 1596965, 1749547, 2109022, 2281881, 2794441, 2770592, 3176720, 2884666, 2786604, 2857481, 2328671, 2551608, 2169847, 1953140, 1339989, 1555393, 1681816, 1479032, 1487830, 1366091, 1442568, 2225394, 1709758, 1501216, 1311747, 1193504, 1159180, 1227943, 493553, 657991, 387984, 629093, 279551, 319703, 345608, 266969, 101755, 265441, 274376, 49503, 186734, 324611, 152589, 207612, 481484, -211741, 228006, 117181, 79346, -256159, 104063, 114809, 42201, 50369, 3135, -48013, 114035, -10209, 81319, 102614, 153789, -157295, -51579, -69859, -171044, 289437, 150351, -162771, -213796, -239828, -374767, -169710, -261019, 192958]
10902b20065F239J59704a7055H4262a02718J546C9874c90944J56577N6383g8463
10890e801j56985p0130B09335B413J92998m2349D3330h6323j90163A71102k9503
10879A41599a37860f6220a4046l26020A21050a63022f8697j64339M1319A0144
10868D10268a45143b8217m2137K8057B26632a58007A29044m7739b62341D32713
10857A93112p4106J31013C7832a29728F058a09285A15178a23570C0366a6845n1335
10846f8180J001k25064e152j3400k69373D1005d69592K25045g6475A32329d6612
10834D2516P4154f2849b6625H1158Q5409b09318J03425D77193a79657r6927A26130
10822B4081R3922K5950a12021m5705j16935Q3464b2845r1891B3975j1458i2647
$$ y = [-220065, 6239, 165943, -17055, 84262, -102718, -101172, 39874, -390944, -234367, -177984, -78463, -5801, -162786, -232916, 209335, 2413, 195411, 153062, 43330, -86323, -276486, 171102, 141599, -137860, -66220, -14046, -340066, 121050, -163022, -68697, -233036, -191717, 10144, 410268, -145143, -28217, -70354, -42297, 226632, -158007, 129044, 81305, -262341, 432713, 193112, 119006, 250019, 37832, -129728, 6058, -109285, 115178, -123570, 30366, -16845, -68180, -67179, -292243, -5152, -18552, -287925, 41005, -469592, -244547, -76475, 132329, -46612, 42516, 116670, -62849, -26625, 81158, 166567, -209318, -105893, 477193, -179657, -276584, 126130, 24081, 118003, 143953, -112021, -157726, -274661, -191197, -22845, -114736, 23975, 12517, -92647]
10810B0000P0429c8356A59857b56830A49687a76281I5272a91052G0153B9735c05871
10798c47577Q0757F5074i1265A44741P4557a43512B20899I126P0206f0493l881
10787f4374A37512f371l07663J35873d5809G8159b49237A11717b5307j178j11001
10776a37486M0109j09947f3019k48444A52095d6009A37280f4475A18604e3458
10765A36302d5323B87283a13573C1100A2827a09076n5360C98035b437k41346f4072
10753a7604o5165A25605L7702a68137A31350a78500O4336j32315i1027d1168A25883
10741a98211j42892a09600G6580b07077C6090e8500C29853a10749E2049e5221
10730c265E2643b45427A58353F4657M3433g569l0328j16410F5026a06543M0657
$$ y = [20000, 90429, -38356, 159857, -256830, 149687, -176281, 95272, -191052, 70153, 29735, -305871, -347577, -266820, 65074, -91265, 144741, 219298, -143512, 220899, 9126, 79332, -60493, -64374, 137512, -6371, -314034, -178161, -45809, 78159, -249237, 111717, -25307, -26485, -137486, -97377, -207324, -63019, -311463, 152095, -46009, 137280, -64475, 118604, -53458, 136302, -45323, 287283, -113573, 31100, 12827, -109076, -164436, 398035, -2437, -243783, -64072, -17604, -82769, 125605, 163307, -168137, 131350, -178500, -114164, -246479, -91027, -41168, 125883, -198211, -341103, -109600, 76580, -207077, 36090, -58500, 329853, -110749, 52049, -55221, -3265, 52643, -245427, 158353, 64657, 108090, -7569, -37897, -154307, 65026, -106543, -65886]
10719f5886b3731k02421c6478j9008k22238F9659k8578J57719b82809H9627a16909
10707a80199g0479A11603J6891f2169a9960q9793I2623a50539H9577b38781B23857
10695a26876F964b98330H1113b53463d1296h640l84368g1722I5116e0712D3327
10683A05109E754M0034R0753a05095H3898k6273a566A1455J45625h5707G9472
10671A0156b7519E7603L2058N3924n7356b66778A98036c2755j01124L0660L9265
10660f3954K5623A91438i2193M0893k33556J26840d3065j5322b426j46497a3526
10648h1530j20967Q5640j9909J1309N4805B02317K80738e2920j50924c0602k36362
10637b66964J2243Q8393N8093k22954a3806l35835O1762B4420a62378p0358N2969
$$ y = [-65886, -23731, -226152, -36478, -55486, -277724, 69659, 41081, 198800, -282809, 89627, -116909, -180199, -70479, 111603, 128494, -62169, -19960, -109753, 92623, -150539, 89577, -238781, 223857, -126876, 6964, -298330, 81113, -253463, -41296, -8640, -393008, -71722, 95116, -50712, 43327, 105109, 5754, 45788, 136541, -105095, 83898, 57625, -1566, 11455, 157080, -85707, 79472, 10156, -27519, 57603, 89661, 143585, 86229, -266778, 198036, -32755, -133879, -103219, -63954, -38331, 191438, -92193, -51300, -284856, -158016, -43065, -58387, -2426, -148923, -13526, -81530, -202497, -116857, -136766, -125457, -70652, 202317, 483055, -52920, -203844, -30602, -266964, -254721, -166328, -108235, -331189, -13806, -349641, -287879, 24420, -162378, -232736, -179767]
10626a79767r7235J22271P6742A46616c7063j68192N3506C80189H9478A2033a92352
10614c38011a12074j46757E998J55522a537k35200p3568F6952B6597b7338B610
10602a31911M749j62962b8928l6915A22957a75197j17583C29725e4322B630e1890
10590A39881a8829l52514E4232M9400J0709a25099k12619J25249A56287a76381
10579b6012j41856r2514B82549b68174g560j25135G9849j5258j3328a97009A42376
10567d4310E2338R5190c59789g8526B15913a0738A37603a21597E7518J9490J51331
10556B28339a02967l84347B21823B4822O8344b02171C30138b30765A11991b00000
10545A2302K1295a23445a1170A16575O1025R9530i2588E8732a22216j17962K7669
$$ y = [-179767, -277002, -154731, -77989, 146616, -37063, -205255, -151749, 380189, 89478, 12033, -192352, -338011, -112074, -258831, 5998, 161520, -1537, -236737, -310305, 66952, 26597, -27338, 2610, -131911, -127162, -290124, -28928, -65843, 122957, -175197, -292780, 329725, -54322, 2630, -51890, 139881, -18829, -371343, 54232, 103632, 114341, -125099, -337718, -212469, 156287, -176381, -26012, -167868, -260382, 282549, -268174, -7560, -132695, 79849, 64591, 51263, -197009, 142376, -44310, 52338, 147528, -359789, -78526, 215913, -10738, 137603, -121597, 57518, 77008, 228339, -102967, -487314, 221823, 24822, 93166, -202171, 330138, -230765, 111991, -200000, 12302, 33597, -123445, -11170, 116575, 177600, 277130, -92588, 58732, -122216, -240178, -212509]
10534b12509O7890I4508d62168A55027a24773A06372o051a6395B5760L21672e5296
10522B11467a00809k09595A44076q697b13237J2877K9029C28726b4367E5640b37151
10510B15882e7058B32716f5761p8165C659R0215d46786B22839a01300A49361J63381
10499C12742b02681F7185O1628c31412B64679a43394H0109K56504a48986B90375
10488a7849G0785c8644A90323B9192K59091i6887K1618B17889L28294J8614B79155
10476D42384H3331J66871a6270p179A75054C7741b15181A4291O6920J0290b11815
10464a02002c6048r9900j8371L2657E7005j6886R3100L6528a45123I9178b124
10452A92959b6891A0131b18265j02779A28083Q2767N7368b530p0302C00032j35798
$$ y = [-212509, -144619, 94508, -462168, 155027, -124773, 106372, 100321, -16395, 25760, 347432, -55296, 211467, -100809, -310404, 144076, 135379, -213237, -200360, -171331, 328726, -24367, 55640, -237151, 215882, -57058, 232716, -65761, -143926, 3659, 93874, -446786, 222839, -101300, 149361, 312742, -202681, 67185, 128813, -331412, 264679, -143394, 80109, 336613, -148986, 290375, -17849, 70785, -38644, 190323, 29192, 288283, -96887, -75269, 217889, 546183, 564797, 279155, 442384, 83331, 250202, -16270, -23449, 175054, 37741, -215181, 14291, 81211, 91501, -211815, -102002, -36048, -135948, -154319, -121662, 57005, 40119, 133219, 169747, -145123, 99178, -2124, 192959, -26891, 10131, -218265, -321044, 128083, 210850, 268218, -2530, -72832, 300032, 164234]
10441A64234a52141J4044A44164a11516j0464p2440h221j64055e0573o8702E1493
10429b86864A41188O4911d0521C42310j00012D5368a83976J4056b0911p7261J6426
10418h1746l34205I8326a6947j32017q085F6756a82989H8013a43305I1859a36476
10406A61020E6104H208K04887b2756k41889A44130o3310a79829B1532c55478I1907
10394b39233B87627J76767c0381r4955A42308J0493a57287A11714R7625O8895
10384B78234K376A24169K89770h6981D94230B4177a00266E19863B59132p5245
10374A83887L92291B37925L03945j90426n0767A38720L57412A47404j405M50182
10364E96181k24680d3697C78987j19216d3134C18346a15196I8121J03377B8170
$$ y = [164234, -152141, -138097, 144164, -111516, -121980, -194420, -8221, -172276, -50573, -119275, 51493, -286864, 141188, 206099, -40521, 342310, 242298, 45368, -183976, -169920, -20911, -98172, -81746, -415951, 98326, -16947, -148964, -157049, 66756, -182989, 88013, -143305, 91859, -136476, 161020, 56104, 8208, 213095, -22756, -264645, 144130, 80820, -179829, 21532, -355478, 91907, -239233, 287627, 464394, -30381, -125336, 142308, 152801, -157287, 111714, 209339, 278234, 280610, 124169, 413939, -86981, 494230, 24177, -100266, 519863, 259132, 183887, 576178, 237925, 541870, 351444, 300677, 138720, 496132, 147404, 145999, 596181, 371501, -43697, 378987, 259771, -43134, 318346, -115196, 98121, 201498, 28170]
10353A38630K17231r304j24936J99789n921A90788a07440C26847l9077l6267K72638
10342E24141B05909M4349l3007A02501K5032J77483j9936F064M81175A8628M0775
10331E9403h2644F7564J309R1395h791A47179C4098K62581r0003J00008a28650
10319B92163J56616A24546K68953n7340A12477b1859I2931J5932J60609C8898
10308A51656b483B55209C2833J01157a32345c9966C03667I8059a37587N9591A05413
10296D4851a57282A04999C2723j5071c25637a22457A4185L27112E4717b71119
10285H6226a58490k07069I7453Q698b34731N8631A08082a99749A29084a16589
10274B69036b77682o8879P4926C7103J02802E0477J23928g9457a5500A2504h84
$$ y = [138630, 355861, 346557, 221621, 421410, 415489, 190788, -107440, 326847, 287770, 251503, 524141, 205909, 250258, 217251, 102501, 127533, 305016, 285080, 6064, 487239, 18628, 59403, -82644, 67564, 68873, 160268, -8791, 147179, 34098, 296679, 206676, 306684, -128650, 292163, 448779, 124546, 393499, 336159, 112477, -21859, 92931, 108863, 269472, 38898, 151656, -2483, 255209, 32833, 133990, -132345, -39966, 303667, 98059, -137587, -77996, 105413, 44851, -157282, 104999, 32723, 17652, -325637, -122457, 14185, 341297, 54717, -271119, 86226, -158490, -365559, 97453, 106151, -234731, -176100, 108082, -199749, 129084, -116589, 269036, -277682, -346561, -271635, 37103, 139905, 50477, 174405, -79457, -15500, 12504, -884]
10262c9729E8415b0560k0292A64918n3123K0057d32680A06814B6202j1785Q2434
10251I6851j8451a66064B27583p4705a80592A65994J401G322J60907D3664J89914
10240B33578b26642E0336b64910A56087K65313a11417A3743b48938J19775p3538
10230b02701d3462G4100b29204c2469A9118a62790P386N0123E8470L714B0279
10218a83589B26491H1738J27932a55665f8178l0664R335H1904a15608H3947K93986
10207C77933a82990l0442b1893l2257j46057c2635k16662A96721e660A21022k0882
10196A00140a47171A61501a06285o3445b0136k33724B6732a88279r7275a01484
10185e7980K4501A55184b47610H970L52658c31223g4976l32533a14631a6089j92381
$$ y = [-39729, 58415, -20560, -40852, 164918, 111795, 131852, -432680, 106814, 26202, 14417, 96851, 78400, -166064, 227583, 152878, -180592, 165994, 167395, 7322, 168229, 43664, 233578, -226642, 50336, -264910, 156087, 421400, -111417, 13743, -248938, -129163, -202701, -43462, 74100, -229204, -32469, 19118, -162790, -155404, -105281, 58470, 62184, 20279, -183589, 226491, 81738, 209670, -155665, -68178, -98842, -89507, 81904, -115608, 83947, 377933, -182990, -213432, -21893, -54150, -200207, -32635, -249297, 196721, -5660, 121022, 100140, -147171, 161501, -106285, -169730, -20136, -253860, 26732, -188279, -285554, -101484, -57980, -33479, 155184, -247610, 8970, 361628, -331223, -74976, -407509, -114631, -16089, -208470]
10174b08470q3685I789b79760h3792j88306A21082i8026a5025B59305G415J43194
10163A50609a8182j14595B9809b13327A52821c4710a2467C4168i3291e987A70388
10151a83752p7019h7194l7781l9519F6166d69999N7421a256m43106i0516A49343
10139A81544a18653B2932d1532J336B2674e1996B04413d30180D167L11564a09705
10127a75517B80308b7958j49967I4596a76632E0295J18091N4186c34703d0609
10116d1361k15574J17887a9870l6260A1824d5105B07J28600E6242h6502j51163
10105b37665f3534a1A51585b05573l8336A26984D2978M4290M3625b0127j23787
10094a43914A8749a28703k30392a06540k37310N6110L2801R3986g4380I4421a43586
$$ y = [-208470, -292155, 9789, -279760, -83792, -272098, 121082, -98026, -15025, 259305, 7415, 150609, -18182, -132777, 29809, -213327, 152821, -34710, -12467, 34168, -93291, -5987, 170388, -183752, -260771, -87194, -124975, -164494, 66166, -469999, -412578, -1256, -444362, -90516, 149343, 181544, -118653, 22932, -41532, -40196, 22674, -51996, 204413, -430180, 4167, 315731, -109705, -175517, 280308, -27958, -177925, 94596, -176632, 50295, 168386, 222572, -334703, -40609, -41361, -256935, -139048, -19870, -56130, 11824, -45105, 207, 128807, 56242, -86502, -237665, -63534, -11, 151585, -205573, -243909, 126984, 42978, 87268, 130893, -20127, -143914, 18749, -128703, -359095, -106540, -343850, -287740, -254939, -160953, -74380, 94421, -143586]
10082g6077j20162A31532h6456G7131c6833j42014N3941j79713b3811r5496A03790
10070a28966L9440L4030A25771g3710a1282c230q4265A81019A5032a72335m4584
10059b16919j45545e3276j12375m9469F1899h2854K7251A52521a23704j51433
10049b75137A82205b27965L0753f287I9077L51060G9571g0049A2566f6302A08272
10037b5578r7869D2260a01212B15278n7308a21450n3821a5807j54283C0844f9416
10025a49920H6048l7779b34757j69228J37200a03111A28359e9006j51825B4944
10014H3187C5410f6237G5186K85112E9830k6738a95638Q3957a0355A2522g3075
10002a47648r1325l6535J18901n527f6397m9043H3070e8311C9691L862a24571
$$ y = [-76077, -196239, 131532, -86456, 77131, -36833, -178847, -124906, -304619, -23811, -119307, 103790, -128966, -89526, -55496, 125771, -73710, -11282, -3230, -87495, 181019, 15032, -172335, -216919, -362464, -53276, -165651, -215120, 61899, -82854, -55603, 152521, -123704, -275137, 182205, -227965, -197212, -6287, 99077, 450137, 79571, -70049, 12566, -66302, 108272, -25578, -123447, 42260, -101212, 215278, 157970, -121450, -175271, -15807, -170090, 30844, -69416, -149920, 86048, 48269, -234757, -403985, -266785, -103111, 128359, -59006, -210831, 24944, 83187, 35410, -66237, 75186, 360298, 59830, 33092, -195638, -111681, -10355, 12522, -73075, -147648, -238973, -275508, -156607, -162134, -66397, -115440, 83070, -58311, 39691, 43553, -124571]
9990f9435n8001e0104F5979P8372b2060A79955B2499h2232a4541k00784k3899
9979b39224q8541h0812I6272b87723i732A35497F6331a03296L8459k3749o6191
9968a54777f9142j47881A78210A2641a5403j81872h8651o8627A156e946n5128
9957f1074j06239B0849a77082F0200a35950R744l56934a07525d2913e767E4486
9945c02347A41732a26377k2753b0836E468M0609J80142j10519D8948c09722e8176
9933B3784b11176a8201k04683r8512A6552a84562N9343d810l27963i7028A20046
9921i7553j97599K5709b6931j78837b8310n470A11442a19770d4246n7248o1977
9910a63471B52444b71583A66977c2572j21852O8406I87a21224n7478A69529o7589
$$ y = [-69435, -127436, -50104, 65979, 144351, -22060, 179955, 22499, -82232, -14541, -215325, -239224, -327765, -80812, 96272, -287723, -9732, 135497, 66331, -103296, -64837, -88586, -154777, -69142, -217023, 178210, 12641, -15403, -197275, -88651, -157278, 1156, -5946, -61074, -167313, 20849, -177082, 60200, -135950, -126206, -483140, -107525, -42913, -5767, 54486, -302347, 141732, -126377, -149130, -20836, 5468, 46077, 226219, 115700, 48948, -309722, -58176, 23784, -211176, -18201, -222884, -321396, 16552, -184562, -125219, -4810, -332773, -97028, 120046, -97553, -295152, -269443, -26931, -205768, -28310, -33780, 111442, -119770, -44246, -101494, -163471, 252444, -271583, 166977, -32572, -154424, -86018, 987, -121224, -178702, 169529, 101940]
9899A01940c3258J1690j13209A5134O4951a28647C6024Q7691N0411J70696a584
9887a80519k83417g5573J1698j6928A33233Q07L8551o5616c4384A55851b69848
9875G0887a42825q3599L8444B03445A0211h9929A01280M5251h3083r7968l0121
9864b11172A96812g5091K1624j9040j45898N903M6996o4083k2886k7933F4499
9852c61284A57593i6947A29904c5469j99881m5782J09353r8292F811b8995B76683
9840a8310j20746b7146m1209A05259b54057j88655b16528I0958c1326E9571b12445
9828D4106d87356h3419p7855I8191b5557A12178a46124j44867D9729b04349a00731
9816a03436J3423A8980a52457D3439a17682D2681b32905c7810B08556F7730M2037
$$ y = [101940, -33258, -21568, -134777, 15134, 80085, -128647, 36024, 123715, 174126, 344822, -1584, -180519, -463936, -75573, -63875, -80803, 133233, 134040, 172591, 106975, -34384, 155851, -269848, 70887, -142825, -226424, -187980, 203445, 10211, -89929, 101280, 146531, -83083, -181051, -211172, 196812, -75091, -53467, -72507, -218405, -212502, -165506, -229589, -252475, -280408, 64499, -361284, 157593, -96947, 129904, -35469, -235350, -281132, -171779, -270071, 6811, -28995, 276683, -18310, -139056, -27146, -68355, 105259, -254057, -442712, -216528, 90958, -31326, 59571, -212445, 44106, -487356, -83419, -161274, 98191, -25557, 112178, -146124, -290991, 49729, -204349, -100731, -103436, -90013, 18980, -152457, 43439, -117682, 42681, -232905, -37810, 208556, 67730, 109767]
9805A09767a06077j7467L4055p5452d2395A02707a25147N5245r3821a2034F2918
9793a24250C389R1302l8790a36627A51468a79348O9834A06669M814a27062j65790
9782b92852L9405A13484b83307J07762A21403m3884L2728e164k72170a9820k01729
9771b21549f5361A43951n2845N8508h2106D824e3211A21610H119L04266g8894
9759B2556h1805j77229i7411L6421C5962J67389c65779a27498B9950R788b04305
9747b89972A16094f1582k05216A38659b84891J1403Q1060a8304j0997B62077e1881
9735B6N0850b27570i8622h503n8082j76636d8737A27292D5318b91329O3606N9376
9723a68347l6675j54929B0231b82364a30869j26389h9197k54028i2538b0697j60492
$$ y = [109767, -106077, -123544, -89489, -164941, -42395, 102707, -125147, -69902, -163723, -12034, 62918, -124250, 3389, 94691, 55901, -136627, 151468, -179348, -109514, 106669, 111483, -127062, -292852, -253447, 113484, -283307, -175545, 121403, 77519, 110247, -5164, -277334, -19820, -221549, -65361, 143951, 91106, 149614, -82106, 4824, -53211, 121610, 8119, 312385, -78894, 22556, -81805, -259034, -97411, -60990, 35962, 203351, -365779, -127498, 29950, 39738, -204305, -289972, 116094, -61582, -266798, 138659, -284891, -273488, -192428, -18304, -29301, 262077, -51881, 26, 50876, -227570, -98622, -8503, -66585, -243221, -48737, 127292, 45318, -291329, -227723, -168347, -205022, -359951, 20231, -282364, -130869, -257258, -89197, -343225, -92538, -20697, -181189]
9712a81189p9542f3567r76J849o3612a0110A63878a46413k3013B2318g114r4507
9700a01621E1862a16025c8107B57747a13968B42310g8187r757D7997R6419f6911
9688a71744A92143m8335a45069M4907k27662g7641D3412a51846B23635i9952A73378
9676i3089c7806A80228a25570B6659a21777j08802b5471B31756c22338K7423B36451
9664I4050g478B39870a59259O2039H8871a54800A78024c48521a45196C7071g4929
9652b22974l4685j28448A93556o3782f4275J7190j30188A41515i9328B88204b23998
9640a57166a4402j32415m5558k4597r841N0329A78016B8223g1090H541J69291
9629A77832C7496b39842e6771j56760e1974l23530g0076j84583A59728p4120a30806
$$ y = [-181189, -260731, -63567, -64543, -62694, -126306, -10110, 163878, -146413, -169426, 22318, -7114, -101621, 51862, -116025, -38107, 257747, -113968, 242310, -78187, -87944, 47997, 144416, -66911, -171744, 192143, 143808, -145069, -100162, -327824, -77641, 43412, -151846, 223635, -99952, 173378, -93089, -37806, 180228, -125570, 26659, -121777, -230579, -25471, 231756, -322338, -294915, 236451, 94050, -7478, 239870, -159259, -97220, 88871, -154800, 178024, -348521, -145196, 37071, -74929, -222974, -257659, -386107, 193556, 129774, -64275, -47085, -177273, 141515, -99328, 288204, -223998, -157166, -14402, -146817, -192375, -216972, -226813, -176484, 178016, 28223, -71090, 8541, 177832, 37496, -239842, -56771, -213531, -51974, -375504, -70076, -254659, 159728, 85608, -130806]
9617g819j61747r4779A68808a50628E699L07217b71707f7188A08009b65717f2132
9605a24018L5969B32405e4334A83757a50134k9075H6298b6792j78930f0657C7351
9593A67819d0526k86685I3640c20780a51363f3692A50117c04111D1612P6258a55342
9581d9767I9977K5408a3652l3923A81284d7784j7904C12050A302c18214J46315
9570a71899j63063h110k95652n3249A13569n1735a23057E0979e9997A46576f1660
9558F6069a07771D467J00928d9412j28926o2971E3073a36416m2056J2779e1793
9546A5275c33849A36572b03428D8719b86751D3494a58076A5385a09211n0853m1960
9535b02024N313B1562J65684c4039j12297B14246A9931J39360f9763j39733j46901
$$ y = [-7819, -169566, -264345, 168808, -150628, 5699, 312916, -271707, -67188, 108009, -265717, -62132, -124018, -88049, 232405, -54334, 183757, -150134, -179209, 86298, -26792, -205722, -60657, 37351, 167819, -40526, -327211, 93640, -320780, -151363, -63692, 150117, -304111, 41612, 117870, -155342, -49767, 99977, 125385, -13652, -47575, 181284, -47784, -65688, 312050, 1302, -318214, -171899, -334962, -8110, -303762, -357011, 113569, 61834, -123057, 50979, -59997, 146576, -61660, 66069, -107771, 4467, 105395, -49412, -178338, -241309, 53073, -136416, -178472, -165693, -51793, 15275, -333849, 136572, -203428, 48719, -286751, 43494, -158076, 15385, -109211, -160064, -202024, -196711, 21562, 187246, -34039, -146336, 214246, 19931, 159291, -69763, -209496, -356397]
9524c56397A4670b19164B96850j07705b60657M0026A1108d7447I433M7734e2214
9512b28587P5005f1699D56668b11679i5330j3925k5968D5250c54321A83993a44671
9500G4195h5065a6521k39425N3598q9209C791h5729k21659K3732r648M1280G2037
9487b21233O6280j2600L1004a0751E9133Q4717a6741k56430B1265i6873p1860
9476a68733d315B01434F5105B6863c49800E4393a95690B42266d21703h8499K7080
9465f1419E4837L4665f4573B48404A3947a43188A22799J77907a30556k21144J47250
9454b04450C1317A5011l929c21718A36649d9800J1463G3108e23198A54432a66710
9442F5951J0778l7300h4108I3971g5777B47687a60590c3829k82347H4857b80773
$$ y = [-356397, 14670, -219164, 296850, 189145, -260657, -220631, 11108, -47447, 9433, 57167, -52214, -228587, -153582, -61699, 456668, -211679, -95330, -109255, -135223, 45250, -354321, 183993, -144671, 74195, -85065, -16521, -255946, -202348, -291557, 3791, -85729, -307388, -283656, -293304, -252024, 72037, -221233, -154953, -167553, -136549, -10751, 59133, 143850, -16741, -273171, 21265, -96873, -168733, -4315, 201434, 65105, 26863, -349800, 54393, -195690, 242266, -421703, -88499, -61419, 54837, 89502, -64573, 248404, 13947, -143188, 122799, 300706, -130556, -351700, -204450, 31317, 15011, 11082, -321718, 136649, -49800, -38337, 73108, -523198, 154432, -166710, 65951, 76729, 39429, -84108, 93971, -75777, 247687, -160590, -33829, -316176, 84857, -280773]
9430d9922B26048h0096j9039K509j75264a06814F0949L35969b43381C1213J42988
9419A74201b29952A17281J5198a12292B1303k385a05891C04754a32702J4610G6792
9407A94601O335E2698a49940e9590p1609A33008i0196r6407f2720j13697K0729
9396a55688A6451e376A07803J34347A09898N5020l4688a17062q4420d2808F096
9384E1972O7776b49750A34984b37219a10243q7810i2406A76758b57731A77939
9373a41008f5825j27007g1437j24287b5577r3499A56148r736L674O1551E0187
9361c58073J31884A30199c784B44540j18093b1462c345j99364i5069J1129m8348
9350a32288q8753A12494a21707M2247A43569D5825a13611M6885p3278j12781i2202
$$ y = [-49922, 226048, -80096, -99135, -96626, -271890, -106814, 60949, 396918, -243381, 31213, 174201, -229952, 117281, 132479, -112292, 21303, 18918, -105891, 304754, -132702, -118092, 76792, 194601, 200936, 52698, -149940, -59590, -131199, 133008, -90196, -186603, -62720, -176417, -155688, 16451, -5376, 107803, 242150, 109898, 164918, 130230, -117062, -201482, -42808, 6096, 51972, 119748, -249750, 134984, -237219, -110243, -198053, -92406, 176758, -257731, 177939, -141008, -65825, -192832, -71437, -195724, -25577, -119076, 156148, 146412, 150086, 211637, 50187, -358073, -226189, 130199, -3784, 244540, 126447, -21462, -3345, -202709, -95069, -83940, -132288, -221041, 112494, -121707, -79460, 143569, 45825, -113611, -66726, -140004, -252785, -92202]
9338I7412p179c43087a6501I1199b7800A76521o5297h1289H1482a46767J7898
9327a28869d1572B13105F2561L508c43441d6359j16166A58203J6830e135j07935
9316a13070G9517a29430A08988d0185D2168i4511j13151C1637b5080A85036c4743
9304c2013k606j86601Q1415j18659D7158b21977n9239A27643J5006a29586j78915
9293c08501B2273f4179A72475b46493P3452H7291F874K0755a49232j69216F9919
9281b39135e4505F3694d96913a17185J5005o8363g2428n7467k15032A24371a29526
9269a62577E1850k1947K1322i0134q872E0399d2252A4511b30135h9369B69516
9257E085a23260m0440d8164j3192A14304c68887J23399k77846f6714j67339O7491
$$ y = [97412, 90233, -343087, -16501, 91199, -27800, 176521, 111224, -81289, 81482, -146767, -128869, -41572, 213105, 62561, 66069, -343441, -46359, -162525, 158203, 175033, -5135, -113070, 79517, -129430, 108988, -40185, 42168, -94511, -207662, 31637, -25080, 185036, -34743, -32013, -34619, -221220, -139805, -258464, 47158, -221977, -281216, 127643, 142649, -129586, -308501, 22273, -64179, 172475, -246493, -173041, 87291, 6874, 27629, -149232, -318448, 69919, -239135, -54505, 63694, -496913, -117185, -102180, -170543, -72428, -129895, -344927, 124371, -129526, -162577, 51850, 29903, 51225, -90134, -99006, 50399, -42252, 14511, -230135, -89369, 269516, 5085, -123260, -163700, -48164, -61356, 114304, -368887, -245488, -523334, -66714, -234053, -166562]
9246a66562b3001A30708b2953k24999G9563b73026O9759B94913b64961l0860L8735
9235b57086j36602O9316c4872i846C1499a47454C536c4408r7417r988l6461D5922
9222a61813c1339G4293a28341G6202a57975j91763J30953e7708r406I0694a28958
9210B97671d0711j12167G2707a22114l5026j89453N2514E943a98925A0746b2015
9198A70451a12029b3434Q910j71688o9763O1491P8615Q918M1594E3314J11852
9187A65166M84C7611b0759j03558k90860a72158K896d8953j04071A5478h2517
9175G8034a41818E5767a09558A25238l4398a19767k26898A11857a48404N4599
9165i3805m1145J3587a7422l15670C2499g4301k9756H37a17495B4102a9268B9129
$$ y = [-166562, -23001, 130708, -22953, -247952, 79563, -273026, -203267, 294913, -264961, -295821, -257086, -393688, -324372, -34872, -9846, 31499, -147454, 3536, -34408, -131825, -141813, -178274, 45922, -161813, -31339, 74293, -128341, 76202, -157975, -349738, -218785, -57708, -67114, 90694, -128958, 297671, -40711, -152878, 72707, -122114, -157140, -346593, -294079, 5943, -198925, 10746, -22015, 170451, -112029, -23434, -14524, -186212, -255975, -194484, -115869, -106951, -65357, 53314, 165166, 165650, 37611, -20759, -124317, -415177, -172158, -169262, -48953, -153024, 15478, -82517, 78034, -141818, 55767, -109558, 125238, 90840, -119767, -346665, 111857, -148404, -93805, -134950, -121363, -17422, -333092, 32499, -74301, -104057, 837, -117495, 24102, -19268, 29129]
9152c42293a57878D97772b14739a5692k48366Q8364E2710c20860H6873R6578f5867
9140B86853q3793A9982a44348l6097A81327D8265g6539r6681A02072b0348q5964
9129a06312M0542k97599e8025j04285a4317A93453F8757J39861b99859i1364j14182
9118b05546J5905p2082Q2810c046C180P3439d1661m4124F2613i3268A77529b8396
9105B77532B2183O7860P0397k2544R2952b1046m7833j51043A95134i3416L8756
9094e4660a0382n6686C9282b02158a00534l0019r6706J9839E9421a54578B99242
9082F3187d61629i7223A52034C7967a23957c8610j31737L9904B23645b44425l06346
9071e50771g8496G8658b31453J07414A24877a7014A86277I0101L5789a53590B35620
$$ y = [-342293, -157878, 497772, -214739, -15692, -264058, -175694, 52710, -320860, 86873, 183451, -65867, 286853, 203060, 19982, -144348, -180445, 181327, 48265, -76539, -173220, 102072, -20348, -106312, -65770, -363369, -58025, -162310, -14317, 193453, 68757, 208618, -299859, -91364, -205546, -189641, -261723, -178913, -3046, 3180, 76619, -41661, -85785, 62613, -93268, 177529, -28396, 277532, 22183, 90043, 160440, 137896, 230848, -21046, -68879, -219922, 195134, -93416, -54660, -10382, -67068, 39282, -202158, -100534, -130553, -227259, -207420, 59421, -154578, 299242, 63187, -461629, -97223, 152034, 37967, -123957, -38610, -170347, -130443, 223645, -244425, -550771, -78496, 78658, -231453, -124039, 124877, -17014, 186277, 90101, 125890, -153590, 235620]
9059C2651a09451l7885A80133C953b71132P0377j62501a44509C39361e8167j72966
9048b31133o7327A56245h8461B6058b57008j0569D0886h9729m0934I818a75525
9036a59933F2685P6279i5331C10672d44136d8024J9125j7015j8633J8767A52753
9024a85397m2384I2839J7534B2592N0543h3613j07944j8736i7318A42557a68430
9012a37836m5915m4342C0731K27141b94683h3366C3458Q9663j1398b74195A7084
9000c0591B62686k0533r4858a57404j38655a15525C9213B744P9955a06730j05759
8989b12489M6770A41956a47578e1907B4661f2641p6848B00389b50278B19472M6770
8978B66242b21450O2864B4891b28545B89765B0670a82986B68804j04476P8618
$$ y = [32651, -109451, -147336, 180133, 3953, -271132, -200755, -363256, -144509, 339361, -58167, -231133, -298460, 156245, -88461, 26058, -257008, -267577, 40886, -89729, -130663, 9818, -175525, -159933, 62685, 138964, -95331, 310672, -444136, -48024, -28899, -45914, -64547, -45780, 152753, -185397, -227781, 92839, 110373, 22592, 73135, -83613, -191557, -210293, -97318, 142557, -168430, -137836, -183751, -228093, 30731, 257872, -294683, -83366, 33458, 123121, 111723, -274195, 17084, -30591, 262686, 242153, 147295, -157404, -296059, -115525, 39213, 2744, 82699, -106730, -212489, -165719, 141956, -147578, -51907, 24661, -62641, -139489, 200389, -250278, 219472, 266242, -221450, -158586, 24891, -228545, 289765, 20670, -182986, 268804, 164328, 242946]
8968B42946J611C3572b48560N9392n7318h2135m2197k7429K1545j32746f6309
8956A73209b6166E9446a28758f0123A36412E6670a10508A05405a11273A73740
8945d04952J18042C0423b21866c363j14173e2485A22250d4642q0600A27279d7910
8933C8600b58963A6383b11829O9821L6099j71588H3521K8988a27822b5267l538
8922b8805j5850D36864a14204M3649A00236K22606A24757b5856n12G015b9857
8910c13004q0227e4072c869A4109b53012R7313A18998b7624l7456j71605C9247
8898G6547l6187J08141i0051C7514j150O3742b44783l02611C15883i4837r8825
8887a93662D7014J36342b7731j64154e6450k90032c0078D6621A7815L9863M9772
$$ y = [242946, 244557, 33572, -248560, -189168, -246486, -82135, -124332, -151761, -130216, -262962, -66309, 173209, -26166, 59446, -128758, -60123, 136412, 56670, -110508, 105405, -111273, 173740, -404952, -286910, 30423, -221866, -3363, -117536, -52485, 122250, -44642, -125242, 127279, -47910, 38600, -258963, 16383, -211829, -142008, -105909, -277497, 83521, 112509, -127822, -25267, -28805, -44655, 436864, -114204, -70555, 100236, 322842, 124757, -25856, -26368, 7015, -29857, -313004, -393231, -54072, -3869, 14109, -253012, -155699, 118998, -27624, -65080, -236685, 39247, 76547, 40360, 148501, -90051, 37514, 36364, 100106, -244783, -547394, 315883, -94837, -193662, 47014, 183356, -27731, -191885, -56450, -346482, -30078, 46621, 17815, 57678, 107450]
8876A07450l851L2394d8304k839j23564b1069k00507d582k8082A51023g384G7879
8863G1094J1300J7977b04858O2530A5182J56508a56180c6617B82642C5964h3199
8851b14963c4724p9685M3591r8331l2777A97732c18984J33976a9213l31411n3781
8840d04405A81121K1227B912J1539e2827m8574A80659a12904D1468j706a53117
$$ y = [107450, 103599, 135993, -48304, -51143, -174707, -21069, -221576, -4582, -32664, 151023, -7384, 77879, 71094, 82394, 100371, -204858, -142328, 15182, 171690, -156180, -36617, 282642, 35964, -83199, -214963, -34724, -114409, -70818, -169149, -201926, 197732, -318984, -185008, -19213, -350624, -404405, 181121, 202348, 2912, 14451, -52827, -101401, 180659, -112904, 41468, 39762, -153117]
$$ [...]
##END NTUPLES=NMR SPECTRUM
##END=
