##TITLE=AC1738_SEN00011_9276187_vwu7jyrfVx
##JCAMPDX= 6.0         $$ Bruker NMR JCAMP-DX V2.0
##DATA TYPE= NMR SPECTRUM
##DATA CLASS= NTUPLES
##ORIGIN= BRUKER
##OWNER= Administrator
$$ 1.72 TOPSPIN		Version 2.1
$$ 2015-08-07 23:04:34.328 -0700  Administrator@X
$$ Compression mode = diff/dup
##.OBSERVE FREQUENCY= 400.02188249412
##.OBSERVE NUCLEUS= ^1H
##.ACQUISITION MODE= SIMULTANEOUS (DQD)
##.ACQUISITION SCHEME= undefined
##.AVERAGES= 64
##.DIGITISER RES= 22
##SPECTROMETER/DATA SYSTEM= spect
##.PULSE SEQUENCE= noesygpps1d.comp
##.SOLVENT NAME= COFFEE_meoh
##.SHIFT REFERENCE= INTERNAL, COFFEE_meoh, 1, 14.96101
##AUDIT TRAIL= $$ (NUMBER, WHEN, WHO, WHERE, PROCESS, VERSION, WHAT)
$$ ##TITLE= Audit trail, TOPSPIN		Version 2.1
$$ ##JCAMPDX= 5.01
$$ ##ORIGIN= Bruker BioSpin GmbH
$$ ##OWNER= Administrator
$$ $$ E:\/data/COFFEE/nmr/AC1738_SEN00011_9276187_vwu7jyrfVx/42/pdata/1/auditp.txt
$$ ##AUDIT TRAIL=  $$ (NUMBER, WHEN, WHO, WHERE, PROCESS, VERSION, WHAT)
(   1,<2015-08-07 23:04:28.656 -0700>,<Administrator>,<X>,<go>,<TOPSPIN 2.1>,
      <created by zg
	started at 2015-08-07 22:52:59.203 -0700,
	POWCHK enabled, PULCHK disabled,
       configuration hash MD5:
       21 0F 79 D6 B3 7B B4 F6 88 20 88 DB 03 48 BD 9F
       data hash MD5: 64K
       DF 39 AA 89 BC 59 17 C6 02 C6 1F B2 77 8E 6D 3C>)
(   2,<2015-08-07 23:04:32.203 -0700>,<Administrator>,<X>,<proc1d>,<TOPSPIN 2.1>,
      <Start of raw data processing
       efp LB = 0.3 FT_mod = 6 PKNL = 1 PHC0 = 0 PHC1 = 0 SI = 128K 
       data hash MD5: 128K
       BE C9 43 1A 24 EF 11 7D 99 0E 68 F3 5C 38 EB B8>)
(   3,<2015-08-07 23:04:33.109 -0700>,<Administrator>,<X>,<proc1d>,<TOPSPIN 2.1>,
      <pk PHC0 = -86.10535 PHC1 = 0 
       data hash MD5: 128K
       28 5E 3F 5B 01 AF 20 9E 06 91 F3 76 83 03 E1 EC>)
(   4,<2015-08-07 23:04:33.500 -0700>,<Administrator>,<X>,<proc1d>,<TOPSPIN 2.1>,
      <abs ABSG = 1 
       data hash MD5: 128K
       A8 EE C6 15 DE 4F 7F 43 8D 47 E4 C8 E1 E4 54 36>)
(   5,<2015-08-07 23:04:33.594 -0700>,<Administrator>,<X>,<proc1d>,<TOPSPIN 2.1>,
      <abs ABSG = 2 
       data hash MD5: 128K
       EF FB 5A 9F B7 5F 03 59 8D C7 FA 01 C3 65 BF 0C>)
(   6,<2015-08-07 23:04:33.672 -0700>,<Administrator>,<X>,<proc1d>,<TOPSPIN 2.1>,
      <abs ABSG = 3 
       data hash MD5: 128K
       EE 31 BE 3E BE 05 4C 78 AC F6 3E CA 5F 01 AD 06>)
(   7,<2015-08-07 23:04:33.766 -0700>,<Administrator>,<X>,<proc1d>,<TOPSPIN 2.1>,
      <abs ABSG = 4 
       data hash MD5: 128K
       24 3F AD 8D C8 B2 05 FB 85 27 60 AE AF 45 D1 E2>)
(   8,<2015-08-07 23:04:33.891 -0700>,<Administrator>,<X>,<proc1d>,<TOPSPIN 2.1>,
      <abs ABSG = 5 
       data hash MD5: 128K
       20 97 2A 86 22 02 7E 52 23 06 F7 4C D7 F2 0D E5>)
$$ ##END=
$$ 
$$ $$ hash MD5
$$ $$ BE F4 C7 42 40 E0 F5 EB A7 DF 3A 40 2A D3 48 8C
##$RELAX= 
##$RELAX= 
##$RELAX= 
##$RELAX= 
##$RELAX= 
##$RELAX= 
##$RELAX= 
##$RELAX= 
$$ Bruker specific parameters
$$ --------------------------
##$DU= <E:\>
##$EXPNO= 42
$$ [...]
##$TP07= 0
##$TPNAME0= <>
##$TPNAME1= <>
##$TPNAME2= <>
##$TPNAME3= <>
##$TPNAME4= <>
##$TPNAME5= <>
##$TPNAME6= <>
##$TPNAME7= <>
##$TPOAL= (0..7)
0.5 0.5 0.5 0.5 0.5 0.5 0.5 0.5
##$TPOFFS= (0..7)
0 0 0 0 0 0 0 0
##$TUNHIN= 0
##$TUNHOUT= 0
##$TUNXOUT= 0
##$USERA1= <user>
##$USERA2= <user>
##$USERA3= <user>
##$USERA4= <user>
##$USERA5= <user>
##$V9= 5
##$VALIST= <valist>
##$VCLIST= <CCCCCCCCCCCCCCC>
##$VD= 0
##$VDLIST= <DDDDDDDDDDDDDDD>
##$VPLIST= <PPPPPPPPPPPPPPP>
##$VTLIST= <TTTTTTTTTTTTTTT>
##$WBST= 2048
##$WBSW= 25
##$XGAIN= (0..3)
0 0 0 0
##$XL= 0
##$YL= 0
##$YMAX_a= 6990909
##$YMIN_a= -12875535
##$ZGOPTNS= <>
##$ZL1= 120
##$ZL2= 120
##$ZL3= 120
##$ZL4= 120
##$ABSF1= 14.96101
##$ABSF2= -5.597172
##$ABSG= 5
##$ABSL= 3
##$ALPHA= 0
##$AQORDER= 0
##$ASSFAC= 0
##$ASSFACI= 0
##$ASSFACX= 0
##$ASSWID= 0
##$AUNMP= <proc_prof1d_extract.lims>
##$AXLEFT= 0
##$AXNAME= <>
##$AXNUC= <1H>
##$AXRIGHT= 0
##$AXTYPE= 0
##$AXUNIT= <>
##$AZFE= 0.1
##$AZFW= 0.1
##$BCFW= 0
##$BC_mod= 0
##$BYTORDP= 0
##$COROFFS= 0
##$CY= 15
##$DATMOD= 1
##$DC= 0
##$DFILT= <>
##$DTYPP= 0
##$F1P= 0
##$F2P= 0
##$FCOR= 0.5
##$FTSIZE= 131072
##$FT_mod= 6
##$GAMMA= 0
##$GB= 0
##$INTBC= 1
##$INTSCL= 1
##$ISEN= 128
##$LB= 0.3
##$LEV0= 0
##$LPBIN= 0
##$MAXI= 10000
##$MC2= 0
##$MEAN= 0
##$ME_mod= 0
##$MI= 0
##$NCOEF= 0
##$NC_proc= -2
##$NLEV= 6
##$NOISF1= 0
##$NOISF2= 0
##$NSP= 0
##$NTH_PI= 0
##$NZP= 0
##$OFFSET= 14.96101
##$PC= 1
##$PHC0= -86.10535
##$PHC1= 0
##$PH_mod= 1
##$PKNL= yes
##$PPARMOD= 0
##$PPDIAG= 0
##$PPIPTYP= 0
##$PPMPNUM= 2147483647
##$PPRESOL= 1
##$PSCAL= 4
##$PSIGN= 0
##$PYNMP= <proc.py>
##$REVERSE= no
##$SF= 400.020009632813
##$SI= 131072
##$SIGF1= 0
##$SIGF2= 0
##$SINO= 400
##$SIOLD= 131072
##$SPECTYP= <>
##$SREGLST= <1H.CDCl3>
##$SSB= 0
##$STSI= 131072
##$STSR= 0
##$SW_p= 8223.68421052631
##$SYMM= 0
##$S_DEV= 0
##$TDeff= 65536
##$TDoff= 0
##$TI= <>
##$TILT= no
##$TM1= 0
##$TM2= 0
##$TOPLEV= 0
##$USERP1= <user>
##$USERP2= <user>
##$USERP3= <user>
##$USERP4= <user>
##$USERP5= <user>
##$WDW= 1
##$XDIM= 131072
##$YMAX_p= 427673425
##$YMIN_p= -11652
##$CURPLOT= <Network HP LaserJet P1505>
##$CURPRIN= <$Network HP LaserJet P1505>
##$DFORMAT= <normdp>
##$LAYOUT= <+/1D_H.xwp>
##$LFORMAT= <normlp>
##$PFORMAT= <normpl>
##$SURQMSG= 1
$$ End of Bruker specific parameters
$$ ---------------------------------
##NTUPLES= NMR SPECTRUM
##VAR_NAME=  FREQUENCY,     SPECTRUM/REAL,   SPECTRUM/IMAG
##SYMBOL=    X,             R,               I
##VAR_TYPE=  INDEPENDENT,   DEPENDENT,       DEPENDENT
##VAR_FORM=  AFFN,          ASDF,            ASDF
##VAR_DIM=   131072,        131072,          131072
##UNITS=     HZ,            ARBITRARY UNITS, ARBITRARY UNITS
##FACTOR=    0.0627417313425164, 1,          1
##FIRST=     8223.62146879497, -1840,        -58592
##LAST=      0,             89,              -60011
##MIN=       0,             -11652,          0
##MAX=       8223.62146879497, 427673425,    0
$$ Real data points
##PAGE= N=1
##DATA TABLE= (X++(R..R)), XYDATA
$$ [...]
63907A727807j47565j28909j12618r7615q3387p0927o1193n3635m7046m1070l6015
$$ 1727807 1580242 1451333 1338715 1241100 1157713 1086786 1025593 971958 924912 883842 847827
63896H47827l1855k8284k5325k3088k1308j9715j8520j7942j7558j6704j5187
$$ 847827 815972 787688 762363 739275 717967 698252 679732 661790 644232 627528 612341
63885F12341j3176j0828q495o803n932n207l925k179l74J626M165O993R491J1541
$$ 612341 599165 588337 579842 573039 567107 561900 557975 555796 555422 557048 561213 568206 577697 589238
63871E89238J3578J5855J8169K0184K1647K2477K2923K3443K4154K4603K4372
$$ 589238 602816 618671 636840 657024 678671 701148 724071 747514 771668 796271 820643
63860H20643K3571K2450K0903J8700J5878J2597Q953N200J714j509m891q503j1844
$$ 820643 844214 866664 887567 906267 922145 934742 943695 948895 950609 949100 944209 935706 923862
63847I23862j4703j7632k0982k4132k6278k7472k8240k8652k8547k8282k8402
$$ 923862 909159 891527 870545 846413 820135 792663 764423 735771 707224 678942 650540
63836F50540k8715k8456k7329k5747k4137k2550k1003j9631j8451j7258j5798
$$ 650540 621825 593369 566040 540293 516156 493606 472603 452972 434521 417263 401465
63825D01465j3946j1822r929q820q439q103p409o682o281n965n401m778m347l829
$$ 401465 387519 375697 365768 356948 348509 340406 332997 326315 320034 314069 308668 303890 299543 295714
63811B95714k913j965j585j715j868j961k273k716k878k693k508k511k603k761
$$ 295714 292801 290836 289251 287536 285668 283707 281434 278718 275840 273147 270639 268128 265525 262764
63797B62764k988l021k591j985j790k054k178j785j264j275j948k762l043k571
$$ 262764 259776 256755 254164 252179 250389 248335 246157 244372 243108 241833 239885 237123 234080 231509
63783B31509j751j166r44o90j34M94Q37Q64P60O04M28L22L57N70J046J656J779
$$ 231509 229758 228592 227648 226958 226824 227318 228155 229019 229779 230383 230811 231133 231490 232060 233106 234762 236541
63766B36541Q70n76j337r94m21m10o37n59n06j028j750j855j326p65k69N47J534
$$ 236541 237411 236835 235498 234504 234083 233673 233036 232477 231971 230943 229193 227338 226012 225247 224978 225525 227059
63749B27059J949J549R49P53R27J219J591K054K563L146L750L937L246J945R93
$$ 227059 229008 230557 231506 232259 233186 234405 235996 238050 240613 243759 247509 251446 254692 256637 257630
63734B57630J017J664K149K127J872J860K308L110M051N056O109O947P126O541
$$ 257630 258647 260311 262460 264587 266459 268319 270627 273737 277788 282844 288953 295900 303026 309567
63720C09567N659N031M759M517L941K865J395p9j259k291l422m304m245l318k514
$$ 309567 315226 320257 325016 329533 333474 336339 337734 337655 336396 334105 330683 326379 322134 318816 316302
63705C16302k458k599k191j414r05o90l57J19M99R57J883L095L908L984L580L034
$$ 316302 313844 311245 309054 307640 306735 306045 305688 305807 306306 307263 309146 312241 316149 320133 323713 326747
63689C26747K469J960J519R71K43l75n99o11p43r16q53o58o40o82l70L35R98J347
$$ 326747 329216 331176 332695 333666 333909 333534 332935 332324 331581 330665 329812 329154 328514 327832 327462 327797 328795 330142
63671C30142J553J847K237K659L087L440L549L275K563J501L16q50k195l890n504
$$ 330142 331695 333542 335779 338438 341525 344965 348514 351789 354352 355853 356169 355319 353124 349234 343730
63656C43730o237n845m885l945l210k911l413m454m993m312k773j142J91R62R29
$$ 343730 337493 331648 326763 322818 319608 316697 313284 308830 303837 299525 296752 295610 295801 296763 297692
63641B97692N17P53J843K692K591K456L308M450M489L594L233L943M854N374N952
$$ 297692 298209 298962 300805 303497 306088 308544 311852 316302 320791 324385 327618 331561 336415 341789 347741
63626C47741O951P961Q621R192R971J0860J1797J2957J4333J5651J6818J7972
$$ 347741 354692 362653 371274 380466 390437 401297 413094 426051 440384 456035 472853 490825
63614D90825J9133K0355K2045K4459K7030K8849K9672K9717K8725K6072K1688
$$ 490825 509958 530313 552358 576817 603847 632696 662368 692085 720810 746882 768570
63603G68570J6067R546K516l782p827r366r499r104q131o586n290n112o240q408
$$ 768570 784637 794183 796699 792917 785090 775724 766225 757121 748990 742404 737114 732002 725762 717354
63589G17354j1280j4293j6821j8638j9812k0148j9357j7757j6003j4214j2127
$$ 717354 706074 691781 674960 656322 636510 616362 597005 579248 563245 549031 536904
63578E36904j0017q505p411n886l747j676L2J833L785N231N999O725P547P642
$$ 536904 526887 518382 510971 505085 501338 499662 499694 501527 505312 510543 516542 523267 530814 538456
63564E38456O715N804N809O217O295O575Q001J0279J2177J3180J3898J5156J7498
$$ 538456 545171 550975 556784 563001 569296 575871 583872 594151 606328 619508 633406 648562 666060
63551F66060K1253K6225L1406L5785L9083M0929L9680L3349K2119R102j939r260
$$ 666060 687313 713538 744944 780729 819812 860741 900421 933770 955889 964991 963052 953792
63539I53792j3424j5570j6062j4726j1816q326n344l391k522k859m726q239j3038
$$ 953792 940368 924798 908736 894010 882194 873868 868524 865133 862611 859752 855026 846787 833749
63526H33749j8326k3046k6165k7321k7206k6915k6868k6658k5870k4475k2469
$$ 833749 815423 792377 766212 738891 711685 684770 657902 631244 605374 580899 558430
63515E58430j9842j7094j5140j4242j3547j2170j0316q843p982p077n577l863
$$ 558430 538588 521494 506354 492112 478565 466395 456079 447236 439254 432177 426600 422737
63503D22737k884l124m014m419l734k420j345q01m90k85m62j141j909k241k000
$$ 422737 419853 416729 412715 408296 404562 402142 400797 399996 399506 399221 398759 397618 395709 393468 391468
63488C91468j417p78k53J85P42J564K547L480M258M820N095N234N555N876N356
$$ 391468 390051 389273 389020 389205 389947 391511 394058 397538 401796 406616 411711 416945 422500 428376 433732
63473D33732L539J188n77j651k703l813m388m392m600n340n877n500m503l643
$$ 433732 437271 438459 437882 436231 433528 429715 425327 420935 416335 410995 405118 399618 395115 391472
63459C91472l157k771k243j535o89K30J255K576M111N219N430N351O120P879R583
$$ 391472 388315 385544 383301 381766 381077 381307 382562 385138 389249 394468 399898 405249 411369 419248 428831
63444D28831J0381J0456J0380J0444J0894J2102J4210J7152K1018K5516K8977
$$ 428831 439212 449668 460048 470492 481386 493488 507698 524850 545868 571384 600361
63433F00361K9021K4884J8286J1677O399K935J649K437M397O787R793J3657J7788
$$ 600361 629382 654266 672552 684229 690628 693563 695212 697649 702046 708833 718626 732283 750071
63420G50071K1545K5231K9307L3057L5083L4736L2202K7463K0363J1703L251l561
$$ 750071 771616 796847 826154 859211 894294 929030 961232 988695 1009058 1020761 1024012 1020451
63408A020451q403j1475j2919j2967j2089j0704r194q344r223j2251j6619k0901
$$ 1020451 1012048 1000573 987654 974687 962598 951894 942700 934356 925133 912882 896263 875362
63396H75362k4185k6478k8156k9300k9620k8833k6971k4340k1388j8645j6460
$$ 875362 851177 824699 796543 767243 737623 708790 681819 657479 636091 617446 600986
63385F00986j4666j2761j0579q515o756m830k396oJ606K664L908N307O275P006
$$ 600986 586320 573559 562980 554465 547709 542879 540483 540477 542083 544747 548655 553962 560237 567243
63371E67243Q454J0720J2656J3531J4027J5032J6326J7170J7551J8189J9744K2505
$$ 567243 575697 586417 599073 612604 626631 641663 657989 675159 692710 710899 730643 753148
63359G53148K6237K9970L2544L3725L4090L3489L0595K4625J6721Q802J793m278
$$ 753148 779385 809355 841899 875624 909714 943203 973798 998423 1015144 1023946 1025739 1021461
63347A021461r133j2248j3546j3285j1695r460q009q380j0184j2488j5219j8742
$$ 1021461 1012328 1000080 986534 973249 961554 952094 944085 935705 925521 913033 897814 879072
63335H79072k2476k5173k6451k6956k7033k6232k4270k1568j8611j5462j2132
$$ 879072 856596 831423 804972 778016 750983 724751 700481 678913 660302 644840 632708
63324F32708q660m795l73L639N210K920k580r031j4246j7330j8642j8939j8488
$$ 632708 624048 619253 618880 622519 627729 630649 628069 619038 604792 587462 568820 549881 531393
63311E31393j6974j4303j1278r067q088p676o969n843m877m549m591m199l029
$$ 531393 514419 500116 488838 479771 471683 464007 457038 451195 446318 441769 437178 432979 429950
63298D29950j791j521k286l124l344l330l732m378m546l959l078k537k653l261
$$ 429950 428159 426638 424352 421228 417884 414554 410822 406444 401898 397939 394861 392324 389671 386410
63284C86410l727l422k422j490j137j141j162j254j407j217n86j94o32j427j645
$$ 386410 382683 379261 376839 375349 374212 373071 371909 370655 369248 368031 367445 367251 366619 365192 363547
63269C63547j101l54J64L76K55m4J2O87J405J455J062R95J374J707J959K635L734
$$ 363547 362446 362092 362256 362632 362887 362843 362855 363542 364947 366402 367464 368459 369833 371540 373499 376134 379868
63252C79868M524M636M602M950N410N493N391N818P112Q830J0223J0961J1380
$$ 379868 384392 389028 393630 398580 403990 409483 414874 420692 427804 436634 446857 457818 469198
63239D69198J2088J3345J4904J6483J8114J9881K1540K2728K3431K3993K4713
$$ 469198 481286 494631 509535 526018 544132 564013 585553 608281 631712 655705 680418
63228F80418K5614K6426K6726K6226K5168K4082K3200K2314K1412K0949K1246
$$ 680418 706032 732458 759184 785410 810578 834660 857860 880174 901586 922535 943781
63217I43781K2034K2801K3293K3354K2770K1497J9633J6899J2649O765Oo867j3696
$$ 943781 965815 988616 1011909 1035263 1058033 1079530 1099163 1116062 1128711 1135476 1135482 1128615 1114919
63204A114919k0343k6146l0538l3659l5778l6732l6482l5548l4174l1774k8050
$$ 1114919 1094576 1068430 1037892 1004233 968455 931723 895241 859693 825519 793745 765695
63193G65695k4019k0934j8617j5938j2510q873n249j377K505N596P624R086J0372
$$ 765695 741676 720742 702125 686187 673677 664804 659555 658178 660683 666279 673903 682989 693361
63180F93361J1353J1964J2341J2441J2215J2096J2519J3057J2905J2212J1955
$$ 693361 704714 716678 729019 741460 753675 765771 778290 791347 804252 816464 828419
63169H28419J2441J2797J2168J0546Q269N535K624j89l181o903j1155j5021j8073
$$ 828419 840860 853657 865825 876371 884640 890175 892799 892610 889429 882526 871371 856350 838277
63156H38277k0701k3018k4391k4497k3975k3458k2703k1363j9875j8786j7711
$$ 838277 817576 794558 770167 745670 721695 698237 675534 654171 634296 615510 597799
63145E97799j5845j3263j0886r181p677n917m301l586l821m178l833k759j483
$$ 597799 581954 568691 557805 548624 540947 535030 530729 527143 523322 519144 515311 512552 511069
63132E11069l34P58J780K420K569K620L004L683M412N142N813O053N624M910M463
$$ 511069 510735 511493 513273 515693 518262 520882 523886 527569 531981 537123 542936 548989 554613 559523 563986
63117E63986M232L787L135K706K597K464K144J778J318M88n82j269j173o39l29
$$ 563986 568218 572005 575140 577846 580443 582907 585051 586829 588147 588635 588053 586784 585611 584972 584643
63102E84643n33j023j353j334j215j372j695j586q09R6N67Q13J275J736J626J025
$$ 584643 584110 583087 581734 580400 579185 577813 576118 574532 573723 573819 574386 575199 576474 578210 579836 580861
63086E80861O34Q80J649K772M143N332N784N512N144N164N478N750N834N930O450
$$ 580861 581495 582375 584024 586796 590939 596271 602055 607567 612711 617875 623353 629103 634937 640867 647317
63071F47317P608Q884R398R107R085J0164J1900J3558J5342J7730K0196K1891
$$ 647317 654925 663809 673207 682314 691399 701563 713463 727021 742363 760093 780289 802180
63059H02180K3239K5454K8599L1509L3833L6678M0772M5206M8756N1479N4133
$$ 802180 825419 850873 879472 910981 944814 981492 1022264 1067470 1116226 1167705 1221838
63048A221838N6786N8834O0100O1035O1906O2350O1848O0383N8462N6575N4777
$$ 1221838 1278624 1337458 1397558 1458593 1520499 1582849 1644697 1705080 1763542 1820117 1874894
63037A874894N2995N1620N1323N2100N2999N3146N2432N0683M6899M0091L0468
$$ 1874894 1927889 1979509 2030832 2082932 2135931 2189077 2241509 2292192 2339091 2379182 2409650
63026B409650J8998O208p734k2173l6241m9607o2055p2593q0108q4630q6937q7179
$$ 2409650 2428648 2434856 2427122 2404949 2368708 2319101 2257046 2184453 2104345 2019715 1932778 1845599
63014A845599q5030q0968p6012p0314o3328n5347m7466m0022l2449k4867j8241
$$ 1845599 1760569 1679601 1603589 1533275 1469947 1414600 1367134 1327112 1294663 1269796 1251555
63003A251555j2720p254j418L835P753J0777J3410J5477J7104J9064K1345K2744
$$ 1251555 1238835 1231581 1230163 1233998 1241751 1252528 1265938 1281415 1298519 1317583 1338928 1361672
62991A361672K2756K2566K3157K3769K3367K2422K1869K1217J9219J5730J1498
$$ 1361672 1384428 1406994 1430151 1453920 1477287 1499709 1521578 1542795 1562014 1577744 1589242
62980A589242O562L28o990j4285k0909k7132l3270l9131m4266m8159n0271n0573
$$ 1589242 1595804 1596132 1589142 1574857 1553948 1526816 1493546 1454415 1410149 1361990 1311719 1261146
62968A261146m9802m8669m7067m4591m1463l8257l5163l2172k9648k7900k6492
$$ 1261146 1211344 1162675 1115608 1071017 1029554 991297 956134 923962 894314 866414 839922
62957H39922k4809k3064k1967k1484k0810j9551j8233j7426j7020j6542j5735
$$ 839922 815113 792049 770082 748598 727788 708237 690004 672578 655558 639016 623281
62946F23281j4662j3515j2518j1783j1237j0674r914q859p633o676o381o478o193
$$ 623281 608619 595104 582586 570803 559566 548892 538978 530119 522486 515810 509429 502951 496758
62933D96758n179l949l161k887k808k782k814k776k508k077j735j696j986k336
$$ 496758 491579 487630 484469 481582 478774 475992 473178 470402 467894 465817 464082 462386 460400 458064
62919D58064k316j854j507j746k200k174j740j599j949k364k679l067l155k270
$$ 458064 455748 453894 452387 450641 448441 446267 444527 442928 440979 438615 435936 432869 429714 427444
62905D27444q16k58j134k194k150j260m83J8N12P18K29n14o69j61L69N04L40O8
$$ 427444 426628 426370 425236 423042 420892 419632 419149 419167 419679 420397 420626 420112 419443 419282 419651 420155 420495 420563
62887D20563j79k70k56l04k66K03Q76J043N99L05N68Q56Q13R54J561J882J269
$$ 420563 420384 420114 419858 419554 419288 419491 420367 421410 422009 422314 422882 423738 424551 425505 427066 428948 430217
62870D30217L23o2J2m6k58m71j029j938k105p45J118J865J559J548K129K208J295
$$ 430217 430540 430478 430490 430444 430186 429715 428686 426748 424643 423898 425016 426881 428440 429988 432117 434325 435620
62853D35620L51L37J100K083L036L650L397K281J079L82k6n24r14p18R4J013J473
$$ 435620 435971 436308 437408 439491 442527 446177 449574 451855 452934 453316 453290 452766 451852 451134 451228 452241 453714
62836D53714J262O16l0m27n23j72P72J914K416K033J557J811K650L419L872M101
$$ 453714 454976 455592 455562 455135 454612 454440 455212 457126 459542 461575 463132 464943 467593 471012 474884 478985
62820D78985L979L458L010L100L507L731L831M127M485M577M559M776N093N179
$$ 478985 482964 486422 489432 492532 496039 499770 503601 507728 512213 516790 521349 526125 531218 536397
62806E36397N239N632O139O295O321O849P878Q821R447J0076J0908J1879J3097
$$ 536397 541636 547268 553407 559702 566023 572872 580750 589571 599018 609094 620002 631881 644978
62793F44978J4729J6572J8408K0664K3920K7854L1480L4521L7816M2226M7684
$$ 644978 659707 676279 694687 715351 739271 767125 798605 833126 870942 913168 960852
62782I60852N3570N9454O5348P1501P8029Q4527R0182R4464R7440R9152R9168
$$ 960852 1014422 1073876 1139224 1210725 1288754 1373281 1463463 1557927 1655367 1754519 1853687
62771A853687R7132R3195Q7316P8653O6447N1165L4046J5903k839k1295l8312
$$ 1853687 1950819 2044014 2131330 2209983 2276430 2327595 2361641 2377544 2374705 2353410 2315098
62760B315098n3391o6600p7699q6177r2043r5750r7423r6932r4713r1623q7975
$$ 2315098 2261707 2195107 2117408 2031231 1939188 1843438 1746015 1649083 1554370 1462747 1374772
62749A374772q3421p7894p1911o5936o0093n4585m9716m5418m1251l7000l2822
$$ 1374772 1291351 1213457 1141546 1075610 1015517 960932 911216 865798 824547 787547 754725
62738G54725k8866k5233k2127j9640j7491j5416j3632j2390j1415j0228q761p146
$$ 754725 725859 700626 678499 658859 641368 625952 612320 599930 588515 578287 569526 562380
62726E62380n345l583k536k384k179j032N33J397J540J901K923M315N937P780
$$ 562380 557035 553452 550916 548532 546353 545321 545854 547251 548791 550692 553615 557930 563867 571647
62712E71647R378J0353J1339J3171J5384J6842J7745J9527K2720K6334K9558L2646
$$ 571647 581025 591378 602717 615888 631272 648114 665859 685386 708106 734440 763998 796644
62700G96644L5721L8160L9820M1721M4706M8271N1373N3663N5290N6145N5838
$$ 796644 832365 870525 910345 952066 996772 1045043 1096416 1150079 1205369 1261514 1317352
62689A317352N3985N0146M3980L5704K5996J5355M089p177j7693k7297l6157m3854
$$ 1317352 1371337 1421483 1465463 1501167 1527163 1542518 1546607 1539430 1521737 1494440 1458283 1414429
62677A414429m9656n3645n6616n8687n9148n7863n5670n3091m9734m5456m1143
$$ 1414429 1364773 1311128 1254512 1195825 1136677 1078814 1023144 970053 920319 874863 833720
62666H33720l7673l4948l2432k9920k7268k4190k0868j8085j6239j4821j3251
$$ 833720 796047 761099 728667 698747 671479 647289 626421 608336 592097 577276 564025
62655E64025j1609j0149q826p683p106p151p252o933o333n701m935l946k892j820
$$ 564025 552416 542267 533441 525758 518652 511501 504249 497316 490983 485282 480347 476401 473509 471689
62641D71689o06N13J047R84P85M90k77j357j977j927j845k008j814r25K3L85L51
$$ 471689 471083 471596 472643 473627 474412 474902 474625 473268 471291 469364 467519 465511 463697 462772 462795 463180 463531
62624D63531L45L73N17J248K613L851M401M591M793M760M354M141M514M953M894
$$ 463531 463876 464249 464766 466014 468627 472478 476879 481470 486263 491023 495377 499518 504032 508985 513879
62609E13879M702N034N846O804Q105J0084J2389J4335J5866J7521J9705K2413
$$ 513879 518581 523615 529461 536265 544370 554454 566843 581178 597044 614565 634270 656683
62597F56683K5462K8630L1816L5286L9287M3305M6312M7994M8922M9305M8396
$$ 656683 682145 710775 742591 777877 817164 860469 906781 954775 1003697 1053002 1101398
62586A101398M5584M1168L5510K8320J9537J0077Q79q072j7068k5580l2739l8258
$$ 1101398 1146982 1188150 1223660 1251980 1271517 1281594 1282473 1274401 1257333 1231753 1199014 1160756
62574A160756m2221m4535m5402m5618m5558m4451m1705l8302l5822l4403l2808
$$ 1160756 1118535 1074000 1028598 982980 937422 892971 851266 812964 777142 742739 709931
62563G09931l0297k7337k4486k1636j8617j5761j3565j2190j1394j0713r798q806
$$ 709931 679634 652297 627811 606175 587558 571797 558232 546042 534648 523935 514137 505331
62551E05331q167p786o932n336l781l020k679j940p90J77P87J199J173L47q57
$$ 505331 497164 489378 482446 477110 473329 470309 467630 465690 464900 465077 465864 467063 468236 468583 467726
62536D67726j539j521j425j564j470p11M74J542K247K768L543M978O970Q899J0338
$$ 467726 466187 464666 463241 461677 460207 459496 459970 461512 463759 466527 470070 475048 482018 490917 501255
62521E01255J1566J2985J4435J5605J6821J8702K1199K3656K5789K7956L0393
$$ 501255 512821 525806 540241 555846 572667 591369 612568 636224 662013 689969 720362
62510G20362L2827L4939L6677L7848L7880L6276L3197K9333K5239K0851J5720
$$ 720362 753189 788128 824805 862653 900533 936809 970006 999339 1024578 1045429 1061149
62499A061149R795L890q55l904n427n552m192j711J026L740P232J2113J7599K2307
$$ 1061149 1070944 1074834 1073979 1070075 1064648 1059096 1054904 1053193 1054219 1057959 1065191 1077304 1094903 1117210
62485A117210K5973K9560L3759L7983M0824M0808L6832K8719J7937P339n96n689
$$ 1117210 1143183 1172743 1206502 1244485 1285309 1326117 1362949 1391668 1409605 1416944 1416348 1410659
62473A410659j0372j7775k8966m1800n2547n8845o1082o1213o0754n9990n8507
$$ 1410659 1400287 1382512 1353546 1311746 1259199 1200354 1139272 1078059 1017305 957315 898808
62462H98808n5974n2470m8325m3650l8275l2377k6868k2583j9251j5995j2754
$$ 898808 842834 790364 742039 698389 660114 627737 600869 578286 559035 543040 530286
62451E30286j0328q938p782o293m856l808k695j152K62Q83R69J229J857K659L522
$$ 530286 519958 511020 503238 496945 492089 488281 485586 484434 484696 485579 486548 487777 489634 492293 495815
62436D95815M152L902K547Q10m96j368k130k751l189l805m656n028m506l872m048
$$ 495815 499967 503869 506416 507226 506730 505362 503232 500481 497292 493487 488831 483803 479297 475425 471377
62421D71377m624m506l579k749k558k710k860k990l092l188l501l941l713k262
$$ 471377 466753 462247 458668 455919 453361 450651 447791 444801 441709 438521 435020 431079 427366 425104
62407D25104l87M76j5r07j367j477j557j494r60J60J643K937L433L124K706K646
$$ 425104 424717 425193 425178 424271 422904 421427 419870 418376 417416 417576 419219 422156 425589 428713 431419 434065
62391D34065K587K184K017K873M474N698N900N305M403L742L955N177O535P070
$$ 434065 436652 438836 440853 443726 448200 453898 459798 465103 469506 473248 477203 482380 488915 495985
62377D95985P006P338Q347R453J0368J1386J2488J3093J2998J2808J3286J4801
$$ 495985 502991 510329 518676 528129 538497 549883 562371 575464 588462 601270 614556 629357
62365F29357J7461K1100K5070K8663L1867L5153L8625M2036M5570M9661N3873
$$ 629357 646818 667918 692988 721651 753518 788671 827296 869332 914902 964563 1018436
62354A018436N6688N6836N4303M9783M3623L5723K6216J5976O472j045o500j1044
$$ 1018436 1075124 1131960 1186263 1236046 1279669 1315392 1341608 1357584 1364056 1363011 1356511 1345467
62342A345467j5900k1235k6423l0989l4855l7919l9979m0910m0568l8780l5908
$$ 1345467 1329567 1308332 1281909 1250920 1216065 1178146 1138167 1097257 1056689 1017909 982001
62331I82001l3017l0863k9021k6681k4005k1953k0977k0676k0606k0615k0434
$$ 982001 948984 918121 889100 862419 838414 816461 795484 774808 754202 733587 713153
62320G13153j9747j8759j8010j7514j6679j5182j3442j2106j1439j1198j0769
$$ 713153 693406 674647 656637 639123 622444 607262 593820 581714 570275 559077 548308
62309E48308r610p850o277n349m630l550k294j349p14j89J6k44m17M7Q24J325
$$ 548308 538698 530848 524571 519222 514592 511042 508748 507399 506685 506496 506512 506268 505851 505898 506722 508047
62293E08047J777K706L750M099L785L504L378L032K663K882L493L652L207K826
$$ 508047 509824 512530 516280 520379 524164 527668 531046 534078 536741 539623 543116 546768 549975 552801
62279E52801K792K705K470K510K955L585M560O167P909R005R758J1174J3282J5124
$$ 552801 555593 558298 560768 563278 566233 569818 574378 580545 588454 597459 607217 618391 631673 646797
62265F46797J6549J8525K1446K4646K7968L2281L7795M3303M7873N1993N6199
$$ 646797 663346 681871 703317 727963 755931 788212 826007 869310 917183 969176 1025375
62254A025375N9782O1775O2073O0539N6121M8107L7604K6640J6332O869j405q089
$$ 1025375 1085157 1146932 1209005 1269544 1325665 1373772 1411376 1438016 1454348 1461217 1459812 1451723
62242A451723j3657j9243k5552l2443l9310m5320m9685n2270n3649n4089n3061
$$ 1451723 1438066 1418823 1393271 1360828 1321518 1276198 1226513 1174243 1120594 1066505 1013444
62231A013444n0270m6496m2704l8910l4794l0891k8077k6119k3841k0759j7647
$$ 1013444 963174 916678 873974 835064 800270 769379 741302 715183 691342 670583 652936
62220F52936j5323j3675j2243j1068j0468j0218r539p933n819m154l486l496l528
$$ 652936 637613 623938 611695 600627 590159 579941 570402 562469 556650 552496 549010 545514 541986
62207E41986l266k704j792n07Q01J698K207K674L138L401L639M342N542O696P487
$$ 541986 538720 536016 534224 533717 534518 536216 538423 541097 544235 547636 551275 555617 561159 567855 575342
62192E75342Q192R082J0017J0775J1263J1308J0844J0419J0777J1715J2057J1111
$$ 575342 583534 592616 602633 613408 624671 635979 646823 657242 668019 679734 691791 702902
62180G02902R461P954O588N040L673L318M253N958P887J0101J3133J7287K2106
$$ 702902 712363 720317 726905 731945 735618 738936 743189 749147 757034 767135 780268 797555 819661
62167H19661K6659L0551L4382L8718M2860M5258M4937M1818L5965K7679J8432
$$ 819661 846320 876871 911253 949971 992831 1038089 1083026 1124844 1160809 1188488 1206920
62156A206920J0430M597j28n084j0292j5091j9424k3673k7747l1138l3534l4864
$$ 1206920 1217350 1221947 1221819 1216735 1206443 1191352 1171928 1148255 1120508 1089370 1055836 1020972
62144A020972l5056l4201l2622l0456k7584k4240k1093j8350j5459j2151r177
$$ 1020972 985916 951715 919093 888637 861053 836813 815720 797370 781911 769760 760583
62133G60583p352o419n478m217l048k327j889j287p3J865M067N871P183Q496J0057
$$ 760583 753231 746812 741334 737117 734069 731742 729853 728566 728493 730358 734425 740296 747479 755975 766032
62118G66032J1652J3364J5712J8536K0470K0089J7144J2335O661J398k074l278
$$ 766032 777684 791048 806760 825296 845766 865855 882999 895334 901995 903393 901319 898041
62106H98041k964j907j19K047K898Q59l414p467r470r373p868n429k541J22K222
$$ 898041 895077 893170 893051 895098 897996 898855 895441 887974 878504 869131 861263 855834 853293 853415 855637
62091H55637L976N522O509O659O332O259O857P904Q834R240R213R139R323R936
$$ 855637 859613 865135 871644 878303 884635 890894 897751 905655 914489 923729 932942 942081 951404 961340
62077I61340J1221J3329J5787J7681J8653J9292K0197K1059K1196K0702K0454
$$ 961340 972561 985890 1001677 1019358 1038011 1057303 1077500 1098559 1119755 1140457 1160911
62066A160911K1042K2216K3426K4430K5119K5010K3285J9423J3748P235Q48m827
$$ 1160911 1181953 1204169 1227595 1252025 1277144 1302154 1325439 1344862 1358610 1365845 1366693 1361866
62054A361866r430j2805j5375j8087k1503k5227k8574l1497l4210l6335l7222
$$ 1361866 1352436 1339631 1324256 1306169 1284666 1259439 1230865 1199368 1165158 1128823 1091601
62043A091601l6993l6448l5952l5216l4077l2686l0902k8445k5687k3380k1471
$$ 1091601 1054608 1018160 982208 946992 912915 880229 849327 820882 795195 771815 750344
62032G50344j9173j6403j4053j2533j1122r232p344o051n092m021l181l254m340
$$ 750344 731171 714768 700715 688182 677060 667828 660484 654433 649341 645320 642139 638885 634545
62019F34545n893p181p563o955o112n794n608m602l039k230k381k058m20J517
$$ 634545 628652 621471 613908 606953 600841 595047 589439 584837 581798 579568 577187 575129 574709 576226
62005E76226K674L567N094O866P949Q235P902O497L905J342J6m71j143j871k050
$$ 576226 578900 582467 587561 594427 602376 610611 618513 625010 628915 630257 630273 629802 628659 626788 624738
61990F24738k294l777o226q214r246j0059j0959j1329j0961j0510j0375j0183
$$ 624738 622444 618667 612441 604227 594981 584922 573963 562634 551673 541163 530788 520605
61978E20605r564q497o863m624k477j436j610k182k607k910k915k219j065l22
$$ 520605 511041 502544 495681 491057 488580 487144 485534 483352 480745 477835 474920 472701 471636 471314
61964D71314l82p85r89q27j43J102K328K689K206J780K067K836L633M319M914
$$ 471314 470932 470147 469158 468331 468188 469290 471618 474307 476513 478293 480360 483196 486829 491148 496062
61949D96062N483O269P456Q762R780J0700J2131J4313J6948J9646K1985K3418
$$ 496062 501545 507814 515270 524032 533812 544512 556643 570956 587904 607550 629535 652953
61937F52953K3797K3764K3946K3975K3075K1333J9539J7998J6420J4758J3159
$$ 652953 676750 700514 724460 748435 771510 792843 812382 830380 846800 861558 874717
61926H74717J1127P883L639m96l993p260j0312j2235j2430j1508j0325q862o589
$$ 874717 885844 893727 897366 896870 892877 885617 875305 863070 850640 839132 828807 819945 813356
61913H13356l385M44M638R008J3271J7133K0294K2261K2563K1237J8770J5483
$$ 813356 809971 810415 815053 824061 837332 854465 874759 897020 919583 940820 959590 975073
61901I75073J1370O585J615l165p666j1709j4872j6828j7611j7533j7081j6718
$$ 975073 986443 993028 994643 991478 983812 972103 957231 940403 922792 905259 888178 871460
61889H71460j6433j5692j4212j2586j1598j1238j0944j0585j0547j1009j1776
$$ 871460 855027 839335 825123 812537 800939 789701 778757 768172 757625 746616 734840
61878G34840j2693j3585j3933j3293j1961j0592r314p914o570n520m275k209J54
$$ 734840 722147 708562 694629 681336 669375 658783 649469 641555 634985 629465 625190 622981 623135
61865F23135J560J871K392M069O396Q510J0371J2361J4517J6841J9719K3405K7455
$$ 623135 624695 626566 628958 633027 639423 647933 658304 670665 685182 702023 721742 745147 772602
61852G72602L1139L4089L6294L7843L8965L9912M0441L9776L7267L2952K7355
$$ 772602 803741 837830 874124 911967 950932 990844 1031285 1071061 1108328 1141280 1168635
61841A168635K1106J4669Q077R90o478j3145j7589j9588k0000j9288j7053j3190
$$ 1168635 1189741 1204410 1212487 1213477 1206999 1193854 1176265 1156677 1136677 1117389 1100336 1087146
61829A087146q525l850R37O108J1167J5152J7450J7801J5999J2089O600Q2p335
$$ 1087146 1078621 1074771 1075708 1081816 1092983 1108135 1125585 1143386 1159385 1171474 1178074 1178156 1170821
61816A170821j5439k3305k9648l3906l6542l8266l9228l9136l7949l6190l4449
$$ 1170821 1155382 1132077 1102429 1068523 1031981 993715 954487 915351 877402 841212 806763
61805H06763l2732l0611k7896k4928k2114j9658j7769j6572j5597j4015j1835
$$ 806763 774031 743420 715524 690596 668482 648824 631055 614483 598886 584871 573036
61794E73036j0170r727r647q693o968n512m621l746k792k359k578k810k648k354
$$ 573036 562866 553139 543492 534799 527831 522319 517698 513952 511160 508801 506223 503413 500765 498411
61780D98411k106j643q92j75L75R58J543J875K125K736L571L963L763L546L655
$$ 498411 496305 494662 493770 493595 493970 494928 496471 498346 500471 503207 506778 510741 514504 518050 521705
61765E21705L845M088M802O046P256Q075Q730R306R399Q814P829O491M456J847
$$ 521705 525550 529638 534440 540486 547742 555817 564547 573853 583252 592066 599895 606386 610842 612689
61751F12689n05k136l537n206o790p648p748p481p095o655o157n430m374l440
$$ 612689 612184 610048 606511 601305 594515 586867 579119 571638 564543 557888 551731 546301 541927 538487
61737E38487l190l299k807j577o15n41o83l08K41L98N82J527K973L937M054L729
$$ 538487 535297 531998 529191 527614 526999 526458 525775 525467 525708 526106 526688 528215 531188 535125 539179 542908
61721E42908L205K358J374Q73J133J697J900J455N40m45j129j415j556j861k455
$$ 542908 546113 548471 549845 550718 551851 553548 555448 556903 557443 556998 555869 554454 552898 551037 548582
61706E48582l265m140m840n112m888m370l844l497l314l063k471j653j212j579
$$ 548582 545317 541177 536337 531225 526337 521967 518123 514626 511312 508249 505778 504125 502913 501334
61692E01334k490l399m082m466m183l021j593p97p04o56l66j42p5J38M59M12q9
$$ 501334 498844 495445 491363 486897 482714 479693 478100 477303 476599 475943 475577 475435 475360 475498 475957 476369 476280
61675D76280n56p33p73n73J99J161J339O22J33N42R62K82j142k009j794j033j92
$$ 476280 475724 474991 474218 473645 473844 475005 476344 476966 477099 477641 478603 478885 477743 475734 473940 472907 472715
61658D72715Q24K027K944L126K649J935J251N83lr9P11K152L272L498L325L555
$$ 472715 473539 475566 478510 481636 484285 486220 487471 488054 488051 487952 488663 490815 494087 497585 500910 504465
61642E04465M130M309L850L303L130L075K528J126r37k869l767l610l468m150
$$ 504465 508595 512904 516754 520057 523187 526262 528790 529916 528979 526110 522343 518733 515265 511115
61628E11115n060n118m397l906m023m178l941l375k474j185M3P05J103J714J998
$$ 511115 506055 500937 496540 492634 488611 484433 480492 477117 474643 473458 473501 474206 475309 477023 479021
61613D79021J048p31k058k765l874n608o962p476p805q130p732o621n954o097
$$ 479021 480069 479338 477280 474515 470641 465033 458071 450595 442790 434660 426928 420307 414353 408256
61599D08256n915m825l910m027m391m145l829m065m148l334k308j940j738j020
$$ 408256 402341 397516 393606 389579 385188 381043 377214 373149 369001 365667 363359 361419 359681 358661
61585C58661n50j362k808l392k899k147j282QJ032O21r61k178k237j739j338j038
$$ 358661 358111 356749 353941 350549 347650 345503 344221 344229 345261 345882 344921 342743 340506 338767 337429 336391
61569C36391q73j081j416j242n20J45M65P37J090J240J066Q43Q13J006J346J583
$$ 336391 335518 334437 333021 331779 331259 331404 331869 332606 333696 334936 336002 336845 337658 338664 340010 341593
61553C41593J358P18K65L27M58K14j15p5K57P09J454K378K744K257J765J999K470
$$ 341593 342951 343669 343934 344261 344719 344933 344818 344743 345000 345709 347163 349541 352285 354542 356307 358306 360776
61536C60776K543K780L872N017M826L433K191J538O78o97j880k470k853l147k924
$$ 360776 363319 366099 369971 374988 379814 383247 385438 386976 387654 386957 385077 382607 379754 376607 373683
61521C73683k256j927k145k154j499p70n69o34n15m08p40j344j591j127j94N69
$$ 373683 371427 369500 367355 365201 363702 362932 362363 361729 361214 360806 360066 358722 357131 356004 355810 356379
61505C56379O40J44j33L66J222J571J244Q64Q87J100J148J042J060J412J989K301
$$ 356379 357019 357163 357030 357396 358618 360189 361433 362297 363184 364284 365432 366474 367534 368946 370935 373236
61489C73236J907J059N89Q01R54L57n29p32j33N81J008J279J394J086M02k38n86
$$ 373236 375143 376202 376791 377592 378546 378903 378374 377642 377509 378090 379098 380377 381771 382857 383259 383021 382435
61472C82435p00o52m60k29N7N47J032Q35k30j332j619j347j261j291p37M75J555
$$ 382435 381735 381083 380623 380394 380451 380998 382030 382865 382635 381303 379684 378337 377076 375785 375048 375523 377078
61455C77078J852J443Q57O93J230J980K008J221P74J558K868L433L148K784K563
$$ 377078 378930 380373 381230 381923 383153 385133 387141 388362 389136 390694 393562 396995 400143 402927 405490
61440D05490K212K071K784M017M704M603M461M634M607M095L503L091K547J734
$$ 405490 407702 409773 412557 416574 421278 425881 430342 434976 439583 443678 447181 450272 452819 454553
61426D54553J015O51N09N59R65J594K022K093J909J357K95r19j793k402l034l404
$$ 454553 455568 456219 456728 457287 458252 459846 461868 463961 465870 467227 467522 466603 464810 462408 459374 455970
61410D55970l070k441k408l074l761m093m104l502k050o32n74j743k564k215j573
$$ 455970 452900 450459 448051 444977 441216 437123 433019 429517 427467 426835 426261 424518 421954 419739 418166
61395D18166j545j789j711j547j594j269L8J750K668K404J639J162J291J956K850
$$ 418166 416621 414832 413121 411574 409980 408711 408749 410499 413167 415571 417210 418372 419663 421619 424469
61380D24469L516L635L272K760K458K655L344M133M528M409L993L525L222L281
$$ 424469 427985 431620 434892 437652 440110 442765 446109 450242 454770 459179 463172 466697 469919 473200
61366D73200L514L277K282J202R36J479K169K787L610M607N409O025O804P683
$$ 473200 476714 479991 482273 483475 484411 485890 488059 490846 494456 499063 504472 510497 517301 524984
61352E24984Q328Q957J0169J1786J2688J2059J0210P976N951M422L443K764K141
$$ 524984 533312 542269 552438 564224 576912 588971 599181 607157 613108 617530 620973 623737 625878
61339F25878J739J776J870J374L62m37p35j091k121l743n302o056n724m898m618
$$ 625878 627617 629393 631263 632637 632999 632562 631827 630736 628615 624872 619570 613514 607790 602892 598274
61324E98274n085n289m460l287k845k955k718k115j803j638q61M23J299J673K439
$$ 598274 593189 587900 583440 580153 577308 574353 571635 569520 567717 566079 565218 565641 566940 568613 571052
61309E71052L908N436O825Q715J1178J3145J3647J2608J0175O454K279j040l189
$$ 571052 574960 580396 587221 595936 607114 620259 633906 646514 656689 663143 665422 664382 661193
61296F61193n035o943q146q209p867p728p356o404n485n083m546l140j298K9O55
$$ 661193 656158 649215 641069 632860 624993 617265 609909 603505 598020 592937 588391 585251 583953 583982 584637
61281E84637R57J097J141J447K305L628N332P359Q984R106P782O533O446O813
$$ 584637 585594 586691 587832 589279 591584 595212 600544 607903 616887 625993 633775 640308 646754 653567
61267F53567O483N725N747O966Q738J0449J2040J3658J5373J6892J7267J5444
$$ 653567 660050 665775 671522 678488 687226 697675 709715 723373 738746 755638 772905 788349
61255G88349J1625P435M233J812o83l365n792p896r774j1075j1437j1214j0978
$$ 788349 799974 807409 811642 813454 812771 809406 803614 795718 785944 774869 763432 752218 741240
61242G41240j0685r927q746p438o002m428l236k953l337l724l892l902l462k180
$$ 741240 730555 720628 711882 704444 698442 694014 690778 687825 684488 680764 676872 672970 669508 667328
61228F67328l96J029J687J850J765J301L30r38k095k727k575j780q45j10O07J552
$$ 667328 666932 667961 669648 671498 673263 674564 674894 673956 671861 669134 666559 664779 663934 663824 664431 665983
61212F65983K470K736K018N57j079k314k723k167p86J036K780M092N272P099R837
$$ 665983 668453 671189 673207 673764 672685 670371 667648 665481 664695 665731 668511 672603 677875 684974 694811
61197F94811J2738J5097J7367K0301K3213K4205K2278J8290J3645R046M828J481
$$ 694811 707549 722646 740013 760314 783527 807732 830010 848300 861945 870991 875819 877300
61185H77300p61k091k495j690j46P54J33j539l486n665q094j0041j0832j0849
$$ 877300 876539 874448 871953 870263 870117 870871 871004 869465 865979 860314 852220 842179 831347 820498
61171H20498j0875j0914j0483r635q927q699r007r881j1044j1753j1602j1040
$$ 820498 809623 798709 788226 778591 769664 760965 751958 742077 731033 719280 707678 696638
61159F96638j0571r892q506o695n059l524j636M93K434M376O762R010R510P234
$$ 696638 686067 676175 667669 660974 655915 652391 650755 651248 653682 658058 664820 673830 683340 690574
61145F90574K758k400o999j0498j2823j3993j3925j2665j0784r105p699n690k588
$$ 690574 693332 690932 683933 673435 660612 646619 632694 620029 609245 600140 592441 586751 584163
61132E84163N90K349K628K885M225O284Q120R473J0722J2116J3585J5075J6610
$$ 584163 584753 587102 589730 592615 596840 603124 611244 620717 631439 643555 657140 672215 688825
61119F88825J8043J9079J9564J9604J9419J9234J9321J9877K0645K0770J9471
$$ 688825 706868 725947 745511 765115 784534 803768 823089 842966 863611 884381 903852
61108I03852J6939J4353J2724J1923J1043R437P026L839k04m902r585j3444j6020
$$ 903852 920791 935144 947868 959791 970834 980271 987297 991136 990932 986030 976445 963001 946981
61095I46981j7448j8390j9525k0811k1498k1121k0185j9338j8378j6734j4731
$$ 946981 929533 911143 891618 870807 849309 828188 808003 788665 770287 753553 738822
61084G38822j3316j2553j1434r499p666o889o709o004m679l707l571l559k821
$$ 738822 725506 712953 701519 692020 684354 677465 670756 664752 660073 656366 652795 649236 646415
61071F46415j538n93l42k14M91J797L201M306N053N531N894O384P131Q054R197
$$ 646415 644877 644284 643942 643728 644219 646016 649217 653523 658576 664107 670001 676385 683516 691570 700767
61056G00767J0774J2539J3508J3170J2564J3269J5422J7740J9394K0705K1971
$$ 700767 711541 724080 737588 750758 763322 776591 792013 809753 829147 849852 871823
61045H71823K2955K3755K4894K6179K6824K7041K8011K9838L1153L1336L1446
$$ 871823 894778 918533 943427 969606 996430 1023471 1051482 1081320 1112473 1143809 1175255
61034A175255L2140L2522L2123L2174L3707L5999L8258M1068M4789M8167N0014
$$ 1175255 1207395 1239917 1272040 1304214 1337921 1373920 1412178 1453246 1498035 1546202 1596216
61023A596216N0638N0445M9225M8152N0003N5666O3010P1032Q1833R6069J10033
$$ 1596216 1646854 1697299 1746524 1794676 1844679 1900345 1963355 2034387 2116220 2212289 2322322
61012B322322J20728J30524J43168J58947J78346K06378K47624L00470L62471
$$ 2322322 2443050 2573574 2716742 2875689 3054035 3260413 3508037 3808507 4170978
61003D170978M37229N28668O33789P51757Q95896J084509J325561J626765K005512
$$ 4170978 4608207 5136875 5770664 6522421 7418317 8502826 9828387 11455152 13460664
60994A3460664K437895K774020K756240K206293J226763J82843n51259q28103
$$ 13460664 15898559 18672579 21428819 23635112 24861875 25044718 24493459 23665356
60986B3665356p22183l59816J64746P04452R91634P66194M491j014017j898499
$$ 23665356 22943173 22583357 22748103 23452555 24444189 25210383 25214874 24200857 22302358
60977B2302358k406874k535151k412417k164794j870041j576511j314427j091258
$$ 22302358 19895484 17360333 14947916 12783122 10913081 9336570 8022143 6930885
60969F930885q99910p36275o01616m92698m01531l24536k63477k17586j81968
$$ 6930885 6030975 5294700 4693084 4200386 3798855 3474319 3210842 2993256 2811288
60960B811288j53517j31888j14760r8224q2096o9443o0536n2140m2818l4173k6719
$$ 2811288 2657771 2525883 2411123 2312899 2230803 2161360 2100824 2048684 2005866 1971693 1944974
60949A944974j9358j3248j1594j4793j9756k4465k9340l3912l6425l7403l9531
$$ 1944974 1925616 1912368 1900774 1885981 1866225 1841760 1812420 1778508 1742083 1704680 1665149
60938A665149m3197m5925m6900m8155n0329n1221m9863m8291m7758m6637m3776
$$ 1665149 1621952 1576027 1529127 1480972 1430643 1379422 1329559 1281268 1233510 1186873 1143097
60927A143097m0812l9203l7773l5133l2145l0151k8695k6683k4180k1761j9454
$$ 1143097 1102285 1063082 1025309 990176 958031 927880 899185 872502 848322 826561 807107
60916H07107j7325j5684j4156j2009r667q206p347n946m440m361n313n135l464
$$ 807107 789782 774098 759942 747933 738266 730060 722713 716767 712327 707966 702653 697518 694054
60903F94054k349k755l185k690k465l329m173m207m400n349n985n622n316n764
$$ 694054 691705 688950 685765 683075 680610 677281 673108 668901 664501 659152 653167 647545 642229 636465
60889F36465n900m896l785l700m060l806l056k484k333k835m275o030o934p069
$$ 636465 630565 625669 621884 618184 614124 610318 607262 604778 602445 599610 595335 589305 582371 575302
60875E75302p602q587q751p814o976o688o097n163n037n633n218l320j739j610
$$ 575302 567700 559113 550362 542548 535572 528884 522787 517624 512587 506954 501736 498416 496677 495067
60861D95067j772j083j40M51J309K438K329L39j948l105l610l973l180o72J980
$$ 495067 493295 492212 492072 492523 493832 496270 498599 498938 496990 493885 490275 486302 483122 482450 484430
60846D84430L086K944K524J659K2j575k440l144m162m770m499m161m216l716k170
$$ 484430 487516 490460 492984 494643 494665 493090 490650 487506 483344 478574 474075 469914 465698 461982 459812
60831D59812p55l71j13R16J942K100K082K655L099K637J990J906J664O03l07j20
$$ 459812 459057 458686 458573 459489 461431 463531 465613 468268 471367 474004 475994 477900 479564 480167 479860 479740
60815D79740K73k99j181j196q55j429k665l248k837k151j614j326j685k871m223
$$ 479740 480013 479714 478533 477337 476482 475053 472388 469140 466303 464152 462538 461212 459527 456656 452433
60800D52433n028n244m851l672k391k350l462l965l108k339k733l247k889k694
$$ 452433 447405 442161 437310 433638 431247 428897 425435 421470 418362 416023 413290 410043 407154 404460
60786D04460l666m647m176k991k571k570j829q15q22j645k044j775j319m50J053
$$ 404460 400794 396147 391971 388980 386409 383839 382010 381195 380373 378728 376684 374909 373590 373140 374193
60771C74193K066J463J83J39J564L140M155M885N339N238M898M754M420L505K716
$$ 374193 376259 377722 377905 378044 379608 382748 386903 391788 397127 402365 407263 412017 416437 419942 422658
60756D22658K885L569L829L658L376K564R58m53p08l68l59l07M01Q42l34k732
$$ 422658 425543 429112 432941 436599 439975 442539 443497 443044 442336 441968 441609 441302 441703 442545 442211 439479
60740D39479m819o070o944p375p002o287n892n421m271l107k947l384l290k677
$$ 439479 434660 428590 421646 414271 407269 400982 395090 389669 385398 382291 379344 375960 372670 369993
60726C69993k382k428k242j970k108k342k093j621j349q30K45R39M68k34nN21
$$ 369993 367611 365183 362941 360971 358863 356521 354428 352807 351458 350628 350873 351812 352280 352046 352041 352562
60710C52562J67m67K5J243J556P94L46Q00J433J829K236K499K263K052K551L204
$$ 352562 352729 352262 352287 353530 355086 355880 356226 357026 358459 360288 362524 365023 367286 369338 371889 375093
60694C75093L065K520K496K588J873J038J606L405M851N485O096O571N876M301
$$ 375093 378158 380678 383174 385762 387635 388673 390279 393684 398535 404020 410116 416687 422563 426864
60680D26864L488L922M304L767K904K247J520Q24Q05J227R45l51j776k930m316
$$ 426864 430352 434274 438578 442345 445249 447496 449016 449840 450645 451872 452817 452466 450690 447760 443444
60665D43444n799o306n593m789m662m633m152l642l495l235k333j026K11J178
$$ 443444 437645 431339 425746 420957 416295 411662 407510 403868 400373 397138 394805 393779 393990 395168
60651C95168J689J600J284J346J708J782J428R56L51o33j753k600l355m276m757
$$ 395168 396857 398457 399741 401087 402795 404577 406005 406961 407312 406679 404926 402326 398971 394695 389938
60636C89938m081k753j865j467q38j05p5o72r15m60J73Q12J703K396K044R01J91
$$ 389938 385857 383104 381239 379772 378934 378829 378754 378082 377167 376707 376880 377692 379395 381791 383835 384736 384927
60619C84927L54O19M00l8l95o23m68K60R68R62N87N68O26M2p66p65j42J8l50l31
$$ 384927 385281 385900 386300 386262 385867 385244 384776 385036 386004 386966 387553 388121 388747 388789 388023 387258 387116 387134 386784 386453
60599C86453R9N8l76j25Q08J050J29o25p1J293K415K943K900K308J585J303J233
$$ 386453 386552 386610 386234 386109 386917 387967 388096 387471 387400 388693 391108 394051 396951 399259 400844 402147 403380
60582D03380P26R0L25J360J947J589J178J330J474J163J039J874L555N482P122
$$ 403380 404106 404196 404521 405881 407828 409417 410595 411925 413399 414562 415601 417475 421030 426512 433634
60567D33634P985P975P969Q963J0586J1441J0969R884Q705P088M795K188m10k806
$$ 433634 441619 449594 457563 466526 477112 488553 499522 509406 518111 525199 529994 532182 531772 528966
60553E28966m443m873m663m573m073k104P86K758L272L604M623N804O857Q556
$$ 528966 524523 519650 514987 510414 506341 504237 505023 507781 511053 514657 519280 525084 531941 540497
60539E40497J1212J3844J5668J7081J8431J9094J8495J6927J4581J0932N830K89
$$ 540497 551709 565553 581221 598302 616733 635827 654322 671249 685830 696762 702592 702881
60527G02881m506q211j0826j2074j1880j0739r112p139n209m032l847m138m337
$$ 702881 698375 690164 679338 667264 655384 644645 635533 628394 623185 619153 615306 611168 606831
60514F06831m099l040j094Q85J872K009K301L122M071N148O814Q948J0980J3128
$$ 606831 602732 599692 598598 599483 601355 603364 605665 608787 612858 618006 624820 633768 644748 657876
60500F57876J6181K0056K3813K7155L0662L4509L8236M1764M5226M7831M8318
$$ 657876 674057 694113 717926 745081 775743 810252 848488 890252 935478 983309 1031627
60489A031627M6609M3574L9166L2309K2721J1288j369j5022k8424l9562m7648
$$ 1031627 1078236 1121810 1160976 1193285 1216006 1227294 1225925 1210903 1182479 1142917 1095269
60478A095269n3250n6335n6052n2862m8827m5159m1176l6323l1428k7257k3469
$$ 1095269 1042019 985684 929632 876770 827943 782784 741608 705285 673857 646600 623131
60467F23131j9891j7276j5856j4632j2838j0908r320p870o588n989n811n087l987
$$ 623131 603240 585964 570108 555476 542638 531730 522410 514540 507952 501963 496152 491065 487078
60454D87078l864m863n268m139k778k508k699k221j392j092j234j342j587k027
$$ 487078 483214 478351 473083 468944 466166 463658 460959 458738 457346 456254 455020 453678 452091 450064
60440D50064j875o53P90J362J022K64p07j576j772j422j401j793j552l57N72L61
$$ 450064 448189 447536 448326 449688 450710 450974 450267 448691 446919 445497 444096 442303 440751 440394 440966 441327
60424D41327j27K05J033J443J376J236J035R01J395K510L208K765J671O60j39
$$ 441327 441200 441405 442438 443881 445257 446493 447528 448429 449824 452334 455542 458307 459978 460638 460499
60409D60499n75k50M23K67q47j481o77P69J812K473K913K641J700J217J760K369
$$ 460499 459924 459674 460097 460364 459517 458036 457359 458128 459940 462413 465326 467967 469667 470884 472644 475013
60393D75013K314K438L567M879N126M421L626K941K266J984K269K500K332K373
$$ 475013 477327 479765 483332 488211 493337 497758 501384 504325 506591 508575 510844 513344 515676 518049
60379E18049K931L181K525J760J807K357K677K795K888K635K051J885K251K113
$$ 518049 520980 524161 526686 528446 530253 532610 535287 538082 540970 543605 545656 547541 549792 551905
60365E51905J072L73J050K341L057L328L721L911L556L378L975M587M422M248
$$ 551905 552977 553350 554400 556741 559798 563126 566847 570758 574314 577692 581667 586254 590676 594924
60351E94924N237P069Q547R280R533R171Q017O572N218L376M79k899n756p689
$$ 594924 600161 607230 615777 625057 634590 643761 651778 658350 663568 666944 667423 664524 658768 651079
60337F51079q481p771o079n018n375o037n796n101m894m989m815m642m774m637
$$ 651079 642598 634827 628748 623730 618355 612318 606522 601421 596527 591538 586723 582081 577307 572670
60323E72670l903l411l679l692k589j316j075j233m72J000K073K808M166O248
$$ 572670 568767 565356 561677 557985 555396 554080 553005 551772 551300 552300 554373 557181 561347 567595
60309E67595Q348J0209J1947J3242J3876J4434J5431J6488J7282J8146J8545J6433
$$ 567595 575943 586152 598099 611341 625217 639651 655082 671570 688852 706998 725543 741976
60297G41976J0771L590k265o533j0842j5497j8981k0246j9706j8140j6107j4148
$$ 741976 752747 756337 754072 747539 736697 721200 702219 681973 662267 644127 628020 613872
60285F13872j2311r879o716m268l919n030n893n949n786n646n402n353n626n448
$$ 613872 601561 591682 584966 580698 576779 571749 565856 559907 554121 548475 543073 537720 532094 526646
60271E26646m286l021k623k527j727p22o38j189j187n66k41l58l04p8j93m99m61
$$ 526646 522360 519339 516716 514189 512462 511740 511102 509913 508726 508160 507919 507561 507257 507179 506986 506487 506026
60254E06026k12k01k40n1p6n39n78L91J330J056J78K5M69M63J4j12J8q9o3O19
$$ 506026 505814 505613 505373 505322 505246 504707 504129 504520 505850 506906 507084 507109 507578 508041 508055 507943 507961 507872 507809 508428
60234E08428J275J069O72J157K093K486K876M349O148O434N123L811L198K645
$$ 508428 509703 510772 511444 512601 514694 517180 520056 524405 530553 536987 542110 545921 549119 551764
60220E51764K146K572L871M914N337N884O807P544P994Q615R219R098Q318P569
$$ 551764 553910 556482 560353 565267 570604 576488 583295 590839 598833 607448 616667 625765 634083 641652
60206F41652O952O188N655N745N643M351K550J783K103K179J441M32o70k132l464
$$ 641652 648604 654792 660447 666192 671835 676186 678736 680519 682622 684801 686242 686674 686004 683872 680408
60191F80408l879l859m596n997o788o499n788n085m419m269m934n416m556l004
$$ 680408 676529 672670 668074 662077 655289 648790 643002 637917 633498 629229 624295 618879 614323 611319
60177F11319k277k281j667l80K57o6k01L33O33J00p79j537k160k329j724j034
$$ 611319 609042 606761 605094 604714 604971 604905 604704 605037 605670 605770 604991 603454 601294 598965 597241 596207
60161E96207j231j957k093j611j333j179l93P63J298J267J510J928J805J559K207
$$ 596207 594976 593019 590926 589315 587982 586803 586410 587173 588471 589738 591248 593176 594981 596540 598747
60146E98747L326L487K639K115K364K668K940L769M700M603L782L727M646N231
$$ 598747 602073 605560 608199 610314 612678 615346 618286 622055 626755 631358 635140 638867 643513 648744
60132F48744M932M475M132L497L014L543M348L737J896Q84J489K325K362K159
$$ 648744 653676 658151 662283 665780 668794 672337 676685 680422 682318 683202 684691 687016 689378 691537
60118F91537K175J979J681K037K650K140N38m99m15n60j679k760l082l390m214
$$ 691537 693712 695691 697372 699409 702059 704199 704737 704238 703823 703263 701584 698824 695742 692352 688138
60103F88138m842m795m630m585m093l167k612k426j730o69m58j120j175r5Q71
$$ 688138 683296 678501 673871 669286 665193 662026 659414 656988 655258 654589 654131 653011 651836 651741 652612
60088F52612R32Q49J171J289Q80M60m1j330k928l331k571k428l566m614m832n268
$$ 652612 653544 654393 655564 656853 657733 658193 658152 656822 653894 650563 647992 645564 641998 637384 632552 627284
60072F27284o381o876o175n756o601p296o267m199k763k346k416k791l272l181
$$ 627284 620903 614027 607852 602096 595495 588199 581932 577733 574970 572624 570208 567417 564145 560964
60058E60964k313j370p74j90L12J26m21o4J308K325K441K796M035N179N432N374
$$ 560964 558651 557281 556507 556317 556629 556755 556334 556270 557578 559903 562344 565140 569175 574354 579786 585160
60042E85160N478N202M398L858L695K854J029p17j847l042m377m866m493m643
$$ 585160 590638 595840 600238 604096 607791 610645 611674 610957 609110 606068 601691 596825 592332 587689
60028E87689n685o340o157o304p002o640m717l143l215l670l228k793l376m059
$$ 587689 582004 575664 569507 563203 556201 549561 544844 541701 538486 534816 531588 528795 525419 521360
60014E21360l860l580l983m046k959j977k308k903k328j236r53j163r33o84j205
$$ 521360 517500 513920 509937 505891 502932 500955 498647 495744 493416 492180 491227 490064 489131 488447 487242
59999D87242j853j622q43k32N96K062L319L589L560M035M434M140L942M592N261
$$ 487242 485389 483767 482924 482692 483288 485350 488669 492258 495818 499853 504287 508427 512369 516961 522222
59984E22222M927L992L067J572q35k935l589l457l510l355k538j951k309k701
$$ 522222 527149 531141 534208 535780 534945 532010 528421 524964 521454 518099 515561 513610 511301 508600
59970E08600k334k089k667k853j589j30J2l16M63J790K112J620J496J555R59L32
$$ 508600 506266 504177 501510 498657 497068 496938 496950 496634 497097 498887 500999 502619 504115 505670 506629 506961
59954E06961P70J600J382M26R9L64K01j90J34P17K40j086j832j724j790k295k380
$$ 506961 507731 509331 510713 511139 511238 511602 511803 511613 511747 512464 512704 511618 509786 508062 506272 503977 501597
59937E01597j748j052o30k19K27N68J077J928K592K699K831L479M117M248M470
$$ 501597 499849 498797 498167 497948 498175 498743 499820 501748 504340 507039 509870 513349 517466 521714 526184
59922E26184N335O320P050Q266J0249J1693J1526J0554R786Q579O210L777K688
$$ 526184 531519 537839 544889 553155 563404 575097 586623 597177 606963 615542 621752 625529 628217
59909F28217K545K371K485L193L151J364o03q67l75j194k849l240k298j719j701
$$ 628217 630762 633133 635618 638811 641962 643326 642723 641856 641481 640287 637438 634198 631900 630181 628480
59894F28480r40L30L75q61j373l31P97Q03L09J91L33N23R82J648K218K981M322
$$ 628480 627540 627870 628245 627384 626011 625680 626477 627280 627589 627780 628113 628636 629618 631266 633484 636465 640787
59877F40787N531N498M383L215K161P18p56j353j228j314j755k058k375l098l601
$$ 640787 646318 651816 656199 659414 661575 662293 661537 660184 658956 657642 655887 653829 651454 648356 644755
59862F44755l048j957j412j191m39M28L87r2M03J906L177L861M585N271N276N164
$$ 644755 641707 639750 638338 637147 636708 637136 637523 637431 637834 639740 642917 646778 651363 656634 661910 667074
59846F67074O323Q739J0833J1437J0410P614L176j389m131m831m683m089k522
$$ 667074 673397 682136 692969 704406 714816 722430 725606 724217 720086 715255 710572 706483 703961
59833G03961l86Q35L67j427m151p358r770j0232r316q439p777o669n461m984m617
$$ 703961 703575 704410 704777 703350 699199 691841 682071 671839 662523 654084 646307 639638 634177 629193 624576
59818F24576l047o17J117J911K722L268K138n57k876l761l993m092l438k023j068
$$ 624576 621529 620912 622029 623940 626662 629930 632068 631511 628635 624874 620881 616789 613351 611328 610260
59803F10260j090j023m3J136J435P87k15j047j375j251j247j647j864j507j324
$$ 610260 609170 608147 608104 609240 610675 611462 611247 610200 608825 607574 606327 604680 602816 601309 599985
59788E99985j935k498k105j635k378l629l714k777k397k786k676j769j140j130
$$ 599985 598050 595552 593447 591812 589434 585805 582091 579314 576917 574131 571455 569686 568546 567416
59774E67416r78n19l24j28Q66K164K524K230K780M314N457N782O231O995P095
$$ 567416 566438 565919 565595 565467 566333 568497 571021 573251 576031 580345 585802 591584 597815 604810 611905
59759F11905O443O174O661P122P342P861Q235P297N397M308M483M450L337K022
$$ 611905 618348 624522 631183 638305 645647 653508 661743 669040 674437 678745 683228 687678 691015 693037
59745F93037J317R09N89O45O87j86j604k187j761j569k030k204j748j431j440
$$ 693037 694354 695263 695852 696497 697184 696998 695394 693207 691446 689877 687847 685643 683895 682464 681024
59730F81024j112o55j084k163k397j455n97l59J16J023J319P37L47N63N18p1l50
$$ 681024 679912 679257 678173 676010 673613 672158 671561 671202 671318 672341 673660 674397 674744 675307 675825 675754 675404
59713F75404m0J46K01R36K168K835L183M549O657P546O714N853N920N955N594
$$ 675404 675364 675510 675711 676647 678815 681650 684833 689382 696039 703585 710299 716152 722072 728027 733621
59698G33621O067P675Q758Q396P779P616O576L796Q15o52j032j535k132k348k534
$$ 733621 739688 747363 756121 764517 772296 779912 786488 790284 791099 790447 789415 787880 785748 783400 780866
59683G80866k971l097k700k604l205l775m002m613n667o061n574n501o274o409
$$ 780866 777895 774798 772098 769494 766289 762514 758512 753899 748232 742171 736597 731096 724822 718413
59669G18413n020l430k921k720j699m01K10N39J348K223K502K700L615M982O075
$$ 718413 713393 709963 707042 704322 702623 702222 702432 702971 704319 706542 709044 711744 715359 720341 726416
59654G26416O812P294P230O552N640M380K190o41k970m597o464q682j0098j0414
$$ 726416 733228 740522 747752 754304 759944 764324 766514 765873 762903 758306 751842 743160 733062 722648
59640G22648j0834j1842j2232j1214r660q256o346l682j550r32j150j459k321
$$ 722648 711814 699972 687740 676526 666866 658610 652264 648582 647032 646100 644950 643491 641170
59627F41170m008n546o248o803p770q494q500q399q453p871o498n496n335m872
$$ 641170 637162 631616 625368 618565 610795 602301 593801 585402 576949 569078 562580 557084 551749 546877
59613E46877l503k308j915j145Q03K607K837K107J721J634J219O67K93k74j002
$$ 546877 543374 541066 539151 538006 538809 541416 544253 546360 548081 549715 550934 551601 551894 551620 550618
59598E50618r38J56J090J208J448K413L094K749K242K232J836M94n79l25M23O00
$$ 550618 549680 549836 550926 552134 553582 555995 559089 561838 564080 566312 568148 568642 568063 567738 568161 568761
59582E68761N58O64Nj770l117k859k258k931m229m587m111l942m083l813l218
$$ 568761 569319 569983 569988 568218 565101 562242 559984 557053 552824 548237 544126 540184 536101 532288 529070
59567E29070k764k153j093k60k19m42m53p07j223r51L53J190O69N0N26J188R01
$$ 529070 526306 524153 523060 522800 522581 522139 521686 520979 519756 518805 519158 520348 521017 521067 521593 522781 523682
59550E23682M56J046K142K790L473M764N677N431N437P361J0503J3362J6510K1248
$$ 523682 524138 525184 527326 530116 533589 538353 544030 549461 554898 562259 572762 586124 602634 623882
59536F23882K6017K6723K0922J0290q42q396j0744r437p415n924m015j255R76
$$ 623882 649899 676622 697544 707834 706992 698596 687852 678415 671000 665076 661061 659806 660782
59523F60782J806K377L501L841K186k79j868k917m476o109p018p822r144r908
$$ 660782 662588 664965 668466 672307 674493 674214 672346 669429 664953 658844 651826 644004 634860 624952
59509F24952r192q295q689r290q146n675l804k929k098j302j206j368q46M8N49
$$ 624952 615760 607465 598776 589486 581340 575665 571861 568932 566834 565532 564326 562958 562112 562160 562709
59494E62709J042K096K866K476J837K070K342J506O49J491L260L731K661J726
$$ 562709 563751 565847 568713 571189 573026 575096 577438 578944 579593 581084 584344 588075 590736 592462
59480E92462J676J916K346L306M183M207M045M534M705L223R66k42o29j635k853
$$ 592462 594138 596054 598400 601706 605889 610096 614141 618675 623380 626603 627569 627327 626698 625063 622210
59465F22210k577j019j68n15n75L23J290K058L528N790P618Q373Q615Q688Q308
$$ 622210 619633 618614 618446 617931 617356 617679 618969 621027 624555 630345 637963 646336 654951 663639 671947
59450F71947P614P028O254M883L509K659J196k172o315q774r057q719q469p541
$$ 671947 679561 686589 692843 697726 701235 703894 705090 702918 696603 687829 678772 670053 661584 654043
59436F54043n920m830m651m394l640l197l447l649l214k250p84J233L192M507
$$ 654043 648123 643293 638642 634248 630608 627411 623964 620315 617101 614851 614067 615300 618492 622999
59422F22999N958Q757J2444J5277J6674J7599J8530J8962J9302K1432K6038L0148
$$ 622999 628957 637714 650158 665435 682109 699708 718238 737200 756502 777934 803972 834120
59410H34120K8551J8251J780j4033k3241k5063k2725j8847j3441o062K590J1483
$$ 834120 862671 880922 882702 868669 845428 820365 797640 778793 765352 759290 761880 773363
59398G73363J9068K1494J4469r36j6953k6187k8117k6633k3901j9866j5444j2227
$$ 773363 792431 813925 828394 827458 810505 784318 756201 729568 705667 685801 670357 658130
59386F58130r867p090m495l364k725o43K230L594L349L486M553N253N206N231
$$ 658130 648263 641173 636678 633314 630589 629946 632176 635770 639119 642605 647158 652411 657617 662848
59372F62848N139M088K905L326N060O232O442O830P473P460P274Q332J0288J1525
$$ 662848 667987 672075 674980 678306 683366 689598 696040 702870 710343 717803 725077 733409 743697 755222
59358G55222J2027J3069J4288J4053J2632J2059J2746J3127J2745J2881J3827
$$ 755222 767249 780318 794606 808659 821291 833350 846096 859223 871968 884849 898676
59347H98676J4337J4108J4213J4704J4281J2666J0859Q930N919K096j094l420
$$ 898676 913013 927121 941334 956038 970319 982985 993844 1002774 1008693 1010789 1009695 1006275
59335A006275n824q188r598j0650j2775j5377j6429j5813j5276j5103j3936j1862
$$ 1006275 1000451 992263 982665 972015 959240 943863 927434 911621 896345 881242 867306 855444
59323H55444j0607j0337r483p938p309p551o691m480l051l153k991j734r52j388
$$ 855444 844837 834500 825017 817079 809770 802219 795528 791048 787997 784844 781853 780119 779167 777779
59309G77779j440k32O18p6r83n63P65K125L691N453O614P374R387J3223J6977
$$ 777779 776339 776107 776725 776649 775666 775103 775868 777993 781684 787137 793751 801125 810512 823735 840712
59294H40712J8147J5257P691l642j5028k2002k3615k2640k1223j8935j5527j2450
$$ 840712 858859 874116 881807 878165 863137 841135 817520 794880 773657 754722 739195 726745
59282G26745j0446q372n607l248j769L6K631M671N473O216P527Q266P894P692
$$ 726745 716299 707927 702320 699072 697303 697339 699970 704641 710114 716330 723857 732123 740017 747709
59268G47709Q418Q934Q349P394O520M873K258n2j557l350n735p315p572p979r337
$$ 747709 756127 765061 773410 780804 787324 792197 794455 794403 792846 789496 783761 776446 768874 760895 751558
59253G51558j0341j0053r528r563r176p644n958m868l542j551k9M60J150K760
$$ 751558 741217 731164 721636 712073 702897 695253 689295 684427 680885 679334 679305 679765 680915 683675
59239F83675M056M073L815M328N034N239N352N338M020J314q45j248j198k128
$$ 683675 687731 691804 695619 699947 704981 710220 715572 720910 724930 726244 725399 724151 722953 720825
59225G20825l375l736l482l372l288l088l225l508k890j393m91o88p26J4N28N06
$$ 720825 717450 713714 710232 706860 703572 700484 697259 693751 690861 689468 688977 688289 687563 687577 688105 688611
59209F88611J270L256M863N111N056N358M821K920J375J512K141J783J004Q69
$$ 688611 689881 693137 698000 703111 708167 713525 718346 721266 722641 724153 726294 728077 729081 729950
59195G29950R36N04Q5J18l0n17k63J006J835J470J132J616J773Q29P5O46J585
$$ 729950 730886 731390 731475 731593 731563 731046 730783 731789 733624 735094 736226 737842 739615 740444 740519 741165 742750
59178G42750J737J582J679J306J78l57N44J746K306L118N013P084Q470R694J0855
$$ 742750 744487 746069 747748 749054 749232 748875 749419 751165 753471 756589 761602 768686 777156 786850 797705
59163G97705J0621Q593O677O334O416N349L445J532o72l117m466m285m260n536
$$ 797705 808326 816919 823596 829930 836346 841695 845140 846672 846000 842883 838417 834132 829872 824336
59149H24336o852o927o662p238q042q259q562r525j0262j0285j0622j1604j1645
$$ 824336 817484 810557 803895 796657 788615 780356 771794 762269 752007 741722 731100 719496 707851
59136G07851r971q262p895p772o749n780n679n085k884n06M54Q20J937L233L800
$$ 707851 697880 689618 681723 673951 667202 661422 655743 650658 647774 647268 647722 648542 650479 653712 657512
59121F57512M441N986P530Q371R667J2148J4235J4623J4556J5397J6111J5473
$$ 657512 661953 667939 675469 683840 693507 705655 719890 734513 749069 764466 780577 796050
59109G96050J4528J4501J4361J2961J1451J1087J0649Q624N940L961J816j580
$$ 796050 810578 825079 839440 852401 863852 874939 885588 894212 900152 904113 905929 904349
59097I04349m812o086o253o893p202n679l304k039j642p27K70l0j363k651m103
$$ 904349 899537 893451 887198 880305 873103 867424 864120 862081 860439 859712 859982 859952 858589 855938 851835
59082H51835o146p614p414o634o672o860o200n740o745q141q325p905q137q292
$$ 851835 845689 838075 830661 824027 817355 810495 804295 798555 791810 783669 775344 767439 759302 751010
59068G51010p216n821n498n622n160m978n928o504n217l497l376m107l920l344
$$ 751010 743794 737973 732475 726853 721693 716715 710787 704283 699066 695569 692193 688086 684166 680822
59054F80822l642l824k428o56m14p61K87J906J864M91j38P5k90j006p06L02Q04
$$ 680822 677180 673356 670928 670272 669858 669097 669384 671290 673154 673645 673507 673582 673292 672286 671580 671882 672686
59037F72686J199K400L394K908K244L303N134N671N544O690Q440Q746Q266R458
$$ 672686 673885 676285 679679 682587 684831 688134 693268 698939 704483 711173 719613 728359 736625 746083
59023G46083J2216J4100J4426J4659J5009J4047J1497Q429N003Q75k698m048l922
$$ 746083 758299 772399 786825 801484 816493 830540 842037 850466 855469 856344 853646 849598 845676
59010H45676m303n078m675l214k057r93J099L547M778N229O434P946Q076O862
$$ 845676 841373 836295 831620 828406 826349 825356 826455 830002 834780 840009 846443 854389 862465 869327
58996H69327N487L712Q19k047l507m705p255r765r905q600q467r239q731p323
$$ 869327 874814 878526 879345 877298 873791 869086 861831 852066 842161 833561 825094 815855 807124 799801
58982G99801p160p680o212k832l17O11J964M287N769N874O203P298P976Q057Q483
$$ 799801 792641 784961 778749 775917 775600 776211 778175 782462 788231 794105 800308 807606 815582 823639 832122
58967H32122Q745P513N745N768P260P663O508N769N864N002K830J030j75k620
$$ 832122 840867 848380 854125 859893 867153 874816 881324 887093 892957 897959 900789 901819 901644 899024
58953H99024o629j0081j1729j2495j2989j2586j1450j0677j0122q616o427m955
$$ 899024 892395 882314 870585 858090 845101 832515 821065 810388 800266 791650 785223 780268
58941G80268m143k866j565j626k507k491j834k114k978k802k024k338l060j989
$$ 780268 776125 773259 771694 770068 767561 765070 763236 761122 758144 755342 753318 750980 747920 745931
58927G45931M15J460O04k31n31j463k414j329J240K403J638J488L085M752N530
$$ 745931 746346 747806 748410 748179 747648 746185 743771 742442 743682 746085 747723 749211 752296 757048 762578
58912G62578O544Q167R263R765J0753J1719J1044R441R427J1125J2047J1247J0148
$$ 762578 769122 777289 786552 796317 807070 818789 829833 839274 848701 859826 871873 883120 893268
58899H93268R160P188M704L649L878L389K216K462M276N720O775R416J3349J5823
$$ 893268 902428 909616 914320 917969 921847 925236 927452 929914 934190 939910 946685 956101 969450 985273
58885I85273J6113J6136J6168J4184J0207O991N490L649N77k033l501n200p170
$$ 985273 1001386 1017522 1033690 1047874 1058081 1065072 1070562 1074211 1074788 1072755 1069254 1064054 1056884
58872A056884p626o618o374p223p277o685p937j1072j3084j3075j3555j5538j6789
$$ 1056884 1049258 1042640 1036266 1029043 1021766 1015081 1007144 996072 982988 969913 956358 940820 924031
58859I24031j6277j5945j6624j6499j5110j4603j5433j5119j2874j1171j1110
$$ 924031 907754 891809 875185 858686 843576 828973 813540 798421 785547 774376 763266
58848G63266j0529q514p431q470r358q591p888q408q522p460p202q497q831o655
$$ 763266 752737 744223 736792 728322 718964 710373 702485 694077 685555 678095 670893 662396 653565 646910
58834F46910m076l094k723j886j635k366k310p98K41j28j70R74J613J120J416
$$ 646910 642834 639740 637017 635131 633496 631130 628820 628022 628263 628135 627965 628939 630552 631672 633088
58819F33088L175M286L835L737M692M563K671J533K223K238K12j438r79m17j474
$$ 633088 636263 640549 644384 648121 652813 657376 660047 661580 663803 666041 666253 664815 663836 663419 661945
58804F61945k509k054j632k367k587j351o35j446j611q9M90j540l551l020j501
$$ 661945 659436 657382 655750 653383 650796 649445 648810 647364 645753 645664 646154 644614 641063 638043 636542
58789F36542j154q14J127L319M117M656O224P559P540P581Q703R272Q274P615
$$ 636542 635388 634574 635701 639020 643137 647793 654017 661576 669116 676697 685400 694672 702946 710561
58775G10561Q492Q779O714L907J991l61m214p528q435q270q641q626p532p070
$$ 710561 719053 727832 734546 738453 740444 740083 735869 728341 719906 711636 702995 694369 686837 679767
58761F79767q053q294o494m756m640m293k396j128k084k993j781k77m88p27R33
$$ 679767 671714 663420 656926 652170 647530 643237 640841 639713 637629 634636 632855 632578 632090 631363 632296
58746F32296K769K717K311L756N935O876P321Q497R145Q124P130P755Q601Q252
$$ 632296 635065 637782 640093 643849 649784 656660 663981 672478 681623 689747 696877 704632 713233 721485
58732G21485Q002Q811Q851P042N599N967N800L261O45L25O97k01p34R07K845K934
$$ 721485 729487 738298 747149 754191 759790 765757 771557 774818 775463 775788 776485 776284 775550 776457 779302 782236
58716G82236K605L590M199K751J166J257R47j754m573m981m932p172j0217j1476
$$ 782236 784841 788431 792630 795381 796547 797804 798751 796997 792424 787443 782511 775339 765122 753646
58702G53646j2107j4182j6116j5692j4673j5685j7205j6369j4102j2936j2195
$$ 753646 741539 727357 711241 695549 680876 665191 647986 631617 617515 604579 592384
58691E92384r963p344o398o123m781l691m550n606m707l445m026m800l321j097
$$ 592384 582421 575077 568679 562556 557775 554084 549534 543928 539221 535776 531750 526950 523629 522532
58677E22532p52j146Q9J814J811J359K828N070N728N693O982Q735R555J1020J4383
$$ 522532 521780 520634 520723 522537 524348 525707 528535 533605 539333 545026 552008 560743 570298 581318 595701
58662E95701J6774J5182J1341Q182M688q70n991p605p563r048j0514q911o083
$$ 595701 612475 627657 638998 647180 651868 650998 645007 637402 629839 620791 610277 601366 595283
58649E95283n900p435p037n029m489n190m552k956k606k738j205Q44J028N58J878
$$ 595283 589383 581948 574911 569882 565393 560203 555651 552695 550089 547351 546146 546990 548018 548576 550454
58634E50454L610L014J369J541K478J507j09M35J778Q42j048m44J803K259J249
$$ 550454 554064 557078 558447 559988 562466 563973 563864 564299 566077 566919 565871 565427 567230 569489 570738
58619E70738J638L005K895K183L451N600N745M733N224O165M863K551K131K467
$$ 570738 572376 575381 578276 580459 583910 589510 595255 599988 605212 611377 616240 618791 620922 623389
58605F23389R04q82K45K356J479j017q43J239R59j587k614j876k156k725m01L745
$$ 623389 624293 623411 623656 626012 627491 626474 625631 626870 627829 626242 623628 621752 619596 616871 616470 620215
58589F20215N677N632P283J0572J2139J2078J3393J5443J4782J1940J0599J0712
$$ 620215 625892 631524 638807 649379 661518 673596 686989 702432 717214 729154 739753 750465
58577G50465R064O041N023N777N212L944N198Q041Q827Q632J1823J7863K1960
$$ 750465 759529 765570 770593 776370 781582 785526 790724 798765 807592 816224 828047 845910 867870
58564H67870K3523K6325L0507L2150L0909L0351L0404K7054K0116J3886R495M060
$$ 867870 891393 917718 948225 980375 1011284 1041635 1072039 1099093 1119209 1133095 1142590 1146650
58552A146650k092m891m173m435o909q039o857o821r049j0763j1590j4624j9914
$$ 1146650 1144558 1139667 1135494 1131059 1124150 1116111 1109254 1102433 1093384 1082621 1071031 1056407 1036493
58539A036493k3606k4679k6100k8336k8228k5346k3007k2010j9717j6004j3694
$$ 1036493 1012887 988208 962108 933772 905544 880198 857191 835181 815464 799460 785766
58528G85766j2621r773n748m259m937l636k45J057k57k44J774K173M54J45J504
$$ 785766 773145 763372 757624 753365 748428 744792 744547 745604 745347 745103 746877 749050 749504 749649 751153
58513G51153Q94j672k019J36M34j795k336m26k18k459k760p9J107r06k242j074
$$ 751153 752047 750375 748356 748492 748926 747131 744795 744369 744151 741692 738932 738853 739960 739054 736812 735738
58497G35738m79j641j508O78J733J182K360N311O076M574N463R516J1991J1446
$$ 735738 735259 733618 732110 732788 734521 735703 738063 743374 749450 754024 759487 769003 780994 792440
58483G92440J2152J5736J8468J9035K0965K4961K6639K4366K1642J9562J4752
$$ 792440 804592 820328 838796 857831 878796 903757 930396 954762 976404 995966 1010718
58472A010718P012J032j758n107r622j0836p932n929o703o082k508q9l12Q39M625
$$ 1010718 1017730 1018762 1017004 1011897 1002275 991439 983507 977578 970875 964793 962285 962196 961884 962723 967348
58457I67348O838O192O933J0221J1462R098P407P604N014j698p397r780j2896
$$ 967348 974186 980378 987311 997532 1008994 1018092 1025499 1033103 1038117 1036419 1029022 1019242 1006346
58444A006346j8048k0358j8047j5996j6325j4548r002m803m283k730K002M873
$$ 1006346 988298 967940 949893 933897 917572 903024 894022 889219 884936 882206 884208 889081
58432H89081L258K138M982Q182R147J1141J5451J7566J5717J4565J5941J4851
$$ 889081 892339 894477 899459 907641 916788 927929 943380 960946 976663 991228 1007169 1022020
58420A022020R150L989K148p26o542j0018q557p362r583j0817q562p469r812j0392
$$ 1022020 1031170 1035159 1037307 1036581 1030039 1020021 1011464 1004102 994519 983702 975140 967671 957859 947467
58406I47467o577l686m753m666l94K873J831J491N216Q109O798O068R226J1443
$$ 947467 940890 937204 932451 927785 927391 930264 932095 933586 938802 946911 953709 959777 969003 980446
58392I80446R251P186Q436Q570N024K996N368O720L993K785O301Q552N688L481
$$ 980446 989697 996883 1005319 1013889 1018913 1021909 1027277 1033997 1037990 1040775 1047076 1055628 1061316 1064797
58378A064797O078Q023N239L114N659P363M198K019N413Q810P421O407J0238J3545
$$ 1064797 1070875 1078898 1084137 1087251 1092910 1100273 1104471 1106490 1111903 1120713 1128134 1134541 1144779 1158324
58364A158324J1680R933J2945J5580J3457J1901J4926J6274J1193O163O863P592
$$ 1158324 1170004 1179937 1192882 1208462 1221919 1233820 1248746 1265020 1276213 1282376 1289239 1296831
58352A296831L006q29J993N623L693J342M554Q248O633M981R192J3962J3193J2023
$$ 1296831 1299837 1299008 1301001 1306624 1310317 1311659 1316213 1324461 1331094 1336075 1345267 1359229 1372422 1384445
58338A384445J6458K1265K0277J8526K1945K5225K2247J8396J9958K1568J6759
$$ 1384445 1400903 1422168 1442445 1460971 1482916 1508141 1530388 1548784 1568742 1590310 1607069
58327A607069J0759J0119J0093N045Q31L706P609N628L320P295J1732R913P861
$$ 1607069 1617828 1627947 1638040 1643085 1643916 1647622 1655231 1660859 1664179 1671474 1683206 1693119 1700980
58314A700980J2465J7481J5733J3516J8116K2916K0173J6697K0905K6194K3603
$$ 1700980 1713445 1730926 1746659 1760175 1778291 1801207 1821380 1838077 1858982 1885176 1908779
58303A908779J9234K2259K7168K5032K1026K3386K6504K2452J7883K1600K6959
$$ 1908779 1928013 1950272 1977440 2002472 2023498 2046884 2073388 2095840 2113723 2135323 2162282
58292B162282K4597K0801K4898L0496K8170K4558K9461L6207L4683L1417L6478
$$ 2162282 2186879 2207680 2232578 2263074 2291244 2315802 2345263 2381470 2416153 2447570 2484048
58281B484048M3103M1162L8006M4485N3206N2647M9720N5602O2667N8989N2453
$$ 2484048 2527151 2568313 2606319 2650804 2704010 2756657 2806377 2861979 2924646 2983635 3036088
58270C036088N6150O3200O0889N6239O1866P0153O8050O3814P1488Q2531Q1191
$$ 3036088 3092238 3155438 3216327 3272566 3334432 3404585 3472635 3536449 3607937 3690468 3771659
58259C771659P4514P7939Q4743Q0000P1323P4653Q2879Q0311P4845Q3059R6899
$$ 3771659 3846173 3924112 4008855 4088855 4160178 4234831 4317710 4398021 4472866 4555925 4652824
58248D652824R8841R6467J07312J23173J25496J22373J33184J50311J54285J52938
$$ 4652824 4751665 4848132 4955444 5078617 5204113 5326486 5459670 5609981 5764266 5917204
58238E917204J66023J85145J89878J89195K04582K26790K33372K34052K52792
$$ 5917204 6083227 6268372 6458250 6647445 6852027 7078817 7312189 7546241 7799033
58229G799033K80321K92223K98282L23774L58199L75246L86863M22135M69593
$$ 7799033 8079354 8371577 8669859 8993633 9351832 9727078 10113941 10536076 11005669
58220A1005669M98643N20691N67584O27701O68856P05825P75571Q64632R35273
$$ 11005669 11504312 12025003 12592587 13220288 13889144 14594969 15370540 16235172 17170445
58211A7170445J004001J114590J253681J378905J510088J700139J937092K175771
$$ 17170445 18174446 19289036 20542717 21921622 23431710 25131849 27068941 29244712
58203B9244712K444565K811090L265634L760958M344801N119108O093801P230999
$$ 29244712 31689277 34500367 37766001 41526959 45871760 50990868 57084669 64315668
58195F4315668Q602598J0329283J2402687J4785285J7655978K1307974K5852217
$$ 64315668 72918266 83247549 95650236 110435521 128091499 149399473 175251690
58188A75251690L1309327L7742164M4414099M8477168M5503156L2735643J2240178
$$ 175251690 206561017 244303181 288717280 337194448 382697604 415433247 427673425
58181D27673425r679877k6598108l5681677l8049019l6604367l3909330l1307456
$$ 427673425 417993548 391395440 355713763 317664744 281060377 247151047 215843591
58174B15843591k8985693k6518023k3588946k0374635j7287270j4541578j2124610
$$ 215843591 186857898 160339875 136750929 116376294 99089024 84547446 72422836
58167G2422836j0036104q327481o957749n808793m837026m070689l478334k971747
$$ 72422836 62386732 54059251 47101502 41292709 36455683 32384994 28906660 25934913
58159B5934913k525221k173862j904884j658444j427101j253543j134732j020017
$$ 25934913 23409692 21235830 19330946 17672502 16245401 14991858 13857126 12837109
58151A2837109r00162q12154p57759o97380o24180n69880n36516m91892m33555
$$ 12837109 11936947 11124793 10367034 9669654 9045474 8475594 7939078 7447186 7013631
58142G013631l92118l69831l37203k91607k60954k48194k28030j99810j89665
$$ 7013631 6621513 6251682 5914479 5622872 5361918 5113724 4885694 4685884 4496219
58133D496219j98072j96698j79804j69872j70312j60189j38548j27888j30270
$$ 4496219 4298147 4101449 3921645 3751773 3581461 3421272 3282724 3154836 3024566
58124C024566j23867j06213r8357j02799r8769q3033p5256p8797p5051o1119n5448
$$ 3024566 2900699 2794486 2696129 2593330 2494561 2411528 2336272 2257475 2182424 2121305 2065857
58113B065857o1248o0638n0092m6508n3045n3118m3591m0712m7634m8389l9548
$$ 2065857 2004609 1943971 1893879 1847371 1794326 1741208 1697617 1656905 1609271 1560882 1521334
58102A521334l6472m2385m2042l2099k7805l3274l4014k5493k0990k4562k3565
$$ 1521334 1484862 1442477 1400435 1368336 1340531 1307257 1273243 1247750 1226760 1202198 1178633
58091A178633j4708j0994j6062j7205j0499p873j2821j3662p443o421j4127j8451
$$ 1178633 1163925 1152931 1136869 1119664 1109165 1101292 1088471 1074809 1067366 1060945 1046818 1028367
58079A028367j5119j5103k2081k5078k0364j8564k3214k3776j6878j3372j7260
$$ 1028367 1013248 998145 976064 950986 930622 912058 888844 865068 848190 834818 817558
58068H17558j8253j2250r079j2824j4157r329p382j1472j1954n247j133m203o051
$$ 817558 799305 787055 777976 765152 750995 741666 734284 722812 710858 705611 704478 700275 694224
58055F94224k826k628q449j1342p626n739r078r124k709Q25l022n836k861j404
$$ 694224 691398 688770 680321 668979 661353 655614 646536 637412 634703 635528 632506 626670 623809 622405
58041F22405n424p591m206k628o371p921l721j455n068p161l723j956n971q816
$$ 622405 616981 609390 605184 602556 596185 588264 584543 583088 578020 570859 567136 565180 559209 550393
58027E50393o252m698p914r419n583l045n668p119l676j508m048n001j104R39
$$ 550393 544141 539443 531529 522110 516527 513482 507814 500695 497019 495511 491463 486462 485358 486297
58013D86297k430m334o77J962p87k747N68L471J664M95L694N549K209l71K162
$$ 486297 483867 479533 478856 480818 480031 477284 477852 481323 482987 483482 487176 492725 494934 494563 496725
57998D96725M241J313j655m27L83k771m810k279p75m200o719l509L12m91k105
$$ 496725 500966 502279 500624 500197 500580 497809 492999 490720 489945 485745 479026 475517 475829 475338 473233
57983D73233l04J205r83k560k01J312j592l782r90K007N80j137J221L645J758
$$ 473233 472929 474134 473151 470591 470390 471702 470110 466328 465338 467345 467925 466788 468009 471654 473412
57968D73412p68L16J758Oj375Q87K682M07j719K65K320K39k251r03R97m98k203
$$ 473412 472644 472960 474718 474724 473349 474236 476918 477325 475606 475871 478191 478430 476179 475276 476273 475775 473572
57951D73572m93J365L2q72J979M460K602M36K547N742N773N536Q699J1854J1027
$$ 473572 473079 474444 474476 473604 475583 480043 482645 483081 485628 491370 497143 502679 511378 523232 534259
57936E34259R623J2005J5256J5156J4173J5616J6054J1619O015M075L022j701
$$ 534259 543882 555887 571143 586299 600472 616088 632142 643761 649776 653851 656873 655172
57924F55172p406r291r410j2155j5560j5344j3237j3258j3797j1182p240n848
$$ 655172 647766 638475 629065 616910 601350 586006 572769 559511 545714 534532 527292 521444
57912E21444n668l417n40J86O64L482N975M975L182M182N561L786J351K034L412
$$ 521444 515776 512359 511819 512005 512669 516151 522126 527101 530283 534465 540026 543812 545163 547197 550609
57897E50609J484j399o78K162K798J995L052M780M094K496L080M137K473p8j5
$$ 550609 552093 550694 550016 552178 554976 556971 560023 564803 568897 571393 574473 578610 581083 581005 580990
57882E80990J113j72k526k683j903l107m702l674j792k392l930l033r28o66j038
$$ 580990 582103 581931 579405 576722 574819 571712 567010 563336 561544 559152 555222 552189 551261 550595 549557
57867E49557N90K610K469K377N337Q830Q893P296Q104J0219J0039Q591R203J0822
$$ 549557 550147 552757 555226 557603 562940 571770 580663 587959 596063 606282 616321 624912 634115 644937
57853F44937J0291Q696Q898R278O556K436Q89J179r4k382l001l136n579q744r156
$$ 644937 655228 663924 672822 682100 688656 691092 691981 693160 693066 690684 687683 684547 678968 670224 661068
57838F61068p812p878q532p120m936m679m726k274N69L41q73J034M397M630K508
$$ 661068 653256 645378 636846 629726 624790 620111 615385 613111 613680 614021 613148 614182 618579 623209 625717
57823F25717K309L803L347J335J175K336J515n12k38J661J649K70P57K007J34
$$ 625717 628026 631829 635176 636511 637686 640022 641537 641025 640787 642448 644097 644367 645124 647131 647265
57808F47265l963n721m861n044o284n001j407L65l45j2K137L113K365K596L920
$$ 647265 643302 637581 632720 627676 621392 616391 614984 615349 615004 614992 617129 620242 622607 625203 629123
57793F29123L481J436J310L701N346N045N070O274P083P643R695J2237J2450J1013
$$ 629123 632604 634040 635350 639051 644397 649442 654512 660786 667869 675512 685207 697444 709894 720907
57779G20907J1237J2997J2892J0337Q128P058N274K965K232K334M48k863m356
$$ 720907 732144 745141 758033 768370 776498 783556 788830 791795 794027 796361 796809 793946 789590
57766G89590m065n067p455q229p217p323q689q408o338n455n982m910k048p25
$$ 789590 785525 780458 773003 764774 757557 750234 741545 733137 726799 721344 715362 710452 708404 707679
57752G07679j626j556P02K653L271M535O732P427O288N960P095P216N649M743
$$ 707679 706053 704497 705199 707852 711123 715658 722390 729817 736105 742065 749160 756376 762025 766768
57738G66768N287N383M728N293O905O941N233M576N507N405L622K627L153K992
$$ 766768 772055 777438 782166 787459 794364 801305 806538 811114 816621 822026 825648 828275 831428 834420
57724H34420J608J212K211K314J109R34K179K398J038M18J118R88l03m84O74O82
$$ 834420 836028 837240 839451 841765 842874 843808 845987 848385 849423 849841 850959 851947 851644 851160 851834 852516
57708H52516p02p72Q92J447J56k14J327K342J961K581N020O789O840P209Q322
$$ 852516 851814 851042 851934 853381 853537 853323 854650 856992 858953 861534 866554 873343 880183 887392 895714
57693H95714P462L833M63q02j680l091l084j104K84L2N80L142N370N924O963R852
$$ 895714 903176 907009 907472 906670 904990 901899 898815 897711 897995 898027 898607 901749 907119 913043 920006 929858
57677I29858J2566J3713J5113J8124K1315K4094K8643L5942M3805N1341O1207
$$ 929858 942424 956137 971250 989374 1010689 1034783 1063426 1099368 1143173 1194514 1255721
57666A255721P4312Q5203Q5678P1062M2121M557l1742n6985o8126o9371o5433
$$ 1255721 1330033 1415236 1500914 1571976 1614097 1618654 1586912 1529927 1461801 1392430 1326997
57655A326997n7605m7066l7166k9952k4081j8241j3319r601n589j370O12k6l10
$$ 1326997 1269392 1222326 1185160 1155208 1131127 1112886 1099567 1089966 1084377 1083007 1083619 1083593 1083283
57642A083283J288K665K509K705M262N015L798K852L672M379L658L386M746N706
$$ 1083283 1084571 1087236 1089745 1092450 1096712 1101727 1105525 1108377 1112049 1116428 1120086 1123472 1128218 1133924
57628A133924M976M579N745O187M447K992L836M826L701K301L100M790M982M416
$$ 1133924 1138900 1143479 1149224 1155411 1159858 1162850 1166686 1171512 1175213 1177514 1180614 1185404 1190386 1194802
57614A194802M955N941N951N779O543P111O351N541N813N718M182L192M566O581
$$ 1194802 1199757 1205698 1211649 1217428 1223971 1231082 1237433 1242974 1248787 1254505 1258687 1261879 1266445 1273026
57600A273026O897O357O836P598O992N693N244N196M526M009M605N303N064M980
$$ 1273026 1279923 1286280 1293116 1300714 1307706 1313399 1318643 1323839 1328365 1332374 1336979 1342282 1347346 1352326
57586A352326O181P552P811P762Q326Q562P838P560Q478Q803P326N854O071O639
$$ 1352326 1358507 1366059 1373870 1381632 1389958 1398520 1406358 1413918 1422396 1431199 1438525 1444379 1450450 1457089
57572A457089O003N412O279P174O436N417O068P511P965Q001Q841R608R220Q976
$$ 1457089 1463092 1468504 1474783 1481957 1488393 1493810 1499878 1507389 1515354 1523355 1532196 1541804 1551024 1560000
57558A560000J0227J1481J0833R382R228R935R987R941J1015J2267J2237J1845
$$ 1560000 1570227 1581708 1592541 1601923 1611151 1621086 1631073 1641014 1652029 1664296 1676533 1688378
57546A688378J2735J4157J4333J3534J3109J2896J2181J1694J2128J2302J1298
$$ 1688378 1701113 1715270 1729603 1743137 1756246 1769142 1781323 1793017 1805145 1817447 1828745
57535A828745J0567J1384J2135J0989R357R641J1191J1690J1057J0933J1496J1891
$$ 1828745 1839312 1850696 1862831 1873820 1883177 1892818 1904009 1915699 1926756 1937689 1949185 1961076
57523A961076J2551J4246J5813J5654J4497J4127J4451J4284J3873J4136J4551
$$ 1961076 1973627 1987873 2003686 2019340 2033837 2047964 2062415 2076699 2090572 2104708 2119259
57512B119259J4262J4120J5169J6348J6078J5006J4833J5531J5903J5725J5346
$$ 2119259 2133521 2147641 2162810 2179158 2195236 2210242 2225075 2240606 2256509 2272234 2287580
57501B287580J4458J3207J2971J4128J4838J3958J3114J3788J4634J4166J3704
$$ 2287580 2302038 2315245 2328216 2342344 2357182 2371140 2384254 2398042 2412676 2426842 2440546
57490B440546J4944J6741J7246J7105J7518J7350J5433J3694J4467J6475J6989
$$ 2440546 2455490 2472231 2489477 2506582 2524100 2541450 2556883 2570577 2585044 2601519 2618508
57479B618508J6347J6714J7888J8064J7557J8049J9068J8799J7606J7369J8054
$$ 2618508 2634855 2651569 2669457 2687521 2705078 2723127 2742195 2760994 2778600 2795969 2814023
57468B814023J8125J7699J8136J9221J9672J9718K0352K0935K0375J9698K0523
$$ 2814023 2832148 2849847 2867983 2887204 2906876 2926594 2946946 2967881 2988256 3007954 3028477
57457C028477K2003K2223K1535K1544K1910K1310K0528K1338K3211K4190K4173
$$ 3028477 3050480 3072703 3094238 3115782 3137692 3159002 3179530 3200868 3224079 3248269 3272442
57446C272442K4337K4377K3405K2499K3148K4248K3873K2862K3306K4599K4606
$$ 3272442 3296779 3321156 3344561 3367060 3390208 3414456 3438329 3461191 3484497 3509096 3533702
57435C533702K3723K4023K5241K5368K4616K5016K6524K7230K6999K7371K8274
$$ 3533702 3557425 3581448 3606689 3632057 3656673 3681689 3708213 3735443 3762442 3789813 3818087
57424C818087K8343K8082K9113L0664L0449K8699K7785K8166K8314K8243K9348
$$ 3818087 3846430 3874512 3903625 3934289 3964738 3993437 4021222 4049388 4077702 4105945 4135293
57413D135293L1028L1308L0616L1163L2703L2844L1513L1085L1923L1890L0650
$$ 4135293 4166321 4197629 4228245 4259408 4292111 4324955 4356468 4387553 4419476 4451366 4482016
57402D482016L0354L1489L1960L1097L0782L1747L2396L2217L2782L4412L5307
$$ 4482016 4512370 4543859 4575819 4606916 4637698 4669445 4701841 4734058 4766840 4801252 4836559
57391D836559L4973L5117L6211L6467L5317L4676L5563L6627L7074L7972L9527
$$ 4836559 4871532 4906649 4942860 4979327 5014644 5049320 5084883 5121510 5158584 5196556 5236083
57380E236083M0083L9070L8100L8019L7659L6545L6064L6752L7172L6561L6099
$$ 5236083 5276166 5315236 5353336 5391355 5429014 5465559 5501623 5538375 5575547 5612108 5648207
57369E648207L6492L6820L6711L7099L8001L8097L7344L7409L8779L9997M0444
$$ 5648207 5684699 5721519 5758230 5795329 5833330 5871427 5908771 5946180 5984959 6024956 6065400
57358F065400M1164M2267M2394M1557M1646M3142M4185M3844M3511M3994M4110
$$ 6065400 6106564 6148831 6191225 6232782 6274428 6317570 6361755 6405599 6449110 6493104 6537214
57347F537214M3210M2417M2266M1764M0774M0645M1538M1861M1229M1152M1925
$$ 6537214 6580424 6622841 6665107 6706871 6747645 6788290 6829828 6871689 6912918 6954070 6995995
57336F995995M1898M0920M1207M3457M5279M5081M4433M4880M5415M5014M4825
$$ 6995995 7037893 7078813 7120020 7163477 7208756 7253837 7298270 7343150 7388565 7433579 7478404
57325G478404M5804M6678M6435M6427M7950M9825N0434N0167N0016M9619M8544
$$ 7478404 7524208 7570886 7617321 7663748 7711698 7761523 7811957 7862124 7912140 7961759 8010303
57314H010303M7724M7889M8152M7620M6893M6677M6605M6504M7024M7984M8078
$$ 8010303 8058027 8105916 8154068 8201688 8248581 8295258 8341863 8388367 8435391 8483375 8531453
57303H531453M7137M6626M6976M6722M5327M4391M4845M5386M5109M5147M6191
$$ 8531453 8578590 8625216 8672192 8718914 8764241 8808632 8853477 8898863 8943972 8989119 9035310
57292I035310M6806M5887M4546M3926M3297M1956M0829M0505L9776L7819L5822
$$ 9035310 9082116 9128003 9172549 9216475 9259772 9301728 9342557 9383062 9422838 9460657 9496479
57281I496479L4835L4016L2612L1614L1828L2269L2032L1794L1981L1517K9936
$$ 9496479 9531314 9565330 9597942 9629556 9661384 9693653 9725685 9757479 9789460 9820977 9850913
57270I850913K8674K8714K9009K8701K8667K9349K9374K8079K7121K7652K8183
$$ 9850913 9879587 9908301 9937310 9966011 9994678 10024027 10053401 10081480 10108601 10136253 10164436
57259A0164436K7179K5616K4865K4245K2690K0909J9731J8280J5878J3860J3383
$$ 10164436 10191615 10217231 10242096 10266341 10289031 10309940 10329671 10347951 10363829 10377689 10391072
57248A0391072J3279J2134J0655R913R206P830P044P964R303R488R342J0368J2010
$$ 10391072 10404351 10416485 10427140 10437053 10446259 10454089 10461133 10469097 10478400 10487888 10497230 10507598 10519608
57235A0519608J2939J3443J4253J4664J4108J3925J5226J6517J5938J4325J3541
$$ 10519608 10532547 10545990 10560243 10574907 10589015 10602940 10618166 10634683 10650621 10664946 10678487
57224A0678487J3224J1889R989R102Q977Q050O185M573L476K202P10p13k587n271
$$ 10678487 10691711 10703600 10713589 10722691 10731668 10739718 10745903 10750476 10753952 10756154 10756864 10756151 10753564 10748293
57210A0748293p737r050j0150j2358j5117j7019j8002j8813j9346j9297j9373
$$ 10748293 10740556 10731506 10721356 10708998 10693881 10676862 10658860 10640047 10620701 10601404 10582031
57199A0582031k0145k0833k0842k1155k2547k3880k4068k4176k5524k7170k7455
$$ 10582031 10561886 10541053 10520211 10499056 10476509 10452629 10428561 10404385 10378861 10351691 10324236
57188A0324236k6706k6262k6166k5933k6285k7875k9503k9851k9762l0570l1523
$$ 10324236 10297530 10271268 10245102 10219169 10192884 10165009 10135506 10105655 10075893 10045323 10013800
57177A0013800l1164l0072k9844l0469l1101l2273l4973l8560m1965m5823n1113
$$ 10013800 9982636 9952564 9922720 9892251 9861150 9828877 9793904 9755344 9713379 9667556 9616443
57166I616443n6797o1268o4974o9139p3034p5147p5901p6528p6285p3610o9123
$$ 9616443 9559646 9498378 9433404 9364265 9291231 9216084 9140183 9063655 8987370 8913760 8844637
57155H844637o4595n9851n3617m6861m2365m1500m4100n0677o1453p3387q1438
$$ 8844637 8780042 8720191 8666574 8619713 8577348 8535848 8491748 8441071 8379618 8306231 8224793
57144H224793q3219q0242p4903o8882o4238o3027o5238o9189p3989p9598q4895
$$ 8224793 8141574 8061332 7986429 7917547 7853309 7790282 7725044 7655855 7581866 7502268 7417373
57133G417373q8187q9539r0176q9750q6645q1026p5050o9937o5197o0856n8083
$$ 7417373 7329186 7239647 7149471 7059721 6973076 6892050 6817000 6747063 6681866 6621010 6562927
57122F562927n7246n7388n7905n8752n9056n7473n3963m9344m3273l4802k4712
$$ 6562927 6505681 6448293 6390388 6331636 6272580 6215107 6161144 6111800 6068527 6033725 6009013
57111F009013j5049o240L193J4287K7317M3851O6601R6791J33809J77949K31626
$$ 6009013 5993964 5987724 5990917 6005204 6032521 6076372 6142973 6239764 6373573 6551522 6783148
57100F783148K97587L78061M76334N97449P46779R29118J149089J410384J713562
$$ 6783148 7080735 7458796 7935130 8532579 9279358 10208476 11357565 12767949 14481511
57091A4481511K055100K428109K822605L224994L618110L980530M283356M487230
$$ 14481511 16536611 18964720 21787325 25012319 28630429 32610959 36894315 41381545
57083D1381545M545210M413756M068849L520662K816365K023433J201683L86686
$$ 41381545 45926755 50340511 54409360 57930022 60746387 62769820 63971503 64358189
57075F4358189m02997j149009j828832k424501k927798l335137l641966l843864
$$ 64358189 63955192 62806183 60977351 58552850 55625052 52289915 48647949 44804085
57067D4804085l939585l931615l827064l639964l390459l099906k787378k469988
$$ 44804085 40864500 36932885 33105821 29465857 26075398 22975492 20188114 17718126
57059A7718126k162865j876961j618227j389361j190741j020027q73618p49331
$$ 17718126 15555261 13678300 12060073 10670712 9479971 8459944 7586326 6836995
57051F836995o45859n59958m86817m23623l70203l25786k87842k54707k26695
$$ 6836995 6191136 5631178 5144361 4720738 4350535 4024749 3736907 3482200 3255505
57042C255505k03608j83482j64823j48032j33673j21094j09522r8814q8523p7824
$$ 3255505 3051897 2868415 2703592 2555560 2421887 2300793 2191271 2092457 2003934 1926110
57032A926110o6870n6671m7262l7485k6727j5276k745J2706L3382O0022Q8125
$$ 1926110 1859240 1802569 1755307 1717822 1691095 1675819 1673074 1685780 1719162 1779184 1867309
57021A867309J04747R3289M7596j8544q0189j20231j37514j38953j30401j16213
$$ 1867309 1972056 2065345 2112941 2094397 2014208 1893977 1756463 1617510 1487109 1370896
57011A370896j01085q7872p6145o5228n6203m9468m3326l6885l1683k8605k5977
$$ 1370896 1269811 1181939 1105794 1040566 984363 934895 891569 854684 823001 794396 768419
57000G68419k2500j9504j8293j7657j6084j4182j3004j1941j0153q272o913n259
$$ 768419 745919 726415 708122 690465 674381 660199 647195 635254 625101 616829 609916 604657
56988F04657k637J65K556N369R134J2752J4965J5343J2958O406l552j3415k0289
$$ 604657 602020 602185 604741 610110 619244 631996 646961 662304 675262 681668 678116 664701 644412
56975F44412k4057k5445k4382k1454j8548j6476j4019j0596p594n788l893j052
$$ 644412 620355 594910 570528 549074 530526 514050 500031 489435 481841 476053 472160 471108
56963D71108J668L770O755J1328J5814J9240K3262K8553L1516K7486J5929N23
$$ 471108 472776 476546 483301 494629 510443 529683 552945 581498 613014 640500 656429 656952
56951F56952j4403k5606l1142l1436k9269k6848k3913j9830j5617j2201q574l720
$$ 656952 642549 616943 585801 554365 525096 498248 474335 454505 438888 426687 418113 414393
56939D14393J123M197N883P825J0667J4358J9377K5911L2761L8227M0701L7604
$$ 414393 415516 419713 425596 433421 444088 458446 477823 503734 536495 574722 615423 653027
56927F53027K6229P623j2248k7334l6203m0559m1382l8845l4327k9752k5600k1529
$$ 653027 679256 686879 674631 647297 611094 570535 529153 490308 455981 426229 400629 379100
56915C79100j7982j5490j3416j1022q848p505o346m762l492l164k930j965r69
$$ 379100 361118 345628 332212 321190 312342 304837 298491 293729 290237 287073 284143 282178 281209
56902B81209o87m19N14J365J540K031L628N248N741N829O661P908Q988J0560J3234
$$ 281209 280522 280103 280617 281982 283522 285553 289181 294429 300170 305999 312660 320568 329556 340116 353350
56887C53350J6243J8920K1656K3812K2684J6618P529j526r499j6247k0340k0514
$$ 353350 369593 388513 410169 433981 456665 473283 480812 479286 469787 453540 433200 412686
56875D12686j7851j4300j0328n952k403n36J044M024P969J1723J5735K0847K6377
$$ 412686 394835 380535 370207 364255 361852 361316 362360 366384 374353 386076 401811 422658 449035
56862D49035L1594L7656M5774N4398N9962N9135M9243K9270K916k1515l7324m4346
$$ 449035 480629 518285 564059 618457 678419 737554 786797 816067 818983 797468 760144 715798
56850G15798m6004m3979l8516l1399k4792j8407j1043l626K290P690J4532K2368
$$ 715798 669794 625815 587299 555900 531108 512701 501658 498032 500322 508012 522544 544912
56838E44912K9703L7481M7817O0376P3264Q5991R7238J00586Q7390N5421J2157
$$ 544912 574615 612096 659913 720289 793553 879544 976782 1077368 1164758 1220179 1232336
56827A232336l0733o4009q3209q8808q5332p7898o8616n7470m5713l5698k7765
$$ 1232336 1201603 1137594 1054385 965577 880245 802347 733731 676261 630548 594850 567085
56816E67085k0154j2017m134L300J1138J9525K7938L7005M8067O0584P1293P5528
$$ 567085 546931 534914 530780 534080 545218 564743 592681 629686 677753 738337 809630 885158
56804H85158O8422M6840J3208k3278n2157o8677p4304p2210o5123n6132m7764
$$ 885158 953580 1000420 1013628 990350 938193 869516 795212 723002 657879 601747 553983
56793E53983m0027l1853k4023j8166j3690q671l196J140M613R155J5118K1254
$$ 553983 513956 482103 458080 439914 426224 417553 414357 415497 420110 429265 444383 465637
56781D65637K7531L4538L9931L8776K8450J1136q558k6147l7994m2650m2153l9860
$$ 465637 493168 527706 567637 606413 634863 645999 637441 611294 573300 530650 488497 448637
56769D48637l6918l2669k7731k3868k1189j8277j5006j2585j1097r602q334q091
$$ 448637 411719 379050 351319 327451 306262 287985 272979 260394 249297 239695 231361 223270
56757B23270p854n945l234k181k974l618l508l712l985k887r64l92j260j477n12
$$ 223270 215416 209471 206237 204056 201082 197464 193956 190244 186259 183372 182408 182016 180756 179279 178767
56742A78767ll33p9P64M16j204j913r29L2K4K04J111J576J152Q25P10j46j199
$$ 178767 178764 178431 178352 179116 179532 178328 176415 175486 175518 175542 175746 176857 178433 179585 180410 181120 180974 179775
56724A79775p13Q92J212j6k41J467K733J808Q2o65o73m67N38K227L048K381J589
$$ 179775 179062 179954 181166 181150 180909 182376 185109 186917 186999 186334 185661 185194 185732 187959 191007 193388 194977
56707A94977J621J743J407J147R40m6j443j761r67n55p77m15M34K24r69j270m20
$$ 194977 196598 198341 199748 200895 201835 201789 200346 198585 197618 197063 196286 195871 196305 196529 195560 194290 193870
56690A93870k58j190j387k20O57N19O68J455J440M63L34J408J748P48L00J138
$$ 193870 193612 192422 191035 190815 191472 191991 192659 194114 195554 196017 196351 197759 199507 200255 200555 201693
56674B01693J407K04p55m22q8l92J32J888K874K157J601K443L213K741K134K132
$$ 201693 203100 203304 202549 202127 202039 201647 201779 203667 206541 208698 210299 212742 215955 218696 220830 222962
56658B22962J542O2m98M75R63%m80O73J550P41j18M45J028K47n87j58L52k13o86
$$ 222962 224504 224566 224068 224543 225506 225506 225026 225699 227249 227990 227872 228317 229345 229592 229005 228847 229199 228986 228300
56639B28300j83k32j879l362l104k444k877l232k215j179j647k392j759o76p53
$$ 228300 228117 227885 226006 222644 219540 217096 214219 210987 208772 207593 205946 203554 201795 201119 200366
56624B00366j397j347j137j583j842j187p63j359j581l91P62N71K58J008J489
$$ 200366 198969 197622 196485 194902 193060 191873 191110 189751 188170 187779 188541 189112 189370 190378 191867
56609A91867L72r42p67r2m56j039n01L27K59K69J490K602J921M10j0N01P13P81
$$ 191867 192239 191297 190530 190438 189982 188943 188442 188769 189028 189297 190787 193389 195310 195720 195710 196211 196924 197705
56591A97705J273J400M79m36m09l07p21l23J545K887J986K40k80J7j23j03J013
$$ 197705 198978 200378 200857 200421 200012 199705 198984 198661 200206 203093 205079 205319 205039 205056 204933 204830 205843
56574B05843K219K232J673J486J143M71Q78K712L824L045K467L852N568N861O295
$$ 205843 208062 210294 211967 213453 214596 215067 215945 218657 222481 225526 227993 231845 237413 243274 249569
56559B49569Q825J1891J2674J1054Q363M520m18m169m906m097l842l614k511k031
$$ 249569 258394 270285 282959 294013 302376 306896 306478 302309 297403 293306 289464 285850 283339 281308
56545B81308l275m048k337k23o06k336k523j504j433j916j213j90q76k452k620
$$ 281308 278033 273985 271648 271425 270819 268483 265960 264456 263023 261107 259894 259704 258828 256376 253756
56530B53756j692j574j929j190r2m31j464j172MJ95k99P0P77L05p20q40q11j910
$$ 253756 252064 250490 248561 247371 247279 246848 245384 244212 244216 244411 244112 244182 244959 245264 244544 243704 242893 240983
56512B40983k734j388O14M48j356k160j814k056k519j461L95O99m82j133j000
$$ 240983 238249 236861 237475 237923 236567 234407 232593 230537 228018 226557 226952 227651 227169 226036 225036
56497B25036j371j955j537q49j344k095j317R5j7j200j428p72n65k43J335K793
$$ 225036 223665 221710 220173 219324 217980 215885 214568 214663 214646 213446 212018 211246 210681 210438 211773 214566
56481B14566K230R07J114J894R52p61o70N38J86j383j580m35j13m32O04K444K655
$$ 214566 216796 217703 218817 220711 221663 220902 220232 220770 220956 219573 217993 217558 217445 217013 217617 220061 222716
56464B22716J360P08N95o61k152j468N93J023j45j19J431K080J355J242K062K121
$$ 222716 224076 224784 225379 224718 222566 221098 221691 222714 222569 222450 223881 225961 227316 228558 230620 232741
56448B32741J406J559K344K108J308J524J790J87j810j201J064J405l13j010k26
$$ 232741 234147 235706 238050 240158 241466 242990 244780 244967 243157 241956 243020 244425 244112 243102 242876
56433B42876m33j767j691j02L37p30q94K60O60J67O81J797J268k41P4J707J437
$$ 242876 242443 240676 238985 238883 239220 238490 237596 237856 238516 238683 239364 241161 242429 242188 242262 243969 245406
56416B45406o14r80P71J382J00j37J392J804K33n90L45O95k67j99J427K084J161
$$ 245406 244792 243812 244583 245965 246065 245928 247320 249124 249357 248767 249112 249807 249540 249341 250768 252852 254013
56399B54013J184K750L194J685P61J391J402J68n6J144J227k51m46J425K509J632
$$ 254013 255197 257947 261141 262826 263587 264978 266380 266548 266492 267636 268863 268612 268166 269591 272100 273732
56383B73732J233K353K655J191K93R74J170J92J40J228O91j917l274j901m19l58
$$ 273732 274965 277318 279973 281164 281457 282431 283601 283793 283933 285161 285852 283935 280661 278760 278341 277983
56367B77983K22K086K819J658J299K746L215J423J27R94J670M18q40n17l7l23
$$ 277983 278205 280291 283110 284768 286067 288813 292028 293451 293578 294572 296242 296660 295820 295303 295266 294943
56351B94943J48J660K016Q07N27J684J556m37j103Q40K449K009J731K821L037
$$ 294943 295091 296751 298767 299574 300101 301785 303341 302904 301801 302641 305090 307099 308830 311651 314688
56336C14688J475P61J976K479J170P58K322K896J170K86K051L592K876K378M017
$$ 314688 316163 316924 318900 321379 322549 323307 325629 328525 329695 329981 332032 335624 338500 340878 344895
56321C44895N376M352K816K463J590p46k011p71M78l2l22Q99J506M79L59K325
$$ 344895 350271 354623 357439 359902 361492 360746 358735 357964 358442 358410 358088 358987 360493 360972 361331 363656
56305C63656L631K747K214L615M670M128M265N761N578K861J327K652L351J541
$$ 363656 367287 370034 372248 375863 380533 384661 388926 394687 400265 403126 404453 407105 410456 411997
56291D11997P32L104N114M039K927M586O347N508M453N635O656N272M108N597
$$ 411997 412729 415833 420947 424986 427913 432499 438846 444354 448807 454442 461098 466370 470478 476075
56277D76075P139O170N113O549Q172P435O461P666R111Q848R146J1804J4076J3789
$$ 476075 483214 489384 494497 501046 509218 516653 523114 530780 539891 548739 557885 569689 583765 597554
56263E97554J3645J5848J7676J7107J7482K1494K5792K6933K7619L1529L6933
$$ 597554 611199 627047 644723 661830 679312 700806 726598 753531 781150 812679 849612
56252H49612M0906M4994N1213N7184O0786O4759P1207P6417P6817P5130P4895
$$ 849612 890518 935512 986725 1043909 1104695 1169454 1240661 1317078 1393895 1469025 1543920
56241A543920P3912O9041O2510N7178N0313L8504K4300J1755j79j3614k5762l3364
$$ 1543920 1617832 1686873 1749383 1806561 1856874 1895378 1919678 1931433 1931254 1917640 1891878 1858514
56229A858514l8806m5484n1399n3560n4333n7076n9720n9028n6860n6085n4789
$$ 1858514 1819708 1774224 1722825 1669265 1614932 1557856 1498136 1439108 1382248 1326163 1271374
56218A271374n0806m7252m7034m6661m2269l7008l5474l5540l2854k8881k7117
$$ 1271374 1220568 1173316 1126282 1079621 1037352 1000344 964870 929330 896476 867595 840478
56207H40478k5856k2124j8494j8441j9172j6496j2585j1476j1215q122m518m385
$$ 840478 814622 792498 774004 755563 736391 719895 707310 695834 684619 676497 671979 667594
56195F67594n493l763j307k139m044k767k84p15k016m2L031K721Q60J826L924
$$ 667594 662101 658338 657031 654892 650848 648081 647797 647082 645066 645024 648055 650776 651636 653462 657386
56180F57386L040J076K236M554L748J867L448O592O604M970N978P975O881M845
$$ 657386 660426 661502 663738 668292 672040 673907 677355 683947 690551 695521 701499 709474 716355 721200
56166G21200O463R799J0104Q987J0935J4229J4433J3321J5245J8293J8212J7311
$$ 721200 727663 737462 747566 756553 767488 781717 796150 809471 824716 843009 861221 878532
56154H78532K0057K3820K3704K2545K6039L1984L4759L6465M2900N2237N8883
$$ 878532 898589 922409 946113 968658 994697 1026681 1061440 1097905 1140805 1193042 1251925
56143A251925O5016P7075R3820J09195J23894J42501J61851J73605J75920J71627
$$ 1251925 1316941 1394016 1487836 1597031 1720925 1863426 2025277 2198882 2374802 2546429
56133B546429J58361J32743J01834P8188O5210N8206N6453O1518O6436O0125M2076
$$ 2546429 2704790 2837533 2939367 3017555 3082765 3140971 3197424 3258942 3325378 3385503 3427579
56122C427579K1095J415j8127l3796l9466l8866m3089n6369p5050r8132j26515
$$ 3427579 3448674 3450089 3431962 3398166 3358700 3319834 3276745 3220376 3145326 3047194 2920679
56111B920679j53672j69711j73823j71631j63058j44923j22427j04567r0506p3551
$$ 2920679 2767007 2597296 2423473 2251842 2088784 1943861 1821434 1716867 1626361 1552810
56101A552810n5807m5071l9936l2428k3109j8890j8180j3280n592l180m924k623
$$ 1552810 1497003 1451932 1411996 1379568 1356459 1337569 1319389 1306109 1300517 1297337 1292413 1289790
56089A289790K904L692R04K997Q951R873O341P317J2572J3270R557J0277J5352
$$ 1289790 1292694 1296386 1297290 1300287 1309238 1319111 1325452 1332769 1345341 1358611 1368168 1378445 1393797
56076A393797J5957J2235J3183J8585J9049J4534J4834K0711K2718J9762K0600
$$ 1393797 1409754 1421989 1435172 1453757 1472806 1487340 1502174 1522885 1545603 1565365 1585965
56065A585965K5705K6121K1598K1356K5506K4452J8071J6413K0074J9264J3674
$$ 1585965 1611670 1637791 1659389 1680745 1706251 1730703 1748774 1765187 1785261 1804525 1818199
56054A818199J3443J8936J9859J6019J8093K6047K8181K3656K4146L0837L2187
$$ 1818199 1831642 1850578 1870437 1886456 1904549 1930596 1958777 1982433 2006579 2037416 2069603
56043B069603K7130K7621L5042L7349L3091L4620M3640M7555M4072M5100N2112
$$ 2069603 2096733 2124354 2159396 2196745 2229836 2264456 2308096 2355651 2399723 2444823 2496935
56032B496935N2702M6080M6326N5305N8405N2526N1628N8876O0657N4409N4546
$$ 2496935 2549637 2595717 2642043 2697348 2755753 2808279 2859907 2918783 2979440 3033849 3088395
56021C088395O3945O7860O3126O4588P5260P9739P4863P6558Q8169R3234Q8235
$$ 3088395 3152340 3220200 3283326 3347914 3423174 3502913 3577776 3654334 3742503 3835737 3923972
56010C923972R0381J03727J10553J06183J08388J21920J28720J24321J27987J44883
$$ 3923972 4014353 4118080 4228633 4334816 4443204 4565124 4693844 4818165 4946152 5091035
56000E091035J55173J53213J59304J79203J91426J89151J94122K13821K26620
$$ 5091035 5246208 5399421 5558725 5737928 5929354 6118505 6312627 6526448 6753068
55991F753068K25662K34162K59960K79427K84493K99500L32575L58481L69480
$$ 6753068 6978730 7212892 7472852 7752279 8036772 8336272 8668847 9027328 9396808
55982I396808L92834M36900M72847M91986N25538N83812O34887O69026P21680
$$ 9396808 9789642 10226542 10699389 11191375 11716913 12300725 12935612 13604638 14326318
55973A4326318Q05091Q83680R47214J037348J168910J301035J422353J583262
$$ 14326318 15131409 16015089 16962303 17999651 19168561 20469596 21891949 23475211
55965B3475211J804335K041381K285331K601168L019973L498875M043077M750735
$$ 23475211 25279546 27320927 29606258 32207426 35227399 38726274 42769351 47520086
55957D7520086N675429O774914Q063553R662640J1623749J3892548J6553965J9898730
$$ 47520086 53195515 59970429 68033982 77696622 89320371 103212919 119766884 139665614
55949A39665614K4132685K9287913L5448392M2304378M7755627M7519712L7671145
$$ 139665614 163798299 193086212 228534604 270838982 318594609 366114321 403785466
55942D03785466J8469515m701434k4786824l7528720m2827666m2844882l9793139
$$ 403785466 422254981 417553547 392766723 355238003 312410337 269565455 229772316
55935B29772316l5249861l0323760k5672309k1493375j7802989j4669800j2124147
$$ 229772316 194522455 164198695 138526386 117033011 99230022 84560222 72436075
55928G2436075j0048740q311500o890927n778477m880387m109589l472482k983634
$$ 72436075 62387335 54075835 47184908 41406431 36526044 32416455 28943973 25960339
55920B5960339k585454k223547j917438j689586j499726j310137j145722j032050
$$ 25960339 23374885 21151338 19233900 17544314 16044588 14734451 13588729 12556679
55912A2556679r37947q32355p38045o78675o28401n61558n00106m66558m38661
$$ 12556679 11618732 10786377 10048332 9369657 8741256 8179698 7679592 7213034 6774373
55903F774373l93632l51287l32127l16169k82783k50417k38828k30669k06948
$$ 6774373 6380741 6029454 5697327 5381158 5098375 4847958 4609130 4378461 4171513
55894D171513j83734j78593j75570j57371j38970j36643j35581j19816j03667
$$ 4171513 3987779 3809186 3633616 3476245 3337275 3200632 3065051 2945235 2841568
55885B841568j02767j03290q9735p4946p3410p2242n7575m3662m7305n7716n8941
$$ 2841568 2738801 2635511 2545776 2470830 2397420 2325178 2267603 2223941 2176636 2118920 2059979
55874B059979n8634o8065p6510p1706o4243o6613o8926n9592m9246n0212n2531
$$ 2059979 2001345 1933280 1856770 1785064 1720821 1654208 1585282 1525690 1476444 1426232 1373701
55863A373701m4118l4955l7620m2716l7146k8795k9933l3397k7973k0981k3184
$$ 1373701 1329583 1294628 1257008 1214292 1177146 1148351 1118418 1085021 1057048 1036067 1012883
55852A012883k6930k1159j3137j4256j8650j6359j3389j8575k4563k1630j6795
$$ 1012883 985953 964794 951657 937401 918751 902392 889003 870428 845865 824235 807440
55841H07440j9896k4132j9684j3322j5292j9560j6163j0693j2621j6322j2463
$$ 807440 787544 763412 743728 730406 715114 695554 679391 668698 656077 639755 627292
55830F27292o670q367j2259r150m129o031r597o154j496n074j1376j0158n611
$$ 627292 620622 612255 599996 590846 586717 580686 571089 564935 563439 558365 546989 536831 531220
55817E31220p459j1985r842m367m594p710n510r15j557m008n78N125N099K534
$$ 531220 523761 511776 501934 497567 492973 485263 479753 478838 477281 473273 472695 477820 482919 485453
55803D85453N090R444P848L567M573Q086O137N66j876l225q887j4726j3767r902
$$ 485453 490543 499987 507835 511402 515975 524061 530198 530764 528888 525663 516776 502050 488283 478381
55789D78381j0998j4205j1903o348m662n077k084N37m112j1998j4142j1679j1628
$$ 478381 467383 453178 441275 434927 430265 425188 423104 423641 419529 407531 393389 381710 370082
55776C70082j2782r394m123l646n651l335J289J430j390j045P45j691n815n299
$$ 370082 357300 347906 343783 340137 334486 331151 332440 333870 332480 331435 332180 330489 324674 319375
55762C19375k529m163q135p633m219m461p061n857k317k710n913o113m568o737
$$ 319375 316846 312683 304548 296915 292696 288235 281174 275317 273000 270290 264377 258264 253696 246959
55748B46959j0675j0097o194m904n435k913O74k28l415k509R89P04k413k349K20
$$ 246959 236284 226187 219993 215089 209654 206741 207415 207187 203772 201263 202252 202956 200543 198194 198414
55733A98414m9j998l59L187K731m02l26J743j6m172m317j208j012l270k278J129
$$ 198414 198365 196367 196008 199195 201926 201524 201198 202941 202925 198753 194436 193228 192216 188946 186668 187797
55717A87797R05k317k243J045J509j168j490O95J18l087l235J68J883J068J915
$$ 187797 188702 186385 184142 185187 186696 185528 184038 184733 184851 181764 178529 178697 180580 181648 183563
55702A83563M303L767O79k35P75p69m069m042j278j154l460k875N28J311r22j151
$$ 183563 187866 191633 192312 192077 192852 192083 188014 183972 182694 181540 178080 175205 175733 177044 176122 174971
55686A74971J023Q50j859k281j82l01k751k620L68J208p66j010R99R17j472j708
$$ 174971 175994 176844 174985 172704 172522 172221 169470 166850 167218 168426 167660 166650 167649 168566 167094 165386
55670A65386K71j62k934k892L10J347p53r95J949L689L099M274P791Q840O049
$$ 165386 165657 165495 162561 159669 159979 161326 160573 159578 161527 165216 168315 172589 180380 189220 195269
55655A95269L780L874L176R12M35J959J442j732l569l181m032o449o743m850m855
$$ 195269 199049 202923 206099 207011 207446 209405 210847 209115 205546 202365 198333 191884 185141 180291 175436
55640A75436o913o703l887k936m433l997j066j77k104k329N1O08j483j537J467
$$ 175436 168523 161820 157933 154997 150564 146567 145501 145324 143220 140891 140942 141550 140067 138530 139997
55625A39997K540J4j417L61J212q99k057j77J108l18j318k55k55k547l508j559
$$ 139997 142537 142551 141134 141495 142707 141808 139751 139574 140682 140364 139046 138791 138536 135989 132481 130922
55609A30922k70j507k189p75l00k046k777j166m44j872k148q4P53j036j853l5
$$ 130922 130652 129145 126956 126181 125881 123835 121058 119892 119448 117576 115428 115344 116097 115061 113208 113173
55593A13173R51o91j650l3J080k34j229k52J78r45n29K390M020K563J499L029
$$ 113173 114124 113433 111783 111750 112830 112596 111367 111115 111293 110348 109819 112209 116229 118792 120291 123320
55577A23320M327L519L340N442O981O316O290Q491R919Q715P558Q071P483M228
$$ 123320 127647 131166 134506 139948 146929 153245 159535 168026 177945 186660 194218 202289 209772 214000
55563B14000J239L52j027m329o577o097n864p677q581o718n166o220p192n681
$$ 214000 215239 215591 214564 210235 203658 197561 191697 184020 175439 168721 163555 157335 150143 144462
55549A44462l803l496k782m53P04r16k257j075J21p65j331M31K137J700J206K182
$$ 144462 140659 137163 134381 133928 134632 133716 131459 130384 130505 129740 128409 128840 130977 132677 133883 136065
55533A36065J959j205m104l831k498k713k864j097L38r56l085l501l277m003m194
$$ 136065 138024 136819 132715 128884 126386 123673 120809 119712 120050 119094 116009 112508 109231 105228 101034
55518A01034k569j144j518j708j38J055O9j142p28k81j101j173P31K147J312L93
$$ 101034 98465 97321 95803 94095 93957 95012 95081 93939 93211 92930 91829 90656 91387 93534 94846 95239
55502I5239J006R37j248k754j428K82n9n96O23J558L16q33K89J511N02p30K54
$$ 95239 96245 97182 95934 93180 91752 92034 91975 91379 92002 93560 93876 93043 93332 94843 95345 94615 94869
55485I4869J714J272L52Q87J239l42j736p11O88k11j924j834q30q83j088r3O12
$$ 94869 96583 97855 98207 99094 100333 99991 98255 97544 98232 98021 96097 94263 93433 92550 91462 91369 91981
55468I1981l82j250l60M72l60q42O35J693L21r40N14K406J684l5K38J369P47o75
$$ 91981 91599 90349 89989 90461 90101 89259 89894 91587 91908 90968 91482 93888 95572 95537 95775 97144 97891 97216
55450I7216o76k24j029j471L09K057Q97j426j553k73n39j908j819m68J07Q0P58
$$ 97216 96540 96316 95287 93816 94125 96182 97079 95653 94100 93827 93288 91380 89561 89093 89200 89280 90038
55433I0038J319N11k92M36J034l40j789p83J174J196R7M21J570J264P2J74J158
$$ 90038 91357 91868 91576 92012 93046 92706 90917 90134 91308 92504 92601 93022 94592 95856 95928 96102 97260
55416I7260J125M16N50J031P52O96J806K353R05m74L77J594N16j498j657p45j193
$$ 97260 98385 98801 99351 100382 101134 101830 103636 105989 106894 106420 106797 108391 108907 107409 105752 105007 103814
55399A03814k343k043j021j281k004j266j1j56o44M17J676Q48p77n15Q96R91K62
$$ 103814 101471 99428 98407 97126 95122 93856 93845 93689 93045 93462 95138 95986 95209 94694 95590 96581 96843
55382I6843O97J463N42r06m16J082R13m40n59J81l59j653j632r75j771l096k448
$$ 96843 97540 99003 99545 98639 98223 99305 100218 99778 99219 99400 99041 97388 95756 94781 93010 89914 87466
55365H7466n85l72j715k018r19k63j96N00J073j8j436p11J248J546M03M76J807
$$ 87466 86881 86509 84794 82776 81857 81594 81398 81898 82971 82953 81517 80806 82054 83600 84003 84479 86286
55348H6286J852K05r16o46k30p0M37O83j80q38K33J579J002l86j28J059P85l66
$$ 86286 88138 88343 87427 86781 86551 86481 86918 87601 87421 86583 86816 88395 89397 89011 88883 89942 90727 90361
55330I0361m7J228J097l8O5R30L35j023n28J343J736O01M74J434J093n66j046
$$ 90361 90314 91542 92639 92601 92666 93596 93931 92908 92380 93723 95459 96060 96534 97968 99061 98495 97449
55313I7449j27j87j545j917q53m40j217j410o19m05q55m32O24M89n85n56M96N50
$$ 97449 97322 97135 95590 93673 92820 92380 91163 89753 89134 88729 87874 87442 88066 88555 87970 87414 87910 88460
55295H8460l24n4J318J581N41K38R38Q27j41j29P71N16q14j002R5K71p81r94l9
$$ 88460 88136 88082 89400 90981 91522 91760 92698 93525 93384 93255 94026 94542 93728 92726 92821 93092 92311 91317 91278
55276I1278J47o54m94P63J024Q6R3J325J517J61n41J92N44j34j58Q79J139J20
$$ 91278 91425 90771 90277 91040 92064 92150 92243 93568 95085 95246 94705 94897 95441 95307 95149 96028 97167 97287
55258I7287m04M1k99j802k463j518o36o03j46J005J302N13L40J038P70p88j604
$$ 97287 96883 96924 96625 94823 92360 90842 90206 89603 89457 90462 91764 92277 92617 93655 94425 93637 92033
55241I2033q81j57qQ56K362K426O63o68m97m09j249j543n46L44M10P66J631J510
$$ 92033 91152 90995 90987 91843 94205 96631 97294 96626 96129 95720 94471 92928 92382 92726 93136 93902 95533 97043
55223I7043J72n57KK92l85o71j0K51m50r53r25j370j965j026J148K089J090J39
$$ 97043 97215 96658 96660 96952 96567 95896 95886 96137 95687 94734 93809 92439 90474 89448 90596 92685 93775 93914
55205I3914J98k9q49o73O26R35k97q87J90J122O99K21N90O89M8k9P49P85k79o63
$$ 93914 94112 94083 93234 92561 93187 94122 93825 92938 93128 94250 94949 95170 95760 96449 96497 96468 97217 98002 97723 97060
55185I7060J81N42j27o3J227J695M98m40j09j56j324j625p8J168M65o19l76K25
$$ 97060 97241 97783 97656 97593 98820 100515 101013 100573 100464 100308 98984 97359 97281 98449 98914 98295 97919 98144
55167I8144kk6J082J983J394L42J24K35K3K01J040J316N39K2L71L19o88j258p13
$$ 98144 98142 98116 99198 101181 102575 102917 103041 103276 103299 103500 104540 105856 106395 106417 106788 107107 106419 105161 104448
55148A04448l79r19j066l19o3o86n09Q96J411L3j207p93j37o08j048m01P5o33
$$ 104448 104069 103150 102084 101765 101702 101016 100507 101403 102814 102847 101640 100847 100710 100102 99054 98653 98728 98095
55130I8095j135k53P43N62J52M82N98j43m10N33J032n3j137p01J51O3r1O89J263
$$ 98095 96960 96707 97450 98012 98164 98646 99244 99101 98691 99224 100256 100203 99066 98365 98516 98579 98488 99177 100440
55111A00440N04n06n08k64o13n78N14J250N66j80L53J127R11N52J009J311O00
$$ 100440 100944 100438 99930 99666 99053 98475 98989 100239 100805 100625 100978 102105 103016 103568 104577 105888 106488
55094A06488O0O26R85R5n47M71J736J373J83n1M16L96J95N53P61L5o93m17J16
$$ 106488 106548 107174 108159 108254 107707 108178 109914 111287 111470 111419 111835 112231 112426 112979 113740 113775 113082 112665 112781
55075A12781Kp4M65N59m10j014k15N86qr48p64j33k07m18m3n3j121j795q70L38
$$ 112781 112783 112709 113174 113733 113323 112309 112094 112680 112672 111724 110960 110827 110620 110202 110159 110106 108985 107190 106320 106658
55055A06658K91j95Q1K23p98j730j105P0K00j50J87N07j11n28M35J448Q54l19
$$ 106658 106949 106754 106835 107058 106260 104530 103425 103495 103695 103545 103732 104239 104128 103600 104035 105483 106337 106018
55037A06018k23N61M21j12M64J617J742J036P79Q45L94q4J92M19k80p75J49J228
$$ 106018 105795 106356 106777 106665 107129 108746 110488 111524 112303 113148 113542 113458 113650 114069 113789 113014 113163 114391
55019A14391O75o31o77J60l6j259j724r02J41Q17J286J280O10R5K31Kj190j858
$$ 114391 115066 114435 113758 113918 113882 112623 110899 109997 110138 110955 112241 113521 114131 114226 114457 114459 113269 111411
55001A11411o70J104J565J087J053J183O01O2N66J124M26n76l04N26L34l26K3
$$ 111411 110741 111845 113410 114497 115550 116733 117334 117396 117962 119086 119512 118936 118632 119158 119492 119166 119189
54984A19189Q65P67K70P39J479Q96l45l44O55Q70K50K46Q57Q60M43Q18J596J341
$$ 119189 120054 120821 121091 121830 123309 124205 123860 123516 124171 125041 125291 125537 126394 127254 127697 128515 130111 131452
54966A31452L35J35O76M81n01q56l52p8j70K38R40Q81K51J65M83J29p37j008p52
$$ 131452 131787 131922 132598 133079 132578 131722 131370 131292 131122 131360 132300 133181 133432 133597 134080 134209 133472 132464 131712
54947A31712r10j255q21J4K8o06p07l13m11q40n96J46L20n7p9L18O82J404K888
$$ 131712 130802 129547 128726 128740 128768 128162 127455 127142 126731 125891 125295 125441 125761 125704 125625 125943 126625 128029 130917
54928A30917M156M257M149N166O601P065P082P851Q477P237M765L049J966k33
$$ 130917 135073 139330 143479 148645 155246 162311 169393 177244 185721 192958 197723 200772 202738 202505
54914B02505l419n599o242o688p317p074n906n096m919m411l524l180l198k453
$$ 202505 199086 193487 187245 180557 173240 166166 160260 155164 150245 145834 142310 139130 135932 133479
54900A33479j082l18k36J46P31O24K11O08J264O82o81q18N71J810K235K828L734
$$ 133479 132397 132079 131843 131989 132720 133344 133555 134163 135427 136109 135428 134610 135181 136991 139226 142054 145788
54883A45788L847L252L602N431P300Q066Q018P383N737L324J108p80k914m942
$$ 145788 149635 152887 156489 161920 169220 177286 185304 192687 198424 201748 202856 202076 199162 194220
54869A94220n938o265p107q151p826n964m206l580l523l325k853j857k76R15Q25
$$ 194220 188282 182017 174910 166759 158933 152969 148763 145183 141660 138335 135482 133625 133349 134264 135089
54854A35089J93J40J06j012k368k280j134o97j005o34K99K11r48j529j150j154
$$ 135089 135282 135422 135528 134516 132148 129868 128734 128037 127032 126398 126697 126908 125960 124431 123281 122127
54838A22127j889k114j428q75p94l31N87R55N78K51R6k85k83Q54J976J373k58
$$ 122127 120238 118124 116696 115821 115027 114696 115283 116238 116816 117067 117163 116878 116595 117449 119425 120798 120540
54821A20540p47m2L3o90n32O33R94Q1n77n15r12j710j234N47J487Q48M75J426
$$ 120540 119793 119751 119784 119094 118562 119195 120189 120270 119693 119178 118266 116556 115322 115869 117356 118204 118679 120105
54803A20105K259J786Q81M69J51j10N56J831J956N92m95m13l47q64o99O89J812
$$ 120105 122364 124150 125031 125500 125651 125541 126097 127928 129884 130476 129981 129568 129221 128357 127658 128347 130159
54786A30159J682J266J270R43K13N86K473L922L553K561K378K460J989J790K849
$$ 130159 131841 133107 134377 135320 135533 136119 138592 142514 146067 148628 151006 153466 155455 157245 160094
54771A60094M541N840O822P716P986P504P128P031N985L352K99j943l498m749
$$ 160094 164635 170475 177297 185013 192999 200503 207631 214662 220647 223999 224298 222355 218857 214108
54757B14108n470n862o817q229q687p652o337n659n032l899k695j615k14J106
$$ 214108 208638 202776 195959 187730 179043 171391 165054 159395 154363 150464 147769 146154 145940 147046
54743A47046J115l1o27j34l0j039j798j235k34K85Q82J963K664K547K672L711
$$ 147046 148161 148130 147503 147369 147339 146300 144502 143267 143033 143318 144200 146163 148827 151374 154046 157757
54727A57757M766N194N726O694O933N755M243L343K308L57j745l014l727m487
$$ 157757 162523 167717 173443 180137 187070 192825 197068 200411 202719 203076 201331 198317 194590 190103
54713A90103n191n841o808p516o516l888j728j386j882j991k009k332k217j256
$$ 190103 184912 179071 172263 164747 158231 154343 152615 151229 149347 147356 145347 143015 140798 139542
54699A39542m35m70o14k01J18k73q56j157j491j796j365m19j69o60m99N56R66
$$ 139542 139107 138637 138023 137822 137940 137667 136811 135654 134163 132367 131002 130583 130414 129754 129255 129811 130777
54682A30777J26m80K7M29k24j000j117j349k029j831j41J429J473Q28P07O94J27
$$ 130777 130903 130423 130450 130879 130655 129655 128538 127189 125160 123329 123188 124617 126090 126918 127625 128319 128446
54665A28446l82l49n18j141j011L27J372J033L30K93J94n32p16M91J864K118J795
$$ 128446 128064 127715 127197 126056 125045 125372 126744 127777 128107 128400 128594 128062 127346 127837 129701 131819 133614
54648A33614J635J040k75j050o04j53m08j16J309K074J001j93J06N45n73j949
$$ 133614 135249 136289 136014 134964 134360 134207 133799 133683 134992 137066 138067 137874 137980 138525 137952 136003
54632A36003j481Q6O72L80O05R63J03j450k050j675j420j091J25J472J581R43
$$ 136003 134522 134608 135280 135660 136265 137228 137331 135881 133831 132156 130736 129645 129770 131242 132823 133766
54616A33766J080J838J846J049N80O01L51j35j79Q5J53L71J107J522P99k30l82
$$ 133766 134846 136684 138530 139579 140159 140760 141111 140976 140797 140882 141035 141406 142513 144035 144834 144604 144222
54599A44222k1p9k30J43L42m00j157p96p5k08n33J59J072O55n03n81L60O92J92
$$ 144222 144201 144122 143892 144035 144377 143977 142820 142024 141949 141741 141208 141367 142439 143094 142591 142010 142370 143062 143254
54580A43254K12J072J576J138M21j07m88l22P87J972J912P21l72q33r78q27k92
$$ 143254 143466 144538 146114 147252 147673 147566 147078 146756 147543 149515 151427 152148 151776 150943 149965 149138 148846
54563A48846K3m11r57q05l28k53l40j91l05q69p26Q04K214J856N49K19R12J288
$$ 148846 148869 148458 147501 146696 146368 146115 145775 145584 145279 144410 143684 144488 146702 148558 149107 149326 150238 151526
54545A51526J193J541K265K480K216K092J831R06J3R9O34N98L36N92O17o60k302
$$ 151526 152719 154260 156525 159005 161221 163313 165144 166050 166063 166162 166796 167394 167730 168322 168939 168279 165977
54528A65977k461j168p6Q4k08p89j692k118j457p05r70j435p45N27R47P61J090
$$ 165977 163516 162348 162272 162356 162148 161359 159667 157549 156092 155387 154417 152982 152237 152764 153711 154472 155562
54511A55562J448O44o58q56k24k14n98k2J087J012j09n20m9j67q96n90Q25J349
$$ 155562 157010 157654 156996 156140 155916 155702 155104 155082 156169 157181 157072 156552 156503 156336 155440 154850 155675 157024
54493A57024K48p20k32P66R89N26j22q70j204k79J562K830K827K212J552Q85O84
$$ 157024 157272 156552 156320 157086 158075 158601 158479 157609 156405 156126 157688 160518 163345 165557 167109 167994 168678
54476A68678J528K724K950K269J866J934J610Q34L77J51n60j288q30M80J034N30
$$ 168678 170206 172930 175880 178149 180015 181949 183559 184393 184770 184921 184361 183073 182243 182723 183757 184287
54460A84287K49P13J108J153J370J403K66j536k223j466p84r23r39l20R2j67m24
$$ 184287 184536 185249 186357 187510 188880 190283 190549 189013 186790 185324 184540 183617 182678 182358 182450 182283 181859
54443A81859m18p75j499j744j453j458j661j039K05N23m64j272r56l03r0M5L49
$$ 181859 181441 180666 179167 177423 175970 174512 172851 171812 172017 172540 172076 170804 169848 169545 169455 169500 169849
54426A69849L13m6R2P98J058N27O8J30J67P5M96J301J379M65l69m31j69J32P64
$$ 169849 170162 170116 170208 171006 172064 172591 172659 172789 172956 173031 173527 174828 176207 176672 176303 175872 175703 175835 176599
54407A76599J453J407Q00O20Q50N44k08k15O51J155Q91P71R95N73n82j111m67
$$ 176599 178052 179459 180259 180879 181729 182273 182065 181850 182501 183656 184547 185318 186313 186886 186304 185193 184726
54390A84726J84Jl57k46j5J16N21R29M59o74j197r25r96j586j424j26J071J502
$$ 184726 184910 184911 184554 184308 184293 184409 184930 185859 186318 185644 184447 183522 182526 180940 179516 179390 180461 181963
54372A81963J868K223J486j99q58L94J934K260J955J826J229k25j180n26O99R83
$$ 181963 183831 186054 187540 187341 186483 186877 188811 191071 193026 194852 196081 195856 194676 194150 194849 195832
54356A95832N97N76P46L22n21j094j443j884k139j920j663j776j927j760j523
$$ 195832 196429 197005 197751 198073 197552 196458 195015 193131 190992 189072 187409 185633 183706 181946 180423
54341A80423j432j332j379j943k463j777l0J137Q27j07p61j261j615j190j86J21
$$ 180423 178991 177659 176280 174337 171874 170097 170067 171204 172031 171924 171163 169902 168287 167097 166911 167032
54325A67032n49p48L68J650J918J677J674J358J91q67p42m3k4o37q66m25M2l4
$$ 167032 166483 165735 166103 167753 169671 171348 173022 174380 174571 173704 172962 172919 172895 172258 171392 170967 171009 170975
54307A70975o64j324j165P3J203Q16n71j023p8O35J79k54L84J181R66J98j81m42
$$ 170975 170311 168987 167822 167895 169098 169914 169343 168320 168242 168877 169056 168802 169186 170367 171333 171531 171350 170908
54289A70908j205k012k030j387p17j95J71J31j49j5M95M91k19o32k15L00L55M27
$$ 170908 169703 167691 165661 164274 163557 163362 163533 163664 163515 163500 163995 164486 164267 163635 163420 163720 164075 164502
54271A64502P65P91M80P60J685J881P84j92J58J038J288J266J673J962J378M80
$$ 164502 165267 166058 166538 167298 168983 170864 171648 171456 171614 172652 173940 175206 176879 178841 180219 180699
54255A80699K22M08L28lk36n01p97o34n3N6n60q92l94M4l02p82p70q08j277j381
$$ 180699 180921 181329 181657 181654 181418 180917 180120 179486 179433 179489 178929 178037 177643 177687 177385 176603 175833 175025 173748 172367
54235A72367o01J16j21p39r55j111j534j449l54P25O81p2o34j027j384j073L3
$$ 172367 171766 171882 171761 171022 170067 168956 167422 165973 165619 166344 167025 166953 166319 165292 163908 162835 162868
54218A62868P51L40j68K41Q21N72J28M74R71M65o24j033o99m60m33k62k36p26
$$ 162868 163619 163959 163791 164032 164853 165425 165553 166027 166998 167463 166839 165806 165107 164647 164214 163952 163716 162990
54200A62990j147p83l6L16M15P05R16P70Q05J345J545P44k28l31L5n8m16l57j14
$$ 162990 161843 161060 161024 161340 161755 162460 163376 164146 164951 166296 167841 168585 168357 168026 168061 168003 167587 167230 167116
54181A67116k48m54k06J82K64L83Q10Q97K51l27k36k70j100j799j302l00q2m95
$$ 167116 166868 166414 166208 166390 166654 167037 167847 168744 168995 168668 168432 168162 167062 165263 163961 163661 163579 163084
54163A63084n56k82l19n78o22p38j235j496r01MM72P33J097J039L78J42Q74J416
$$ 163084 162528 162246 161927 161349 160727 159989 158754 157258 156357 156361 156833 157566 158663 159702 160080 160222 161096 162512
54145A62512Q40K37P92J474O39j094j751r77lO95J644K631K690J692M60n11j109
$$ 162512 163352 163589 164381 165855 166494 165400 163649 162672 162669 163364 165008 167639 170329 172021 172481 171970 170861
54128A70861r58lP40L76n00p84m93k24J12O76Q15J65l02K52J015R68O83J116J662
$$ 170861 169903 169900 170640 171016 170516 169732 169239 169015 169127 169803 170618 170783 170481 170733 171748 172716 173399 174515 176177
54109A76177J266L61m9k98j116j769j116K41Q44O74P22J073J179J285J760J882
$$ 176177 177443 177804 177755 177457 176341 174572 173456 173697 174541 175215 175937 177010 178189 179474 181234 183116
54093A83116J133O85J607K722K433J610K209L968N055N297N994O975O519M182
$$ 183116 184249 184934 186541 189263 191696 193306 195515 199483 204538 209835 215829 222804 229323 233505
54079B33505J277j373l856n641n867n044m403l779k310p24n10j190r67J35M08
$$ 233505 234782 233409 229553 223912 218045 213001 208598 204819 202509 201785 201275 200085 199118 199253 199661
54064A99661l91p60l86o36j773k325j689r57o12J84J464J976J472J288J945K287
$$ 199661 199270 198510 198124 197488 195715 193390 191701 190744 190132 190316 191780 193756 195228 196516 198461 200748
54048B00748J715J192J397J775K138L226M965O023N865N557N862O215O173O240
$$ 200748 202463 203655 205052 206827 208965 212191 217156 223179 229044 234601 240463 246678 252851 259091
54034B59091O612O707O375O092N651M391K878K459K904K538J071J39M46P46K99
$$ 259091 265703 272410 278785 284877 290528 294919 297797 300256 303160 305698 306769 306908 307354 308100 308399
54019C08399R7N58K90j500l307l535k799k612l100l436l369l117k674k297k711
$$ 308399 308496 309054 309344 307844 304537 301002 298203 295591 292491 289055 285686 282569 279895 277598 274887
54004B74887l995n110n256m773m169l372k475k064k185k127j723j686k167k273
$$ 274887 270892 265782 260526 255753 251584 248212 245737 243673 241488 239361 237638 235952 233785 231512
53990B31512j644j170j476j941j928j811k000k045j519q51n78n48m54l48k67j19
$$ 231512 229868 228698 227222 225281 223353 221542 219542 217497 215978 215127 214549 214001 213547 213199 212932 212813
53974B12813j95q24j501j293k49O89J138J452J560J060M49O72J431J537J026J117
$$ 212813 212618 211794 210293 209000 208751 209440 210578 212030 213590 214650 215099 215771 217202 218739 219765 220882
53958B20882J916K073J172N02Q43J392J528J860K660L052K677K593L519M716N434
$$ 220882 222798 224871 226043 226545 227388 228780 230308 232168 234828 237880 240557 243150 246669 251385 256819
53943B56819O048O978P885Q839J0712J3494J5614J5741J3901J0304M855j282n549
$$ 256819 262867 269845 277730 286569 297281 310775 326389 342130 356031 366335 371190 369908 364359
53930C64359o775o551o618o493n075k996j622q76J82J461K142K293K719L627M593
$$ 364359 357584 351033 344415 337922 332847 329851 328229 327353 327535 328996 331138 333431 336150 339777 344370
53915C44370N463O270O665O340N642N165N019N003M891M325L129J948J610J636
$$ 344370 349833 356103 362768 369108 374750 379915 384934 389937 394828 399153 402282 404230 405840 407476
53901D07476O04j655l484l641k758j989j494j144j422k564l828m595n329o547
$$ 407476 408080 406425 402941 399300 396542 394553 393059 391915 390493 387929 384101 379506 374177 367630
53887C67630p758q241q094p753p258o629o175n780m848l446k553k639l032l205
$$ 367630 359872 351631 343537 335784 328526 321897 315722 309942 305094 301648 299095 296456 293424 290219
53873B90219l544m206m488m036l611l813m150m020l655l377l013k626k758l288
$$ 290219 286675 282469 277981 273945 270334 266521 262371 258351 254696 251319 248306 245680 242922 239634
53859B39634l224k195j097o39m81l27n68j207j504j321j440j914j683n57M6o54
$$ 239634 236410 234215 233118 232479 231998 231671 231103 229896 228392 227071 225631 223717 222034 221477 221523 220869
53843B20869j466j196m45k25l02j40j61o89r23k78M05K49k31k87l10p23p20L92
$$ 220869 219403 218207 217762 217537 217235 217095 216934 216245 215322 215044 215449 215698 215467 215180 214870 214147 213427 213819
53825B13819J701J943J342Q76O59L20O7Q9j69q61r02M76K244K919K516J950J538
$$ 213819 215520 217463 218805 219681 220340 220660 220727 220816 220647 219786 218884 219360 221604 224523 227039 228989 230527
53808B30527J364J959L256L840K850J657K137M093N897O895P521P742P140O138
$$ 230527 231891 233850 237106 240946 243796 245453 247590 251683 257580 264475 271996 279738 286878 293016
53794B93016N614N555N271M606L817K834J652Q89Q86R35M35p3j06m43j821l360
$$ 293016 298630 304185 309456 314062 317879 320713 322365 323254 324140 325075 325510 325437 325331 324888 323067 319707
53778C19707l831l583l724m221m362m367m788m994m071k709k398l081l435l200
$$ 319707 315876 312293 308569 304348 299986 295619 290831 285837 281766 279057 276659 273578 270143 266943
53764B66943l351m027m126l188k114j601j302r13r06j662k722l369l316k660j697
$$ 266943 263592 259565 255439 252251 250137 248536 247234 246321 245415 243753 241031 237662 234346 231686 229989
53749B29989q94n58n46o23q19j100j098o52j13K67O67J006P44j14o75m10J18L98
$$ 229989 229095 228537 227991 227368 226549 225449 224351 223699 223586 223853 224520 225526 226270 226156 225481 225071 225189 225587
53731B25587P97J456J576P80P2L30Q95Q82Q31J624K679K738J913J404J662K113
$$ 225587 226384 227840 229416 230196 230268 230598 231493 232375 233206 234830 237509 240247 242160 243564 245226 247339
53715B47339K305K190J689R93Q16J368J781J438J112J715K763L274L297L349L201
$$ 247339 249644 251834 253523 254516 255332 256700 258481 259919 261031 262746 265509 268783 272080 275429 278630
53700B78630K550K090K566L446L879M117M678M870L688J558k45j290j791j575
$$ 278630 281180 283270 285836 289282 293161 297278 301956 306826 310514 312072 311827 310537 308746 307171
53686C07171o89k23q75j491o44J038J831J468R46N05l09j020p29R4J38n69p98
$$ 307171 306482 306259 305384 303893 303249 304287 306118 307586 308532 309037 308728 307708 306979 307073 307211 306642 305844
53669C05844k18L52N96Q85R79K77p28q99l42k07o68p52j57L56M59O21Q62N88j84
$$ 305844 305626 305978 306574 307459 308438 308715 307987 307088 306746 306539 305871 305119 304962 305318 305777 306398 307260 307848 307664
53650C07664p47q84r48q38j93N41N35j0j44K59N22N28P90J356J819K252K848L027
$$ 307664 306917 306033 305085 304247 304054 304595 305130 305120 304976 305235 305757 306285 307075 308431 310250 312502 315350 318377
53632C18377K198J059P89J343J828K093K466K473J570N86P88J783K219K156K802
$$ 318377 320575 321634 322423 323766 325594 327687 330153 332626 334196 334782 335570 337353 339572 341728 344530
53617C44530M168M953M776M572M753M813M764N218N864N696M842M536N105N636
$$ 344530 348698 353651 358427 362999 367752 372565 377329 382547 388411 394107 398949 403485 408590 414226
53603D14226N613N327M709L489K413K443K854K041J75j004r80r33j259r49J16
$$ 414226 419839 425166 429875 433364 435777 438220 441074 443115 443290 442286 441306 440373 439114 438165 438281
53588D38281N71j16p55o72q41j904k821k494j365m75j59k47n49p21o81j098k316
$$ 438281 438852 438736 437981 437309 436468 434564 431743 429249 427884 427409 427250 427003 426454 425733 425052 423954 421638
53571D21638l170k492j349j686l047l068j341q0m62j057o72k03m24l31Q34J927
$$ 421638 418468 415976 414627 412941 409894 406826 405485 405405 404943 403886 403214 403011 402587 402256 403090 405017
53555D05017J760R29M72K95J54N62J535J917J226O50J102J751J655J340J575K030
$$ 405017 406777 407706 408178 408473 408627 409189 410724 412641 413867 414517 415619 417370 419025 420365 421940 423970
53539D23970K336L036M301N088M846M576N085N604N464N579O757Q022Q220Q112
$$ 423970 426306 429342 433643 438731 443577 448153 453238 458842 464306 469885 476642 484664 492884 500996
53525E00996R096J0913J2242J2758J3003J3021J2648J2476J3136J4173J4912J5746
$$ 500996 510092 521005 533247 546005 559008 572029 584677 597153 610289 624462 639374 655120
53513F55120J7302J9019J9963K0520K1783K3621K4745K4591K3960K3722K3865
$$ 655120 672422 691441 711404 731924 753707 777328 802073 826664 850624 874346 898211
53502H98211K3893K3551K3004K2599K2396K1909K0812J9751J9706K0504K1007
$$ 898211 922104 945655 968659 991258 1013654 1035563 1056375 1076126 1095832 1116336 1137343
53491A137343K0864K0872K1280K1139J9938J8583J7958J7722J7297J6893J6695
$$ 1137343 1158207 1179079 1200359 1221498 1241436 1260019 1277977 1295699 1312996 1329889 1346584
53480A346584J6187J5197J4624J5109J5948J6155J5680J4723J2902J0142P436
$$ 1346584 1362771 1377968 1392592 1407701 1423649 1439804 1455484 1470207 1483109 1493251 1500687
53469A500687N659M389K795Q12j391m242p985j1791j4552j5999j6383j5914j5122
$$ 1500687 1506346 1510735 1513530 1514342 1512951 1508709 1500724 1488933 1474381 1458382 1441999 1426085 1410963
53456A410963j4890j5391j5942j6409j7595j9551k0869k0673j9997k0093k0574
$$ 1410963 1396073 1380682 1364740 1348331 1330736 1311185 1290316 1269643 1249646 1229553 1208979
53445A208979k0519k0219k0420k0766k0393j9350j8101j6437j3999j1237q614
$$ 1208979 1188460 1168241 1147821 1127055 1106662 1087312 1069211 1052774 1038775 1027538 1018924
53434A018924n771k710p72r31j872j459M17K094K885L816N629P581Q684R103R899
$$ 1018924 1013153 1010443 1009671 1008740 1006868 1005409 1005826 1007920 1010805 1014621 1020250 1027831 1036515 1045618 1055517
53419A055517J1918J5009J8013J9749K0265K0694K1654K2541K2852K3195K4252
$$ 1055517 1067435 1082444 1100457 1120206 1140471 1161165 1182819 1205360 1228212 1251407 1275659
53408A275659K5642K6702K7606K8856L0375L1968L3916L6264L8360M0030M2275
$$ 1275659 1301301 1328003 1355609 1384465 1414840 1446808 1480724 1516988 1555348 1595378 1637653
53397A637653M5749M9381N1644N2555N3184N3932N4443N4710N5077N5584N6198
$$ 1637653 1683402 1732783 1784427 1836982 1890166 1944098 1998541 2053251 2108328 2163912 2220110
53386B220110N7152N8059N7488N4571N0459M7044M4774M2863M0966L9286L7498
$$ 2220110 2277262 2335321 2392809 2447380 2497839 2544883 2589657 2632520 2673486 2712772 2750270
53375B750270L4889L1417K7549K3423J9097J5104J1626P660K195m249j0575j7131
$$ 2750270 2785159 2816576 2844125 2867548 2886645 2901749 2913375 2921035 2923230 2918981 2908406 2891275
53363B891275k5157l4391m2721m8487n1977n4379n6250n7420n7731n7501n7453
$$ 2891275 2866118 2831727 2789006 2740519 2688542 2634163 2577913 2520493 2462762 2405261 2347808
53352B347808n8026n8488n7306n3944m9820m6812m5333m4567m3955m3541m3255
$$ 2347808 2289782 2231294 2173988 2120044 2070224 2023412 1978079 1933512 1889557 1846016 1802761
53341A802761m2864m2425m1973m1051l9093l6117l2539k8780k5473k3324k2221
$$ 1802761 1759897 1717472 1675499 1634448 1595355 1559238 1526699 1497919 1472446 1449122 1426901
53330A426901k1054j9075j6612j4059j1234q511p304q247r923j0662j0718j1245
$$ 1426901 1405847 1386772 1370160 1356101 1344867 1336356 1329052 1320805 1310882 1300220 1289502 1278257
53318A278257j2086j2153j1363j0579r956q901p457o253n256l850k132q78k98
$$ 1278257 1266171 1254018 1242655 1232076 1222120 1213219 1205762 1199509 1194253 1190403 1188271 1187393 1187095
53305A187095J75Q87J715K717M149N918P733R563J1297J2559J3538J5277J8193
$$ 1187095 1187270 1188157 1189872 1192589 1196738 1202656 1210389 1219952 1231249 1243808 1257346 1272623 1290816
53292A290816K1112K2862K4001K5664K7427K7932K7049K5855K4724K3104K1056
$$ 1290816 1311928 1334790 1358791 1384455 1411882 1439814 1466863 1492718 1517442 1540546 1561602
53281A561602J9499J8736J8067J6943J5455J3554J0907P587M039M02l300o523
$$ 1561602 1581101 1599837 1617904 1634847 1650302 1663856 1674763 1682350 1686389 1686791 1683491 1676968
53269A676968q715j0254j2004j4141j6318j8600k1318k4209k6697k8734l0543
$$ 1676968 1668253 1657999 1645995 1631854 1615536 1596936 1575618 1551409 1524712 1495978 1465435
53258A465435l1969l2867l3631l4391l4406l3282l2041l1721l1680l0654k8820
$$ 1465435 1433466 1400599 1366968 1332577 1298171 1264889 1232848 1201127 1169447 1138793 1109973
53247A109973k7261k6006k4291k2458k1785k2565k3861k5002k5881k6025k4964
$$ 1109973 1082712 1056706 1032415 1009957 988172 965607 941746 916744 890863 864838 839874
53236H39874k3383k2361k1628k0026j7609j5592j4312j2926j1166r695q634p420
$$ 839874 816491 794130 772502 752476 734867 719275 704963 692037 680871 671176 662542 655122
53224F55122o268o170p091p827p986q546j0004j1509j2362j2932j3561j3836j3596
$$ 655122 648854 642684 635593 627766 619780 611234 601230 589721 577359 564427 550866 537030 523434
53211E23434j3370j3277j2655j1344j0225r856r558q538p074n987n637n805o094
$$ 523434 510064 496787 484132 472788 462563 452707 443149 434611 427537 421550 415913 410108 404014
53198D04014o211o348p176q813j0094r792q258o820n950n191m566m556m829m540
$$ 404014 397803 391455 384279 375466 365372 355580 347322 340502 334552 329361 324795 320239 315410 310870
53184C10870l926l983m537m257k901j872k059k661k683k270j889j513j210j440
$$ 310870 306944 302961 298424 294167 291266 289394 287335 284674 281991 279721 277832 276319 275109 273669
53170B73669k144k537k255j753j252m35M53M40p02j892k149j641r55l34O6R3N0
$$ 273669 271525 268988 266733 264980 263728 263293 263746 264186 263484 261592 259443 257802 256847 256513 256579 256672 256722
53153B56722L07L81l90j386j319m03k13j085j430l34R19Q65m9m83q4O85J561K218
$$ 256722 257029 257410 257020 255634 254315 253912 253699 252614 251184 250850 251769 252634 252585 252102 252018 252703 254264 256482
53135B56482J979P86k78k61N30J303J837K090J725P62lr0l0l11m23K82J421K101
$$ 256482 258461 259247 258969 258708 259238 260541 262378 264468 266193 266955 266952 266862 266832 266521 266098 266380 267801 269902
53117B69902K093J852J725J703J554Q94m33j882k654k682k499k201j466o13m67
$$ 269902 271995 273847 275572 277275 278829 279723 279290 277408 274754 272072 269573 267372 265906 265293 264826
53102B64826r91j226q83p57j242j695j775k012k510k337j063L50R79J160J414
$$ 264826 263835 262609 261726 260969 259727 258032 256257 254245 251735 249398 248335 248685 249664 250824 252238
53087B52238J279K70r18j199n06M21J033J093N34j46q1P18J107M25m73n23L8L38
$$ 252238 253517 253787 252869 251670 251164 251585 252618 253711 254245 254099 254018 254736 255843 256268 255795 255272 255310 255648
53069B55648K08M5j26n38j055j348j401j311j040p22o73q00n94PM57N67Q03J329
$$ 255648 255856 255901 255775 255237 254182 252834 251433 250122 249082 248360 247687 246887 246293 246300 246757 247324 248127 249456
53051B49456J710J834K173K688K592J635N85q0q03j708j958j197m21n02r27r31
$$ 249456 251166 253000 255173 257861 260453 262088 262673 262593 261790 260082 258124 256927 256506 256004 255077 254146
53035B54146q32j232j679j394o06j83m00r35j525j872j491l99O14J067J421K012
$$ 254146 253314 252082 250403 249009 248403 248220 247820 246885 245360 243488 241997 241598 242212 243279 244700 246712
53019B46712K221J500M55j4K0n9l28m72m12j19O25J588J947J415Q25Q69J077P36
$$ 246712 248933 250433 250888 250874 250894 250835 250507 250035 249623 249504 250129 251717 253664 255079 255904 256773 257850 258586
53001B58586K8n10q55j009n63M51J148J093J113J805K276J561L64J9M34N19J53
$$ 258586 258614 258104 257249 256240 255677 256128 257276 258369 259482 261287 263563 265124 265488 265507 265941 266460 266613
52984B66613K24R46J544J617J592J766J856J653J391J356J662K295K932K957K163
$$ 266613 266837 267783 269327 270944 272536 274302 276158 277811 279202 280558 282220 284515 287447 290404 292567
52969B92567J092L18k02o47q20o48n75q50r93o11j76l07q84j472j983k323k081
$$ 292567 293659 293977 293775 293128 292308 291660 291085 290235 289242 288631 288455 288148 287264 285792 283809 281486 279405
52952B79405j347j080j793k546k204j084l67l59l97q2K99M20K49p2j95J84P28
$$ 279405 278058 276978 275185 272639 270435 269351 268984 268625 268228 268146 268445 268865 269114 269042 268847 269031 269759
52935B69759O60q7o78p58r72j545j508l11Q95Q06j24n27j54J79R2j94o15j039
$$ 269759 270419 270332 269654 268896 267924 266379 264871 264560 265455 266261 266137 265610 265456 265635 265727 265533 264918 263879
52917B63879p97L86J502J412M58k25m36p37j012o37J59M09j41p36p96m47L8M63
$$ 263879 263082 263468 264970 266382 266840 266615 266179 265442 264430 263793 263952 264361 264220 263484 262688 262241 262279 262742
52899B62742M85r1q92j418j543j185j01J316J943J403Q13J098J461P44o06j310
$$ 262742 263227 263136 262244 260826 259283 258098 257997 259313 261256 262659 263472 264570 266031 266775 266169 264859
52883B64859j287j351j534j260p82q08j042o14K18M21J06M64J732K771K906K788
$$ 264859 263572 262221 260687 259427 258645 257837 256795 256181 256399 256820 256926 257390 259122 261893 264799 267587
52867B67587L078L519L659L459K912J977J042N64K20n53j323j090lN08m57k319
$$ 267587 270665 274184 277843 281302 284214 286191 287233 287797 288017 287464 286141 285051 285048 285556 285099 282780
52851B82780m000m928m965m353l826l934m188l712k644j881j604j244q52j124
$$ 282780 278780 273852 268887 264534 260708 256774 252586 248874 246230 244349 242745 241501 240649 239525
52837B39525j915k024r05N11J178J142R50P65N88N99P51O50K00j64j48K8J35K30
$$ 239525 237610 235586 234681 235192 236370 237512 238462 239227 239815 240414 241165 241815 242015 241851 241703 241731 241866 242096
52819B42096L01K12J14L08O11M91k1k00L38J052J171N49l79j141j577j819k001
$$ 242096 242397 242609 242723 243031 243642 244133 244112 243912 244250 245302 246473 247022 246643 245502 243925 242106 240105
52802B40105j995j622j161j107j308j021j32N19M75M24Q52R95J39r53j130o62
$$ 240105 238110 236488 235327 234220 232912 231891 231759 232278 232753 233177 234029 235024 235163 234210 233080 232418
52786B32418n99q95o93oL83L97O50J077J077Q47J111J596J261J40n82m79l90p74
$$ 232418 231819 230924 230231 230225 230608 231005 231655 232732 233809 234656 235767 237363 238624 238764 238182 237703 237313 236539
52768B36539j003p39o26j009j194o55M3J66j39l10j86J00M05M85J60k03L5Q01
$$ 236539 235536 234797 234171 233162 231968 231313 231356 231522 231383 231073 230887 230987 231392 231877 232037 231834 231869 232670
52750B32670J316J182Q43Q62J279J803K081J869J403J341J814J986J249L09J07
$$ 232670 233986 235168 236011 236873 238152 239955 242036 243905 245308 246649 248463 250449 251698 252007 252114
52735B52114L00J9n01m52q5k14l79O19K386K993J732J7q97j410k111k466j892
$$ 252114 252414 252433 251932 251480 251395 251181 250802 251421 253807 256800 258532 258549 257652 256242 254131 251665 249773
52718B49773r38m69n08o42p46p57n04j84k19l27K34J268J594P65j90l01R8K20
$$ 249773 248835 248366 247858 247216 246470 245713 245209 245025 244806 244479 244713 245981 247575 248340 248150 247849 247947 248167
52700B48167j3k32k33J36R53J743J796J177O17L05j90o98m38N24J043N69j45m65
$$ 248167 248154 247922 247689 247825 248778 250521 252317 253494 254111 254416 254226 253528 253090 253614 254657 255226 255081 254616
52682B54616p09j029q40p4K25m95j136m69J052J920J437J28j109j637j273n13
$$ 254616 253907 252878 252038 251964 252189 251694 250558 250089 251141 253061 254498 254626 253517 251880 250607 250094
52666B50094r2p4J04N74Q26P72R98J623J918J577J330J800K581L043L093K689
$$ 250094 250002 249928 250032 250606 251432 252204 253202 254825 256743 258320 259650 261450 264031 267074 270167 272856
52650B72856J549q3j259j535j489j619j624j281j031j089r84n28l12n56n59P1
$$ 272856 274405 274322 273063 271528 270039 268420 266796 265515 264484 263395 262411 261883 261571 261015 260456 260527
52634B60527O47O09N01R65J679K131K439K617J945J76j574k091j617j209j227
$$ 260527 261174 261783 262284 263249 264928 267059 269498 272115 274060 274236 272662 270571 268954 267745 266518
52619B66518j378j540j650j340o00k07o58j201q33K60J074J176Q95N81L87M22
$$ 266518 265140 263600 261950 260610 260010 259803 259145 257944 257111 257371 258445 259621 260516 261097 261484 261906
52603B61906N59M02j07m70m40l16j71M02J253J478Q57M73J036J611J086ll63P4
$$ 261906 262465 262867 262760 262290 261850 261534 261363 261765 263018 264496 265353 265826 266862 268473 269559 269556 269193 269267
52585B69267L92L37M59Q49R73O98M71M76M42K81K14K97L36J91k32r92j742j775
$$ 269267 269659 269996 270455 271304 272277 272975 273446 273922 274364 274645 274859 275156 275492 275683 275451 274459 272717 270942
52567B70942r42j24j79q40j204r39m15J8L01M28L80K05j22o14j020j143j358k110
$$ 270942 270000 269876 269697 268857 267653 266714 266299 266317 266618 267046 267426 267631 267509 266895 265875 264732 263374 261264
52549B61264k818k296n31J003J231O47J28l02p87q64k51L96M61L42O23J114J475
$$ 261264 258446 256150 255619 256622 257853 258500 258628 258326 257539 256675 256424 256820 257281 257623 258246 259360 260835
52532B60835J940K530K425J188j29k50N77J157J059P51N39M23N97J143J578J526
$$ 260835 262775 265305 267730 268918 268789 268539 269116 270273 271332 272083 272622 273045 273642 274785 276363 277889
52516B77889J370J563J841J879K046K604K957K662K404K881L317K429L35j697
$$ 277889 279259 280822 282663 284542 286588 289192 292149 294811 297215 300096 303413 305842 306177 304480
52502C04480k993l824m347m431m289m175l720k544j254q29j227j641j742j681
$$ 304480 301487 297663 293316 288885 284596 280421 276701 274157 272903 272074 270847 269206 267464 265783
52488B65783j187Q6J459J745Q62j7l6N69J255J799K060J854J261N67r1n63n27
$$ 265783 264596 264682 266141 267886 268748 268731 268695 269264 270519 272318 274378 276232 277493 278060 277969 277406 276879
52471B76879L7N47N78N21Q98J533K065K708L649M309M071L296K653J941N94j125
$$ 276879 276916 277463 278041 278562 279460 280993 283058 285766 289415 293724 297795 301091 303744 305685 306279 305154
52455C05154k435l213l781l957l436k726k592k781k443j619j145j282j479j444
$$ 305154 302719 299506 295725 291768 288332 285606 283014 280233 277790 276171 275026 273744 272265 270821
52441B70821j351j102m21L78P18P44R85J204O83l95r67n87J05N06O76P94Q41R88
$$ 270821 269470 268368 267947 268325 269043 269787 270772 271976 272659 272264 271297 270710 270815 271321 271997 272791 273632 274620
52423B74620J411J720J332M88O5L44P15O68M20M50J042K158L320L808L550L521
$$ 274620 276031 277751 279083 279571 279636 279980 280695 281363 281783 282233 283275 285433 288753 292561 296111 299632
52407B99632M678O892R438J1894J3672J3465J0376N327J98m056p447r707j0328
$$ 299632 304310 311202 320640 332534 346206 359671 370047 375374 375572 371516 364069 354362 344034
52394C44034r586q302o761m959l464k774k184p86P79J105L84J97R99J628J501
$$ 344034 334448 326146 319385 314426 310962 308188 306004 305218 305997 307102 307486 307683 308682 310310 311811
52379C11811J508K160K557K011J340J634K800M055M961N383N181M488L674K714
$$ 311811 313319 315479 318036 320047 321387 323021 325821 329876 334837 340220 345401 349889 353563 356277
52365C56277J333j49r91j121j037o92L38J510J593O08MM82J105J154J318K072
$$ 356277 357610 357461 356470 355349 354312 353620 353958 355468 357061 357669 357673 358155 359260 360414 361732 363804
52349C63804K421J457J08p2R38J941K360K553K746K826K996L629M521N034M973
$$ 363804 366225 367682 367790 367718 368656 370597 372957 375510 378256 381082 384078 387707 392228 397262 402235
52334D02235M738M678M857N308O043O830P382P762Q316R311J0785J2538J4086
$$ 402235 406973 411651 416508 421816 427859 434689 442071 449833 458149 467460 478245 490783 504869
52321E04869J4780J4300J3014J1740J1224J1661J2540J3114J3315J4024J5972
$$ 504869 519649 533949 546963 558703 569927 581588 594128 607242 620557 634581 650553
52310F50553J8537K0231K0346J9609J9163J9417K0060K0639K0949K1100K1324
$$ 650553 669090 689321 709667 729276 748439 767856 787916 808555 829504 850604 871928
52299H71928K1595K1501K0613J8777J5961J2317Q659O127M870L727J833k04j609
$$ 871928 893523 915024 935637 954414 970375 982692 991351 997478 1002348 1006075 1007908 1007704 1006095
52286A006095k906m870o724p006n903n047n073m998m260l715m075m714m693m007
$$ 1006095 1003189 998319 991595 984589 978686 973639 968566 963568 959308 955593 951518 946804 942111 938104
52272I38104l121k152j051J00J332K693L736L885L547L926N571P811R881J1658
$$ 938104 934983 932831 931780 931880 933212 935905 939641 943526 947073 950999 956570 964381 974262 985920
52258I85920J3196J4416J5488J6732J7880J8344J8223J8152J8041J7048J4925
$$ 985920 999116 1013532 1029020 1045752 1063632 1081976 1100199 1118351 1136392 1153440 1168365
52247A168365J2285R446O211L017R15p0j219l185n020n828o184p108q605j0101
$$ 1168365 1180650 1190096 1196307 1199324 1200239 1200169 1198950 1195765 1190745 1184917 1178733 1171625 1163020 1152919
52233A152919j1484j2838j3869j4337j4468j4373j3712j2515j1596j1573j2058
$$ 1152919 1141435 1128597 1114728 1100391 1085923 1071550 1057838 1045323 1033727 1022154 1010096
52222A010096j2318j2079j1322j0022q565p654p345o929o116n427n010m092k234
$$ 1010096 997778 985699 974377 964355 955790 948136 940791 933862 927746 922319 917309 913217 910983
52209I10983k00J059J457J279N75k32j73J039K408L040L377M275N648O888P852
$$ 910983 910783 911842 913299 914578 915153 914921 914748 915787 918195 921235 924612 928887 934535 941423 949275
52194I49275Q522Q369P014N072L510K511J664P09m84k085l841n011n427n941p138
$$ 949275 957797 966166 973180 978252 981762 984273 985937 986646 986162 984077 980236 975225 969798 963857 956719
52179I56719q346q641q130p439o604n456m488m261m359l916k923k107j701j214
$$ 956719 948373 939732 931602 924163 917559 912103 907615 903354 898995 895079 892156 890049 888348 887134
$$ [...]
##END NTUPLES=NMR SPECTRUM
##END=
