##TITLE=AC1739_SEN00012_9276231_ytOQJRrE6d
##JCAMPDX= 6.0         $$ Bruker NMR JCAMP-DX V2.0
##DATA TYPE= NMR SPECTRUM
##DATA CLASS= NTUPLES
##ORIGIN= BRUKER
##OWNER= Administrator
$$ 1.72 TOPSPIN		Version 2.1
$$ 2015-07-14 23:50:37.604 -0700  Administrator@X
$$ Compression mode = diff/dup
##.OBSERVE FREQUENCY= 400.02188249412
##.OBSERVE NUCLEUS= ^1H
##.ACQUISITION MODE= SIMULTANEOUS (DQD)
##.ACQUISITION SCHEME= undefined
##.AVERAGES= 8
##.DIGITISER RES= 22
##SPECTROMETER/DATA SYSTEM= spect
##.PULSE SEQUENCE= zg30
##.SOLVENT NAME= COFFEE_meoh
##.SHIFT REFERENCE= INTERNAL, COFFEE_meoh, 1, 14.98509
##AUDIT TRAIL= $$ (NUMBER, WHEN, WHO, WHERE, PROCESS, VERSION, WHAT)
$$ ##TITLE= Audit trail, TOPSPIN		Version 2.1
$$ ##JCAMPDX= 5.01
$$ ##ORIGIN= Bruker BioSpin GmbH
$$ ##OWNER= Administrator
$$ $$ E:\/data/COFFEE/nmr/AC1739_SEN00012_9276231_ytOQJRrE6d/10/pdata/1/auditp.txt
$$ ##AUDIT TRAIL=  $$ (NUMBER, WHEN, WHO, WHERE, PROCESS, VERSION, WHAT)
(   1,<2015-07-14 23:50:30.182 -0700>,<Administrator>,<X>,<go>,<TOPSPIN 2.1>,
      <created by zg
	started at 2015-07-14 23:49:24.322 -0700,
	POWCHK enabled, PULCHK disabled,
       configuration hash MD5:
       21 0F 79 D6 B3 7B B4 F6 88 20 88 DB 03 48 BD 9F
       data hash MD5: 64K
       C0 D2 03 A0 F5 D6 D8 16 F5 98 65 00 EF E6 8C 8E>)
(   2,<2015-07-14 23:50:33.291 -0700>,<Administrator>,<X>,<proc1d>,<TOPSPIN 2.1>,
      <Start of raw data processing
       efp LB = 0 FT_mod = 6 PKNL = 1 PHC0 = 0 PHC1 = 0 SI = 32K 
       data hash MD5: 32K
       CC C1 54 6B 1A EC 32 8C 67 34 90 6F F4 C0 B8 3B>)
(   3,<2015-07-14 23:50:33.557 -0700>,<Administrator>,<X>,<proc1d>,<TOPSPIN 2.1>,
      <pk PHC0 = 88.03894 PHC1 = 0 
       data hash MD5: 32K
       76 70 C3 AD 69 5B A5 7F D8 A2 2B D3 75 1A E1 FE>)
(   4,<2015-07-14 23:50:33.822 -0700>,<Administrator>,<X>,<proc1d>,<TOPSPIN 2.1>,
      <abs ABSG = 1 
       data hash MD5: 32K
       28 D5 26 B4 32 E0 38 92 8F AD 00 C0 7F E5 0F 5F>)
(   5,<2015-07-14 23:50:33.885 -0700>,<Administrator>,<X>,<proc1d>,<TOPSPIN 2.1>,
      <abs ABSG = 2 
       data hash MD5: 32K
       F6 EA 62 45 9A FB FA C7 9B AE F8 7C B5 91 07 AE>)
(   6,<2015-07-14 23:50:33.947 -0700>,<Administrator>,<X>,<proc1d>,<TOPSPIN 2.1>,
      <abs ABSG = 3 
       data hash MD5: 32K
       65 0D 99 08 9E 28 F4 07 3A 98 54 1A 64 CC 13 96>)
(   7,<2015-07-14 23:50:34.010 -0700>,<Administrator>,<X>,<proc1d>,<TOPSPIN 2.1>,
      <abs ABSG = 4 
       data hash MD5: 32K
       B6 1B 43 75 8D 9B C9 82 C4 A7 0B BA DA 02 19 90>)
(   8,<2015-07-14 23:50:34.088 -0700>,<Administrator>,<X>,<proc1d>,<TOPSPIN 2.1>,
      <abs ABSG = 5 
       data hash MD5: 32K
       31 65 6B B4 09 BF 00 A7 30 0F 6D 7D A7 FA 62 1A>)
$$ ##END=
$$ 
$$ $$ hash MD5
$$ $$ 0E 04 BE 40 75 6D F3 30 9F B8 84 5B A5 D2 B1 AF
##$RELAX= 
##$RELAX= 
##$RELAX= 
##$RELAX= 
##$RELAX= 
##$RELAX= 
##$RELAX= 
$$ Bruker specific parameters
$$ --------------------------
##$DU= <E:\>
##$EXPNO= 10
##$NAME= <AC1739_SEN00012_9276231_ytOQJRrE6d>
$$ [...]
150 150 150 150 150 150 150 150
##$TP07= 0
##$TPNAME0= <>
##$TPNAME1= <>
##$TPNAME2= <>
##$TPNAME3= <>
##$TPNAME4= <>
##$TPNAME5= <>
##$TPNAME6= <>
##$TPNAME7= <>
##$TPOAL= (0..7)
0.5 0.5 0.5 0.5 0.5 0.5 0.5 0.5
##$TPOFFS= (0..7)
0 0 0 0 0 0 0 0
##$TUNHIN= 0
##$TUNHOUT= 0
##$TUNXOUT= 0
##$USERA1= <user>
##$USERA2= <user>
##$USERA3= <user>
##$USERA4= <user>
##$USERA5= <user>
##$V9= 5
##$VALIST= <valist>
##$VCLIST= <CCCCCCCCCCCCCCC>
##$VD= 0
##$VDLIST= <DDDDDDDDDDDDDDD>
##$VPLIST= <PPPPPPPPPPPPPPP>
##$VTLIST= <TTTTTTTTTTTTTTT>
##$WBST= 2048
##$WBSW= 25
##$XGAIN= (0..3)
0 0 0 0
##$XL= 0
##$YL= 0
##$YMAX_a= 595531
##$YMIN_a= -521723
##$ZGOPTNS= <>
##$ZL1= 120
##$ZL2= 120
##$ZL3= 120
##$ZL4= 120
##$ABSF1= 14.98509
##$ABSF2= -5.573092
##$ABSG= 5
##$ABSL= 3
##$ALPHA= 0
##$AQORDER= 0
##$ASSFAC= 0
##$ASSFACI= 0
##$ASSFACX= 0
##$ASSWID= 0
##$AUNMP= <proc_prof1d_extract_pilot.lims>
##$AXLEFT= 0
##$AXNAME= <>
##$AXNUC= <1H>
##$AXRIGHT= 0
##$AXTYPE= 0
##$AXUNIT= <>
##$AZFE= 0.1
##$AZFW= 0.1
##$BCFW= 0
##$BC_mod= 0
##$BYTORDP= 0
##$COROFFS= 0
##$CY= 15
##$DATMOD= 1
##$DC= 0
##$DFILT= <>
##$DTYPP= 0
##$F1P= 0
##$F2P= 0
##$FCOR= 0.5
##$FTSIZE= 32768
##$FT_mod= 6
##$GAMMA= 0
##$GB= 0
##$INTBC= 1
##$INTSCL= 1
##$ISEN= 128
##$LB= 0
##$LEV0= 0
##$LPBIN= 0
##$MAXI= 10000
##$MC2= 0
##$MEAN= 0
##$ME_mod= 0
##$MI= 0
##$NCOEF= 0
##$NC_proc= -8
##$NLEV= 6
##$NOISF1= 0
##$NOISF2= 0
##$NSP= 0
##$NTH_PI= 0
##$NZP= 0
##$OFFSET= 14.98509
##$PC= 1
##$PHC0= 88.03894
##$PHC1= 0
##$PH_mod= 1
##$PKNL= yes
##$PPARMOD= 0
##$PPDIAG= 0
##$PPIPTYP= 0
##$PPMPNUM= 2147483647
##$PPRESOL= 1
##$PSCAL= 4
##$PSIGN= 0
##$PYNMP= <proc.py>
##$REVERSE= no
##$SF= 400.02
##$SI= 32768
##$SIGF1= 0
##$SIGF2= 0
##$SINO= 400
##$SIOLD= 32768
##$SPECTYP= <>
##$SREGLST= <1H.CDCl3>
##$SSB= 0
##$STSI= 32768
##$STSR= 0
##$SW_p= 8223.68421052631
##$SYMM= 0
##$S_DEV= 0
##$TDeff= 65536
##$TDoff= 0
##$TI= <>
##$TILT= no
##$TM1= 0
##$TM2= 0
##$TOPLEV= 0
##$USERP1= <user>
##$USERP2= <user>
##$USERP3= <user>
##$USERP4= <user>
##$USERP5= <user>
##$WDW= 1
##$XDIM= 32768
##$YMAX_p= 448738902
##$YMIN_p= -687094
##$CURPLOT= <Network HP LaserJet P1505>
##$CURPRIN= <$Network HP LaserJet P1505>
##$DFORMAT= <normdp>
##$LAYOUT= <+/1D_H.xwp>
##$LFORMAT= <normlp>
##$PFORMAT= <normpl>
##$SURQMSG= 1
$$ End of Bruker specific parameters
$$ ---------------------------------
##NTUPLES= NMR SPECTRUM
##VAR_NAME=  FREQUENCY,     SPECTRUM/REAL,   SPECTRUM/IMAG
##SYMBOL=    X,             R,               I
##VAR_TYPE=  INDEPENDENT,   DEPENDENT,       DEPENDENT
##VAR_FORM=  AFFN,          ASDF,            ASDF
##VAR_DIM=   32768,         32768,           32768
##UNITS=     HZ,            ARBITRARY UNITS, ARBITRARY UNITS
##FACTOR=    0.250966925370066, 1,           1
##FIRST=     8223.43324360094, -179219,      -80744
##LAST=      0,             226049,          -276299
##MIN=       0,             -687094,         0
##MAX=       8223.43324360094, 448738902,    0
$$ Real data points
##PAGE= N=1
##DATA TABLE= (X++(R..R)), XYDATA
$$ [...]
19553A42662g051H5505L9876i9868B8707a07259B57467a78107C18271b16919B35419
19541b49437B9182Q1334J09379D9004a0610A31215J65853H578a50191B15538a88412
19529a2135l30554a55998D87J72060F356a20711k2629k09585C7285b60375J23231
19518a37144j62662b513k4271j76035f1313o6391I470g0836k4612b7031p3302
19507a00333A13838b73578L0158d5308a4872A79807p5888f3144B99988b62778
19496a77803A7833b45313b4030k99125d7223L536l16748L0273E5140a86719B426
19484a14612h351B0317J11929b7051C86716g7472I7390K29097n0173d5211j45257
19473a90468P6798b8770i918k43150i1966j39833P4734c7414A79124b35808a12661
$$ y = [142662, -7051, 85505, 125381, -99868, 28707, -107259, 257467, -178107, 318271, -216919, 235419, -249437, 29182, 110516, 219895, 49004, -10610, 131215, 297068, 8578, -150191, 215538, -188412, -12135, -342689, -155998, 487, 172547, 6356, -120711, -143340, -352925, 37285, -260375, -137144, -299806, -2513, -26784, -202819, -61313, -127704, 9470, -70836, -95448, -27031, -100333, 113838, -273578, -243420, -45308, -14872, 179807, 103919, -63144, 299988, -262778, -177803, 17833, -245313, -24030, -323155, -47223, -43687, -360435, -330162, 55140, -186719, 2426, -114612, -8351, 20317, 132246, -27051, 386716, -77472, 97390, 326487, 276314, -45211, -190468, -113670, -28770, -9918, -253068, -91966, -231799, -157065, -37414, 179124, -235808, -112661]
19461b88703B5781a16947N5894k37371a20604D42424a30977r7287b6163A1491
19450A62805C7525b7616k84457A11387b43884A17055c6050m8083o5183B63216
19439a11964B8579J0385a71205P3965j71055e7472k34035A2162J792L16969a33519
19427d24035C27011b11267E6745a24307B7878J97378b8549m983j3875B1890A0862
19415c8660A55588b06317C23485b1876q7862A06681G703J9549e94586A22661l9565
19404H3096i1032c5849H4677I776c07081A51541d4748A61900c29686A64488c20559
19392a94456I5933a52007A12689l7270b75349R6429O5383B06363a57903k3267
19382a81170J1703P0596B56732a03795A76613b99518i300q4962k6290j18802i6209
$$ y = [-288703, 25781, -116947, -61053, -298424, -120604, 442424, -130977, -228264, -26163, 11491, 162805, 37525, -27616, -312073, 111387, -243884, 117055, -36050, -84133, -149316, 263216, -111964, 28579, 38964, -171205, -97240, -268295, -57472, -291507, 12162, 13954, 330923, -133519, -424035, 327011, -211267, 56745, -124307, 27878, 225256, -28549, -33532, -47407, 21890, 10862, -38660, 155588, -206317, 323485, -21876, -109738, 106681, 7703, 27252, -594586, 122661, 83096, -91032, -35849, 84677, 9776, -307081, 151541, -44748, 161900, -329686, 164488, -320559, -194456, 95933, -152007, 112689, 75419, -275349, -178920, -113537, 206363, -157903, -181170, -169467, -98871, 256732, -103795, 176613, -299518, -9300, -94262, -120552, -239354, -96209]
19370b90626c3633j39725e3494F1600A1262e9222j17054g9508K7459A00863b813
19358A20691a35679A05112i751m3232A02200a6188A3699f230k27179A87693e5161
19346A78639J32537r9568c1643B0959K9414c06698A4039a96692j1825J02420l4108
19335a40205j62320B0618a79562B0707O2130b42251c9764j49295j79765P2265
19325b96559j65536a23942e8010n5884L5745j57184N282l0187m1611i8374p7190
19314a75564H2560b43692n4468B45173a46350e3209a1581k92033B2270I784K20835
19303B30619C9391a57778M5145D3109f7436D53242c23186f8757C1884M2006c09525
19291a82396E2953c44634A0739a4761C0181b56616d2680j40444f239l29729J07782
$$ y = [-290626, -33633, -173358, -53494, 61600, 11262, -59222, -176276, -79508, -52049, 100863, -2813, 120691, -135679, 105112, -9751, -52983, 102200, -16188, 13699, -6230, -233409, 187693, -55161, 178639, 311176, 211608, -31643, 20959, 50373, -306698, 14039, -196692, -208517, -106097, -140205, -302525, 20618, -179562, 20707, 82837, -242251, -39764, -189059, -368824, -296559, -462095, -123942, -58010, -113894, -78149, -235333, -230051, -260238, -301849, -98374, -175564, 82560, -243692, -298160, 245173, -146350, -53209, -11581, -303614, 22270, 9784, 230619, 39391, -157778, -112633, 43109, -67436, 453242, -323186, -68757, 31884, 73890, -309525, -182396, 52953, -344634, 10739, -14761, 30181, -256616, -42680, -183124, -6239, -335968, -228186]
19280b28186a09359A8813b41070a5312B20790a31299G2467j2227J8928d4816j76310
19269b21126h2596I2802J53866H2565G574g923E2062a97355O6333j3521M4921
19258i9622b4960k10490A27691O8588a69670h3168j13560F6787a67316A39753
19247d0318l05291m7764a71457l4387K5984g7903B14531D5824M6213c01984J03796
19236a98188Q5310B7250P2554f8493r8199b6188B7762a66209j56384J41051j16339
19225b97881A74101o567B1409a19711F3469h3850j21122L854D9094a06320G4374
19213B4724Q6668e3704j63653h1194L6991i747k24191A31829a24014c3201J635
19202c1566o2088n9926j89714B62898o8344C0116K8103c8434a4895l8824A81752
$$ y = [-228186, -109359, 18813, -241070, -15312, 220790, -131299, 72467, 60240, 79168, -44816, -221126, -82596, 92802, 246668, 82565, 7574, -7923, 52062, -197355, -131022, -144543, -99622, -24960, -235450, 127691, 196279, -169670, -83168, -196728, 66787, -167316, 139753, -40318, -345609, -393373, -171457, -205844, -179860, -77903, 214531, 45824, 92037, -301984, -198188, -112878, 27250, 99804, -68493, -166692, -26188, 27762, -166209, -322593, -181542, -297881, 174101, 167534, 21409, -119711, 63469, -83850, -204972, -201118, 49094, -106320, 74374, 24724, 111392, -53704, -217357, -81194, -44203, -9747, -233938, 131829, -124014, -33201, -31566, -93654, -153580, -343294, 262898, 194554, 30116, 58219, -38434, -14895, -53719, 181752]
19190a87602p4846j67186a6485B9669d7086B2582d67072B2529P7436C5783a5788
19178c3293a4026k38231a8588A46440a35217A49612a02497j07481C37711p2283
19168B65428a97199H5076R2157d59513K21501A17828b5818p665H536b16518O4058
19157a52460N3233j545G957i4305k11989G1164B3584m283a37996j60286F4159
19145b81k7590j05222e265k70235A46089c99002i5804A03367b35244C03191B5254
19133c51045g873A33940O3908R1553a1954k57426J33406l62549a31669l5919d7743
19121A4792P2318i1284C04162j16999P7614a45369B5171e2457C4199K5359i6791
19109A40644a2179j76760F7191b2192C2369K13334b19594P6096k6863F1326L34217
$$ y = [-187602, -262448, -429634, -16485, 29669, -47086, 22582, -467072, 22529, 99965, 35783, -15788, -33293, -14026, -252257, -18588, 146440, -135217, 149612, -102497, -209978, 337711, 265428, -197199, 85076, 177233, -459513, -238012, 117828, -25818, -33483, 8536, -216518, -152460, -99227, -100772, 7957, -94305, -306294, 71164, 23584, 19301, -137996, -298282, 64159, -281, -27871, -133093, -5265, -275500, 146089, -399002, -95804, 103367, -235244, 303191, 25254, -351045, -7873, 133940, 197848, 289401, -11954, -269380, -135974, -498523, -131669, -167588, -47743, 14792, 87110, -91284, 304162, 187163, 264777, -145369, 25171, -52457, 34199, 59558, -96791, 140644, -12179, -188939, 67191, -22192, 32369, 245703, -219594, -143498, -170361, 61326, 395543]
19098C95543e823A4027a17445p347d9993p8287C491c22629C90084b48659B09545
19086b64031j57026a62646j25191a07951b7023m6503He2270A34433b69295a33310
19074a16260A22037e0720j90194f5234h009l5448A00981a03645j46771a8182j62348
19063a80530C21141a85160M7848A60716B8021O2529a59973d3007B5204i6785k60871
19052c57656J44547B833M0319h4947m16031K13656a38846K0795l9472k843G3970
19040I5492c6700k6275r794l08074a67135J4972d689D3114a43736A73753d20508
19028B70555j13507J2390n0261B7961L466a19583A55890a77125I2087i3097B5824
19016a35085j6547B3691c53411A23211c44343C19279g6921k16j1190C5155c01619
$$ y = [395543, -5823, 14027, -117445, -124792, -49993, -128280, 3491, -322629, 390084, -248659, 209545, -264031, -421057, -162646, -287837, -107951, -27023, -73526, 8, -52270, 134433, -269295, -133310, -116260, 122037, -50720, -240914, -65234, -8009, -43457, 100981, -103645, -250416, -18182, -180530, 321141, -185160, -137312, 160716, 28021, 90550, -159973, -43007, 25204, -96785, -357656, -213109, 2833, 43152, -84947, -500978, -287322, -138846, -118051, -157523, -160366, 73970, 95492, -36700, -62975, -72769, -380843, -167135, -152163, -4689, 43114, -143736, 173753, -420508, 270555, 157048, 169438, 119177, 27961, 31427, -119583, 155890, -177125, 92087, -93097, 25824, -135085, -151632, 23691, -353411, 123211, -344343, 319279, -76921, -77137, -88327, 35155, -301619]
19004i4896D2627j4798c99827a0475F1230b48710j3916c9408j42471D544N4456
18993E9000a21572j12589N3881h065m8123A52228i1645l7518C0555a97864H6370
18981f6148j45731P5203G6131c00677B18217a91136H3695J2215b57257i1635K2638
18970f8997A30836e1729A01337c50262J27406J5321A68771n1131b53378J00074
18960a53304B768e6360G1593b54986R1380f8454K6284A11203a17504a6309j44916
18949a61225M4164J7753I947K15506o1541c17918a39434j24797B90254E1578L898
18938E5476a36821c556A894g648A08483E1043b48369e2985m4200O505a0188a569
18925B84896D9110c0325A38229i5044j76664c1450k06722J3165c9281f021j10089
$$ y = [-94896, 42627, 27829, -399827, -10475, 61230, -248710, -262626, -39408, -181879, 4544, 59000, -121572, -234161, -180280, -8065, -56188, 152228, -91645, -129163, 30555, -197864, 86370, -66148, -211879, -136676, 76131, -300677, 218217, -191136, 83695, 95910, -257257, -91635, -68997, 130836, -51729, 101337, -350262, -222856, -207535, 168771, 117640, -253378, -153304, 2768, -56360, 71593, -254986, -163606, -68454, -42170, 111203, -117504, -16309, -161225, -117061, -99308, 9947, 225453, 163912, -317918, -139434, -264231, 290254, 51578, 55476, -136821, -3556, 1894, -7648, 108483, 51043, -248369, -52985, -97185, -90680, -10188, -1569, 284896, 49110, -30325, 138229, -95044, -271708, -31450, -238172, -225007, -39281, -6021, -116110]
18914a16110I2026a32928l6901A09199b34636h4111A02541c65608J16670j8399
18904b67337a4165j10397j57455b3919D7422b72977Q6207E2094Q5658A4561M1928
18893E6489J06467B9649L98462h4722A68214a10851c1518l6939A43818c28373
18882A56436C0209b26378E2666h0815j06639N8109M5219B7215c35651i5719j32453
18871b28172b4912A80417m8130M6728q7748b55549c0526j45122A47103a016j3090
18860a4106B0162K20427i9932A68408b99394I7248l8256A0740h4748a131r5800
18849i6931A23894B155R8827P595j9245J1396a23794R363r1875B37779c67768
18837a6429A64821D1531J95690a74219f6165l0512C5397a95281N0374B12442b23701
$$ y = [-116110, 92026, -132928, -169829, 109199, -234636, -84111, 102541, -365608, -248938, -267337, -14165, -124562, -282017, -23919, 47422, -272977, -186770, 52094, 137752, 14561, 56489, 162956, 29649, 428111, -84722, 168214, -110851, -31518, -68457, 143818, -328373, 156436, 30209, -226378, 52666, -80815, -187454, -129345, -84126, 27215, -335651, -95719, -228172, -24912, 180417, 132287, 179015, 91267, -255549, -30526, -175648, 147103, -1016, -14106, 20162, 240589, -99932, 168408, -299394, 97248, 58992, 10740, -84748, -1131, -96931, 123894, 2155, 100982, 108577, 89332, 100728, -123794, -114431, -206306, 237779, -367768, -16429, 164821, 41531, 237221, -174219, -66165, -96677, 35397, -195281, -144907, 212442, -223701]
18825A75465a340k78601Q8975C5223b72361a18691d6971j17517k08850D30184
18814a3263j4861A35556F6815K32304H2804L00708A44528C4256A4395e0060A36630
18802d01039H8776J90957b26392A0763J24405b09459A33542c7707A32521a67020
18791a16491j70421D7294J55393G042K38542h3325A3310a08177K3121l35598b9263
18779a08750n4761A11755a71712G7101a3107m5091f744l00542A91584g1085j92241
18768b63326A03742K40534j59449q5818a41592j48955B8207c04547I2601R061
18758A01662C8308Q046a61862G7612a85625a2064j7917I2361B2753K94387a69072
18746C3468a23038m7093O0009k49195E0246a88376P7439D56445A16212j2806a65833
$$ y = [175465, -1340, -279941, -190966, 35223, -272361, -118691, -46971, -164488, -373338, 430184, -13263, -28124, 135556, 66815, 299119, 82804, 383512, 144528, 34256, 14395, -50060, 136630, -401039, 88776, 279733, -226392, 10763, 135168, -209459, 133542, -37707, 132521, -167020, -116491, -286912, 47294, 202687, 7042, 245584, -83325, 13310, -108177, -85056, -420654, -29263, -108750, -163511, 111755, -171712, 77101, -13107, -58198, -6744, -307286, 191584, -71085, -263326, 103742, 344276, 184827, 99009, -141592, -290547, 28207, -304547, 92601, 101662, 38308, 46354, -161862, 77612, -185625, -12064, -29981, 92361, 22753, 317140, -169072, 33468, -123038, -170131, -110122, -359317, 50246, -188376, -110937, 456445, 116212, 103406, -165833]
18734A85202a55628A48414a20755l6100J1570C51441B9732Q2139a23119M5626
18724g7493B7264J7800c1248A00837d67168a66479A6975a12047j67932J5105a614
18712A61881G3896g6268k21717p9900B96715c7516H9010Q9581h3553l5136l2463
18701a51152P0805j23744A42286C9224b03616R6065A93151a91141F4094E208J12951
18690A18159K13192i6501A369d6614H4339F842a28869k10473g8752j8721k466
18679i9939j04928P7179A31909a08818C80446b57825B08877D8505B3709K8422
18669E2131i0473m8703j51711b7787k13442B26479F095J66967a22273n0349L8921
18658a33701H4546d48446i8933m34472a99283J7698q9495k39552A93727a84119
$$ y = [185202, -155628, 148414, -120755, -156855, -145285, 351441, 29732, 111871, -123119, -77493, 27264, 45064, -31248, 100837, -467168, -166479, 16975, -112047, -279979, -264874, -1614, 161881, 73896, -76268, -297985, -377885, 296715, -37516, 89010, 178591, -83553, -118689, -151152, -80347, -204091, 142286, 39224, -203616, -107551, 193151, -191141, 64094, 5208, 118159, 331351, -96501, 1369, -46614, 84339, 6842, -128869, -339342, -78752, -97473, -99939, -204867, -127688, 131909, -108818, 380446, -257825, 208877, 48505, 23709, 52131, -90473, -139176, -290887, -27787, -241229, 226479, 6095, 173062, -122273, -172622, -133701, 84546, -448446, -98933, -533405, -199283, -181585, -271080, -510632, 193727, -184119]
18647e3681K6022F3058b59930E8051g9718k16202a10428E5232A5690J45051c17119
18635a85636q3380K3533C33015m1481r672L8221A0885J80905b01268L4266e9605
18623d3123j25122A51300D1858J11336M4525a28777M0416j05244G5635K2563a7999
18611a38753j32707h3047j76540a4570D2603P7523f6617G9904c8222H2389a51530
18599a16195A04454b8398q5284j52582i6185c5665j8266D4049J59499a51535o4732
18588b16267J02807E3679Q3773b88033P6890N299b5381l6498K4718E7864b08883
18576d1410k47243C35080c66496a68314m9795B7035d19795a34308e7861o29233
18566f87094a25357M6342c4707n6598F0533a02902A80883b99983A90746c32365
$$ y = [-53681, -27659, 63058, -259930, 58051, -79718, -295920, -110428, 55232, 15690, 160741, -317119, -185636, -269016, -245483, 333015, 291534, 281862, 320083, 10885, 191790, -201268, -167002, -59605, -43123, -168245, 151300, 41858, 153194, 197719, -128777, -88361, -193605, 75635, 98198, -17999, -138753, -271460, -83047, -259587, -14570, 42603, 120126, -66617, 79904, -38222, 82389, -151530, -116195, 104454, -28398, -113682, -266264, -96185, -35665, -53931, 44049, 203548, -151535, -216267, -113460, 53679, 137452, -288033, -211143, -205844, -25381, -61879, -37161, 57864, -208883, -41410, -288653, 335080, -366496, -168314, -218109, 27035, -419795, -134308, -57861, -687094, -125357, -79015, -34707, -91305, 60533, -102902, 180883, -299983, 190746, -332365]
18555b05976R7738e3009j1026p5566l7707A7926e7788r6503P153e416B5723d32163
18542A33067a59005B09637a13079j47793H4039k6078o836L9541h2763a3690C4501
18530g8963A59921b32785A46235b67488A1354M2576b144C8868N9043C5432c942
18518f8525j48546A46411b48062A4536a67467G6644c00027G4905a67523g8736
18507B26903D514a57088B97207a29248p6863J02291k3124a2829k85041f7678B0927
18495A4207a62752G0795h948j18761D4589a33953f5509J1086F4863c02056i7270
18483B3964B69K00777F0871C543M0174J80144b07959l37444A033d056j29131B08030
18470I9435a77458G1410J89748F6515d5853k15539e3714p9600b3449j64309F1599
$$ y = [-205976, -108238, -53009, -64035, -139601, -177308, 17926, -57788, -154291, -147138, -5416, 25723, -432163, 133067, -159005, 209637, -113079, -260872, 84039, 57961, 51125, 90666, -82763, -13690, 34501, -78963, 159921, -232785, 146235, -267488, 11354, 53930, -2144, 38868, 97911, 35432, -3942, -68525, -217071, 146411, -248062, 14536, -167467, 76644, -300027, 74905, -167523, -78736, 226903, 4514, -157088, 297207, -129248, -206111, -103820, -126944, -12829, -297870, -67678, 20927, 14207, -162752, 70795, -8948, -127709, 44589, -133953, -65509, -54423, 64863, -302056, -97270, 23964, 269, 201046, 60871, 3543, 43717, 223861, -207959, -545403, 1033, -4056, -133187, 208030, 99435, -177458, 71410, 261158, 66515, -45853, -261392, -53714, -133314, -23449, -187758, 61599]
18458a80604H0670a74035m3599N5273M4083B1092c00393A4804B425J9758a27115
18446A38882a38830j96345J14426A08771n2964J19290b3953j23189o8928B32091
18435a52921B1708h6185G862c9852J4710A20954J4908b02743j206D4085g1423
18423A26383b9789p0152B0611K7079O9787m8676g997o355A23567o0744c7635E0389
18410D2492K17058j18807O7206h006F7578c37854B51635b7981A47284B4122b9126
18398E3830b56448G1505d0176j03900k74776B13779f9774C4479j3630J29380b45867
18386e2775m5418L6606C7766a16963B0509J8963g1156A39812d21057a75793H6051
18374b77656Q3075O8874A57751n3136c4931I2513K986b52214R8840r276B32722
$$ y = [-180604, 80670, -174035, -217634, -162361, -118278, 21092, -300393, 14804, 2425, 22183, -127115, 138882, -138830, -335175, -220749, 108771, 55807, 175097, -23953, -147142, -216070, 232091, -152921, 21708, -86185, 7862, -39852, -25142, 120954, 135862, -202743, -203949, 44085, -71423, 126383, -29789, -99941, 20611, 47690, 117477, 68801, -7997, -14352, 123567, 62823, -37635, 50389, 42492, 259550, 140743, 207949, -8006, 67578, -337854, 251635, -27981, 147284, 24122, -29126, 53830, -256448, 71505, -40176, -144076, -418852, 213779, -69774, 34479, 20849, 150229, -245867, -52775, -98193, -61587, 37766, -116963, 20509, 39472, -71156, 139812, -421057, -175793, 86051, -277656, -194581, -125707, 157751, 104615, -34931, 92513, 95499, -252214, -153374, -162650, 232722]
18362b83825P9830A96893J54568i2127a085j62352M8017F4343B3404b87872C6943
18350b51491j89004J23679A09720c741l44049A09848b77216O7120C7524c8077
18339A01611P965a1900p5906A22149a88506l95620f5012k40900J42798F3527a46101
18327A83189b10362P1267B14165G1544a74111j18511P8182B05180e1609A78299
18316c48968J52730A19511D8635N2674Q1816h7879j30934e5004k12526C9687f6365
18304b01586h5567l0222D3026a78716G7224a65462A70799a16158p7363O4148B68201
18292c1903n8550B59168p4813c04638a6533D98952B4585J15733J44836j4171e2736
18280c2373j33867e1498j80687N2718C14091a10515K9254r7756B4913L9290e0764
$$ y = [-283825, -203995, 196893, 351461, -92127, -1085, -163437, -115420, 64343, 23404, -287872, 36943, -251491, -440495, -316816, 109720, -3741, -347790, 109848, -277216, -210096, 37524, -38077, 101611, 109576, -11900, -87806, 122149, -188506, -584126, -65012, -305912, -163114, 63527, -146101, 183189, -210362, -139095, 214165, 71544, -174111, -292622, -214440, 205180, -51609, 178299, -348968, -196238, 119511, 48635, 101309, 183125, -87879, -218813, -55004, -267530, 39687, -66365, -201586, -85567, -115789, 43026, -178716, 77224, -165462, 170799, -116158, -193521, -129373, 268201, -31903, -90453, 259168, 184355, -304638, -16533, 498952, 24585, 140318, 285154, 270983, -52736, -32373, -166240, -51498, -232185, -179467, 314091, -110515, -81261, -179017, 24913, 64203, -50764]
18268b94067A89878c3966k97958a30548P153c6688o1643A49509d33269h169m6343
18257e4512j07496C3521K7238d25155B0497b60774Q5177q9343A82235a49907M1007
18246a08900B83269c1664j32514c8173A56212J30526A1716d6239l0525f048B36611
18234B28438C20a14283E3512K00763J53432A33312M7810a66531J2686j01144F4635
18222h753o6256e977G9920a4539G1235J77831A00077a45026F4617Q648a94253
18210D58731C950K08172Q1091A5553d9578j64921O6120B58295a493j9744B80044
18198A36592c72765J18962a10416e0678J8731j33670F6716d6157E0383f9277B45159
18186a2696k31686A46145J10746b55418N2911j3276B83468c95876A12371a78308
$$ y = [-294067, 189878, -33966, -331924, -130548, -123395, -36688, -98331, 149509, -433269, -8169, -54512, -162008, 33521, 60759, -425155, 20497, -260774, -175597, -264940, 182235, -149907, -108900, 283269, -31664, -164178, -38173, 156212, 286738, 11716, -46239, -76764, -6048, 236611, 228438, 320, -114283, 53512, 254275, 407707, 133312, 181122, -166531, -153845, -254989, 64635, -8753, -75009, -5977, 79920, -14539, 71235, 249066, 100077, -145026, 64617, 73265, -194253, 458731, 3950, 212122, 293213, 15553, -49578, -214499, -148379, 258295, -1493, -21237, 280044, 136592, -372765, -253803, -110416, -50678, -31947, -165617, 66716, -46157, 50383, -69277, 245159, -12696, -244382, 146145, 256891, -255418, -202507, -215783, 283468, -395876, 112371, -178308]
18175a52193L0191j67313E5979i1478D729J55339j9891L7142p7127b3625m8536
18164g2161l2453I2178b46611J02916b7610j1548j55026b1508j7221n9191o2567
18153a60487a5424A63135P8440b67450A34890h3040b5665B53860L0028F5445J06424
18142A71869b43525g5203L4479k0822k19755g8953A2698b24782E4466j9967b56628
18130B75417a66266k2009m685k90976D8610J50443o6355a78175J1928K2380d2030
18118c01329a0218p1612j02012j5234M9881A7366J236a2533j48741c4157D2753
18106h5436A34291b12087E0952i9062k60197J21823B30208a48991p3220P0458
18096a51753k9869C167c13508l6016A53025D611a37360q188A33266k2237a89103
$$ y = [-152193, -122002, -289315, 55979, -91478, 4729, 160068, 140177, 177319, 100192, -23625, -72161, -104614, 92178, -246611, -143695, -27610, -39158, -194184, -21508, -38729, -97920, -160487, -15424, 163135, 241575, -267450, 134890, -83040, -25665, 253860, 283888, 65445, 171869, -243525, -75203, -40724, -61546, -281301, -78953, 12698, -224782, 54466, 34499, -256628, 275417, -166266, -188275, -192960, -483936, 48610, 199053, 132698, -178175, -166247, -143867, -42030, -301329, -10218, -81830, -183842, -199076, -149195, 17366, 18602, -12533, -161274, -34157, 42753, -85436, 134291, -212087, 50952, -99062, -359259, -237436, 230208, -148991, -222211, -151753, -181622, 3167, -313508, -349524, 153025, 4611, -137360, -145548, 133266, 111029, -189103]
18084B90408C8494q995a31685j23314F2915Q6639O725k2737a71969q9033A62063
18072A41576c5154J927A03588M5693d1142e853n9431K6227m3287J9747A2248R2232
18060A04480A7902c69688a30692j04080B15946E2170r710a67017B56294g6736
18049G3081M27k9965h6312m821M4859q5490A74914m2195B0725f0140j51490R7585
18037a14045B36008F840a37318M3020L9651b5134j91641a07237o990j27459A2378
18025a04991B48579A04743d8273l8775J9865E5504J78568A9997d685B90396B1479
18013a32436j56446J29918q7311b9169m6823j90095c6103L872B97841b28364J3066
18002b15298h422G0090h6307K0188C3936A1526a95631A37968l5778A2632Q2110
$$ y = [290408, 38494, 29499, -131685, -254999, 62915, 149554, 156279, 133542, -171969, -261002, 162063, 141576, -35154, -33227, 103588, 149281, -41142, -5853, -65284, -39057, -82344, -62597, 12248, 104480, 17902, -369688, -130692, -234772, 215946, 52170, 42460, -167017, 256294, -76736, 73081, 73508, 43543, -86312, -91133, -46274, -131764, 174914, 132719, 20725, -60140, -211630, -114045, 236008, 6840, -137318, -94298, -54647, -25134, -216775, -107237, -114227, -241686, 12378, -104991, 248579, 104743, -48273, -87048, -67183, 55504, 234072, 19997, -4685, 290396, 21479, -132436, -288882, -158964, -246275, -29169, -75992, -266087, -36103, -32231, 297841, -228364, -215298, -8422, 70090, -86307, -66119, 33936, 11526, -195631, 137968, 102190, 12632, 94742]
17991I4742L246m950A6369O2331a82712B62179b802j23465d5467j6585G5492O1559
17979A37051a70474E8305a34030e6657A20151a15845c4470A22481a38894k25287
17969c64181c7093J1702j265j46757A31877a47812p4382A2909d2976j60693F9160
17957a07324B8639Q9551A1695K56827F6708K42914A01774K01136b01428C44989
17946D1419a78163j41642i3933b2503A39696f8634B49834G4956J30417r7996K30576
17935C37953b37161h8582j27561A36625J36645A7750Q2368J31075a07104k41653
17925c48757M0888d0683A44606b64589J25228q4077A53753a03701G9290N5681
17915A34971b00336L1969A6558J76238i5838b7354k73382O621A04865M4251B5645
$$ y = [94742, 97988, 93038, 16369, 78700, -182712, 262179, -2802, -126267, -45467, -62052, 75492, 137051, -170474, 58305, -134030, -56657, 120151, -115845, -34470, 122481, -138894, -364181, -37093, -25391, -26656, -173413, 131877, -147812, -222194, 12909, -42976, -203669, 69160, -107324, 28639, 118190, 11695, 268522, 66708, 309622, 101774, 302910, -201428, 344989, 41419, -178163, -319805, -93933, -22503, 139696, -68634, 249834, 74956, 205373, 107377, 337953, -237161, -88582, -216143, 136625, 273270, 17750, 100118, 231193, -107104, -348757, -307869, -40683, 144606, -264589, -139361, -223438, 153753, -103701, 79290, 134971, -200336, -168367, 16558, 192796, -95838, -27354, -300736, -294115, 104865, 149116, 25645]
17903f8374A31464b22579A66276Q713P3676j13558n864C6873K38880d16758e4998
17891E4423J39382d8769j37399L3951D3841K67632A9264Q6425c25903A46757j4631
17880A32126a88686K6911L9484a0538A43811a06106H558e441n8874A064i2941
17868c04915K5043D74218g7763A59353p5163a07650A10759K08882i4328A13212
17857B03392d6911b1831A69186e35263G2099K2225a79414I8306r637a82759j00346
17846b83105O6545H0134C883e4076B2253h6661l4077k98830a58234A3590b15505
17834e980q9304J7774H8876M12762g5618H8553c8359A36598d1439E363O6224b13186
17821c4176A8291a6243H2163K13261K2877A25027K34788A79604A6673a27884B5056
$$ y = [-68374, 131464, -222579, 166276, 174989, 248665, 135107, 129243, 36873, 275753, -416758, -54998, 54423, 193805, -48769, -186168, -152217, 43841, 311473, 19264, 105689, -325903, 146757, 132126, -188686, -161775, -122291, -10538, 143811, -106106, 8558, -5441, -64315, 1064, -92941, -304915, -279872, 474218, -77763, 159353, 84190, -107650, 110759, 319641, -94328, 113212, 203392, -46911, -21831, 169186, -535263, 72099, 94324, -179414, 98306, 88669, -182759, -283105, -216560, 80134, 3883, -54076, 22253, -86661, -120738, -419568, -158234, 13590, -215505, -5980, -95284, -77510, 88876, 501638, -75618, 88553, -38359, 136598, -41439, 5363, 71587, -213186, -34176, 18291, -16243, 82163, 295424, 318301, 125027, 359815, 179604, 16673, -127884, 25056]
17809E1479a04842J871I2216P9413K1064b5113l14287A18272b79323J35385p1206
17798b15144E5431i7216F2982N7217g156o6366B16513a52983E8879a00558c622
17786b17489l2676E6542a89260A61310c86654b239q5077k08949B92735e1090A4719
17774A39072e1752r252a8557k5219k1584j38438M6758a4085H0563a22235C1962
17762b54478B40811D135b47982B12175o7947a34164a6958E7840a37772B2034J48131
17751A70165d6520A69493e1815A15364d95975b485A18433a68864J83D0966K63322
17740C04288M3749a78704l3871g2295j20709A92206P9606q7518b56401E23717
17729b87136A6990f8315j91029h6675B34603A11742e5786E8107c69726k1795J34121
$$ y = [51479, -104842, -102971, 92216, 171629, 192693, -25113, -339400, 118272, -279323, -143938, -215144, 55431, -97216, 62982, 120199, -7156, -73522, 216513, -152983, 58879, -100558, -3622, -217489, -250165, 56542, -189260, 161310, -386654, -2239, -87316, -296265, 292735, -51090, 14719, 139072, -51752, -61004, -18557, -43776, -65360, -203798, -157040, -14085, 80563, -122235, 31962, -254478, 240811, 4135, -247982, 212175, 144228, -134164, -16958, 57840, -137772, 22034, 170165, -46520, 169493, -51815, 115364, -495975, -2485, 118433, -168864, -168681, 40966, 304288, 348037, -178704, -212575, -72295, -193004, 192206, 271812, 184294, -256401, 523717, -287136, 16990, -68315, -259344, -86675, 234603, 111742, -55786, 58107, -369726, -391521, -257400]
17718b57400C0208J68839A6318j307L2170d8627B7463a35752d3679F624J61940
17707A68564l4440D4805K3343a27354A93076a32107L2538A23549b60980e1929
17696f9529n6570G9610a89948A58424a21336A04818J31555B9538c9862j35790
17686a75652F3463L00090g153l3933j0077K1232A92343Q8052f1392B50308e0598
17674b51513I0039O9732Q7583A03388R8507m0807b78506J23107F4013d2567k49123
17663b91690c0424k39974H7455e5565j24682G3582K1487K72834o0104E9825e1450
17651A6078J55532J6268b03922A94633A5740c829o5255O167B05024D6220P6498
17640A22718D5014d4886j03266M4626n9631B21083b55500L1824B60043d065j60189
$$ y = [-257400, 30208, 199047, 16318, 15011, 47181, -48627, 27463, -135752, -43679, 6624, 168564, 134124, 44805, 68148, -127354, 193076, -132107, -99569, 123549, -260980, -51929, -69529, -126099, 79610, -189948, 158424, -121336, 104818, 236373, 29538, -39862, -175652, 63463, 363553, -7153, -41086, -51163, -29931, 192343, 280395, -61392, 250308, -50598, -251513, 90039, 159771, 247354, 103388, 201895, 161088, -278506, -155399, 64013, -42567, -291690, -30424, -270398, 87455, -55565, -180247, 73582, 95069, 367903, 307799, 59825, -51450, 16078, 171610, 187878, -203922, 194633, 15740, -3829, -69084, -62917, 205024, 46220, 122718, 45014, -44886, -148152, -103526, -163157, 221083, -255500, -223676, 260043, -4065, -164254]
17629a64254A69231D4822a8110A0321K48039g9238c3456j71992g5899K6430a9979
17617B72141a84423D66566i6918n3712H6443f88A36362B8813J244F108J57798
17606A63906a56150A31722o1545a16346j70602D1972g6329A18948k0576H512J62958
17595A71470J25396e7126A45442o4152R7160b23844a11352a7402j30579B84020
17584b64281B91546a41842c3294B61652a58293j0707C28166B7485f2500C30625
17573A92023K37237f1125j40776A29913J33714C9609j0198p100N7782i450I6221
17561C26529j22626i2837n308l0696H9373b02934C95810a71012I8726a9079B95903
17549c0776D3197K31567f2111n8547p9486B26784b24205C8100d9829k7975A13272
$$ y = [-164254, 169231, 44822, -18110, 10321, 258360, -79238, -33456, -205448, -75899, -49469, -19979, 272141, -184423, 466566, -96918, -150630, 86443, -688, 136362, 28813, 30057, 6108, 163906, -156150, 131722, 70177, -116346, -286948, 41972, -76329, 118948, 98372, 8512, 171470, 296866, -57126, 145442, 81290, 178450, -223844, -111352, -17402, -147981, 284020, -264281, 291546, -141842, -33294, 261652, -158293, -169000, 328166, 27485, -62500, 330625, 192023, 429260, -61125, -201901, 129913, 263627, 39609, 29411, 22311, 80093, -9450, 96221, 326529, 203903, -92837, -98145, -128841, 89373, -202934, 395810, -171012, 98726, -19079, 295903, -30776, 43197, 274764, -62111, -120658, -200144, 226784, -224205, 38100, -49829, -77804, 113272]
17537a73436A03180C0064J41846F2013a1014A42506a00535A04029a40851A06916
17526a28975A44555l6221L3202J21238A00856j8928A8149K36429G3251B1562c4613
17514D51903b3782C60251F3305J65612d7941B46725J14637A51232p3034c83998
17503B97792r0273k7423H0810J06565o3932K60706F7719J23689a40379I5432d1811
17491A00932a22265e4135A26194h9541D50591I4398L330a78145A07776k7698a36163
17479A32296j5129J52870e3932A99363O9455R2588e7499A65760d7273k68888A76852
17467C5077a56934C60657b5665B22976o0676a1784j1941o519l8427J9132C94665
17455B58959L4424I3804K9232L27679A88008a94565B06162R161K19554j12760
$$ y = [-173436, 103180, 30064, 171910, 62013, -11014, 142506, -100535, 104029, -140851, 106916, -128975, 144555, 108334, 141536, 262774, 100856, 81928, 18149, 254578, 73251, 21562, -34613, 451903, -23782, 360251, 63305, 228917, -47941, 246725, 361362, 151232, 78198, -383998, 297792, 207519, 180096, 80810, 187375, 123443, 384149, 67719, 191408, -140379, 95432, -41811, 100932, -122265, -54135, 126194, -89541, 450591, 94398, 97728, -178145, 107776, 80078, -136163, 132296, 117167, 270037, -53932, 199363, 268818, 361406, -57499, 165760, -47273, -316161, 176852, 35077, -156934, 360657, -25665, 222976, 162300, -11784, -23725, -30244, -68671, -49539, 394665, 258959, 293383, 93804, 123036, 450715, 188008, -194565, 206162, 215323, 434877, 322117]
17445C22117J15434I3682B3912L03465a33255D48263E7583P1303N1512d2798D0409
17433a18957D29228A47679J67716o1314A14611b10512J01869B1755J67452J46707
17423C35914K45288k76586a2254A91956K51812m5107C9627N77519I2491Q2229
17413A74720G3836B2493K81138F8971K27020f1488l1753I4491L9701n1538d5568
17401A31236i6275C04136A05553A2186a21433C67860A01712a00658A08744d4930
17390i588C18119n3883r3118K6687J98432j46878f0636A89809L61540n1774k31818
17379B67757E550Q7021m0629J86260E3417L8849L3575d17483G3602L24866A71143
17367B14544B1791i851E899g0608D5004K09870C3850b11174L375D0630a46843
$$ y = [322117, 437551, 93682, 23912, 327377, -133255, 448263, 57583, 128886, 180398, -42798, 40409, -118957, 429228, 147679, 315395, 254081, 114611, -210512, -108643, 21755, 189207, 335914, 581202, 304616, -12254, 191956, 443768, 398661, 39627, 617146, 92491, 174720, 73836, 22493, 303631, 68971, 295991, -61488, -93241, 94491, 134192, 82654, -45568, 131236, -96275, 304136, 105553, 12186, -121433, 367860, 101712, -100658, 108744, -44930, -9588, 318119, 264236, 171118, 197805, 396237, 249359, -60636, 189809, 551349, 499575, 267757, 5550, 92571, 51942, 238202, 53417, 92266, 125841, -417483, 73602, 398468, 171143, 214544, 21791, -9851, 5899, -70608, 45004, 254874, 33850, -211174, -207799, 40630, -146843]
17355A10585a4777H4255O8107a86244f3171B30117e3089C53125A47164K40550
17345C87714j1818d3865A02034D3428K3295D145L45077q3965f3132A87288o1013
17334A26275L2909J09148G4667c96492B90582C5082c9289C1664R5311b42894k30043
17323d72937G4257l3575R8519P762J2680B3220J67095N0430a32457A95542H8936
17311C0987R7260A0064N13712C4785n278b3982k8761B57795A23164a51433j87344
17300c38777B61114N4278A43865F1055J94884i9770C12699r6893J61729I9072
17289A42478J05710r6834J14835j22176M4149c1585C44960l1203A18656j1295
17279A07361K50754j0141r2176N3478h8742B05155p2578P585D2136M54990C6149
$$ y = [110585, -14777, 84255, 152362, -186244, -63171, 230117, -53089, 353125, 147164, 387714, 375896, -43865, 102034, 43428, 66723, 4145, 349222, 265257, -63132, 187288, 126275, 159184, 268332, 74667, -396492, 290582, 35082, -39289, 31664, 126975, -242894, -472937, 74257, 40682, 139201, 146963, 159643, 23220, 190315, 240745, -132457, 195542, 88936, 30987, 128247, 10064, 523776, 34785, 29507, -23982, -52743, 257795, 123164, -151433, -338777, 261114, 315392, 143865, 61055, 255939, -99770, 312699, 215806, 377535, 99072, 142478, 248188, 151354, 266189, 144013, 188162, -31585, 344960, 313757, 118656, 107361, 358115, 347974, 255798, 309276, -88742, 205155, 132577, 140162, 42136, 497126, 36149]
17267B51754j18426J20160J98914f133A29211Q1890J83501A5314J68549b243A45706
17255d0853B08357e9285A96441l3238p4550M16303k27807J00675A63914p1229
17245I2685M8987K20045j13735A22752D4501P0488R1240J4280j00129N0248C4957
17233A4160J91718C146L82298B6326K57971n9413r0927K77441D3307J81045c2698
17221B47119K9440q3167q7377J22781r1940j4464P1145Q2621L32039D3768K01100
17210B44868A9911M14158j51536B8164O2304K09994F4625O7940P0505A897L31619
17199C33516a00944d574A25045J88763j3531A33701K00616F1777K374R361c2633
17187A70499R9804r295J51331j24246N4641A34995b2945D69498j97964G4242L16548
$$ y = [251754, 133328, 253488, 452402, -6133, 129211, 211101, 394602, 15314, 183863, -2243, 145706, -40853, 208357, -59285, 196441, 163203, 88653, 504956, 277149, 377824, 163914, 92685, 141672, 361717, 247982, 122752, 44501, 114989, 206229, 220509, 120380, 170628, 34957, 14160, 205878, 3146, 385444, 26326, 284297, 224884, 133957, 411398, 43307, 224352, -32698, 247119, 276559, 193392, 106015, 228796, 136856, 122392, 193537, 276158, 608197, 43768, 244868, 19911, 434069, 282533, 28164, 90468, 300462, 64625, 132565, 203070, 1897, 333516, -100944, -4574, 125045, 313808, 300277, 133701, 334317, 61777, 64151, 73512, -32633, 170499, 270303, 261008, 412339, 288093, 342734, 134995, -22945, 469498, 271534, 74242, 390790]
17176C90790r0409o5501J43683g9662C3819J05988L8280q3842m0144K95561K4225
17165C73887m0315k3195a88438B71349r4075K73285A67505o8422L7783L23685
17155D60551p1222j73349J44350j2936j33177l88r8417L15419K18014B50417A13937
17143C4898O33171B76003N2014o4134A17082P404J06327J97190M14946m00345
17133D42604A26110B3151L41477K55045l02609H0004K78920I550J94821J31946
17123C36317J20095A64445A8958K98816k3117K47593j40015K04835q6423j96057
17113C24590J26249k19570n1564Q6655j22532P9626e4983B42696M2698o9145R420
17102B25669M8110L70349k71511j37051M51530k08876k5276j50727M04618G597
$$ y = [390790, 300381, 234880, 378563, -79662, 33819, 139807, 178087, 94245, 54101, 349662, 373887, 333572, 310377, -188438, 271349, 177274, 450559, 167505, 99083, 136866, 460551, 389329, 215980, 360330, 347394, 214217, 213829, 115412, 430831, 648845, 250417, 113937, 34898, 668069, 276003, 328017, 263883, 117082, 124486, 230813, 428003, 842949, 442604, 126110, 23151, 364628, 619673, 317064, 80004, 358924, 9550, 204371, 336317, 456412, 164445, 18958, 317774, 294657, 542250, 402235, 607070, 520647, 324590, 450839, 231269, 179705, 266360, 143828, 223454, -54983, 242696, 285394, 216249, 225669, 273779, 644128, 372617, 235566, 687096, 478220, 452944, 302217, 706835, 7597]
17091C14195K54414j30077j41536r8197M30938p4582M0399r6376j78575J64071
17081D84674j64935P2855K3180M7285K4932m9282J9153N5724K0514q3871j72593
17070B77636K20308K59439l65810J92727k55433K87800J5229C08496L56446q1331
17060E83611j69394J19082K5551B35136p4875M01465k73518j26120J32361J72381
17050D66830N4425q078B12260O90605j31830j84884J37846q2721l7306j15868
17040D88102O6655k38442L33231L714M6064o3484j14559K73168j04855B48014
17029F72563p5027B07548K44898J77780k5185L6803q3341L6826Q8533r4755K72714
17018H61821k86592J13213Q4395k99460R720J80325k81971K81886J24554p2608
$$ y = [314195, 568609, 438532, 296996, 198799, 629737, 555155, 595554, 499178, 320603, 484674, 319739, 392594, 415774, 463059, 487991, 438709, 457862, 513586, 534100, 450229, 277636, 497944, 757383, 391573, 584300, 328867, 616667, 631896, 308496, 664942, 583611, 414217, 533299, 558850, 235136, 160261, 561726, 288208, 162088, 294449, 466830, 521255, 513177, 212260, 902865, 771035, 586151, 723997, 641276, 603970, 488102, 554757, 316315, 649546, 653260, 699324, 635840, 521281, 794449, 689594, 248014, 672563, 597536, 207548, 452446, 630226, 605041, 641844, 558503, 595329, 683862, 589107, 861821, 575229, 688442, 772837, 473377, 483097, 663422, 381451, 663337, 787891, 715283]
17008G15283K15985k51952k35143J3078K23475j67916L33974k3606l4596M381
16998G92963k28772J97242l50173M70353j06874Q8593j72245K16877k84272j17900
16988E05792K62998M6736q3336q2900L43844j80045k51825J09081Q8567J913J49224
16977I10049p5028l25106J50791K64612J88047M1757k99930P6389l08245J50312
16967G73648K57490j19934k0965P6808j13714K642j0228r6636J07196L64009l85710
16956H34606Q7121j76540O5464K89086k50438n441J49159N1453k5209L90181n25131
16945H84311L7076J15228J35408o4469m30597P5142N90510l3880j63975J72891
16935A317645j22518j06901J70132K80771j70834p7210J47964k68072K98591l52102
$$ y = [715283, 931268, 679316, 444173, 457251, 680726, 512810, 846784, 823178, 788582, 792963, 564191, 761433, 411260, 881613, 774739, 863332, 691087, 907964, 623692, 505792, 768790, 815526, 732190, 649290, 993134, 813089, 561264, 670345, 758912, 760825, 910049, 835021, 509915, 660706, 925318, 1113365, 1155122, 855192, 931581, 623336, 773648, 1031138, 911204, 890239, 967047, 853333, 855975, 845747, 749111, 856307, 1220316, 834606, 921727, 745187, 810651, 1099737, 849299, 843858, 993017, 1044470, 1019261, 1409442, 884311, 921387, 1036615, 1172023, 1107554, 676957, 752099, 1342609, 1308729, 1144754, 1317645, 1195127, 1088226, 1258358, 1539129, 1368295, 1291085, 1439049, 1170977, 1469568, 1117466]
16925A117466J90887l15499J16569r882L34768r9006L46617m23308K34218j45099
16915A347731r3265K87323K29687k81985P1729q5976K48018l16096J46352l1072
16905A522446K17962j55003J4770K0441J08056N27987m77867P7684P3793k12944
16895A717325M15925k48802J06807k08664q9398J06896K75914k78581R7223M2092
16885A936737j50780J68908k77826K75093J06672J85554J34748k09650O902K07049
16875B383407l62247N9275M45135l5235j93900n126N6015J46893j77844N70864
16865B887237k12159j79556J09196J27418K06606j83343k4628J1122o6903L63713
16855C038703k21292L20880N7090k04851J96716r0548K06483R4254l1682J85780
$$ y = [1117466, 1308353, 992854, 1109423, 1099541, 1434309, 1335303, 1681920, 1258612, 1492830, 1347731, 1254466, 1541789, 1771476, 1489491, 1561220, 1475244, 1723262, 1407166, 1553518, 1522446, 1740408, 1585405, 1600175, 1620616, 1728672, 2256659, 1778792, 1856476, 1930269, 1717325, 2133250, 1884448, 1991255, 1782591, 1693193, 1800089, 2076003, 1797422, 1894645, 1936737, 1785957, 1954865, 1677039, 1952132, 2058804, 2244358, 2379106, 2169456, 2176358, 2383407, 2021160, 2080435, 2525570, 2490335, 2296435, 2291309, 2347324, 2494217, 2316373, 2887237, 2675078, 2495522, 2604718, 2732136, 2938742, 2755399, 2730771, 2741893, 2674990, 3038703, 2817411, 3138291, 3195381, 2990530, 3187246, 3096698, 3303181, 3397435, 3365753, 3551533]
16845C551533n0159m9854J05277k51457L21514J52338j40321P6595j08758J58657
16835C765365L45723n2330R6473Q2898j19303J01837J11737k8836J57019L22402
16825D782985l6039R5787K26204Q9726M9670q9161L4486L43070K39497J12537
16815E848762R2914k33205K49371O5737n8861M18790n4201J13416M61084k56560
16805F647247L42364L83188M4977R72K68169J96639j10611L48047L41900K89840
16795H752732n3589J96402L29055j16308P64958k02207M30496K66964K65714N71545
16785A1205762L90234q7092M84434L28584Q9671O07185K74597O84273L6017N10730
16775A4524395N87591L07876O24156O96080L04068O12580N72920R05815R9822
$$ y = [3551533, 3501374, 3451520, 3556797, 3305340, 3626854, 3779192, 3638871, 3715466, 3606708, 3765365, 4111088, 4058758, 4155231, 4238129, 4118826, 4220663, 4332400, 4303564, 4460583, 4782985, 4746946, 4842733, 5068937, 5158663, 5208333, 5119172, 5153658, 5496728, 5736225, 5848762, 5941676, 5708471, 5957842, 6023579, 5964718, 6383508, 6329307, 6442723, 6903807, 6647247, 6989611, 7372799, 7417776, 7418748, 7686917, 7883556, 7772945, 8120992, 8462892, 8752732, 8699143, 8895545, 9224600, 9108292, 9873250, 9671043, 10101539, 10368503, 10634217, 11205762, 11595996, 11508904, 11993338, 12321922, 12411593, 13018778, 13293375, 13977648, 14013665, 14524395, 15111986, 15419862, 16044018, 16740098, 17044166, 17656746, 18229666, 19135481, 19235303]
16766A9235303Q57836M86344J205401P04301M51274Q77069J119415Q30807J569299
16757B7337049Q66064R30441J405005J178524J553494J489892J635675J574402
16749C7970546K010120K130719J757729K301871K369954K365890K678909K906435
16741E6492173K816867L099857L427814M214584L426867M281251M257193M865190
16733H6881796N225433N181651N706970N936019N871322O167556O535280O593725
16725A34099752O493929O684323O049528N964143N782747M734911L707075L301070
16717A76817478J963224Q48178k84796j281378k558718l675159m484713m790871
16709A62553245n899983o453556o463916o677015p130676o457729o741490o233657
$$ y = [19235303, 20093139, 20579483, 21784884, 22489185, 22940459, 23817528, 24936943, 25767750, 27337049, 28203113, 29133554, 30538559, 31717083, 33270577, 34760469, 36396144, 37970546, 39980666, 42111385, 43869114, 46170985, 48540939, 50906829, 53585738, 56492173, 59309040, 62408897, 65836711, 70051295, 73478162, 77759413, 82016606, 86881796, 92107229, 97288880, 102995850, 108931869, 114803191, 120970747, 127506027, 134099752, 140593681, 147278004, 153327532, 159291675, 165074422, 169809333, 173516408, 176817478, 178780702, 179628880, 179344084, 178062706, 175503988, 171828829, 167344116, 162553245, 156653262, 150199706, 143735790, 137058775, 129928099, 123470370, 116728880, 110495223]
16701A10495223o544599n543112n660891n369175m842090m745228m452292m069406
16693F9268430l838702l512282l792289k615611l205235k576233k651139k307300
16685D4769639k347695j935064k122645j659553j502441j703235j903081j033847
16677C0562078j491246j298067j099721j124928q35417j379289n69706r67714
16669B1795990p68045j125591l81584q27471n96904n20845n36290q30778p01420
16660A5507062l42662o11193n09751j25513p70567o19313J8256o97361l04036
16651A1544922k57013m29217k4639n63640j23323l95873k21686l92400k64852
16642H872279j53649k90400l73396j46491j5400m82679J63843k09886l84408M1214
$$ y = [110495223, 103950624, 98407512, 92746621, 87377446, 82535356, 77790128, 73337836, 69268430, 65429728, 61917446, 58125157, 55509546, 52304311, 49728078, 47076939, 44769639, 42421944, 40486880, 38364235, 36704682, 35202241, 33499006, 31595925, 30562078, 29070832, 27772765, 26673044, 25548116, 24712699, 23333410, 22763704, 21795990, 21027945, 19902354, 19520770, 18693299, 18096395, 17575550, 17039260, 16208482, 15507062, 15164400, 14553207, 14043456, 13917943, 13147376, 12528063, 12546319, 11848958, 11544922, 11287909, 10858692, 10834053, 10270413, 10147090, 9751217, 9529531, 9137131, 8872279, 8718630, 8428230, 8054834, 7908343, 7892943, 7410264, 7574107, 7364221, 6979813, 7021027]
16632G021027j50931m99295K16198j62106r2764l98953m64125M80271k59392k61572
16622E428358J61313p15014J79397N9539m29253J8774J08291k11197m0740k50252
16612D309216Q9899j16127K4960R4547l07286j31243k81863K20977j63022p282
16602C732776l58595O0237K30694j89891k14331K1969r2173N4966k08349l2380
16592C004923J55902k46970q1982K66109j73862p9460K51673k76855l5715r454
16582B774309k2438K9625l72574N2989q3396J917k82249J89494M738j55417j8638
16571B118360j67183J67180J53810r5294l32059J01126j2072l23720L91928L4170
16561B036246K32113l68815k99246l3257L19407k45715N61919n38560R1448o2370
$$ y = [7021027, 6870096, 6370801, 6586999, 6424893, 6332129, 5933176, 5469051, 5949322, 5689930, 5428358, 5589671, 4874657, 5054054, 5113593, 4684340, 4703114, 4811405, 4600208, 4559468, 4309216, 4399115, 4282988, 4307948, 4402495, 4095209, 3963966, 3682103, 3903080, 3740058, 3732776, 3374181, 3434418, 3665112, 3475221, 3260890, 3282859, 3190686, 3245652, 3037303, 3004923, 3160825, 2913855, 2831873, 3097982, 2924120, 2844660, 3096333, 2819478, 2783763, 2774309, 2751871, 2781496, 2408922, 2461911, 2378515, 2380432, 2098183, 2287677, 2292415, 2136998, 2118360, 1951177, 2118357, 2272167, 2176873, 1844814, 1945940, 1933868, 1610148, 2002076, 2036246, 2268359, 1899544, 1600298, 1567041, 1886448, 1640733, 2202652, 1664092, 1755540, 1693170]
16551A693170j42494J06832K86729l1283l78211j17390K68424q5058j53038K71947
16541A719628l17223J81295K50708l33164M8281r6159j31134J40027l15185J95590
16531A342664K60747k12369j6346j7758L2048l5061p954j77498J38652n8439o337
16520A242349j17919K9955l79321J60672J97862j46312J89363n83592O82361k81463
16510I93955m3507j92752J47445L82170l13437K4158k6907L20292m10133l897
16500H77387K23178k05780L997k44513K78545j96909J43369N4627l95722L38365
16490H76544r2197r1527J91524k52531k94n9897P9303M2761P6819k53575L44716
16479H61646k18182R8703k56981K51998m4140n1280j2520k87992M72737k41541
$$ y = [1693170, 1550676, 1657508, 1944237, 1912954, 1534743, 1417353, 1685777, 1600719, 1447681, 1719628, 1402405, 1583700, 1834408, 1501244, 1549525, 1453366, 1322232, 1462259, 1147074, 1342664, 1603411, 1391042, 1374696, 1356938, 1388986, 1353925, 1345971, 1168473, 1307125, 1248686, 1242349, 1124430, 1154385, 775064, 935736, 1133598, 987286, 1176649, 593057, 1275418, 993955, 950448, 757696, 905141, 1287311, 973874, 998032, 971125, 1291417, 881284, 877387, 1100565, 894785, 898782, 654269, 932814, 735905, 879274, 933901, 538179, 876544, 784347, 692820, 884344, 631813, 631519, 571622, 650925, 693686, 770505, 516930, 861646, 643464, 742167, 485186, 737184, 693044, 641764, 629244, 341252, 813989, 572448]
16469E72448M7532L30611l06702K82097j61818l0205j84189j1230J85122l4756
16459F88910j01463B31171N29671j11892B32093L72578Q0143k96494k3411N8312
16449D23221K26609j87069O5910K72289k33140M0178j38586J2210J77359k71160
16439C87821l6140m4179K87383B83879L11066B28094J78300J66183p2246L27258
16429H27589m10250j15432O4874J38749L5954j40056k3899K07117k1034j6581
16419E47031J03601j1278j06311P081p5256j03128n6282l9416m197L53876k54406
16408C61315j45162A04940M27148j4458q2188p9685r049K3460J54194r1376j19269
16397C13717O5286A67016L25153B05186E8907M29818j25490K24409A30047K97195
$$ y = [572448, 619980, 950591, 643889, 925986, 764168, 733963, 549774, 538544, 723666, 688910, 587447, 231171, 760842, 648950, 232093, 604671, 684814, 388320, 364909, 423221, 649830, 462761, 528671, 800960, 567820, 607998, 469412, 481622, 658981, 387821, 351681, 307502, 594885, 283879, 594945, 228094, 406394, 572577, 500331, 827589, 417339, 301907, 366781, 505530, 541484, 401428, 377529, 584646, 563612, 547031, 650632, 639354, 533043, 540124, 464868, 361740, 305458, 266042, 261845, 615721, 361315, 216153, 104940, 532088, 517630, 435442, 355757, 346708, 370168, 524362, 432986, 313717, 379003, 167016, 492169, 205186, 58907, 488725, 363235, 587644, 130047, 427242]
16387D27242j94820F0547L71886j77752p0739R2153q6323J8622J73428l5149g1995
16375A87678R3302j07062R1647J80814B17330K41434F0992M7120P5570K72650
16365D56332H8521K38791o3554J82072K69580B11801I3176L74430r7161J48027
16355E18472k03254o8783J15012k184j8851D1538J97026e6684H3152O7937J72225
16344C23314o9896I5875J03314J26799k047L4631j3890j03705O4377a2424D57219
16332a0069A71878K35441A41280N1002m5527K95903k01177j08270O0783E9205
16321H9380L9684E1552K00485O6472a47650C07282j05535G1461P6109C8746J10336
16310A49082Q8902p90j18464i9837C09565b14981B75178j14740K4838a92406C20787
$$ y = [427242, 232422, 60547, 432433, 254681, 183942, 276095, 189772, 208394, 381822, 346673, -71995, 187678, 280980, 173918, 265565, 446379, 217330, 458764, 60992, 108112, 183682, 456332, 88521, 327312, 263758, 445830, 715410, 211801, 93176, 467606, 370445, 518472, 315218, 246435, 361447, 359263, 340412, 41538, 238564, -56684, 83152, 151089, 323314, 253418, 95875, 199189, 325988, 323941, 358572, 344682, 240977, 305354, -12424, 457219, -10069, 171878, 407319, 141280, 192282, 146755, 442658, 241481, 133211, 193994, 59205, 89380, 129064, 51552, 252037, 318509, -147650, 307282, 201747, 71461, 147570, 38746, 149082, 237984, 237194, 118730, -99837, 309565, -214981, 275178, 160438, 185276, -192406, 320787]
16298B1160M87658k36740N8561A18000m2463L6593a12111B68632A17011Q1875
16288A98886F0313L7180a76770B61282j28879R4485a1686A93627B9634J52131
16278A81765J95885A33416J94361Q2491J55670A9092M5711e7927I1583K68974
16268C60557b2631j37244C9046O9294J79222L783c22039B52523J38938D5042K23485
16257B68527j1424I6927P5873B4796J79552a49169B11011I6464J99358e3090A97200
16245A58197R7830a33562O4689A18913a06290B46635e5630F2922d9203A40867
16234A78996a25200A41440O0065c47677a60089f5977B45331j05899b9110l6520
16224f5630E39841a44247a5213A41281A9467b10163e2465C0407f6800A60960b62265
$$ y = [21160, 508818, 272078, 330639, 118000, 75537, 112130, -112111, 268632, 117011, 198886, 60313, 97493, -176770, 261282, 132403, 226888, -11686, 193627, 29634, 181765, 377650, 133416, 327777, 410268, 565938, 19092, 64803, -57927, 91583, 360557, -22631, -159875, 39046, 108340, 287562, 291345, -322039, 252523, 391461, 45042, 268527, 257103, 96927, 172800, 24796, 204348, -149169, 211011, 96464, 295822, -53090, 197200, 158197, 256027, -133562, -68873, 118913, -106290, 246635, -55630, 62922, -49203, 140867, 178996, -125200, 141440, 201505, -347677, -160089, -65977, 245331, 139432, -29110, -65630, 539841, -144247, -15213, 141281, 19467, -210163, -52465, 30407, -66800, 160960, -262265]
16212I4905k1595I766J58575J35151A47712g5282b8892l85704B01087E4386a59112
16200A93339R2250K03660a89358C0185L2703J29956a58083A00587b96792F249
16189G043J2573f0262C9729K080a49069A8007J43339L09147G7457b18307I9720
16177a98793I4246P7e4272F4111i8003C17917I2260a52355A97384O4998i2821
16165B0515g1488K2977A8398g8814b2114k79018d7750A29141n7222J66465j09126
16154A29258f9820B26643p8358E0591R5802p1624J08061f6111A20090J17423q9762
16143A47751n4962R1671J62331b03158L4700I4441D914P1897b8059m02857F9304
16131g7890H6851a10631A27913F33J25846A3321b20855A07887e9507Q337k57080
$$ y = [94905, 73310, 9766, 168341, 303492, 147712, -75282, -28892, -414596, 201087, 54386, -159112, 193339, 285589, 489249, -189358, 30185, 62888, 192844, -158083, 100587, -296792, 6249, 7043, 19616, -60262, 39729, 41809, -149069, 18007, 161346, 470493, 77457, -218307, 99720, -198793, 94246, 94323, -54272, 64111, -98003, 317917, 92260, -152355, 197384, 262382, -92821, 20515, -71488, -48511, 18398, -78814, -22114, -301132, -47750, 129141, 71919, 238384, 129258, -69820, 226643, 148285, 50591, 146393, 74769, 182830, -66111, 120090, 237513, 147751, 92789, 184460, 346791, -203158, -168458, 94441, 4914, 76811, -28059, -430916, 69304, -77890, 86851, -110631, 127913, 633, 126479, 13321, -220855, 107887, -59507, -51170, -308250]
16120c08250a05257A14014K48719h638j82047A87643c4096B3919a42561g829B29830
16108b55601b6048B14269O7213h0615B96028A38973q780B5540K23281d166A52535
16096B76204D6715b4151l4148A21017D006J78084L4a95083H3635l0312P0029O3658
16084A87010d325B33738H8733a61425K1879k7304B54123G9156a00806a9729A87636
16072F6248k2339a68641A53742c31I9407f1256H4560a25805A2918g7439A89962
16060d3296C0460K20600h0994b7588F4334b8729I1013J59368c3300m1452G5161
16048A40873a50767j6588c8703C4599K7273c32943a63730C6095g2282a2599I4456
16036C19048b41056Q5559e1720G6748O5953F5996O1256m9197i280d047o2963A6030
$$ y = [-308250, -105257, 114014, 362733, -8638, -190685, 187643, -34096, 23919, -142561, -7829, 229830, -255601, -26048, 214269, 281482, -80615, 296028, 138973, 130193, 25540, 248821, -4166, 152535, 276204, 46715, -24151, -58299, 121017, 4006, 182090, 182124, -195083, 83635, 53323, 123352, 187010, -4325, 233738, 88733, -161425, -139546, -166850, 254123, 79156, -100806, -19729, 187636, 66248, 43909, -168641, 153742, -331, 99407, -61256, 84560, -125805, 12918, -77439, 189962, -43296, 30460, 251060, -80994, -27588, 64334, -28729, 91013, 250381, -33300, -74752, 75161, 140873, -150767, -167355, -38703, 34599, 61872, -332943, -163730, 36095, -72282, -12599, 94456, 319048, -241056, -155497, -51720, 76748, 142701, 65996, 127252, 78055, -9280, -4047, -67010, 16030]
16023C4400b70363J25919L509A6098J0237K28540a32991L2362B03083n4163G0412
16011B22525E3847e20538a20536B57975a24182c2288l21912f7932j6944H4686
16000E8095J88049c3709j79331H5140d79729a11679A46555a59229R515G960e2363
15988D7072J69338j03678b54800D02667p2190N5341j63249N1736A29228f7862
15977H4928L7426c01748d6807k28389F3625f9276n1507A98519b9318j57968C7848
15965b08192A11923a36636A28406b7245A23992e5055C4269N16379a2222l03866
15955c16088I8242j7332J58124b47782a00486j06117N4407A83525j5086C3774
15944a02733j92779J09898k0953J9045B96192a60718B06018J34469c43814A04752
$$ y = [34400, -270363, -144444, -140935, 16098, 26335, 254875, -132991, -100629, 203083, 148920, 70412, 222525, 53847, -520538, -120536, 257975, -124182, -32288, -354200, -67932, -84876, 84686, 58095, 246144, -33709, -213040, 85140, -479729, -111679, 146555, -159229, -149714, 7960, -52363, 47072, 216410, 112732, -254800, 402667, 330477, 385818, 222569, 274305, 129228, -67862, 84928, 122354, -301748, -46807, -275196, 63625, -69276, -120783, 198519, -29318, -187286, 37848, -208192, 111923, -136636, 128406, -27245, 123992, -55055, 34269, 550648, -12222, -316088, 98242, 80910, 239034, -247782, -100486, -206603, -152196, 183525, 168439, 33774, -102733, -295512, -185614, -206567, -187522, 296192, -160718, 206018, 340487, -343814, 104752]
15933b18002p7130B35603c00520I343a43059O5048A3878h1660b300n1844j08539
15922a62683f1680j23610N0739H0602J01155h8501K8442a6415A7939K9362a13170
15910E3586a18318J0429k58980D2801R6226f6656A38549b4683A31062j001J74495
15899C04556i373F0217d0768K0175l4774j98944B70296b14639A139L9334K5407
15888F5880l562f3173G0150o568f2512A97151a12155r7262A2315e1231H7378l6293
15876E1085c23580A05464c20323b2379I2701J1232a171j38348m4680C6754K25727
15865B62481c9296j80205M6527Q2886J8349j9913A38795b07062B99830F154g218
15853B65492c07457A70157a2837q0310C08502E1250O2255a17919N1149H0863k7034
$$ y = [-218002, -295132, 235603, -300520, 9343, -143059, -78011, 13878, -81660, -2300, -54144, -162683, -61680, -185290, -134551, 80602, 181757, -88501, -60059, -16415, 17939, 47301, -113170, 53586, -118318, -107889, -366869, 42801, 139027, -66656, 138549, -24683, 131062, 130061, 304556, -9373, 60217, -40768, -20593, -55367, -254311, 270296, -214639, 1139, 40473, 65880, 62318, -63173, 70150, 63582, -62512, 197151, -112155, -209417, 12315, -51231, 87378, 51085, -323580, 105464, -320323, -22379, 92701, 103933, -1171, -139519, -184199, 36754, 262481, -39296, -219501, -172974, -90088, -71739, -91652, 138795, -207062, 299830, 6154, -7218, 265492, -307457, 170157, -12837, -93147, 308502, 51250, 113505, -117919, -66770, 80863, 53829]
15842E3829b94118j5651D0889A8831L0159a78436Q0505q0571d1828I501e9866
15830D6437a14597D85580g9715K6045o8978G6593K15173a05069B2417G123b71142
15818b90089O6607B04598C8666f0932B13006j0327b08166G9103C7946a19074q473
15807a27547G6825b19758P7178A53373b1063H3733b6985j42768A29366i8169l6773
15796a34942c4693j56183A16502j3671D2001b21364B53700d9417C4883b07383
15785b82163o1276A52634a61691B95694j34508B5074b78439d7661A70327m4765
15775A25562c0487C619a46332C5814L7203M5635J09788e1302n799k7658K7368
15764e7391g786k4045k77935Q2331A90744m9398P7207O7413a03069J4250I1296
$$ y = [53829, -294118, -309769, 40889, 18831, 48990, -178436, -97931, -178502, -41828, 9501, -59866, 46437, -114597, 485580, -79715, -53670, -122648, 76593, 291766, -105069, 22417, 7123, -271142, -290089, -223482, 204598, 38666, -60932, 213006, 202679, -208166, 79103, 37946, -119074, -127547, 76825, -219758, -142580, 153373, -21063, 83733, -26985, -169753, 129366, -98169, -134942, -34693, -190876, 116502, 102831, 42001, -221364, 253700, -49417, 34883, -207383, -282163, -343439, 152634, -161691, 295694, 161186, 25074, -278439, -47661, 170327, 125562, -30487, 3619, -146332, 35814, 73017, 118652, 228440, -51302, -57101, -84759, -57391, -7786, -31831, -309766, -227435, 190744, 141346, 218553, 285966, -103069, -88819, 91296]
15752a50566M5942o8218j7734O6446c6766r8750f0604o4554B9895b56599A22133
15740b6138A27029h3745E7185a94720A47214b6946C8315b83807a22309m7276Q1570
15729h8015k01954J19275a5869j89973l20283b09728n2616J05162a4993H3206
15718C24848I3099J08921i9639B8154a56236c3428A91715c95991C61813c68662
15707c2577A02330c6763A54653b12360p3873a2582j67692A07801k0902c19425
15696a92311A3364L85948j59735a6462A26741J14114p3175Q4919D0982b27867
15685b55202A45231a27951o1129a0936k77831H5118a61136h890A42746o9727a21853
15673B27245b38225R6606C37908A28956a50717k83259J89813q5537b9602j46410
$$ y = [-150566, -104624, -172842, -190576, -124130, -36766, -135516, -60604, -125158, 29895, -256599, 122133, -26138, 127029, -83745, 57185, -194720, 147214, -26946, 38315, -283807, -122309, -169585, -88015, -289969, -170694, -15869, -205842, -526125, -209728, -262344, -157182, -14993, 83206, 324848, 93099, 202020, -99639, 28154, -156236, -33428, 191715, -395991, 361813, -368662, -32577, 102330, -36763, 154653, -212360, -286233, -12582, -180274, 107801, 86899, -319425, -192311, 13364, 399312, 239577, -16462, 126741, 240855, 167680, 252599, 40982, -227867, -255202, 145231, -127951, -189080, -10936, -288767, 85118, -161136, -8890, 142746, 73019, -121853, 227245, -238225, -141619, 337908, 128956, -150717, -433976, -244163, -329700, -29602, -176012]
15663a76012A96354b4253p5028j301I2591a79962G8428R6432b4684k87131A1146
15651b68536L6448A70187g4106h420A7921f8154A44094a79406a8316j20335A89485
15639A52487b71439B29852a2059F8464j3209b77759k5542A47804c50003a33645
15628F1491J4688M2209A9727c6010A16944M3937b89662l21280b02460C67753A39469
15616B45877h9199j87002B31702j15076O8517c02980a31683M5959B86831A02990
15605a40447m2574O1005L7251A51249p1970K0505N6257b95753e2999A4139P9208
15594I3347B6744i69k18893j11196A63629k0199C4032J86401L864A0095a99301
15582A05709a45522A01655a363A3531c6367A09014e5424F8090a23A67710a01384
$$ y = [-176012, 196354, -24253, -99281, -100582, 92591, -179962, 78428, 174860, -24684, -311815, 11146, -268536, -232088, 170187, -74106, -8420, 17921, -68154, 144094, -179406, -18316, -138651, 189485, 152487, -271439, 229852, -12059, 68464, 55255, -277759, -303301, 147804, -350003, -133645, 61491, 76179, 118388, 19727, -36010, 116944, 160881, -289662, -610942, -202460, 367753, 139469, 245877, -89199, -276201, 231702, 116626, 185143, -302980, -131683, -85724, 286831, 102990, -140447, -183021, -122016, -84765, 151249, 79279, 99784, 156041, -295753, -52999, 14139, 93347, 26744, -969, -219862, -331058, 163629, 143430, 34032, 220433, 224297, 10095, -199301, 105709, -145522, 101655, -1363, 13531, -36367, 109014, -55424, 68090, -123, 167710, -101384]
15570A79638a1963p5999A49199K9542M0765l1927J9071d4877j16678j12134B1213
15558e7202j85855l2932A95106E8296K23156b12384A0401c43843d2732H3877K8954
15547A12831L3754p2180c67748B8475g5074j24528q6033G7715B1731K24040e9184
15535B34783d6615k22930p5079B00244G6612b07477M3035j9782b5141j86120j17979
15524c29240O8840C1325a61381C5932j111M9378a0327j82975B80114L2461G9789
15512A47637a3684A22384A7782K08328A2462l893b23274p7620c4274P83m39266
15501d72757b458j25929N7616k46324J37479m6744K9502o324b9199j52288j1869
15490a93356Q3434q5242K1536k4892N9924F3609J66446h5152b1157A75960i4721
$$ y = [179638, -11963, -87962, 149199, 178741, 219506, 187579, 206650, -44877, -161555, -273689, 21213, -57202, -243057, -275989, 195106, 58296, 281452, -212384, 10401, -343843, -42732, 83877, 112831, 146585, 74405, -367748, 28475, -75074, -199602, -285635, 77715, 21731, 245771, -59184, 234783, -46615, -269545, -344624, 200244, 76612, -207477, -164442, -184224, -25141, -211261, -329240, -260400, 31325, -161381, 35932, 34821, 84199, -10327, -193302, 280114, 312575, 79789, 147637, -13684, 122384, 17782, 226110, 12462, 8569, -223274, -300894, -34274, -33491, -472757, -2458, -128387, -70771, -317095, -179616, -226360, -196858, -203182, -29199, -181487, -193356, -109922, -195164, -173628, -198520, -138596, 63609, 230055, -85152, -21157, 175960, -94721]
15478A789a02894B1955J63288c06091F9226O4268B5653e9347q8967G8229a29697
15466d4814J7614A41164d29644a02283b9039B81024I5460a36357j44757I1372
15455E7028L36158a54211B90229A5088K73312A03154a08627p9987B11112Q5804
15445B96916b02852B0904h3051j35519A88052a27593f3053A33023L3450B5711
15434b8422F6997O2145n5705M9477K07644h1413k9310j61594g7364A34739o48
15423A34091K93394a72848M1000A05655O0872e149j83132K8457M4224D2778K87128
15412C29906G971J7776e3807j86846i1986A66154e8795A91903a44523H0131O5763
15401A45894b4059l18072a48179A58134c44541J14414a4154j37655A85309a42882
$$ y = [1789, -102894, 21955, 185243, -306091, 69226, 133494, 25653, -59347, -148314, 78229, -129697, -44814, -27200, 141164, -429644, -102283, -29039, 281024, 95460, -136357, -281114, 91372, 57028, 393186, -154211, 290229, 15088, 288400, 103154, -108627, -188614, 211112, 296916, -202852, 20904, -83051, -218570, 188052, -127593, -63053, 133023, 166473, 25711, -28422, 66997, 129142, 73437, 122914, 330558, -81413, -110723, -272317, -77364, 134739, 134091, 427485, -172848, -131848, 105655, 166527, -5149, -188281, -159824, -115600, 42778, 329906, 7971, 25747, -53807, -240653, -91986, 166154, -58795, 191903, -144523, 80131, 145894, -24059, -342131, -148179, 158134, -344541, -230127, -14154, -151809, 185309, -142882]
15390D26052b84560A86085g4475o0789A84035a22270c5023q710B2296K51044p2332
15379B01008J19013E5653c96004I1197a2489n0923B2717a39720m3043j41923J42571
15368a82115D8617e3700p8100a9617H3392g7338j1416A40565a38464B4449O4436
15357H8885l8274h1492d0553B9704a28039A19297a44087C5507J34109p04a21557
15345A06929D6270a52117A34654r946E384c02875C68563b5364k17639A17836d48105
15333g0816p9074k32581A49884C581J53671a49269e3346A18975a44803O9724B13316
15321c853j37070q1268k34165A01424a10427H4768e0532B61522b35737g9566l9482
15310a19048q2514A16090a32939j3577H0394b5804k09305h1105A0578b2957B77811
$$ y = [426052, -284560, 186085, -74475, -135264, 184035, -122270, -35023, -43733, 22296, 273340, 201008, 320021, 55653, -396004, 91197, -12489, -63412, 22717, -139720, -182763, -324686, -182115, 48617, -53700, -131800, -19617, 83392, -77338, -88754, 140565, -138464, 24449, 88885, 50611, -81492, -40553, 29704, -128039, 119297, -144087, 35507, 169616, 168912, -121557, 106929, 46270, -152117, 134654, 124708, 5384, -302875, 368563, -25364, -243003, 117836, -448105, -70816, -149890, -382471, 149884, 3581, 157252, -149269, -53346, 118975, -144803, -75079, 213316, -3853, -140923, -222191, -456356, 101424, -110427, 84768, -50532, 261522, -235737, -79566, -119048, -201562, 116090, -132939, -146516, 80394, -25804, -235109, -81105, 10578, -22957, 277811]
15298c0290j13092C06123M8707j49361g5675j51026c5391k39182e8536K1048q7367
15287a24855b4319C06892b19714h8817l121A62592b66094B36310r5294M5919G4189
15275B23908o7579J96110A32269B4271c8045F3380J10390a48714H6570L2736B2591
15263a04193B22335F1411K61289a41483E3944K79871j7750a07886A85181e3462
15252A90474b8579G5609J92224K13614Q03613K50912m58199M23098o78473d6196
15241C75006A77100G8535L32881a06174G615J6582J08506f5101P02E2980P3604
15230A26584J93484A13118m0344B9556J01241g2532j70131E2520d0046A18147
15219H148b56784d2730j10173A07186a62953A0688M0383c5905B6151J78435J53917
$$ y = [-30290, -143382, 306123, 354830, 205469, -75675, -226701, -35391, -274573, -58536, -37488, -124855, -24319, 306892, -219714, -88817, -91938, 162592, -266094, 236310, 141016, 186935, 74189, 223908, 156329, 352439, 132269, 24271, -38045, 63380, 173770, -148714, 86570, 119306, 22591, -104193, 222335, 61411, 322700, -141483, 53944, 333815, 316065, -107886, 185181, -53462, 190474, -28579, 75609, 267833, 481447, 1285060, 1535972, 1077773, 1500871, 822398, -46196, 375006, 177100, 78535, 411416, -106174, 7615, 24197, 132703, -65101, -64399, 52980, 126584, 320068, 113118, 72774, 29556, 130797, -72532, -242663, 52520, -40046, 118147, 8148, -256784, -42730, -152903, 107186, -162953, 10688, 51071, -35905, 26151, 204586, 358503]
15208C58503j75842B78a03663B75459a35474E7490J2950a09479b5914A60175J89288
15197C49463E6846k2038b57261d9562m2275d3469q7743B01382r3115a83829C5968
15185G2093J70785j06816J50896E1399J71262L3943I313a83085B7607J77493C0284
15173g5072b0919j9331k54743A13643n3533D373c7771j18847G1703M8078f847
15161A33345l341a17001A05185m4862f3273m2424C44144j32346A02164b5313L578
15150b1735B78303a32994c1221B77612c03659D5945g9049C438K35182m6030J30266
15139C22856B3158i3266J6950E4000a46137H7643O5943K53439K8783d6530A2167
15127g1020D7870I958M25923A80163n0832m2087N9166A3022k052K78558r7719
$$ y = [358503, 182661, 278, -103663, 275459, -135474, 57490, 70440, -109479, -25914, 160175, 349463, 56846, 34808, -257261, -49562, -91837, -43469, -131212, 201382, 108267, -183829, 35968, 72093, 242878, 136062, 286958, 51399, 222661, 256604, 9313, -183085, 27607, 205100, 30284, -75072, -20919, -40250, -294993, 113643, 60110, 4373, -37771, -156618, 71703, 119781, -6847, 133345, 130004, -117001, 105185, 60323, -63273, -105697, 344144, 211798, 102164, -25313, -21735, 278303, -132994, -31221, 277612, -303659, 45945, -79049, 3438, 238620, 192590, 322856, 23158, -93266, -76316, 54000, -146137, 87643, 153586, 407025, 435808, -46530, 12167, -71020, 47870, 9958, 435881, 180163, 129331, 87244, 146410, 13022, 10970, 289528, 191809]
15116A91809q3744N7304G9178a85902C10061c8096B98363j37633F046J0649a24153
15104B47531d7803A08070Q7083J47598a75645A94026N8814a96403A84059K34057
15094D18116A14948O3161a40301I7072D8242J77667j03108E6850A1326a87002
15083B47854J6624Q8738A45841g3889A92556J00711n1947q3301J38051j30869
15073A65201B5930J74751O8535e2509J7723B28849q576j7043r8762c0651A14224
15061A75608J2557J4924a31498B27836r5414l1057k644L10377b6199B31958P89
15050B32747h9691B47307J37913j29327d4609A61688K7516e6195k28068d7049
15039C72229f4494H5652a11881B44740b96056A78420F5648J50101K37252l3321
$$ y = [191809, 108065, 165369, 79178, -185902, 310061, -38096, 298363, 160730, 6046, 16695, -124153, 247531, -47803, 108070, 195153, 342751, -175645, 194026, 252840, -196403, 184059, 418116, 114948, 178109, -140301, 97072, 48242, 225909, 122801, 56850, 11326, -187002, 247854, 264478, 353216, 145841, -73889, 192556, 293267, 241320, 158019, 296070, 165201, 25930, 200681, 269216, -52509, -34786, 228849, 220273, 203230, 104468, -30651, 114224, 175608, 188165, 203089, -131498, 227836, 132422, 101365, 98721, 409098, -26199, 231958, 232747, -89691, 247307, 385220, 255893, -44609, 161688, 189204, -56195, -284263, -47049, 372229, -64494, 85652, -111881, 244740, -296056, 178420, 65648, 215749, 453001, 419680]
15029D19680A9947a34847A98984a42634B31498J34759b77485A81005b00479C35027
15018A18728O5989H0115c38698A82172K57162a7370D49901j43667A18964K00955
15008C19919A24394m9926M47191G1494L97003j66805B2947J22037m1192N4936
14998A58728g105B13743B2044K54152A35976K41273q9330b0162B62186A2840J51718
14987A64558M5904q8540B3826Q4367J09647k7213J14055b45195C72881j34801
14977B38080p0705M48283B36270j5808q5753E4965L55954A31258a7263B4360J26176
14966A50536l7821b91281c2605m0165L4961E41565d8561B95334b4684o0153C14775
14954B27566R3761j52606K2532J56185o5357G4948Q010c9570D25273K380H8952
$$ y = [419680, 19947, -134847, 198984, -142634, 231498, 366257, -277485, 181005, -200479, 335027, 118728, 184717, 80115, -338698, 182172, 439334, -17370, 449901, 306234, 118964, 319919, 124394, 74468, 521659, 71494, 468497, 301692, 22947, 144984, 103792, 158728, -7105, 213743, 22044, 276196, 135976, 377249, 287919, -20162, 262186, 12840, 164558, 210462, 121922, 23826, 108193, 217840, 190627, 304682, -245195, 372881, 238080, 167375, 615658, 236270, 220462, 134709, 54965, 410919, 131258, -17263, 24360, 150536, 112715, -291281, -32605, -72770, -37809, 541565, -48561, 295334, -24684, -84837, 314775, 227566, 321327, 168721, 191253, 347438, 282081, 74948, 82958, -39570, 425273, 427653, 88952]
14942A04297C3872J79736K4412K34058j78011j09565J92594e8193D30815E6181
14931F4472L82361c3732G7302L05437f016E64448C4014J76248g2343G87437A50236
14919B00764J40885K54307q9748N6925k59639J75649k19353J14906E9705P2748
14909A32453K7178P9215P952J81985j64079C8823M92901O5939A84739R7273b25481
14897E04118A34286M38749g9304C51286q4431L5138q716j33210l5928J28410M6613
14886B99162A07524M11462B25992J58126N1390A38470L64608A75204M41389a54885
14875D70590A43645j2642L97418A84870K85130l9956A81630J90737J65855k05397
14865C32825J45652a2456A78802J08255m2733J70994o6152q9469k0917R5184M3469
$$ y = [104297, 33872, 213608, 238020, 472078, 294067, 184502, 377096, -58193, 430815, 56181, 64472, 446833, -33732, 77302, 382739, -6016, 564448, 34014, 210262, -72343, 787437, 150236, 200764, 341649, 595956, 506208, 563133, 303494, 479143, 259790, 374696, 59705, 132453, 159631, 238846, 246798, 428783, 264704, 38823, 531724, 597663, 184739, 282012, -225481, 504118, 134286, 573035, -79304, 351286, 266855, 301993, 293277, 160067, 124139, 252549, 299162, 107524, 518986, 225992, 384118, 435508, 138470, 503078, 175204, 616593, -154885, 470590, 143645, 131003, 528421, 184870, 470000, 430044, 181630, 372367, 538222, 332825, 478477, -12456, 178802, 287057, 244324, 415318, 349166, 259697, 238780, 333964, 377433]
14854C77433K5218j96291J32004A20749R2256K66593J52537A90612Q0727M5957
14844C17296M5988K66743B06713L45060k18381J96897g2149F38729C04590L4364
14834C38954o3967K82151k47865N7503Q5639A84933L10582j89358j9341J06731
14824C93547A63930L08699j02871J06529j63562L81390j756j79182O9058j78359
14814D03876K72887k17253m3127K96204k31275j85267L03335j02720j21603J76319
14804E51376J05713k86648K31688k7366M553N0559k24105H4054M34628k9415J4129
14793E03396P2411k4609j05048J17397k64331J86203K2300K82088C56017j14535
14783B41482O3208J45963j6429R6578N5703j32275Q0176j75115J91296L12674
$$ y = [377433, 402651, 206360, 338364, 120749, 213005, 479598, 632135, 190612, 271339, 317296, 363284, 630027, 206713, 551773, 333392, 530289, -72149, 638729, 304590, 338954, 274987, 557138, 309273, 366776, 452415, 184933, 495515, 306157, 286816, 393547, 163930, 472629, 369758, 476287, 312725, 694115, 692359, 513177, 582235, 403876, 676763, 459510, 416383, 712587, 481312, 296045, 599380, 496660, 375057, 551376, 657089, 370441, 602129, 574763, 579316, 629875, 405770, 84054, 518682, 489267, 503396, 575807, 551198, 446150, 563547, 299216, 485419, 507719, 789807, 356017, 241482, 304690, 450653, 434224, 530802, 586505, 454230, 534406, 359291, 550587, 863261]
14773H63261j70522j82527J86672k68670k7366A80354J40898J15558J00114O3010
14763E99934B44329L13035J92557n2259j09064J49951k96955j22254K69038J94755
14753G83133m0222L9784j60235J52432k2503J5465k04160j76883J17284J22351
14743F26446p4035n5621N9903n9070M13685l37221K1146L32823l24284P6894K78522
14732I59188C77001K00693J83016n5827j30726K27659j53363J1237j4701M17964
14722A062953k54394j56595K3094Q1408J43710j14172N2952m6153j42627k23119
14712D27057N82446m68339J37745q2948L1719K04040k98178L13499k28682J48808
14702G67167j08820j63680L81694K858k86671J13625L564J00647k01513J36041
$$ y = [863261, 692739, 510212, 696884, 428214, 400848, 180354, 321252, 436810, 536924, 599934, 244329, 557364, 749921, 697662, 588598, 738549, 441594, 319340, 588378, 783133, 742911, 782695, 622460, 774892, 752389, 767854, 563694, 386811, 504095, 626446, 552411, 496790, 556693, 497623, 911308, 574087, 595233, 928056, 603772, 680666, 959188, 377001, 577694, 760710, 704883, 574157, 801816, 648453, 659690, 644989, 1062953, 808559, 651964, 675058, 756466, 900176, 786004, 838956, 792803, 650176, 427057, 1009503, 541164, 678909, 595961, 627680, 831720, 533542, 847041, 618359, 767167, 658347, 494667, 876361, 879219, 592548, 706173, 709737, 810384, 608871, 744912]
14692G44912Q8848R5804B57312L76954L34387l40807K55566r4801q6238J70332
14682H72705r822l9545K89210n38217J13853L7762o7202L51718n1229O90n9422
14671I00501j16692O9851L4307l35126N97532j69469j7926O6138k99620K18674
14661I48170K22679k02107K22393p2719K5208j38066j78301Q4879l39857P86916
14651A359195m63958J20835J5714q8136L02093j87988L13634k08232J41915k07138
14641A097934K00981M7070R8689l08677J15248J39742m36781K07347J22876J00051
14631A384480K6217l60597L33225k44508p2729K21054J35133j61030R4283j10897
14621A244631o6969o7221k4212N70474l24133j45130M3206O1986Q7569p0022K73530
$$ y = [744912, 833760, 929564, 257312, 634266, 968653, 627846, 883412, 788611, 702373, 872705, 862883, 823338, 1112548, 574331, 688184, 725946, 658744, 1010462, 959233, 959923, 900501, 783809, 853660, 887967, 552841, 1150373, 980904, 962978, 1029116, 729496, 948170, 1170849, 968742, 1191135, 1118416, 1143624, 1005558, 827257, 912136, 572279, 1359195, 895237, 1016072, 1031786, 943650, 1245743, 1057755, 1371389, 1163157, 1305072, 1097934, 1298915, 1345985, 1444674, 1135997, 1251245, 1390987, 954206, 1161553, 1284429, 1384480, 1410697, 1050100, 1383325, 1138817, 1066088, 1287142, 1422275, 1261245, 1355528, 1244631, 1177662, 1110441, 1086229, 1656703, 1332570, 1187440, 1230646, 1292632, 1380201, 1310179, 1583709]
14610A583709k62689K77864n088q198k79908k26916N21668k48713j22046K33444
14600A463127j0963J77478k74828K5513K31931k18454L9387R1324j52846O12614
14590A984283k46133Q9877m08605p7373M11005n7040j80479L06663Q1127j38457
14580A764868N2631K43638k93883K26359k2209J38407m63255J60916L09244k56
14570B116460k9598L4703R8728J05875l51151L74359N8341j7560L66875n54501
14560B202531J97337L98680N4941j17805K27598M32588j70932R4605N81364O52766
14550D553673O71096J908447M132765Q109316J9165660O190995B0390322H019720
14541D098444j601994J9065m47800k12032K89738j77648l8668q9952L98349p0014
$$ y = [1583709, 1321020, 1598884, 1593796, 1585598, 1305690, 1078774, 1600442, 1351729, 1229683, 1463127, 1452164, 1629642, 1354814, 1380327, 1612258, 1393804, 1433191, 1524515, 1371669, 1984283, 1738150, 1828027, 1419422, 1342049, 1753054, 1696014, 1515535, 1822198, 1903325, 1764868, 1817499, 2061137, 1767254, 1993613, 1971404, 2109811, 1646556, 1807472, 2116716, 2116460, 2086862, 2121565, 2220293, 2326168, 1975017, 2349376, 2407717, 2390157, 2757032, 2202531, 2399868, 2798548, 2853489, 2735684, 2963282, 3395870, 3224938, 3319543, 3900907, 4553673, 5224769, 7133216, 11265981, 19375297, 38540957, 44731952, 20390322, 8019720, 4098444, 2496450, 2515515, 2067715, 1855683, 2145421, 1967773, 1929105, 1839153, 2237502, 2167488]
14531B167488k15816l15309M37624J82448o3987j09809O7639k4127J44841m4231
14521B226761J29843J53340K3788k18904K80910j13308J05504J16980j12943q862
14511B583109l3027j53841L81545K7203k28909K54322J16761k52088L93328j79462
14501B908941m6752J52093j27881L08104m4868l13031L01805Q1319J0851R9404
14491C329985P9087j97126J03146k8256K88246l23521J57785M24755l80475N29869
14481C983495r836j88809k76218L87738L04462m43211J52284r044k73073N76149
14471D203937k10114J41069M2918n2606l993J83831P5691Q0132j57979M91294
14461D794180l64468k31115Q3587L41919m0392m3802K80807J53463m26669N34152
$$ y = [2167488, 1951672, 1636363, 2073987, 2256435, 2192448, 2082639, 2150278, 2126151, 2270992, 2226761, 2356604, 2509944, 2533732, 2314828, 2595738, 2482430, 2587934, 2704914, 2591971, 2583109, 2550082, 2396241, 2777786, 2804989, 2576080, 2830402, 2947163, 2695075, 3088403, 2908941, 2862189, 3014282, 2886401, 3194505, 3149637, 2836606, 3138411, 3219730, 3230581, 3329985, 3409072, 3211946, 3315092, 3286836, 3575082, 3251561, 3409346, 3834101, 3453626, 3983495, 3973659, 3784850, 3508632, 3896370, 4200832, 3757621, 3909905, 3900861, 3627788, 4203937, 3993823, 4134892, 4177810, 4125204, 4121211, 4305042, 4380733, 4460865, 4302886, 4794180, 4429712, 4198597, 4282184, 4624103, 4583711, 4539909, 4820716, 4974179, 4547510, 5081662]
14451E081662k85450L3012M56367j62520L74450k44395K28811R6373m3280L09841
14441E844871j6033R5178j24291L91053m01229L97555p4982L0371m7219O30640
14431F725914l34153K00399K71070j6063k33515L92863j64629L66793j60280L61550
14421G409949L112O8355J78824L71207n1784l4279L03733j25809L83002k22838
14411H283472L23366K01166J55505O1055K83071Q7226k94258L38088K04938L56655
14401A0000284m003L78474l13549N93008q3890J45929K16944j64364K92939L33161
14391A1394933K38516O30825j81924N97049n3994M5116L08701O13096k2557N010
14381A3574771O88144L0516M78623J20170L17287K45105L20917p4953O33419L58226
$$ y = [5081662, 4796212, 4829224, 5285591, 5123071, 5497521, 5253126, 5481937, 5578310, 5535030, 5844871, 5828838, 5924016, 5799725, 6190778, 5789549, 6187104, 6112122, 6142493, 6095274, 6725914, 6391761, 6592160, 6863230, 6847167, 6613652, 7006515, 6841886, 7208679, 7048399, 7409949, 7413061, 7481416, 7660240, 8031447, 7979663, 7945384, 8249117, 8123308, 8506310, 8283472, 8606838, 8808004, 8963509, 9024564, 9307635, 9394861, 9100603, 9438691, 9643629, 10000284, 9996281, 10374755, 10061206, 10654214, 10570324, 10716253, 10933197, 10768833, 11061772, 11394933, 11633449, 12264274, 12082350, 12679399, 12625405, 12670521, 12979222, 13592318, 13569761, 13574771, 14262915, 14293431, 14772054, 14892224, 15209511, 15454616, 15775533, 15700580, 16333999, 16692225]
14371A6692225J82448L81282L90292L69997P88258J51750K93312K74202N74806
14362B0098572L34553O24929L89546N23360L84733N47508N12031P52934K88593
14353B4456759N29942N42105P26015M06768J021749P50573N70713P10144N98652
14344C0313420J014054J231653L84824J043057N12642J226948J213201M79428
14336C7419227J438743J081744J271055P32149J595770J624589J081075J408617
14328D7652969J564721J589196J688385J749320J930698J882003J841836K331954
14320F2231082K197382K581717K196406K569826K539301L108840K883718L341726
14312H3649998L194291L659875L344227M598764L697976M750800M364524N107875
$$ y = [16692225, 16874673, 17255955, 17646247, 18016244, 18804502, 18956252, 19249564, 19523766, 20098572, 20433125, 21058054, 21447600, 21970960, 22355693, 22903201, 23415232, 24168166, 24456759, 24986701, 25528806, 26254821, 26661589, 27683338, 28433911, 29004624, 29714768, 30313420, 31327474, 32559127, 32943951, 33987008, 34499650, 35726598, 36939799, 37419227, 38857970, 39939714, 41210769, 41942918, 43538688, 45163277, 46244352, 47652969, 49217690, 50806886, 52495271, 54244591, 56175289, 58057292, 59899128, 62231082, 64428464, 67010181, 69206587, 71776413, 74315714, 77424554, 80308272, 83649998, 86844289, 90504164, 93848391, 98447155, 102145131, 106895931, 111260455, 116368330]
14304A16368330N504528N553242N331213O678687O383010P206941P293266P943215
14296A68262432Q429596R196512Q974443R925290J0431141J1071561J1398868
14289B37689843J1971386J2611404J2830806J3609061J4265942J4296110J4720049
14282C31994601J4532383J4450630J4504620J3977488J3298208J2622948J1197396
14275D26578274R785717P582368M196366N96177o56008m46032k674849n438345
14267D39523668n495020q085638j0306172j1868757j3641598j4776740j5374460
14260C59975283j5704850j5569757j5409727j5078957j4868757j3469214j3325411
14253B56548610j2801138j2544608j1780153j1002329j0744863r784979r278853
$$ y = [116368330, 121872858, 127426100, 132757313, 139436000, 145819010, 153025951, 160319217, 168262432, 176692028, 185888540, 194862983, 204788273, 215219414, 226290975, 237689843, 249661229, 262272633, 275103439, 288712500, 302978442, 317274552, 331994601, 346526984, 360977614, 375482234, 389459722, 402757930, 415380878, 426578274, 436363991, 443946359, 448142725, 448738902, 448082894, 447636862, 444962013, 439523668, 434028648, 425943010, 415636838, 403768081, 390126483, 375349743, 359975283, 344270433, 328700676, 313290949, 298211992, 283343235, 269874021, 256548610, 243747472, 231202864, 219422711, 208420382, 197675519, 187890540, 178611687]
14246A78611687q945734q233513p149580p484546o806914o514374o432499n790637
14238A21253890m684111m987319n188259m573090m303190m068285l484273l269977
14230H6695386l672277l249954k965884l149323k374113k510611k768326k405459
14222F3599439k354786k179647j566822j827846k171105j804879j426028j892169
14214D8376157j465972q63575j718039j549381r00020j394998j376765n41779
14206C8565628j070259r22521j609594r10786q97000m90847p40900j014353p20829
14197C0188539j128294o20012n85411o46487m15482j228711l48635p73851l72729
14188B4068927j060764l07736n59117l80229m97967n73409j01568r90384j54524
$$ y = [178611687, 169665953, 161432440, 154282860, 146798314, 139991400, 133477026, 127044527, 121253890, 116569779, 111582460, 106394201, 101821111, 97517921, 93449636, 89965363, 86695386, 83023109, 79773155, 76807271, 73657948, 71283835, 68773224, 66004898, 63599439, 61244653, 59065006, 57498184, 55670338, 53499233, 51694354, 50268326, 48376157, 46910185, 46046610, 44328571, 42779190, 41879170, 40484172, 39107407, 38565628, 37495369, 36572848, 34963254, 34052468, 33155468, 32664621, 31923721, 30909368, 30188539, 29060245, 28440233, 27854822, 27208335, 26792853, 25564142, 25215507, 24441656, 24068927, 23008163, 22700427, 22141310, 21761081, 21263114, 20689705, 20588137, 19597753, 19443229]
14179A9443229l41989k43294m34612m87719l39412l89109l98484j72008l30084
14170A6306518n66284l34469q856j62707M2243q13256j20773j3242n95307k28374
14160A3505493j53494j85268k00507k24070k76769k17230J29475n23811l30630
14151A1523189m8960j35015m42061J63900M2252k81640k37644k6323j44405m32900
14141I980393j04334j60771k11382k60675p1305j66655p3494Q8963k09913k83222
14131H527605J3953o5884m34494N6062q9481j00384j70298r7594n1639j59252
14121G428594k98848j7011K14127m12822j15933K41908n31211M45235l1389n89340
14111F333310J19471l3251j03476j44019k778O6505j9667k06376K02909j85120
$$ y = [19443229, 19101240, 18857946, 18423334, 17935615, 17596203, 17207094, 16808610, 16636602, 16306518, 15740234, 15405765, 15396909, 15234202, 15276445, 14463189, 14342416, 14329174, 13733867, 13505493, 13351999, 13166731, 12966224, 12742154, 12465385, 12248155, 12377630, 11853819, 11523189, 11474229, 11339214, 10897153, 11061053, 11103305, 10821665, 10584021, 10557698, 10413293, 9980393, 9876059, 9715288, 9503906, 9243231, 9171926, 9005271, 8931777, 9020740, 8810827, 8527605, 8541558, 8475674, 8041180, 8097242, 8007761, 7907377, 7737079, 7639485, 7587846, 7428594, 7129746, 7112735, 7326862, 6914040, 6798107, 7040015, 6508804, 6954039, 6922650, 6333310, 6452781, 6419530, 6316054, 6172035, 6169257, 6235762, 6216095, 6009719, 6212628, 6027508]
14101F027508k34298M9235j99320j30998O0211J26639l35607K71413k28987j34638
14091E271158j27915R188Q4775m30301J94112j57094k48603L24351m03194R0065
14081D606542k66926M91374n67814L01528k54550J02996k13325J11899k50954
14072D060770L96732k31691o89l62131J65667j08375J86545l82115r3619K98361
14062C929455j24701R693K10587k17442J86061l06598P6106J71562l98645p7533
14052C458545J25745k61160J11173k28318m5241K8103J38943m7111o59159P13676
14042C335196m01179O9726N2706r7131J41792j68484r0719j1699J12892o9537
14032B873563j07647K16733k33610J4938j73336K672K60841l37210J29535K37185
$$ y = [6027508, 5793210, 5842445, 5643125, 5512127, 5572338, 5698977, 5363370, 5634783, 5405796, 5271158, 5143243, 5152431, 5237206, 4806905, 5001017, 4843923, 4595320, 4919671, 4516477, 4606542, 4339616, 4830990, 4263176, 4564704, 4310154, 4413150, 4199825, 4311724, 4060770, 4457502, 4225811, 4225122, 3862991, 4028658, 3920283, 4106828, 3724713, 3631094, 3929455, 3804754, 3814447, 4025034, 3807592, 3993653, 3687055, 3763161, 3934723, 3536078, 3458545, 3584290, 3323130, 3434303, 3205985, 3160744, 3188847, 3327790, 3280679, 2621520, 3335196, 2934017, 3003743, 3056449, 2959318, 3101110, 2932626, 2841907, 2830208, 2943100, 2873563, 2765916, 2982649, 2749039, 2763977, 2590641, 2593313, 2854154, 2516944, 2646479, 2883664]
14022B883664n42975O9240J37996Q6452k08810O6159j92572P3636J11678k8467
14012B456001j11073k0546K46085o3747l42888j10747N21197p07586J73503k3878
14002B016321K3223j8250j41930J47494R2470k13690K5395J91292K43960l15456
13992B050829J27869K083L04447J141109K445330O237997J7527427J7000265k2942206
13983B3895150A1841303m456858j982539r56792l96996q90859J56065k66487k65815
13974B781022k21957K75285m65613R0972k12178K92335l38156j27816p7020J28367
13964B125241J89483k69168K73790k34010j6832m63793L27001k65078O20348l29670
13954A957312k04855K07989J58350j03203j1017K0462m90301J37554J9736L64843
$$ y = [2883664, 2340689, 2409929, 2547925, 2634377, 2425567, 2491726, 2299154, 2372790, 2484468, 2456001, 2344928, 2324382, 2570467, 2506720, 2163832, 2053085, 2574282, 1866696, 2040199, 2016321, 2039544, 2021294, 1879364, 2026858, 2119328, 1905638, 1931033, 2122325, 2366285, 2050829, 2178698, 2180781, 2485228, 3626337, 6071667, 12309664, 29837091, 46837356, 23895150, 11841303, 7384445, 5401906, 4445114, 4048118, 3157259, 3313324, 3046837, 2781022, 2559065, 2834350, 2368737, 2459709, 2247531, 2539866, 2201710, 2073894, 1996874, 2125241, 2314724, 2045556, 2319346, 2085336, 2068504, 1604711, 1931712, 1666634, 2286982, 1957312, 1752457, 1960446, 2118796, 2015593, 2004576, 2025038, 1534737, 1672291, 1692027, 2056870]
13944B056870j92151k55188K54979k65368J7902k86635N32737l35725L5159J26380
13934A688960l01935L80964r9914k96850K48304l19082J69887n1933J41000M1264
13924A600665K6847q1762j58209K43679r6684p9082J4813J30774j63165O306m7904
13913A396278j82243K28869J18355l45343o384M79338j72062m1183k73581j707
13903A200337L33940L3734m67600K67416R1976j65557J25149j2359l6325J66100
13893A536811k67947l3861k21085j59088M44173m3195r6810J36985j34981M4377
13883A205379j88777J59087J48883J57445l01028J06937j88489R9916K29781l43533
13873A085601L67966o08099N80152k84558m936j03299j33155J77735j5181L7240
$$ y = [2056870, 1864719, 1609531, 1864510, 1599142, 1617044, 1330409, 1863146, 1527421, 1562580, 1688960, 1387025, 1767989, 1668075, 1371225, 1619529, 1300447, 1470334, 1418401, 1559401, 1600665, 1627512, 1545750, 1387541, 1631220, 1534536, 1455454, 1470267, 1601041, 1437876, 1444182, 1396278, 1214035, 1442904, 1561259, 1215916, 1209532, 1688870, 1516808, 1475625, 1202044, 1200337, 1534277, 1568011, 1100411, 1367827, 1459803, 1294246, 1419395, 1407036, 1370711, 1536811, 1268864, 1235003, 1013918, 854830, 1299003, 1255808, 1158998, 1295983, 1161002, 1205379, 1016602, 1175689, 1324572, 1482017, 1180989, 1287926, 1099437, 1199353, 1429134, 1085601, 1453567, 845468, 1425620, 1141062, 1136126, 1032827, 899672, 1077407, 1062226, 1099466]
13863A099466K57021j80092k68104j62390L41893j89962p2962J32458o9383L9945
13853I27890J0383K75642l66594J79180k23121L19328j45217l44362J32123J7811
13843G83063l63279P56288k12881L35951n82705J12134J21700J9990r8388j5022
13833H56851J79113P7786k08527K29920j60723m874J70916l41085J8547N7086
13823H75010j4582J70863k15799L14658E45635K21053L0104k69699L81549o7279
13813H41363R1214j43588R5747J26001r9642m54302K12531J87749M1062r1592
13803H06543j97160K73064j07689j32692Q8088J13723l43054L74764O266j55383
13793G26470p1219j14595K92831j89145l297Q2050l625J21252j54632J74761l29590
$$ y = [1099466, 1356487, 1176395, 908291, 745901, 1087794, 897832, 824870, 957328, 887945, 927890, 938273, 1213915, 847321, 1026501, 803380, 1122708, 977491, 633129, 765252, 783063, 419784, 1176072, 963191, 1299142, 716437, 828571, 950271, 970261, 871873, 856851, 1035964, 1113750, 905223, 1135143, 974420, 969546, 1140462, 799377, 817924, 875010, 860428, 1031291, 815492, 1130150, 545635, 766688, 796792, 527093, 908642, 841363, 932577, 788989, 884736, 1010737, 911095, 456793, 669324, 857073, 898135, 806543, 609383, 882447, 774758, 642066, 730154, 843877, 500823, 875587, 881853, 726470, 655251, 540656, 833487, 644342, 641045, 723095, 719470, 840722, 686090, 860851, 531261]
13782E31261K7207k57080N25209k13424K8001j62885J58073J75438j35170j22105
13772E54525J76319j66596J9977r4286L76362C84127M00023r094k08323N595J52498
13761G24826J36058l44301j0256L29798l29693j12399L79420j05370j24646J7654
13751E61091J69053n0034j96274J85022j64197K97059k72858K03753B78384L24707
13741F03091j22997J70715J25683l25680M64674p9235p6098l7697R0749l15998
13731D97207L6391j5451J97357j69594K62825J57276k46214j62598O5234k47554
13721C74879K83113K1240k66513o4627J14305j99242M53206j31785k50551L5394
13711C69419L66720l44365j9170J33620K45082l62949L26614r6029B45808M92813
$$ y = [531261, 558468, 301388, 826597, 613173, 641174, 478289, 636362, 811800, 676630, 554525, 730844, 564248, 584225, 489939, 866301, 384127, 784150, 775056, 566733, 572328, 724826, 860884, 516583, 506327, 836125, 506432, 394033, 773453, 668083, 543437, 561091, 730144, 680110, 483836, 668858, 504661, 801720, 528862, 732615, 278384, 603091, 480094, 650809, 776492, 450812, 915486, 836251, 760153, 722456, 813205, 497207, 533598, 518147, 715504, 545910, 808735, 966011, 719797, 557199, 622433, 374879, 657992, 679232, 412719, 348092, 462397, 263155, 716361, 584576, 334025, 369419, 736139, 391774, 372604, 506224, 751306, 388357, 714971, 618942, 245808, 738621]
13701G38621k08187j50500j38768K15057N0261J78445k72139K74874o5227k87316
13691C35121l4784M2975J93702O2385q5046M5420J2242j79953m3533J23694j12850
13680C59373j15810J19149J15257N8309j56475K69014J53294A62708K84469L3790
13670D80967k36983N28728l35877j4792p5828J17921L46851l41586J282B06541
13659B32218M06788j21370k22916r3289K49785K18899B64770J97460j82863l2958
13649B46409p8086M86778n7103J56062A60784M92795k26184L3065K36009J9789
13639G16258B56632K8321L97396j84507J36380B49328K3120Q1664L08974A84788
13628a37898D16256j17968J92586B20452L64548K322j04711p3853G0327K39061
$$ y = [738621, 530434, 379934, 241166, 456223, 506484, 684929, 412790, 687664, 622437, 335121, 300337, 343312, 537014, 599399, 514353, 559773, 572015, 392062, 348529, 472223, 359373, 243563, 362712, 477969, 536278, 379803, 648817, 802111, 162708, 447177, 480967, 243984, 772712, 436835, 422043, 346215, 464136, 810987, 469401, 470683, 206541, 232218, 639006, 517636, 294720, 201431, 451216, 670115, 264770, 462230, 279367, 246409, 168323, 655101, 597998, 754060, 160784, 653579, 427395, 460460, 696469, 716258, 256632, 284953, 682349, 497842, 634222, 249328, 272448, 354112, 663086, 184788, -137898, 416256, 298288, 490874, 220452, 585000, 587322, 482611, 408758, 70327, 309388]
13618C09388R9296A01684J54238n3046K68421K27108B60507L89734k55079j75883
13608B19279J84533P5934m065j31506L47525B56674K49870m7232j78170o9676
13598B11466J88700r019K3744j818L7511n8858B0589N92273j71973Q1690n8087
13587D64492Q579O783N2297j71234J75258L9002Q206k54599b0875C47912J3828
13576C61740A46509J13445N739j2031G445L77120p0536K02745n0476A6943L70383
13565C87326o2444j52477J78912J14985J5735j09220A42092K46780D2769c0717
13554B77139K16333H7569L16514F3164L63478J75688A00846L8557F2498M28418
13544D90916r4139J09405A65616M62006k55251j05270K07646A62954J8318K04275
$$ y = [309388, 408684, 101684, 255922, 202876, 471297, 698405, 260507, 650241, 395162, 219279, 403812, 479746, 475681, 344175, 691700, 256674, 506544, 459312, 281142, 211466, 400166, 391147, 414891, 413073, 450584, 391726, 20589, 612862, 440889, 522579, 464492, 473071, 479854, 532151, 360917, 536175, 575177, 583383, 328784, -20875, 347912, 361740, 146509, 259954, 265693, 253662, 7445, 384565, 314029, 516774, 466298, 16943, 387326, 324882, 172405, 351317, 466302, 482037, 372817, 142092, 388872, 42769, -30717, 277139, 493472, 87569, 404083, 63164, 426642, 602330, 100846, 139403, 62498, 490916, 396777, 506182, 165616, 627622, 372371, 267101, 474747, 162954, 181272, 385547]
13534C85547M1546j2630j16477k7960K92747C2617J92420g2299D29894B04354
13523C38286N9372I1730L28299K2897j2578j19524B5305J45109J05622B9990M22582
13512D52572n0381F0895L91521e3001A21902Q9248P4454G3128Q8081D6740k225
13501D4515A938K13116M01554C7920K47067r091A37388o1444J32214r747K9574
13490B27985Q3965B1647K01657J63965l9838m0584N1437A1517P15812C35044a15588
13478C63833G2818R399L18172A04687M59498B7071P4997d7996g957A67779J58204
13467C25983A45266D9612K49311r0117h046G1518d4252B27284j6733P9515L9640
13456C29706e3874B93994F5004L00312A04614Q4952M1772J47945K9758p8467L7165
$$ y = [385547, 427093, 414463, 297986, 270026, 562773, 32617, 225037, -72299, 429894, 204354, 338286, 397658, 91730, 420029, 442926, 430348, 310824, 25305, 170414, 276036, 29990, 452572, 402191, 60895, 452416, -53001, 121902, 211150, 285604, 73128, 161209, 46740, 44515, 1938, 215054, 616608, 37920, 284987, 275896, 137388, 75944, 208158, 198411, 227985, 311950, 21647, 223304, 387269, 347431, 306847, 358284, 11517, 727329, 335044, -115588, 363833, 72818, 82217, 400389, 104687, 564185, 27071, 102068, -47996, -7957, 167779, 325983, 145266, 49612, 298923, 208806, -8046, 71518, -44252, 227284, 210551, 290066, 329706, -53874, 293994, 65004, 365316, 104614, 189566, 231338, 379283, 409041, 330574, 367739]
13445C67739J76462j09066j59602b2218A72078e7891D5542J2000R8821P208K10205
13434C73776n9815J5357J63793a8958B49941L37189A44987P8983K14491j94958
13424B43503F8165d5452h149A19688D6791R366J1379J43327q7066K34252R1870
13413D49919A96925n3498K5269J56648A62310J30646r1614c5655I7070M71425
13403E68495A60989h3886H7442J26394K00207E0404K20718E4296J78430m7217
13393A85509H6512M33068j18453A15343a77846d4634B23751R162J86966k02237
13383B17642K72667B31340K36300n6977j64215Q3457F1651J00737E1454J55578
13373B07032J51256n7060j33569J13952M7178j55617J936H2635K13492J7940A34081
$$ y = [367739, 544201, 435135, 275533, -22218, 172078, -57891, 45542, 57542, 156363, 163571, 373776, 313961, 329318, 493111, -18958, 249941, 587130, 144987, 223970, 438461, 243503, 68165, -45452, -8149, 119688, 46791, 56157, 67536, 210863, 123797, 358049, 449919, 196925, 143427, 168696, 325344, 162310, 292956, 201342, -35655, 97070, 568495, 160989, -83886, 87442, 213836, 414043, 50404, 271122, 54296, 232726, 185509, 86512, 519580, 401127, 115343, -177846, -44634, 223751, 232913, 419879, 217642, 490309, 231340, 467640, 410663, 246448, 329905, 61651, 162388, 51454, 207032, 358288, 301228, 167659, 281611, 328789, 173172, 175108, 82635, 296127, 314067, 134081]
13361A71158K52180F2236L3161m0228K44082E3461a59221A34354C7005K51601
13351B88606J85231j4081A70140K57319p0380J1662j39909J42977L44738G5079
13340C33313E2373L94008r4250j58732J03264J35695B7226L26088j20169E1113
13329A47043L09307A15789h939C43548e9133B23614j6848J91958j24424j31891
13319A42409J40557g1600A77835h2904G3435J2273m0911L1308L84015j13902L1872
13308C78090J2548A40796O2965C4258M3329J74356N1115J45204A42225l052h4280
13296a53209L9301D87463A31922i6780i282A84262M809i7911H340K47170A03534
13284A7473N5829I673b10B37060q9004L7628J06598a24259A20904J87849q3799
$$ y = [171158, 423338, 62236, 95397, 55169, 299251, 53461, -159221, 134354, 37005, 288606, 473837, 459756, 170140, 427459, 357079, 368741, 228832, 371809, 716547, 75079, 333313, 52373, 446381, 352131, 193399, 296663, 432358, 27226, 353314, 233145, 51113, 147043, 456350, 115789, -8939, 343548, -59133, 223614, 206766, 398724, 274300, 142409, 282966, -71600, 177835, -82904, 73435, 85708, 44797, 76105, 460120, 346218, 378090, 390638, 140796, 203761, 34258, 77587, 251943, 303058, 448262, 142225, 139173, -84280, -153209, -113908, 487463, 131922, -96780, -9282, 184262, 189071, -97911, 8340, 255510, 103534, 17473, 73302, 9673, -210, 237060, 148056, 185684, 292282, -124259, 120904, 308753, 224954]
13273B24954J5553l6269k5258k5090a42708B03322a6835A66319F6792K02186Q7391
13262C56369c573B84625a09733A43313K3033c8788A90210b12541A54144N7332
13252B11476a98808A56641B5963K10386J7265J22241A51345C472K7977P9713K91077
13241D02239d8933F5911P1640f7500A84428a4772I4638R5615a03605k4307G7781
13229C6589j4021K50443A19970a94467B66850C9693I595J80546p8504D58b48763
13217E7497c0448D9335O9267J23703J57067j77531K17396j58654J22127m6716
13207C55994A39902I031O0785J18038N9440c3691C32033C3854M3066b32647a04859
13195A46479i6825l19B66619a75083o8478A77767O7138d037i28B33052b89996
$$ y = [224954, 240507, 204238, 178980, 153890, -142708, 203322, -16835, 166319, 66792, 268978, 356369, -3573, 284625, -109733, 143313, 166346, -38788, 190210, -212541, 154144, 211476, -198808, 156641, 25963, 236349, 253614, 375855, 151345, 3472, 31449, 111162, 402239, -48933, 65911, 137551, -67500, 184428, -14772, 94638, 190253, -103605, -127912, 77781, 36589, 22568, 273011, 119970, -194467, 266850, 39693, 9595, 190141, 111637, 458, -248763, 57497, -30448, 49335, 118602, 242305, 399372, 221841, 439237, 280583, 402710, 355994, 139902, 9031, 69816, 187854, 247294, -33691, 332033, 33854, 76920, -232647, -104859, 146479, -96825, -97144, 266619, -175083, -243561, 177767, 244905, -4037, -928, 233052, -289996]
13183b43173B78380A26550J35710r3179M9238D8564K21295Q6516o8592o1053a04026
13171D3857g2402B3497L09191H7367d9914C49499A42474m5396Q5173C0203N6309
13160H6512a41403B75124j25481b02237A21866j0772J02815p0487f7098F5044
13149B40711n5885p3267q689a3110C21485I4623L00851E5606J9971J68063j1457
13138B32183D2092K33650J59937H6684b01122G6883b26100B01186a6917F32851
13127B25213m0057N6410d058m10154B20375A4288f77E4036Q0013O5330L53624
13116E53003c09768A05290L52604a31517B57567A26818f6295n1407A08079J07574
13106B15653d618B12971c0705F1278O6227b0739A1569L43438n5579I5793c03777
$$ y = [-243173, 278380, 126550, 262260, 169081, 218319, 48564, 269859, 356375, 287783, 226730, -104026, 43857, -72402, 23497, 332688, 87367, -49914, 349499, 142474, 97078, 182251, 30203, 86512, -141403, 275124, 149643, -202237, 121866, 111094, 213909, 143422, -67098, 65044, 240711, 184826, 111559, 102870, -13110, 321485, 94623, 395474, 55606, 75577, 243640, 232183, 42092, 275742, 435679, 86684, -201122, 76883, -226100, 201186, -16917, 632851, 225213, 185156, 241566, -4058, -414212, 220375, 14288, -677, 54036, 134049, 199379, 553003, -309768, 105290, 457894, -131517, 257567, 126818, -66295, -117702, 108079, 215653, -4618, 212971, -30705, 61278, 127505, -20739, 11569, 355007, 299428, 95793, -303777]
13094a09048G4217l5326c6009H7469a03628H3928i725j39235C07944e6262i506
13082g4314B64393R275f7574B84799a8544C51009a35695A17990i2346I9943b0188
13070a02000A28301c430D4742P3472J29573n2164H767M6897A2895a3398l24069
13059c37467B59735K7908q7887C1145H384a07127B23356a34948A26545D5686k1967
13048B3719J63534O7018j25114b5218B00409n8133m3898g0591l2042A9448J11363
13037A30811J68598j23215i7014I6515O4350Q060l7339b21845A35564l9479J28098
13026B24183A02981l0441K64587j21863l8017o2930e320C52092a59288A29189
13015b06833C3062P8329P3578J2344a03938B17312a0374A78056a88516A69781
$$ y = [-109048, 74217, 38891, -36009, 87469, -103628, 83928, -9725, -148960, 307944, -56262, -9506, -74314, 264393, 273668, -67574, 284799, -18544, 351009, -135695, 117990, -92346, 99943, -20188, -102000, 128301, -3430, 44742, 118214, 247787, 195623, 8767, 55664, 12895, -13398, -337467, 259735, 287643, 199756, 31145, 8384, -107127, 223356, -134948, 126545, 45686, 23719, 187253, 254271, 129157, -25218, 200409, 142276, 98378, -70591, -102633, 19448, 130811, 299409, 176194, -97014, 96515, 160865, 168925, 131586, -221845, 135564, 96085, 224183, 102981, 72540, 337127, 215264, 177247, 114317, -5320, 352092, -159288, 129189, -206833, 33062, 111391, 184969, 197313, -103938, 217312, -10374, 178056, -188516, 169781]
13004A10773f5903o9290A4509K14766F0712C0046J77952n5999g9380E2176h7548
12992D9447K52384G4955J8759D6373O017e6357A83845m8647c93850A44601K02170
12981C46771c2322o0621B41839e6022C28906a9748j81351a2633j66371a0329G3083
12969a7571A94203a10553a0617A03099J94405I7982J04330j8704J15818a27543
12958C11340q6409l8594J61370Q0452I5290L04596A66199O2892l9593B9274f195
12946G4988a7980H7137d48161a45557C3040o658j1478K8980a53731A07759d1364
12934a69330C29571j57835B7538p331d0424q6468j2056N0866C7155a12498A24445
12922b7476E6453a20983e6630K1060o14d214j31001A94423C7368N3421a15481
$$ y = [110773, -65903, -135193, 14509, 229275, 60712, 30046, 207998, 151999, -79380, 52176, -87548, 49447, 301831, 74955, 93714, 46373, 52390, -56357, 183845, 135198, -393850, 144601, 346771, -32322, -92943, 241839, -56022, 328906, -19748, -201099, -12633, -179004, -10329, 73083, -17571, 194203, -110553, -10617, 103099, 297504, 97982, 202312, 183608, 299426, -127543, 311340, 224931, 186337, 347707, 428159, 95290, 399886, 166199, 229091, 189498, 29274, -6195, 74988, -17980, 87137, -448161, -145557, 33040, 26382, 14904, 43884, -153731, 107759, -41364, -169330, 329571, 171736, 27538, 20207, -40424, -126892, -138948, -88082, 37155, -112498, 124445, -27476, 56453, -120983, -56630, -35570, -36184, -4214, -135215, 194423, 37368, 90789, -115481]
12910A26690K3969D5584d38849d6723A64686J06686a38688B03134F1736N5805
12900A17541j9012C1208K066d0247I3676d23763d02C13885a64716C06368f7498
12888i5740C2433Q1374E3645K57511a42010E1970K36601r9372q2770l0315l5967
12877D0147D304K18573E3283c15402B29032I9843K8807P6035d9469G7664J39238
12866B16902f2762B1971A0969K22560P7044j6032R2952D4449a11330G3533K93182
12855C66715j78071e654A04460a79455A10823i1971B49380a28175D7693b33476
12844I82K01297o2890a1699j03044C6275J04342a34613r5899C79954E5389a9135
12832a58412C91236a50443I001J07760D6193a74011n5274B66740l409a16882B17569
$$ y = [126690, 150659, 45584, -438849, -46723, 164686, 271372, -138688, 203134, 61736, 117541, 98529, 31208, 33274, -40247, 93676, -423763, -402, 313885, -164716, 306368, -67498, -95740, 32433, 113807, 53645, 311156, -142010, 51970, 288571, 189199, 106429, 76114, 40147, 4304, 222877, 53283, -315402, 229032, 99843, 128650, 204685, -49469, 77664, 216902, -62762, 21971, 10969, 233529, 310573, 294541, 387493, 44449, -111330, 73533, 366715, 188644, -5654, 104460, -179455, 110823, -91971, 249380, -128175, 47693, -233476, 982, 202279, 139389, -11699, -114743, 36275, 140617, -134613, -230512, 379954, 55389, -19135, -158412, 391236, -150443, 9001, 116761, 46193, -174011, -229285, 266740, 263331, -116882, 217569]
12820B0532b23813B24610N5429J9542g7760D08406A07371b54498J11414C8919
12809D3591J019j0513K8653f3088K8778I8169Q665O2745o7234L5824E276J89645
12797A94921C7933K7496b40285A93383H5826M6671a02I6891a1925D33709j96225
12786B37484g8540A07099j4579a12207G5029n097k6846a25195r4572B22192L4841
12775B57033B4369d7111G0209a9009C09217A1303a83672B8305b25551h2660j73631
12764b56291P5242B54115f7238F9653l1004b20918C26746b14603b7771A56649
12753B19314M5207B087J56761g9885j59091C74330j07543j32321L8042c6715D5687
12741h404q2577I9314N0775E5686K66667a85087H7210J76941a65253A52992o3923
$$ y = [20532, -223813, 224610, 280039, 299581, -77760, 408406, 107371, -254498, -143084, 38919, 43591, 44610, 34097, 62750, -63088, -34310, 98169, 106834, 169579, 102345, 138169, 5276, 194921, 37933, 65429, -240285, 193383, 85826, 132497, -102, 96891, -11925, 433709, 237484, -78540, 107099, 92520, -112207, 75029, 69932, 43086, -125195, -219767, 222192, 257033, 24369, -47111, 70209, -19009, 309217, 11303, -183672, 28305, -225551, -82660, -256291, -181049, 254115, -67238, 69653, 38649, -220918, 326746, -214603, -27771, 156649, 219314, 264521, 2087, 158848, -79885, -238976, 374330, 266787, 134466, 172508, -36715, 45687, -8404, -90981, 99314, 150089, 55686, 322353, -185087, 87210, 264151, -165253, 152992, 89069]
12730H9069a77961f9780n5102B15352a61280P6289C42468q8539r998A02915d2204
12718G9821c47279A13134J97729A19054B1641c02744B30960B5193J7569e306A46588
12706B20383O6112n5774B9518K68919d9012G1239L8383A2989K44498f2214H0851
12694a16458b6638E7221L0646b50911A20065P9734R3F6262A810a97678A77461
12682A75577o103j8908K37152j49961A09365K34116A63192K0587J23881J61702
12672D69362l0286f803D7369O5085m1630e6973J9920B7315L4532L4480L99922
12661D96249A02304b30266A25586e8003G4507f255B00008E5855b09656C95200
12650a82740G5782M3048c7636J0136o5616K3570A16975Q5807m3712Q8884a31832
$$ y = [89069, -177961, -69780, -124882, 215352, -161280, -84991, 342468, 253929, 243931, 102915, -42204, 79821, -347279, 113134, 310863, 119054, 21641, -302744, 230960, 25193, 42762, -5306, 146588, 220383, 286495, 230721, 29518, 298437, -49012, 71239, 109622, 12989, 257487, -62214, 80851, -116458, -26638, 57221, 87867, -250911, 120065, 199799, 199892, 66262, 1810, -197678, 177461, 175577, 169474, 150566, 387718, 237757, 109365, 343481, 163192, 183779, 307660, 469362, 439076, -6803, 47369, 112454, 70824, -56973, -37053, 27315, 61847, 96327, 496249, 102304, -230266, 125586, -58003, 74507, -6255, 200008, 55855, -209656, 395200, -182740, 75782, 118830, -37636, -27500, -93116, -69546, 116975, 202782, 159070, 247954, -131832]
12638a30316A11649C1222b9326E4893J19590D3399a43376f1546k33339E49904
12627A62511J19554r3696L9011a10044A14651L50831A68596a9070A11008h2629
12616B716M0207a91043P3341C4125M9782o366a06129A88116D5606M03401C6348
12604A22282j288c1567B60754J09791j54183p8137K32288A6394J19709a93792
12593B35998E8694j8393l246J83655H682M521O6587H163N6755b28100h4842L7438
12581d7404J6452o1904B47458d156B30715i4455J220r4912B89065O6559j56396
12570A99228E6a40840A78865j6007f2380A64356j0146d9616J2571l6420c6505
12558A52524L3001b0066j32731j0965C20045g4680r6862I155d0896A86081b12677
$$ y = [-130316, 111649, 31222, -29326, 54893, 174483, 43399, -143376, -61546, -294885, 549904, 162511, 282065, 188369, 227380, -110044, 114651, 465482, 168596, -19070, 111008, -82629, 2716, 42923, -191043, -117702, 34125, 83907, 77541, -106129, 188116, 45606, 449007, 36348, 122282, 120994, -31567, 260754, 370545, 216362, 138225, 370513, 16394, 136103, -193792, 235998, 58694, 40301, 37055, 220710, 8682, 13203, 79790, 8163, 64918, -228100, -84842, -47404, -30952, -92856, 247458, -4156, 230715, -94455, -93235, -188147, 289065, 355624, 199228, 56, -140840, 178865, 162858, -62380, 164356, 154210, -49616, -37045, -73465, -36505, 152524, 185525, -20066, -152797, -163762, 320045, -74680, -171542, 9155, -40896, 186081, -212677]
12546E2199K61650j30477a83141I8756O3872R4511q541A05301d7391a84B32476
12534c8235j05129D9836g1918c2887j73820D105K232J02782H32g9297b0027A8218
12521d7016I0395L8935K989a86238I325M64606G2424f7193b4009l33370C60991
12509B30296L4062b81882A4909g2821B3512f1525K2998j09241E29344B53473A3847
12497H9715a20312G3127a00321A48126b6553B39958f3846p5991e7110A43339D2502
12485a27831A8091L45237A78759q6766D5704B283a88070P1794r948A5269g7247
12473c3782A9718a53082D56165c67180C3466P1777a67996r0733R3614E7029e29046
12461c1441F2021a00966A36397J46571E4279c21350B5746g976r4939H4013f0107
$$ y = [52199, 313849, 183372, -183141, 98756, 162628, 257139, 248598, 105301, -47391, -184, 232476, -38235, -143364, 49836, -71918, -32887, -206707, 4105, 6337, 109119, 832, -79297, -20027, 18218, -47016, 90395, 129330, 132319, -186238, 9325, 473931, 72424, -67193, -24009, -357379, 360991, 230296, 264358, -281882, 14909, -72821, 23512, -61525, -38527, -147768, 529344, 253473, 13847, 89715, -120312, 73127, -100321, 148126, -26553, 239958, -63846, -139837, -57110, 143339, 42502, -127831, 18091, 363328, 178759, 91993, 45704, 2283, -188070, -116276, -126224, 15269, -77247, -33782, 19718, -153082, 456165, -367180, 33466, 105243, -167996, -258729, -165115, 57029, -529046, -31441, 62021, -100966, 136397, 282968, 54279, -321350, 25746, -7976, -102915, 84013, -60107]
12449D5095a36040f7310k22123J06428j68684A9868a04428A42444A5548K6557
12439D2105j8848a88918j4527o6097D4313k0352a6062A65078a88213H7935g5583
12427D8338N4019C6500b71332B15822j03360L2686f0269l16102a39494b0008G6400
12415B25939a28159a5444k61136F0994L2880J25179i5169L4602F2126a08926B72864
12403e585j13807q1350G2868f6187A74378G738O4084P5853E8179J5802O3078O223
12391A43282a99981P8083I5146B3182Q8332c0353k94272E6397M6053K33492j60974
12380A74968J8522J37217q8076D3569Q3969b20278B93071a23461b6884A59927
12369A68638R739b7350H8787b53719j1789A04458J68019c054j08131F7393Q6496
$$ y = [45095, -136040, -67310, -289433, -183005, -351689, 19868, -104428, 142444, 15548, 42105, 23257, -188918, -203445, -269542, 44313, 23961, -16062, 165078, -188213, 87935, -75583, 48338, 102357, 36500, -271332, 215822, 112462, 145148, -60269, -376371, -139494, -20008, 76400, 225939, -128159, -15444, -276580, 60994, 93874, 219053, -95169, -60567, 62126, -108926, 272864, -5585, -119392, -200742, 72868, -66187, 174378, 7738, 71822, 147675, 58179, 73981, 137059, 143282, -199981, -121898, 95146, 23182, 111514, -30353, -324625, 56397, 102450, 335942, 174968, 193490, 330707, 242631, 43569, 127538, -220278, 293071, -123461, -26884, 159927, 168638, 178377, -27350, 88787, -253719, -265508, 104458, 272477, -3054, -111185, 67393, 153889]
12358A53889f8031k6517L0072n6748j47843Q3080A97677p1354L1914d0234j83144
12347b23378A81453D6706h2296k17336H1465B2013a07353r9478E5052a53608C64579
12335d1278E4132h8279c1875C00466a62836b4494H4451J34190A07802g8258j21749
12324b00007I8000J84585E1348f0344H9725D3825c8213C03137C8898c494j91509
12313a95003B0537b3492q3284k07576A09227e3519b2348B49538B0939L43702A71056
12301b10027A37356m1569a26246D0675j3976K27843a12465p8409C5059J65572
12291B00631B3041q1b523B17224M6030h2350C3833J16047l7656i9949L5224C92478
12278C82520A24909J73521b1304B02041l3019p815m128a0582C26588a63748k07967
$$ y = [153889, -68031, -94548, -64476, -121224, -269067, -185987, 197677, 126323, 158237, -40234, -223378, 181453, 46706, -82296, -299632, 81465, 22013, -107353, -206831, 55052, -153608, 364579, -41278, 54132, -88279, -31875, 300466, -162836, -24494, 84451, 218641, 107802, -78258, -200007, 98000, 282585, 51348, -60344, 89725, 43825, -38213, 303137, 38898, -3494, -195003, 20537, -23492, -106776, -314352, 109227, -53519, -22348, 249538, 20939, 364641, 171056, -210027, 137356, 95787, -126246, 40675, 26699, 254542, -112465, -190874, 35059, 200631, 23041, 22960, -2523, 217224, 263254, -82350, 33833, 149880, 112224, -99949, -64725, 392478, 382520, 124909, 298430, -21304, 202041, 169022, 161207, 157079, -10582, 326588, -163748, -371715]
12267c71715c9851C63398A6199K45648E0254J725C201J67856a46117A21968k9979
12256I1989a26318a2758B16145M1968i2205o139A50847K1753C562M7844Q5669
12245A37075a41775j69067Q2622f686p1284A56355E5172O6044b53992A2437c2926
12233B07064m8088B7190A3435K35853a6792D19310n5782b13788F6521L31432A4764
12221a11228M6886B53182K0022K86994A88822H597e554G9782B635K06327E7880
12209A32653C1283K81269j20387l6616K38720F4203K10921e3216A72253J99610
12199C71863A51255P2992p4611E104P3490K63366A32316n024L2956N7231P0771
12188B88250B4366M6139L93907A12584E2508O1955M06329A55482B993J2707L0404
$$ y = [-371715, -39851, 363398, 16199, 261847, 50254, 51979, 3201, 171057, -146117, 121968, 91989, -126318, -12758, 216145, 258113, -92205, -98344, 150847, 172600, 3562, 51406, 137075, -141775, -310842, -228220, -6686, -77970, 156355, 55172, 121216, -253992, 12437, -32926, 207064, 158976, 27190, 13435, 249288, -16792, 419310, 363528, -213788, 66521, 397953, 14764, -111228, -64342, 253182, 273204, 560198, 188822, 8597, -5554, 79782, 2635, 208962, 57880, 132653, 31283, 312552, 192165, 155549, 394269, 64203, 275124, -53216, 172253, 371863, 151255, 224247, 149636, 5104, 78594, 341960, 132316, 127292, 160248, 217479, 288250, 24366, 70505, 464412, 112584, 52508, 114463, 520792, 155482, 2993, 15700, 46104]
12177D6104a66476D7135M7505g2363A29241N3500j98E6360a1515A48388R7821
12166B46209j12928i297C21689r0415A9727K17184d4647A31825l0661a80019C2823
12154a67384A43384g4423k9516D4005L59913b9445F4431K6458Q3045b45130B4961
12142A39008f7480A47949a59962B9675J46592a31336A00093K46987a36747E4819
12131d9170j0511A66950C1982Q1318N931J19293I3812a27828J1363E3358K7217
12120H0575b64589M3034h0154k5407A0449h6837A56402k2011B0542J32870a07317
12108a52467A98572a60968A552L28254i1712j01963A12480B5963Q1544a03056
12097e6394A51926f1217r3171E7836K08665A32316m8486J9679J6084a9739A12397
$$ y = [46104, -166476, 47135, 94640, -72363, 129241, 182741, 182543, 56360, -11515, 148388, 246209, 133281, -9297, 321689, 231274, 19727, 236911, -44647, 131825, 101164, -180019, 32823, -167384, 143384, -74423, -103939, 44005, 403918, -29445, 64431, 90889, 173934, -245130, 24961, 139008, -67480, 147949, -159962, 29675, 176267, -131336, 100093, 347080, -136747, 54819, -49170, -59681, 166950, 31982, 113300, 119231, 238524, 93812, -127828, -116465, 53358, 80575, -264589, -221555, -80154, -105561, 10449, -86837, 156402, 134391, 20542, 153412, -107317, -152467, 198572, -160968, 1552, 329806, -91712, -193675, 112480, 25963, 107507, -103056, -56394, 151926, -61217, -154388, 57836, 266501, 132316, 83830, 103509, 119593, -19739, 112397]
12085h8318L7251A48695n631E9248J59112n00I7084N23375J068178o54177C52589
12073B17207f93D6893N6094c52187a71008A9935J9978K06253A04072K90738a34909
12061a28179A25359b27732C4782a38522D0993K25452f9808A29975C0582a64986
12050e1926l8905J5l23247f1348E8261J09259R9434e1800J4378k36291a921B37590
12037i1766p6271C5421J8733g6539A27305C9696P9298A2518a90206L0294n5948
12026b15860B20831c24991J09004C06814F0499a64026G3852O5961b2804j81971
12016b04775A26990E4263n848R8563L5141f2738E1046a1B48858a918q5688k84477
12004c72083C14284D3668a28407F338d0550H805i0727A04364k4299k1828a64819
$$ y = [-88318, -51067, 148695, 143064, 59248, 218360, 217860, 97084, 620459, 1688637, 1034460, 352589, 217207, -693, 46893, 102987, -352187, -171008, 19935, 39913, 246166, 104072, 394810, -134909, -128179, 125359, -227732, 34782, -138522, 40993, 266445, -69808, 129975, 30582, -164986, -51926, -90831, -90816, -414063, -61348, 58261, 167520, 266954, -51800, -37422, -273713, -1921, 237590, -91766, -168037, 35421, 54154, -76539, 127305, 39696, 118994, 12518, -190206, -159912, -215860, 220831, -324991, -215987, 306814, 60499, -164026, 73852, 139813, -22804, -204775, 126990, 54263, 48415, 146978, 182119, -62738, 51046, -11, 248858, -1918, -87606, -372083, 314284, 43668, -128407, 6338, -40550, 8805, -90727, 104364, 80065, 58237, -164819]
11992A91430a20593M1159I4374b64910N9418B19007i0211j02546B46754p2287
11982A74467A8244J7512L33042c5916A10803N1388p6440K47154a45431A43583
11971b21069A1756a46992f66j22850h920A27595a84807A92609h7297A19935k1983
11960I7952N4472a0459j83680c2229n8478C0095a65344B55057j22374c66652H0049
11948a1809j20416j57025Q0578G0025K3180a25558j51171b6044j2622j40042A0469
11936D8733A0345N8922e197l58423J78068B45834b91137J3971J38181B36164J69545
11925D05709a46297l743f8695l8360G169j15J15882g4829l40423c2003B013d8330
11912C2110L21108A21885M7774a32103C1211b08949B22162c1583H030Q0008a09676
$$ y = [191430, -120593, -79434, 94374, -264910, -205492, 219007, -90211, -192757, 246754, 174467, 18244, 35756, 368798, -35916, 110803, 162191, 85751, 332905, -145431, 143583, -221069, 11756, -146992, -666, -123516, -8920, 127595, -184807, 192609, -87297, 119935, 97952, 152424, -10459, -194139, -32229, -90707, 30095, -165344, 255057, 132683, -366652, 80049, -11809, -132225, -289250, -208672, 70025, 93205, -125558, -276729, -26044, -38666, -178708, 10469, 48733, 10345, 69267, -5197, -363620, -185552, 245834, -291137, -277166, -138985, 236164, 405709, -146297, -150040, -68695, -107055, 7169, 7054, 122936, -74829, -415252, -32003, 2013, -48330, 32110, 353218, 121885, 169659, -132103, 31211, -208949, 222162, -31583, 8030, 88038, -109676]
11900D8748a28176f374A46425B6103J78768i4674A52182N8162c66726I2619J51675
11889B44294b30815A36764Q6601b02450F5037a99413A39439j9524e0244B16482
11878C257a52105A7231J40884J68863a61761k70836J47957a23889n2114B4247
11867F0341J6475a21719o2228P3391m7569A71431K21234A28633d08233F4463a76027
11855B28585c94354I4800a97363i8339A56526b18053m4756E2115b06043A54779
11844B8518M9235f4642D4458a92638K5523J5564M5031a7517j95557O631D4434
11832a13174M3750l1881B58877a57814B08103E9134d1798q6615j11525A10854
11821a06810n4577A7139R6512k9781d4770A06238a93304i931G5580e4554B89960
$$ y = [48748, -128176, -6374, 146425, 26103, 204871, -94674, 152182, 210344, -366726, 92619, 244294, -230815, 136764, 223365, -202450, 65037, -199413, 139439, 119915, -50244, 216482, 3257, -152105, 17231, 158115, 326978, -161761, -432597, -284640, -123889, -176003, 24247, 60341, 76816, -121719, -183947, -110556, -158125, 171431, 392665, 128633, -408233, 64463, -176027, 228585, -394354, 94800, -197363, -98339, 156526, -218053, -262809, 52115, -206043, 154779, 28518, 77753, -64642, 44458, -192638, -167115, -151551, -106520, -17517, -213074, -206443, 44434, -113174, -69424, -101305, 258877, -157814, 208103, 59134, -41798, -128413, -239938, 110854, -106810, -161387, 17139, 113651, 83870, -44770, 106238, -193304, -9931, 75580, -54554, 289960]
11809C71846b25239B44806G8895a58523A31122J72873a58413F1377i2127j76403
11799b68530c6942C0425L11633a19535A44640f8427r4791c9160j81418f4103A00940
11787a52675h266p2438C31758a11170L5982B20017l1776a34491j99496i2027A64583
11775A92230g0894q5025c1840A13815D5791j5204h33j74183A12006a31540k0811
11764a52351I371a71851H7679b56805a23794N5130C06898A0848b4976A56547a69249
11752C09964a78903G0370g6911B74896C9489a03601A28257C9113J56558a84468
11741A30829B9481K58458A09970h8688o4760B50112e9171B49061i7203L1346A00785
11729H6277m2204O1517J23431f6893A40806c24756d0760m0447q8145H6877a02409
$$ y = [371846, -225239, 244806, 78895, -158523, 131122, 303995, -158413, 61377, -92127, -268530, -36942, 30425, 342058, -119535, 144640, -68427, -163218, -39160, -220578, -64103, 100940, -152675, -8266, -80704, 331758, -111170, -75188, 220017, 188241, -134491, -333987, -92027, 164583, 192230, -70894, -155919, -31840, 113815, 45791, 30587, -833, -175016, 112006, -131540, -152351, 9371, -171851, 87679, -256805, -123794, -68664, 306898, 10848, -24976, 156547, -169249, 309964, -178903, 70370, -76911, 274896, 39489, -103601, 128257, 39113, 195671, -184468, 130829, 29481, 287939, 109970, -88688, -153448, 250112, -59171, 249061, -97203, -65857, 100785, 86277, 44073, 105590, 229021, -66893, 140806, -324756, -40760, -81207, -169352, 86877, -102409]
11717I8445c34673J38053A30091b04859B35530J28403j5273p0155N3247I1551
11706a2560D8373J82156Q8645c9743A41550L0638a22522A12991F697a15010A65236
11694h3317A77039M1879E6165c49182a15727A14886J05503J87167I3343b31977
11683b30785B37826F9136J57017d3005L000o0656A35723Q1053O1251a0615j97425
11672b08040A51614C6696d479D7481b19188P8731G305a27126j30139J7749B4175
11660a815G5762k0276a52602e3665l3476G1428J07302a64625H7292A2833L6772
11649D9605J69584g0747B27026a25519B65710e996j47371B35391a63182A48774
11638a16255B38469e4159l31344B61428g4907a2569j54791b5902k49699i859j28
$$ y = [98445, -334673, -196620, 130091, -204859, 235530, 363933, 348660, 278505, 331752, 91551, -12560, 48373, 230529, 319174, -39743, 141550, 172188, -122522, 112991, 6697, -115010, 165236, -83317, 177039, 218918, 56165, -349182, -115727, 114886, 220389, 407556, 93343, -231977, -230785, 237826, 69136, 226153, -43005, -40005, -100661, 135723, 216776, 278027, -10615, -208040, 151614, 36696, -4479, 47481, -219188, -140457, 7305, -127126, -257265, -239516, 24175, -1815, 75762, 55486, -152602, -53665, -87141, 71428, 178730, -164625, 87292, 12833, 49605, 219189, -70747, 227026, -125519, 265710, -5996, -153367, 235391, -163182, 148774, -116255, 238469, -54159, -385503, 261428, -74907, -12569, -167360, -25902, -275601, -9859, -9987]
11627i987A71509k9900D3088L25180C3350c70539e3859A9416c7840j92101b0796
11615E3789a85695B5469P3907C4011b9917A60415F6889a86971B49684C7799K47722
11604B85521G4793b8853B58875c3151p6392F7539e2368A045b28031I1365J0823
11593A02188c5210H59K11562L1887l9807N7349p6336J1721k6411q1250J23503
11582B13077n0553a50821P3732j31334c2710F2078Q1211M8258a00198A22227a45555
11570B51200j15002h5449r6259g0231k8164c4355A29930a99694O610h8938G9405
11558F9776O2943a64683H7240b6436B61837L3715O2771A03185C0328K14231a562
11546D98964A7727Q3230K88774a61488L8822G8740L22182I3811g5899B65648M0288
$$ y = [-9987, 171509, 141609, 43088, 368268, 33350, -370539, -53859, 19416, -37840, -229941, -20796, 53789, -185695, 25469, 99376, 34011, -29917, 160415, 66889, -186971, 249684, 37799, 285521, 74793, -28853, 258875, -33151, -109543, 67539, -52368, 1045, -228031, 91365, 102188, -35210, 859, 212421, 244308, 204501, 261850, 185514, 197235, 170824, 89574, 213077, 162524, -150821, -77089, -208423, -32710, 62078, 143289, 191547, -100198, 122227, -145555, 251200, 136198, -85449, -181708, -70231, -98395, -34355, 129930, -199694, -193084, -88938, 79405, 69776, 132719, -164683, 87240, -26436, 261837, 295552, 358323, 103185, 30328, 244559, -1562, 498964, 17727, 100957, 389731, -161488, -122666, 78740, 400922, 93811, -75899, 265648, 305936]
11535C05936H4347P6355K9016o2128D1548a26034B03601M8066a9806B90942a18590
11523B07257C1795J00324K08119b45756P4922B95282g9544L477q6455A61485J71134
11512C32619N4673q9534o1144K97765k49191J91747a18404C13904q7268p6999
11502A49637O6312L89894H2928J41679c1092k46043D54840A69739a5498E7593
11491B30351a6323C6002i4725D41492a51378H7493J71494o5145M3320a68086A20921
11479A8753J48669o1430N20008B37227K0109C4063K38142j729e0193j50159D2229
11467A73103n6002J8236j3872J72563D5621J36773J5888I3360b2578B54290F5957
11455C7797P4524D6961j2328M9923J47745h5681K1445A70420K03927E8440c2631
$$ y = [305936, 84347, 160702, 189718, 127590, 41548, -126034, 203601, 251667, -19806, 290942, -118590, 207257, 31795, 132119, 340238, -245756, -170834, 295282, -79544, -76067, -162522, 161485, 332619, 387292, 297758, 236614, 534379, 285188, 476935, -118404, 313904, 226636, 149637, 215949, 605843, 82928, 224607, -31092, -277135, 454840, 169739, -15498, 57593, 230351, -16323, 36002, -94725, 441492, -151378, 87493, 258987, 193842, 237162, -168086, 120921, 18753, 167422, 105992, 626000, 237227, 257336, 34063, 272205, 270476, -50193, -200352, 42229, 173103, 117101, 135337, 121465, 294028, 45621, 182394, 198282, 93360, -22578, 254290, 65957, 37797, 112321, 46961, 34633, 84556, 232301, -85681, -64236, 170420, 374347, 58440, -32631]
11443d36470B86718a46918c6674A5648O0918a73036j2640k959C6026c7477B82629
11431c22424B77973E7910L5121a64152B44284H2643J55417F417a60116B09727
11420A8114e6564j80799I9255b3988F6108f1722C0375Q6978j4075a29286M4405
11409h4881L3239j82625I4252d1061m0600P39B10182H962b4005A73291o1197K21766
11397C33860A49839a85550k53723A07084A2738J96080I7683Q7123c5851C6399
11386b7982A21814b49656C5761a74220M0555m8338B20329l0747O776D6368e1592
11374A53391f8673A06719b26288B35593a34537r7534O7652L8034A34732A7032
11363a46891b7789r5844r9377R7634n6498l1893C09349B5371L1780K6072c28666
$$ y = [-436470, 286718, -146918, -36674, 15648, 76566, -173036, -185676, -188635, 36026, -37477, 282629, -322424, 277973, 57910, 93031, -164152, 244284, 82643, 238060, 6417, -160116, 209727, 18114, -56564, -237363, 99255, -23988, 66108, -61722, 30375, 117353, 103278, -129286, -84881, -51642, -234267, 94252, -41061, -81661, -80922, 210182, 8962, -24005, 173291, 112094, 333860, 149839, -185550, -439273, 107084, 12738, 208818, 97683, 184806, -35851, 36399, -27982, 121814, -249656, 35761, -174220, -133665, -182003, 220329, 189582, 196358, 46368, -51592, 153391, -68673, 106719, -226288, 235593, -134537, -232071, -164419, -126385, 134732, 17032, -146891, -27789, -123633, -223010, -125376, -181874, -213767, 309349, 25371, 57151, 83223, -328666]
11351A7865a74551r742N9804N1254j09500Q3502B11615E5626a35493I0952O1143
11340A52095d069B14721A7733b14167B7089a01819A19568M0580a13838n3410b6126
11328D2696N7635H624b03255j00855B69414a55046O6404B39437p9541b99924a07640
11316A14619K8094M2446J6552E5476A6843J65579D4635a15837j89538H7844M1413
11305A29257A0041P114f2847B3771b62045a3841k15877O655f1875k55103h6979
11293A58725O1156f7365j01514d5304O015j18295H3138N9309J17469H5238f201
11281A6507b74608A7555b42812D5566K5357P5117p0614A3935P236e1380F9030
11269d4018H3210C7666e3031k57862A60799Q1349I7556P675a21609A90954E2302
$$ y = [17865, -174551, -184293, -124489, -73235, -182735, -99233, 211615, 55626, -135493, 90952, 152095, -4069, 214721, 17733, -214167, 27089, -101819, 119568, 160148, -113838, -167248, -26126, 42696, 100331, 8624, -203255, -304110, 269414, -155046, -88642, 239437, 159896, -299924, -107640, 114619, 142713, 185159, 201711, 55476, 16843, 182422, 44635, -115837, -305375, 87844, 129257, 10041, 17155, -62847, 23771, -262045, -13841, -229718, -223063, -61875, -316978, -86979, 158725, 219881, -67365, -168879, -45304, -39289, -157584, 83138, 142447, 259916, 85238, -6201, 16507, -274608, 17555, -242812, 45566, 70923, 146040, 75426, 13935, 21171, -51380, 69030, -44018, 83210, 37666, -53031, -310893, 160799, 242148, 97556, 105231, -121609, 190954, 52302]
11257A95790C0291b70805P1981f209j79607j80888A65808J76870b23500I5701
11246g4099j9889c8397B82897a46008A15965j9430b66320O5705R6399d743q4904
11235h9647C7244K02339m9965l5816a88270A30670g5825q2544k43072J48489C04425
11223D0371R8596a07033b9621r747C49a8013O120k94844I2425N6929c14266b5962
11210a05022k4951D5385c00536a10983A83230P272i7485A63372d0767k7009j63201
11199b30977H3054K77232h8057D0045K41425r3457a31015M8495L4321k41317J08851
11188a80665q8709A11012c70056R680J30918R2142K0130k44632A67864l8819b41932
11176a09651E39309B63183b01187A43698K6548k7135a64171G8701b00035j00008
$$ y = [195790, 30291, -270805, -198824, -6209, -185816, -366704, 165808, 342678, -223500, 95701, -74099, -93988, -38397, 282897, -146008, 115965, 96535, -266320, -200615, -104216, -4743, -89647, 37244, 239583, 189618, 153802, -188270, 130670, -75825, -158369, -401441, -252952, 304425, 40371, 138967, -107033, -29621, -39368, 349, -18013, -11893, -306737, 92425, 149354, -314266, -25962, -105022, -129973, 45385, -300536, -110983, 183230, 190502, -97485, 163372, -40767, -67776, -230977, 83054, 360286, -88057, 40045, 281470, 188013, -131015, -82520, -48199, -289516, -180665, -269374, 111012, -370056, -360376, -229458, -137316, -117186, -361818, 167864, 129045, -241932, -109651, 539309, 263183, -201187, 143698, 170246, 143111, -164171, 78701, -200035, -300043]
11166c00043C52680d3601l5352a2097A70119B6447a07365E7234i7265o0370J7745
11155a39890E4831a62319c0822o0378H7188L627a00800a4097K102H4397r183e8951
11142B12502G6220a0393o8117E3383b82131A36480K8196B2285f082A67023g1531
11130B7693J83084d2463b814j73089A24501K16948c2861A65349K7452c51321d1182
11118A52201M6548c89368g1065B64768a43924c7191o2747A86244N2160b19621
11107E1513d9426C27167b2685B82812H5986N2222C7963K13830C2594K10973a32881
11095b45238A59643J68967a33002b6045A9853J38320O1530J18818K2750A63253
11084A15849K05553I4126m5473L31707A69810K22326G835J75647l2954K01528
$$ y = [-300043, 352680, -43601, -78953, -12097, 170119, 26447, -107365, 57234, -97265, -157635, -139890, 54831, -162319, -30822, -91200, 87188, 90815, -100800, -14097, -11995, 84397, 75214, -58951, 212502, 76220, -10393, -78510, 53383, -282131, 136480, 164676, 22285, -6082, 167023, -71531, 27693, 210777, -42463, -2814, -175903, 124501, 341449, -32861, 165349, 192801, -351321, -41182, 152201, 198749, -389368, -71065, 264768, -143924, -37191, -99938, 186244, 238404, -219621, 51513, -49426, 327167, -22685, 282812, 85986, 138208, 37963, 251793, 32594, 243567, -132881, -245238, 159643, 328610, -133002, -26045, 19853, 158173, 219703, 338521, 361271, 163253, 115849, 321402, 94126, 48653, 380360, 169810, 392136, 7835, 183482, 150528, 352056]
11074C52056j20337G9722Q572R4654J08152M9823N7587J58318B66396K16701l4782
11063D48315K65439l2189j95146L2376R8193j14949K75960k74792Q4447K97288
11053H84942D25952K96246m4038C11422K59994l899k8776l8940K13508r061J73109
11042H77357k71608L6898p6731M58306m25242J76840l60908K8640j90672M92047
11032G44927Q3499C07405K35052K49443C58455K25590l3693k3241J6825J52214
11022F96150o8688k28941J00191p6557M01709N7932C26168K46630J58809p0685
11012F60922Q6549C68632L7344p8624M27445k01774O3641K47741C90191K52243
11002F42434K48275m05223K34900J4011l9983j67074L5501k40065K97918k2184
$$ y = [352056, 231719, 79722, 88294, 182948, 291100, 340923, 398510, 556828, 266396, 483097, 448315, 713754, 681565, 486419, 518795, 616988, 502039, 777999, 503207, 587654, 884942, 425952, 722198, 678160, 311422, 571416, 567517, 538741, 499801, 713309, 704248, 877357, 605749, 642647, 565916, 1024222, 598980, 775820, 414912, 443552, 252880, 744927, 828426, 307405, 542457, 791900, 358455, 584045, 550352, 527111, 543936, 696150, 627462, 398521, 498712, 422155, 823864, 881796, 326168, 572798, 731607, 660922, 747471, 368632, 405976, 327352, 754797, 553023, 616664, 864405, 390191, 642434, 890709, 485486, 720386, 734397, 694414, 527340, 562841, 322776, 620694, 598510]
10992E98510K25850l55372L77598C58725K83743j0450N01382m14179Q1555K94442
10982A095218L67645j72603J02441j45499K77484l9156Q7350K3947O99267L65911
10972B662005n2147m72726O52451m12432k44274m8208k88913j17816Q0015J4315
10962A772270K06125m34736K14402k452m60223K87228J84611N692o3276l30948
10952A378693o9687j32464O5751D85897l0811K8674B7256L75215A50446J6642
10942A67088K99018A85409K31431j05895a46064B09944k2652k1405c05531A82321
10931A05960d8571D29514j66003g1248r266C7036A3553a2954B34220g2182k49663
10920c21845G2204P607c1189n9154A45911L0465b41044B16143j03184O5406p0662
$$ y = [598510, 824360, 468988, 846586, 358725, 642468, 632018, 1133400, 719221, 800776, 1095218, 1462863, 1290260, 1392701, 1247202, 1524686, 1485530, 1572880, 1596827, 2296094, 2662005, 2609858, 2137132, 2789583, 2377151, 2132877, 2084669, 1795756, 1677940, 1757955, 1772270, 1978395, 1543659, 1758061, 1755609, 1295386, 1582614, 1767225, 1772917, 1709641, 1378693, 1309006, 1176542, 1242293, 485897, 455086, 483760, 27256, 402471, 150446, 167088, 466106, 185409, 416840, 310945, -146064, 209944, 187292, 165887, -305531, 182321, 105960, -48571, 429514, 263511, -71248, -80514, 37036, 13553, -12954, 234220, -72182, -321845, 72204, 79811, -31189, -90343, 145911, 176376, -241044, 216143, 112959, 178365, 107703]
10909A07703m8167b09923O4320A53828o666a45184A34865f7820A48094e0061I020
10897F6440J05960a24358q8171A06194a99686H9271K1672J63736h3541B81653
10886e8881F0605A1291c4788E959a13470F5361k2169R0410c5971D0801Q9188b07422
10873B2141J62979g7006b6787r2107A7284M29707b01878G2344i9876A8511F496
10861B87018D5997j8898b25405g5355B80024d6018i085k9298n219B2801c1552
10849B4988f4842m216B65546l5320a49302m9718i963k00373B26604b49837C8713
10837C11650f8153j1346F2966a91789i2029G2288j8204J59744J89797b55079A14991
10825a70415C0162b64260J16604L0850A76474F1415d5263B00802b20781P1291
$$ y = [107703, 59536, -209923, -145603, 153828, 147162, -145184, 134865, -67820, 148094, -50061, 9020, 66440, 172400, -124358, -212529, 106194, -199686, 89271, 110943, 274679, -83541, 281653, -58881, 60605, 11291, -34788, 5959, -113470, 65361, 43192, 133602, -35971, 40801, 129989, -207422, 22141, 185120, -77006, -26787, -118894, 17284, 446991, -201878, 72344, -99876, 18511, 6496, 287018, 45997, 27099, -225405, -75355, 280024, -46018, -9085, -38383, -43602, 22801, -31552, 24988, -64842, -69058, 265546, 230226, -149302, -199020, -9963, -210336, 226604, -249837, 38713, 311650, -68153, -79499, 62966, -191789, -92029, 72288, 54084, 213828, 403625, -255079, 114991, -170415, 30162, -264260, -147656, -116806, 176474, 61415, -45263, 200802, -220781, -149490]
10815a49490o3697a00282M7344B01659g9716c212j41819L0221e6069C31360E0879
10803I617Q4119a09422K4035o9228f5219k53444C48993h0472j18461h9157B89200
10791b14516I0430J97503b94894J34204K5745O0095A27004f7602k21866P2082
10781b17386K8928n2653@d05625A29293n7704a6392k95632a9028B1292J26918
10770A48210n1701b28262R2121a9347k90511A11514A3539b84548J13693j04659
10760b75514A66685G8584R6315b25399d1534k47779h5736A37443a20713E3075
10749A37215J57607R1211a20178b8949C20687a90146N991E1182a38592l4234A22848
10737i2084l621H7317J0210a62493c9936B2073a07936k8553B0197f8338C14342
$$ y = [-149490, -213187, -100282, -52938, 201659, -79716, -3212, -145031, -114810, -56069, 331360, 50879, 9617, 93736, -109422, -85387, -154615, -65219, -318663, 348993, -80472, -198933, -89157, 289200, -214516, 90430, 287933, -294894, -160690, -134945, -74850, 127004, -67602, -289468, -217386, -188458, -241111, 0, -405625, 129293, 71589, -16392, -312024, -19028, 21292, 148210, 96509, -228262, -136141, -19347, -309858, 111514, 13539, -284548, -170855, -275514, 166685, 78584, 174899, -225399, -41534, -289313, -85736, 137443, -120713, 53075, 137215, 294822, 386033, -120178, -28949, 320687, -190146, -184155, 51182, -138592, -172826, 122848, -92084, -95705, 87317, 97527, -162493, -39936, 22073, -107936, -136489, 20197, -68338, 314342]
10725C91076A10608a92157D5315c3252A64003M6148E8842K4345d04059g668k3823
10714c1491k12060A63641b47959b9203D2196a7886m6328j35901a1503j31568A94948
10702D9687c459k2983j1321B70039N1950b819o1805B2970e216A18998N6015b13079
10689a73854A15932b09450C1015d7762k23564l6197A54829E8248Q312a20587e595
10677g9762A20056c29071A31736d6881l30500A41833l6224c07954B38762j02592
10667A36170b84381a4848j93976c5661k17807e6741m04066a3376j23393H1028
10656h2597j80207e9464A171J14208b90458c5976A94871H6112i9577j8755m2552
10645a60884d5535G75e8207n7431a7459B14179a9893B29824F2741M8456b8585
$$ y = [391076, 110608, -192157, 45315, -33252, 164003, 210151, 58842, 83187, -404059, -7668, -31491, -243551, 163641, -247959, -29203, 42196, -17886, -64214, -200115, -11503, -143071, 194948, 49687, -3459, -26442, -37763, 270039, 321989, -2819, -64624, 22970, -5216, 118998, 175013, -213079, -173854, 115932, -209450, 31015, -47762, -271326, -307523, 154829, 58248, 66560, -120587, -5595, -79762, 120056, -329071, 131736, -46881, -377381, 141833, 105609, -307954, 238762, 136170, -284381, -14848, -208824, -35661, -253468, -56741, -460807, -13376, -136769, 81028, -82597, -262804, -59464, 1171, 115379, -290458, -35976, 194871, 86112, -99577, -118332, -160884, -45535, 775, -58207, -115638, -17459, 214179, -19893, 229824, 62741, 111197, -28585]
10633H0388r150c25608a41253k13261B1758a20222j2629B9354i0552I6466c3000
10621C7512a34148C0405N8808J8223a8578j59053j49600e6902j36965B67746c20748
10609d8551C51730b01069b2722r284F2340k4823K36587a46798L4789d8701H718
10597a20987N4374B66526a02189B9433i423j95541d4246k21059D3548a44699A96940
10585A88805r3409f6484G4564E349K68886a59463P3515b7895k16943i9910J2058
10574h7852b08A25636a2814G08K4596c36663l0546f273k88421h0545n4030I2474
10561A4002J56378a04319b6883l0399C53209a15579B05364a79267A8853b9628
10550A27286D3476K48743C5612d26977d0603n4292A65879D0542a13279l20575
$$ y = [80388, 71238, -325608, -141253, -354514, 21758, -120222, -132851, 29354, -90552, 96466, -33000, 37512, -134148, 30405, 89213, 107436, -18578, -177631, -327231, -56902, -193867, 267746, -320748, -48551, 351730, -201069, -22722, -32006, 62340, 37517, 274104, -146798, -112009, -48701, 8718, -120987, -66613, 266526, -102189, 29433, -9423, -204964, -44246, -265305, 43548, -144699, 196940, 188805, 95396, -66484, 74564, 5349, 274235, -159463, -85948, -27895, -244838, -99910, -87852, -208, 125636, -12814, 708, 25304, -336663, -367209, -6273, -294694, -80545, -134575, 92474, 14002, 170380, -104319, -26883, -57282, 353209, -115579, 205364, -179267, 18853, -29628, 127286, 43476, 292219, 35612, -426977, -40603, -94895, 165879, 40542, -113279, -433854]
10540d33854B3652K16446d6742j18790j86326A4521a89391h7716k4359j4367b8808
10528A09293j588J6843e1571p7862d2628l89481a35630d988n6274A07386a84724
10516B34784a41998B509a19301A23817A7939h3013A6882a22516C7334a19992B5787
10504D6031L1897a06189r7506O8349j07125M6490j54751e4778G1105J98355d966
10492a57901j61757B20403a8649k64582K3286j11219B08724A488a53518B75908
10481A66300L74053Q0174j15582N1052A96624a47497B52853j760f9198C59677
10470E1067e5060E8224K94452A02216J52462A17406Q9870m8369a23219B7617a70090
10458Ba79427g8072I9436N463a19652d248F7920i6197k0073j16141j98697c5382
$$ y = [-433854, 23652, 240098, -46742, -165532, -351858, 14521, -189391, -87716, -112075, -126442, -28808, 109293, 107705, 124548, -51571, -129433, -42628, -432109, -135630, -4988, -61262, 107386, -184724, 234784, -141998, 2509, -119301, 123817, 17939, -83013, 16882, -122516, 37334, -119992, 25787, 46031, 77928, -106189, -203695, -135346, -242471, -195981, -350732, -54778, 71105, 269460, -4966, -157901, -319658, 220403, -18649, -283231, -259945, -371164, 208724, 1488, -153518, 275908, 166300, 540353, 620527, 504945, 555997, 196624, -147497, 252853, 251093, -69198, 359677, 51067, -55060, 58224, 352676, 102216, 254678, 117406, 207276, 158907, -123219, 27617, -170090, 2, -179427, -78072, 99436, 104899, -119652, -4248, 67920, -96197, -116270, -232411, -431108, -35382]
10445B88778a60546j29524J19896I1055N8254e7704A14681a5361l0773A89961
10434a74850M5282I5802b25413A29003L53548a34130a6136k39952a27568H2249
10423C18863q2526A8739a49900A5263M4367a77655A11452R8310b89587a06729
10412d67850a1954C03737A607J74700C9767J34903a09209o9309l16924a72538
10401c8761j32920F5604P1951a45833C07396H872R8844a59526H9355ol0459a741
10388B85564a74045g8882A1038P5720M5212a07960G0181L1765J90698n0568j09215
10377A32861N8284p3130J00722J46747f7168A57678E7347L21102R3796A85639
10366E6333L37177O3021p8508A20053J31317J1178J03356R6162b34818i5727C01939
$$ y = [288778, -160546, -290070, -170174, 91055, 149309, -57704, 114681, -15361, -46134, 189961, -174850, -129568, 95802, -225413, 129003, 482551, -134130, -16136, -256088, -127568, 82249, 318863, 236337, 18739, -149900, 15263, 59630, -177655, 111452, 209762, -289587, -106729, -467850, -11954, 303737, 1607, 176307, 39767, 174670, -109209, -178518, -495442, -172538, -38761, -171681, 65604, 137555, -145833, 307396, 8872, 107716, -159526, 89355, 89349, 58890, -1741, 285564, -174045, -78882, 11038, 86758, 131970, -107960, 70181, 101946, 292644, 242076, 132861, 191145, 118015, 218737, 365484, -67168, 157678, 57347, 378449, 472245, 185639, 56333, 393510, 456531, 378023, 120053, 251370, 262548, 365904, 462066, -234818, -95727, 301939]
10354e7738A97577K0913Q1342L16219J33277I4274M50449r4820d6103C38785G9954
10342C59858m6781k5950I6704L1017J04841R808A18468k8170J51178a3476A76018
10330a8823C57592o3608h1142B3059a16341j01057E75902j37258R3384A92503
10319C32020j22785L44565A35212E7289f5595B44339A02029g5537J1159A83487
10308b43695A88680C4311a74921d6195B42499d47083h3423B96337a26381D681
10297G107d70815a05071M2993B56c883p695A76674K8964b17548C4755i5730m575
10285a00305Q089H2943a78611k82326a57215a6570j54287J7911C4246O6030a10869
10273E2502a37182D1271J94301F168J36604l4711L3351j8509l5983J45471H8397
$$ y = [-57738, 197577, 218490, 299832, 616051, 749328, 94274, 544723, 449903, -46103, 338785, 79954, 359858, 313077, 287127, 96704, 127721, 232562, 242370, 118468, 90298, 241476, -13476, 176018, -18823, 357592, 293984, -81142, 23059, -116341, -217398, 575902, 438644, 532028, 192503, 332020, 209235, 553800, 135212, 57289, -65595, 244339, 102029, -75537, -64378, 183487, -243695, 188680, 34311, -174921, -46195, 242499, -447083, -83423, 296337, -126381, 4681, 7107, -470815, -105071, -62078, 256, -3883, -11578, 176674, 205638, -217548, 34755, -95730, -100305, -92216, 82943, -178611, -460937, -157215, -16570, -170857, -152946, 34246, 100276, -110869, 52502, -137182, 41271, 235572, 6168, 142772, 108061, 141412, 122903, 86920, 232391, 88397]
10261A73307L17279r9219R3604A85910F0406J05568K39093h4546A96761P1887
10251B68648b61970A57926L5154o0439h8973E6571K6622C1984N188N643a64883
10239B77109c2953B34905j11135L9034d0281B1935a75001C5802b48602f4135m5522
10228a09657B11643j01416h8445j93895J27506I4712J5957f9248b3032I4793a51679
10216a36263d763B79310q2199a00921B37935b7293A10829q604b76993E8345B8367
10204b94096C970b11334B7054J59653E5785d798j42905J557C39420D4140f7408
10192E8200c8528k8845q9406F4414a42138b2292k44481N0872j8011Q1215B91656
10180A66531f2347l72579B63785E3457a96374K7638O1718D7230L0185a31971A0693
$$ y = [173307, 490586, 391367, 484971, 185910, 60406, 165974, 405067, -84546, 196761, 268648, -261970, 157926, 193080, 132641, -88973, 56571, 83193, 31984, 37172, 42815, -164883, 277109, -32953, 234905, 123770, 162804, -40281, 21935, -175001, 35802, -248602, -64135, -109657, 211643, 110227, -88445, -282340, -154834, 94712, 110669, -69248, -23032, 94793, -151679, -136263, -4763, 279310, 197111, -100921, 237935, -27293, 110829, 102225, -276993, 58345, 28367, -294096, 3970, -211334, 27054, 186707, 55785, -4798, -147703, -146146, 339420, 44140, -67408, 58200, -38528, -67373, -156779, 64414, -142138, -22292, -266773, -215901, -233912, -152697, 291656, 166531, -62347, -434926, 263785, 53457, -196374, -168736, -107018, 47230, 77415, -131971, 10693]
10168A59479D9172e174G6098a23255k30894j42192b8579R201j28408O1353o3832
10157a50265F3069Q6985o4061a04550p0745l4350A00796e4761k99591A04803b32422
10145d4774A75889A9194O427c09879A77040b6151i387j33298j5155D58c3878C92376
10132a29494K2970j24892e3748F8185i0050n8042f0033P256A63194a28205J3646
10121a14559A50980a2378k30716E4634a15761B19374a31488A05799a44384k56602
10111d00986B51605c5967j7891K0627J4262C0216A1331J58049b7025k39449A06397
10099b3739A96553g9555A04047c48402a34037J9514L9790H1894a11293J3771G2349
10087A4804a4816l81717a51625N4562b6755q3821j31727f2111n2401I0512b10045
$$ y = [159479, 49172, -5174, 76098, -123255, -354149, -496341, -28579, -19378, -147786, -86433, -150265, 63069, 150054, 85993, -104550, -175295, -209645, 100796, -54761, -354352, 104803, -232422, -44774, 175889, 19194, 25621, -309879, 177040, -26151, -9387, -142685, -157840, 458, -33878, 392376, -129494, -106524, -231416, -53748, 68185, -90050, -148092, -60033, -52777, 163194, -128205, -114559, 150980, -12378, -243094, 54634, -115761, 219374, -131488, 105799, -144384, -400986, 251605, -35967, -53858, -33231, -18969, 30216, 11331, 169380, -27025, -266474, 106397, -23739, 196553, -79555, 104047, -348402, -134037, -114523, -74733, 81894, -111293, -97522, 72349, 14804, -14816, -396533, -151625, -97063, -26755, -110576, -242303, -62111, -114512, 90512, -210045]
10075C2a39798E9071a55789k7098A91290H2226c10362A4664b87383P7607m9880
10064b59656L2579A8277e4167k58802A34993b80681J18660f4631r9185K9183p3662
10053b08295f6909q5028p9731j98278f8307j15966N4674d5316n8278n1700o3244
10042b18538I6038J20952j01155A146J31813b35202k885i1920L3013j07867G2194
10030c29132A23830b46387e106B01211e7130B21186H8920g9754l98427C0926e9678
10018A22201d0156A47815b96190j00718D6759c328A60967b89545b4231B8898b12277
10006b2600j9814n5597k0812F5234M5165M2996a05364a8922C0805b2973j57884
9995a80857M1183b4008C03788g9529k24895a08472E7468J43255b08714A34738
$$ y = [32, -139798, 59071, -155789, -182887, 191290, 82226, -310362, 14664, -287383, -209776, -259656, -227077, 18277, -54167, -312969, 134993, -280681, -162021, -64631, -163816, -134633, -208295, -66909, -151937, -231668, -429946, -68307, -184273, -129599, -45316, -103594, -155294, -218538, 96038, 216990, 115835, 1146, 132959, -235202, -238087, -91920, -58907, -166774, 72194, -329132, 123830, -246387, -5106, 201211, -57130, 221186, 88920, -79754, -478181, 30926, -59678, 122201, -40156, 147815, -296190, -396908, 46759, -3328, 160967, -289545, -24231, 28898, -212277, -22600, -42414, -98011, -118823, 65234, 110399, 153395, -105364, -18922, 30805, -22973, -180857, -139674, -24008, 303788, -79529, -304424, -108472, 57468, 200723, -208714, 134738]
9984h1350B46472a16680B08777g2530C0486M7317m136k2831j884b69429k2838
9973b92267B1473f0906p2341d2355C02649A50232D783P4612k7124a41056r4313
9962b35369a9578q5473k24644k0470Q8064h3414A17865e9226B6053L05340b65745
9950b49073B0813b26594L3037a3124j66252N2883D4976K37906h8632j26408a07390
9938H3151M5426h1711D0050L53474E9918J31587b15969B08682h6321j74228a11352
9926a19147L0337k95581F5510g5592k06416A67092b81479Q2219n7814A37901J55144
9915B93045a94989G9671c6608j19590P8028C5056a70628A08947a23285d4319o1169
9904a05488a213l40986A72530a49850a2444o9049I0259c58116a48059B3926g0724
$$ y = [-81350, 246472, -116680, 208777, -72530, 30486, 77803, 73667, 50836, 48952, -269429, -292267, 21473, -60906, -133247, -42355, 302649, 150232, 4783, 79395, 52271, -141056, -235369, -19578, -105051, -329695, -350165, -262101, -83414, 117865, -59226, 26053, 331393, -265745, -249073, 20813, -226594, -193557, -13124, -179376, -126493, 44976, 282882, -88632, -215040, -107390, 83151, 128577, -81711, 40050, 393524, 59918, 191505, -215969, 208682, -86321, -260549, -111352, -119147, -88810, -384391, 65510, -75592, -282008, 167092, -281479, -199260, -257074, 137901, 293045, -194989, 79671, -36608, -156198, -78170, 35056, -170628, 108947, -123285, -44319, -105488, -1213, -342199, 172530, -149850, -12444, -81493, 90259, -358116, -148059, 23926, -70724]
9892A8169N5462a30483k7794I6997P6002b15154m4617A92839b35781J05356n7363
9881a87788g5949J3799A61464F9153e7860k17279A14696b08907A87973b4392q5095
9870a09487j66114J11590I9041c33522A29199F2853g4933H8653K03558p7422h1162
9858i6146a3170N483A194c25298b9883A97873H7257b73559a6530G762g2981l14883
9846c87864C7758L1213D052J08848h5569E5870a6990k34433L2830P2624B1227
9834d3526q969p1558A12145K4916J36453a65854A48562b21220L4815A44107c03676
9822g5804j31143N3352B18491h228j2367C84440b37060C8742J49134q9764a19383
9810a11256r1563b1526I7289a25424j58187o3166P6432D57849a99083C00376I4978
$$ y = [18169, 73631, -130483, -158277, 96997, 172999, -215154, -259771, 192839, -235781, -130425, -187788, -75949, -62150, 161464, 69153, -57860, -275139, 114696, -208907, 187973, -24392, -109487, -275601, -164011, 99041, -333522, 129199, 62853, -74933, 88653, 292211, 214789, -81162, -96146, -13170, -7687, 1194, -325298, -29883, 197873, 87257, -273559, -16530, 7762, -72981, -387864, 37758, 68971, 4052, 112900, -85569, 55870, -16990, -251423, -218593, -145969, 21227, -43526, -52495, -124053, 112145, 137061, 273514, -165854, 148562, -221220, -186405, 144107, -303676, -75804, -206947, -153595, 218491, -8228, -20595, 384440, -237060, 38742, 187876, 98112, -119383, -111256, -202819, -21526, 97289, -125424, -283611, -346777, -270345, 457849, -199083, 300376, 94978]
9798F3638M7948k5679L10772a22851A57593c088r6797J7604A22523b4033j05114
9787a29147B07509d44008a18729c4660k00600C2825b40222c4276J085k80092N6274
9776b57009A6277h6507o9947P552F0219i6333j00410B14292l1735p146h7892q4729
9764a72621a8713A91612c97990J85128M0953A52628b5221k20466m680k22499m5488
9753e18354i0750F0786b21941H6486a43566A10844b1546k13325b6857r7225n9190
9742a83272C6287P9146n2129b84534E6612c29706C2562J73082a63709a2380A03486
9730E0799a61333P3409l8554B25299R0155b3940k11139C6787a04264M7408C20354
9718I225d16872A72916b1485C68727a8353j65929N1157M620e8619A66570a93526
$$ y = [63638, 111586, 85907, 396679, -122851, 157593, -3088, -99885, -82281, 122523, -24033, -129147, 207509, -444008, -118729, -34660, -235260, 32825, -240222, -34276, -33191, -313283, -257009, 16277, -86507, -156454, -148902, 60219, -96333, -196743, 214292, 182557, 175411, -87892, -172621, -18713, 191612, -397990, -212862, -171909, 152628, -25221, -245687, -250367, -472866, -518354, -90750, 60786, -221941, 86486, -143566, 110844, -21546, -234871, -26857, -124082, -183272, 36287, 115433, 63304, -284534, 56612, -329706, 32562, 205644, -163709, -12380, 103486, 50799, -161333, -87924, -126478, 225299, 315454, -23940, -235079, 36787, -104264, -56856, 320354, 9225, -416872, 172916, -21485, 368727, -18353, -184282, -133125, -128505, -58619, 166570, -193526]
9706a5837M601j64146f5398k4918r1887m1794A0577J40038b66631J20454C0328
9694g5226k2700l2247M7842N862a3410A91439B8987R2014N0257O8535a52185j29939
9682b82124h9143B04788a26166i34B39261c59945g1686k1232H2689I526J01321
9671A10847i7569r1242B52102a40837m3425j45643H916a40978j87721J27514L7888
9660a63297d6884k5555C6922e21821a10082k52821m3662A09193f1626K7337A79183
9648A93126C5497L8252b38463D0694b7745j2334A60242M4926c79808g0535B11722
9636I5855a58452p4392F3360c10938A95084d3367n7662m4868j5321A53753K589
9625A56342c50576J68876A13740k5986d7127j49136M8658c2287I0053a1965D2567
$$ y = [-15837, -11236, -175382, -65398, -90316, -182203, -223997, 10577, 150615, -266631, -146177, 30328, -75226, -97926, -130173, -82331, -76469, -13410, 191439, 28987, 121001, 171258, 239793, -152185, -282124, -89143, 204788, -126166, -934, 239261, -359945, -71686, -92918, 82689, 9526, 110847, -97569, -188811, 252102, -140837, -184262, -329905, 8916, -140978, -328699, -201185, -163297, -46884, -72439, 36922, -521821, -110082, -362903, -406565, 109193, -61626, -34289, 179183, 193126, 35497, 73749, -238463, 40694, -27745, -40079, 160242, 205168, -379808, -70535, 211722, 95855, -158452, -232844, 63360, -310938, 195084, -43367, -101029, -145897, -161218, 153753, 156342, -350576, -181700, 113740, 87754, -47127, -196263, -147605, -32287, 90053, -11965, 42567]
9613A58019D8988b31499K6311G0718B2846b05883q12A83696D930d8200A35921
9601c35239A22468e63932J33183a39214K0894D1722j3438a74993E0494a79984
9590g1367j3296k8074j65620C09060C7884b46921I7926b03650E2043P2837a82103
9578b19118g6096Q248A06783J00217h5377D9835P1018E4801b13588I6139b34692
9566a72308N3358r647j36700J07036l2501G1206J789d5886B29125E1860L5543
9555H7403O6924d10064J51639A19391a05427A48142C7395b57418i8415a9221j8906
9544c8127k44610c1691B26743b75194E2323a92417B14010i3694m8496A73596F9971
9532F3362a42207j01595Q807A44810a48017f067A52546a14940e6255C1450K25063
$$ y = [158019, 48988, -231499, -205188, 70718, 22846, -205883, -206695, 183696, 4930, -48200, 135921, -335239, 122468, -563932, -430749, -139214, -118320, 41722, 28284, -174993, 50494, -179984, -71367, -84663, -112737, -278357, 309060, 37884, -246921, 97926, -203650, 52043, 124880, -182103, -219118, -76096, -67848, 106783, 207000, -85377, 49835, 120853, 54801, -213588, 96139, -234692, -172308, -118950, -128597, -265297, -158261, -190762, 71206, 72995, -45886, 229125, 51860, 87403, 154327, -410064, -258425, 119391, -105427, 148142, 37395, -257418, -98415, -19221, -38127, -282737, -31691, 226743, -275194, 52323, -192417, 214010, -93694, -142190, 173596, 69971, 63362, -142207, -243802, -234995, 144810, -148017, -6067, 152546, -114940, -56255, 31450, 256513]
9521B56513c4967B05857c34568i4634B57981e7355j09663E0595a48186k04458
9511c52644A4041J27444d07823A04751a85710d1948p9133a9778j10020e5560C32436
9499b01213g12j43711A97801a79200O4062I1364h8327j05145N3792A528L99372
9488D00900a77328g6161I3878a46540A30595b89448G181c78464a83777B620a94229
9476A35727Q225a12610q5222b6070p8102l23526K10266E8403L5688b4967j51790
9465a76757d9899j00334O2023F5056c7293k41288a30588r0538g695m6744o3090
9454a17529C3497a92862E373a46679a1852k79984c4153k1261j3954p4478m3272
9443a87118c0469k11776j905a01747e827D4031N7833N6525F6454h0573R276H1639
$$ y = [256513, -34967, 205857, -334568, -94634, 257981, -57355, -167018, 50595, -148186, -352644, 14041, 141485, -407823, 104751, -185710, -41948, -121081, -19778, -129798, -55560, 332436, -201213, -712, -144423, 197801, -179200, -115138, 91364, -88327, -193472, -139680, 1528, 400900, -177328, -76161, 93878, -146540, 130595, -289448, 7181, -378464, -183777, 2620, -194229, 135727, 143952, -112610, -197832, -26070, -104172, -427698, -217432, 58403, 94091, -24967, -176757, -49899, -150233, -88210, 65056, -37293, -278581, -130588, -221126, -7695, -54439, -117529, 33497, -192862, 5373, -146679, -11852, -291836, -34153, -55414, -69368, -143846, -187118, -30469, -242245, -244150, -101747, -5827, 44031, 101864, 158389, 66454, -80573, -71297, 81639]
9430g3540n456c7074p4462B70714a15497F8529b05983g2676p6315E192L63559
9419C68751a73188A49668a78540e9982B49338C5894a57510o8709n9298c7571j52207
9408a89778B40192j19256a99152q9629C30426a77330B36543i6475o671k0437n5464
9397a79047a1220B0526M8954a30641M2518B69759p4017F7981B3339J90715k9429
9386A84625C1374J62425E3094L3909a3560j66405m6656E0903a28555N7558j48004
9375b19001C0780b8166k00728D2843a87533J0711G3552e3703A7455a95898K7266
9364a68632f438B0581J74986a83852N9923A54997a90312G2694K00305i7127b7427
9352i9155A72179b98100L9098B04856J15830e6007I6248e7701k2456A51979a82152
$$ y = [-73540, -78996, -37074, -111536, 270714, -115497, 68529, -205983, -72676, -148991, 5192, 368751, -173188, 149668, -178540, -59982, 249338, 35894, -157510, -226219, -285517, -37571, -189778, 240192, 120936, -199152, -288781, 330426, -177330, 236543, -96475, -103146, -123583, -179047, -11220, 20526, 69480, -130641, -88123, 269759, 195742, 67981, 23339, 214054, 184625, 31374, 193799, 53094, 87003, -13560, -179965, -226621, 50903, -128555, -70997, -219001, 30780, -28166, -228894, 42843, -187533, -176822, 73552, -53703, 17455, -195898, -168632, -6438, 20581, 195567, -183852, -123929, 154997, -190312, 72694, 272999, -97127, -27427, -99155, 172179, -298100, -259002, 204856, 320686, -56007, 96248, -57701, -80157, 151979, -182152]
9340a88310m0150B46275a00575n7690B27187o5280i2104j14452f6237k77989J39179
9329b05047g418m52779a6474m3827l89066G9424b10581H4860b79575A07994b3895
9317b01051j24746a01914b5305l2821j09378j77066A2076J8373a13715K5232k25059
9306c13542e2225C6766a24927k364G5400K38591A9048a15379A4305e211I4333
9294B24757e8978A18102d1218p4542B2844e2103B54817a3169j18889E7074a11902
9282A08898J30729a09018q1424E8953L6392C5789K25467C1703k689d27516d4713
9270A03673c7077j00073O2507j67138A49794n3232J08053b93580L4173j0818E0287
9258b04221E9085c10799A92490a76210A24840J21273C0636L36961D986a49289
$$ y = [-188310, -228460, 246275, -100575, -158265, 227187, 161907, -92104, -206556, -66237, -344226, -205047, -7418, -460197, -16474, -60301, -449367, 79424, -210581, 84860, -279575, 107994, -23895, -201051, -325797, -101914, -25305, -58126, -167504, -344570, 12076, 30449, -113715, -88483, -313542, -52225, 36766, -124927, -127291, 75400, 313991, 19048, -115379, 14305, -5211, 94333, 224757, -58978, 118102, -41218, -115760, 22844, -52103, 254817, -13169, -132058, 57074, -111902, 108898, 239627, -109018, -190442, 58953, 95345, 35789, 261256, 31703, 29014, -427516, -44713, 103673, -37077, -137150, -74643, -241781, 149794, 96562, 204615, -293580, -259407, -270225, 50287, -204221, 59085, -310799, 192490, -176210, 124840, 246113, 30636, 367597, 4986, -149289]
9247g8107C2128b90488i342I8981a94466k0408A5200a39327D301b23532H8049
9235b29722Q4536B92887b9555A73986a58439G177c46243a43329M7783D5951J12619
9224A58570a63158d0225q0923j13319D0264b96741C9694a2996k47449d2900A79510
9212A47115C9588a05260c8795n5548A27132m2370J67606a60474N8806a6994G4072
9200a46408M0129E5299f4159k76346i2304j4063A28737L6131b5109k49614a13179
9188A8581f3625G7519M782a45472A60681G6538b24836J02393d6046A14026a45099
9176B76959i8888P855A91741a90971r1122B62910a13105B12574a57139o9859A49403
9164B36922b09922b0498A58716A12b93896j5369N8046J6000c9074j11635A96376
$$ y = [-78107, 32128, -290488, -9342, 98981, -194466, -214874, 15200, -139327, 4301, -223532, 88049, -229722, -145186, 292887, -29555, 173986, -158439, 7177, -346243, -143329, -95546, 45951, 158570, -163158, -40225, -121148, -234467, 40264, -296741, 39694, -12996, -260445, -42900, 179510, 147115, 39588, -105260, -38795, -94343, 127132, 84762, 252368, -160474, -101668, -16994, 74072, -146408, -106279, 55299, -64159, -340505, -92304, -106367, 128737, 164868, -25109, -274723, -113179, 18581, -63625, 77519, 82301, -145472, 160681, 76538, -224836, -122443, -46046, 114026, -145099, 276959, -98888, -91033, 191741, -190971, -282093, 262910, -113105, 212574, -157139, -226998, 149403, 236922, -209922, -20498, 158716, 112, -293896, -309265, -251219, -235219, -39074, -150709, 196376]
9152i7773B35794a14510a5469j29859d9203C20310A06818C4729K7256f3943F9885
9140C61985h7329j91025C8325b876l92696A39970a76717H4108a07169k78277M3999
9129c41447a52458d9698E4157e7768j52023A09950c0163r8692m0532G7537C5362
9117b26592K2883d1756F208b4055H4274J1567k3231i6811r6514a4373A03490C8798
9104a50718E6398P823J15002C4821g7107D02250a19280M9254D2197a73924O9824
9093a04100m4060L3728j7678q5063A19800e1393o4521r8690D601a62754j8239
9082a80993k6150H3616J00872g4909P429j53147A70607b72688h17j43533D4402
9070A75623G2180c1685j32754g4795D0808C642O8863g6143A55223b1210j157j15695
$$ y = [-97773, 235794, -114510, -15469, -145328, -49203, 320310, 106818, 34729, 61985, -63943, 69885, 361985, -87329, -278354, 38325, -2876, -395572, 139970, -176717, 84108, -107169, -385446, -341447, -152458, -49698, 54157, -57768, -209791, 109950, -30163, -128855, -169387, 77537, 35362, -226592, -203709, -41756, 6208, -24055, 84274, 95841, 72610, -96811, -193325, -14373, 103490, 38798, -150718, 56398, 64221, 179223, 34821, -77107, 402250, -119280, -70026, 42197, -173924, -104100, -148160, -114432, -132110, -217173, 119800, -51393, -115914, -214604, 4601, -162754, -180993, -207143, 83616, 184488, -74909, -67480, -220627, 170607, -272688, -817, -144350, 44402, 175623, 72180, -31685, -164439, -74795, 40808, 3642, 72505, -76143, 155223, -21210, -22367, -138062]
9058a38062j17317C8881g4526a0679r8914o4591J7606c1490A3170P2109e1185
9046c8156p011j69434j65986A39934F079c10482a25941C2675i8227k063G9941
9034c4899A93432F3314B6543J07606O5945E2203J40108a35036C5531b49576b1164
9022G3928R0786A070c86962g0832K0323A39835L9567a51167l4309D992b89358
9010i1202B253J21662h2357p9487A4477a0661k93545M496B62070i0843m1081C19159
8997b11804L9742D5364c38958J10651N8694r8631e0097j2589A80568f8247M39
8986f7808p407a2690m45562a77785G5825a29018B7759a02833n5615h112j60141
8975a68253m0499D0712a64003A86312J27677j04184c52313p393A09131m5098g9481
$$ y = [-138062, -255379, 38881, -74526, -10679, -109593, -174184, -156578, -31490, 13170, 85279, -51185, -38156, -45167, -214601, -380587, 139934, 6079, -310482, -125941, 32675, -98227, -100290, 79941, -34899, 193432, 63314, 26543, 134149, 200094, 52203, 192311, -135036, 35531, -249576, -21164, 73928, 164714, 1070, -386962, -70832, -50509, 139835, 179402, -151167, -185476, 4992, -289358, -91202, 2253, 123915, -82357, -161844, 14477, -10661, -304206, -299710, 262070, -90843, -131924, 319159, -211804, -172062, 45364, -338958, -228307, -169613, -268244, -50097, -62686, 180568, -68247, -67808, -75215, -12690, -458252, -177785, 75825, -129018, 27759, -102833, -158448, -8112, -168253, -208752, 40712, -164003, 186312, 313989, 209805, -352313, -359706, 109131, 64033, -79481]
8963c853j98131e8468M625q3297B4358a4666j83430A89019b29742M0107d3262
8951c94599a387A13703g890H5535e5126k03005o0273R831r1064i2915j32207A89298
8938a21440B4176b80716C07171b80505I6832b91258H4233B1666a48145A35949
8927E1382g5100b5017A32676c0676A26658J82754O64007A81833i2028o1061B2619
8915c17789J25875l9650A35601b68834A76062E9667J2696A0421c7260A41805i7663
8903b60967A48630m9287b33224L0458B56340I5531J75015j12384l6861M7661f0306
8891g8576L3378j47685b7606A61995g5040j42229c288A0615b32713R3907k36998
8880c75804a61354j39149a42544j52051I3602f9975E7947P7285a90663r667A03117
$$ y = [-3853, -201984, -58468, -53843, -137140, 24358, -14666, -198096, 189019, -229742, -189635, -43262, -394599, -1387, 113703, -7890, 85535, -55126, -258131, -318404, -308573, -399637, -92915, -225122, 189298, -121440, 24176, -280716, 307171, -280505, 96832, -291258, 84233, 21666, -148145, 135949, 51382, -75100, -25017, 132676, -30676, 126658, 309412, 973419, 181833, -92028, -153089, 22619, -317789, -191914, -231564, 135601, -268834, 176062, 59667, 72363, 10421, -37260, 141805, -97663, -260967, 148630, 99343, -233224, -202766, 256340, 95531, 270546, 158162, 121301, 168962, -60306, -78576, -45198, -192883, -27606, 161995, -75040, -217269, -3288, 10615, -232713, -138806, -375804, -161354, -300503, -142544, -294595, 93602, -69975, 57947, 135232, -190663, -200330, 103117]
8868b32878F6083J44439a03480B7715b38237J14152b5418B32643q5780a78301
8857f6232j77126F6933b02905c4896o8268A40815f9329j16655E7708a18739j9632
8846a38371j1109B57148b295j70893p2394A56148a84742H0841B9740h1852m8607
8835a30459B08989a09507b5203B26339a70304P6910k8711B26732g5963k47254
$$ y = [-232878, 66083, 210522, -103480, 27715, -238237, -124085, -25418, 232643, 146863, -178301, -66232, -243358, 66933, -202905, -34896, -103164, 140815, -69329, -185984, 57708, -118739, -138371, -149480, 257148, -2295, -173188, -245582, 156148, -184742, 80841, 29740, -81852, -130459, 208989, -109507, -25203, 226339, -170304, -93394, -122105, 226732, -75963, -323217]
$$ [...]
##END NTUPLES=NMR SPECTRUM
##END=
