##TITLE=AC1739_SEN00012_9276231_ytOQJRrE6d
##JCAMPDX= 6.0         $$ Bruker NMR JCAMP-DX V2.0
##DATA TYPE= NMR SPECTRUM
##DATA CLASS= NTUPLES
##ORIGIN= BRUKER
##OWNER= Administrator
$$ 1.72 TOPSPIN		Version 2.1
$$ 2015-07-15 00:03:41.479 -0700  Administrator@X
$$ Compression mode = diff/dup
##.OBSERVE FREQUENCY= 400.02188249412
##.OBSERVE NUCLEUS= ^1H
##.ACQUISITION MODE= SIMULTANEOUS (DQD)
##.ACQUISITION SCHEME= undefined
##.AVERAGES= 64
##.DIGITISER RES= 22
##SPECTROMETER/DATA SYSTEM= spect
##.PULSE SEQUENCE= noesygpps1d.comp
##.SOLVENT NAME= COFFEE_meoh
##.SHIFT REFERENCE= INTERNAL, COFFEE_meoh, 1, 14.96088
##AUDIT TRAIL= $$ (NUMBER, WHEN, WHO, WHERE, PROCESS, VERSION, WHAT)
$$ ##TITLE= Audit trail, TOPSPIN		Version 2.1
$$ ##JCAMPDX= 5.01
$$ ##ORIGIN= Bruker BioSpin GmbH
$$ ##OWNER= Administrator
$$ $$ E:\/data/COFFEE/nmr/AC1739_SEN00012_9276231_ytOQJRrE6d/12/pdata/1/auditp.txt
$$ ##AUDIT TRAIL=  $$ (NUMBER, WHEN, WHO, WHERE, PROCESS, VERSION, WHAT)
(   1,<2015-07-15 00:03:36.354 -0700>,<Administrator>,<X>,<go>,<TOPSPIN 2.1>,
      <created by zg
	started at 2015-07-14 23:52:06.807 -0700,
	POWCHK enabled, PULCHK disabled,
       configuration hash MD5:
       21 0F 79 D6 B3 7B B4 F6 88 20 88 DB 03 48 BD 9F
       data hash MD5: 64K
       AE 0E 44 B8 9F 7B 9C C1 F7 5A B5 10 4F B2 DA 5F>)
(   2,<2015-07-15 00:03:39.494 -0700>,<Administrator>,<X>,<proc1d>,<TOPSPIN 2.1>,
      <Start of raw data processing
       efp LB = 0.3 FT_mod = 6 PKNL = 1 PHC0 = 0 PHC1 = 0 SI = 128K 
       data hash MD5: 128K
       8A EC 31 CC C9 00 67 6A EA 41 C3 E5 0A B7 10 FD>)
(   3,<2015-07-15 00:03:40.510 -0700>,<Administrator>,<X>,<proc1d>,<TOPSPIN 2.1>,
      <pk PHC0 = -89.71436 PHC1 = 0 
       data hash MD5: 128K
       33 15 96 3F 61 CB 16 90 7C 79 B4 1F 0B D4 04 EE>)
(   4,<2015-07-15 00:03:40.916 -0700>,<Administrator>,<X>,<proc1d>,<TOPSPIN 2.1>,
      <abs ABSG = 1 
       data hash MD5: 128K
       76 2B FE 48 EC 85 DE AE A7 8C 0E 8A A8 EF 67 98>)
(   5,<2015-07-15 00:03:41.025 -0700>,<Administrator>,<X>,<proc1d>,<TOPSPIN 2.1>,
      <abs ABSG = 2 
       data hash MD5: 128K
       E1 2E 50 7F 18 01 A9 9E 68 F3 06 AA E2 D0 82 EF>)
(   6,<2015-07-15 00:03:41.104 -0700>,<Administrator>,<X>,<proc1d>,<TOPSPIN 2.1>,
      <abs ABSG = 3 
       data hash MD5: 128K
       C2 62 83 7F DC 06 2D 2A 47 3A 10 CA 2D 5F 52 DE>)
(   7,<2015-07-15 00:03:41.166 -0700>,<Administrator>,<X>,<proc1d>,<TOPSPIN 2.1>,
      <abs ABSG = 4 
       data hash MD5: 128K
       FE 9B 21 3F 0D 1A DA 26 49 6C BA DD CD F2 57 AE>)
(   8,<2015-07-15 00:03:41.260 -0700>,<Administrator>,<X>,<proc1d>,<TOPSPIN 2.1>,
      <abs ABSG = 5 
       data hash MD5: 128K
       97 64 8C C5 2A 3B 8C 78 A6 49 02 03 B0 A5 22 80>)
$$ ##END=
$$ 
$$ $$ hash MD5
$$ $$ FD CE E5 DC 13 99 A5 03 82 D4 23 A7 37 70 65 4E
##$RELAX= 
##$RELAX= 
##$RELAX= 
##$RELAX= 
##$RELAX= 
##$RELAX= 
##$RELAX= 
##$RELAX= 
$$ Bruker specific parameters
$$ --------------------------
##$DU= <E:\>
##$EXPNO= 12
$$ [...]
##$TP07= 0
##$TPNAME0= <>
##$TPNAME1= <>
##$TPNAME2= <>
##$TPNAME3= <>
##$TPNAME4= <>
##$TPNAME5= <>
##$TPNAME6= <>
##$TPNAME7= <>
##$TPOAL= (0..7)
0.5 0.5 0.5 0.5 0.5 0.5 0.5 0.5
##$TPOFFS= (0..7)
0 0 0 0 0 0 0 0
##$TUNHIN= 0
##$TUNHOUT= 0
##$TUNXOUT= 0
##$USERA1= <user>
##$USERA2= <user>
##$USERA3= <user>
##$USERA4= <user>
##$USERA5= <user>
##$V9= 5
##$VALIST= <valist>
##$VCLIST= <CCCCCCCCCCCCCCC>
##$VD= 0
##$VDLIST= <DDDDDDDDDDDDDDD>
##$VPLIST= <PPPPPPPPPPPPPPP>
##$VTLIST= <TTTTTTTTTTTTTTT>
##$WBST= 2048
##$WBSW= 25
##$XGAIN= (0..3)
0 0 0 0
##$XL= 0
##$YL= 0
##$YMAX_a= 6206830
##$YMIN_a= -11528246
##$ZGOPTNS= <>
##$ZL1= 120
##$ZL2= 120
##$ZL3= 120
##$ZL4= 120
##$ABSF1= 14.96088
##$ABSF2= -5.597301
##$ABSG= 5
##$ABSL= 3
##$ALPHA= 0
##$AQORDER= 0
##$ASSFAC= 0
##$ASSFACI= 0
##$ASSFACX= 0
##$ASSWID= 0
##$AUNMP= <proc_prof1d_extract.lims>
##$AXLEFT= 0
##$AXNAME= <>
##$AXNUC= <1H>
##$AXRIGHT= 0
##$AXTYPE= 0
##$AXUNIT= <>
##$AZFE= 0.1
##$AZFW= 0.1
##$BCFW= 0
##$BC_mod= 0
##$BYTORDP= 0
##$COROFFS= 0
##$CY= 15
##$DATMOD= 1
##$DC= 0
##$DFILT= <>
##$DTYPP= 0
##$F1P= 0
##$F2P= 0
##$FCOR= 0.5
##$FTSIZE= 131072
##$FT_mod= 6
##$GAMMA= 0
##$GB= 0
##$INTBC= 1
##$INTSCL= 1
##$ISEN= 128
##$LB= 0.3
##$LEV0= 0
##$LPBIN= 0
##$MAXI= 10000
##$MC2= 0
##$MEAN= 0
##$ME_mod= 0
##$MI= 0
##$NCOEF= 0
##$NC_proc= -2
##$NLEV= 6
##$NOISF1= 0
##$NOISF2= 0
##$NSP= 0
##$NTH_PI= 0
##$NZP= 0
##$OFFSET= 14.96088
##$PC= 1
##$PHC0= -89.71436
##$PHC1= 0
##$PH_mod= 1
##$PKNL= yes
##$PPARMOD= 0
##$PPDIAG= 0
##$PPIPTYP= 0
##$PPMPNUM= 2147483647
##$PPRESOL= 1
##$PSCAL= 4
##$PSIGN= 0
##$PYNMP= <proc.py>
##$REVERSE= no
##$SF= 400.02000968379
##$SI= 131072
##$SIGF1= 0
##$SIGF2= 0
##$SINO= 400
##$SIOLD= 131072
##$SPECTYP= <>
##$SREGLST= <1H.CDCl3>
##$SSB= 0
##$STSI= 131072
##$STSR= 0
##$SW_p= 8223.68421052631
##$SYMM= 0
##$S_DEV= 0
##$TDeff= 65536
##$TDoff= 0
##$TI= <>
##$TILT= no
##$TM1= 0
##$TM2= 0
##$TOPLEV= 0
##$USERP1= <user>
##$USERP2= <user>
##$USERP3= <user>
##$USERP4= <user>
##$USERP5= <user>
##$WDW= 1
##$XDIM= 131072
##$YMAX_p= 412028871
##$YMIN_p= -12305
##$CURPLOT= <Network HP LaserJet P1505>
##$CURPRIN= <$Network HP LaserJet P1505>
##$DFORMAT= <normdp>
##$LAYOUT= <+/1D_H.xwp>
##$LFORMAT= <normlp>
##$PFORMAT= <normpl>
##$SURQMSG= 1
$$ End of Bruker specific parameters
$$ ---------------------------------
##NTUPLES= NMR SPECTRUM
##VAR_NAME=  FREQUENCY,     SPECTRUM/REAL,   SPECTRUM/IMAG
##SYMBOL=    X,             R,               I
##VAR_TYPE=  INDEPENDENT,   DEPENDENT,       DEPENDENT
##VAR_FORM=  AFFN,          ASDF,            ASDF
##VAR_DIM=   131072,        131072,          131072
##UNITS=     HZ,            ARBITRARY UNITS, ARBITRARY UNITS
##FACTOR=    0.0627417313425164, 1,          1
##FIRST=     8223.62146879497, 1218,         -56193
##LAST=      0,             3773,            -56212
##MIN=       0,             -12305,          0
##MAX=       8223.62146879497, 412028871,    0
$$ Real data points
##PAGE= N=1
##DATA TABLE= (X++(R..R)), XYDATA
$$ [...]
63943B067323K06281K25909K43835K58975K71013K80151K86369K88827K86025
$$ 2067323 2273604 2499513 2743348 3002323 3273336 3553487 3839856 4128683 4414708
63934D414708K76507K59695K36037K06486J71922J33167R1333M7776L667m0322
$$ 4414708 4691215 4950910 5186947 5393433 5565355 5698522 5789855 5837631 5841298 5800976
63924E800976q3750j25891j65503k01049k31125k54818k71767k82025k85913k84039
$$ 5800976 5717226 5591335 5425832 5224783 4993658 4738840 4467073 4185048 3899135 3615096
63914C615096k77315k66802k53406k37690k20022k00880j81001j61250j42384
$$ 3615096 3337781 3070979 2817573 2579883 2359861 2158981 1977980 1816730 1674346
63905A674346j24966j09323r5457q3086p1988o2286n4219m7663m2132l7342l3399
$$ 1674346 1549380 1440057 1344600 1261514 1189526 1127240 1073021 1025358 983226 945884 912485
63894I12485l0315k7750k5469k3777k3067k3153k3442k3592k3550k3044k1675
$$ 912485 882170 854420 828951 805174 782107 758954 735512 711920 688370 665326 643651
63883F43651j9551j7322j5387j3524j1439r253p218n294l335j352O24K628M485
$$ 643651 624100 606778 591391 577867 566428 557175 549957 544663 541328 539976 540600 543228 547713
63870E47713N840O763P882R544J1153J1884J1826J1807J2235J2728J2818J2454
$$ 547713 553553 560316 568198 577742 588895 600779 612605 624412 636647 649375 662193 674647
63858F74647J1663J0297Q446O654N375M396L064R57j762m530o712p990q627r298
$$ 674647 686310 696607 705053 711707 717082 721478 724542 725499 723737 719207 712495 704505 695878 686580
63844F86580j0499j2233j4208j6120j7663j8602j9084j9588k0289k0701k0293
$$ 686580 676081 663848 649640 633520 615857 597255 578171 558583 538294 517593 497300
63833D97300j9305j8436j7821j6879j5315j3718j2833j2546j2112j1131r938r051
$$ 497300 477995 459559 441738 424859 409544 395826 382993 370447 358335 347204 337266 328215
63821C28215q660q604q525p967o735n240m221l906l742l189k412j965j943j926
$$ 328215 319555 310951 302426 294459 287724 282484 278263 274357 270615 267426 265014 263049 261106 259180
63807B59180j648j238q09k13N25Q68K88r61j932j999j564j524k122k665k484j861
$$ 259180 257532 256294 255485 255272 255797 256665 256953 255992 254060 252061 250497 248973 246851 244186 241702 239841
63791B39841j643k041k367k060j506j401j668j568q22r7j40q50j439j348p53k71
$$ 239841 238198 236157 233790 231730 230224 228823 227155 225587 224765 224668 224528 223678 222239 220891 220138 219867
63775B19867l48q82j402j522j251q56n43l75l24k58M1N77J019J053P61L37l25
$$ 219867 219519 218637 217235 215713 214462 213606 213063 212688 212364 212106 212147 212724 213743 214796 215557 215894 215569
63758B15569j290j984j621l67N72L44m90p54j35O70J022J035J181J614K001J908
$$ 215569 214279 212295 210674 210307 210879 211223 210733 209979 209844 210514 211536 212571 213752 215366 217367 219275
63742B19275J338Q96J196K063K631K408J897J830K162K290K026J806J929K173
$$ 219275 220613 221509 222705 224768 227399 229807 231704 233534 235696 237986 240012 241818 243747 245920
63728B45920K186J970J787J927K526L464M355M913N210N390N273M618L634K787
$$ 245920 248106 250076 251863 253790 256316 259780 264135 269048 274258 279648 284921 289539 293173 295960
63714B95960K121J264J35q67j510k084k837l491l620l208k551j857j201o25o7
$$ 295960 298081 299345 299480 298613 297103 295019 292182 288691 285071 281863 279312 277455 276254 275629 275562
63699B75562N35R13O18k45p62j59J277K646L492L952M080L735L058K461J973J226
$$ 275562 276097 277010 277628 277383 276621 276462 277739 280385 283877 287829 291909 295644 298702 301163 303136 304362
63683C04362K12m49l33J82N21O69R23J194J121P60N45O52Q21R01J060J312J273
$$ 304362 304574 304125 303792 303974 304495 305164 306087 307281 308402 309162 309707 310359 311180 312081 313141 314453 315726
63666C15726O50k77r98j358j565j817k195k771l511m123m259l921l462l240l346
$$ 315726 316376 316099 315101 313743 312178 310361 308166 305395 301884 297761 293502 289581 286119 282879 279533
63651B79533l619l753l484k867k231j700r66J45J095J192O13L41R31J931K676
$$ 279533 275914 272161 268677 265810 263579 261879 260913 261058 262153 263345 263958 264299 265230 267161 269837
63636B69837L064L220L001K473K347L209M554N334N377N489O118O726O812O825
$$ 269837 272901 276121 279122 281595 283942 287151 291705 297039 302416 307905 314023 320749 327561 334386
63622C34386P531Q920J0302J1234J1876J2543J3462J4862J6880J9242K1378K2987
$$ 334386 341917 350837 361139 372373 384249 396792 410254 425116 441996 461238 482616 505603
63610E05603K4336K5859K7618K9214L0116L0010K8915K6985K4198K0296J5120
$$ 505603 529939 555798 583416 612630 642746 672756 701671 728656 752854 773150 788270
63599G88270R022K810k633o626q831r427r158q899r032r423j0054j1294j3402
$$ 788270 797292 800102 797469 790843 782012 772585 763427 754528 745496 736073 726019 714725 701323
63586G01323j6030j8555k0648k2275k3261k3353k2624k1394j9694j7288j4356
$$ 701323 685293 666738 646090 623815 600554 577201 554577 533183 513489 496201 481845
63575D81845j1631r556p751n756l875k701j988p48J400L598M733M706M479N119
$$ 481845 470214 460658 452907 447151 443276 440575 438587 437839 439239 442837 447570 452276 456755 461874
63561D61874O895R064J0408J0238R124Q425R022J0759J3080J5743J8669K1589
$$ 461874 468769 477833 488241 498479 507603 516028 525050 535809 548889 564632 583301 604890
63549F04890K4293K6901K9618L2401L5145L7629L8890L7172L1380K2432J2546
$$ 604890 629183 656084 685702 718103 753248 790877 829767 866939 898319 920751 933297
63538I33297L336m680j0934j4418j4861j3451j1736j0287q983q116q404j0130
$$ 933297 936633 931953 921019 906601 891740 878289 866553 856266 847283 839167 830763 820633
63526H20633j2938j6483k0676k5152k9010l1428l2396l2511l2193l1247k9225
$$ 820633 807695 791212 770536 745384 716374 684946 652550 620039 587846 556599 527374
63515E27374k6062k2324j8842j6125j4106j2392j0714r155p949p158o609o200
$$ 527374 501312 478988 460146 444021 429915 417523 406809 397654 389705 382547 375938 369738
63503C69738o076o262o242n312l496j742r40r87j140r53n07pL52K68l23q64p53
$$ 369738 363662 357400 351158 345846 342350 340608 339668 338681 337541 336588 336081 336074 336426 336694 336371 335507 334754
63486C34754k20l8k80j38Q82K228L168L672M041M256M209M139M186L933K931J428
$$ 334754 334534 334496 334216 334078 334960 337188 340356 344028 348069 352325 356534 360673 364859 368792 371723 373151
63470C73151rj279k587l733m285m333m414m675m744m452m047l636l006k160j459
$$ 373151 373142 371863 369276 365543 361258 356925 352511 347836 343092 338640 334593 330957 327951 325791 324332
63455C24332r42j22J254K603L187L054K986L591M761N957O770P277P957R196J0777
$$ 324332 323390 323268 324522 327125 330312 333366 336352 339943 344704 350661 357431 364708 372665 381861 392638
63440C92638J2007J2416J2243J2218J2990J4804J7474K0447K2956K4214K3613
$$ 392638 404645 417061 429304 441522 454512 469316 486790 507237 530193 554407 578020
63429E78020K0971J6912J2794R950Q833R049J0077J1672J3725J6229J9458K3591
$$ 578020 598991 615903 628697 638647 647480 656529 666606 678278 692003 708232 727690 751281
63417G51281K8111L1990L4681L6320L6809L5331L1298K5242J8185J0589K653m709
$$ 751281 779392 811382 846063 882383 919192 954523 985821 1011063 1029248 1039837 1042490 1037781
63405A037781j0142j3119j4298j4447j3783j2587j1830j2583j5087j8748k2825
$$ 1037781 1027639 1014520 1000222 985775 971992 959405 947575 934992 919905 901157 878332
63394H78332k6809l0309l2955l4430l4490l3062l0498k7630k5275k3620k2131
$$ 878332 851523 821214 788259 753829 719339 686277 655779 628149 602874 579254 557123
63383E57123k0125j7416j4457j1800r455o922l989j233O27J730K981M879O988
$$ 557123 536998 519582 505125 493325 483870 476948 472959 471726 472353 474083 477064 481943 488931
63370D88931Q738J0215J1723J3041J3731J4038J4824J6536J8712K0654K2230K3832
$$ 488931 497669 507884 519607 532648 546379 560417 575241 591777 610489 631143 653373 677205
63358F77205K5829K8219L0699L2916L4741L6130L6538L4740K9789K2270J4108
$$ 677205 703034 731253 761952 794868 829609 865739 902277 937017 966806 989076 1003184
63347A003184O849N53n305j0381j3591j4559j4167j3555j3114j2808j3051j4633
$$ 1003184 1010033 1010586 1005281 994900 981309 966750 952583 939028 925914 913106 900055 885422
63335H85422j7730k1484k4791k7287k9255l0726l1118k9979k7707k5116k2453
$$ 885422 867692 846208 821417 794130 764875 734149 703031 673052 645345 620229 597776
63324E97776j9308j5553j1811q703o046l342q75J42j315n058r790j3959j6514
$$ 597776 578468 562915 551104 542401 536355 533013 532138 532280 530965 525907 516117 502158 485644
63311D85644j7177j6299j4515j2469j0720r593q905q005o474m697l433k814k186
$$ 485644 468467 452168 437653 425184 414464 404871 395966 387961 381487 376790 373357 370543 368357
63298C68357j058K17R01P47M1q95j897k731l172l342l668m288m772m647m038l488
$$ 368357 367299 367516 368417 369164 369205 368310 366413 363682 360510 357168 353500 349212 344440 339793 335755 332267
63282C32267l202k815k072j374j281j662j773j266o00k61m5M23Q74P38K09J92
$$ 332267 329065 326250 324178 322804 321523 319861 318088 316822 316222 315961 315916 316339 317213 317951 318160 318352
63266C18352J052K030K296K058K111K637L010K815K466K677L610M741N446N490
$$ 318352 319404 321434 323730 325788 327899 330536 333546 336361 338827 341504 345114 349855 355301 360791
63252C60791N078M600M455M959O147P621Q768R322R619J0145J1025J2145J3583
$$ 360791 365869 370469 374924 379883 386030 393651 402419 411741 421360 431505 442530 454675 468258
63239D68258J5427J7320J8690J9535K0500K1990K3692K5174K6511K7917K9203
$$ 468258 483685 501005 519695 539230 559730 581720 605412 630586 657097 685014 714217
63228G14217K9984L0202K9992K9305K8089K6709K5725K5266K5016K4767K4675
$$ 714217 744201 774403 804395 833700 861789 888498 914223 939489 964505 989272 1013947
63217A013947K4945K5525K6123K6261K5422K3358K0166J5956J0620M178k896r981
$$ 1013947 1038892 1064417 1090540 1116801 1142223 1165581 1185747 1201703 1212323 1216501 1213605 1203624
63205A203624j6722k2865k8017l2024l5223l7770l9003l8222l5817l2848k9623
$$ 1203624 1186902 1164037 1136020 1103996 1068773 1031003 992000 953778 917961 885113 855490
63194H55490k5657k1131j7195j4419j1884q590m934j996J40K401N266Q264J0811
$$ 855490 829833 808702 791507 777088 765204 756614 751680 749684 749824 752225 757491 765755 776566
63181G76566J2875J4607J5955J6835J7312J7456J7349J7225J7280J7280J6767
$$ 776566 789441 804048 820003 836838 854150 871606 888955 906180 923460 940740 957507
63170I57507J5702J4499J3302J1687R360O675M093J367k206o788j1734j6377k0668
$$ 957507 973209 987708 1001010 1012697 1022057 1028732 1032825 1034192 1031986 1025198 1013464 997087 976419
63157I76419k4775k8374l0782l1729l1600l0851k9583k7862k6079k4595k3198
$$ 976419 951644 923270 892488 860759 829159 798308 768725 740863 714784 690189 666991
63146F66991k1401j9227j7225j5663j4111j2089r766p723o283n351m720m184l534
$$ 666991 645590 626363 609138 593475 579364 567275 557509 549786 543503 538152 533432 529248 525714
63133E25714k691j812j007j00J075K268L065L577M392N754P115P703P377O660
$$ 525714 523023 521211 520204 520104 521179 523447 526512 530089 534481 540235 547350 555053 562430 569090
63119E69090O155O077O230O159N371L770J913O92N23R85J355J362J225J061O52
$$ 569090 575245 581322 587552 593711 599082 602852 604765 605457 605980 606965 608320 609682 610907 611968 612620
63104F12620j27r41j312j095m88K68Q59Q44P2q69j119n95j07k51o27n32k2K37
$$ 612620 612493 611552 610240 609145 608657 608925 609784 610628 610700 609831 608712 608117 608010 607759 607132 606600 606578 606815
63086F06815N2K8P01J786K541K728K842L438M444N379O006O579P299P925Q181
$$ 606815 606867 606895 607596 609382 611923 614651 617493 620931 625375 630754 636760 643339 650638 658563 666744
63071F66744Q344R015J0351J1907J3274J4440J5455J6267J7076J8432K0634K3354
$$ 666744 675088 684103 694454 706361 719635 734075 749530 765797 782873 801305 821939 845293
63059H45293K6185K9182L2546L6085L9480M2811M6318M9879N3191N6289N9394
$$ 845293 871478 900660 933206 969291 1008771 1051582 1097900 1147779 1200970 1257259 1316653
63048A316653O2328O4677O6390O7719O8518O8281O6969O5226O3580O1951O0157
$$ 1316653 1378981 1443658 1510048 1577767 1646285 1714566 1781535 1846761 1910341 1972292 2032449
63037B032449N8446N7228N6628N6475N6399N5685N3580M9887M4847L8154K8783
$$ 2032449 2090895 2148123 2204751 2261226 2317625 2373310 2426890 2476777 2521624 2559778 2588561
63026B588561J6305J891j2697k6811m0815n4567o6872p6621q3647q8187r0132
$$ 2588561 2604866 2606757 2594060 2567249 2526434 2471867 2404995 2328374 2244727 2156540 2066408
63015B066408q9356q6287q1632p5737o8694o0889n2935m5060l6984k8545k0134
$$ 2066408 1977052 1890765 1809133 1733396 1664702 1603813 1550878 1505818 1468834 1440289 1420155
63004A420155j2316n275J214P346J3045J8022K1976K4836K6868K8506K9923L0823
$$ 1420155 1407839 1402564 1403778 1411124 1424169 1442191 1464167 1489003 1515871 1544377 1574300 1605123
62992A605123L0825K9944K8658K7513K6788K6369K5694K3979K0807J6498J1646
$$ 1605123 1635948 1665892 1694550 1722063 1748851 1775220 1800914 1824893 1845700 1862198 1873844
62981A873844O341J65p120j5228k3727l2220m0117m6790n2215n6932o0976o3425
$$ 1873844 1880185 1880350 1873230 1858002 1834275 1802055 1761938 1715148 1662933 1606001 1545025 1481600
62969A481600o3572o1948n9550n6533n2586m8228m4502m1405l7855l3595k9963
$$ 1481600 1418028 1356080 1296530 1239997 1187411 1139183 1094681 1053276 1015421 981826 951863
62958I51863k8051k7097k5612k3430k1587k0571j9840j8997j8376j8241j8218
$$ 951863 923812 896715 871103 847673 826086 805515 785675 766678 748302 730061 711843
62947G11843j7917j7451j6976j6250j5073j3764j2669j1564j0053q398p316o898
$$ 711843 693926 676475 659499 643249 628176 614412 601743 590179 580126 571728 564412 557514
62935E57514o369n181l882l402l734l926l372k539k109j943j465p71o20j268j913
$$ 557514 551145 545964 542082 538680 534946 531020 527648 525109 523000 521057 519592 518821 518201 516933 515020
62920E15020j658o37J89J34o75j664k434k973l467l909l948l307k339j867k291
$$ 515020 513362 512725 512914 513048 512373 510709 508275 505302 501835 497926 493978 490671 488332 486465 484174
62905D84174l131l673l754l641l445l075k610k259j983j536q54j29M75R11J112
$$ 484174 481043 477370 473616 469975 466530 463455 460845 458586 456603 455067 454213 454084 454559 455470 456582
62890D56582J018P30L59j36p59j180j086o63l76k68N3P42J387J514J008K7j111
$$ 456582 457600 458330 458689 458553 457794 456614 455528 454865 454489 454221 454274 455016 456403 457917 458925 458952 457841
62873D57841j829j555m14P02J002N43j57q63j664k390k470j428N12K376L064K291
$$ 457841 456012 454457 454043 454745 455747 456290 456133 455270 453606 451216 448746 447318 447830 450206 453270 455561
62857D55561R40K66O58J431J812J740J562J449J439J636J943J921J326N97K72
$$ 455561 456501 456767 457425 458856 460668 462408 463970 465419 466858 468494 470437 472358 473684 474281 474553
62842D74553K42N6k00m1M98P36L58j48l45n17j021j486j281n48j3J21M49J333
$$ 474553 474795 474851 474651 474610 475108 475844 476202 476054 475709 475192 474171 472685 471404 470856 470843 470964 471413 472746
62824D72746K198K249J569J045J341K311L329L866L773L312L041L369M124M767
$$ 472746 474944 477193 478762 479807 481148 483459 486788 490654 494427 497739 500780 504149 508273 513040
62810E13040N035N167N416N671N804O015O525P164P605P874Q263Q859R572J0510
$$ 513040 518075 523242 528658 534329 540133 546148 552673 559837 567442 575316 583579 592438 602010 612520
62796F12520J1867J3422J4690J5687J7089J9410K2397K5529K8773L2547L7094
$$ 612520 624387 637809 652499 668186 685275 704685 727082 752611 781384 813931 851025
62785H51025M2195M7443N2626N7938O3857P0672P7972Q4869R0863R6217J01313
$$ 851025 893220 940663 993289 1051227 1115084 1185756 1263728 1348597 1439460 1535677 1636990
62774A636990J05949J09404J10922J09782J05276R7128Q5906P2590N7674M0961
$$ 1636990 1742939 1852343 1963265 2073047 2178323 2275451 2361357 2433947 2491621 2532582
62764B532582K2299K268j7899l6967n4203o9345q2127r2016r8692j02643j04863
$$ 2532582 2554881 2557149 2539250 2502283 2448080 2378735 2296608 2204592 2105900 2003257 1898394
62753A898394j05794j04969j01989r7418r2281q7051q1523p5510o9167o2751n6469
$$ 1898394 1792600 1687631 1585642 1488224 1395943 1308892 1227369 1151859 1082692 1019941 963472
62742I63472n0563m5226m0540l6673l3812l1552k8764k4722k0172j6614j4615
$$ 963472 912909 867683 827143 790470 756658 725106 696342 671620 651448 634834 620219
62731F20219j3441j2256j0940r660q330o856n346l834k224p25K01N31R40J997
$$ 620219 606778 594522 583582 573922 565592 558736 553390 549556 547332 546607 546808 547339 548279 550276
62717E50276L487M785N655O462P797R971J2623J4838J6068J6937J8674K1694K5328
$$ 550276 553763 558548 564203 570665 578462 588433 601056 615894 631962 648899 667573 689267 714595
62704G14595K8967L2724L6773M0836M4802M9073N3696N7825O0772O3139O5952
$$ 714595 743562 776286 813059 853895 898697 947770 1001466 1059291 1120063 1183202 1249154
62693A249154O9031P1087P1319P0050O7622O3540N7019M7858L6509K3610R787
$$ 1249154 1318185 1389272 1460591 1530641 1598263 1661803 1718822 1766680 1803189 1826799 1836586
62682A836586m381j8399l1808m3997n4256o2114o7566p0986p2913p3792p3699
$$ 1836586 1832205 1813806 1781998 1738001 1683745 1621631 1554065 1483079 1410166 1336374 1262675
62671A262675p2340o9511o5526o1050n6559n2072m7415m2638l8116l4295l1209
$$ 1262675 1190335 1120824 1055298 994248 937689 885617 838202 795564 757448 723153 691944
62660F91944k8391k5469k2687k0483j8628j6430j3900j1979j1229j0961j0239
$$ 691944 663553 638084 615397 594914 576286 559856 545956 533977 522748 511787 501548
62649E01548r206q713q919r075q497p128n250l302j948j628j953k070j638j038
$$ 501548 492342 483629 474710 465635 457138 450010 444760 441458 439510 437882 435929 433859 432221 431183
62635D31183o37l91j64Q7M20P85P83J00q76j387j268j011q58n15J27P02J048J602
$$ 431183 430546 430155 429991 430078 430498 431283 432066 432166 431290 429903 428635 427624 426766 426251 426378 427080 428128 429730
62617D29730K735M159N299N943O229O383O656P280Q196R107R847J0450J0882J1189
$$ 429730 432465 436624 441923 447866 454095 460478 467134 474414 482610 491717 501564 512014 522896 534085
62603E34085J1877J3616J6368J9356K2080K4799K7896L1337L5013L9034M3231
$$ 534085 545962 559578 575946 595302 617382 642181 670077 701414 736427 775461 818692
62592H18692M6965M9736N1600N2645N2612N1373M9211M6102M1244L3929K4587
$$ 818692 865657 915393 966993 1019638 1072250 1123623 1172834 1218936 1260180 1294109 1318696
62581A318696J4401M204n811j5557k4789l3087l9799m4377m7121m9107n0766n1168
$$ 1318696 1333097 1337301 1331490 1315933 1291144 1258057 1218258 1173881 1126760 1077653 1026887 975719
62569I75719m9471m6511m3899m1863l9203l5399l1524k8596k6213k3444k0343
$$ 975719 926248 879737 835838 793975 754772 719373 687849 659253 633040 609596 589253
62558E89253j7657j5562j3569j1543j0005r264q832q055o928n943n248m400l025
$$ 589253 571596 556034 542465 530922 520917 511653 502821 494766 487838 481895 476647 472247 469222
62545D69222j445l34P9J82L33M39K95L4n6K9M9m6mM00J069J719K250K947M210
$$ 469222 467777 467443 467522 467704 468037 468476 468771 468805 468749 468778 468827 468781 468777 469177 470246 471965 474215 477162 481372
62526D81372N949P455Q180Q548R591J1739J4456J7154J9813K2475K4810K6772
$$ 481372 487321 494776 502956 511504 521095 532834 547290 564444 584257 606732 631542 658314
62514F58314K9092L2390L6124L9155M1177M2851M4535M5605M5205M3136L9803
$$ 658314 687406 719796 755920 795075 836252 879103 923638 969243 1014448 1057584 1097387
62503A097387L5703L1126K6096K0428J4034P244O58n220j0002j3255j4698j4357
$$ 1097387 1133090 1164216 1190312 1210740 1224774 1232018 1232676 1227456 1217454 1204199 1189501 1175144
62491A175144j2295q417l002K900Q283J3311J8983K5633L2401L8306M3146M7217
$$ 1175144 1162849 1154432 1151430 1154330 1162613 1175924 1194907 1220540 1252941 1291247 1334393 1381610
62479A381610N0683N3475N5088N4237M9355M0129K8253J6217N457m195j3751k4232
$$ 1381610 1432293 1485768 1540856 1595093 1644448 1684577 1712830 1729047 1734504 1730309 1716558 1692326
62467A692326l6130m8908o0944p0320p5953p7925p7083p4606p1674o8884o5784
$$ 1692326 1656196 1607288 1546344 1476024 1400071 1322146 1245063 1170457 1098783 1029899 964115
62456I64115o1348n5195m8152m1429l5480k9935k4525j9588j5535j2226r312o910
$$ 964115 902767 847572 799420 757991 722511 692576 668051 648463 632928 620702 611390 604480
62444F04480n399m577l554j685P65L114M976O242O843O845O475N722M283K228
$$ 604480 599081 594504 590950 589265 590030 593144 598120 604362 611205 618050 624525 630247 634530 636758
62430F36758K21j432l377o150r007j0617j0749j0309r941r535r106r117r549r583
$$ 636758 636979 635547 632170 626020 617013 606396 595647 585338 575397 565862 556756 547639 538090 528507
62416E28507q611p050n771n226n340n718n752n104m299m222m852n152m509l474
$$ 528507 519896 512846 507075 501849 496509 490791 485039 479935 475636 471414 466562 461410 456901 453427
62402D53427k759k222j458o97l71k94jM44O10M68M19P07J198J701K074K228K263
$$ 453427 450668 448446 446988 446291 445920 445626 445625 446069 446679 447147 447566 448273 449471 451172 453246 455474 457737
62385D57737K419K702K850K836L010L548M174M728N445O450P505Q567R952J1505
$$ 457737 460156 462858 465708 468544 471554 475102 479276 484004 489449 495899 503404 511971 521923 533428
62371E33428J2339J2035J1451J1619J2497J3548J4922J7062J9634K1970K4284
$$ 533428 545767 557802 569253 580872 593369 606917 621839 638901 658535 680505 704789
62360G04789K7374L1260L5184L8906M2871M7005N0432N2612N3759N3810N1915
$$ 704789 732163 763423 798607 837513 880384 927389 977821 1030433 1084192 1138002 1189917
62349A189917M7444M0792L2724K3651J4026M778l269j0077j6038k1332k5972l0149
$$ 1189917 1237361 1278153 1310877 1334528 1348554 1353332 1350063 1339986 1323948 1302616 1276644 1246495
62337A246495l4024l7422m0025m1588m1821m0425l7587l4105l0685k7400k4087
$$ 1246495 1212471 1175049 1135024 1093436 1051615 1011190 973603 939498 908813 881413 857326
62326H57326k0928j8284j6158j4306j2748j1867j2025j3189j4857j6278j6980
$$ 857326 836398 818114 801956 787650 774902 763035 751010 737821 722964 706686 689706
62315F89706j7111j7054j6685j5412j3129j0676q958p946o914n504m034k823j690
$$ 689706 672595 655541 638856 623444 610315 599639 590681 582735 575821 570317 566283 563460 561770
62302E61770k80J319K514K801K357J932K061K514K677K360J808J056j63j673k592
$$ 561770 561490 562809 565323 568124 570481 572413 574474 576988 579665 582025 583833 584889 584726 583053 580461
62287E80461k269j219o23j039j955k540k368j462q3J282K130K385K544L164M224
$$ 580461 578192 576973 576350 575311 573356 570816 568448 566986 566903 568185 570315 572700 575244 578408 582632
62272E82632N223N889O571P813R641J1527J3040J4348J5931J7955K0154K2276
$$ 582632 587855 593744 600315 608128 617769 629296 642336 656684 672615 690570 710724 733000
62260G33000K4526K7477L1568L6599M1765M6328N0253N3875N6970N8529N7668
$$ 733000 757526 785003 816571 853170 894935 941263 991516 1045391 1102361 1160890 1218558
62249A218558N4411M9270M2487L4173K4906J5555O618j818r585j6518k2978k9613
$$ 1218558 1272969 1322239 1364726 1398899 1423805 1439360 1445978 1444160 1434575 1418057 1395079 1365466
62237A365466l6505m3007m8479n2634n5111n5429n3674n0685m7226m3396l9119
$$ 1365466 1328961 1285954 1237475 1184841 1129730 1074301 1020627 969942 922716 879320 840201
62226H40201l4702l0557k6776k3354k0432j8037j5894j3859j2148j0820r481p875
$$ 840201 805499 774942 748166 724812 704380 686343 670449 656590 644442 633622 624141 616266
62214F16266o422n712n664n633n110m040k683j502q67n27K51J671K970L463L615
$$ 616266 609844 604132 598468 592835 587725 583685 581002 579500 578633 578106 578357 580028 582998 586461 590076
62199E90076M386N814O991P302P042O809O947P590Q682R800J0472J0721J0902
$$ 590076 594462 600276 607267 614569 621611 628420 635367 642957 651639 661439 671911 682632 693534
62186F93534J1037J0870J0571J0710J1350J1752J1264J0027Q554P051N542M332
$$ 693534 704571 715441 726012 736722 748072 759824 771088 781115 789669 796720 802262 806594
62174H06594L901M447N716P255Q791J0547J3158J7037K1739K6293L0128L3375
$$ 806594 810495 814942 820658 827913 836704 847251 860409 877446 899185 925478 955606 988981
62162I88981L6239L8497L9640L9138L6526L1780K5693J9335J2989O161j127p871
$$ 988981 1025220 1063717 1103357 1142495 1179021 1210801 1236494 1255829 1268818 1274979 1273852 1265981
62150A265981j3278j7747k2007k5880k8717l0584l2099l3270l3429l2371l0640
$$ 1265981 1252703 1234956 1212949 1187069 1158352 1127768 1095669 1062399 1028970 996599 965959
62139I65959k8577k5864k2328j8525j5094j2093r369p121n661m905m600m751n403
$$ 965959 937382 911518 889190 870665 855571 843478 834109 826988 821327 816422 811822 807071 801668
62126H01668o152o370n868n007m107l115j843l05J330K975M669O356P604P614
$$ 801668 795516 789146 783278 778271 774164 771049 769206 768901 770231 773206 777875 784231 791835 799449
62112G99449N817K534j084l926n569o122n787m883l993l698m246n659p870j0395
$$ 799449 805266 807800 806716 802790 797221 791099 785312 780429 776436 772738 768492 762833 754963 744568
62098G44568j2156j2197j0579q174n640l128q79N57J033J122J395J773J942K043
$$ 744568 732412 720215 709636 701462 695822 692694 691815 692372 693405 694527 695922 697695 699637 701680
62084G01680K485L280M055M617N187O079P443R202J1047J2578J3699J4752J6032
$$ 701680 704165 707445 711500 716117 721304 727383 734826 744028 755075 767653 781352 796104 812136
62071H12136J7356J8297J8764J8938J8930J8895J9389K1026K3622K6124K7593
$$ 812136 829492 847789 866553 885491 904421 923316 942705 963731 987353 1013477 1041070
62060A041070K7950K7535K6306K3747J9516J3886P663J764l204p207j0691j4201
$$ 1041070 1069020 1096555 1122861 1146608 1166124 1180010 1187673 1189437 1186233 1179026 1168335 1154134
62048A154134j8017k2089k6171k9954l3196l5750l7501l8316l8167l7276l5991
$$ 1154134 1136117 1114028 1087857 1057903 1024707 988957 951456 913140 874973 837697 801706
62037H01706l4486l2693l0560k8226k5916k3681k1369j8863j6320j4122j2477
$$ 801706 767220 734527 703967 675741 649825 626144 604775 585912 569592 555470 542993
62026E42993j1172r900q675p689o803n705m688m633n795p084p183o083m878m242
$$ 542993 531821 521921 513246 505557 498754 493049 488361 483728 477933 470849 463666 457583 452705 448463
62012D48463l852l316k822k662k684k557k163j418k38J122K087K493K863L648
$$ 448463 444611 441295 438473 435811 433127 430570 428407 426989 426751 427873 429960 432453 435316 438964
61998D38964M492M687M083L193K513K099J719J184M87k41r88k012l514n211o539
$$ 438964 443456 448143 452226 455419 457932 460031 461750 462934 463421 463180 462192 460180 456666 451455 444916
61983D44916p299p730p932p806p563p629p776p109n405l742l155l257k942j999
$$ 444916 437617 429887 421955 414149 406586 398957 391181 384072 378667 374925 371770 368513 365571 363572
61969C63572j111n17K18J127J508J015L36L92J221K048K080J138j90r23n60L61
$$ 363572 362461 361944 362162 363289 364797 365812 366148 366540 367761 369809 371889 373027 372837 371914 371354 371715
61953C71715R21J001J317K179K932K996K787L123M082N021N583O071O853P866
$$ 371715 372636 373637 374954 377133 380065 383061 385848 388971 393053 398074 403657 409728 416581 424447
61939D24447Q863R846J0983J2186J2924J2627J1346R895R162R258R520R344Q683
$$ 424447 433310 443156 454139 466325 479249 491876 503222 513117 522279 531537 541057 550401 559084
61926E59084P678O163L966J455o29j927k771l625m454m845m556l814l041k473
$$ 559084 566762 572925 576891 578346 577717 575790 573019 569394 564940 560095 555539 551725 548684 546211
61912E46211j943r91Q62L665O753R079J0079J0193J0268J0503J0245Q965O951
$$ 546211 544268 543277 544139 547804 554557 563636 573715 583908 594176 604679 614924 623889 630840
61899F30840M829K726L99j996l897n141o224p468q383q285p303o323n942n957
$$ 630840 635669 638395 638794 636798 632901 627760 621536 614068 605685 597400 590097 583774 577832 571875
61885E71875n933n846n855n779n339m843n124o532q328r418r489r078q678q216
$$ 571875 565942 560096 554241 548462 543123 538280 533156 526624 518296 508878 499389 490311 481633 473417
61871D73417p410o216m764l269k049j345r17j85J031K295L252M185N502P029Q244
$$ 473417 466007 459791 455027 451758 449709 448364 447447 447262 448293 450588 453840 458025 463527 470556 478800
61856D78800R018R714J0746J2274J4218J6211J7707J8548J9172K0003K0782K0986
$$ 478800 487818 497532 508278 520552 534770 550981 568688 587236 606408 626411 647193 668179
61844F68179K0525J9598J8076J5691J2658R479O172K485j181l886n403o551p928
$$ 668179 688704 708302 726378 742069 754727 764206 770378 772863 771682 767796 762393 755842 747914
61831G47914r024r025p884o018l468j46L405O169P635Q179Q440Q652Q514P395
$$ 747914 738890 729865 721981 715963 712495 712349 715754 721923 729558 737737 746177 754829 763343 770738
61817G70738M756P03l862p813j0623j2476j3745j4595j5002j4953j4562j4069
$$ 770738 775494 776197 772335 764522 753899 741423 727678 713083 698081 683128 668566 654497
61805F54497j3634j3135j2341j1383j0787j0849j1236j1431j1311j0982j0298
$$ 654497 640863 627728 615387 604004 593217 582368 571132 559701 548390 537408 527110
61794E27110r064p602o586o161n719m751l596l019l227l648l644l109k314j452
$$ 527110 518046 510444 503858 497697 491978 487227 483631 480612 477385 473737 470093 466984 464670 463218
61780D63218o03K3J26k80p77r62r13j006j371j663j432n90M77J241J475J489J788
$$ 463218 462615 462638 462764 462484 461707 460745 459832 458826 457455 455792 454360 453770 454247 455488 456963 458452 460240
61763D60240K505L278L782M120M538M938N023M789M502M277M007L630L110K167
$$ 460240 462745 466023 469805 473925 478463 483401 488424 493213 497715 501992 505999 509629 512739 514906
61749E14906N05j610l442m564n196n646n864n750n499n255m828m067l267k776
$$ 514906 515411 513801 510359 505795 500599 494953 489089 483339 477840 472585 467757 463690 460423 457647
61735D57647k422j789r49m39m44m40J21R59J197M99l24j68R22J661J096r4m14
$$ 457647 455225 453436 452487 452048 451604 451164 451285 452244 453441 453940 453616 453448 454370 456031 457127 457033 456619
61718D56619O36K146L086L252K893K197J522J357J561J195l12k269l575m027m207
$$ 456619 457255 459401 462487 465739 468632 470829 472351 473708 475269 476464 476152 473883 470308 466281 462074
61703D62074m401m457m459m750n211n222m485l361k346j672j495j880k506k830
$$ 462074 457673 453216 448757 444007 438796 433574 429089 425728 423382 421710 420215 418335 415829 412999
61689D12999k807l001l746m591m804m186l191k443k328k781l273l220k532j683
$$ 412999 410192 407191 403445 398854 394050 389864 386673 384230 381902 379121 375848 372628 370096 368413
61675C68413j131q66n71p2N01P83M53l75r85o57M76J489J698J342J039R93J075
$$ 368413 367282 366416 365845 365773 366274 367057 367510 367135 366150 365493 365969 367458 369156 370498 371537 372530 373605
61658C73605J354K003K822L354L498L525L464K940J888R55P98J222J497J351J172
$$ 373605 374959 376962 379784 383138 386636 390161 393625 396565 398453 399408 400206 401428 402925 404276 405448
61643D05448J214J235J055R92J288J584J436J069J034J298J287Q56M97M52K55
$$ 405448 406662 407897 408952 409944 411232 412816 414252 415321 416355 417653 418940 419796 420293 420745 421000
61628D21000m69j314j669j638j889k756l915m801n084m765m080l264k294j103
$$ 421000 420531 419217 417548 415910 414021 411265 407350 402549 397465 392700 388620 385356 383062 381959
61614C81959r0j5j061k452l341l707l938l975l524k889k737l158l587l697l714
$$ 381959 381869 381854 380793 378341 375000 371293 367355 363380 359856 356967 354230 351072 347485 343788 340074
61599C40074l751l536k926k184j520q79l87m50j188k145k830l067k747j800p01
$$ 340074 336323 332787 329861 327677 326157 325278 324891 324441 323253 321108 318278 315211 312464 310664 309963
61584C09963l77j151k193k506k045j442j050q56r81j502j890j426k57N99N21M3
$$ 309963 309586 308435 306242 303736 301691 300249 299199 298343 297362 295860 293970 292544 292287 292886 293407 293450
61568B93450J2M75Q64R37J018J325J594J548J408J556J917K017J706J391J412
$$ 293450 293462 293937 294801 295738 296756 298081 299675 301223 302631 304187 306104 308121 309827 311218 312630
61553C12630J498J195O19L57O83J214J422J105L42o33j415j582j121m13L08J137
$$ 312630 314128 315323 315942 316299 316982 318196 319618 320723 321065 320432 319017 317435 316314 315901 316209 317346
61537C17346J953K209J702J167J492K433K719J602k52j581j902j672j400j104
$$ 317346 319299 321508 323210 324377 325869 328302 331021 332623 332371 330790 328888 327216 325816 324712
61523C24712o39k01k02p05j289j492j269r29p23o54o51p50r78j201j104m52P09
$$ 324712 324073 323872 323670 322965 321676 320184 318915 317986 317263 316609 315958 315208 314230 313029 311925 311473 312182
61506C12182J905K488K121J153L03L9L38J008J893K669K843K259J473J224J603
$$ 312182 314087 316575 318696 319849 320152 320191 320529 321537 323430 326099 328942 331201 332674 333898 335501
61491C35501K021K042J925K129K588K783K478K048J925K014J893J474J159J268
$$ 335501 337522 339564 341489 343618 346206 348989 351467 353515 355440 357454 359347 360821 361980 363248
61477C63248J634J869J796J432P80r0q95j342j455j443j404j340j373j572j684
$$ 363248 364882 366751 368547 369979 370759 370669 369774 368432 366977 365534 364130 362790 361417 359845 358161
61462C58161j433j086j277k115k878k817j980j022m56k82k04J9L35M62K95J78
$$ 358161 356728 355642 354365 352250 349372 346555 344575 343553 343097 342815 342611 342630 342965 343427 343722 343900
61446C43900N08J147J530J523J588K014K427K422K256K463L009L366L191K523
$$ 343900 344408 345555 347085 348608 350196 352210 354637 357059 359315 361778 364787 368153 371344 373867
61432C73867J477K59n73m00P22J937K371J905J080M74K63L08N34J144K260L365
$$ 373867 375344 375603 375030 374630 375352 377289 379660 381565 382645 383119 383382 383690 384224 385368 387628 390993
61416C90993L513K352P23j86j62j8m18j128j498j283p55l20j93l80p31j061j191
$$ 390993 394506 396858 397581 397395 397233 397215 396797 395669 394171 392888 392133 391813 391620 391240 390509 389448 388257
61399C88257r27j77P41J174Q68M07N29J104J335J024Q88J398J973J865J355J382
$$ 388257 387330 387153 387894 389068 389936 390343 390872 391976 393311 394335 395223 396621 398594 400459 401814 403196
61383D03196K163K852K657J747Q71N47P81J301J772J940J810J552J149M28m41
$$ 403196 405359 408211 410868 412615 413486 414033 414814 416115 417887 419827 421637 423189 424338 424766 424325
61368D24325q42m86l9m07j509k309k157j533j164j030p43m25m78o55j90J036K237
$$ 424325 423483 422997 422958 422551 421042 418733 416576 415043 413879 412849 412106 411681 411203 410548 410358 411394 413631
61351D13631K863L366M359N556O092N680M846M119L540K980K525K375K572K945
$$ 413631 416494 419860 424219 429775 435867 441547 446393 450512 454052 457032 459557 461932 464504 467449
61337D67449L208L161K877K620K455K113J415O54K35J46M0k55o26r50j087p49
$$ 467449 470657 473818 476695 479315 481770 483883 485298 485952 486187 486333 486373 486118 485492 484542 483455 482706
61321D82706J49J077J345J059J160K298M040N406N929O001O366P392Q729R681
$$ 482706 482855 483932 485277 486336 487496 489794 493834 499240 505169 511170 517536 524928 533657 543338
61307E43338J0045J0408J1279J2192J2231J1360J0391R588Q169N712L103J384
$$ 543338 553383 563791 575070 587262 599493 610853 621244 630832 639001 644713 647816 649200
61295F49200K61j319l534n551o874p862q796r306r078q497q174q257q479q519
$$ 649200 649461 648142 644608 639057 632183 624321 615525 606219 597141 588644 580470 572213 563734 555215
61281E55215q103p092n775m740m203l681k661j325l63j48l80l95K73J510K573
$$ 555215 547112 540020 534245 529505 525302 521621 518960 517635 517272 517124 516744 516349 516622 518132 520705
61266E20705K640J621L02l26J81J630L464M956N550N340M990M886M638L732K397
$$ 520705 523345 524966 525268 524942 525123 526753 530217 535173 540723 546063 551053 555939 560577 564309 566706
61251E66706J347Q75O94N50M43K71k11r31j471j621j604j661j752j787j755j523
$$ 566706 568053 568928 569622 570172 570615 570886 570675 569744 568273 566652 565048 563387 561635 559848 558093 556570
61235E56570r08p8N35Q34J132J455J453J300J965L940O231P401P299O928O894
$$ 556570 555662 555584 556119 556953 558085 559540 560993 562293 564258 568198 574429 581830 589129 596057 602951
61220F02951O904O744O801P305P881Q159Q271Q376Q223P606O786O069N354M499
$$ 602951 609855 616599 623400 630705 638586 646745 655016 663392 671615 679221 686007 692076 697430 701929
61206G01929L728L301L080K863K835L258L969M663N410O431P592Q579R477J0581
$$ 701929 705657 708958 712038 714901 717736 720994 724963 729626 735036 741467 749059 757638 767115 777696
61192G77696J1726J2235J1552R616O667L286M28j122j538j758k454l568m828o129
$$ 777696 789422 801657 813209 822825 829492 832778 833206 832084 830546 828788 826334 822766 817938 811809
61178H11809p282p985q295q649r163r384r088q789r019r490r587r390r514j0043
$$ 811809 804527 796542 788247 779598 770435 761051 751963 743174 734155 724665 715078 705688 696174 686131
61164F86131j0310r848r087q725q823q835q390p700p115o560n629m189k662j531
$$ 686131 675821 665973 656886 648161 639338 630503 622113 614413 607298 600738 595109 590920 588258 586727
61150E86727p15K93J675K946L445K962J749J99j339k577l360l678l531k930k056
$$ 586727 586012 586305 587980 590926 594371 597333 599082 599281 597942 595365 592005 588327 584796 581866 579810
61135E79810j183l00Q89K420L832M755N456O396P492Q298Q833R697J1327J3529
$$ 579810 578627 578327 579216 581636 585468 590223 595679 602075 609567 617865 626698 636395 647722 661251
61121F61251J5851J8063K0112K1869K3107K3670K3603K3300K3341K3969K4752
$$ 661251 677102 695165 715277 737146 760253 783923 807526 830826 854167 878136 902888
61110I02888K5071K4827K4399K3901K3049K1748K0342J9074J7703J5931J3806
$$ 902888 927959 952786 977185 1001086 1024135 1045883 1066225 1085299 1103002 1118933 1132739
61099A132739J1454Q754N702K760M48j279k833m338n541o265o588o558o097n245
$$ 1132739 1144193 1152947 1158649 1161409 1161857 1160578 1157745 1153407 1147866 1141601 1135013 1128455 1122358 1117113
61085A117113m267l389k618j851j000k0R99J823K263K334K123J636R85N49O53
$$ 1117113 1112846 1109457 1106839 1104988 1103988 1103968 1104967 1106790 1109053 1111387 1113510 1115146 1116131 1116680 1117333
61070A117333J085J216O63m16j632k688l417l837m333n380o867p923p779o670
$$ 1117333 1118418 1119634 1120297 1119881 1118249 1115561 1112144 1108307 1103974 1098594 1091727 1083804 1076025 1069355
61056A069355n631n367n590n512m740l541k278r22Q14K941N002O497P304P675
$$ 1069355 1063724 1058357 1052767 1047255 1042515 1038974 1036696 1035774 1036588 1039529 1044531 1051028 1058332 1066007
61042A066007P922Q322R194J0787J2969J5182J6883J8066J9255K0928K3023K5068
$$ 1066007 1073929 1082251 1091445 1102232 1115201 1130383 1147266 1165332 1184587 1205515 1228538 1253606
61030A253606K6795K8439L0421L2871L5523L7875L9334L9654L9496M0278M2938
$$ 1253606 1280401 1308840 1339261 1372132 1407655 1445530 1484864 1524518 1564014 1604292 1647230
61019A647230M7196N2553N9581O9178Q0749R2447J03553J15385J29638J47363
$$ 1647230 1694426 1746979 1806560 1875738 1956487 2048934 2152487 2267872 2397510 2544873
61009B544873J70327K01511K42592K92431L50005M17710M99527N97300P12151
$$ 2544873 2715200 2916711 3159303 3451734 3801739 4219449 4718976 5316276 6028427
61000F028427Q48894J014658J212133J436656J676276J900976K043343K003872
$$ 6028427 6877321 7891979 9104112 10540768 12217044 14118020 16161363 18165235
60992A8165235J706670J173271N41178m987l34099m15785k94846n0342K11577
$$ 18165235 19871905 21045176 21586354 21581367 21247268 20831483 20536637 20486295 20697872
60983B0697872L54621K52541j33074p10382j303544j753016j986068k015585j896938
$$ 20697872 21052493 21305034 21171960 20461578 19158034 17405018 15418950 13403365 11506427
60974A1506427j691668j452800j219046j010932q33533o85213n63424m64482l83220
$$ 11506427 9814759 8361959 7142913 6131981 5298448 4613235 4049811 3585329 3202109
60965C202109l15802k61265k19154j87206j62365j42607j26575j12714r9971q8520
$$ 3202109 2886307 2625042 2405888 2218682 2056317 1913710 1787135 1674421 1574450 1485930
60955A485930p8757p0125o1790n3750m6507m0140l4492k9923k7139k6387k7179
$$ 1485930 1407173 1337048 1275258 1221508 1175001 1134861 1100369 1070446 1043307 1016920 989741
60944I89741k8490k9085k8139k5916k3499k1679k0487j9743j9319j8754j7501
$$ 989741 961251 932166 904027 878111 854612 832933 812446 792703 773384 754630 737129
60933G37129j5848j4780j4592j4465j3785j2924j2252j1395j0141r102q676q250
$$ 737129 721281 706501 691909 677444 663659 650735 638483 627088 616947 607845 599169 590919
60921E90919p365o739p070p543o836n140l862l618l739l698l689l756l437k627
$$ 590919 583554 576815 569745 562202 555366 550226 546364 542746 539007 535309 531620 527864 524427 521800
60907E21800j894j655j664j546j249q74n84p16j354j883j674j151j407k645l860
$$ 521800 519906 518251 516587 515041 513792 512918 512334 511618 510264 508381 506707 505556 504149 501504 497644
60892D97644m269m217m356m624m582m212l852l699l731l925m210m449m607m718
$$ 497644 493375 489158 484802 480178 475596 471384 467532 463833 460102 456177 451967 447518 442911 438193
60878D38193m635m122l345k878l055l544l720l235k129o74P32J693K014J779J325
$$ 438193 433558 429436 426091 423213 420158 416614 412894 409659 407530 406856 407588 409281 411295 413074 414399
60863D14399J258K155L907N551O184N910N435M990M211L030J978J462J346J343
$$ 414399 415657 417812 421719 427270 433454 439364 444799 449789 454000 457030 459008 460470 461816 463159
60849D63159J393J491J585J645J528Q34n88k090k847k980l340m193m998n540o267
$$ 463159 464552 466043 467628 469273 470801 471635 471047 468957 466110 463130 459790 455597 450599 445059 438792
60834D38792p081o970n557m147m266n664o734o543n554m493l520k642k105j996
$$ 438792 431711 424741 419184 415037 410771 405107 398373 391830 386276 381783 378263 375621 373516 371520
60820C71520j976j769j594j822k395k884l042l069l264l493l255k328j199n99
$$ 371520 369544 367775 366181 364359 361964 359080 356038 352969 349705 346212 342957 340629 339430 338831
60806C38831o76r01p62l15L6l7n99j406j918j684q21J14O99R15R07Q72J111J665
$$ 338831 338155 337254 336492 336177 336213 336176 335577 334171 332253 330569 329748 329862 330561 331476 332383 333255 334366 336031
60788C36031K004J597Q79Q78J759K449K089J109M04J63M4m8q0k63o47p47k84J30
$$ 336031 338035 339632 340511 341389 343148 345597 347686 348795 349199 349362 349406 349358 349278 349015 348368 347621 347337 347467
60770C47467k34j073j483j275r99q62n17N9M00L64L23L47mp58j199q64k53j03
$$ 347467 347233 346160 344677 343402 342403 341541 341024 341083 341483 341847 342170 342517 342513 341755 340556 339692 339439 339336
60752C39336l68n20l76j93q1J47O43J354K072K474K254J490O97K65q5r53k454
$$ 339336 338968 338448 338072 337879 337798 337945 338588 339942 342014 344488 346742 348232 348929 349194 349109 348156 345702
60735C45702l954m672m356l437k593k181j992j619j011n33m47m88j68O67J669
$$ 345702 341748 337076 332720 329283 326690 324509 322517 320898 319887 319354 318907 318419 318251 318918 320587
60720C20587K363K513K215J802J611J712J898J972J987J971J684Q96k5k99K87
$$ 320587 322950 325463 327678 329480 331091 332803 334701 336673 338660 340631 342315 343211 343186 342887 343174
60705C43174R06O24l53r24n64p6m41j452k010j655j082j038j313j277r20q24j180
$$ 343174 344080 344704 344351 343427 342863 342787 342346 340894 338884 337229 336147 335109 333796 332519 331599 330775 329595
60688C29595j442j060j88N71Q22O07K05k3K17Q74J474J609J498J701K248K479
$$ 329595 328153 327093 326905 327476 328298 328905 329110 329087 329304 330178 331652 333261 334759 336460 338708 341187
60672C41187K030J538J881K869L296K408P36p17j656k416l103l369k972k148j305
$$ 341187 343217 344755 346636 349505 352801 355209 355945 355228 353572 351156 348053 344684 341712 339564 338259
60657C38259o88l11j7M19J086J802K357K710K939L059L149L328L415K908J646
$$ 338259 337571 337260 337243 337662 338748 340550 342907 345617 348556 351615 354764 358092 361507 364415 366061
60642C66061K30p37j480k577l832m377l938l246k949k851k443j733j046n17j31
$$ 366061 366291 365554 364074 361497 357665 353288 349350 346104 343155 340304 337861 336128 335082 334565 334434
60627C34434j2k57o61q80p52l25K02N33N61O38J230K147K558J965Q20n9l61l71
$$ 334434 334422 334165 333504 332624 331872 331547 331749 332282 332843 333481 334711 336858 339416 341381 342201 342142 341781 341410
60609C41410m18m89k80M55J400J727J005p4m18J13P37J050J451K103K480K252
$$ 341410 340992 340503 340223 340678 342078 343805 344810 344736 344318 344431 345168 346218 347669 349772 352252 354504
60593C54504J825J517J082N48O68J754K863K982K380J918J637J057L53R5J34j21
$$ 354504 356329 357846 358928 359476 360144 361898 364761 367743 370123 372041 373678 374735 375088 375183 375317 375196
60577C75196m36R3J503K664K768K371K594L939O104Q417J0210J1183J1613J1856
$$ 375196 374760 374853 376356 379020 381788 384159 386753 390692 396796 405213 415423 426606 438219 450075
60563D50075J1725J0800R234P689O337M563J868j357m143n758o154n847n406m868
$$ 450075 461800 472600 481834 489523 495860 500423 502291 500934 496791 491033 484879 479032 473626 468758
60549D68758l791k060k70J091K374M093N824O677O720P077Q577J0973J3600J6078
$$ 468758 464967 462907 462637 463728 466102 470195 476019 482696 489416 496493 505070 516043 529643 545721
60535E45721J8181J9701K0714K1482K1885K1320J9262J5616J0587M747q51n255
$$ 545721 563902 583603 604317 625799 647684 669004 688266 703882 714469 719216 718365 713110
60523G13110q365j0648j2262j3024j3081j2826j2224j1070r747q851q035o333
$$ 713110 704745 694097 681835 668811 655730 642904 630680 619610 609863 601012 592977 586644
60511E86644l783j574k96P77K178L266L625M319O730J0749J5193J9460K3728K7916
$$ 586644 582861 581287 580991 581768 583946 587212 590837 595156 601886 612635 627828 647288 671016 698932
60497F98932L1532L4511L7314M0071M2213M3120M2610M0824L8029L4551L0690
$$ 698932 730464 764975 802289 842360 884573 927693 970303 1011127 1049156 1083707 1114397
60486A114397K6648K2591J8474J3759P745M51p350j5259k3780l3130m2132m9052
$$ 1114397 1141045 1163636 1182110 1195869 1203614 1204065 1196715 1181456 1157676 1124546 1082414 1033362
60474A033362n3231n5146n5186n3235m9439m4525l9252l4109k9590k6106k3378
$$ 1033362 980131 924985 869799 816564 767125 722600 683348 649239 619649 593543 570165
60463E70165k0589j7408j4509j2744j2089j1655j0580q747o832n740n810o427
$$ 570165 549576 532168 517659 504915 492826 481171 470591 461844 455012 449272 443462 437035
60451D37035o509n569m078k884k349k236k202k166k186k181j981j631j443j610
$$ 437035 430526 424957 420879 417995 415646 413410 411208 409042 406856 404675 402694 401063 399620 398010
60437C98010j931k089k085k134k230k162j901j653j443j044m22K4p0n41q51o59
$$ 398010 396079 393990 391905 389771 387541 385379 383478 381825 380382 379338 378916 378940 378870 378329 377478 376819
60421C76819j04L53L89J90K83Q03J245J242J301K142L432L951L121J665N54K6
$$ 376819 376715 377068 377457 377647 377930 378733 379978 381220 382521 384663 388095 392046 395167 396832 397386 397412
60405C97412q8J76P00J123J384J885K692L138K767K117J929K107K130K047K248
$$ 397412 397324 397500 398200 399323 400707 402592 405284 408422 411189 413306 415235 417342 419472 421519 423767
60390D23767K575K552K298K351K635K490J834J479J971K755K884K150J162O40
$$ 423767 426342 428894 431192 433543 436178 438668 440502 441981 443952 446707 449591 451741 452903 453543
60376D53543R01J813K942L714L737L039K134J668J841K143J933J320J100J690
$$ 453543 454444 456257 459199 462913 466650 469689 471823 473491 475332 477475 479408 480728 481828 483518
60362D83518K535K885K718K509K432K349K348K812L954N615P348Q474Q370P185
$$ 483518 486053 488938 491656 494165 496597 498946 501294 504106 508060 513675 521023 529497 537867 545052
60348E45052N946N497N475M920L511J656m49k952n527p224p454o604n392m217
$$ 545052 550998 556495 561970 566890 570401 572057 571608 568656 563129 555905 548451 541847 536455 532238
60334E32238l285k913l190l704l930l833l776l953m131l942l356k772k595k690
$$ 532238 528953 526040 522850 519146 515216 511383 507607 503654 499523 495581 492225 489453 486858 484168
60320D84168k454j558l79N45J259K256L718N315O716P932R050J0030J0801J1376
$$ 484168 481714 480156 479777 480322 481581 483837 487555 492870 499586 507518 516568 526598 537399 548775
60306E48775J1698J1646J1275J0944J1079J1713J2213J1518Q996N188J322k061
$$ 548775 560473 572119 583394 594338 605417 617130 629343 640861 649857 655045 656367 654306
60294F54306n644j0105j4791j8151j9293j8559j6757j4417j1847r348p150n390
$$ 654306 648662 638557 623766 605615 586322 567763 551006 536589 524742 515394 508244 502854
60282E02854m176l436k835k183j828k232l196l937l997l683l600l957m426m463
$$ 502854 498678 495242 492407 490224 488396 486164 482968 479031 475034 471351 467751 463794 459368 454905
60268D54905l808k905k614l213l887l639k493j339p44m91k05J64N39Q35Q08K55
$$ 454905 451097 448192 445578 442365 438478 434839 432346 431007 430263 429772 429567 429731 430270 431105 431913 432168
60252D32168m90p55l15L76Q71J184J490J785K066K384K594K368J642Q42M20L69
$$ 432168 431678 430923 430608 430984 431855 433039 434529 436314 438380 440764 443358 445726 447368 448210 448630 448999
60236D48999L04j15q14j289j085l88J06J65M35J442K641L106K886K815L188L496
$$ 448999 449303 449188 448374 447085 446000 445612 445718 445883 446318 447760 450401 453507 456393 459208 462396 465892
60220D65892L527L765M457N099N217N014M927N119N708O813Q021Q480P958P336
$$ 465892 469419 473184 477641 482740 487957 492971 497898 503017 508725 515538 523559 532039 539997 547333
60206E47333P522Q269Q614Q096P138O416O244O326N954M695L049K037K003K233
$$ 547333 554855 563124 571738 579834 586972 593388 599632 605958 611912 616607 619656 621693 623696 625929
60192F25929J951J146J55r84k283l391l984m238m522m843n042n190n406n554n492
$$ 625929 627880 629026 629181 628197 625914 622523 618539 614301 609779 604936 599894 594704 589298 583744 578252
60177E78252n365n284n045m514l997l805l694l228k439j705j190q41p50j034j515
$$ 578252 572887 567603 562558 558044 554047 550242 546548 543320 540881 539176 537986 537145 536395 535361 533846
60162E33846j886k121k351k452k194j652j093n26K18J015J446J326R52P80R92
$$ 533846 531960 529839 527488 525036 522842 521190 520097 519571 519789 520804 522250 523576 524528 525308 526300
60147E26300J407J642J412Q61M68O43J444K692M048M993N148M817M782N377O135
$$ 526300 527707 529349 530761 531622 532090 532733 534177 536869 540917 545910 551058 555875 560657 566034 572169
60132E72169O541O615O465N875M818L823L199K466J231K05L70J458K213K117J855
$$ 572169 578710 585325 591790 597665 602483 606306 609505 611971 613202 613407 613777 615235 617448 619565 621420
60117F21420K009K315K541L093M094M667L878K037L51m83p63j045j486j936k200
$$ 621420 623429 625744 628285 631378 635472 640139 644017 646054 646405 645922 645159 644114 642628 640692 638492
60102F38492k134j808j600j857k419k755k596k138j639j173q58r60j448j743j366
$$ 638492 636358 634550 632950 631093 628674 625919 623323 621185 619546 618373 617515 616555 615107 613364 611998
60087F11998o21k56m96r27j337j959k657k625j567o00j115k899m265m227l641
$$ 611998 611377 611121 610625 609698 608361 606402 603745 601120 599553 598953 597838 594939 590674 586447 582806
60072E82806l906n201o606p417p692p690p426o856o146n578n274n044m540l693
$$ 582806 578900 573699 567093 559676 551984 544294 536868 530012 523866 518288 513014 507970 503430 499737
60058D99737k942k732k880k760k178j542j078n03L19R71J216J533K404L456M016
$$ 499737 496795 494063 491183 488423 486245 484703 483625 483122 483441 484412 485628 487161 489565 493021 497037
60043D97037M196M671N552O204O151N600M983M534M324M219L668K176R6j475j888
$$ 497037 501233 505904 511456 517660 523811 529411 534394 538928 543252 547471 551139 553315 553411 551936 550048
60028E50048j641j720k525l685m715n504o304p371q549r292r162q348p420o643
$$ 550048 548407 546687 544162 540477 535762 530258 523954 516583 508034 498742 489580 481232 473812 467169
60014D67169n808m756l707k984k672k758l208l783m002l606k860k189j664j071
$$ 467169 461361 456605 452898 449914 447242 444484 441276 437493 433491 429885 427025 424836 423172 422101
60000D22101m25k3m1k18q5O07J681K642L044K905K730K996L560L775L309K649
$$ 422101 421676 421653 421612 421394 421309 421916 423597 426239 429283 432188 434918 437914 441474 445249 448558 451207
59984D51207K597L323M160M265L294J468o62k368l060k767k150j832j842j917
$$ 451207 453804 457127 461287 465552 468846 470314 469652 467284 464224 461457 459307 457475 455633 453716
59970D53716k058k435k917l101k790k056r71L50J487K017K133K484L251L789L386
$$ 453716 451658 449223 446306 443205 440415 438359 437388 437738 439225 441242 443375 445859 449110 452899 456285
59955D56285K064M79o19p81j06O54O94J1o00n77j93M8Q6Q7Qk33m83o02o85p68
$$ 456285 458349 458828 458209 457428 457322 457976 458670 458681 458081 457504 457311 457359 457445 457532 457540 457307 456824 456222 455537 454769
59935D54769o21j39M48J055J960L129L888L846L668M162M893M651L221J759J150
$$ 454769 454148 454009 454457 455512 457472 460601 464489 468335 472003 476165 481058 485709 488930 490689 491839
59920D91839Q62m2j383k064j560n99j41j92N8J083K423L346L693L785L782L604
$$ 491839 492701 492659 491276 489212 487652 487053 486912 486720 486778 487861 490284 493630 497323 501108 504890 508494
59904E08494L330L107K649J546R5q11r04r52j558k164j885p62M56J414K274K995
$$ 508494 511824 514931 517580 519126 519221 518410 517506 516554 514996 512832 510947 510185 510641 512055 514329 517324
59888E17324L281L213L311L870M661N272N420N020M326L880L988M345M529M605
$$ 517324 520605 523818 527129 530999 535660 540932 546352 551372 555698 559578 563566 567911 572440 577045
59874E77045M793M864M398L546K858K445J851Q08l41j125j401j334j171j059q65
$$ 577045 581838 586702 591100 594646 597504 599949 601800 602608 602267 601142 599741 598407 597236 596177 595312
59859E95312k74O96J525J819J825J937K057J998K159L049M344N217N533N955O723
$$ 595312 595038 595734 597259 599078 600903 602840 604897 606895 609054 612103 616447 621664 627197 633152 639875
59844F39875P083O173L946J029j775l699m243l543k202p01P04J548J139o74l139
$$ 639875 646958 653131 657077 658106 656331 652632 648389 644846 642644 641943 642647 644195 645334 644660 641521
59829F41521n206o341o652o530o238n716m812l772l262l603m302m687m693m498
$$ 641521 636315 629974 623322 616792 610554 604838 600026 596254 592992 589389 585087 580400 575707 571209
59815E71209l777k155j52J120J340J201J211J056M44k13l59o0J67l0o40j364j774
$$ 571209 567432 565277 565125 566245 567585 568786 569997 571053 571497 571284 570925 570865 571032 571002 570362 568998 567224
59798E67224j648j242r60q86r84j488k477l288l165k492k460l398m302m333l872
$$ 567224 565576 564334 563374 562488 561504 560016 557539 554251 551086 548594 546134 542736 538434 534101 530229
59783E30229l690l824l902l914m012l974l482k686j952j248k45J094K349L011
$$ 530229 526539 522715 518813 514899 510887 506913 503431 500745 498793 497545 497300 498394 500743 503754
59769E03754K944K569K570L182L886M075L908M019M589N335O190P234Q012P878
$$ 503754 506698 509267 511837 515019 518905 522980 526888 530907 535496 540831 547021 554255 562267 570145
59755E70145P167P064P999R105R641R981J0626J1101J0695R556Q338P195N915
$$ 570145 577312 584376 592375 601480 611121 621102 631728 642829 653524 663080 671418 678613 684528
59742F84528M609L617K952K445K042J583O79o31j618j831j832k335l016l011k221
$$ 684528 689137 692754 695706 698151 700193 701776 702455 701824 700206 698375 696543 694208 691192 688181 685960
59727F85960j425j187j374j617j662j315o51j91m35j212j919k202k064j514o80
$$ 685960 684535 683348 681974 680357 678695 677380 676729 676538 676103 674891 672972 670770 668706 667192 666512
59712F66512j5J24QJ81P15J314J994L057M429N506N813N419M715M105L958M467
$$ 666512 666497 666621 666629 666810 667525 668839 670833 673890 678319 683825 689638 695057 699772 703877 707835 712302
59696G12302N432O372O862O753O149N316M435L361J782k25k131l549m604n477
$$ 712302 717734 724106 730968 737721 743870 749186 753621 756982 758764 758539 756408 752859 748255 742778
59682G42778o038o167o154o348o671o760o483o101o070o701p695q026o927n058
$$ 742778 736740 730573 724419 718071 711400 704640 698157 692056 685986 679285 671590 663564 656637 651579
59668F51579m005m353n016m824m027l515l325k748j519j8J356K372K783K651K580
$$ 651579 647574 643221 638205 633381 629354 625839 622514 619766 618247 618229 619585 621957 624740 627391 629971
59653F29971L020L600L710L443L291L256K925K167J163p0j542l005m376o028q015
$$ 629971 632991 636591 640301 643744 647035 650291 653216 655383 656546 656476 654934 651929 647553 641525 633510
59638F33510r476r622q910q302p821o836n480m569m267l919l319k968l040l122
$$ 633510 624034 614412 605502 597200 589379 582543 577063 572494 568227 564308 560989 558021 554981 551859
59624E51859l169l654m495m847m322l603l414l721m213m809n288n148m324l427
$$ 551859 548690 545036 540541 535694 531372 527769 524355 520634 516421 511612 506324 501176 496852 493425
59610D93425k879k437j839j258p62k2J040J868J995J643J292J129J206J564J916
$$ 493425 490546 488109 486270 485012 484250 484228 485268 487136 489131 490774 492066 493195 494401 495965 497881
59595D97881J788J281J073J396J617J297R25J130J704J977J699J053K44n56j207
$$ 497881 499669 500950 502023 503419 505036 506333 507258 508388 510092 512069 513768 514821 515065 514509 513302
59580E13302j850k697l351l140k385k437l770m964m479k755j485j407j874k230
$$ 513302 511452 508755 505404 502264 499879 497442 493672 488708 484229 481474 479989 478582 476708 474478
59566D74478k362k037r53M13J015O21P1k9m8l99o77l51K64L88j36n57m3J447L041
$$ 474478 472116 470079 469126 469539 470554 471175 471246 471217 471169 470770 470093 469742 470006 470394 470258 469701 469658 471105 474146
59547D74146L743L484L317M245N981P329P770P955Q629R839J1559J4170J7417
$$ 474146 477889 481373 484690 488935 494916 502245 510015 517970 526599 536438 547997 562167 579584
59534E79584J9307J7272J0749K101n301r566j0862j0227q473o072l461j047R64
$$ 579584 598891 616163 626912 629013 623712 614146 603284 593057 584584 578512 575051 574004 574968
59521E74968K503L391L330K256N84j062k315l209l839m206m412m797n567o480
$$ 574968 577471 580862 584192 586448 587032 585970 583655 580446 576607 572401 567989 563192 557625 551145
59507E51145p035p013o604o095n672n415n243m838l940k814k111k029j923j002
$$ 551145 544110 537097 530493 524398 518726 513311 508068 503230 499290 496476 494365 492336 490413 489411
59493D89411P29K417L219K927J980J058O37P41J109J652K551L733M615M752M463
$$ 489411 490140 492557 495776 498703 500683 501741 502378 503119 504228 505880 508431 512164 516779 521531 525994
59478E25994M454M844N139N014M657M286L878L480L289L179K650J500K27n22o28
$$ 525994 530448 535292 540431 545445 550102 554388 558266 561746 565035 568214 570864 572364 572591 572069 571441
59463E71441m30k56k34k63lQ41K044K972L357L584M082M791N442N938O186N986
$$ 571441 571011 570755 570521 570258 570255 571096 573140 576112 579469 583053 587135 591926 597368 603306 609492 615478
59447F15478N445N041M885M332K795N94j535l462n519p465q371p671n915m221
$$ 615478 620923 625964 630849 635181 637976 638570 637035 633573 628054 620589 612218 604547 598632 594411
59433E94411l205k596j808p31J08K70P0K33R68J905K903M324O320Q452J0282J1839
$$ 594411 591206 588610 586802 586071 586179 586449 586519 586752 587720 589625 592528 596852 603172 611624 621906 633745
59417F33745J3251J4513J5894J7933K0649K3443K5986K8164K8639K4795J5496
$$ 633745 646996 661509 677403 695336 715985 739428 765414 793578 822217 847012 862508
59406H62508L325p219j3331j4941j3059q715l172K452P991J3305J6557J4971P941
$$ 862508 865833 858614 845283 830342 817283 808568 805396 807848 815839 829144 845701 860672 868613
59393H68613j843j0869j7432k1329k2435k0741j7221j3465j0471q314o788n828
$$ 868613 866770 855901 838469 817140 794705 773964 756743 743278 732807 724493 717705 711877
59381G11877n337n059m658l948l067k347j916j514r92o56p56r68q57o34p10q41
$$ 711877 706540 701481 696823 692875 689808 687461 685545 684031 683039 682383 681627 680659 679802 679168 678458 677617
59365F77617m52L74J030J399J879K486K884L248M159N560O788P723Q891J0308
$$ 677617 677165 677539 678569 679968 681847 684333 687217 690465 694624 700184 706972 714695 723586 733894
59351G33894J1272J1615J2032J2844J3500J3736J4129J4868J5076J4101J2572
$$ 733894 745166 756781 768813 781657 795157 808893 823022 837890 852966 867067 879639
59340H79639J1416J0541R288P496N312K578p33l984o486q350j0105j1867j3393
$$ 879639 891055 901596 910884 918380 923692 926270 925537 921553 915067 906717 896612 884745 871352
59327H71352j4590j5455j5925j6154j6408j6400j5391j3450j1780j1184j1002
$$ 871352 856762 841307 825382 809228 792820 776420 761029 747579 735799 724615 713613
59316G13613j0314r405r080r142q661p453o270n642n315m843m057k940j556l3
$$ 713613 703299 693894 684814 675672 667011 659558 653288 647646 642331 637488 633431 630491 628935 628902
59302F28902J676L842O498R243J1678J3531J4069J2170P523J203n410j1537j6384
$$ 628902 630578 634420 640918 650161 661839 675370 689439 701609 709132 710335 704925 693388 677004
59289F77004j8662j7826j5157j2499j0343q026n342k802o80J158K611L503M251
$$ 677004 658342 640516 625359 612860 602517 594491 589149 586347 585667 586825 589436 592939 597190
59276E97190N457O953Q147R063J0190J1423J2159J2335J2441J2533J2132J1147
$$ 597190 602647 609600 617747 626810 637000 648423 660582 672917 685358 697891 710023 721170
59264G21170R983Q730P140N376L897K621J060o41j796k331k882l590l815l324
$$ 721170 731153 739883 747023 752399 756296 758917 759977 759336 757540 755209 752327 748737 744922 741598
59250G41598k740k421j894q44J55O10R67J857L032L754L831L580L111K221Q85
$$ 741598 738858 736437 734543 733699 733854 734464 735431 737288 740320 744074 747905 751485 754596 756817 757702
59235G57702o16j946k899l498m122n161o347o821o252n533n860p338q889r498
$$ 757702 757086 755140 752241 748743 744621 739460 733113 726292 720040 714507 708647 701309 692420 682922
59221F82922r142q478q031p869p807p632p109o057m599l204k261j675j148p56
$$ 682922 673780 665302 657271 649402 641595 633963 626854 620797 616198 612994 610733 609058 607910 607154
59207F07154q11j143j065k66P37J323J470J484J498J695K410L516M195L977L476
$$ 607154 606343 605200 604135 603869 604606 605929 607399 608883 610381 612076 614486 618002 622197 626174 629650
59192F29650L465L662L345K704K573L027L321L220L202L309K815J491K31o5L76
$$ 629650 633115 636777 640122 642826 645399 648426 651747 654967 658169 661478 664293 665784 666015 665950 666326
59177F66326O68L19n80j711k691l165l125k895k728k589k399k164j864j590j619
$$ 666326 666994 667313 666733 665022 662331 659166 656041 653146 650418 647829 645430 643266 641402 639812 638193
59162F38193j996k214j852j364j554k391l175l742m585n675o202n795n131m930
$$ 638193 636197 633983 632131 630767 629213 626822 623647 619905 615320 609645 603443 597648 592517 587587
59148E87587n168n627o358p059o925n768m629m419m646m330l612l476m146m787
$$ 587587 582419 576792 570434 563375 556450 550682 546053 541634 536988 532658 529046 525570 521424 516637
59134E16637m829m595m426l901k440l09J475K170K069K151L087M613N940O613
$$ 516637 511808 507213 502787 498886 496446 496137 497612 499782 501851 504002 507089 511702 517642 524255
59120E24255O834P054P522Q226Q954R439R702J0111J0777J1026J0132Q480P299
$$ 524255 531089 538143 545665 553891 562845 572284 581986 592097 602874 613900 624032 632512 639811
59107F39811P084O979O121M853M048L841L712L417L125K790K091R83k21j349k485
$$ 639811 646895 653874 659995 664848 668896 672737 676449 679866 682991 685781 687872 688855 688634 687285 684800
59092F84800l570m260m273l608k462j171j97J48nl29q24j782l182m470n151n390
$$ 684800 681230 676970 672697 669089 666627 665456 665259 665407 665402 665073 664249 662467 659285 654815 649664 644274
59076F44274n750o379o768o442n709n399n873o478o258n014l468k425k088k164
$$ 644274 638524 632145 625377 618935 613226 607827 601954 595476 589218 584204 580736 578311 576223 574059
59062E74059k365k612k858k960k744k271j927k050k434k445j782r26n56p06q21
$$ 574059 571694 569082 566224 563264 560520 558249 556322 554272 551838 549393 547611 546685 546129 545423 544602
59047E44602m86J80Q09J107R84O25M18M98N23J86j76J18J175K378L071L140K847
$$ 544602 544116 544296 545105 546212 547196 547821 548239 548737 549260 549446 549270 549388 550563 552941 556012 559152 561999
59030E61999K542K594L279M574O189P785R092R979J0670J1557J2582J3045J2505
$$ 561999 564541 567135 570414 574988 581177 588962 598054 608033 618703 630260 642842 655887 668392
59017F68392J1449J0520R385P212M104J226n99j634k457l226l883m432m675m307
$$ 668392 679841 690361 699746 706958 711062 712288 711689 710055 707598 704372 700489 696057 691382 687075
59003F87075l484k701j882l44K036M276N400N474N091M396L232J787M48o96j684
$$ 687075 683591 680890 679008 678664 680700 684976 690376 695850 700941 705337 708569 710356 710804 710108 708424
58988G08424k269k255k041k225k735k884k328j505j010p62m7J629L892N839P013
$$ 708424 706155 703900 701859 699634 696899 694015 691687 690182 689172 688410 688363 689992 693884 699723 706736
58973G06736P851Q928J0132J0997J1611J2473J3469J3759J2947J1691J0727R888
$$ 706736 714587 723515 733647 744644 756255 768728 782197 795956 808903 820594 831321 841209
58961H41209Q607O963N516M383L117J427n28k608m980p686j0236j1981j2755j2941
$$ 841209 849816 856779 862295 866678 869795 871222 870694 868086 863106 855420 845184 833203 820448 807507
58947H07507j2861j2445j1616j0766j0371j0169r349p743o228n554n284m570l496
$$ 807507 794646 782201 770585 759819 749448 739279 729930 722187 715959 710405 705121 700551 697055
58934F97055k787k461j754m00Q93J482J601J805K222K580K494J612l3j706k536
$$ 697055 694268 691807 690053 689653 690546 692028 693629 695434 697656 700236 702730 704342 704309 702603 700067
58919G00067k497k257k053j523o65r1N5N40J840L236L762L569L658M563N899P048
$$ 700067 697570 695313 693260 691737 691072 690981 691036 691576 693416 696652 700414 703983 707641 712204 718103 725151
58903G25151P807Q431R337J0681J2087J2934J2945J2225J0928R301P952P450P579
$$ 725151 732958 741389 750726 761407 773494 786428 799373 811598 822526 831827 839779 847229 854808
58890H54808P617P454P774R020J0837J2708J4313J5076J4277J2098R782Q129O551
$$ 854808 862425 869879 877653 886673 897510 910218 924531 939607 953884 965982 975764 983893 990444
58877I90444M201J389q65k224l181m139n034n751o323o706o775o546o221o092
$$ 990444 994645 996034 995169 992945 989764 985625 980591 974840 968517 961811 955036 948490 942269 936177
58863I36177o390p087p803q253q659r349j0142j0640j0994j1581j2118j1979j1364
$$ 936177 929787 922700 914897 906644 897985 888636 878494 867854 856860 845279 833161 821182 809818
58850H09818j1141j1374j1158j0147r116q642q275p669p359p762q373q680q957
$$ 809818 798677 787303 776145 765998 756882 748240 739965 732296 724937 717175 708802 700122 691165
58837F91165r401r439q690p759p221o672n622m459l640k852j953j736k545l050
$$ 691165 681764 672325 663635 655876 648655 641983 636361 631902 628262 625410 623457 621721 619176 616126
58823F16126j812N84K370L085L671M524N020M962M940N109M843L891K830K086
$$ 616126 614314 614898 617268 620353 624024 628548 633568 638530 643470 648579 653422 657313 660143 662229
58809F62229J442P40K61J12o4o17j597k951m465n595n950n910o084o390o312n910
$$ 662229 663671 664411 664672 664784 664720 664103 662506 659555 655090 649495 643545 637635 631551 625161 618849 612939
58793F12939n782o054o201n847n108m123k926j791j016l85N67J787K834L709M851
$$ 612939 607157 601103 594902 589055 583947 579824 576898 575107 574091 573706 574273 576060 578894 582603 587454
58778E87454O231P190P329O970O556O021M937L006L37k538n019o918q428r502
$$ 587454 593685 600875 608204 615174 621730 627751 632688 635694 636031 633493 628474 621556 613128 603626
58764F03626r739r150q482q259q066p289o109n048m020k618j017J70P17P96M13
$$ 603626 593887 584737 576255 567996 559930 552641 546532 541484 537464 534846 533829 533999 534716 535512 535925
58749E35925m50j377j787j522p02O47K190L086K889K332K429L171L873M388N074
$$ 535925 535475 534098 532311 530789 530087 530734 532924 536010 538899 541231 543660 546831 550704 555092 560166
58734E60166N814O022N571M959M608M559M617M419L707L031L455M972O012N415
$$ 560166 565980 572002 577573 582532 587140 591699 596316 600735 604442 607473 610928 615900 621912 627327
58720F27327M029L356L461L609M103N741P858Q741Q051P127O717N965M031J367
$$ 627327 631356 634712 638173 641782 645885 651626 659484 668225 676276 683403 690120 696085 700116 701483
58706G01483j157l281n061o503p912r788j1999j3797j4806j5346j5651j5620j5309
$$ 701483 700326 697045 691984 685481 677569 667781 655782 641985 627179 611833 596182 580562 565253
58693E65253j4872j3988j2273j0220q780p998p062n795n008n112n376m932l746
$$ 565253 550381 536393 524120 513900 505120 497122 490060 484265 479257 474145 468769 463837 460091
58680D60091k339j268r83j459j925j609q01l64l54lR93K159L245M521N985P224
$$ 460091 457752 456484 455501 454042 452117 450508 449707 449343 448989 448986 449979 452138 455383 459904 465889 473113
58664D73113Q239R490J0957J1874J1524R676O388K204j685m393o244p868q848
$$ 473113 481352 490842 501799 513673 525197 534873 541261 543465 541780 537387 531143 523275 514427
58651E14427q419p153o491o683o643n849m961m474m086l578l092k418j297l39
$$ 514427 506008 498855 492364 485681 479038 473189 468228 463754 459668 456090 452998 450580 449283 448944
58637D48944l16n88J65J631K139J319O98J101J514J125O51O50L29q38j852j789
$$ 448944 448628 448040 448205 449836 451975 453294 453992 455093 456607 457732 458383 459033 459362 458524 456672 454883
58621D54883j297j285j308n50O15J343J799K654L777M551N031N701O442O545N592
$$ 454883 453586 452301 450993 450443 451058 452401 454200 456854 460631 465182 470213 475914 482356 488901 494493
58606D94493L843K088J276J722K484K284J245O90J031J092Qj418j970j645j184
$$ 494493 498336 500424 501700 503422 505906 508190 509435 510125 511156 512248 512256 510838 508868 507223 506039
58591E06039q82n88j68O75K316M415O021O829P491Q341Q907R138R874J1296J2020
$$ 506039 505157 504569 504401 505076 507392 511807 517828 524657 532148 540489 549396 558534 568408 579704 591724
58576E91724J0729P926N280L959M215N783P944R841J1387J3239J5567J7616J8941
$$ 591724 602453 610379 615659 619618 623833 629616 637560 647401 658788 672027 687594 705210 724151
58563G24151K0113K1743K3705K5709K7611K8751K8089K5441K1612J7020J1436
$$ 724151 744264 766007 789712 815421 843032 871783 899872 925313 946925 963945 975381
58552I75381N417M98k727n240p607q882q443p413p119p375p486p804r091j1297
$$ 975381 980798 981296 978569 973329 965722 956840 948397 940984 933865 926490 919004 911200 902109 890812
58538H90812j4055j7417k1044k3614k4207k3481k2460k1087j8966j6599j4716
$$ 890812 876757 859340 838296 814682 790475 766994 744534 723447 704481 687882 673166
58527F73166j3098j1130q948p129n889n248n246n376m683l126j915j854k336k563
$$ 673166 660068 648938 639990 632861 626972 621724 616478 611102 606419 603293 601378 599524 597188 594625
58513E94625k564k386j569k83L43r0n00j41J91k15o34l00J96J21m8K36L27l68
$$ 594625 592061 589675 588106 587823 588166 588076 587576 587435 587626 587411 586777 586477 586673 586794 586746 586982 587309 586941
58495E86941j071q63j45M04J180K611L900M271M427N438P081Q545R806J1133J2278
$$ 586941 585870 585007 584862 585266 586446 589057 592957 597228 601655 607093 614174 622719 632525 643658 655936
58480F55936J3233J4685J6624J7756J7527J7157J7397J6834J4030R828N741J568
$$ 655936 669169 683854 700478 718234 735761 752918 770315 787149 801179 811007 816748 818316
58468H18316l402q077j0628j1004j0507r657q257o662n212l233j88K987N244P040
$$ 818316 814914 806837 796209 785205 774698 765041 756784 750122 744910 741677 741489 744476 749720 756760
58454G56760R076J0651J0905J0510J0294R488P140L993J055k310o738j0782j2757
$$ 756760 765836 776487 787392 797902 808196 817684 824824 828817 829872 827562 820824 810042 797285
58441G97285j3350j3989j4013j2130r470q145p685n925k818l57Q77K140L737M680
$$ 797285 783935 769946 755933 743803 734333 726188 718503 712578 709760 709403 710280 712420 716157 720837
58427G20837N136O439Q473R616R504R468R975R872Q409O025L013n71l783n555
$$ 720837 725973 732412 740885 750501 760005 769473 779448 789320 797729 803754 806767 806196 802413 796858
58413G96858o498p899r250q946p232o015n877n565m506l551l001k119q29O2M89
$$ 796858 790360 782461 773211 764265 757033 751018 745141 739576 735070 731519 728518 726399 725570 725632 726121
58398G26121J152K019K600L443N258P055P308O645O953Q098Q172O868N896N819
$$ 726121 727273 729292 731892 735335 740593 747648 754956 761601 768554 776652 784824 791692 797588 803407
58384H03407N224L433J656Q35M95K26K55L12j32l11J127L719N514N875N869N950
$$ 803407 808631 812064 813720 814555 815050 815276 815531 815843 815711 815400 816527 820246 825760 831635 837504 843454
58368H43454N589N238O246Q417R840R673R104R274J0070J1128J2196J2476J1405
$$ 843454 849043 854281 860527 868944 878784 888457 897561 906835 916905 928033 940229 952705 964110
58355I64110R957R374R043P586N470M211L624K385Q38N65J544K453L315N090P012
$$ 964110 974067 983441 992484 1000070 1005540 1009751 1013375 1015760 1016598 1017163 1018707 1021160 1024475 1029565 1036577
58340A036577P448P160Q521J1531J3764J4359J4887J6060J6794J6883J7523J8657
$$ 1036577 1044025 1051185 1059706 1071237 1085001 1099360 1114247 1130307 1147101 1163984 1181507 1200164
58328A200164J8689J7291J5779J4428J2194R282P200O133N003M018M323N301N359
$$ 1200164 1218853 1236144 1251923 1266351 1278545 1287827 1295027 1301160 1306163 1310181 1314504 1319805 1325164
58315A325164N064O301Q572R635R533J0302J1956J2639J2608J3932J6203J6811
$$ 1325164 1330228 1336529 1345101 1354736 1364269 1374571 1386527 1399166 1411774 1425706 1441909 1458720
58303A458720J5775J5947J7975J9424J9417J9854K1246K1650K0654K0250K0982
$$ 1458720 1474495 1490442 1508417 1527841 1547258 1567112 1588358 1610008 1630662 1650912 1671894
58292A671894K1261K1151K2566K5115K6136K5480K5784K7516K8430K8464L0088
$$ 1671894 1693155 1714306 1736872 1761987 1788123 1813603 1839387 1866903 1895333 1923797 1953885
58281A953885L3085L4294L3567L4515L8143M1090M1686M2415M4771M7037M8673
$$ 1953885 1986970 2021264 2054831 2089346 2127489 2168579 2210265 2252680 2297451 2344488 2393161
58270B393161N1641N5683N7630N7004N7048N8767N9579N9209O0889O5128O8394
$$ 2393161 2444802 2500485 2558115 2615119 2672167 2730934 2790513 2849722 2910611 2975739 3044133
58259C044133O9645P1853P5403P6706P5267P5183P7572P8659P7597P8668Q3134
$$ 3044133 3113778 3185631 3261034 3337740 3413007 3488190 3565762 3644421 3722018 3800686 3883820
58248C883820Q6769Q8353R2658J01498J09933J15043J20543J28805J36455J42021
$$ 3883820 3970589 4058942 4151600 4253098 4363031 4478074 4598617 4727422 4863877 5005898
58238E005898J49700J61085J71438J78652J87507K00511K13261K23673K36660
$$ 5005898 5155598 5316683 5488121 5666773 5854280 6054791 6268052 6491725 6728385
58229F728385K54544K72105K86632L03444L25907L49639L72273L98761M31178
$$ 6728385 6982929 7255034 7541666 7845110 8171017 8520656 8892929 9291690 9722868
58220I722868M63990M95591N33257N80408O30988O83138P45421Q22223R06903
$$ 9722868 10186858 10682449 11215706 11796114 12427102 13110240 13855661 14677884 15584787
58211A5584787R97503J104784J236134J387014J557721J762229K011059K303700
$$ 15584787 16582290 17687074 18923208 20310222 21867943 23630172 25641231 27944931
58203B7944931K648794L072635L596977M230052M989650N908719P006722Q289137
$$ 27944931 30593725 33666360 37263337 41493389 46483039 52391758 59398480 67687617
58195F7687617R792868J1595836J3762073J6320236J9315998K2818003K6812925
$$ 67687617 77480485 89076321 102838394 119158630 138474628 161292631 188105556
58188A88105556L1113520L5324171L8676232L9749722L6639263K8009028J4411379
$$ 188105556 219219076 254543247 293219479 332969201 369608464 397617492 412028871
58181D12028871j477051j6190495k7268383l4018378l6989383l7093600l5180105
$$ 412028871 410551820 394361325 367092942 333074564 296085181 258991581 223811476
58174B23811476l2006603k8228182k4326768k0608297j7260459j4376030j1954436
$$ 223811476 191804873 163576691 139249923 118641626 101381167 87005137 75050701
58167G5050701r943397q290853o949073n858240m960421m220754l615608l113490
$$ 75050701 65107304 56816451 49867378 44009138 39048717 34827963 31212355 28098865
58159B8098865k685921k323773k024755j775667j561416j379485j230565j105359
$$ 28098865 25412944 23089171 21064416 19288749 17727333 16347848 15117283 14011924
58151A4011924r93799q96989q17428p47224o78027o13166n58412n09548m60357
$$ 14011924 13018125 12121136 11303708 10556484 9878457 9265291 8706879 8197331 7736974
58142G736974m14338l77392l46421l15795k88067k68178k53578k39416k27238
$$ 7736974 7322636 6945244 6598823 6283028 5994961 5726783 5473205 5233789 5006551
58133E006551k19417k11309j98019j83189j72402j63386j51327j38551j30187
$$ 5006551 4787134 4575825 4377806 4194617 4022215 3858829 3707502 3568951 3438764
58124C438764j24929j18393j11504j07539j04709r9318r2870q8868q5850q0359
$$ 3438764 3313835 3195442 3083938 2976399 2871690 2772372 2679502 2590634 2504784 2424425
58114B424425p3683o9199o6035o1535n7003n5018n3952n0879m7195m5856m5905
$$ 2424425 2350742 2281543 2215508 2153973 2096970 2041952 1988000 1937121 1889926 1844070 1798165
58103A798165m4857m3658m4076m4147m1393l7673l5826l4417l0825k6683k5098
$$ 1798165 1753308 1709650 1665574 1621427 1580034 1542361 1506535 1472118 1441293 1414610 1389512
58092A389512k5117k3975k2291k2123k2349k0821j8743j8282j8217j6560j5012
$$ 1389512 1364395 1340420 1318129 1296006 1273657 1252836 1234093 1215811 1197594 1181034 1166022
58081A166022j6116j8357j8833j8454j9696k1438k0932j8979j8344j8724j7923
$$ 1166022 1149906 1131549 1112716 1094262 1074566 1053128 1032196 1013217 994873 976149 958226
58070I58226j6380j6007j6086j4738j2941j2758j3106j1602r140q315q757q248
$$ 958226 941846 925839 909753 895015 882074 869316 856210 844608 835468 827153 818396 810148
58058H10148p133p351q368q354q147r827j2380j3035j1910j1242j0999r390o954
$$ 810148 803015 795664 787296 778942 770795 760968 748588 735553 723643 712401 701402 692012 685058
58045F85058n882n972n200l831l972n509o349o290o919q007p736o255n502n654
$$ 685058 679176 673204 668004 664173 660201 654692 648343 642053 635134 627127 619391 613136 607634 601980
58031F01980n226m416m902o503p406p479q126r047q577p089o671p387p169n602
$$ 601980 596754 592338 587436 580933 573527 566048 557922 548875 540298 533209 526538 519151 511982 506380
58017E06380m563m776m862m164l659l633l140k161j828k202k169j662j650j955
$$ 506380 501817 497041 492179 488015 484356 480723 477583 475422 473594 471392 469223 467561 465911 463956
58003D63956j512p21j031k261k732k137j755j853j502j026k045m715p278q715
$$ 463956 462444 461723 460692 458431 455699 453562 451807 449954 448452 447426 445381 440666 433388 424673
57989D24673r590j0077r329p267m975l016j147L64R28J131J995K962K567J017
$$ 424673 415083 405006 395677 388410 383435 380419 379272 379636 380564 381695 383690 386652 389219 390236
57975C90236J3J27M23N14Q58J194Q01K65Q23K128K694K402K298K212J008q77j678
$$ 390236 390249 390376 390799 391313 392171 393365 394166 394431 395254 397382 400076 402478 404776 406988 407996 407119 405441
57958D05441j225j165k044k609k320k180k592k697k407k814l928m157k823j279
$$ 405441 404216 403051 401007 398398 396078 393898 391306 388609 386202 383388 379460 375303 372480 371201
57944C71201p03n25J16R39J428J837K625L820N319O846P674P422O952P236P695
$$ 371201 370498 369973 370089 371028 372456 374293 376918 380738 386057 392903 400577 407999 414951 422187 429882
57929D29882P075N464L793J966o43l301m639n012n950p473q145p764p669q276
$$ 429882 436957 442421 446214 448180 447537 444236 439597 434585 428635 421162 413017 405253 397584 389308
57915C89308q548q181q053q210p531n769l934k329k47K017L031K518J823J627
$$ 389308 380760 372579 364526 356316 348785 343016 339082 336753 336506 338523 341554 344072 345895 347522
57901C47522J171J36p21j203j899k413j497N34J697J305Q84J440J951J541J062
$$ 347522 348693 348829 348108 346905 345006 342593 341096 341630 343327 344632 345516 346956 348907 350448 351510
57886C51510J402K038K263K307K352J949J205R79J251R40n6m03M18J233J289J392
$$ 351510 352912 354950 357213 359520 361872 363821 365026 366005 367256 368196 368140 367737 368155 369388 370677 372069
57870C72069K078K523K235K084K622L047K873K890L454L533K600J803K055K519
$$ 372069 374147 376670 378905 380989 383611 386658 389531 392421 395875 399408 402008 403811 405866 408385
57856D08385K251J801J881J892J202N51P57J192R06K12j30k83o27o95r5L37l98
$$ 408385 410636 412437 414318 416210 417412 417963 418720 419912 420818 421030 420900 420617 419990 419295 419200 419537 419139
57839D19139j917l033l241k774j940j228j267j865j840n98R95J960K448K845K725
$$ 419139 417222 414189 410948 408174 406234 405006 403739 401874 400034 399436 400431 402391 404839 407684 410409
57824D10409J733O20L74R51J648K108K279K097J798J831J974J397l0j443k448
$$ 410409 412142 412762 413136 414087 415735 417843 420122 422219 424017 425848 427822 429219 429189 427746 425298
57809D25298l685n426o868p470p756q123q056p290o482n890m749k824j281r88
$$ 425298 421613 416187 409319 401849 394093 385970 377914 370624 364142 358252 353503 350679 349398 348410
57795C48410j240j192j304k144k960k799k031j419o62P94K273K643K039J484J330
$$ 348410 347170 345978 344674 342530 339570 336771 334740 333321 332659 333453 335726 338369 340408 341892 343222
57780C43222J248J329K019L254M524N442N677M907L529K656K681K640J700L94
$$ 343222 344470 345799 347818 351072 355596 361038 366715 371622 375151 377807 380488 383128 384828 385222
57766C85222m66j149k170l101l346l352l790m198l712k574j662r68J91J756K924
$$ 385222 384756 383607 381437 378336 374990 371638 367848 363650 359938 357364 355702 354734 354925 356681 359605
57751C59605L418L706M033M195M180M223M238L856L130K637K890L889N068N564
$$ 359605 363023 366729 370762 374957 379137 383360 387598 391454 394584 397221 400111 404000 409068 414632
57737D14632M931L701K828K486K142J690J602J769J406L75m91q47j340k136k298
$$ 414632 419563 423264 426092 428578 430720 432410 434012 435781 437187 437562 437071 436224 434884 432748 430450
57722D30450j349k20K52N21J131J541J178N08Q6l81r46p16N18J203O6j814k555
$$ 430450 429101 428881 429133 429654 430785 432326 433504 434012 434098 433717 432771 432055 432573 433776 433842 432028 429473
57705D29473k115j739j614q89M40J505K106K798L598M046M284M723M863L851K012
$$ 429473 427358 425619 424005 423116 423556 425061 427167 429965 433563 437609 441893 446616 451479 455330 457342
57690D57342N31k96j174k294k983k908k531k234k012j981k242k179r12J495M104
$$ 457342 457873 457577 456403 454109 451126 448218 445687 443453 441441 439460 437218 435039 434127 435622 439726
57675D39726O304Q255J0275J2633J5855K0313K5607L1053L6562M2185M6757M7776
$$ 439726 446030 454285 464560 477193 493048 513361 538968 570021 606583 648768 695525 743301
57663G43301M2798L0849J3001p503k6160l9312m5840m6760m3712l8339l2277k6702
$$ 743301 786099 816948 829949 822446 796286 756974 711134 664374 620662 582323 550046 523344
57651E23344k1862j7592j3994j1156q756o606n052m205l374j994n36K58M42M45
$$ 523344 501482 483890 469896 458740 449984 443378 438326 434121 430747 428753 428217 428475 428917 429362
57637D29362K70p7p9M72Q48M61n3J61Q44J245J352J412J020j05j113j092n07l63
$$ 429362 429632 429555 429476 429948 430796 431257 431204 431365 432209 433454 434806 436218 437238 437133 436020 434928 434421 434058
57619D34058n14j72M57N58K31K21M37J92m27p04n90n09l01L94J029R05N40Q61
$$ 434058 433544 433372 433829 434387 434618 434839 435276 435468 435041 434337 433747 433238 432937 433331 434360 435265 435805 436666
57601D36666J405J011p0n08j74k42r97j400j058q35j149j277q37m14k63K02J088
$$ 436666 438071 439082 439012 438504 438330 438088 437091 435691 434633 433798 432649 431372 430535 430121 429858 430060 431148
57584D31148J508J025M30N00J000J373J488J321Q35M76P97J425J415P18K32K18
$$ 431148 432656 433681 434111 434611 435611 436984 438472 439793 440628 441104 441901 443326 444741 445459 445691 445909
57568D45909k1o45q17k05L32J45k02N7P99J530K126K595K820K976L463M157M442
$$ 445909 445888 445243 444426 444221 444553 444698 444496 444553 445352 446882 449008 451603 454423 457399 460862 465019 469461
57551D69461M201M017M186M395M421M314L850K798J778J667K166K179J759K176
$$ 469461 473662 477679 481865 486260 490681 494995 498845 501643 503421 505088 507254 509433 511192 513368
57537E13368L759N129N195M539M110L807L190K583K475K648K623K385K097J810
$$ 513368 517127 522256 527451 531990 536100 539907 543097 545680 548155 550803 553426 555811 557908 559718
57523E59718J780K327K967K721J629J031J767L174M339N316O324O800O240N188
$$ 559718 561498 563825 566792 569513 571142 572173 573940 577114 581453 586769 593093 599893 606133 611321
57509F11321M523M312M116L857L742L751L838M081M265L879L021K604L127L859
$$ 611321 615844 620156 624272 628129 631871 635622 639460 643541 647806 651685 654706 657310 660437 664296
57495F64296L797K902J883J330J449K091K706K818K799L513M891N721N242M154
$$ 664296 668093 670995 672878 674208 675657 677748 680454 683272 686071 689584 694475 700196 705438 709592
57481G09592L624M044N135O410P128O639N296M295M079L830K997K262K330K784
$$ 709592 713216 717260 722395 728805 735933 742572 747868 752163 756242 760072 763069 765331 767661 770445
57467G70445K960L137L847M774N274N432N695N948N866N766O187O917P209O861
$$ 770445 773405 776542 780389 785163 790437 795869 801564 807512 813378 819144 825331 832248 839457 846318
57453H46318O461O597P254P942Q137P797P462P540P608P058O327O540P784Q805
$$ 846318 852779 859376 866630 874572 882709 890506 897968 905508 913116 920174 926501 933041 940825 949630
57439I49630Q733Q111P692P349O882O861P747Q895R395R330R387R700R898R884
$$ 949630 958363 966474 974166 981515 988397 995258 1003005 1011900 1021295 1030625 1040012 1049712 1059610 1069494
57425A069494R899J0029J0212J0418J0493J0206R741R599R796R762R289Q843Q701
$$ 1069494 1079393 1089422 1099634 1110052 1120545 1130751 1140492 1150091 1159887 1169649 1178938 1187781 1196482
57412A196482Q664Q840R721J1119J2104J2400J2718J3225J3033J1888J0939J0911
$$ 1196482 1205146 1213986 1223707 1234826 1246930 1259330 1272048 1285273 1298306 1310194 1321133 1332044
57400A332044J0892J0061R278R607J0445J0685J0692J1462J2595J2926J2619J2824
$$ 1332044 1342936 1352997 1362275 1371882 1382327 1393012 1403704 1415166 1427761 1440687 1453306 1466130
57388A466130J3578J3726J2977J2461J3065J4471J6002J7228J7684J7047J5860
$$ 1466130 1479708 1493434 1506411 1518872 1531937 1546408 1562410 1579638 1597322 1614369 1630229
57377A630229J5110J5063J5246J5420J5715J5846J5267J4107J3153J2811J2916
$$ 1630229 1645339 1660402 1675648 1691068 1706783 1722629 1737896 1752003 1765156 1777967 1790883
57366A790883J3425J4394J5386J5810J5878J6299J7068J7489J7423J7554J8276
$$ 1790883 1804308 1818702 1834088 1849898 1865776 1882075 1899143 1916632 1934055 1951609 1969885
57355A969885J9185J9933K0663K1387K1671K1418K1246K1705K2485K2842K2512
$$ 1969885 1989070 2009003 2029666 2051053 2072724 2094142 2115388 2137093 2159578 2182420 2204932
57344B204932K1954K1761K2001K2154K1830K1402K1554K2186K2405K1858K1325
$$ 2204932 2226886 2248647 2270648 2292802 2314632 2336034 2357588 2379774 2402179 2424037 2445362
57333B445362K1559K2259K2772K3098K3457K3597K3406K3544K4482K5403K5210
$$ 2445362 2466921 2489180 2511952 2535050 2558507 2582104 2605510 2629054 2653536 2678939 2704149
57322B704149K4198K3636K4000K4722K5443K6275K6933K6854K6267K6080K6589
$$ 2704149 2728347 2751983 2775983 2800705 2826148 2852423 2879356 2906210 2932477 2958557 2985146
57311B985146K7210K7575K7939K8374K8538K8438K8570K9098K9649K9977L0197
$$ 2985146 3012356 3039931 3067870 3096244 3124782 3153220 3181790 3210888 3240537 3270514 3300711
57300C300711L0315L0314L0609L1557L2573L2680L1999L1654L2148L2852L3324
$$ 3300711 3331026 3361340 3391949 3423506 3456079 3488759 3520758 3552412 3584560 3617412 3650736
57289C650736L3943L4899L5568L5513L5248L5348L5534L5335L5032L5323L6288
$$ 3650736 3684679 3719578 3755146 3790659 3825907 3861255 3896789 3932124 3967156 4002479 4038767
57278D038767L7334L7918L7927L7593L7307L7317L7525L7706L7990L8637L9369
$$ 4038767 4076101 4114019 4151946 4189539 4226846 4264163 4301688 4339394 4377384 4416021 4455390
57267D455390L9431L8522L7233L6338L6016L5978L5978L5971L5980L6058L6254
$$ 4455390 4494821 4533343 4570576 4606914 4642930 4678908 4714886 4750857 4786837 4822895 4859149
57256D859149L6465L6408L5845L4844L3970L4010L5191L6571L6846L5951L5235
$$ 4859149 4895614 4932022 4967867 5002711 5036681 5070691 5105882 5142453 5179299 5215250 5250485
57245E250485L5622L6346L6218L5356L4740L4509L3847L2351L0520K8906K7673
$$ 5250485 5286107 5322453 5358671 5394027 5428767 5463276 5497123 5529474 5559994 5588900 5616573
57234E616573K6894K6486K5931K4938K4212K4636K5793K6351K5954K5686K6377
$$ 5616573 5643467 5669953 5695884 5720822 5745034 5769670 5795463 5821814 5847768 5873454 5899831
57223E899831K7490K8000K7590K6616K5668K5392K6067K7022K7118K6040K4476
$$ 5899831 5927321 5955321 5982911 6009527 6035195 6060587 6086654 6113676 6140794 6166834 6191310
57212F191310K2974K1327J9286J7030J4683J2090R411P226N751M557L348K328
$$ 6191310 6214284 6235611 6254897 6271927 6286610 6298700 6308111 6315337 6321088 6325645 6328993 6331321
57200F331321J467J42k066m663o769p900q097p779p670q308r318r714r139q356
$$ 6331321 6332788 6332930 6330864 6326201 6319432 6311532 6303435 6295656 6287986 6279678 6270360 6260646 6251507 6243151
57186F243151q311r114j0135j0623j0169r021q006p682p569o800n423m314l814
$$ 6243151 6234840 6225726 6215591 6204968 6194799 6185778 6177772 6170090 6162521 6155721 6150298 6145984 6142170
57173F142170l345k479j505o65L20J538K510K949L214L665M065M040L434K001
$$ 6142170 6138825 6136346 6134841 6134176 6134496 6136034 6138544 6141493 6144707 6148372 6152437 6156477 6159911 6161912
57159F161912o65m458q642j2687j6662k0638k4430k8230l2747l8205m3868m8958
$$ 6161912 6161247 6156789 6148147 6135460 6118798 6098160 6073730 6045500 6012753 5974548 5930680 5881722
57147E881722n3440n7458o0664o2587o3207o2667o1014n8524n5691n2440m7879
$$ 5881722 5828282 5770824 5710160 5647573 5584366 5521699 5460685 5402161 5346470 5294030 5246151
57136E246151m1509l4227k7738k3226k0839k0023k0096k0990k3518k8342l4576
$$ 5246151 5204642 5170415 5142677 5119451 5098612 5078589 5058493 5037503 5013985 4985643 4951067
57125D951067m0191m4040m6494m7854m7393m4731m1050l7834l5244l2782l0852
$$ 4951067 4910876 4866836 4820342 4772488 4725095 4680364 4639314 4601480 4566236 4533454 4502602
57114D502602l0277l0613l0282k8374k5264k1319j5977q420J569J3814K8352M5736
$$ 4502602 4472325 4441712 4411430 4383056 4357792 4336473 4320496 4312076 4313645 4327459 4355811 4401547
57102D401547O7161R4518J30000J75477K32435L02482L87547M89293O08172P42712
$$ 4401547 4468708 4563226 4693226 4868703 5101138 5403620 5791167 6280460 6888632 7631344
57092G631344Q89432J043556J199937J353144J496557J621881J720086J782715
$$ 7631344 8520776 9564332 10764269 12117413 13613970 15235851 16955937 18738652
57084A8738652J802006J770386J681460J532572J326264J068624P66812M29753
$$ 18738652 20540658 22311044 23992504 25525076 26851340 27919964 28686776 29116529
57076B9116529P1842k86050o22446r23875j187071j412255j595413j728063j803348
$$ 29116529 29188371 28902321 28279875 27356000 26168929 24756674 23161261 21433198 19629850
57067A9629850j820722j785647j707272j596835j466035j325081j181988j043404
$$ 19629850 17809128 16023481 14316209 12719374 11253339 9928258 8746270 7702866
57059G702866r14680p98622o95361o04178n24738m56274l96894l44775k99304
$$ 7702866 6788186 5989564 5294203 4690025 4165287 3709013 3312119 2967344 2668040
57050B668040k60344k27007j98011j72638j50626j31609j15302j01693r0373q0287
$$ 2668040 2407696 2180689 1982678 1810040 1659414 1527805 1412503 1310810 1220437 1140150
57040A140150p0761o2235n5235m9235m3269l7152l1235k5401j9143j2332n065
$$ 1140150 1069389 1007154 951919 902684 859415 822263 791028 765627 746484 734152 729087
57029G29087L002J2467K3546L6018M9017N9697O2605N2286K7827n218l7606o1498
$$ 729087 732089 744556 768102 804120 853137 912834 975439 1027725 1055552 1050334 1012728 951230
57017I51230p3839p6276p2579o5873n7741m9095m1006l4298k8955k4561k1052
$$ 951230 877391 801115 728536 662663 604922 555827 514821 480523 451568 427007 405955
57006D05955j8617j7048j5700j4016j1836r433p485o604o561o268m924k916j241
$$ 405955 387338 370290 354590 340574 328738 319305 311820 305216 298655 292387 287463 284547 283306
56993B83306l49J13P39J901L604N473P118Q692J0710J3128J5014J5451J4228J1475
$$ 283306 282957 283070 283809 285710 289314 294787 301905 310597 321307 334435 349449 364900 379128 390603
56979C90603P190J651m158r066j2426j4135j4442j3928j3155j1993r868o928m227
$$ 390603 397793 399444 395286 386220 373794 359659 345217 331289 318134 306141 296273 289345 285118
56966B85118k390q57J046L089M855O733R371J2649J5941J8826K0871K1141J8746
$$ 285118 282728 281871 282917 286006 290861 297594 306965 319614 335555 354381 375252 396393 415139
56953D15139J3550N986l197j2388j9232k2295k2280k0799j8522j5372j1793q603
$$ 415139 428689 434675 431478 419090 399858 377563 355283 334484 315962 300590 288797 280194
56941B80194n864l083l08J999M063O716J0205J3968J7623K1334K5075K8112K9265
$$ 280194 274330 271247 270939 272938 277001 283717 293922 307890 325513 346847 371922 400034 429299
56928D29299K7208K0927J0700j338j2399k0788k6234k8970k9318k7988k5834k3274
$$ 429299 456507 477434 488134 486796 474397 453609 427375 398405 369087 341099 315265 291991
56916B91991k0424j7578j4946j2278r460p185o221o220o100n473m818m367l759
$$ 291991 271567 253989 239043 226765 217305 210120 203899 197679 191579 186106 181288 176921 173162
56903A73162k793j716o94K70R49J107J132J750L036M429N633O876Q310R851J1587
$$ 173162 170369 168653 167959 168229 169178 170285 171417 173167 176203 180632 186265 193141 201451 211302 222889
56888B22889J3654J5787J7584J9051K0145J9916J7036J1349M234k642q290j2219
$$ 222889 236543 252330 269914 288965 309110 329026 346062 357411 361645 359003 350713 338494
56876C38494j4129j4090j2493r712o133k413Q49L591O025Q174J0253J3095J7350
$$ 338494 324365 310275 297782 288070 281937 279524 280373 283964 289989 298163 308416 321511 338861
56863C38861K2441K7238L1646L6445M1425M4533M3207L6092K3630P859q177k1543
$$ 338861 361302 388540 420186 456631 498056 542589 585796 621888 645518 653377 645200 623657
56851F23657l0592l5029l5280l2281k7513k2254j6754j0696m357J529O904J2580
$$ 623657 593065 558036 522756 490475 462962 440708 423954 413258 408901 410430 417334 429914
56839D29914J9232K6848L5136M3773N2374O0716O8592P4491P4825O5820M6668
$$ 429914 449146 475994 511130 554903 607277 667993 736585 811076 885901 951721 998389
56828I98389K0381q214l4443n4463o5972o9177o6337n9860n1272m1777l2567k4142
$$ 998389 1018770 1010556 976113 921650 855678 786501 720164 660304 609032 567255 534688 510546
56816E10546j6234q776k222L408Q878J4801K1035K7401L4177M1283M7263M9439
$$ 510546 494312 485536 483314 486722 495600 510401 531436 558837 593014 634297 681560 730999
56804G30999M4963L2178J2053j1358l2629m7792n5766n7643n5355n0712m4701
$$ 730999 775962 808140 820193 808835 776206 728414 672648 615005 559650 508938 464237
56793D64237l7395k8991k0724j4029r079m996j226K313O094J0698J5792K0542
$$ 464237 426842 397851 377127 363098 354019 349023 347797 350110 356204 366902 382694 403236
56781D03236K4907K9049L1536K9812K2855J2073n52j3547k4882l2082l4570l4395
$$ 403236 428143 457192 488728 518540 541395 553468 552916 539369 514487 482405 447835 413440
56769D13440l3507l1629k8024k3789k0749j8879j6660j3536j0548q633p578o732
$$ 413440 379933 348304 320280 296491 275742 256863 240203 226667 216119 207486 199908 193176
56757A93176n791m795l993l704l851l806l156k307j844j706j477j156j001r75
$$ 193176 187385 182590 178597 174893 171042 167236 164080 161773 159929 158223 156746 155590 154589 153614
56743A53614q82q05q83r39p97p03r38j286j287p98M2J038J852J996J380N73J37
$$ 153614 152732 151927 151044 150105 149308 148605 147667 146381 145094 144296 144338 145376 147228 149224 150604 151177 151314
56726A51314K8n8q5J77O58R93R22N26J86L55J093J851K062J851J703J578J036
$$ 151314 151342 151284 151199 151376 152034 153027 153949 154475 154661 155016 156109 157960 160022 161873 163576 165154 166190
56709A66190J96k46l7L44N73Q28J124J110Q67R75J486J615R40J01j75J1K37M90
$$ 166190 166386 166140 166103 166447 167020 167848 168972 170082 170949 171924 173410 175025 175965 176066 175891 175902 176139 176629
56691A76629Q63J134J184J279J455J245M81j43R8J044J927K211J845J116N82O51
$$ 176629 177492 178626 179810 181089 182544 183789 184270 184127 184225 185269 187196 189407 191252 192368 192950 193601
56675A93601J026R79K44p96j814k655k842j958n54K18Q4k15l51p86j540j813j341
$$ 193601 194627 195606 195850 195054 193240 190585 187743 185785 185231 185449 185533 185318 184967 184181 182641 180828 179487
56658A79487q00n07J11J118J532R06J96K19L80r6q08j052r98j034q54k44J91R0
$$ 179487 178687 178180 178291 179409 180941 181847 182043 182262 182642 182546 181738 180686 179688 178654 177800 177556 177747 177837
56640A77837J96J071J926J822J164Q22P01L95L68J050J509N55j293k362k036j164
$$ 177837 178033 179104 181030 182852 184016 184838 185539 185934 186302 187352 188861 189416 188123 185761 183725 182561
56624A82561n34k71m20r93j516j543j413j600j677r89K1K30n85j596k065j768
$$ 182561 182027 181756 181336 180343 178827 177284 175871 174271 172594 171605 171626 171856 171271 169675 167610 165842
56608A65842o54R14J908J640P85M84P83Q64M63M9q0Q6P06J649K032J319M18N36
$$ 165842 165188 166102 168010 169650 170435 170919 171702 172566 173029 173078 172998 173084 173790 175439 177471 178790 179208 179744
56590A79744J274J252K98l52m3N68R03J293J987K462K213J488Q33N20N96J020
$$ 179744 181018 182270 182568 182216 182173 182741 183644 184937 186924 189386 191599 193087 193920 194440 195036 196056
56574A96056J525J790J747J412P67J93N86K287M320N467N744O113P041Q336R911
$$ 196056 197581 199371 201118 202530 203297 203490 204076 206363 210683 216150 221894 228007 235048 243384 253295
56559B53295J1784J3420J3993J3218J1293Q313M612J210j004k270l301m003l837
$$ 253295 265079 278499 292492 305710 317003 325316 329928 331138 330134 327864 324563 320560 316723
56546C16723l111k782l130l630l940m075l823l057k413k581l110l006k384k367
$$ 316723 313612 310830 307700 304070 300130 296055 292232 289175 286762 284181 281071 278065 275681 273314
56532B73314l342m460m949m869m484l874l318l113k978k337j327o86o55q18r79
$$ 273314 269972 265512 260563 255694 251210 247336 244018 240905 237927 235590 234263 233577 232922 232104 231125
56517B31125j412k165k876l291l356k924k013j162q77r58r38p77m93K04J136J248
$$ 231125 229713 227548 224672 221381 218025 215101 213088 211926 211049 210091 209153 208376 207883 208087 209223 210471
56501B10471L8j246j180k91k04j076j542r95l35l15n70n10n9O66J411J518O42
$$ 210471 210509 209263 208083 207792 207588 206512 204970 203975 203640 203325 202755 202245 202186 202852 204263 205781 206423
56484B06423m29o30j39J10L9K65O42M44j74k93J41K96J6m1K24K91L53J148K392
$$ 206423 205994 205364 205225 205335 205374 205639 206281 206725 206551 206258 206399 206695 206711 206670 206894 207185 207538 208686 211078
56465B11078K890K393J843J618J081J41l14P6N97Q01J002J191P77j66p45o14k68
$$ 211078 213968 216361 218204 219822 220903 221044 220730 220806 221403 222204 223206 224397 225174 225008 224263 223649 223381
56448B23381J50R52J751J776J398J675K225J505m99j899j827j631k302k792k068
$$ 223381 223531 224483 226234 228010 229408 231083 233308 234813 234314 232415 230588 228957 226655 223863 221795
56433B21795j004q04j061p72o4M32Q29J402J721J468J175J215J089N51L33Q12
$$ 221795 220791 219987 218926 218154 218090 218522 219351 220753 222474 223942 225117 226332 227421 227972 228305 229117
56417B29117J186R69J036K010K790K136P02N5M53R90J301J632J695R24k89q64
$$ 229117 230303 231272 232308 234318 237108 239244 239946 240001 240454 241444 242745 244377 246072 246996 246707 245843
56401B45843n45j48l32q50j150j020o14j68J90M75O67O48O02J097K173K785K051
$$ 245843 245298 245150 244818 243968 242818 241798 241184 241016 241206 241681 242348 242996 243598 244695 246868 249653 251704
56384B51704P53L45Q03Q46K21N4P20J167R10Q59J494J859J382J035J579K085J503
$$ 251704 252457 252802 253605 254451 254672 254726 255446 256613 257523 258382 259876 261735 263117 264152 265731 267816 269319
56367B69319M34M4K24J89k5R4M10N23O30J006J282J147J034J317J560J427J473
$$ 269319 269753 269797 270021 270210 270185 270279 270689 271212 271842 272848 274130 275277 276311 277628 279188 280615 282088
56350B82088K132K718K391J379M35k24o22m61L22J138J616K123K784K927K254
$$ 282088 284220 286938 289329 290708 291143 290919 290297 289836 290158 291296 292912 295035 297819 300746 303000
56335C03000J536J458J698J968K829M484N818N811N035M712N024N309N174M559
$$ 303000 304536 305994 307692 309660 312489 316973 322791 328602 333637 338349 343373 348682 353856 358415
56321C58415L408K081J245P87j80j587k029r32L75P33Q20J479J935J293N13J055
$$ 358415 361823 363904 365149 365936 365756 364169 362140 361208 361583 362316 363136 364615 366550 367843 368356 369411
56305C69411K545L579M061M896O084O831P134P555P758O960N553M731M676M543
$$ 369411 371956 375535 379596 384492 390576 397407 404541 412096 419854 426814 432367 437098 441774 446317
56291D46317M140M221N068O000O434O471O443O640P357Q498R336R366R043R089
$$ 446317 450457 454678 459746 465746 472180 478651 485094 491734 499091 507589 516925 526291 535334 544423
56277E44423R528J0020J0560J1204J1678J1992J2747J4166J5575J6589J7943K0227
$$ 544423 553951 563971 574531 585735 597413 609405 622152 636318 651893 668482 686425 706652
56265G06652K2739K4533K5911K7871L0796L4559L9148M4318M9382N4242N9853
$$ 706652 729391 753924 779835 807706 838502 873061 912209 956527 1005909 1060151 1120004
56254A120004O6856P4710Q2958R2255J03106J14660J25908J36975J48051J58150
$$ 1120004 1186860 1261570 1344528 1436783 1539889 1654549 1780457 1917432 2065483 2223633
56244B223633J66145J72112J76282J77704J75280J69158J59718J46040J27016
$$ 2223633 2389778 2561890 2738172 2915876 3091156 3260314 3420032 3566072 3693088
56235C693088J03247P6448M7640J7269j3539m3185p0515r4564j14217j29244j40787
$$ 3693088 3796335 3872783 3920423 3937692 3924153 3880968 3810453 3715889 3601672 3472428 3331641
56224C331641j49684j55245j56834j55515j52820j48957j43556j37115j30310
$$ 3331641 3181957 3026712 2869878 2714363 2561543 2412586 2269030 2131915 2001605
56215B001605j22836j14436j06022r8408r0966q2994p5307o8978o3605n8276n3121
$$ 2001605 1878769 1764333 1658311 1559903 1468937 1385943 1310636 1241658 1178053 1119777 1066656
56204A066656m8445m3612l8382l3964l1078k8391k4699k1142j9201j8044j6085
$$ 1066656 1018211 974599 936217 902253 871175 842784 818085 796943 777742 759698 743613
56193G43613j3816j2593j1853j0186q138p287p280o454m782l730l585l339k767
$$ 743613 729797 717204 705351 695165 687027 679740 672460 666006 661224 657494 653909 650570 647803
56180F47803k466k286j783j566k116k185n45J594K297K060K671L912M163L608
$$ 647803 645337 643051 641268 639702 637586 635401 634856 636450 638747 640807 643478 647390 651553 655161
56166F55161L901N119N861O006O628P559P766P793R088J1216J2493J3037J4373
$$ 655161 659062 664181 670042 676048 682676 690235 698001 705794 714882 726098 738591 751628 766001
56153G66001J6310J7237J7352J8554K1097K3376K5150K8032L2466L7023M1078
$$ 766001 782311 799548 816900 835454 856551 879927 905077 933109 965575 1002598 1043676
56142A043676M5503N0422N4888N9036O3962O9076P2136P2066O9443O4296N6236
$$ 1043676 1089179 1139601 1194489 1253525 1317487 1386563 1458699 1530765 1600208 1664504 1720740
56131A720740M6953L9723L5830L3880L2652L2004L0827K7070K0356J2191L436
$$ 1720740 1767693 1807416 1843246 1877126 1909778 1941782 1972609 1999679 2020035 2032226 2035662
56120B035662n926j4599k0556k4294k8810l5875m4715n4320o4258p2887p7747
$$ 2035662 2029736 2015137 1994581 1970287 1941477 1905602 1860887 1806567 1742309 1669422 1591675
56109A591675p8319p6088p1704o4641n5650m6757l8696l0919k3967j9008j5238
$$ 1591675 1513356 1437268 1365564 1300923 1245273 1198516 1159820 1128901 1104934 1085926 1070688
56098A070688j0885o551m394m067l021p41Q73J449K657M615N538N492O631R084
$$ 1070688 1059803 1053252 1048858 1044791 1041770 1041029 1041902 1043351 1046008 1050623 1056161 1061653 1068284 1077368
56084A077368J0426R951R716J0576J0946J0390J0666J2119J2757J1973J1689J2768
$$ 1077368 1087794 1097745 1107461 1118037 1128983 1139373 1150039 1162158 1174915 1186888 1198577 1211345
56072A211345J3739J4036J4959J6575J7189J6798J7374J9006J9530J8732J9009
$$ 1211345 1225084 1239120 1254079 1270654 1287843 1304641 1322015 1341021 1360551 1379283 1398292
56061A398292K0928K2158K1788K1646K2352K2169K0836K0415K1272K1369K0481
$$ 1398292 1419220 1441378 1463166 1484812 1507164 1529333 1550169 1570584 1591856 1613225 1633706
56050A633706K0820K2491K2906K1822K2174K4690K6510K6504K7107K9324L0934
$$ 1633706 1654526 1677017 1699923 1721745 1743919 1768609 1795119 1821623 1848730 1878054 1908988
56039A908988L1258L2714L5887L8099L8619M0221M3780M6485M7271M8759N1796
$$ 1908988 1940246 1972960 2008847 2046946 2085565 2125786 2169566 2216051 2263322 2312081 2363877
56028B363877N3603N3261N3575N5353N5640N3739N3212N5463N7392N7763N9753
$$ 2363877 2417480 2470741 2524316 2579669 2635309 2689048 2742260 2797723 2855115 2912878 2972631
56017B972631O4501O8496P0167P2758P7755Q1957Q4119Q7744R4081R9157J01161
$$ 2972631 3037132 3105628 3175795 3248553 3326308 3408265 3492384 3580128 3674209 3773366 3874527
56006C874527J03811J09045J13559J16211J21315J30556J39275J44916J51526
$$ 3874527 3978338 4087383 4200942 4317153 4438468 4569024 4708299 4853215 5004741
55997E004741J61599J71413J78881J87881K00185K11476K20149K31415K47724
$$ 5004741 5166340 5337753 5516634 5704515 5904700 6116176 6336325 6567740 6815464
55988F815464K64191K78500K95811L18528L41266L61641L85589M16054M47484
$$ 6815464 7079655 7358155 7653966 7972494 8313760 8675401 9060990 9477044 9924528
55979I924528M77799N13981N59211O07096O55761P14130P86501Q65533R49261
$$ 9924528 10402327 10916308 11475519 12082615 12738376 13452506 14239007 15104540 16053801
55970A6053801J049364J173056J313585J469621J656325J885766K155967K473172
$$ 16053801 17103165 18276221 19589806 21059427 22715752 24601518 26757485 29230657
55962B9230657K864695L355553L954301M675877N551280O597918P813819R225281
$$ 29230657 32095352 35450905 39405206 44081083 49632363 56230281 64044100 73269381
55954G3269381J0905993J2923143J5306296J8099136K1380175K5165568K9310341
$$ 73269381 84175374 97098517 112404813 130503949 151884124 177049692 206360033
55947B06360033L3483268L7031502L8673735L6516616K8945272J5991644r2664
$$ 206360033 239843301 276874803 315548538 352065154 381010426 397002070 396909406
55940C96909406j5800746k8123022l5673825l8621878l7987714l5033389l0923069
$$ 396909406 381108660 352985638 317311813 278689935 240702221 205668832 174745763
55933A74745763k6527949k2357284j8642616j5469227j2836711j0677506q903684
$$ 174745763 148217814 125860530 107217914 91748687 78911976 68234470 59330786
55926E9330786p451937o274768n315501m520714l861832l321586k872686k488660
$$ 59330786 51878849 45604081 40288580 35767866 31906034 28584448 25711762 23223102
55918B3223102k161578j890145j661698j461654j288924j146185j025151r15556
$$ 23223102 21061524 19171379 17509681 16048027 14759103 13612918 12587767 11672211
55910A1672211q18811p39214o70767o05433n45888m97834m57525m18378l82427
$$ 11672211 10853400 10114186 9443419 8837986 8292098 7794264 7336739 6918361 6535934
55901F535934l54158l29919l04051k79091k59829k43334k24530k05926j92372
$$ 6535934 6181776 5851857 5547806 5268715 5008886 4765552 4541022 4335096 4142724
55892D142724j81494j68367j54724j44885j37119j27281j16798j09198j02725
$$ 4142724 3961230 3792863 3638139 3493254 3356135 3228854 3112056 3002858 2900133
55883B900133r3938q4904p9750p7679p5868p5443p8086q0572p9112p5625p3655
$$ 2900133 2806195 2721291 2641541 2563862 2487994 2412551 2334465 2253893 2174781 2099156 2025501
55872B025501p1925o7928o4015o3428o3745o0723n5556n2200n0395m7360m3720
$$ 2025501 1953576 1885648 1821633 1758205 1694460 1633737 1578181 1525981 1475586 1428226 1384506
55861A384506m1793m0454l7263l3445l1384k9614k5582k1018j9256j9377j8271
$$ 1384506 1342713 1302259 1264996 1231551 1200167 1170553 1144971 1123953 1104697 1085320 1067049
55850A067049j6434j6623j8497j9570j9861k1009k2364k2295k1724k2239k2525
$$ 1067049 1050615 1033992 1015495 995925 976064 955055 932691 910396 888672 866433 843908
55839H43908k0744j8435j7894j7845j5943j3463j3007j3616j2651j0732j0209
$$ 843908 823164 804729 786835 768990 753047 739584 726577 712961 700310 689578 679369
55828F79369j0439r160p080o563p116o612n705o645q793r726r719j0773j2184
$$ 679369 668930 659770 652690 646127 639011 632399 626694 620049 611256 601530 591811 581038 568854
55815E68854j1514r300q390r002q632o663n039m423l415j651l01N97K144M012
$$ 568854 557340 548040 539650 530648 522016 515353 510314 505891 502476 500825 500524 501121 503265 507277
55801E07277M802M741N191N891N488M306L634K894M93k926n099n606n946o553
$$ 507277 512079 516820 522011 527902 533390 537696 541330 544224 544717 541791 536692 531086 525140 518587
55787E18587o552o071o042o137n562n366p201j0332j2603j3751j4947j5748j4576
$$ 518587 512035 505964 499922 493785 488223 482857 475656 465324 452721 438970 424023 408275 393699
55774C93699j1892r820q720p074m623k864k311j933j373j319j686j742j854k884
$$ 393699 381807 371987 363267 356193 351570 348706 346395 344462 343089 341770 340084 338342 336488 333604
55760C33604m116m149l496l858n189n977o078o772q206r383j0431j2221j3846
$$ 333604 329488 325339 321843 317985 312796 306819 300741 293969 285763 276380 265949 253728 239882
55747B39882j3171j0060o636m228k395r44m64o47l56L85N23R3J09M72J97m38k11
$$ 239882 226711 216651 210015 205787 203392 202448 201984 201337 200981 201366 201889 201982 202091 202563 202760 202322 202111
55730B02111O31O56q3j07O78O75o08j811k138k322k733k645j817j000n42k05l92
$$ 202111 202742 203398 203315 203208 203886 204561 203953 202142 200004 197682 194949 192304 190487 189487 188945 188740 188348
55713A88348j638k895k428n14Q35Q91P84J021P70N4K36J568K371J461l65j913
$$ 188348 186710 183815 181387 180873 181708 182599 183383 184404 185174 185228 185464 187032 189403 190864 190499 188586
55697A88586l000l653l526k750k047j600j029m96m70n04J78J048R62K72L40J112
$$ 188586 185586 181933 178407 175657 173610 172010 170981 170485 170015 169511 169689 170737 171699 171971 172311 173423
55681A73423J389J278K061L489L715K368J239J314J453P99K68O44J215J343J519
$$ 173423 174812 176090 178151 181640 185355 187723 188962 190276 191729 192528 192796 193440 194655 195998 197517
55666A97517J986J985J295Q38R27O39k88o42K15J194J312J102J237J294Q84N91
$$ 197517 199503 201488 202783 203621 204548 205187 204899 204257 204472 205666 206978 208080 209317 210611 211495 212086
55650B12086P57O99M8n09o83j347k863m056l982l453l674m458m890m839m759m803
$$ 212086 212843 213542 213590 213081 212398 211051 208188 204132 200150 196697 193023 188565 183675 178836 174077 169274
55634A69274m954n262n285m233k290q40p41j358j777j933j935j548r56r32j485
$$ 169274 164320 159058 153773 149540 147250 146410 145669 144311 142534 140601 138666 137118 136162 135230 133745
55619A33745j501m39P00Q98M14j83j077k335l073k607j544q45n64m04o01j243
$$ 133745 132244 131805 132505 133403 133817 133634 132557 130222 127149 124542 122998 122153 121589 121185 120584 119341
55603A19341j525p74L54O53n4r34j315j143o68l14n15j163j599j421q82k61M86
$$ 119341 117816 117042 117396 118049 117995 117061 115746 114603 113935 113621 113106 111943 110344 108923 108041 107780 108266
55586A08266J184J319Q83N82P92J051R95J017J467J968K120K225K715L439M120
$$ 108266 109450 110769 111652 112234 113026 114077 115072 116089 117556 119524 121644 123869 126584 130023 134143
55571A34143N036O573Q351R393R061P619N922M542L166J064j641l747m452m447
$$ 134143 139179 145752 154103 163496 172557 180176 186098 190640 193806 194870 193229 189482 185030 180583
55557A80583m799n425n666n698o069o278n413l911l131l243l081k217j520j437
$$ 180583 175784 170359 164693 158995 152926 146648 141235 137324 134193 130950 127869 125652 124132 122695
55543A22695j253n28K30O89J140J454J016J07q7O50J127O81P2j07m20j231j808
$$ 122695 121442 120914 121144 121833 122973 124427 125443 125550 125463 126113 127240 127921 127993 127886 127466 126235 124427
55526A24427j586j140j091j212j311j801k630k846k055j184j049j256j274j412
$$ 124427 122841 121701 120610 119398 118087 116286 113656 110810 108755 107571 106522 105266 103992 102580
55512A02580j968k460k500k377k151j322o6M75r6o79m63j96o82j313j204o88n02
$$ 102580 100612 98152 95652 93275 91124 89802 89736 90211 90115 89436 88973 88777 88095 86782 85578 84890 84388
55495H4388n19l10j46l65n74m35l77o29n04M35J428J664J461J388J189N45p4k72
$$ 84388 83869 83559 83413 83048 82474 82039 81662 81033 80529 80964 82392 84056 85517 86905 88094 88639 88565 88293
55477H8293m85q88o18Q07K253K368J397M12l87j364k197k247j671j134q30o48
$$ 88293 87808 86920 86302 87109 89362 91730 93127 93539 93152 91788 89591 87344 85673 84539 83709 83061
55461H3061o22n40J34J153J296J67q95o78K00N28L16J37k04j006j576j238n51
$$ 83061 82439 81899 82033 83186 84482 84649 83754 83076 83276 83804 84120 84257 84053 83047 81471 80233 79682
55444G9682k35J54J067J576P50n11p96m41o35j057m63Q08J147L07k73J61Q20J052
$$ 79682 79447 79601 80668 82244 82994 82483 81687 81246 80611 79554 79091 79899 81046 81353 81080 81241 82061 83113
55426H3113J175J331J107N73M04O68P04L86L24O67R26J023J317J519Q78l46r46
$$ 83113 84288 85619 86726 87299 87703 88371 89075 89461 89785 90452 91378 92401 93718 95237 96115 95769 94823
55409I4823n31o9k80p15q15q49j229j717j881j693j339r22n42k92q8J33J65j6
$$ 94823 94292 94223 93943 93228 92413 91564 90335 88618 86737 85044 83705 82783 82241 81949 81861 81994 82159 82143
55391H2143L8N25Q10L92p9L82J567K413K476K024J035n64j919j888p69o7m43j016
$$ 82143 82181 82706 83516 83908 83829 84211 85778 88191 90667 92691 93726 93162 91243 89355 88586 88519 88076 87060
55373H7060r50n23k88k61k81l47k70K08P62P14R5l44k96k69o20j049j240j272
$$ 87060 86110 85587 85299 85038 84757 84410 84140 84348 85110 85824 85919 85575 85279 85010 84390 83341 82101 80829
55355H0829j169p49r2M31O49O12L09p0Q7R50J515P67o86j271o16J69K63m6m03
$$ 80829 79660 78911 78819 79250 79899 80511 80820 80750 80837 81787 83302 84069 83383 82112 81496 81665 81928 81882 81479
55336H1479q58j118n79M46P66Nq07p51j11M96R75J227Q12j72p42k96N21P69L92
$$ 81479 80621 79503 78924 79370 80136 80141 79334 78583 78472 78968 79943 81170 81982 81810 81068 80772 81293 82062 82454
55317H2454j25n51p78n53O3N12N34N85R82J253R05K89M7J33j7n58j071j183r32
$$ 82454 82329 81778 81000 80447 80510 81022 81556 82141 83123 84376 85281 85570 85617 85750 85733 85175 84104 82921 81989
55298H1989n85l28j11K63P78J064Q39M28L65O58Q24O03J48l85q06o96J46J110
$$ 81989 81404 81076 80965 81228 82006 83070 83909 84337 84702 85360 86184 86787 86935 86550 85744 85048 85194 86304
55280H6304J365R70O80P35P04M85M68N80J86p67j389j033j05O85J062Q86l0j299
$$ 86304 87669 88639 89319 90054 90758 91243 91711 92291 92477 91710 90321 89288 89183 89868 90930 91816 91786 90487
55262I0487j887j259j01N90O18L96J54j51n01q06j010j024q53p75j017j181o60
$$ 90487 88600 87341 87240 87830 88448 88844 88998 88847 88346 87540 86530 85506 84653 83878 82861 81680 81020
55245H1020L68R99Q28L91J74l9n04q78p49k57K14N72Q49R22P25M09R9k10l91k62
$$ 81020 81388 82387 83215 83606 83780 83741 83237 82359 81610 81353 81567 82139 82988 83910 84635 85044 85143 84933 84542 84280
55225H4280Nk3l88o42m31J85R09J271P03p23j840j526k43N06K18j43J46N56L71
$$ 84280 84285 84262 83874 83232 82801 82986 83895 85166 85869 85146 83306 81780 81537 82043 82261 82118 82264 82820 83191
55206H3191k35p68j172j496j467r56k52M51J251J983K165J778J345J011L82m38
$$ 83191 82956 82188 81016 79520 78053 77097 76845 77296 78547 80530 82695 84473 85818 86829 87211 86773
55190H6773o71j15L49O3m47m42p6P7o6k80m64m41oN03M28m6Q1R88J555J079L17
$$ 86773 86102 85987 86336 86399 85952 85510 85434 85511 85445 85165 84701 84260 84254 84757 85185 85139 85220 86208 87763 88842 89159
55169H9159J13J29j14j64K64K92o37j280k71J463J755L37q36m76N36Q28L05l44
$$ 89159 89272 89401 89287 89123 89387 89679 89042 87762 87491 88954 90709 91046 90210 89734 90270 91098 91403 91059
55151I1059p94j025q90l79J06K06R2J81N91R94R53L89k22l07K0R4l02n73l45j70
$$ 91059 90265 89240 88350 87971 88077 88283 88375 88556 89147 90141 91094 91483 91261 90954 90974 91068 90766 90193 89848 89678
55131H9678o17j238j226o35j31J16L77N14J45m40m33L32J119J346J222J196J323
$$ 89678 89061 87823 86597 85962 85831 85947 86324 86838 86983 86543 86110 86442 87561 88907 90129 91325 92648
55114I2648J386J191O37j65q09r27n76o8L14K68m17j254j110L97J984K056P09
$$ 92648 94034 95225 95862 95697 94888 93961 93385 93317 93631 93899 93482 92228 91118 91515 93499 95555 96264
55097I6264m75n15R2N53P67Q10L93n59j361j246k86P51J262J222R75Q17P54N20
$$ 96264 95789 95274 95366 95919 96686 97496 97889 97330 95969 94723 94437 95188 96450 97672 98647 99464 100218 100738
55079A00738n2o67p49p0R38J551J402Q28N79J001J558J397M77l32m18j94l36p78
$$ 100738 100686 100019 99270 99200 100138 101689 103091 103919 104498 105499 107057 108454 108931 108599 108181 107987 107651 106873
55061A06873r81p94n14l26k82n68j182j570j144j26P29J084J106Q09K6r22j337
$$ 106873 105892 105098 104584 104258 103976 103408 102226 100656 99512 99386 100115 101199 102305 103114 103140 102218 100881
55044A00881j065p01o54n63J0P69J035O97L40M61P93O58j11q37q03j67K51K8m98
$$ 100881 99816 99115 98461 97898 97908 98677 99712 100409 100749 101210 102003 102661 102550 101713 100910 100743 100994 101022 100524
55025A00524q93j079r62l62L82M64k51p85l74L92M92k7l75l69m43n73k39N34J092
$$ 100524 99631 98552 97590 97228 97610 98074 97823 97038 96664 97056 97548 97521 97146 96777 96334 95761 95522 96056 97148
55006I7148J125R80Q31N10J83M22J211J698J273L61k43l19j43J08M37P25O64J2
$$ 97148 98273 99253 100084 100594 100777 101199 102410 104108 105381 105742 105499 105180 105037 105145 105582 106307 106971 106983
54988A06983j066j858j573k56R77J094L10l41l61j00J83O73J351J652J122j7j147
$$ 106983 105917 104059 102486 102230 103207 104301 104611 104270 103909 103809 103992 104665 106016 107668 108790 108773 107626
54971A07626j726j459m61O86J408J635J564J099J37p84q66j01P57J281J688K022
$$ 107626 105900 104441 103980 104666 106074 107709 109273 110372 110509 109725 108859 108758 109515 110796 112484 114506
54955A14506J819R24l0m20l49l06n43j004j439j415p25J01K33l76q81p09j42L69
$$ 114506 116325 117249 117219 116799 116450 116144 115601 114597 113158 111743 111018 111119 111352 110976 110095 109386 109244 109613
54937A09613P49Q79M58l19o63k55K32K42K18P98J707K245K355K438K524K404K349
$$ 109613 110362 111241 111699 111380 110717 110462 110694 110936 111154 111952 113659 115904 118259 120697 123221 125625 127974
54920A27974K886L962M966N526N688N383M407K930J448J69j120k472l586m295
$$ 127974 130860 134822 139788 145314 151002 156385 160792 163722 165170 165339 164219 161747 158161 153866
54906A53866m806n275n464n026l973k716j726j194r37o92n29p98j495j983j625
$$ 153866 149060 143785 138321 133295 129322 126606 124880 123686 122749 122057 121528 120730 119235 117252 115627
54891A15627n34O04J227J180N70j57k71N30J570J948J789K079L139M082M098L596
$$ 115627 115093 115697 116924 118104 118674 118517 118246 118776 120346 122294 124083 126162 129301 133383 137481 141077
54875A41077L476L802L948L675L312K913K057O07r83k290l356m206m552m269l755
$$ 141077 144553 148355 152303 155978 159290 162203 164260 164867 163884 161594 158238 154032 149480 145211 141456
54860A41456l372k961k349j904k029k406k409k092j986k055j720r92o76j170j803
$$ 141456 138084 135123 132774 130870 128841 126435 124026 121934 119948 117893 116173 115181 114505 113335 111532
54845A11532j852j474j120p40j80K01N5k21j9M74N96K88P7Q8q8n23o88l08J92
$$ 111532 109680 108206 107086 106346 106166 106367 106422 106201 106182 106656 107252 107540 107617 107705 107617 107094 106406 106098 106290
54826A06290L24Q8k55n74p66o96m52l00k94k53j26m8Q3N90J407J903J588P42J08
$$ 106290 106614 106702 106447 105873 105107 104411 103959 103659 103365 103112 102986 102938 103021 103611 105018 106921 108509 109251 109359
54807A09359Q4M00M78Q7l17q8O56R54K77n37l49N95R61L22k31J69Q31O21l30r09
$$ 109359 109443 109843 110321 110408 110091 110003 110659 111613 111890 111353 111004 111599 112560 112882 112651 112820 113651 114272 113942 113033
54787A13033o79l03m17p66o75L8Q61J138P01Q4J7P07J619K087J936J496J243J504
$$ 113033 112354 112051 111634 110868 110193 110231 111092 112230 112931 113015 113032 113739 115358 117445 119381 120877 122120 123624
54769A23624K261L120L665M047M810N975O671O129M737L646L348L173K264N63
$$ 123624 125885 129005 132670 136717 141527 147502 154173 160302 165039 168685 172033 175206 177470 178033
54755A78033j375l132m619n710o158n924n304m543l651k710k102k037k103j735
$$ 178033 176658 173526 168907 163197 157039 151115 145811 141268 137617 134907 132805 130768 128665 126930
54741A26930r89m00j33J43M48L36k28m55K30J320J882J698J204O97K70J73N89
$$ 126930 125941 125541 125408 125551 125999 126335 126107 125652 125882 127202 129084 130782 131986 132683 132953 133126 133715
54724A33715J321K139L137M189M596M034L327L311L391K401N65o85r13j196k255
$$ 133715 135036 137175 140312 144501 149097 153131 156458 159769 163160 165561 166126 165441 164528 163332 161077
54709A61077l383l751l607l474l236k741k440k625k768k355j728j409j260j007
$$ 161077 157694 153943 150336 146862 143626 140885 138445 135820 133052 130697 128969 127560 126300 125293
54695A25293r13j157j175n42R1j33q85j127o93l47m16m10r5N2k46m91j28O51J135
$$ 125293 124380 123223 122048 121506 121597 121464 120579 119452 118759 118412 117996 117586 117491 117543 117297 116806 116678 117329 118464
54676A18464R10J62n48p18l13J54J57k85p28q99q71p39m67r1J95K29Q8k0N4K82
$$ 118464 119374 119536 118988 118270 117957 118111 118268 117983 117255 116356 115485 114746 114279 114188 114383 114612 114700 114680 114734 115016
54656A15016M77M55J84k12n59o27k65L37O51M46J12j9l11j180k012j690k37J037
$$ 115016 115493 115948 116132 115920 115361 114734 114469 114806 115457 115903 116015 115996 115685 114505 112493 110803 110566 111603
54638A11603J239Q45O22O04O15Q51J216R29l19j503j515o93j69j89j41J63L70
$$ 111603 112842 113687 114309 114913 115528 116379 117595 118524 118205 116702 115187 114494 114325 114136 113995 114158 114528
54621A14528N51J135J783J489O7j320j514o08M33R18Q05L50k64r77j647j840j114
$$ 114528 115079 116214 117997 119486 119553 118233 116719 116111 116544 117462 118267 118617 118353 117376 115729 113889 112775
54604A12775K80J345J446J062J008J246J146N89O1k05m27o13m69n0K25L00N63
$$ 112775 113055 114400 115846 116908 117916 119162 120308 120897 120958 120753 120326 119713 119244 119194 119419 119719 120282
54587A20282J016J009J19j158j886j564m72O43J139J052J001J308J480R61J07
$$ 120282 121298 122307 122426 121268 119382 117818 117346 117989 119128 120180 121181 122489 123969 124930 125037
54572A25037k84j91l28q79j151o86K1K68M2k11k92l27m62p00q74p03j21M80O89
$$ 125037 124753 124562 124234 123355 122204 121518 121539 121807 121849 121638 121346 121019 120557 119857 118983 118280 118159 118639 119328
54553A19328O52Q42J324J671J593J157M99j36k73K64P87M88k69k76P35J631J466
$$ 119328 119980 120822 122146 123817 125410 126567 127066 126930 126657 126921 127708 128196 127927 127651 128386 130017 131483
54536A31483O66J50J38L39O59R55P29k45j296j618j294j036j106j153q98m76r0
$$ 131483 132149 132299 132437 132776 133435 134390 135119 134874 133578 131960 130666 129630 128524 127371 126473 125997 125907
54519A25907K38N34Q29J126J268J015L83l04q48j310j597j364o47o0j0j29P6M31
$$ 125907 126145 126679 127508 128634 129902 130917 131300 130996 130148 128838 127241 125877 125230 125170 125160 125031 125107 125538
54501A25538N23M71O55Q96O70m2o49p20l02M35J291J786J420L52o68j165j323
$$ 125538 126061 126532 127187 128083 128753 128711 128062 127342 127040 127475 128766 130552 131972 132324 131656 130491 129168
54484A29168j366j058j45J022J671J386M96k49k94L23J107J613J732J587J324
$$ 129168 127802 126744 126599 127621 129292 130678 131174 130925 130631 130954 132061 133674 135406 136993 138317
54469A38317J172J405J918K106J536O70L59O66P16k1q58p77J67Q26L31r75k019
$$ 138317 139489 140894 142812 144918 146454 147124 147483 148149 148865 148844 147986 147209 147376 148202 148533 147558 145539
54452A45539k121j430n90k36o63j617k361k218j209k3O22N48j9p84j431j545r67
$$ 145539 143418 141988 141398 141162 140499 138882 136521 134303 133094 133071 133693 134241 134222 133438 132007 130462 129495
54435A29495j10M26N92Q53J372J625J148L12o8K50P27Q07N56L90M93O83P22N28
$$ 129495 129385 129811 130403 131256 132628 134253 135401 135713 135645 135895 136622 137429 137985 138375 138868 139551 140273 140801
54417A40801J41l18o39n92j63L58N93M23K1l80o60p67o50l37P1N58J188J793J864
$$ 140801 140942 140624 139985 139393 139230 139588 140181 140604 140625 140245 139585 138818 138168 137831 137902 138460 139648 141441 143305
54398A43305J068j85j006q79q8P59J346J669J714J390P71J61j57j67RL34Q19J253
$$ 143305 144373 144188 143182 142303 142215 142974 144320 145989 147703 149093 149864 150025 149868 149701 149710 150044 150863 152116
54380A52116J238O83Q6R3P09J351J639J761J946K017J771J483J593K062K450K484
$$ 152116 153354 154037 154123 154216 154925 156276 157915 159676 161622 163639 165410 166893 168486 170548 172998 175482
54364A75482K262J945J579J140N21l94j373j890j842j888k567l349l229k079p44
$$ 175482 177744 179689 181268 182408 182929 182535 181162 179272 177430 175542 172975 169626 166397 164318 163574
54349A63574J15N25M89k78j588k525k489j999j916k278k385j757n75N85J107O70
$$ 163574 163689 164214 164703 164425 162837 160312 157823 155824 153908 151630 149245 147488 146913 147498 148605 149275
54333A49275l66j078q64q3M20K60k45n71m05K22R09J138Q07L36O8j98p31j249
$$ 149275 148909 147831 146967 146884 147304 147564 147319 146748 146343 146565 147474 148612 149419 149755 149823 149625 148894 147645
54315A47645j263q80o90q55q46l12K95L48%JN70R63N00l91o79j88J62k63q73q16
$$ 147645 146382 145502 144812 143957 143111 142799 143094 143442 143442 143443 144013 144976 145476 145085 144406 144218 144380 144117 143244 142428
54295A42428k40J48L63R49J707J760J064P16J263J730J108q7n99k53M2k89r39
$$ 142428 142188 142336 142699 143648 145355 147115 148179 148895 150158 151888 152996 152909 152310 152057 152099 151810 150871
54278A50871j475j762j661j067l07J14K28N17J086J574J793J927J976J704J213
$$ 150871 149396 147634 145973 144906 144599 144713 144941 145458 146544 148118 149911 151838 153814 155518 156731
54263A56731R34R04O66J71M7N92J155J045N38L56M57J55o37j088n58N14J152R41
$$ 156731 157665 158569 159235 159406 159453 160045 161200 162245 162783 163139 163596 163751 163114 162026 161468 161982 163134 164075
54245A64075K74l00n92o58n32k02K00M22K50l35j134j793j979j602r17k64K49
$$ 164075 164349 164049 163457 162799 162267 162065 162265 162687 162937 162602 161468 159675 157696 156094 155177 154913 155162
54228A55162O33P03J65q08j426j058l4O29L82l09o37m29j79k65m27k16K59L41
$$ 155162 155795 156498 156663 155855 154429 153371 153337 153966 154348 154039 153402 152973 152794 152529 152102 151886 152145 152486
54210A52486l14j168j351o46L46J000J178R70L42n93j322j335o94N1M52M41J55
$$ 152486 152172 151004 149653 149007 149353 150353 151531 152501 152843 152250 150928 149593 148899 148950 149402 149843 149998
54193A49998k14m63m51k13J48N50Q76R61Q27P00O44L95j50n56l28M10J139J663
$$ 149998 149784 149321 148870 148657 148805 149355 150231 151192 152019 152719 153363 153758 153608 153052 152724 153134 154273 155936
54175A55936K067K054J124l97j216n08Q82J296J86j343j895j238k17L81M98M47
$$ 155936 158003 160057 161181 160784 159568 159060 159942 161238 161424 160081 158186 156948 156731 157112 157610 158057
54159A58057L43R3k33l63k10o6k43o68r75q57k67N66J071O23p35j920j740k83
$$ 158057 158400 158493 158260 157897 157687 157621 157378 156710 155735 154878 154611 155177 156248 156871 156136 154216 152476 152193
54141A52193J060J156L24l70n02m54m83l21J64O17P53Q34J135J284P12m07j226
$$ 152193 153253 154409 154733 154363 153861 153407 152924 152603 152767 153384 154137 154971 156106 157390 158102 157695 156469
54124A56469j315j105j017o74M45J975K880K703K022J554J404J405J730K565L463
$$ 156469 155154 154049 153032 152358 152803 154778 157658 160361 162383 163937 165341 166746 168476 171041 174504
54109A74504L605K821J877J632K128K671K577J658K18j139j790j579j042r27j402
$$ 174504 178109 180930 182807 184439 186567 189238 191815 193473 193691 192552 190762 189183 188141 187214 185812
54094A85812j929k041j887j820j769j501j273j592k301k530j779n19N84J447K153
$$ 185812 183883 181842 179955 178135 176366 174865 173592 172000 169699 167169 165390 164871 165455 166902 169055
54079A69055K310J588N69K09N49P11K53k65k32K02O23J038J566J900J641Q94J76
$$ 169055 171365 172953 173522 173731 174280 174991 175244 174979 174747 174949 175572 176610 178176 180076 181717 182611 182787
54062A82787k13l64m53n05m42k13Q3K06Q9J11Q04K150L483M180M168L716L066
$$ 182787 182574 182210 181757 181252 180810 180597 180680 180886 180975 181086 181890 184040 187523 191703 195871 199587 202653
54045B02653K445K086K033K183K599L429M482N290N753O243O863P115O578N583
$$ 202653 205098 207184 209217 211400 213999 217428 221910 227200 232953 239196 246059 253174 259752 265335
54031B65335M891M944N624O339O235M932L190K239K174J835O60k39L34J758K386
$$ 265335 270226 275170 280794 287133 293368 298300 301490 303729 305903 307738 308398 308159 308493 310251 312637
54016C12637J709O28k06j141k496l839m666n059n338n496n376n040m701m485m349
$$ 312637 314346 314974 314768 313627 311131 307292 302626 297567 292229 286733 281357 276317 271616 267131 262782
54001B62782m143l806l536l559l612l137k209j685j921k049j268k62k89j249j858
$$ 262782 258639 254833 251297 247738 244126 240989 238780 237095 235174 233125 231857 231595 231306 230057 228199
53986B28199j561j030p61m86k22n58j345j304K76K356L491L623L601L693L558
$$ 228199 226638 225608 224847 224361 224139 223581 222236 220932 221208 223564 227055 230678 234279 237972 241530
53971B41530L300L396L630L056J234j161l138m278m668m480l912l248k721k357
$$ 241530 244830 248226 251856 254912 256146 254985 251847 247569 242901 238421 234509 231261 228540 226183
53957B26183k059j719j246n71K68J096J666J805J572J237J112J312J711K086K258
$$ 226183 224124 222405 221159 220588 220856 221952 223618 225423 226995 228232 229344 230656 232367 234453 236711
53942B36711K189K035K022K213K508K934L672M525M752L907K632K059K458L033
$$ 236711 238900 240935 242957 245170 247678 250612 254284 258809 263561 267468 270100 272159 274617 277650
53928B77650L134L100L631M723N662N930N788O016P047Q380Q974Q368P270O724
$$ 277650 280784 283884 287515 292238 297900 303830 309618 315634 322681 331061 340035 348403 355673 362397
53914C62397O945P384P728Q167Q632Q510P461O022N026M561L891K332M8k020l051
$$ 362397 369342 376726 384454 392621 401253 409763 417224 423246 428272 432833 436724 439056 439104 437084 434033
53899D34033l164l144l305l142k448k206l526n950p790q119p599p222p118p015
$$ 434033 430869 427725 424420 421278 418830 416624 413098 407148 399358 391239 383640 376418 369300 362285
53885C62285p029p394p891q088p805p136o234n324m617m121l804l824m157m270
$$ 362285 355256 347862 339971 331883 324078 316942 310708 305384 300767 296646 292842 289018 284861 280591
53871B80591l814l425l854m549m309l323l109l991m337l064j449j199k000k365
$$ 280591 276777 273352 269498 264949 260640 257317 254208 250217 245880 242816 241367 240168 238168 235803
53857B35803k016j805j915j748j325j264j449j129m19l57j228k000j821j037m01
$$ 235803 233787 231982 230067 228319 226994 225730 224281 223152 222733 222376 221148 219148 217327 216290 215889
53842B15889p3Q3Ql45q05j232j611j724j275l79N28J237J676J481M42o95q10R1
$$ 215889 215816 215899 215907 215562 214757 213525 211914 210190 208915 208536 209064 210301 211977 213458 213900 213205 212395 212486
53824B12486Q59Q60O85R52J370J502J488J461J052K11k07M78J739K602K988L419
$$ 212486 213345 214205 214890 215842 217212 218714 220202 221663 222715 222926 222719 223197 224936 227538 230526 233945
53808B33945L906M028L867L914M171M218M126M457N227N728N612N425N691O092
$$ 233945 237851 241879 245746 249660 253831 258049 262175 266632 271859 277587 283199 288624 294315 300407
53794C00407N985N283M359L407K380J402P90P41J193J840K112J404k72k034k964
$$ 300407 306392 311675 316034 319441 321821 323223 324013 324754 325947 327787 329899 331303 331031 328997 326033
53779C26033l068l071l336l621l877m557n731o533o154n040m423m748n254n092
$$ 326033 322965 319894 316558 312937 309060 304503 298772 292239 286085 281045 276622 271874 266620 261528
53765B61528m233l108k024j244j153j835k734l160k992k639k444k419k358k009
$$ 261528 257295 254187 252163 250919 249766 247931 245197 242037 239045 236406 233962 231543 229185 227176
53751B27176j299n88m68j014j562j543j239j284j621j538p00M27J176J263P23
$$ 227176 225877 225289 224821 223807 222245 220702 219463 218179 216558 215020 214320 214747 215923 217186 217909
53736B17909k30j074j207n83J20K77Rj06K07P58J295J717J899J664J058N14N57
$$ 217909 217679 216605 215398 214815 214935 215212 215221 215115 215322 216080 217375 219092 220991 222655 223713 224227 224784
53719B24784J294K286K920K851K163J242N30K62L11L87M86R46J862K693K835K463
$$ 224784 226078 228364 231284 234135 236298 237540 238070 238332 238643 239030 239516 240462 242324 245017 247852 250315
53703B50315K278K442K340J645R91J184K098K850K901K587K618L324M254M418
$$ 250315 252593 255035 257375 259020 260011 261195 263293 266143 269044 271631 274249 277573 281827 286245
53689B86245L214J288N1Q8M26j09j323k007j572n67K55O65O80K72m09r68j189
$$ 286245 289459 290747 290798 290886 291312 291203 289880 287873 286301 285734 285989 286654 287334 287606 287197 286229 285040
53672B85040j198j086p43j72L57N93N28K78l0j96q0J39R7k77n74l41M15J173J294
$$ 285040 283842 282756 282013 281841 282198 282791 283319 283597 283567 283371 283291 283430 283527 283250 282676 282335 282750 283923 285217
53653B85217O52j41l35J21N52N00K04rj76j94M02J536K135J521P20J258K888L813
$$ 285217 285869 285728 285393 285514 286066 286566 286770 286761 286585 286391 286793 288329 290464 291985 292705 293963 296851 300664
53635C00664L155J980J552J776J948J995K201K344J948J094M03M58J481L133M398
$$ 300664 303819 305799 307351 309127 311075 313070 315271 317615 319563 320657 321060 321518 322999 326132 330530
53620C30530M242K774J293P93R95J178J356J908K649L083L254L601M115M314L982
$$ 330530 334772 337546 338839 339632 340627 341805 343161 345069 347718 350801 354055 357656 361771 366085 370067
53605C70067L362K682K038J707J999K687L046K610J606N50j98m91l17P3K16j64
$$ 370067 373429 376111 378149 379856 381855 384542 387588 390198 391804 392354 392156 391665 391348 391421 391637 391473
53589C91473p72j034p80n94j180k381l145k715j541o59m03l82m63r93j880k359
$$ 391473 390701 389667 388887 388293 387113 384732 381587 378872 377331 376672 376269 375887 375424 374431 372551 370192
53573C70192k027j436j194j119q00l94k22m3M89R87P84Q4j83L61J075J236Q41
$$ 370192 368165 366729 365535 364416 363616 363222 363000 362957 363446 364433 365217 365301 365118 365479 366554 367790 368631
53556C68631K72l03q18r99n01O44J923K721K756K185J355N65J62N37J721K973
$$ 368631 368903 368600 367782 366783 366282 366926 368849 371570 374326 376511 377866 378431 378593 379130 380851 383824
53540C83824L346K768K197K424L237L973M453M958N632O323O893P331P725Q330
$$ 383824 387170 389938 392135 394559 397796 401769 406222 411180 416812 423135 430028 437359 445084 453414
53526D53414R316J0356J0853J0810J0971J1776J2808J3572J4170J4706J4767J4288
$$ 453414 462730 473086 483939 494749 505720 517496 530304 543876 558046 572752 587519 601807
53514F01807J4221J5419J7336J8841J9914K1378K3200K4340K4322K3836K3524
$$ 601807 616028 631447 648783 667624 687538 708916 732116 756456 780778 804614 828138
53503H28138K3217K2663K2044K1441K0603J9626J9063J8966J8612J7617J6648
$$ 828138 851355 874018 896062 917503 938106 957732 976795 995761 1014373 1031990 1048638
53492A048638J6488J7005J7454J7304J6410J5016J3961J4274J5962J7704J8288
$$ 1048638 1065126 1082131 1099585 1116889 1133299 1148315 1162276 1176550 1192512 1210216 1228504
53481A228504J7869J7367J7111J6753J6042J5051J3833J2395J0814Q987O584L592
$$ 1228504 1246373 1263740 1280851 1297604 1313646 1328697 1342530 1354925 1365739 1374726 1381310 1384902
53469A384902O05j917m222o615q701r948j0626j1409j2282j2620j2271j1827j1728
$$ 1384902 1385507 1383590 1379368 1372753 1364052 1354104 1343478 1332069 1319787 1307167 1294896 1283069 1271341
53456A271341j1843j2103j2941j4787j7439k0095k1795k1898k0518j8561j7022
$$ 1271341 1259498 1247395 1234454 1219667 1202228 1182133 1160338 1138440 1117922 1099361 1082339
53445A082339j6204j5753j5283j4536j3234j1260q956o751m593k287k76O17K90
$$ 1082339 1066135 1050382 1035099 1020563 1007329 996069 987113 980362 975769 973482 973206 973823 974113
53432I74113m60r83j271j206j84J998M456O075O767P349Q450J0057J1903J3781
$$ 974113 973653 972670 971399 970193 970009 972007 976463 982538 989305 996654 1005104 1015161 1027064 1040845
53418A040845J5476J6887J8087J9120J9835K0244K0782K1853K3253K4525K5650
$$ 1040845 1056321 1073208 1091295 1110415 1130250 1150494 1171276 1193129 1216382 1240907 1266557
53407A266557K6962K8414K9599L0506L1682L3424L5320L6935L8544M0681M3226
$$ 1266557 1293519 1321933 1351532 1382038 1413720 1447144 1482464 1519399 1557943 1598624 1641850
53396A641850M5456M6964M8063M9192N0259N0897N1081N1165N1240N0880M9685
$$ 1641850 1687306 1734270 1782333 1831525 1881784 1932681 1983762 2034927 2086167 2137047 2186732
53385B186732M7940M6338M5101M3750M1803L9383L6859L4158L0925K7220K3594
$$ 2186732 2234672 2281010 2326111 2369861 2411664 2451047 2487906 2522064 2552989 2580209 2603803
53374B603803K0299J6823J2455P154J610l514q200j3000j8411k4361l0265l5517
$$ 2603803 2624102 2640925 2653380 2660534 2662144 2658630 2650430 2637430 2619019 2594658 2564393 2528876
53362B528876l9873m3369m5992m7607m8144m7765m6815m5754m4968m4481m3867
$$ 2528876 2489003 2445634 2399642 2352035 2303891 2256126 2209311 2163557 2118589 2074108 2030241
53351B030241m2645m0767l8595l6528l4816l3681l3267l3529l4295l5369l6197
$$ 2030241 1987596 1946829 1908234 1871706 1836890 1803209 1769942 1736413 1702118 1666749 1630552
53340A630552l5764l3412k9755k6196k3487k1365j9632j8616j8170j7135j4711
$$ 1630552 1594788 1561376 1531621 1505425 1481938 1460573 1440941 1422325 1404155 1387020 1372309
53329A372309j1779r928r577r913j0463j1616j3556j5604j6945j7310j6789j5562
$$ 1372309 1360530 1350602 1341025 1331112 1320649 1309033 1295477 1279873 1262928 1245618 1228829 1213267
53317A213267j4082j2893j2013j0998r693q378p059n346l304j699r67o22q0N72
$$ 1213267 1199185 1186292 1174279 1163281 1153588 1145210 1138151 1132805 1129501 1127802 1126835 1126213 1126133 1126705
53303A126705J173K150L858N900P782R764J2203J4534J5903J6587J7660J9327
$$ 1126705 1127878 1130028 1133886 1139786 1147568 1157332 1169535 1184069 1199972 1216559 1234219 1253546
53291A253546K0635K1028K1187K1891K2834K3140K2471K1121J9470J7853J6561
$$ 1253546 1274181 1295209 1316396 1338287 1361121 1384261 1406732 1427853 1447323 1465176 1481737
53280A481737J5474J3883J1173P560L837N18k472n328p963j0094j1552j2517j3508
$$ 1481737 1497211 1511094 1522267 1529827 1533664 1534182 1531710 1526382 1518419 1508325 1496773 1484256 1470748
53267A470748j5044j7244j9821k2418k4718k6242k6528k5741k4798k4520k4826
$$ 1470748 1455704 1438460 1418639 1396221 1371503 1345261 1318733 1292992 1268194 1243674 1218848
53256A218848k4993k4608k3957k3563k3583k3673k3253k2061k0580j9735j9982
$$ 1218848 1193855 1169247 1145290 1121727 1098144 1074471 1051218 1029157 1008577 988842 968860
53245I68860k0793k1278k1176k0906k0777k0586k0047j9168j8041j6622j4962
$$ 968860 948067 926789 905613 884707 863930 843344 823297 804129 786088 769466 754504
53234G54504j3413j2319j1594j0812r695q325p006o137o098o969q287r388j0049
$$ 754504 741091 728772 717178 706366 696671 688346 681340 675203 669105 662136 653849 644461 634412
53221F34412j0633j1489j2439j3103j3491j3964j4591j4948j4629j3723j2586
$$ 634412 623779 612290 599851 586748 573257 559293 544702 529754 515125 501402 488816
53210D88816j1433j0291r274q554q134p874p687p595p583p650p963q697r644j0219
$$ 488816 477383 467092 457818 449264 441130 433256 425569 417974 410391 402741 394778 386081 376437 366218
53196C66218j0024r235q347p651p139o723o331n838n139m374l911l963m274m231
$$ 366218 356194 346959 338612 330961 323822 317099 310768 304930 299791 295417 291506 287543 283269 279038
53182B79038l403k004q76q14j769k766k786j804q10p01j329j794j604j159j056
$$ 279038 275635 273631 272755 271941 270172 267406 264620 262816 262006 261305 259976 258182 256578 255419 254363
53167B54363j234j170p53m74o40q05l76M07O34j14j159j491q94l6L71J79l82j063
$$ 254363 253129 251959 251206 250732 250092 249287 248911 249318 249952 249838 248679 247188 246294 246258 246629 246808 246426 245363
53149B45363j611j730j282n60j52m41j250j975k076j476n64K20P34J119J411J403
$$ 245363 243752 242022 240740 240180 240028 239587 238337 236362 234286 232810 232246 232466 233200 234319 235730 237133
53133B37133R71M15K26N35R85J187J111R51Q06O64N53N30N81P11J034J595K123
$$ 237133 238104 238519 238745 239280 240265 241452 242563 243514 244320 244984 245537 246067 246648 247359 248393 249988 252111
53116B52111K226J825J266R13P88O28K41l00p27q80q88j033j394j746j863j793
$$ 252111 254337 256162 257428 258341 259129 259757 259998 259698 258971 258091 257203 256170 254776 253030 251167 249374
53100B49374j644j369r19m54j16K56P69J014M62o21j272j017n28o91j463k092
$$ 249374 247730 246361 245442 244988 244872 245128 245897 246911 247373 246752 245480 244463 243935 243244 241781 239689
53084B39689k197k123k198k183j684p94q9P2p6r6k1k95j013j543j269m03L09N62
$$ 239689 237492 235369 233171 230988 229304 228510 228421 228493 228417 228321 228300 228005 226992 225449 224180 223777 224086 224648
53066B24648O09N41J09n72q75n80l09n82r24n09O09J536J709J375J041R02R09
$$ 224648 225257 225798 225907 225335 224460 223880 223571 222989 222065 221556 222165 223701 225410 226785 227826 228728 229637
53049B29637R84R93P97M50K09L11P84J345J485Q71j43p89p83o24p19p31k37M77
$$ 229637 230621 231614 232411 232861 233070 233381 234165 235510 236995 237866 237723 236934 236151 235527 234808 234077 233840 234317
53031B34317Q40Q88J008J121Q45L22M8l5l89q44o02M36J282J216P70P35R13N63
$$ 234317 235157 236045 237053 238174 239019 239341 239389 239354 238965 238121 237519 237955 239237 240453 241223 241958 242871 243434
53013B43434k84q16o41k94l94p89q72m36M7O3k75l82m4K51J9m57n01K3N67P15
$$ 243434 243150 242334 241693 241399 241005 240216 239344 238908 238955 239018 238743 238361 238317 238568 238587 238130 237629 237652 238219 238934
52993B38934O17N45M76L67M02P21J158J447J507J425J354J492J869K194K181K010
$$ 238934 239551 240096 240572 240939 241341 242062 243220 244667 246174 247599 248953 250445 252314 254508 256689 258699
52977B58699K019K022J472M53k18j32R3k35q52r88m83J62N90Q77J084J079Q29
$$ 258699 260718 262740 264212 264665 264447 264315 264408 264173 263321 262333 261850 262012 262602 263479 264563 265642 266471
52960B66471N56M39M16L04M2k24k98k29l64r22j609j988k111k355k666k560j995
$$ 266471 267027 267466 267882 268186 268228 268004 267706 267477 267113 266191 264582 262594 260483 258128 255462 252902 250907
52943B50907j524j356r62o6O51M61k57n14l4N74P53M96j5n85r45r46q16q32q63
$$ 250907 249383 248027 247065 246999 247650 248111 247854 247340 247306 247880 248633 249129 249114 248529 247584 246638 245822 244990 244127
52924B44127o05o5N75J317K006K005R19n23j110o45m8M8J0K53M74K19l45p33q54
$$ 244127 243522 243457 244032 245349 247355 249360 250279 249756 248646 248001 247953 248001 248011 248264 248738 248957 248612 247879 247025
52905B47025r44j087j138r34l44O11J510J710J068J83l22m66o13p69o54k61N3
$$ 247025 246081 244994 243856 242922 242578 243189 244699 246409 247477 247660 247338 246872 246259 245490 244836 244575 244628
52888B44628O8l7M7L82P03O96L71J86N20R95P80k42r49k20J545K798K690J973
$$ 244628 244696 244659 244706 245088 245791 246487 246858 247044 247564 248559 249339 249097 248148 247928 249473 252271 254961 256934
52870B56934J782K126K146J430N18O9J69N79J133J631J704J176L47m14j138j963
$$ 256934 258716 260842 262988 264418 264936 265005 265174 265753 266886 268517 270221 271397 271744 271330 270192 268229
52854B68229k630k744k516k611l167l541l228k609k405k720l040k952k484j838
$$ 268229 265599 262855 260339 257728 254561 251020 247792 245183 242778 240058 237018 234066 231582 229744
52840B29744j165n89k00K0J15M3k49p07j192j469j209k98P58J129O65J73L87R63
$$ 229744 228579 227990 227790 227810 227925 227968 227719 227012 225820 224351 223142 222844 223602 224731 225396 225569 225956 226919
52822B26919R98K81m64n55r3L24K67j94o17n88j73J96L09M43P87R68N89q7m99
$$ 226919 227917 228198 227734 227179 227086 227410 227677 227483 226866 226278 226105 226301 226610 227053 227840 228808 229397 229310 228811
52803B28811o02p34r04q39p02r63j530j789j619j646k087k141j104M39J232R13
$$ 228811 228209 227475 226571 225732 225030 224067 222537 220748 219129 217483 215396 213255 212151 212590 213822 214735
52787B14735L56N11J410K321K450J495j04j344j330n5J505K189J612L93n33q00
$$ 214735 215091 215602 217012 219333 221783 223278 223174 221830 220500 220445 221950 224139 225751 226144 225611 224811
52771B24811p71q58r49p29k79M5K08M79P78N42m45j534j851j254l00M87J000J314
$$ 224811 224040 223182 222233 221504 221225 221270 221478 221957 222735 223277 222832 221298 219447 218193 217893 218380 219380 220694
52753B20694J451J460J458J483J477J400J337J411J631J871J949J799J542J395
$$ 220694 222145 223605 225063 226546 228023 229423 230760 232171 233802 235673 237622 239421 240963 242358
52739B42358J437J532J458J121O63L39K58J93j84q10j134p28J44P60O94J13n86
$$ 242358 243795 245327 246785 247906 248569 248908 249166 249359 249175 248365 247231 246503 246647 247407 248101 248214 247628
52722B47628j119j264q69n5P03R50O17M6l80n69p27j032j261j009k55M65O77N17
$$ 247628 246509 245245 244376 244321 245024 245974 246591 246637 246257 245688 244961 243929 242668 241659 241404 241869 242546 243063
52704B43063L95L79K11j73n39o88n50r0N38Q53N39j9j63J35L14J33l4N5R6j87
$$ 243063 243458 243837 244048 243875 243336 242648 242098 242008 242546 243399 243938 243919 243756 243891 244205 244338 244304 244359 244455 244268
52684B44268n69p34p57q58r96r92q35n38o5M16M95J3n70o31n0O90J031Q35N13
$$ 244268 243699 242965 242208 241350 240354 239362 238527 237989 237924 238340 238835 238848 238278 237647 237597 238287 239318 240153 240666
52665B40666O57J333J862J608Q47L84L81K97M5L35J516K762L086K608K148J947
$$ 240666 241323 242656 244518 246126 246973 247357 247738 248035 248080 248415 249931 252693 255779 258387 260535 262482
52649B62482J472M13q06j561j686j566j741k286k565j895n66K81P9m41l30L32
$$ 262482 263954 264367 263561 262000 260314 258748 257007 254721 252156 250261 249695 249976 250055 249614 249284 249616
52633B49616Q25R58J110J388J540J537J553J490J173Q72R09Q94J42j110j773j365
$$ 249616 250441 251399 252509 253897 255437 256974 258527 260017 261190 262062 262971 263865 264007 262897 261124 259759
52617B59759o27l80n24n11k31J37N42Q39N94k90j042p86K65R76O37l06r82j048
$$ 259759 259132 258752 258228 257717 257486 257623 258165 259004 259598 259308 258266 257480 257745 258721 259358 259052 258070 257022
52599B57022p15k18L40P45O83J65l83n44k88J98Q63J643K151J945J189N92N78
$$ 257022 256307 256089 256429 257174 257857 258022 257639 257095 256807 257005 257868 259511 261662 263607 264796 265388 265966
52582B65966Q29R26R17R72Q74L70k44m40k26p4j37j10J19J89j50o28q22o75m74
$$ 265966 266795 267721 268638 269610 270484 270854 270610 270170 269944 269870 269733 269623 269742 269931 269781 269153 268331 267656 267182
52563B67182n39j001j656k060j908j442j131j034q14m07k44n81r73p94m7O01N84
$$ 267182 266643 265642 263986 261926 260018 258576 257445 256411 255597 255190 254946 254365 253392 252598 252551 253152 253736
52546B53736On74p62o42m67j91L95J085J224N76j35o8O47J119R54O63P76J157
$$ 253736 253742 253168 252406 251764 251297 251106 251501 252586 253810 254386 254251 254183 254830 255949 256903 257566 258342 259499
52528B59499J360J249R69O94N54N72N53L39J39K79N99O49M85O21J094J352J298
$$ 259499 260859 262108 263077 263771 264325 264897 265450 265789 265928 266207 266806 267455 267940 268561 269655 271007 272305
52511B72305J692K904M056M106L325K761K598K019O35q79j797k252k777l439l837
$$ 272305 273997 276901 280957 285063 288388 291149 293747 295766 296401 295522 293725 291473 288696 285257 281420
52496B81420l702l196k713k520k518k315j680q47k46L1K38N55Q80R99P51J52m50
$$ 281420 277718 274522 271809 269289 266771 264456 262776 261929 261683 261714 261952 262507 263387 264386 265137 265289 264839
52479B64839n01O7N41K76l02j90P48J537J474J045J081J623K104K242K192K082
$$ 264839 264338 264405 264946 265222 264920 264730 265478 267015 268489 269534 270615 272238 274342 276584 278776 280858
52463B80858K001K178K672L045K832K170J495P74l31j678k645k990l060l083k877
$$ 280858 282859 285037 287709 290754 293586 295756 297251 298025 297694 296016 293371 290381 287321 284238 281361
52448B81361k454k293k539k639k193j640j516j442o94M80R44J88r65j422j007
$$ 281361 278907 276614 274075 271436 269243 267603 266087 264645 263951 264431 265375 265563 264598 263176 262169
52433B62169k95K55O41R49J079Q51K66l68o42m68j83J4M34J338K243K367J799
$$ 262169 261874 262129 262770 263719 264798 265649 265915 265547 264905 264437 264254 264268 264702 266040 268283 270650 272449
52416B72449J434J583J504P21L0M28J665K756L609N045P218R077R727R424Q747
$$ 272449 273883 275466 276970 277691 277721 278149 279814 282570 286179 291224 298442 307519 317246 326670 335417
52401C35417P463M998J644j454l523m764n654o159o032n531n328n565n466m238
$$ 335417 342880 347878 349522 348068 344545 339781 334127 327968 321936 316405 311077 305512 300046 295808
52387B95808k198n30P1N3J48M59P94J364K465L642L995L382K674K597K882K872
$$ 295808 293610 293080 293151 293204 293352 293811 294605 295969 298434 302076 306071 309453 312127 314724 317606 320478
52371C20478K494K304K757L741M633M736L866K535J359L56o95j448j243k88L21
$$ 320478 322972 325276 328033 331774 336407 341143 345009 347544 348903 349259 348564 347116 345873 345585 345906
52356C45906Q4k01K19Q79R89P99J027J467J375J027J515K864L712L299K701L298
$$ 345906 345990 345789 346008 346887 347876 348675 349702 351169 352544 353571 355086 357950 361662 364961 367662 370960
52340C70960M836N915N859N242M867N057N862P184Q562R424R768J0222J1298J2861
$$ 370960 375796 381711 387570 392812 397679 402736 408598 415782 424344 433768 443536 453758 465056 477917
52326D77917J4395J5542J6315J7017J8039J9535K1196K2458K2887K2359K1040
$$ 477917 492312 507854 524169 541186 559225 578760 599956 622414 645301 667660 688700
52315F88700J9463J8426J8469J9393K0498K1290K1702K1759K1398K0672J9764
$$ 688700 708163 726589 745058 764451 784949 806239 827941 849700 871098 891770 911534
52304I11534J8788J7808J7010J6512J5953J4804J3140J1662J0657R440P213M110
$$ 911534 930322 948130 965140 981652 997605 1012409 1025549 1037211 1047868 1057308 1064521 1068631
52292A068631R82j599l698n576p310q850r992j0442j0125r426q824q392p895p172
$$ 1068631 1069613 1068014 1064316 1058740 1051430 1042580 1032588 1022146 1012021 1002595 993771 985379 977484 970312
52278I70312o131m626k724q72O93K395M609O742P868Q226R122J1107J3121J3950
$$ 970312 964181 959555 956831 955959 956652 959047 963656 970398 978266 986492 995614 1006721 1019842 1033792
52264A033792J3810J3822J4471J5333J5922J6165J6180J6143J6281J6460J6072
$$ 1033792 1047602 1061424 1075895 1091228 1107150 1123315 1139495 1155638 1171919 1188379 1204451
52253A204451J4803J3278J2363J1913J0907Q743N806K754j62k945n628q332j1031
$$ 1204451 1219254 1232532 1244895 1256808 1267715 1276458 1282264 1285018 1284856 1281911 1276283 1267951 1256920
52240A256920j3184j4169j4311j4750j5975j7110j7207j6630j6452j6783j6649
$$ 1256920 1243736 1229567 1215256 1200506 1184531 1167421 1150214 1133584 1117132 1100349 1083700
52229A083700j5535j4184j3512j3384j2938j1821j0467r303q202o894n537m479
$$ 1083700 1068165 1053981 1040469 1027085 1014147 1002326 991859 982556 974354 967460 961923 957444
52217I57444l709k878j798o78K63J119K050K865L120K703K165K322L432M736N096
$$ 957444 953735 950857 949059 948381 948644 949763 951813 954678 957798 960501 962666 964988 968420 973156 978252
52202I78252M154K782K094K279K737L160L844M826N502N504N375N755O265N948
$$ 978252 982406 985188 987282 989561 992298 995458 999302 1004128 1009630 1015134 1020509 1026264 1032529 1038477
52188A038477M665L309K595K247J516O8j864l862n640p137q396r274r457q964
$$ 1038477 1043142 1046451 1049046 1051293 1052809 1052877 1051013 1047151 1041511 1034374 1025978 1016704 1007247 998283
52174I98283q375q120p826o877n427m184l293k234r81k55l32l36N84K053L079
$$ 998283 989908 981788 973962 967085 961658 957474 954181 951947 950966 950711 950379 950043 950627 952680 955759
52159I55759L437L654L953L933L313K285J108r7r71r48R2J467K310K347J983J850
$$ 955759 959196 962850 966803 970736 974049 976334 977442 977345 976374 975426 975518 976985 979295 981642 983625 985475
52143I85475K347L404M373M361L017J124N7M65J634K463K875L835N911Q455J0550
$$ 985475 987822 991226 995599 999960 1002977 1004101 1004158 1004623 1006257 1008720 1011595 1015430 1021341 1029796 1040346
52128A040346J2237J4270J6896J9636K2094K4315K6288K7833K9080L0389L1536
$$ 1040346 1052583 1066853 1083749 1103385 1125479 1149794 1176082 1203915 1232995 1263384 1294920
52117A294920L1697L0624K9175K8206K7516K6424K4878K3283K1636J9582J7164
$$ 1294920 1326617 1357241 1386416 1414622 1442138 1468562 1493440 1516723 1538359 1557941 1575105
52106A575105J4737J2270R497O733M818L994L508K564J113n88k693n424q376j0795
$$ 1575105 1589842 1602112 1611609 1618342 1623160 1627154 1630662 1633226 1634339 1633751 1631058 1625634 1617258 1606463
$$ [...]
##END NTUPLES=NMR SPECTRUM
##END=
