##TITLE=AC1740_SEN00013_9276343_qgJO3Bddgf
##JCAMPDX= 6.0         $$ Bruker NMR JCAMP-DX V2.0
##DATA TYPE= NMR SPECTRUM
##DATA CLASS= NTUPLES
##ORIGIN= BRUKER
##OWNER= Administrator
$$ 1.72 TOPSPIN		Version 2.1
$$ 2015-07-15 00:27:06.729 -0700  Administrator@X
$$ Compression mode = diff/dup
##.OBSERVE FREQUENCY= 400.02188249412
##.OBSERVE NUCLEUS= ^1H
##.ACQUISITION MODE= SIMULTANEOUS (DQD)
##.ACQUISITION SCHEME= undefined
##.AVERAGES= 8
##.DIGITISER RES= 22
##SPECTROMETER/DATA SYSTEM= spect
##.PULSE SEQUENCE= zg30
##.SOLVENT NAME= COFFEE_meoh
##.SHIFT REFERENCE= INTERNAL, COFFEE_meoh, 1, 14.98509
##AUDIT TRAIL= $$ (NUMBER, WHEN, WHO, WHERE, PROCESS, VERSION, WHAT)
$$ ##TITLE= Audit trail, TOPSPIN		Version 2.1
$$ ##JCAMPDX= 5.01
$$ ##ORIGIN= Bruker BioSpin GmbH
$$ ##OWNER= Administrator
$$ $$ E:\/data/COFFEE/nmr/AC1740_SEN00013_9276343_qgJO3Bddgf/10/pdata/1/auditp.txt
$$ ##AUDIT TRAIL=  $$ (NUMBER, WHEN, WHO, WHERE, PROCESS, VERSION, WHAT)
(   1,<2015-07-15 00:26:59.447 -0700>,<Administrator>,<X>,<go>,<TOPSPIN 2.1>,
      <created by zg
	started at 2015-07-15 00:25:53.447 -0700,
	POWCHK enabled, PULCHK disabled,
       configuration hash MD5:
       21 0F 79 D6 B3 7B B4 F6 88 20 88 DB 03 48 BD 9F
       data hash MD5: 64K
       6C 36 7A 11 97 CE 4C 2B 1D 65 7E F2 0B 7E 77 CE>)
(   2,<2015-07-15 00:27:02.572 -0700>,<Administrator>,<X>,<proc1d>,<TOPSPIN 2.1>,
      <Start of raw data processing
       efp LB = 0 FT_mod = 6 PKNL = 1 PHC0 = 0 PHC1 = 0 SI = 32K 
       data hash MD5: 32K
       75 0F D7 5E C7 5C E3 BA 06 1A 87 FB E9 7B 04 62>)
(   3,<2015-07-15 00:27:02.838 -0700>,<Administrator>,<X>,<proc1d>,<TOPSPIN 2.1>,
      <pk PHC0 = 89.67041 PHC1 = 0 
       data hash MD5: 32K
       D2 0F 1B 33 8F 63 F8 31 D2 F0 34 8C FD 9F E0 34>)
(   4,<2015-07-15 00:27:02.979 -0700>,<Administrator>,<X>,<proc1d>,<TOPSPIN 2.1>,
      <abs ABSG = 1 
       data hash MD5: 32K
       AC 2E 86 38 6D 3F 7F 67 90 F9 FB FF 2E 56 BF B6>)
(   5,<2015-07-15 00:27:03.041 -0700>,<Administrator>,<X>,<proc1d>,<TOPSPIN 2.1>,
      <abs ABSG = 2 
       data hash MD5: 32K
       5D 8D 4E C3 AC 07 5B B1 17 89 3C CE 0C 18 34 2E>)
(   6,<2015-07-15 00:27:03.104 -0700>,<Administrator>,<X>,<proc1d>,<TOPSPIN 2.1>,
      <abs ABSG = 3 
       data hash MD5: 32K
       13 33 60 A2 44 C2 79 B3 93 A2 DC D0 BC 6B B5 8D>)
(   7,<2015-07-15 00:27:03.182 -0700>,<Administrator>,<X>,<proc1d>,<TOPSPIN 2.1>,
      <abs ABSG = 4 
       data hash MD5: 32K
       C7 CB 37 74 1A C7 D8 FD 4E 39 39 66 AF DC 5D ED>)
(   8,<2015-07-15 00:27:03.244 -0700>,<Administrator>,<X>,<proc1d>,<TOPSPIN 2.1>,
      <abs ABSG = 5 
       data hash MD5: 32K
       08 ED 8D FE 5F FE E6 FF E5 FB 34 CE CB 3E 89 3B>)
$$ ##END=
$$ 
$$ $$ hash MD5
$$ $$ 96 F0 18 D8 BE FC 1C 59 47 3A 12 92 85 80 89 2F
##$RELAX= 
##$RELAX= 
##$RELAX= 
##$RELAX= 
##$RELAX= 
##$RELAX= 
##$RELAX= 
$$ Bruker specific parameters
$$ --------------------------
##$DU= <E:\>
##$EXPNO= 10
##$NAME= <AC1740_SEN00013_9276343_qgJO3Bddgf>
$$ [...]
##$TP= (0..7)
150 150 150 150 150 150 150 150
##$TP07= 0
##$TPNAME0= <>
##$TPNAME1= <>
##$TPNAME2= <>
##$TPNAME3= <>
##$TPNAME4= <>
##$TPNAME5= <>
##$TPNAME6= <>
##$TPNAME7= <>
##$TPOAL= (0..7)
0.5 0.5 0.5 0.5 0.5 0.5 0.5 0.5
##$TPOFFS= (0..7)
0 0 0 0 0 0 0 0
##$TUNHIN= 0
##$TUNHOUT= 0
##$TUNXOUT= 0
##$USERA1= <user>
##$USERA2= <user>
##$USERA3= <user>
##$USERA4= <user>
##$USERA5= <user>
##$V9= 5
##$VALIST= <valist>
##$VCLIST= <CCCCCCCCCCCCCCC>
##$VD= 0
##$VDLIST= <DDDDDDDDDDDDDDD>
##$VPLIST= <PPPPPPPPPPPPPPP>
##$VTLIST= <TTTTTTTTTTTTTTT>
##$WBST= 2048
##$WBSW= 25
##$XGAIN= (0..3)
0 0 0 0
##$XL= 0
##$YL= 0
##$YMAX_a= 624248
##$YMIN_a= -539594
##$ZGOPTNS= <>
##$ZL1= 120
##$ZL2= 120
##$ZL3= 120
##$ZL4= 120
##$ABSF1= 14.98509
##$ABSF2= -5.573092
##$ABSG= 5
##$ABSL= 3
##$ALPHA= 0
##$AQORDER= 0
##$ASSFAC= 0
##$ASSFACI= 0
##$ASSFACX= 0
##$ASSWID= 0
##$AUNMP= <proc_prof1d_extract_pilot.lims>
##$AXLEFT= 0
##$AXNAME= <>
##$AXNUC= <1H>
##$AXRIGHT= 0
##$AXTYPE= 0
##$AXUNIT= <>
##$AZFE= 0.1
##$AZFW= 0.1
##$BCFW= 0
##$BC_mod= 0
##$BYTORDP= 0
##$COROFFS= 0
##$CY= 15
##$DATMOD= 1
##$DC= 0
##$DFILT= <>
##$DTYPP= 0
##$F1P= 0
##$F2P= 0
##$FCOR= 0.5
##$FTSIZE= 32768
##$FT_mod= 6
##$GAMMA= 0
##$GB= 0
##$INTBC= 1
##$INTSCL= 1
##$ISEN= 128
##$LB= 0
##$LEV0= 0
##$LPBIN= 0
##$MAXI= 10000
##$MC2= 0
##$MEAN= 0
##$ME_mod= 0
##$MI= 0
##$NCOEF= 0
##$NC_proc= -8
##$NLEV= 6
##$NOISF1= 0
##$NOISF2= 0
##$NSP= 0
##$NTH_PI= 0
##$NZP= 0
##$OFFSET= 14.98509
##$PC= 1
##$PHC0= 89.67041
##$PHC1= 0
##$PH_mod= 1
##$PKNL= yes
##$PPARMOD= 0
##$PPDIAG= 0
##$PPIPTYP= 0
##$PPMPNUM= 2147483647
##$PPRESOL= 1
##$PSCAL= 4
##$PSIGN= 0
##$PYNMP= <proc.py>
##$REVERSE= no
##$SF= 400.02
##$SI= 32768
##$SIGF1= 0
##$SIGF2= 0
##$SINO= 400
##$SIOLD= 32768
##$SPECTYP= <>
##$SREGLST= <1H.CDCl3>
##$SSB= 0
##$STSI= 32768
##$STSR= 0
##$SW_p= 8223.68421052631
##$SYMM= 0
##$S_DEV= 0
##$TDeff= 65536
##$TDoff= 0
##$TI= <>
##$TILT= no
##$TM1= 0
##$TM2= 0
##$TOPLEV= 0
##$USERP1= <user>
##$USERP2= <user>
##$USERP3= <user>
##$USERP4= <user>
##$USERP5= <user>
##$WDW= 1
##$XDIM= 32768
##$YMAX_p= 445488092
##$YMIN_p= -780900
##$CURPLOT= <Network HP LaserJet P1505>
##$CURPRIN= <$Network HP LaserJet P1505>
##$DFORMAT= <normdp>
##$LAYOUT= <+/1D_H.xwp>
##$LFORMAT= <normlp>
##$PFORMAT= <normpl>
##$SURQMSG= 1
$$ End of Bruker specific parameters
$$ ---------------------------------
##NTUPLES= NMR SPECTRUM
##VAR_NAME=  FREQUENCY,     SPECTRUM/REAL,   SPECTRUM/IMAG
##SYMBOL=    X,             R,               I
##VAR_TYPE=  INDEPENDENT,   DEPENDENT,       DEPENDENT
##VAR_FORM=  AFFN,          ASDF,            ASDF
##VAR_DIM=   32768,         32768,           32768
##UNITS=     HZ,            ARBITRARY UNITS, ARBITRARY UNITS
##FACTOR=    0.250966925370066, 1,           1
##FIRST=     8223.43324360094, 137559,       4294
##LAST=      0,             -216241,         -79568
##MIN=       0,             -780900,         0
##MAX=       8223.43324360094, 445488092,    0
$$ Real data points
##PAGE= N=1
##DATA TABLE= (X++(R..R)), XYDATA
$$ [...]
$$ plain form
19552 -18273 -289527 53614 77587 221659 -81734 16693 17463 14206 -239015 37592 -79994 -6150
19539 -280818 -71167 -43923 38888 -258110 -128001 -190636 1323 -228839 -138317 -334253 -238515
19528 -238515 285009 56263 -50859 80539 -116366 -83166 -310755 17744 -76843 77783 -40542
19516 -46947 -278415 24393 -90078 -43629 -3331 -157738 -81077 307502 17616 190319 -85934
19504 -99974 111017 -40 -458373 236578 -77287 -151012 -320694 146670 159361 -193675 -8771
19492 -148188 -41347 -280705 -142812 -184654 -221215 -120383 -89649 -158146 212846 -18165 117153
19480 167237 -37516 -96121 -240079 -250091 104352 -122078 -164640 45765 12213 -125519 88054
19468 172698 -292347 -383764 -76445 -91261 -12616 -116810 -113675 -159952 56007 3530 22006
$$ packed form
19552a8273k71254E3614K3973J44072h1734A6693P70l257b39015C7592g9994f150
19539b80818g1167K7244C8888b58110a28001o2635A323b28839R0522j95936R5738
19528b38515B85009E6263e0859H0539a16366L3200k27589A7744g6843G7783d0542
19516d6947k31468B4393i0078d3629c331j54407P6661C07502A7616J72703h5934
19504i9974A11017d0m58333B36578g7287p3725j69682A46670J2691a93675h771
19492a48188d1347k39358J37893m1842l6561J00832L0734o8497B12846a8165A17153
19480A67237c7516n8605j43958j0012A04352a22078m2562D5765A2213a25519H8054
19468A72698b92347r1417g6445j4816a2616j04194L135m6277E6007C530J8476
$$ plain form
19457 22006 -275422 -32051 -45593 -21216 75199 16875 60325 64509 -54564 81831 -88167 -121480
19445 -121480 -150743 132639 12989 -385065 177351 -178897 310953 -87500 -51240 -63624
19435 -63624 -349915 -20993 -247713 209492 -271786 -287015 231627 -333753 -114139 -22402
19424 10540 84147 46469 -340461 53774 17702 -83251 -235373 64157 -195142 -38781 -183250
19413 -183250 -56484 31617 -93380 109529 -41573 -139374 -68345 293598 -83917 -451703 39341
19401 -318057 15938 206788 -291777 153416 -201157 61356 125499 266513 71336 -109486
19390 -214738 -50001 -152337 -40169 -112536 20061 -69170 -331824 112069 -129355 -150388 86339
19378 130591 -382515 -279539 -163800 167499 133606 10206 155519 -11578 -31602 -156642
$$ packed form
19457B2006b75422c2051j3542b1216G5199A6875M3450M184e4564H1831h8167l3313
19445a21480k9263A32639A2989c85065A77351a78897C10953h7500L6260j2384
19435f3624k86291b0993k26720B09492b71786j5229B31627c33753a14139b2402
19424A0540P3607l7678c40461E3774A7702h3251j52122F4157a95142c8781j44469
19413a83250e6484C1617i3380A09529d1573r7801f8345B93598h3917l67786C9341
19401c18057A5938J90850b91777A53416b01157F1356O4143J41014G1336a09486
19390b14738e0001j02336d0169p2367B0061f9170k62654A12069a29355k1033H6339
19378A30591c82515J02976J15739A67499l3893A0206J45313a1578k0024j25040
$$ plain form
19368 -156642 -206289 129738 258310 -114202 -9717 95302 56849 90288 -107258 128634 281068
19357 281068 123884 -295009 -71409 201906 -21313 37062 -104346 -71620 -144104 152446
19346 -9424 12109 -96144 -172002 -77112 36771 141932 -237100 -185982 -159826 -71637 51075
19334 130090 -245773 -85555 -80900 71120 -214780 -51088 170840 -326428 -405896 128069 -466718
19322 -155458 -232280 105510 -119282 113988 -85331 77153 -341030 -103799 -96307 48485 95800
19311 95800 138924 111822 -220498 -79022 -63708 103926 106706 -21226 175912 -109008 -154597
19300 -154597 90852 -142973 -271735 217023 -135988 80915 -124369 -102744 -65134 -30167
19289 -104452 145818 -184036 -147155 173688 -77494 -264363 -118697 -183427 -149749 39362
$$ packed form
19368a56642m9647A29738J28572a14202i717I5302l8453L3439a07258A28634J52434
19357B81068A23884b95009g1409B01906b1313C7062a04346L2726p2484A52446
19346i424A2109i6144p5858g7112C6771J05161b37100N1118K6156g1637E1075
19334A30090b45773h5555M655G1120b14780e1088A70840c26428p9468A28069d66718
19322a55458p6822A05510a19282A13988h5331G7153c41030a03799P492D8485M7315
19311I5800M3124k7102b20498g9022J5314A03926K780b1226A75912a09008m5589
19300a54597I0852a42973j28762B17023a35988H0915a24369K1625L7610c0167
19289a04452A45818a84036L6881A73688g7494j86869a18697o4730L3678C9362
$$ plain form
19278 -309177 64069 -149779 -161118 -33852 -216405 -80332 -173900 -84553 -76618 -47396 -63826
19267 -63826 -66256 216684 13225 101625 -202425 -192418 -79158 -121422 120541 -265177 -193836
19256 -193836 -98951 -363690 -74893 -206661 -106256 -194587 -231373 -47946 -267121 -350176 -29904
19244 -90972 26351 61411 -200619 -73698 -48551 -189978 17999 -88244 31621 270717 -3150
19232 -37588 15011 -61310 -38626 36685 101515 96772 -174608 -59464 -255822 -210899 330580
19220 99295 -198474 -237904 -40589 8982 -320342 -409259 17454 80289 322987 -152527 171751
19208 -154998 -75191 -95029 71790 925 -70890 -163479 125132 -113909 230333 -101925 212025
19196 -218557 37658 -526271 89669 -16342 19432 -111180 -218685 19719 -45769 107358 -286826
$$ packed form
19278c09177F4069a49779j1339c3852j82553h0332r3568h4553P935K9222j6430
19267f3826k430B16684A3225Q8400b02425J0007g9158m2264A20541b65177P1341
19256a93836R4885k64739g4893j31768J00405q8331l6786d7946k19175q3055b9904
19244i0972B6351L5060b00619g3698K5147j41427A7999h8244C1621K39096c150
19232c7588A5011f1310K2684C6685O4830m743a74608e9464j96358M4923C30580
19220I9295a98474l9430d0589H982c20342q8917A7454O2835K42698a52527A71751
19208a54998g5191j9838G1790I25g0890r2589A25132a13909B30333a01925B12025
19196b18557C7658e26271H9669a6342A9432a11180j07505A9719d5769A07358b86826
$$ plain form
19184 -197391 -153343 -113977 -374 -82372 -60315 51914 -217459 70250 -373346 -71673 56592
19172 358959 124702 -36671 32365 -222636 -96563 160407 -263792 -229747 -249255 -284520 19996
19160 17420 102253 -94733 -156868 -73380 -292498 -21140 -453062 -5274 -116710 -238774 -180757
19149 -180757 -95861 25650 13703 -249248 193015 48366 24828 89112 1881 -104893 -266482
19138 -266482 -278572 170860 109147 -327011 108219 -41173 -111513 -119691 -285972 -257186 79409
19126 -63831 -139061 -162518 -146245 -70502 50578 186274 -218032 -242152 136418 -117743 -4681
19114 -84720 15672 -122496 -291310 -177391 -252421 66327 -36184 -21037 -163342 189260 -80196
19102 -36569 98295 -4316 -155205 -225894 -230467 -35185 -175813 -196924 -134042 -40949 -405370
$$ packed form
19184a97391M4048L9366c74q1998K2057E1914b17459G0250c73346g1673E6592
19172C58959A24702c6671C2365b22636i6563A60407b63792L4045j9508l5265A9996
19160A7420Q4833i4733o2135g3380k19118b1140m31922e274j11436j22064N8017
19149a80757Q4896B5650j1947b49248A93015D8366k3538O4284A881a04893j61589
19138b66482j2090A70860o1713c27011A08219d1173p0340q178j66281K8786G9409
19126f3831p5230k3457J6273g0502E0578J35696b18032k4120A36418a17743d681
19114h4720A5672a22496j68814J13919p5030F6327c6184J5147j42305A89260h0196
19102c6569I8295d316j50889p0689m573c5185j40628k1111O2882d0949l64421
$$ plain form
19091 -405370 -451443 68100 361867 -38824 104072 77495 -145184 -68684 3386 -131026 131487
19079 23880 16353 27789 -220827 -33548 -64938 -136361 169755 -38637 -136923 49779 -113579
19067 333212 -117345 186803 -227978 -47116 -194588 -139220 142359 -150083 -164354 92136
19056 -42681 7852 21564 -331456 -42698 -30076 -130644 -31653 61890 29830 -190934 -85184
19044 -25397 -201138 -66786 198155 -64003 37797 -227159 -290599 -109010 -129495 -33104 68316
19032 -175958 79985 -162870 -226978 -148861 -62439 111248 92196 -119859 122044 -254649
19021 382724 200821 223658 72242 -58998 -120605 56160 -181524 65836 -34513 -178120 87322
19009 -78508 -26158 160494 -304684 -192457 180443 -195529 -229099 169311 7466 -194548
$$ packed form
19091d05370m6073F8100K93767c8824A04072k6577a45184f8684C386a31026A31487
19079B3880p527J1436b20827c3548l1390p1423A69755c8637r8286D9779a13579
19067C33212a17345A86803b27978d7116j47472N5368A42359a50083j4271I2136
19056d2681G852J3712c31456d2698J2622j00568c1653F1890B9830a90934h5184
19044b5397j75741f6786A98155f4003C7797b27159o3440a09010k0485c3104F8316
19032a75958G9985a62870o4108P8117f2439A11248j9052a19859A22044b54649
19021C82724j81903K2837G2242e8998o1607E6160a81524F5836c4513j43607H7322
19009g8508b6158A60494c04684J12227A80443a95529l3570A69311G466a94548
$$ plain form
18998 -98762 -10897 21250 -278260 -35178 1546 -157870 -29756 211735 -376219 72331 -215290
18986 56668 -112752 -198702 -167336 -4178 -139749 -103715 -351104 -121902 -251264 52475 -39944
18974 -86504 105835 -41719 186344 -109085 -61478 -39023 35649 -22709 259969 -283484 -185993
18963 -185993 -96113 -199582 -139504 -370129 201733 115441 67200 128567 119856 395835 117142
18951 149941 -81457 117864 -488594 -69919 -4882 -22353 -90827 552116 -216914 156745 -169271
18939 -146803 35845 -154539 -138635 195217 -16572 201646 298036 -94238 183 51362 -120323
18927 -380206 139936 -369727 -64706 -442057 -147498 -28155 -53016 -184761 78471 -11362
18916 41613 -153271 -80779 39479 171964 -161168 -26813 -112843 -254078 -87435 97997 105614
$$ packed form
18998i8762a0897B1250b78260c5178A546a57870b9756B11735c76219G2331b15290
18986E6668a12752q5950L1366d178j35571L6034k47389a21902j29362E2475c9944
18974h6504A05835d1719A86344a09085M7607K2455C5649b2709B59969b83484R7491
18963a85993Q9880j03469O0078k30625B01733q6292m8241O1367q711K75979A17142
18951A49941h1457A17864d88594f9919d882j7471o8474E52116b16914A56745a69271
18939a46803C5845a54539J5904A95217a6572B01646R6390i4238A83N1179a20323
18927c80206A39936c69727f4706l77351a47498b8155k4861j31745G8471a1362
18916D1613a53271P2492C9479J32485a61168b6813q6030j41235h7435I7997P617
$$ plain form
18905 105614 -51602 -138868 -268314 82982 -143278 31271 49604 134768 -23939 -240241 -132332
18894 -132332 -53188 -104811 24477 -46743 -263573 -55067 106597 -103422 13850 -61807 -259714
18883 -259714 -215016 -54334 224119 141627 246971 40047 137017 354623 199225 27819 84570
18872 84570 -435030 8822 -340472 59774 -261444 186884 -82699 -233518 -12632 -11201 24673
18860 -217853 48998 -120985 -81687 -80043 -98142 242564 -151988 6340 -149973 -214902 297725
18848 158882 -104482 -172789 -219707 -147309 246051 13647 -200613 119537 25312 31591 -122245
18836 121229 117513 151425 145286 234514 416379 77927 73313 494 -154284 52301 31879 -84702
18823 -30104 107548 161566 -235952 137361 -197785 72476 99904 128360 41456 22894 208214
$$ packed form
18905A05614e1602q7266j29446H2982a43278C1271J8333Q5164b3939k16302J07909
18894a32332e3188n1623B4477d6743k16830e5067A06597a03422A3850f1807j97907
18883b59714M4698e4334B24119q2492J05344D0047R6970K17606j55398B7819N6751
18872H4570d35030H822c40472E9774b61444A86884h2699j50819a2632J431B4673
18860b17853D8998a20985L9298J644j8099B42564a51988F340a49973o4929B97725
18848A58882a04482o8307m6918P2398B46051A3647b00613A19537B5312O279a22245
18836A21229l716L3912o139Q9228J81865G7927m614D94a54284E2301k0422h4702
18823c0104A07548N4018b35952A37361a97785G2476K7428K8456D1456j8562J85320
$$ plain form
18812 208214 -213948 170150 97604 194055 12627 -162742 203237 60969 -214395 -157910
18802 -157910 97774 164240 -57428 -260643 214511 -168875 -124928 -2339 67365 3885 56902
18791 56902 -352357 -187097 -223743 2637 -12595 -202655 -268291 -90888 341673 134122 -43161
18779 46891 -43370 -451173 -216576 -233812 -232702 -139858 -73769 188389 384707 -44514 -278856
18768 -278856 -367304 -52074 -355855 -50812 -115884 -381481 141419 -194179 -226835 64691 -398600
18756 -293860 -137735 148401 14412 -23368 -88695 -121103 -8618 101329 -142693 -68145 -101681
18745 -101681 213281 213457 99611 15312 -73156 336237 86154 -43145 -230732 -129864 69340
18733 40676 115348 -158553 -13779 -2283 -18659 -171734 -310842 -141896 -64322 -282204 214537
$$ packed form
18812B08214b13948A70150p2546R6451A2627a62742B03237F0969b14395N6485
18802a57910I7774O6466e7428k03215B14511a68875M3947b339F7365C885N3017
18791E6902c52357J65260l6646B637a2595j90060o5636i0888C41673A34122d3161
18779D6891d3370m07803b16576j7236J110R2844O6089A88389J96318d4514k34342
18768b78856q8448e2074l03781e0812o5072k65597A41419a94179l2656F4691c98600
18756b93860a37735A48401A4412b3368o5327l2408h618A01329a42693f8145l3536
18745a01681B13281J76I9611A5312g3156C36237H6154d3145j87587J00868F9340
18733D0676P4672a58553a3779b283j6376j53075j39108a41896f4322k17882B14537
$$ plain form
18721 174819 -302473 102768 102077 -161692 105555 48535 -32106 164803 -62863 -191997 -125999
18710 -125999 388010 23033 -100316 177657 -29138 -195493 -125410 145476 -194329 -109344
18700 -109344 -149914 -261242 -290616 -239004 -471502 221212 -218427 -9593 118327 88475 -96177
18688 -109630 -33926 -141782 -101726 -170655 -193443 -89251 79939 74244 -239012 -22929 40785
18676 -331663 -164159 -310771 24502 -77501 141536 -93440 78863 44218 -166983 156707
18665 19632 -134223 -34184 -215286 -52827 -207668 -91094 -127271 -79607 -228140 -31724 -26003
18654 -26003 -213181 63612 -28578 -125095 -3508 22058 -319809 41990 52134 -40670 -54008
18643 -54008 -283330 -224998 -285524 354408 -262483 -372182 25355 97250 -208191 203380
$$ packed form
18721A74819c02473A02768o91a61692A05555D8535c2106A64803f2863j29134O5998
18710a25999C88010B3033a00316A77657b9138j66355P0083A45476a94329Q4985
18700a09344m0570j11328k9374N1612k32498B21212b18427i593A18327k9852i6177
18688a09630c3926j07856M0056o8929k2788h9251G9939n695b39012b2929D0785
18676c31663a64159j46612B4502g7501A41536i3440G8863l4645a66983A56707
18665A9632a34223c4184j81102e2827j54841i1094l6177M7664j48533c1724N721
18654b6003j87178F3612b8578r6517c508B2058c19809D1990J0144d0670j3338
18643e4008k29322N8332o0526C54408b62483j09699B5355P1895b08191B03380
$$ plain form
18632 -116257 -325962 -73187 -16391 38646 -26388 -151735 -12422 -93831 111357 -16073 -99175
18621 -99175 -26888 -45943 -188099 -21226 -148672 123955 47789 1873 -7115 128757 -193489
18609 -213146 -226476 125011 -154001 -84604 94824 152066 207396 145732 176516 230885 211109
18598 211109 -18605 -96537 -142710 -216220 -100452 -233698 -311015 -169004 5146 -186354 -111155
18587 -111155 73130 -79915 222743 142828 -69591 -496305 -149961 228825 1381 28364 -67392
18575 -286942 -165243 141664 24343 -140269 59008 -250581 -50765 -328196 -17515 23888
18564 -319524 248483 -195951 47122 -20419 169783 324419 -28380 -146213 -114534 54239
18553 -20717 -67886 -204792 272188 -118180 -236216 171874 -89767 92196 -21480 61286 950
$$ packed form
18632a16257k09705g3187a6391C8646b6388j25347a2422q1409A11357a6073q3102
18621i9175b6888j9055j42156b1226j27446A23955D7789A873g115A28757a93489
18609b13146j3330A25011a54001O9397I4824N7242N5330o1664L0784N4369j9776
18598B11109a8605p7932m6173p3510a00452j33246p7317J42011E146a86354P5199
18587a11155G3130g9915B22743p9915f9591m26714a49961B28825A381K6983f7392
18575b86942J21699A41664B4343a40269E9008b50581e0765k77431a7515B3888
18564c19524B48483a95951D7122b0419A69783J54636b8380j17833L1679E4239
18553b0717m7169j36906B72188a18180j18036A71874h9767I2196b1480F1286I50
$$ plain form
18541 -183164 155012 -65259 -123341 -394166 -406773 -315450 -79232 -128026 -2932 29340 366930
18530 366930 -318289 156151 -132087 178306 -74016 -206791 124793 140553 -205168 -31245
18519 193211 -171667 -91039 -217862 -120754 -84265 164562 122338 -145452 -81884 -296844
18509 -296844 -106915 -57681 -34769 242586 -199518 202761 -179189 -209416 59852 213575
18499 213575 80730 -84540 -142654 202789 10200 331624 -64896 -92134 -268185 -109101 177463
18487 223962 -81635 -110812 -72180 -206590 -212310 -172432 -295183 15749 -215550 49911 227
18475 -198448 47437 13288 -184643 76528 -79319 -109901 171483 137731 37502 286311 142026
18463 21588 17149 -199781 -204803 -106089 -84051 137462 -546138 -104166 -408443 20149 -112509
$$ packed form
18541a83164A55012f5259n8082k70825j2607R1323g9232m8794b932B9340L37590
18530C66930c18289A56151a32087A78306g4016j32775A24793J5760b05168c1245
18519A93211a71667Q0628j26823R7108L6489A64562m2224a45452O3568k14960
18509b96844a06915M9234K2912B42586a99518B02761a79189l0227E9852J53723
18499B13575H0730h4540n8114B02789A0200L21424f4896k7238j76051a09101A77463
18487B23962h1635k9177L8632j34410n720L9878j22751A5749b15550D9911B27
18475a98448D7437A3288a84643G6528g9319l0582A71483l3752C7502K48809A42026
18463B1588m439a99781n022R8714K2038A37462e46138a04166l04277B0149a12509
$$ plain form
18451 262629 -117966 -25415 60062 -74302 -145232 -27659 -311027 103893 -532919 -95157 -37350
18439 4655 -66084 -41041 41284 -36477 5991 -241473 -210338 -333354 221838 -194859 -239041
18428 -239041 102585 -413163 -133218 -215473 -36344 -222598 -263751 -376742 126121 317167
18418 317167 153664 -8400 134074 -127010 211189 -286379 7173 -233382 -66977 -243944
18408 -243944 249318 -210614 166229 -53175 93253 310184 260876 -163389 145310 -97983
18397 -301990 -127438 18069 -157956 248047 197110 -14278 -37673 -27572 -47417 158126 338993
18386 338993 36605 -143380 -284487 46935 -77400 -342437 -58055 -153892 197542 -122907
18375 96568 -42797 332948 -290332 -207147 -50932 233813 87364 164496 59200 -140782 -118991
$$ packed form
18451B62629a17966b5415F0062g4302p0930b7659k83368A03893e32919i5157c7350
18439D655f6084K5043D1284c6477E991b41473L1135j23016B21838a94859m4182
18428b39041A02585d13163a33218q2255c6344j86254m1153j12991A26121J91046
18418C17167A53664h400A34074a27010B11189b86379G173b33382f6977j76967
18408b43944B49318b10614A66229e3175I3253K16931m9308a63389A45310i7983
18397c01990a27438A8069a57956B48047n0937a4278k3395J0101j9845A58126J80867
18386C38993C6605a43380j41107D6935g7400k65037e8055r5837A97542a22907
18375I6568d2797C32948b90332Q3185e0932B33813H7364P7132E9200a40782K1791
$$ plain form
18364 -118991 74054 -352531 -22783 342108 98353 -373030 14369 -224691 -123268 -85556
18354 -85556 -358571 -11628 -205584 -145370 -64700 68162 456617 -162291 -360821 -245418
18344 -245418 35778 -40940 133387 -138200 155367 77045 176356 -45833 -203926 -152118 90967
18332 159564 -117429 -147058 -48553 149069 85496 -207552 -55176 -34624 161945 -41945 341223
18320 -90627 -178149 -118859 -93432 -272204 -173811 -134709 -80145 161981 88696 65599 213415
18309 213415 -21324 -30112 -106870 37007 91191 95176 -114710 -244549 -148061 -202656 179125
18297 -216818 94247 -329629 385726 -59995 -99564 83781 216239 -130422 -79849 367007
18286 328615 -131242 303320 -123873 126358 -285476 112500 251598 468 70656 67001 105312
$$ packed form
18364a18991G4054c52531b2783C42108I8353c73030A4369b24691J01423L7712
18354h5556k73015a1628j93956O0214f4700F8162L88455a62291j98530J15403
18344b45418C5778d0940A33387a38200A55367G7045R9311d5833j58093N1808I0967
18332A59564a17429k9629d8553A49069o3573b07552e5176K0552A61945d1945C41223
18320i0627q7522N9290K5427j78772R8393L9102N4564A61981p3285k3097J47816
18309B13415b1324q788p6758C7007N4184L985a14710j29839R6488n4595A79125
18297b16818I4247c29629C85726e9995l9569H3781J32458a30422N0573C67007
18286C28615a31242C03320a23873A26358b85476A12500J39098D68P0188l655L8311
$$ plain form
18275 105312 65554 -266836 -84076 -25593 -133351 -56529 14184 -264337 -184267 48639 253289
18264 253289 69844 164684 -141361 -19113 -50351 131858 -26072 -315413 10553 251772 6664
18252 -207053 -146720 -143818 -49031 369282 -98133 172185 -139182 69922 41597 122183 -19501
18240 -54960 -149988 -116777 43590 -106822 -112823 -270650 -204304 214204 -139799 -198220 -42528
18228 -82444 -233212 30739 187871 -113722 -146695 196773 -309889 73885 -140960 -24868
18217 -207771 -131110 -23944 -283939 -516 -325020 -171925 -152281 10526 -4747 59426 -20924
18205 -382769 71107 60826 -230921 164214 -67234 54744 50973 -246819 145962 -121286 -100964
18194 -100964 -218372 -114419 -24757 141620 -51559 -170831 -75123 79778 117917 -78252 -336801
$$ packed form
18275A05312l9758b66836h4076b5593j07758e6529A4184b64337Q0070D8639K04650
18264B53289F9844R4840a41361a9113l1238A31858b6072k89341A0553K41219F664
18252b07053O0333K902d9031C69282i8133A72185a39182F9922k8325Q0586a9501
18240e4960r5028L3211D3590a06822o001j57827O6346B14204a39799n8421d2528
18228h2444j50768C0739J57132a13722l2973A96773c09889G3885a40960b4868
18217b07771P6661b3944k59995e16l24504J53095J9644A0526d747E9426b0924
18205c82769G1107j0281b30921A64214f7234E4744l771b46819A45962a21286K0322
18194a00964j17408J03953b4757A41620e1559j19272g5123G9778L8139g8252k58549
$$ plain form
18183 -336801 -221977 -49982 3649 235800 -876 -100030 28475 -159071 157132 -28925 -2804
18171 5700 231111 -32064 -161902 -410292 347976 -490564 113384 188914 211989 150505 -4684
18159 -284887 -411014 -192717 -129378 55677 -147685 -25068 -45533 115795 77771 -163001
18148 -130939 -244948 248573 29248 -127222 35844 -21615 -28755 -122575 85983 -29844 -57300
18137 -57300 -3876 -141142 -127524 -446761 -168029 -72829 -263468 -323865 -31363 -131082 1996
18125 112994 57208 154629 -51838 306113 144032 -142232 43509 -25459 78460 -220426 -255761
18114 -255761 -283507 -257237 65113 47589 99492 -70495 48012 57468 -16711 56667 -122925
18102 -124517 62319 11836 -7609 -88567 -163277 142170 148802 -193751 -79512 -25608 -212518
$$ packed form
18183c36801J14824d9982C649K32151h76r9154B8475a59071A57132b8925b804
18171E700K25411c2064j29838k48390C47976d90564A13384P5530K3075o1484d684
18159b84887j26127a92717O3339E5677a47685b5068k0465A15795l8024a63001
18148a30939j14009B48573B9248a27222C5844b1615p140r3820H5983b9844k7456
18137e7300c876j37266J3618l19237a68029g2829j90639o0397c1363r9719A996
18125A12994n5786R7421e1838C06113A44032a42232D3509b5459G8460b20426l5335
18114b55761k7746K6270F5113j7524N1903g0495D8012R456a6711E6667a22925
18102a24517F2319A1836g609q0958p4710A42170O632a93751g9512b5608j86910
$$ plain form
18091 -212518 40213 -58891 98095 -129866 104068 -279378 127787 -52385 -281511 -157481
18081 -157481 74397 -131399 367187 121838 -126017 -121705 91281 -83799 -283261 -232395 -176156
18070 -176156 59268 -349337 -49316 170922 -101180 -157279 -211853 82983 -70623 -100308 291699
18058 179091 -216100 -104607 41663 -31707 -160578 130530 -102803 151705 40734 -156212
18047 -89409 86406 181168 2826 20431 -146119 -138048 28895 -320306 84305 187512 221598
18036 221598 -61096 117625 270484 34805 -80515 89607 -10631 -153288 113384 -27823 -250021
18025 -250021 -3077 -140603 118368 -194460 -61670 -150580 11353 -6972 -381499 -186944 54310
18013 31757 -139982 69318 21283 95182 20155 -446229 241982 -123105 -5587 104858 176653
$$ packed form
18091b12518D0213e8891I8095a29866A04068b79378A27787e2385k29126J24030
18081a57481G4397a31399C67187A21838a26017M312I1281h3799j99462N0866N6239
18070a76156E9268c49337d9316A70922a01180n6099n4574H2983g0623k9685B91699
18058A79091b16100a04607D1663c1707j28871A30530a02803A51705D0734a56212
18047h9409H6406R4762B826J7605a46119Q071B8895c20306H4305J03207L4086
18036B21598f1096A17625J52859C4805h0515H9607a0631j42657A13384b7823k22198
18025b50021c077j37526A18368a94460f1670q8910A1353f972l74527a86944E4310
18013C1757a39982F9318B1283P3899B0155d46229B41982a23105e587A04858P1795
$$ plain form
18002 176653 -311605 -115470 194 -154674 -59311 -27634 114862 145560 74735 -32906 -1742
17990 -226712 16321 -14070 -17121 -257169 26473 -243252 50259 297423 -241244 133531 83060
17979 83060 958 -162286 -56443 -1551 97941 -209763 -123159 -120297 -275942 -438155 -92620 -249713
17967 -249713 -101268 -6101 28730 33114 72613 -80787 -6634 -272463 -171594 -239309 -193988
17956 -193988 -2521 82076 -89464 34085 -228619 -342635 142671 -96249 55168 55985 81068
17945 81068 366512 -289850 -186624 89530 -79929 89897 -37258 -80608 84940 -225428 -67336
17933 -55917 -165699 -74388 84016 -100184 263306 -196995 -64641 -218040 175666 53452
17922 -415664 67672 -72993 -114862 -6917 -272289 15524 170279 -167446 -253643 -277082 -23045
$$ packed form
18002A76653c11605a15470A94a54674e9311b7634A14862L0698p0825c2906a742
17990b26712A6321a4070l051k40048B6473b43252E0259K47164b41244A33531n0471
17979H3060I58a62286e6443a551I7941b09763Q6604K862j55645j62213i2620j57093
17967b49713a01268f101B8730M384L9499h0787f634k65829J00869o7715M5321
17956a93988b521H2076h9464C4085b28619j14016A42671i6249E5168Q17K5083
17945H1068K85444b89850J03226H9530g9929H9897c7258m3350H4940b25428f7336
17933e5917j09782g4388H4016a00184B63306a96995f4641j53399A75666E3452
17922d15664F7672g2993m1869f917k65372A5524J54755a67446q6197k3439b3045
$$ plain form
17910 17629 17238 -59039 -87651 87051 -65971 -119027 -36955 -92321 -149647 34231 -198997 26200
17897 -64691 289932 120088 -261333 -432918 -169016 -87128 181988 299809 66518 5421
17886 -47348 -18642 -100578 -6429 -104026 -234273 -117235 94010 66791 31320 -264295 -196337
17875 -196337 51126 285573 73975 48873 121283 133103 -137278 274783 66868 99696 -184060
17863 395 164223 -269687 135805 -48734 -57964 -99611 -214227 -307328 -24763 230481 314433
17852 314433 285826 -124191 -486208 8882 -142832 64421 -175129 -210152 160141 -92680 110296
17840 48001 62844 273874 409724 173701 -322071 -193884 192202 244634 139140 -27807
17829 123969 -208516 -172018 -135586 81347 -148574 -145040 14068 149812 291623 188929 -39891
$$ packed form
17910A7629l91e9039k8612H7051f5971n3056c6955n5366n7326C4231a98997B6200
17897f4691B89932A20088b61333j71585a69016Q1888A81988J17821F6518E421
17886d7348a8642q1936f429r7597j30247J17038I4010k7219C1320b64295O7958
17875a96337E1126K34447G3975k5102P2410J1820a37278B74783F6868L2828a84060
17863C95J63828b69687A35805d8734r230m1647j14616r3101b4763B30481Q3952
17852C14433k8607a24191l62017H882a42832F4421a75129l5023A60141i2680A10296
17840D8001J4843K11030J35850A73701c22071J28187A92202N2432j05494b7807
17829A23969b08516L6498L6432H1347a48574L534A4068J35744J41811j02694c9891
$$ plain form
17817 -19528 -204182 -74091 -111182 116123 -96111 -271259 -5845 101127 -117826 126314 25513
17805 286540 104648 -47829 -138933 107801 339760 -240291 -62876 150340 13149 218268
17795 218268 -149752 -56653 15314 15962 97111 30494 140411 -341415 -187340 -118696 68460
17783 -33586 -180427 -64056 -262042 -341505 -260682 27885 107649 -114612 64587 311482 182101
17772 182101 -172367 112437 134511 45563 318288 94197 12989 9877 -182492 -27575 275621
17760 63340 -185175 17245 -82474 214724 -140852 161636 402242 -9902 -280153 24272 -93995
17748 160728 -285136 -89374 108704 92229 202239 347837 -25380 144392 -172698 35702
17737 -76253 -223556 -121894 206690 -239699 -211040 6070 9194 -49657 72477 -101440 -92233
$$ packed form
17817a9528j84654g4091l7091A16123i6111j75148e845A01127a17826A26314B5513
17805B86540A04648d7829r1104A07801K31959b40291f2876A50340A3149K05119
17795B18268a49752e6653A5314O48Q1149C0494J09917c41415J54075O8644F8460
17783c3586j46841f4056j97986p9463Q0823B7885P9764a14612F4587K46895j29381
17772A82101a72367A12437K2074D5563K72725I4197A2989l112a82492b7575B75621
17760F3340a85175A7245h2474B14724a40852A61636K40606i902k70251B4272i3995
17748A60728b85136h9374A08704j6475J10010J45598b5380A44392a72698C5702
17737g6253j47303J01662B06690b39699K8659F070L124d9657G2477a01440R207
$$ plain form
17726 -92233 -265495 97341 13056 -73777 -79592 -66384 104149 -393177 166055 -40083 -3157
17714 186621 -34719 -103156 -58325 -45422 40863 30 30188 -32973 325446 -278481 70551 334508
17702 334508 -212472 145077 -119804 249725 -59938 274490 37642 -167576 288503 167775
17692 167775 345056 -140080 -104255 68676 -39636 178085 -161752 -355734 60347 -65501
17681 117575 -135043 149206 -63819 -8049 156334 -197915 138040 233273 138163 -70455 -65614
17670 -65614 -336633 30575 142321 -115094 -263840 -33660 40055 -460867 260359 235953
17660 235953 48483 398480 -197002 392030 214183 173920 -225201 70751 -30394 12200
17649 339744 -321429 -239556 -199204 70787 -100657 306868 -86792 231325 46393 24916 87851
$$ packed form
17726i2233j73262I7341A3056g3777n815J3208A04149c93177A66055d0083c157
17714A86621c4719o8437M4831J2903D0863C0L0158c2973C25446b78481G0551K63957
17702C34508b12472A45077a19804B49725e9938B74490C7642a67576B88503j20728
17692A67775J77281a40080L5825F8676c9636A78085a61752j93982F0347f5501
17681A17575a35043A49206f3819h049A56334a97915A38040R5233r5110g0455M841
17670f5614k71019C0575J11746a15094j48746c3660D0055d60867B60359k4406
17660B35953D8483L49997a97002C92030j77847m0263b25201G0751c0394A2200
17649C39744c21429Q1873M0352G0787a00657C06868h6792B31325D6393k1477O2935
$$ plain form
17638 87851 204642 -105765 -136041 -62417 -306858 -59149 -129787 -141011 315935 50434 -72027
17626 235298 132324 -23035 -17276 238751 10854 340734 -152421 -94245 -172232 211623 6299
17614 137792 -123165 -78334 -74005 329323 -42827 59456 -210305 -188912 -15364 -97888 318010
17602 -72359 41094 257126 200848 -45209 -120067 -4562 276136 -15796 9002 147966 77903
17591 77903 58350 24480 -197046 -30892 -66074 -19344 -60905 -145443 106647 -86091 26489
17579 40116 -168567 155179 13080 52434 208616 74784 -1508 -121957 -133451 88032 391884
17568 391884 -431449 65614 -131823 -109383 -11447 -254526 323568 -207416 -162032 12482
17557 59248 34383 27658 159276 86718 -98691 54139 190116 171530 392990 100427 8615
$$ packed form
17638H7851J16791a05765l0276f2417k44441e9149p0638j1224C15935E0434g2027
17626B35298j02974b3035N759B38751A0854L29880a52421N8176p7987B11623F299
17614A37792a23165M4831M329C29323d2827E9456b10305K1393a5364q2524C18010
17602g2359D1094K16032n6278d5209p4858d562B76136a5796I002J38964p0063
17591G7903j9553B4480a97046c0892l5182a9344m1561q4538A06647h6091B6489
17579D0116a68567A55179A3080L9354J56182G4784a508j20449j1494H8032L03852
17568C91884d31449F5614a31823K2440a1447k43079C23568b07416M5384A2482
17557E9248k4865o725J31618p2558i8691E4139J35977j8586K21460A00427H615
$$ plain form
17545 17573 22216 427984 152967 96579 74105 28621 150295 -18758 253081 148885 85407
17534 85407 -10104 -36678 -23187 389264 -85375 49870 152037 -117866 -237102 135188 -39065
17522 181951 -182207 143256 281154 -59018 -110212 110957 190124 71611 136071 367758
17512 367758 222703 -197703 3551 238035 80906 -133674 -43242 74884 141001 -16781 96026
17500 -54112 14689 410735 -77517 -168984 92324 -273551 177817 60636 405855 -63282 -4158
17488 -185406 255343 -64857 244449 295069 -229391 13701 9553 110946 489271 340000
17478 340000 -91844 -3292 97615 33108 117750 352081 156101 312990 442344 204556 269216
17467 269216 74209 161297 -26166 -141425 -139608 315860 289170 -181810 125530 -1016 223692
$$ packed form
17545A7573M643M05768A52967n6388k2474B8621J21674a8758B53081j04196o3478
17534H5407a0104k6574J3491C89264h5375D9870J02167a17866j19236A35188c9065
17522A81951a82207A43256J37898e9018n1194A10957P9167G1611O4460K31687
17512C67758j45055a97703C551K34484H0906a33674d3242G4884O6117a6781I6026
17500e4112A4689L96046g7517r1467I2324b73551A77817F0636L45219f3282d158
17488a85406B55343f4857B44449N0620b29391A3701m148J01393L78325j49271
17478C40000i1844c292I7615C3108Q4642K34331A56101J56889J29354B04556O4660
17467B69216G4209Q7088b6166j15259J817C15860k6690a81810A25530a016B23692
$$ plain form
17455 -117675 186308 202379 175406 295854 444226 489025 381384 66925 316497 156339
17444 302895 564170 404063 121424 -97064 144567 303509 162036 442990 222717 305076
17434 305076 330142 -51314 169076 293577 -188385 37690 283425 35859 -16711 272543
17423 105373 185287 371263 45425 310506 76237 216463 -54493 571269 473178 454186 -26163
17411 77249 137099 324685 86501 21895 8896 222667 72602 166530 60477 130413 173407
17400 173407 135109 149371 124897 224925 247038 -363086 -103546 90540 401087 128665
17389 365067 268606 474502 92743 1200 81382 322481 -168530 378548 246889 260353 -16781
17377 236941 -97107 88343 279267 -15832 314824 -87733 123711 297332 134075 163052
$$ packed form
17455a17675A86308J6071k6973J20448J48372M4799j07641F6925K49572A56339
17444C02895K61275j60107A21424i7064A44567J58942j41473K80954k20273Q2359
17434C05076K5066e1314A69076J24501a88385C7690K45735C5859a6711B72543
17423A05373P9914J85976D5425K65081G6237J40226e4493E71269r8091j8992b6163
17411G7249N9850J87586H6501B1895H896K13771G2602R3928F0477O9936M2994
17400A73407l8298J4262k4474J00028K2113c63086a03546I0540L10547A28665
17389C65067r6461K05896I2743A200Q0182K41099a68530C78548j31659J3464a6781
17377B36941i7107H8343J90924a5832C14824h7733A23711J73621A34075K8977
$$ plain form
17367 163052 163375 154672 234101 -95858 5016 273148 -66836 175345 -166244 145649 249402
17356 249402 254881 290451 -294215 147784 217281 -13158 -158485 -118158 133060 291373 59283
17344 32224 -5244 173360 -114513 -92345 86563 24903 -76694 137366 446758 -91927 17399
17332 -253288 -199097 251875 263326 39909 358352 360400 -173414 80542 -26471 391902 -127120
17320 439948 -159496 -184195 -63479 307899 -110381 268688 226546 118251 66562 217846
17310 217846 179091 11597 152162 29193 194137 408247 122557 204723 -264336 -26126
17299 54970 416625 94522 216809 390584 305022 185238 170936 136701 -91414 231177 298003
17288 298003 375304 414876 212097 126863 498793 229341 447258 285944 -36055 219600
$$ packed form
17367A63052L23q703P9429i5858E016K68132f6836A75345a66244A45649J03753
17356B49402N479L5570b94215A47784O9497a3158j45327M0327A33060J58313E9283
17344C2224e244A73360a14513K2168H6563B4903g6694A37366L09392i1927A7399
17332b53288N4191B51875J1451C9909L18443K048a73414H0542b6471C91902a27120
17320D39948a59496k4699f3479C07899a10381B68688m2142j08295n1689J51284
17310B17846l8755A1597J40565B9193J64944K14110A22557Q2166b64336b6126
17299E4970L61655I4522J22287J73775q5562j19784j4302l4235i1414B31177O6826
17288B98003P7301L9572k02779q5234L71930B29341K17917j61314c6055B19600
$$ plain form
17277 -45330 139033 160429 204652 42033 182148 440471 216262 92930 550369 -28194 152669
17265 444530 -185653 93190 -62160 408975 71783 247366 -121133 -7472 27194 158151 108164
17254 108164 32834 -18632 182007 378331 147475 453286 111290 44127 74803 52825
17244 52825 2001 678654 312334 -6106 363217 227339 190533 88824 405663 37275 147596
17233 147596 205212 284414 -45075 308457 257925 155793 148839 21552 255599 140480 -59166
17221 -128701 70626 108218 -30681 26938 725977 228769 309921 367027 -88518 231801 186047
17210 186047 -38810 102818 512445 256655 267620 285279 -110022 380297 198916 84581
17199 454422 386809 -147581 204399 303386 318249 183342 102551 164751 252828 -50546 31337
$$ packed form
17277d5330A39033K1396M4223D2033J40115K58323B16262I2930M57439b8194A52669
17265D44530a85653I3190f2160D08975G1783J75583a21133g472B7194J30957m9987
17254A08164C2834a8632A82007J96324A47475L05811A11290D4127L0676k1978
17244E2825B001O76653C12334f106C63217j35878l6806H8824L16839C7275J10321
17233A47596N7616P9202d5075C08457n0532j02132o954B1552K34047j15119e9166
17221a28701G0626L7592c0681B6938O99039B28769Q1152N7106h8518B31801m5754
17210A86047c8810A02818M09627k55790J0965J7659a10022C80297j81381H4581
17199D54422o7613a47581B04399R8987J4863j34907q0791O2200Q8077e0546C1337
$$ plain form
17187 355364 -85980 240739 238949 237830 184171 -56101 16136 93982 219757 186303 353608
17176 353608 281588 236667 172723 307912 193850 549307 466523 419175 233232 198171 363451
17165 363451 184332 122265 303533 516384 345384 266505 409136 389336 467315 155013
17154 353678 328322 221413 39176 312926 207072 402891 265322 150500 303811 568933
17144 568933 158891 325194 294124 278186 368090 355764 197661 301068 219311 418447
17134 418447 360443 749089 260514 219203 345467 390614 225606 241450 642766 388942
17124 388942 74043 370836 412433 209881 71656 317525 368830 541720 606794 310137
17114 310137 464741 686873 310296 173156 279235 752741 266709 307304 543461 621677
$$ packed form
17187C55364h5980B40739j790j119n3659e6101A6136P7846J25775l3454J67305
17176C53608p2020m4921o3944J35189j14062L55457q2784m7348j85943l5061J65280
17165C63451j79119o2067J81268K12851j71000p8879J42631j9800P7979A55013
17154C53678k5356j06909C9176K73750j05854J95819j37569j14822J53311K65122
17144E68933A58891J66303l1070j5938Q9904j2326j58103J03407q1757J99136
17134D18447n8004L88646B60514m1311J26264M5147j65008J5844M01316k53824
17124C88942G4043K96793M1597k02552G1656K45869N1305J72890O5074k96657
17114C10137J54604K22132C10296j37140J06079M73506B66709M0595K36157P8216
$$ plain form
17104 621677 200710 331907 411638 557798 571331 199285 522844 583188 336029 328561
17094 328561 538588 449861 304160 327043 390652 -56808 587085 271972 425714 338541
17084 338541 536957 386230 747314 485759 669254 258612 430256 332524 439199 260237
17074 260237 465292 562718 574378 477034 267790 521427 686760 632812 495983 860780
17064 860780 295870 405839 789955 281491 402352 482897 379651 239007 470578 547017
17054 547017 568791 876091 264476 574133 174372 467548 443681 596909 343619 448776
17044 448776 727122 355709 604463 477717 545790 671169 835442 675340 745857 861378
17034 861378 583303 429742 824360 598416 543415 620535 737723 590736 825809 698139
$$ packed form
17104F21677B00710J31197P9731J46160J3533A99285L23559O0344k47159p468
17094C28561K10027q8727j45701K2883O3609e6808E87085B71972J53742q7173
17084C38541J98416j50727L61084k61555J83495B58612J71644r7732J06675j78962
17074B60237K05055R7426J1660r7344k09244K53637J65333n3948j36829L64797
17064H60780B95870J09969L84116B81491J20861Q0545j03246j40644K31571P6439
17054E47017K1774L07300B64476L09657A74372K93176k3867J53228k53290J05157
17044D48776K78346C55709K48754j26746O8073J25379J64273j60102P0517J15521
17034H61378k78075j53561L94618k25944n5001P7120J17188j46987K35073j27670
$$ plain form
17024 698139 720054 716745 675691 419791 730479 296835 739275 944457 726764 776912
17014 776912 700558 863736 621289 737696 700363 759047 599295 740395 596559 773588
17004 773588 603042 891072 826251 660200 679178 703268 500113 752177 649400 779896
16994 779896 777239 624471 978426 1053638 914437 963035 915427 672952 946882 855319 1010516
16983 1010516 937340 475932 922246 750029 732062 986562 651974 1148399 865636 760257
16973 760257 1182614 857877 734019 1044348 1168403 998445 897375 1202277 931374 850507
16963 850507 1103488 741725 1151838 1172270 871800 1274202 1228978 1119237 1051153 1372629
16953 1372629 773007 1181288 1146494 1237886 1272568 1290991 1150035 729077 1099318 1480070
$$ packed form
17024F98139K1915l309m1054k55900L10688B96835M42440K05182k17693N0148
17014G76912p6354J63178k42447J16407l7333N8684j59752J41100j43836J77029
17004G73588j70546K88030o4821j66051J8978K4090k03155K52064j02777J30496
16994G79896k657j52768L53955P5212j39201M8598m7608k42475K73930r1563J55197
16983A010516p3176m61408M46314j72217j7967K54500l34588M96425k82763j05379
16973G60257M22357l24737j23858L10329J24055j69958j01070L04902k70903q0867
16963H50507K52981l61763M10113K0432l00470M02402m5224j09741o8084L21476
16953A372629n99622M08281l4794R1392L4682J8423j40956m20958L70241L80752
$$ plain form
16943 1480070 1050200 1374253 1271404 1146256 1113342 1087976 1655630 1476041 1507664 1093367
16933 1093367 1521295 1365222 1557224 1474318 1714565 1648350 1430455 1232994 1288834 1316396
16923 1316396 1618462 1216242 1604739 1227627 1581865 1655447 1564620 1655768 1598270 1095667
16913 1095667 1502349 1737017 1595299 1869922 1558361 1736254 1658956 1948765 1947974 1982681
16903 1982681 2208109 1642348 1965387 1559243 1706305 1838266 2082618 2007284 2107459 1738395
16893 1738395 2092651 2246039 2076810 2024905 1941325 2116124 2408857 1863432 1891838 2151187
16883 2151187 2037960 2259201 2259559 2323431 2383366 2222319 2272737 2530967 2291636 2453520
16873 2453520 2763220 2547570 2865344 2646373 2335749 2952574 2550671 2908595 3210027
$$ packed form
16943A480070m29870L24053j02849j25148l2914k5366N67654j79589L1623m14297
16933A093367M27928j56073J92002q2906K40247o6215k17895j97461N5840K7562
16923A316396L02066m02220L88497l77112L54238P3582r0827R1148n7498n02603
16913A095667M06682K34668j41718K74623l11561J77893p7298K89809p91L4707
16903A982681K25428n65761L23039m06144J47062J31961K44352p5334J00175l69064
16893A738395L54256J53388j69229n1905q3580J74799K92733n45425K8406K59349
16883B151187j13227K21241L58O3872N9935j61047N0418K58230k39331J61884
16873B453520L09700k15650L17774k18971l10624O16825m01903L57924L01432
$$ plain form
16864 3210027 2981668 3173867 2970079 2981248 2920278 3099572 2654777 2998633 3413930 3223903
16854 3223903 3383894 3168556 3417060 3577728 3320782 3272952 3442248 3838562 3692989 3846745
16844 3846745 3753236 3797802 3941122 3852959 4221592 4278969 4216605 4110582 4087344 4627749
16834 4627749 4575221 4640611 4458851 4904306 4590470 4736531 4646716 5437146 5234251 5196122
16824 5196122 5378033 5607164 5721088 5962792 5494945 5922928 6010709 5886037 6481296 6382625
16814 6382625 6201373 6607358 6738634 6913661 7275192 7265957 7128115 7652439 7951403 8021232
16804 8021232 7743926 8280475 8202782 8454961 8798646 8827334 9247282 9348029 9522161 9905296
16794 9905296 10065936 10382159 10884973 11312232 11370383 11676480 12187249 12020702 12789461 13093498
$$ packed form
16864C210027k28359J92199k03788J1169o0970J79294m44795L43856M15297j90027
16854C223903J59991k15338K48504J60668k56946m7830J69296L96314j45573J53756
16844C846745r3509M4566J43320q8163L68633N7377o2364j06023k3238N40405
16834D627749n2528O5390j81760M45455l13836J46061q9815P90430k02895l8129
16824E196122J81911K29131J13924K41704m67847M27983Q7781j24672N95259r8671
16814F382625j81252M05985J31276J75027L61531r235j37842N24324K98964O9829
16804H021232k77306N36549p7693K52179L43685K8688M19948J00747J74132L83135
16794I905296J60640L16223N02814M27259N8151L06097N10769j66547P68759L04037
$$ plain form
16784 13093498 12997068 13570657 14158825 14549124 14850165 15404479 15711597 16299299 16866178
16775 16866178 17255042 18014823 18469736 18979133 19906514 20592721 21227541 22264527 22525188
16766 22525188 23779221 24500701 25713108 26293644 27726468 28898951 30058577 31113930
16758 31113930 32400538 33650203 35272057 36963690 38750195 40571980 42271140 44267952
16750 44267952 46601187 48785277 51354558 53844268 56777608 59553898 62822837 66214879
16742 66214879 70134771 73683809 77698145 82264122 86861194 91779040 97005005 102390207
16734 102390207 107943840 113986544 120334329 126443188 133121937 139542246 145820802 151598432
16726 151598432 157550870 163653533 168407410 172452549 176226347 178682217 180299170 180922293
$$ packed form
16784A3093498r6430N73589N88168L90299L01041N54314L07118N87702N66879
16775A6866178L88864P59781M54913N09397R27381O86207O34820J036986K60661
16766B2525188J254033P21480J212407N80536J432824J172483J159626J055353
16758C1113930J286608J249665J621854J691633J786505J821785J699160J996812
16750D4267952K333235K184090K569281K489710K933340K776290L268939L392042
16742F6214879L919892L549038M014336M565977M597072M917846N225965N385202
16734A02390207N553633O042704O347785O108859O678749O420309O278556N777630
16726A51598432N952438O102663M753877M045139L773798K455870J616953O23123
$$ plain form
16718 180922293 180400929 179026355 176544754 173123364 168826330 163658210 157995235 152244716
16710 152244716 145785639 138916997 132549007 126197152 119708126 113296964 107182687 101288526
16702 101288526 95874780 90695277 85749808 81054943 76314092 72545514 68639989 64907199
16694 64907199 61324995 58185864 55517557 52692681 49952608 47205023 45104560 42849520
16686 42849520 40745529 38640062 37194077 35350710 33955911 32792229 31325593 29749587
16678 29749587 28449881 27311627 26355001 25189837 24242425 23202014 22483158 21639154 20727022
16669 20727022 19971294 18951675 18573025 18004278 17452281 16643822 16359971 15645717 15391978
16660 15391978 14776553 14411338 13739036 13652402 13005750 12717389 12099284 11745521 11526685
$$ packed form
16718A80922293n21364j374574k481601l421390m297034n168120n662975n750519
16710A52244716o459077o868642o367990o351855o489026o411162o114277n894161
16702A01288526n413746n179503m945469m694865m740851l768578l905525l732790
16694F4907199l582204l139131k668307k824876k740073k747585k100463k255040
16686D2849520k103991k105467j445985j843367j394799j163682j466636j576006
16678B9749587j299706j138254r56626j165164r47412j040411p18856q44004r12132
16669B0727022p55728j019619l78650n68747n51997q08459k83851p14254k53739
16660A5391978o15425l65215o72302q6634o46652k88361o18105l53763k18836
$$ plain form
16651 11526685 10958162 11237171 10621673 10343496 9857002 9672541 9975881 9282756 9131814
16642 9131814 8770069 8325011 8743443 8260997 7916953 7741593 7372411 7082310 7149795 6944120
16632 6944120 6999280 6635815 6221396 6490005 6398628 6274162 5824637 5836046 5544191 5529047
16622 5529047 5319676 5414141 5257937 5077036 5015466 4911275 4784507 4549366 4454339 4643743
16612 4643743 4550313 4505739 3978120 4390018 4552445 3992280 4349776 3840905 3685844 3670701
16602 3670701 3590091 3835900 3640926 3404764 3698283 3422731 3329038 3435617 3187519 3600866
16592 3600866 2889845 3171819 2871449 2872624 3049912 2847044 2668833 2892786 2703136 2620793
16582 2620793 2646360 2572349 2520718 2437633 2180920 2254833 2478861 2557189 2375937 2334591 2233839
$$ packed form
16651A1526685n68523K79009o15498k78177m86494j84461L03340o93125j50942
16642I131814l61745m45058M18432m82446l44044j75360l69182k90101O7485k05675
16632F944120N5160l63465m14419K68609r1377j24466m49525J1409k91855j5144
16622E529047k09371R4465j56204j80901o1570j04191j26768k35141r5027J89404
16612D643743r3430m4574n27619M11898J62427n60165L57496n08871j55061j5143
16602C670701q0610K45809j94974k36162K93519k75552r3693J06579k48098M13347
16592C600866p11021K81974l00370J175J77288k02868j78211K23953j89650q2343
16582B620793K5567p4011n1631q3085k56713P3913K24028P8328j81252m1346j00752
$$ plain form
16571 2233839 2667227 2294103 2204040 2366253 1848380 1951997 2242084 1996725 1825711 1803062
16561 1803062 1979372 1493527 1996506 1827182 1660497 1986965 1761933 1507165 1810869
16552 1810869 1634153 1455463 1607393 1668230 1508564 1499596 1719453 1559700 1389325 1754063
16542 1754063 1488358 1719230 1587196 1479654 1387822 1695807 1426983 1630716 1491449 1255101
16532 1255101 1494345 1231409 1121230 1259872 1193310 1380459 1248108 1170520 1255322 1323980
16522 1323980 1329666 1264666 1110546 1112208 1109274 1060724 1075708 1293161 1080018 1128336 1274348
16511 1274348 878286 1410234 815140 898452 1163198 1037128 908191 1032476 898494 951990
16501 951990 635278 1062209 852067 1236174 981476 1066369 1046777 705886 836688 1115874
$$ packed form
16571B233839M33388l73124r0063J62213n17873J03617K90087k45359j71014k2649
16561A803062J76310m85845N02979j69324j66685L26468k25032k54768L03704
16552A810869j76716j78690J51930O0837j59666q968K19857j59753j70375L64738
16542A754063k65705K30872j32034j07542r1832L07985k68824K03733j39267k36348
16532A255101K39244k62936j10179J38642o6562J87149j32351p7588Q4802O8658
16522A323980N686o5000j54120J662k934m8550J4984K17453k13143M8318J46012
16511A274348l96062N31948n95094Q3312K64746j26070j28937J24285j33982N3496
16501I51990l16712M26931k10142L84107k54698Q4893j9592l40891J30802K79186
$$ plain form
16491 1115874 952450 727533 1031526 750116 730127 868692 930837 927794 712244 930419
16481 930419 564000 919079 719116 734877 664350 1005546 812652 804054 484183 511841
16471 511841 810745 482382 728730 609256 591527 601613 379149 746221 895765 354549
16460 674642 510379 330850 924060 522604 453001 453646 641020 690179 215428 849342
16450 849342 392229 683542 549478 610731 555001 602433 588928 538397 602511 446692 778001
16439 778001 506096 332879 903092 478095 234342 240930 414308 347898 521429 906498
16429 906498 424719 611222 465903 97548 631703 414446 709622 362291 476081 450509
16419 450509 432358 584091 645213 522906 695853 538697 435670 473682 427708 475876
$$ packed form
16491A115874j63424k24917L03993k81410j9989J38565O2145l043k15550K18175
16481I30419l66419L55079j99963J5761p0527L41196j92894q598l19871K7658
16471E11841K98904l28363K46348j19474j7729J0086k22464L67072J49544C54549
16460F74642j64263j79529N93210m01456o9603O45J87374M9159B15428O33914
16450H49342C92229K91313j34064O1253n5730M7432j3505n0531O4114j55819L31309
16439G78001k71905j73217N70213m24997B34342O588J73378o6410J73531L85069
16429I06498D24719J86503j45319I7548N34155k17257K95176l47331J13790k5572
16419D50509j8151J51733O1122j22307J72947j57156j03027L8012m5974M8168
$$ plain form
16409 475876 445146 404074 271249 215314 386854 336942 378302 173753 526470 147588
16398 536645 183757 265486 524377 524514 214199 521940 473174 69183 651115 393769 291811
16387 291811 468356 436615 431271 228984 498943 154193 174563 120274 225954 263606 113539
16375 485807 514316 51897 496305 377506 82019 467163 255294 422720 93411 246760
16365 246760 439203 105199 351502 531901 305766 329000 192114 345094 -18046 317755
16354 171314 191895 422227 77789 430180 284280 238432 266044 423616 337526 224878
16344 224878 242407 198309 407980 184005 -78566 -229351 199254 -143532 408687 187232
16333 311032 379220 408120 374664 188971 472844 359592 399466 228643 226301 118509 18597
$$ packed form
16409D75876l0730m1072j32825n5935J71540m9912M1360A73753L52717A47588
16398E36645A83757Q1729K58891J37B14199L07741m8766F9183N81932k57346j01958
16387B91811J76545l1741n344k02287K69959A54193K0370n4289J05680L7652A13539
16375D85807K8509E1897M44408j18799H2019L85144k11869J67426I3411J53349
16365B46760J92443A05199K46303J80399k26135K3234j36886J52980a8046C17755
16354A71314K0581K30332G7789L52391j45900m5848K7612J57572q6090j12648
16344B24878J7529m4098K09671A84005g8566j50785A99254a43532D08687A87232
16333C11032O8188K8900l3456j85693K83873j13252L9874j70823k342j07792A8597
$$ plain form
16321 49977 173921 197837 139557 367184 398684 -4785 417734 287445 94911 164852 241382
16310 241382 153177 187452 84674 318577 294476 167043 148790 130341 -88827 26580 225253
16299 225253 -103843 209597 344621 32083 146087 281455 318854 -81254 147558 182807
16289 182807 196389 284410 323159 220682 -67537 80017 322871 69197 -136342 257126 348907
16278 348907 8294 115610 195435 92622 159481 -33066 -92800 57743 -89116 185923 150442
16267 150442 42257 -19662 180108 -60507 625477 252515 531047 300049 -44867 -29448
16257 -29448 71495 244430 103153 371076 -63490 257978 342142 383488 132571 76037 377481
16246 377481 306912 -22438 -165217 155154 107482 -37504 32187 129992 306003 131763 149367
$$ packed form
16321D9977J23944K3916n8280K27627L1500d785D17734j30289I4911O9941P6530
16310B41382q8205L4275H4674K33903k4101j27433j8253j8449h8827B6580J98673
16299B25253a03843B09597J35024C2083J14004J35368L7399h1254A47558L5249
16289A82807J3582Q8021L8749j02477f7537H0017K42854F9197a36342B57126R1781
16278C48907H294J07316P9825I2622O6859c3066n9734E7743h9116A85923l5481
16267A50442D2257a9662A80108f0507F25477B52515K78532k30998d4867J5419
16257b9448G1495J72935A03153K67923f3490B57978Q4164M1346A32571n6534L01444
16246C77481p0569b2438j42779A55154m7672c7504C2187R7805J76011A31763J7604
$$ plain form
16235 149367 97932 291152 346792 35332 272571 168952 -69233 350472 254875 -61361 135227
16223 110206 178473 12203 -9448 164662 -46573 -48714 258339 127799 -133938 -7452 -311652
16212 -311652 387673 -277197 -125986 -345708 162174 103561 -1322 -13642 335802 128556
16201 70271 162420 -45551 9768 -262519 208851 -57933 88153 291044 -63787 176582 25516
16189 181657 -56001 -55745 17491 229041 -102996 320804 -45260 -52770 66615 193464 -261835
16177 83192 128844 -300377 -103836 52859 -42344 2642 -158553 -81448 178198 432261 203012
16165 137042 90401 284598 73268 371565 241469 -112915 -78633 243089 -241626 25179
16154 -66901 149002 -119512 195820 -49011 -86344 -19564 114610 71294 68700 -226490 149220
$$ packed form
16235A49367n1435J93220N5640C5332K37239j03619f9233C50472r5597f1361A35227
16223A10206O8267A2203i448A64662d6573k141B58339A27799a33938g452l04200
16212c11652C87673b77197a25986k19722A62174n8613a322j2320C35802A28556
16201G0271R2149d5551I768b62519B08851e7933H8153K02891f3787A76582B5516
16189A81657e6001K56A7491K11550a02996C20804d5260p510F6615J26849b61835
16177H3192M5652c00377a03836E2859d2344B642a58553P7105A78198K54063B03012
16165A37042m6641J94197G3268K98297j30096a12915L4282B43089b41626B5179
16154f6901A49002a19512A95820d9011l7333a9564A14610m3316k594b26490A49220
$$ plain form
16142 -117201 8686 138125 38240 112120 -255210 169020 111089 -289249 -201662 -105053 -41041
16130 225438 349935 72286 115130 -103540 177838 118797 114491 86920 147703 -47561 -43096
16119 -43096 -158066 58265 -43532 144390 156108 -226937 -19097 -129151 -81822 -195018 -196405
16108 -196405 148545 -55007 -51522 -65817 39636 40960 283571 10244 74436 -138494 48995
16096 -33369 120576 -11655 -85253 115894 -241772 -81534 -188800 -22635 158486 319284
16086 319284 -79347 84791 144444 -329464 239444 121653 20332 -75418 -453 12829 23311
16075 23311 231149 -91758 315631 -317367 -212661 -3034 69691 7531 -267738 -140107 -57259
16063 28989 -108233 -54683 8211 37081 -75494 -161663 -158413 -270988 -3040 75026 -246603 260934
$$ packed form
16142a17201H686J29439C8240P3880b55210A69020n7931b89249Q7587R6609d1041
16130B25438J24497G2286M2844a03540A77838n9041m306k7571O0783d7561M465
16119d3096j14970E8265d3532A44390J1718b26937a9097j10054M7329j13196j387
16108a96405A48545e5007L485j4295C9636J324K42611A0244O4192a38494D8995
16096c3369A20576a1655p3598A15894b41772h1534j07266b2635A58486J60798
16086C19284g9347H4791N9653c29464B39444j17791B0332g5418d53A2829J0482
16075B3311K07838i1758C15631c17367J04706c034F9691G531b67738J27631e7259
16063B8989a08233N3550H211K8870g5494q6169L250j12575c040G5026b46603B60934
$$ plain form
16050 -155466 -195218 83699 209237 -66595 179979 41992 46462 -151481 -101017 -24155 33732
16038 -97827 -116 49681 -25647 -144227 4841 44459 -270446 349837 213958 62423 -166322
16026 84188 333331 30281 225028 -6372 -23418 -64200 16820 -61478 -176258 166520 -178290
16014 -8318 357694 161754 85464 -94968 45343 64300 -256811 16689 109805 79231 -148542
16002 -171477 -37222 -274356 -70194 -6667 -261393 -268995 -258231 102327 -136780 46249 86841
15991 86841 -70788 -46409 9209 -25248 9738 411878 371822 63796 690199 476939 269383
15980 269383 241455 539211 211420 263318 57017 131214 87367 279276 -49736 52639 -106696
15968 -153355 47121 -28219 46260 180468 257226 184910 -214161 85422 -22386 -10768 15484
$$ packed form
16050a55466l9752H3699J25538f6595A79979D1992M470a51481N0464b4155C3732
16038i7827a16D9681b5647j18580D841L9618b70446C49837j35879F2423a66322
16026H4188K49143C0281J94747f372j7046m0782A6820f1478j14780A66520a78290
16014h318C57694A61754p6290i4968D5343J8957b56811A6689R3116l0574a48542
16002a71477c7222k37134g0194f667k54726p602J0764A02327a36780D6249M0592
15991H6841g0788K4379I209b5248I738M02140m0056F3796O26403k13260k07556
15980B69383k7928K97756B11420N1898E7017P4197m3847J91909d9736E2639a06696
15968a53355D7121b8219D6260J34208P6758p2316b14161H5422b2386a0768A5484
$$ plain form
15956 -235641 -118883 -10189 -527889 155596 118449 -166087 84287 -226525 -4745 -277904
15946 -277904 132615 1338 -98570 95636 -489257 83858 398763 -112013 -164627 -100293 -343173
15935 -343173 -6250 -295321 6936 17871 -14503 -179322 3671 -44225 164563 -31627 -13344
15923 -208454 -3286 142020 -6633 140008 76988 45096 -40139 92234 -26237 -133545 -86324
15912 -86324 111411 21116 -62805 -98307 142593 151053 -33330 289 -102096 -86802 88653 -98893
15899 -13937 -354487 -81929 81087 29429 -11761 -15149 281858 -192161 130443 -150567 -316503
15888 -316503 -18538 83637 -146937 57346 60853 -132396 -206458 27708 -253463 22847 168686
15877 168686 3077 77841 -62493 -101103 -233022 49637 100984 -226135 41570 18798 -154587
$$ packed form
15956b35641J16758a0189n17700A55596l7147a66087H4287b26525d745k73159
15946b77904A32615A338i8570I5636d89257H3858L14905a12013n2614O4334k42880
15935c43173f250k89071F936J0935a4503j64819C671d4225A64563c1627a3344
15923b08454c286A42020f633A40008o3020l1892d0139I2234b6237j07308M7221
15912h6324A11411B1116f2805l5502A42593Q460c3330B89a02096J5294H8653i8893
15899a3937l40550h1929H1087B9429a1761l388B81858a92161A30443a50567j65936
15888c16503a8538H3637a46937E7346L507a32396p4062B7708b53463B2847J45839
15877A68686C077P4764f2493l8610j31919D9637N1347b26135D1570A8798a54587
$$ plain form
15865 -306198 57983 106892 -96681 35843 -143020 -52266 138443 -93144 123118 123217 224920
15854 224920 4102 -6090 -23884 -240350 224824 26598 -263917 121873 31051 112452 -461141
15842 -32452 -7707 75720 41215 -15815 -310258 232658 334768 -67331 122402 150576 -328778
15830 189957 -90548 -18850 10803 -161047 275948 -1616 -308845 -24290 183294 -208581 327066
15818 147380 -153717 147479 -227713 -193390 -101519 -186677 48222 -142133 -265910 -78138
15807 -75210 -367122 -283012 117608 62090 -15880 196889 -8215 -140256 5527 289494 -89984
15795 -99175 -297172 -35010 9653 69209 191878 -2043 526 45768 362102 -72515 30743 215231
15783 215231 -236708 84535 58283 -95088 -319721 -20870 -87903 -27443 51771 59144 -12143
$$ packed form
15865c06198E7983M8909i6681C5843a43020e2266A38443i3144A23118R9J01703
15854B24920D102f090j7794k16466B24824B6598b63917A21873C1051Q1401d61141
15842c2452g707G5720l4505a5815k94443B32658J02110f7331A22402K8174c28778
15830A89957i0548a8850A0803a61047B75948a616l07229b4290A83294b08581C27066
15818A47380a53717A47479b27713L4323R1871q5158D8222a42133j23777g8138
15807g5210k91912Q4110A17608n5518a5880A96889h215j32041E527K83967h9984
15795i9175j97997c5010I653N9556J22669b043E26M5242L16334g2515C0743J84488
15783B15231b36708H4535k6252i5088k24633b0870o7033b7443E1771P373a2143
$$ plain form
15771 -75486 -19529 -62597 194069 13112 -282882 -113426 -87530 83655 190237 53363 53573
15760 53573 285303 145312 162251 24012 -150601 183420 -130657 -223068 -83329 287787
15749 108649 495721 -312214 85320 -179603 236639 -378227 -94418 128941 94876 -232731
15738 117050 -8626 -2364 -307476 -174894 -132643 -81048 19968 147822 156889 -472727 -52439
15726 -194527 -142736 41848 151259 -784 -279559 107707 -59319 57712 302647 -253955 -67443
15714 -313640 7991 116529 220626 -123259 -207166 -126156 168108 169198 -179130 -45343 58810
15702 -112083 -182869 -35206 -97866 268488 -84706 -15044 -20552 -107165 109012 28606 -20435
15690 415753 251729 325206 -93039 -25421 -232500 -97948 -30594 -144266 276461 35739 -202429
$$ packed form
15771g5486a9529m3068A94069A3112b82882a13426K5896H3655J06582E3363K10
15760E3573K31730j39991J6939B4012a50601A83420a30657r2411h3329B87787
15749A08649L87072c12214H5320a79603B36639c78227i4418A28941l4065b32731
15738A17050h626b364l05112J32582M2251N1595A9968J27854R067d72727e2439
15726a94527N1791D1848J09411g84k78775A07707e9319E7712K44935b53955f7443
15714c13640G991J08538J04097a23259q3907Q1010A68108J090a79130d5343E8810
15702a12083p0786c5206o2660B68488h4706a5044n508q6613A09012B8606b0435
15690D15753j64024P3477i3039b5421k07079i7948c0594j13672B76461C5739b02429
$$ plain form
15678 -165653 -251746 -52921 72195 259217 -239787 -157522 24814 275656 7346 -236997 -38473
15666 -12331 -111176 -412939 -3982 37609 -193164 51386 -129260 -129395 45755 -143492 48273
15654 -20473 -157104 323704 -87048 65228 134803 78133 -148268 -106790 9737 235832 124327
15643 124327 -29084 -202521 -17314 46053 174170 -10776 -268230 187174 -84035 -164749 -221776
15632 -221776 104256 63939 -351264 187816 116910 -262911 113475 309923 -21641 3143
15621 -24844 -193137 61854 -104615 -118493 131936 118777 55954 245708 -430440 -117178
15610 -53331 -204135 105723 -77709 -28976 -75233 14398 -146730 -155864 -51074 -107612 -50021
15598 -69566 285449 -83363 -374996 133757 286414 -25981 -121542 -41510 -185525 -162344 -146987
$$ packed form
15678a65653q6093e2921G2195J87022b39787Q2265B4814K50842G346b36997c8473
15666a2331r8845l01763c982C7609a93164E1386a29260j35D5755a43492D8273
15654b0473j36631C23704h7048F5228O9575n6670a48268M1478I737K26095j11505
15643A24327b9084j73437a7314D6053J28117a0776k57454A87174h4035q0714n7027
15632b21776A04256m0317c51264A87816p0906b62911A13475J96448b1641C143
15621b4844j68293F1854a04615j3878A31936j3159E5954J89754d30440a17178
15610e3331j50804A05723g7709b8976m6257A4398a46730r134e1074n6538e0021
15598f9566B85449h3363k91633A33757J52657b5981r5561d1510j44015K3181J5357
$$ plain form
15587 -146987 149293 -268668 -249411 -58912 26417 -66565 -182832 -3863 -178802 75220 75274
15576 75274 23422 14476 -48915 -118477 -221481 232002 -44016 120136 121722 -33675 16342
15564 342495 103345 205326 -211723 -161388 -12560 -3772 199621 -72047 -188576 -195247 168708
15552 -115312 -78997 -133737 -259831 139880 -158872 -28597 381325 -83172 147068 -74300
15541 -284007 88731 109538 5299 8636 12766 -205765 -98672 73720 182748 48659 -206340
15529 66702 -100833 -203597 38575 11811 90048 -42761 -273243 -19855 -143693 -110925 98525
15517 3525 14551 140916 255620 50729 198366 -134196 18083 86011 -78690 -1104 52912
15505 -177088 -77840 25792 -58683 -67308 34707 19625 136780 54943 90916 166296 84444
$$ packed form
15587a46987A49293b68668J9257e8912B6417f6565j16267c863j74939G5220N4
15576G5274B3422q946d8915o9562j03004B32002d4016A20136J586c3675A6342
15564C42495A03345J01981b11723N0335a2560c772A99621g2047j16529o671A68708
15552a15312L6315n4740j26094A39880a58872b8597C81325h3172A47068g4300
15541b84007H8731K0807E299L337M130b05765i8672G3720J09028D8659b06340
15529F6702a00833j02764C8575A1811P8237d2761k30482a9855j23838L2768I8525
15517C525J1026J26365J14704E0729J47637a34196A8083O7928g8690a104E2912
15505a77088g7840B5792e8683q625C4707j5082J17155E4943L5973P5380q1852
$$ plain form
15494 84444 98536 -73186 -262376 27689 219441 197963 86933 67568 -206435 -27325 71871
15482 -42491 -93816 -213419 101261 7293 -378077 -192591 160534 -219442 -41413 -48283 67575
15470 77793 -271194 -71748 -32019 124940 -295879 78956 -224005 -247566 166426 53291 237694
15459 237694 -84086 28494 -79365 408031 135361 42431 -318354 138743 67364 179644
15449 179644 231642 -103400 -47158 -233548 -140169 61099 -146025 -125463 30314 -244310 122952
15437 -248917 -66633 133147 190994 -76051 175515 91829 3649 20295 -8886 69482 -96067
15425 136873 125659 -134600 -24730 22773 80797 -86790 326333 14311 254865 154866 92570
15414 92570 -141497 -13677 -124451 268850 -71773 -88916 31878 378345 -87775 -181998 128855
$$ packed form
15494H4444J4092g3186j89190B7689J91752k1478H6933j9365b06435b7325G1871
15482d2491n1325j19603A01261G293c78077J85486A60534b19442d1413o870F7575
15470G7793b71194g1748c2019A24940b95879G8956b24005k3561A66426E3291J84403
15459B37694h4086B8494g9365D08031A35361D2431c18354A38743F7364J12280
15449A79644N1998a03400d7158j86390R3379F1099a46025K0562C0314b44310A22952
15437b48917f6633A33147N7847g6051A75515q3686C649J6646h886F9482i6067
15425A36873j1214a34600b4730B2773N8024h6790C26333A4311K40554r9999o2296
15414I2570a41497a3677j10774B68850g1773j7143C1878L46467h7775r4223A28855
$$ plain form
15402 324363 -24107 268557 -24346 73374 -207518 -32856 270845 -96544 -169497 196217 -143409
15390 304860 -60186 255684 -71903 -56083 -146315 -44200 -160273 317228 -87388 -104431 -153784
15379 -153784 -90834 -384859 56373 -85952 219863 194647 7555 -125850 -61149 -195341 -176361
15368 -176361 111525 303843 191245 2871 -153611 264344 -144154 412958 -47658 6184
15357 44583 -447511 -3722 50810 -333 344492 -79292 -334569 -60867 150979 163021 235013
15346 235013 211434 -55979 238534 -233391 -103113 140418 -191967 -452423 173230 -18264
15335 28929 -44998 156450 -167965 149363 247145 -79250 -15710 320906 113607 263411
15325 263411 107305 -101081 -46010 174627 -6660 198002 -1133 101729 22890 -88771 -508227
$$ packed form
15402C24363b4107B68557b4346G3374b07518c2856B70845i6544p2953A96217a43409
15390C04860f0186B55684g1903J5820r0232d4200j16073C17228h7388j7043m9353
15379a53784O2950k94025E6373h5952B19863k5216G555a25850f1149j34192J8980
15368a76361A11525J92318j12598B871a53611B64344a44154D12958d7658F184
15357D4583d47511c722E0810c33C44492g9292k55277f0867A50979J2042P1992
15346B35013k3579e5979B38534b33391a03113A40418a91967k60456A73230a8264
15335B8929d4998A56450a67965A49363R7782g9250a5710C20906A13607J49804
15325B63411A07305a01081d6010A74627f660A98002a133A01729B2890h8771m19456
$$ plain form
15314 -508227 -224281 38545 114177 -243100 -101675 22723 230453 12092 126501 26707
15303 -175490 29103 -10531 -173914 -101669 -109249 -81199 -50115 78995 16276 -67101 -18185
15291 57879 -63304 61641 110608 153215 120822 237578 217393 320390 199780 -128806 29944
15279 -42899 -73792 -34278 147097 88385 -91565 219354 105384 -155165 -176139 132533 29616
15267 -97015 99290 180561 -23182 39171 160117 -107275 155207 297237 382437 -49790 126014
15255 50660 205719 12659 11109 127678 -90600 25690 407029 879859 1761029 1173854 964061
15244 964061 1420215 905396 144791 185317 32431 -75892 97038 50884 -34352 122919 -160372
15232 67218 106649 130610 332395 102763 -276949 130380 74876 -87002 188157 21948 -174625
$$ packed form
15314e08227b24281C8545P5632b43100a01675B2723K07730A2092J14409B6707
15303a75490B9103a0531j63383P2245p580K8050L1084G8995A6276f7101a8185
15291E7879f3304F1641M8967M2607l2393J16756k0185J02997j20610a28806B9944
15279d2899l0893c4278A47097n8712i1565B19354A05384a55165k0974A32533B9616
15267i7015I9290Q1271b3182C9171J20946a07275A55207J42030Q5200d9790A26014
15255E0660J55059A2659j550J16569i0600B5690L81339M72830Q81170n87175k09793
15244I64061M56154n14819A44791M0526C2431g5892I7038m6154c4352A22919a60372
15232F7218L9431K3961K01785A02763b76949A30380n5504h7002A88157B1948a74625
$$ plain form
15220 -111214 -22341 46187 -15644 128505 102723 -75416 287417 348633 257778 -22986 519099
15208 -296510 -56779 97182 -320887 145855 -6326 165959 -77994 -338279 260154 203921 65562
15196 208711 -150067 126499 218098 29568 243602 118238 122050 128091 164024 259659 153684
15185 153684 26449 333879 -257816 188534 -31970 294125 -78752 352513 108855 -10224
15174 11016 166672 340999 123667 65790 81627 -367397 185484 -68853 53525 -22022 100738
15162 175879 186793 -235402 168776 -88570 268581 235197 -44854 -87945 210447 131170 211499
15151 211499 -32907 -1364 200775 280676 -129305 234092 -39086 -177263 35970 -85177 -9684
15139 257578 159283 70873 88463 -285953 -44881 -145257 -984 226217 107547 -7670 73227
$$ packed form
15220a11214b2341D6187a5644A28505k5782g5416B87417O1216r0855b2986E19099
15208b96510e6779I7182c20887A45855f326A65959g7994k60285B60154n6233F5562
15196B08711a50067A26499R1599B9568K14034A18238L812O041L5933R5635j05975
15185A53684B6449L07430b57816A88534c1970B94125g8752C52513A08855a0224
15174A1016J55656J74327A23667n7877J5837c67397A85484f8853E3525b2022A00738
15162A75879J0914b35402A68776h8570B68581l3384d4854m3091B10447p9277Q0329
15151B11499c2907a364B00775P9901a29305B34092c9086j38177C5970h5177i684
15139B57578r8295G0873J7590b85953d4881j00376i84B26217A07547g670G3227
$$ plain form
15127 -42194 -186884 -122555 -96849 112038 119601 141803 -162488 163597 -44915 175232 21876
15115 144135 16560 244162 448672 132818 278542 325194 -206595 -12241 -23855 102150
15104 -82721 252198 -128931 171389 516362 167972 -206814 -64369 -72343 89069 249561
15094 249561 17310 -21882 266101 -7869 -60342 123299 28436 89675 392105 227955 -127075
15082 -1768 -133579 57305 272842 268305 -34608 134949 181629 225083 -227518 -302988 153725
15070 191540 293333 17584 281271 39544 33425 180327 201698 25344 31939 191695 226945
15059 226945 216842 152049 162763 32036 51754 504582 82841 -101983 377310 128197 191286
15048 191286 439004 19852 121943 714085 -117361 -7338 280303 349856 203843 15768
$$ packed form
15127d2194j44690O4329K5706A12038P563K2202a62488A63597d4915A75232B1876
15115A44135A6560K27602K04510A32818J45724M6652b06595a2241j1614A02150
15104h2721B52198a28931A71389L44973A67972b06814f4369p974H9069J60492
15094B49561A7310b1882B66101g869n2473A23299B8436O1239L02430j64150a27075
15082a768j31811E7305K15537m537c4608A34949M6680M3454b27518p5470A53725
15070A91540J01793A7584K63687C9544o119J46902K1371B5344O595J59756L5250
15059B26945j0103o4793J0714C2036J9718M52828H2841a01983C77310A28197O3089
15048A91286K47718A9852J02091N92142a17361g338B80303O9553j46013A5768
$$ plain form
15037 441979 167843 260873 200596 -43091 -61637 119328 132665 122439 160467 132335 65336
15025 342443 -35646 411347 -75220 84137 141911 336659 312662 215149 -30484 442726 119155
15013 132265 96152 301140 316974 315996 282550 -21492 -78251 645894 273825 377797 225388
15002 225388 138390 33470 292289 -69720 77847 197274 31574 209089 291508 -42427 207896
14990 -54576 342741 -25067 98557 23361 130466 442356 581299 302484 228860 362121
14980 362121 74983 351018 66909 519133 462653 -47706 333334 356776 408907 -45870 -186780
14969 -186780 396566 282470 284786 118842 182047 331353 168957 330722 89976 95981 346766
14958 346766 109619 14975 414679 139958 211768 170410 257778 405733 373408 -236424
$$ packed form
15037D41979A67843R3030o0277d3091j8546A19328J3337j0226L8028k8132F5336
15025C42443c5646D11347g5220H4137N7774J94748k3997r7513c0484D42726A19155
15013A32265l6113K04988J5834r78l3446b1492n6759F45894B73825J03972j52409
15002B25388q6998C3470K58819f9720G7847J19427C1574J77515Q2419d2427B07896
14990e4576C42741b5067I8557B3361J07105L11890J38943k78815p3624J33261
14980C62121G4983K76035F6909M52224n6480d7706C33334K3442N2131d5870j40910
14969a86780C96566j14096K316A18842O3205J49306j62396J61765H9976O005K50785
14958C46766A09619A4975L99704A39958P1810m1358Q7368J47955l2325b36424
$$ plain form
14947 333659 222661 129645 207184 -38678 229071 269369 242411 339852 253376 53798 128317
14936 128317 336763 276971 500112 160706 157677 -125074 170895 385725 392650 315428 206577
14925 206577 462661 333820 -127866 147893 193360 315798 123711 180644 85443 309532
14915 309532 206656 224340 250489 -63569 257463 244041 443225 124899 501568 331651
14905 331651 527135 196035 433423 -98658 245218 -146453 264344 108797 258532 273126
14895 273126 464153 411759 304853 575036 41296 486766 438040 382767 131558 178149
14885 178149 621987 551118 337584 403556 296861 123909 120187 130121 490530 153933 -270551
14873 134653 246032 239650 585364 524497 139872 801706 569119 309010 345827 340403 315913
$$ packed form
14947C33659j10998r3016P7539c8678B29071M0298k6958R7441q6476E3798P4519
14936A28317K08446n9792K23141A60706l029a25074A70895K14830O925p7222j08851
14925B06577K56084j28841a27866A47893M5467J22438A23711N6933H5443K24089
14915C09532j02876J7684K6149f3569B57463j3422J99184A24899L76669j69917
14905C31651J95484A96035K37388i8658B45218a46453B64344A08797J49735J4594
14895B73126J91027n2394j06906K70183D1296M45470m8726n5273A31558M6591
14885A78149M43838p0869k13534O5972j06695A23909l722R934L60409A53933b70551
14873A34653J11379o382L45714o0867A39872O61834k32587k60109L6817n424k4490
$$ plain form
14862 315913 429219 292789 679590 442536 223543 479458 302600 417535 217051 447447
14852 447447 379687 498788 608443 193183 371470 312882 353501 249387 400022 484458
14842 484458 168783 305333 473099 177777 513454 384552 441215 461390 392385 288807
14832 288807 519004 192228 688679 369114 599381 749603 321843 151889 564714 129951
14821 422394 529748 520871 562502 321148 342716 485626 824724 547954 753090 532769
14811 532769 235988 -144330 610588 700614 309585 537680 486427 594972 337858 611821
14801 611821 366090 811303 666832 224465 608203 692114 350004 592484 618066 395855
14791 395855 691936 508183 446245 942174 338885 578867 313862 513482 586211 692745
$$ packed form
14862C15913J13306j36430L86801k37054k18993K55915j76858J14935k00484K30396
14852D47447o7760J19101J09655A93183J78287n8588M0619j04114J50635Q4436
14842D84458A68783J36550J67766A77777L35677j28902N6663K0175o9005j03578
14832B88807K30197A92228M96451l19565K30267J50222C21843A51889M12825A29951
14821D22394J07354q877M1631k41354K1568J42910L39098k76770K05136k20321
14811E32769B35988a44330F10588R0026C09585K28095n1253J08545k57114K73963
14801F11821k45731M45213j44471B24465L83738Q3911l42110K42480K5582k22211
14791C95855K96081j83753o1938M95929C38885K39982k65005J99620P2729J06534
$$ plain form
14781 692745 358062 434888 198684 619432 723618 284056 430943 410254 549260 344277
14771 344277 518172 607090 548882 467803 882089 625090 389857 161142 805251 665041
14761 665041 322228 914143 704454 630056 603028 792879 501311 607639 285250 448084
14751 448084 490904 607280 714412 469112 562768 819813 626488 559040 668607 615147
14741 615147 798706 508641 568683 694476 456346 826088 839642 1009250 684765 865152
14731 865152 763152 442566 499361 849808 854337 578082 969526 720731 817496 626389
14721 626389 452396 867020 713274 852251 867276 826694 850366 518863 1246790 844147
14711 844147 933714 493236 803347 1032427 965448 743268 958536 1032550 981203 689380
$$ packed form
14781F92745l34683P6826A98684M20748J04186B84056J46887k0689J39006k04983
14771C44277J73895Q8918n8208q1079M14286k56999k35233A61142O44109j40210
14761F65041C22228N91915k09689p4398k7028J89851k91568J06328B85250J62834
14751D48084M2820J16376J07132k45300R3656K57045j93325o7448J09567n3460
14741F15147J83559k90065O0042J25793k38130L69742J3554J69608l24485J80387
14731H65152j02000l20586N6795L50447M529k76255L91444k48795R6765j91107
14721F26389j73993M14624j53746J38977J5025m0582K3672l31503P27927m02643
14711H44147Q9567m40478L10111K29080o6979k22180K15268P4014n1347k91823
$$ plain form
14701 689380 799827 848382 976218 865405 880480 492276 849927 847049 758313 954845
14691 954845 894500 1074206 611911 737380 977523 853527 861084 840957 974392 876301
14681 876301 760369 800486 1246256 867515 653704 811030 866797 684324 1165092 1246969
14671 1246969 821423 940017 897198 862609 830647 1548003 1086882 921881 791845 865167
14661 865167 1102818 1084616 1262487 805057 1067660 1128156 811653 1059109 1255103 870384
14651 870384 1097090 1099284 1199497 1159980 1179066 1432424 749163 1223596 1554891 1324698
14641 1324698 1266091 1246600 1382539 1448189 1243862 1413557 1339742 1196252 1352593 1336270
14631 1336270 1257488 1275283 1216170 1336271 1517335 1336531 1292273 1323748 1076949 1126275
$$ packed form
14701F89380J10447M8555J27836j10813J5075l88204L57651k878q8736J96532
14691I54845o0345J79706m62295J25469K40143j23996P557k0127J33435r8091
14681H76301j15932M0117M45770l78741k13811J57326N5767j82473M80768Q1877
14671A246969m25546J18594m2819l4589l1962P17356m61121j65001j30036P3322
14661H65167K37651j8202J77871m57430K62603O0496l16503K47456J95994l84719
14651H70384K26706K194J00213l9517J9086K53358o83261M74433L31295k30193
14641A324698n8607j9491J35939O5650k04327J69695p3815j43490J56341j6323
14631A336270p8782J7795n9113J20101J81064j80804m4258L1475k46799M9326
$$ plain form
14621 1126275 1221044 1477556 1358758 1462867 1543408 1115511 1427804 1183605 1449227 1572950
14611 1572950 1340540 1287393 1557141 1196181 1540183 1514299 1360913 1760794 1595083 1476399
14601 1476399 1576762 1462604 1731468 1523286 1870318 1861121 1648620 1529214 1532493 1734450
14591 1734450 1615930 1778572 1632052 1814243 1656090 1966039 1707785 1881734 2065760
14582 2065760 1552190 1942166 2121169 1977345 1877069 1889190 2247907 1923425 2491377 2096604
14572 2096604 1795900 2525886 2087086 2420769 2299599 2187655 2368779 2492729 2756261
14563 2756261 2136290 2520881 2822133 2893037 2559898 2789974 2872079 3095927 3496091 3750923
14553 3750923 4115471 3832952 4640984 5591438 7844178 11906853 19132891 34450305 44986715
$$ packed form
14621A126275R4769K56512j18798J04109Q0541m27897L12293k44199K65622J23723
14611A572950k32410n3147K69748l60960L44002k5884j53386L99881j65711j18684
14601A476399J00363j14158K68864k08182L47032r197k12501j19406L279K01957
14591A734450j18520J62642j46520J82191j58153L09949k58254J73949J84026
14582B065760n13570L89976J79003j43824j00276J2121L58717l24482N67952l94773
14572B096604l00704P29986m38800L33683j21170j11944J81124J23950K63532
14563B756261o19971L84591L01252P0904l33139K30076Q2105K23848M00164K54832
14553C750923L64548k82519Q08032R50454K252740M062675P226038J5317414J0536410
$$ plain form
14544 44986715 22071653 12147239 5997207 3633058 2679250 2207170 2193914 2107561 2044291
14535 2044291 2149221 1946739 2067899 2032777 2197255 2018465 2355334 2175182 2358808 2301534
14525 2301534 2402655 2327817 2249847 2484409 2747326 2597407 2687063 2565930 2694576 2460027
14515 2460027 2381719 2906028 2695658 2778108 2470440 2790739 2905229 3032227 2642253 2987760
14505 2987760 2916464 3114828 3091208 3344174 3101566 3258007 3258476 2976321 3132040 3283553
14495 3283553 3148038 3472825 3468813 3458240 3179533 3137103 3368530 3462363 3415188 3526910
14485 3526910 3539322 3522717 4004189 3465037 3797914 3630250 4063586 3748470 4013613 4342987
14475 4342987 4086597 3881076 4150726 3982091 4060759 4359532 4522696 4501967 4528109 4803303
$$ packed form
14544D4986715B2071653r924414E997207k364149r53808m72080j3256q6353o3270
14535B044291J04930k02482J21160l5122J64478j78790L36869j80152J83626n7274
14525B301534J01121p4838p7970K34562K62917j49919Q9656j21133J28646k34549
14515B460027p8308N24309k10370Q2450l07668L20299J14490J26998l89974L45507
14505B987760p1296J98364k3620K52966k42608J56441M69k82155J55719J51513
14495C283553j35515L24787m012j0573k78707m2430K31427R3833m7175J11722
14485C526910J2412j6605M81472n39152L32877j67664M33336l15116K65143L29374
14475D342987k56390k05521K69650j68635P8668K98773J63164k0729K6142K75194
$$ plain form
14465 4803303 5002203 4949978 4667554 4437803 4988532 4783333 5305922 4905109 5165563 4933409
14455 4933409 4833127 5311882 5023329 5167095 5551248 5573421 5384990 5477913 5443702 5755759
14445 5755759 5782104 5523192 5873415 5903631 6024840 5890185 6158383 6267595 6498519 6607202
14435 6607202 6658367 6449330 6656771 6465298 6799976 6883164 7110428 7371003 7138991 7120163
14425 7120163 7545092 7449931 7848771 7754844 7602722 7861425 8120501 8630838 8372827 8276413
14415 8276413 9026598 8754355 8573261 9057543 9032281 9115406 9414298 9687149 9823098 10048550
14405 10048550 9694167 10078832 10251768 10512666 10727608 10720749 10864453 10971403 11235194 11682038
14395 11682038 11610408 11740066 11887111 12382031 12237207 12531078 12973428 13227693 13095239
$$ packed form
14465D803303J98900n2225k82424k29751N50729k05199N22589m00813K60454k32154
14455D933409j00282M78755k88553J43766L84153K2173j88431R2923l4211L12057
14445E755759K6345k58912L50223L0216J21209j34655K68198J09212K30924J08683
14435F607202N1165k09037K07441j91473L34678Q3188K27264K60575k32012j8828
14425G120163M24929r5161L98840r3927j52122K58703K59076N10337k58011r6414
14415H276413P50185k72243j81094M84282k5262Q3125K98892K72851J35949K25452
14405A0048550l54383L84665J72936K60898K14942o859J43704J06950K63791M46844
14395A1682038p1630J29658J47045M94920j44824K93871M42350K54265j32454
$$ plain form
14386 13095239 13313675 13918155 13844942 14257485 14400852 15000956 15023742 15079752 15843121 15967406
14376 15967406 16157944 16575869 16796871 17301684 17442876 17983564 17978748 18380961 18872822 19271001
14366 19271001 19669792 20118261 20533932 20882173 21404959 21777324 22309285 22815669 23253505
14357 23253505 23804936 24096605 24899966 25792317 26481014 26575401 27566023 27783302 28838723
14348 28838723 29519683 29901140 31049937 31574516 32445290 33533083 34340363 35257024 36015026
14339 36015026 37222359 38127982 39542049 40188923 41693716 42965791 43858911 45382681
14331 45382681 46776667 48372301 49948633 51135918 53178502 54761199 56552152 58368378
14323 58368378 60220886 62233817 64529836 66700190 69040812 71853373 74669923 77493778
$$ packed form
14386A3095239K18436O04480p3213M12543J43367O00104K2786N6010P63369J24285
14376A5967406J90538M17925K21002N04813J41192N40688m816M02213M91861L98179
14366A9271001L98791M48469M15671L48241N22786L72365N31961N06384M37836
14357B3253505N51431K91669Q03361Q92351O88697R4387R90622K17279J055421
14348B8838723O80960L81457J148797N24579Q70774J087793Q07280R16661P58002
14339C6015026J207333R05623J414067O46874J504793J272075Q93120J523770
14331D5382681J393986J595634J576332J187285K042584J582697J790953J816226
14323E8368378J852508K012931K296019K170354K340622K812561K816550K823855
$$ plain form
14315 77493778 80754247 83653399 86810845 90161557 93967207 97914646 101387944 106314873
14307 106314873 110886146 115462313 120831863 126185796 131920022 137689106 144234516 151037882
14299 151037882 157872751 165758515 174007953 182307988 191202455 201002881 210866674 221465507
14291 221465507 232339431 243890929 256063738 268500066 281194693 294530158 308127739
14284 308127739 321888880 335749402 350014436 363801965 377494869 390615841 403539510
14277 403539510 415207132 426026700 435206787 442229147 444866161 444265994 444232202 444700973
14269 444700973 445488092 438532155 433220502 426935724 419017897 409085100 397958396 385164211
14261 385164211 371416719 356703326 342029612 326977944 312427715 297786770 283660627
$$ packed form
14315G7493778L260469K899152L157446L350712L805650L947439L473298M926929
14307A06314873M571273M576167N369550N353933N734226N769084O545410O803366
14299A51037882O834869P885764Q249438Q300035Q894467R800426R863793J0598833
14291B21465507J0873924J1551498J2172809J2436328J2694627J3335465J3597581
14284C08127739J3761141J3860522J4265034J3787529J3692904J3120972J2923669
14277D03539510J1667622J0819568R180087P022360K637014o00167l3792M68771
14269D44700973P87119o955937n311653o284778p917827r932797j1126704j2794185
14261C85164211j3747492j4713393j4673714j5051668j4550229j4640945j4126143
$$ plain form
14254 283660627 270700060 258232318 245440075 233837451 222463792 211625619 201623208
14247 201623208 191956468 182721984 174056330 166477730 158853225 151198538 144219666 138080906
14239 138080906 131822993 126582425 121102314 115979807 111385644 106340406 102083857 98454962
14231 98454962 94570700 91157492 87180778 84087743 80620814 77792101 75067698 72057541
14223 72057541 69689665 67253403 64934837 62676390 60842182 58485912 56676884 54897526
14215 54897526 53084390 51600572 50390598 48517715 47247385 45796591 44129940 42988287
14207 42988287 41964138 41254352 39747603 38852169 37552393 36415512 35787307 34945079 34134071
14198 34134071 33126166 32044579 31406526 30385675 30040430 29243176 28406744 27684432 26769790
$$ packed form
14254B83660627j2960567j2467742j2792243j1602624j1373659j0838173j0002411
14247B01623208r666740r234484q665654p578600p624505p654687o978872o138760
14239A38080906o257913n240568n480111n122507m594163n045238m256549l628895
14231I8454962l884262l413208l976714l093035l466929k828713k724403l010157
14223G2057541k367876k436262k318566k258447j834208k356270j809028j779358
14215E4897526j813136j483818j209974j872883j270330j450794j666651j141653
14207D2988287j024149p09786j506749q95434j299776j136881o28205q42228q11008
14198C4134071j007905j081587o38053j020851l45245p97254q36432p22312r14642
$$ plain form
14189 26769790 26375751 25814352 24969612 24599687 23732645 23509190 23227663 22610152 21850449
14180 21850449 21658643 21256265 20433696 20387985 19787895 19217903 19045175 18562683 18107486
14171 18107486 17813087 17733763 17454665 17009943 16501970 16459074 16134262 15631115 15405901 15031127
14161 15031127 14835028 14629611 14360549 14235172 14163876 13597568 13426372 12938098 13063671
14152 13063671 12989205 12804295 12680153 12231648 12086875 11744114 11697622 11482705 11224925 11206677
14142 11206677 10997672 10574267 10705855 10361544 10276857 10139194 9976924 9967380 9754600 9724152
14132 9724152 9319405 9256786 9330007 8985332 8872147 8838893 8423064 8604373 8558687 8234285
14122 8234285 8324214 8081735 7743225 7596556 7706875 7864392 7791914 7229005 7371818 7547911
$$ packed form
14189B6769790l94039n61399q44740l69925q67042k23455k81527o17511p59703
14180B1850449j91806m02378q22569m5711o00090n69992j72728m82492m55197
14171A8107486k94399p9324k79098m44722n07973m2896l24812n03147k25214l74774
14161A5031127j96099k05417k69062j25377p1296n66308j71196m88274J25573
14152A3063671p4466j84910j24142m48505j44773l42761m6492k14917k57780j8248
14142A1206677k09005m23405J31588l44311q4687j37663j62270r544k12780l0448
14132I724152m04747o2619P3221l44675j13185l3254m15829J81309m5686l24402
14122H234285Q9929k42479l38510j46669J10319J57517p2478n62909J42813J76093
$$ plain form
14112 7547911 7074002 7209211 6869996 6870046 6728667 6976642 6750321 6497932 6374164 6389326
14102 6389326 6308982 6358998 6152995 6073702 6035009 6079137 5927598 5743796 6083287 5806369
14092 5806369 6090656 5517442 5609533 5343748 5017358 5098402 5206435 5152093 5139409 4972974
14082 4972974 5088106 5048084 4706022 4907140 4790475 4988263 4678295 4803010 4888086 4730528
14072 4730528 4802458 4550666 4327210 4296176 4094321 4642386 4198251 4227293 4308348 4432671
14062 4432671 3787562 4351895 4329719 3894790 4232267 4315244 4119974 3803227 3643164 3823186
14052 3823186 3837311 3561908 3745057 3606156 3457514 3485256 3565874 3620437 3782984 3677369
14042 3677369 3404115 3326375 3498888 3354327 3390197 2948961 3282657 3118685 3223312 3268204
$$ packed form
14112G547911m73909J35209l39215N0j41379K47975k26321k52389j23768J5162
14102F389326q0344N0016k06003p9293l8693M4128j51539j83802L39491k76918
14092E806369K84287n73214R2091k65785l26390Q1044J08033n4342j2684j66435
14082D972974J15132m0022l42062K01118j16665J97788l09968J24715Q5076j57558
14072D730528P1930k51792k23456l1034k01855N48065m44135K9042Q1055J24323
14062D432671o45109N64333k2176m34929L37477Q2977j95270l16747j60063J80022
14052C823186J4125k75403J83149j38901j48642K7742Q0618N4563J62547j05615
14042C677369k73254p7740J72513j44561L5870m41236L33696j63972J04627M4892
$$ plain form
14032 3268204 2999489 3051353 2994011 3033539 3417517 3311822 2766160 3081700 2667612 3039480
14022 3039480 2955582 2705541 2821678 2441543 2571322 2559163 2851675 2414310 2728517 2482825
14012 2482825 2667960 2426353 2487875 2604957 2258484 2753707 2394100 2301684 2164348 2465624
14002 2465624 2109605 2641435 2020538 2132906 2168364 2328795 2360832 2192108 2243643 1872192
13992 1872192 2252651 2694720 3252421 4100810 7003226 12707676 27077086 45700764
13984 45700764 26950715 14945270 9038679 6665296 5005614 4313913 3722693 3735197
13976 3735197 3054199 3322253 2894299 2960862 2702406 2756020 2755250 2759193 2526012 2402410 2523119
13965 2523119 2106811 2267829 2440604 2179373 2380274 2051157 2216538 2224543 2298496 1971877
$$ packed form
14032C268204k68715N1864n7342L9528L83978j05695n45662L15540m14088L71868
14022C039480q3898k50041J16137l80135J29779j2159K92512m37365L14207k45692
14012B482825J85135k41607O1522J17082l46473M95223l59607r2416j37336L01276
14002B465624l56019N31830o20897J12368L5458J60431L2037j68724N1535l71451
13992A872192L80459M42069N57701Q48389K902416N704450J4369410J8623678
13984D5700764j8750049j2005445n906591k373383j659682o91701n91220J2504
13976C735197o80998K68054m27954O6563k58456N3614p70L943k33181j23602J20709
13965B523119m16308J61018J72775k61231K00901l29117J65381Q005P3953l26619
$$ plain form
13955 1971877 2282859 1967510 2537449 2035944 2326410 2298877 1997089 2221517 2181758 1795657
13945 1795657 1891915 1963396 1845318 1603744 1873531 1824266 1679689 1798025 1842504 2001385
13935 2001385 1950344 1925410 1959062 1722104 1893856 1796586 1633380 1953982 1601644 1603055
13925 1603055 1753598 1670618 1472099 1637069 1788043 1427761 1709374 1556393 2054369 1851102
13915 1851102 1146918 1591209 1759836 1718989 1532000 1390711 1603283 1538299 1176999 1664735
13905 1664735 1134517 1638513 1257498 1279842 1420022 1471280 1388003 1529428 1346543 1313974
13895 1313974 1485401 1346114 1266733 1420141 1150427 1259269 1243236 1200125 1342761 1305784
13885 1305784 1358639 823470 1218432 920218 1337010 1250067 1330289 1624920 1399832 1374580
$$ packed form
13955A971877L10982l15349N69939n01505K90466k7533l01788K24428l9759l86101
13945A795657R6258P1481j18078k41574K69787m9265j44577J18336M4479J58881
13935B001385n1041k4934L3652k36958J71752r7270j63206L20602l52338J411
13925A603055J50543q2980j98519J64970J50974l60282K81613j52981M97976k03267
13915A851102p04184M44291J68627m0847j86989j41289K12572o4984l61300M87736
13905A664735n30218N03996l81015K2344J40180N1258q3277J41425j82885l2569
13895A313974J71427j39287p9381J53408k69714J08842j6033m3111J42636l6977
13885A305784N2855n35169L94962k98214M16792q6943Q0222K94631k25088k5252
$$ plain form
13875 1374580 1146025 1385762 1140183 1227937 1447003 1024263 1259137 1585964 1447274 1178422
13865 1178422 1159273 1312651 1224508 1229906 857410 1049612 1415986 1492916 993841 1108174
13855 1108174 1087566 1038024 1226043 977573 1044373 1030378 811207 1077244 1207279 1016215
13845 1016215 716955 1337113 1232260 1023182 1143154 1439887 1282038 908221 755779
13836 755779 951504 1024674 895381 950496 1171532 834921 1168613 906419 1111336 1238336
13826 1238336 1125228 894194 903321 890969 740895 597133 939329 873213 996279 869139
13816 869139 723169 1093972 1210485 1117084 777350 1073124 925248 945555 991609 974865
13806 974865 1003861 1096202 914169 1071887 883128 878026 820016 616753 689267 840153 1005882
$$ packed form
13875A374580k28555K39737k45579Q7754K19066m22740K34874L26827j38690k68852
13865A178422j9149J53378q8143N398l72496J92202L66374P6930m99075J14333
13855A108174k0608m9542J88019k48470O6800j3995k19171K66037J30035j91064
13845A016215k99260O20158j04853k09078J19972K96733j57849l73817j52442
13836G55779J95725P3170j29293N5115K21036l36611L33692k62194K04917J27000
13826A238336j13108k31034R127j2352j50074j43762L42196o6116J23066j27140
13816H69139j45970L70803J16513r3401l39734K95774j47876K0307M6054j6744
13806I74865K8996R2341j82033J57718j88759n102n8010k03263P2514J50886J65729
$$ plain form
13795 1005882 879594 395098 427506 816432 866685 744944 1046562 744649 658030 715069
13785 715069 559550 1351682 743829 909209 676056 694870 743162 797999 1091722 497376
13774 989770 702091 480209 653621 716463 904447 549670 852809 561395 974001 695535
13764 695535 815377 811477 826469 703629 774146 779672 673414 720776 867831 632315 491473
13753 491473 840888 587109 755087 612974 875310 937707 525767 921723 745878 796793
13743 796793 703660 804540 777825 347609 705239 358452 908802 660828 655240 538593
13733 538593 700511 555690 935470 912511 487204 918324 663928 711738 639648 847089
13723 847089 831467 1118578 340087 617921 449922 623791 569533 518041 424358 555497
$$ packed form
13795A005882j26288C95098L2408L88926N0253j21741L01618l01913q6619N7039
13785G15069j55519P92132o07853J65380k33153J8814M8292N4837K93723D97376
13774I89770k87679k21882J73412O2842J87984l54777L03139k91414M12606k78466
13764F95535J19842l900J4992j22840P0517N526j06258M7362J47055k35516j40842
13753D91473L49415k53779J67978j42113K62336O2397m11940L95956j75845N0915
13743G96793r3133J00880k6715C47609L57630l46787N50350k47974n588j16647
13733E38593J61918j44821L79780k2959m25307M31120k54396M7810p2090K07441
13723H47089j5622K87111C40087K77834j67999J73869n4258n1492r3683J31139
$$ plain form
13713 555497 463802 576538 513065 595423 693949 583395 867519 1084245 450700 546269
13703 546269 595584 411436 479989 410731 599337 720748 669092 617340 825570 337532
13692 568155 740170 590896 595613 710942 675719 518608 176809 412623 467459 432607
13682 432607 632387 515855 371702 498766 464079 845690 515120 701716 972127 534526
13672 534526 293414 518864 307598 629789 505747 794024 803050 215606 658016 710365
13662 710365 298589 533735 565661 275965 726860 324000 435624 432302 352550 528548
13652 528548 273189 423245 514278 589068 336603 507897 208884 531565 408015 171529
13641 788556 746246 191191 201361 391014 331305 621295 792857 240803 682235 353736
$$ packed form
13713E55497r1695J12736o3473Q2358R8526j10554K84124K16726D50700R5569
13703E46269M9315j84148O8553o9258J88606J21411n1656n1752K08230C37532
13692E68155J72015j49274M717J15329l5223j57111A76809K35814N4836l4852
13682D32607J99780j16532j44153J27064l4687L81611l30570J86596K70411m37601
13672E34526k41112K25450k11266L22191j24042K88277R026B15606M42410N2349
13662G10365B98589K35146L1926B75965M50895C24000J11624l322p9752J75998
13652E28548k55359J50056R1033P4790k52465J71294B08884L22681j23550A71529
13641G88556m2310A91191J0170J89653n9709K89990J71562B40803M41432l28499
$$ plain form
13631 353736 400466 794201 649013 333810 428190 483065 461346 307218 40521 491170
13621 491170 -125389 557552 418033 155768 314805 242115 310784 456213 660193 437159
13611 437159 299227 622942 463669 213041 265592 390415 113673 515771 642593 564718
13601 564718 636149 374957 257063 127791 369704 233616 -64724 237801 447085 283730
13591 283730 448664 361306 139687 386360 153143 414560 455857 331364 253383 298215
13581 298215 289184 307615 392365 357777 354774 322583 425962 141948 359347 270266 396033
13570 396033 285203 406629 479347 318674 510754 463959 438379 321125 437598 337864
13560 337864 291051 452186 454072 241143 452675 200241 372900 125594 269226 218857
$$ packed form
13631C53736M6730L93735j45188l15203R4380N4875k1719j54128D0521M50649
13621D91170a25389E57552j39519A55768J59037p2690O8669J45429K03980k23034
13611D37159j37932L23715j59273B13041N2551J24823A13673M02098J26822p7875
13601E64718P1431k61192j17894A27791K41913j36088f4724B37801K09284j63355
13591B83730J64934q7358A39687K46673A53143K61417M1297j24493p7981M4832
13581B98215r031J8431Q4750l4588l003l2191J03379A41948K17399q9081J25767
13570C96033j10830J21426P2718j60673J92080m6795k5580j17254J16473r9734
13560C37864m6813J61135J886k12929K11532B00241J72659A25594J43632n0369
$$ plain form
13550 218857 345593 277579 452573 520165 532307 459715 643464 108621 389748 197765
13540 197765 161069 281620 224009 191959 326851 109161 302950 441772 411592 425336
13530 425336 38411 450155 436453 297375 224031 105879 31934 175535 212763 373146
13520 373146 71808 557467 484121 531225 105998 439565 650020 246759 594541 131921
13509 67846 235409 168460 237796 344475 321452 319090 281678 540420 412871 616442 316134
13498 316134 165327 353482 -56790 517105 487321 150894 86665 173464 207630 273877 308263
13487 308263 242410 25918 328269 25406 298999 402254 190493 690391 -7851 78880 196196
13476 196196 354807 410638 356226 354097 108636 458416 114381 61678 363355 203542
$$ packed form
13550B18857J26736o8014J74994O7592J2142p2592J83749A08621K81127j91983
13540A97765l6696J20551n7611l2050J34892A09161J93789J38822l0180J3744
13530D25336C8411M11744j3702j39078p3344A05879C1934J43601L7228J60383
13520C73146G1808M85659p3346M7104A05998L33567K10455B46759L47782A31921
13509F7846J67563o6949O9336J06679k3023k362l7412K58742j27549K03571l00308
13498C16134j50807J88155e6790E17105k9784A50894o4229Q6799L4166O6247L4386
13487C08263o5853B5918L02351B5406K73593J03255A90493M99898g851G8880J17316
13476A96196J58611N5831n4412k129A08636L49780A14381n2703L01677j59813
$$ plain form
13466 203542 171970 432023 750746 419795 272964 -147535 390643 18157 98856 381894
13456 381894 193982 168581 291327 233491 48547 259823 227066 564627 122849 391842
13446 391842 301998 149774 28761 114336 229558 77360 369663 314630 277208 289229 353521
13435 353521 503476 377440 91610 101378 367947 -28617 -197406 -23406 376651 224267
13425 224267 210688 55571 485705 298894 33964 263593 103498 180613 258213 360248
13415 360248 321742 368113 -5919 348000 59839 -123708 325200 33448 259495 266439 309169
13404 309169 148615 213680 -67552 499171 267194 57480 146127 -158802 -29654 -79063 153642
13392 486285 508760 -130929 96045 400044 466919 621824 205900 201703 318917 541900
$$ packed form
13466B03542l1572K60053L18723l30951j46831a47535C90643A8157Q0699K83038
13456C81894j87912k5401J22746n7836D8547K11276l2757L37561A22849K68993
13446C91842q9844A49774B8761Q5575J15222G7360K92303n5033l7422J2021O4292
13435C53521J49955j26036I1610R768K66569b8617j68789b3406C76651j52384
13425B24267j3579E5571M30134j86811C3964K29629A03498P7115P7600J02035
13415C60248l8506M6371e919C48000E9839a23708C25200C3448K26047O944M2730
13404C09169A48615O5065f7552D99171k31977E7480Q8647a58802b9654m9409A53642
13392D86285K2475a30929I6045L03999O6875J54905B05900m197J17214K22983
$$ plain form
13382 541900 276305 331051 213656 334415 85258 -78411 -151371 51508 247086 -85819 236186
13370 265713 219899 -4137 383190 229842 107375 438298 309078 350335 221555 395856
13360 395856 591056 19404 115896 276397 285862 206526 338022 29480 348854 36609 120383
13349 120383 67849 531166 154999 -12250 435318 133038 223182 566945 248731 338041
13339 338041 164917 136526 145281 166579 100332 338676 302813 229708 178480 249619 369946
13328 369946 618744 84865 204946 317221 420469 132507 349653 545601 211783 351883
13318 351883 258154 348747 357841 398225 360613 -184488 125421 98406 153282 113771 255264
13307 255264 242608 96670 280837 -155013 298196 175458 145220 249978 26088 111937
$$ packed form
13382E41900k65595N4746j17395J20759H5258g8411p2960E1508J95578h5819B36186
13370B65713m5814d137C83190j53348A07375L30923j29220M1257j28780J74301
13360C95856J95200A9404R6492J60501R465p9336J31496B9480L19374C6609Q3774
13349A20383n2534M63317A54999a2250D35318A33038R0144L43763B48731Q9310
13339C38041A64917k8391Q755K1298o6247K38344l5863p3105n1228P1139J20327
13328C69946K48798H4865J20081J12275J03248A32507K17146J95948B11783J40100
13318C51883r3729R0593R094M0384l7612a84488A25421k7015N4876l9511J41493
13307B55264j2656I6670J84167a55013B98196j22738l0238J04758B6088Q5849
$$ plain form
13297 111937 41713 233332 105840 154942 354557 79052 359619 585450 102278 37370
13286 283568 182732 226994 198094 -41024 203381 192807 363210 508644 91320 291372
13276 291372 77040 52857 -183634 -131841 190808 372932 124232 -130553 241774 7666
13265 178804 396435 276176 428797 -230078 95835 292263 326854 180052 272545 236936
13255 236936 485679 114260 -185041 44023 -152723 -15082 98340 194258 126978 129585 176421
13244 176421 61727 406791 212517 315281 51741 190302 263267 162195 603781 247308
13233 5002 254586 361157 -13456 356461 367483 399528 31169 252726 -209687 49338 317609
13222 317609 104623 75591 181457 12479 170978 7250 174874 244941 223382 242012 51726
$$ packed form
13297A11937D1713J91619A05840M9102J99615G9052K80567K25831A02278C7370
13286B83568j00836M4262k8900d1024B03381j0574J70403J45434I1320K00052
13276B91372G7040k4183a83634N1793A90808J82124A24232a30553B41774G666
13265A78804K17631j20259J52621b30078I5835J96428L4591j46802R2493l5609
13255B36936K48743A14260a85041D4023a52723a5082I8340R5918o7280K607M6836
13244A76421F1727L45064j94274J02764E1741J38561P2965j01072M41586B47308
13233E002K49584J06571a3456C56461J1022L2045C1169K21557b09687D9338K68271
13222C17609A04623k9032J05866A2479J58499G250J67624P0067k1559J8630E1726
$$ plain form
13210 127836 57891 52185 -28168 231628 52776 -214462 161345 273547 54989 232165 -13134
13198 35333 -37134 103795 153297 198857 227237 60501 136186 -210654 -53466 -74669 28886
13186 310105 -127997 72333 8024 227264 230461 81561 233269 -60333 24460 21099 -113172
13174 198567 64921 -182623 -1241 226135 313400 97591 109248 128803 100528 120 206113
13163 206113 275114 117069 -150856 201330 138686 270380 269016 -283433 -31332 152968
13152 232241 148893 305056 -3424 212965 20313 -94506 15522 -72054 89671 -3517 52300
13140 30143 198236 137365 19601 -63525 515419 250575 -248408 207195 378671 -28662
13129 -76971 176538 438490 83750 171105 44020 88775 -123498 40582 343323 90996 -111030
$$ packed form
13210A27836E7891n706b8168B31628E2776b14462A61345J12202E4989J77176a3134
13198C5333c7134A03795M9502M5560K8380F0501P5685b10654e3466k1203B8886
13186C10105a27997G2333H024K19240L197H1561J51708f0333B4460l361a13172
13174A98567F4921a82623a241B26135Q7265I7591J1657J9555k8275A20K05993
13163B06113O9001A17069a50856B01330o2644J31694j364b83433c1332A52968
13152B32241q3348J56163c424B12965B0313i4506A5522g2054H9671c517E2300
13140C0143J68093o0871A9601f3525E15419B50575b48408B07195J71476b8662
13129g6971A76538K61952H3750Q7355D4020M4755a23498D0582L02741I0996a11030
$$ plain form
13117 146810 283995 173348 -3886 27201 -118843 35143 355616 -28321 72785 228570 -83845
13105 352874 -8760 -278059 -11125 -258538 -64729 -81722 72944 -48162 224327 100058 341741
13094 341741 299665 -166360 31879 37352 -184586 47590 -59440 2408 190234 50149 92762
13083 92762 -128026 137363 -153835 151409 -78308 327856 356479 230328 111028 105601
13073 105601 18142 -17170 153913 -87152 347701 226947 84915 -80395 253905 -182974
13062 29303 -100733 482014 253518 68233 220647 362206 -47900 106665 294623 -195803
13051 211448 238010 -105866 228256 193410 -33087 76924 -47844 41485 -114547 103868 -188231
13039 214128 10855 137258 109218 131177 -44609 364331 229069 -200425 -129670 872 138829
$$ packed form
13117A46810J37185j10647c886B7201a18843C5143L20473b8321G2785J55785h3845
13105C52874h760k69299a1125k47413f4729j6993G2944d8162B24327A00058K41683
13094C41741m2076a66360C1879N473a84586D7590e9440B408J87826E0149M2613
13083I2762a28026A37363a53835A51409g8308C27856K8623j26151A11028n427
13073A05601A8142a7170A53913h7152C47701j20754H4915h0395B53905a82974
13062B9303a00733D82014k28496F8233J52414J41559d7900A06665J87958a95803
13051B11448K6562a05866B28256l4846c3087G6924d7844D1485a14547A03868a88231
13039B14128A0855J26403k8040K1959d4609C64331j35262b00425P0755H72J37957
$$ plain form
13028 138829 15731 16287 263288 42563 169617 -21276 -172294 8951 -127559 108778 61947
13017 61947 -35942 151621 366586 168923 120195 102932 176739 69994 -200925 625352 -29117
13005 36144 160083 -234601 -111889 191500 175544 109016 392017 -37415 -210624 -122279
12995 -122279 229318 290538 199486 171655 -47002 130425 266138 293547 -247568 -54329 88165
12983 66662 147673 232916 61976 365818 311377 59789 279625 57393 113237 160717 50869
12971 -82243 71629 140093 23827 280074 198505 227416 114051 -352012 143684 -61457 235118
12959 -135287 202529 148404 465861 -247604 204715 -189868 185599 247273 56066 132070
12949 132070 58030 125366 -25478 229623 136161 52425 217396 316514 15623 -214857 -103136
$$ packed form
13028A38829A5731N56K47001D2563J27054b1276j51018H951a27559A08778m6831
13017F1947c5942A51621K14965A68923m8728j7263P3807F9994b00925F25352b9117
13005C6144J23939b34601a11889A91500j5956o6528K83001c7415j73209Q8345
12995a22279B29318O1220r1052k7831d7002A30425J35713K7409b47568e4329H8165
12983F6662Q1011Q5243F1976L03842n4441E9789K19836E7393N5844M7480E0869
12971h2243G1629O8464B3827K56247q1569K8911j13365c52012A43684f1457B35118
12959a35287B02529n4125L17457b47604B04715a89868A85599O1674E6066P6004
12949A32070E8030O7336b5478B29623r3462E2425J64971R9118A5623b14857a03136
$$ plain form
12937 120987 247981 141514 -31027 427053 105697 -4863 208622 14785 -231404 42829
12926 -278112 -17602 296832 -153829 -140199 68630 135940 -50981 -210151 3894 31724 338949
12915 338949 -72038 136488 47285 -24814 61331 -82356 42504 -32823 301575 -18453 -81738
12904 -81738 -106616 -341277 16459 163921 -156456 -143478 524246 304797 43444 117538 -117700
12892 -366890 98759 48241 243254 -173118 -30619 -297539 -52253 -73199 -92674 163781 226521
12881 226521 6376 -167715 200447 -39167 81465 136032 74103 101336 -92713 -200428 268023
12869 10717 132434 90949 178463 -105695 65320 -117589 -71245 344186 141039 -3127 273553
12857 362399 55191 97216 -118200 101613 28499 -93320 -128154 323557 7240 139589 131950
$$ packed form
12937A20987J26994j06467c1027D27053A05697d863B08622A4785b31404D2829
12926b78112a7602B96832a53829J3630F8630O7310e0981j59170C894K7830L07225
12915C38949g2038A36488D7285b4814F1331h2356D2504c2823C01575a8453o3285
12904h1738k4878k34661A6459J47462a56456J2978E24246k19449D3444P4094a17700
12892c66890I8759D8241J95013a73118c0619k66920e2253k0946j9475A63781O2740
12881B26521F376a67715B00447c9167H1465N4567o1929K7233i2713j07715B68023
12869A0717J21717m1485Q7514a05695F5320a17589M6344C44186A41039c127B73553
12857C62399E5191M2025a18200A01613B8499i3320l4834C23557G240J32349p639
$$ plain form
12846 131950 -137724 -108513 -12883 162188 119673 180435 49136 -59201 111436 -257541 116768
12834 186374 -246992 -8712 40331 59596 -50795 79359 -74757 185893 -24864 -15695 81199
12822 131849 -91900 38323 85438 -92492 149624 135708 -111191 117668 1326 -79663 -3114
12810 -66081 276268 175762 247377 23380 141416 117181 -80075 220453 -74268 74732 181265
12799 181265 -134766 78873 -121535 -24756 -77706 -251789 252508 -45986 198790 -220562
12788 38676 -254232 9977 -41269 170123 39164 128385 243540 159956 69653 -149717 44051
12776 342142 164511 170775 -40790 122224 -87872 -104480 239617 34312 222771 -523912 -464526
12765 -464526 -198821 -128302 -115799 -401354 -33299 -248948 54587 -90855 281120 304037 121702
$$ packed form
12846A31950a37724K9211a2883A62188m2515O0762D9136e9201A11436b57541A16768
12834A86374b46992h712D0331J9265e0795G9359g4757A85893b4864R169H1199
12822A31849i1900C8323M7115i2492A49624j3916a11191A17668A326g9663c114
12810f6081B76268j00506P1615B3380J18036k4235h0075B20453g4268G4732J06533
12799A81265a34766G8873a21535b4756n2950j74083B52508d5986A98790b20562
12788C8676b54232I977d1269A70123C9164Q9221J15155q3584F9653a49717D4051
12776C42142A64511O264d0790A22224h7872j6608B39617C4312J88459e23912N9386
12765d64526a98821P0519J2503k85555c3299k15649E4587i0855B81120K2917A21702
$$ plain form
12753 110932 -279472 -74110 40186 159714 -29309 -236798 100716 1220 9397 74121 -47727
12741 84301 357672 44842 225033 138796 -181066 8613 -180809 -149019 249769 247831 49484
12729 -92778 119065 27261 78751 57420 115738 -1184 85433 -5554 -245528 86854 -119421
12717 276543 32972 -102847 325774 114354 -199951 67379 129763 48946 285607 423281
12707 423281 232148 208511 432083 94866 313654 -334897 438846 440945 120699 166223
12697 166223 190743 355742 77586 24697 133868 -178007 299 -111033 -93384 -260163 -32604
12685 -105979 -59023 350777 34953 249072 -33455 16736 273606 220278 255250 73774 280095
12674 280095 -95358 -88859 -14036 469135 163194 139979 118825 278959 -60277 102954 241757
$$ packed form
12753A10932b79472g4110D0186J19528b9309k07489A00716A220Q177O4724d7727
12741H4301K73371D4842J80191q6237a81066H613a80809L1790B49769j938D9484
12729i2778A19065B7261N1490k1331N8318a184H5433e554k39974H6854a19421
12717B76543C2972a02847C25774A14354a99951F7379O2384D8946K36661J37674
12707D23281j91133k3637K23572I4866K18788c34897D38846K099A20699M5524
12697A66223K4520J64999G7586B4697J09171a78007B99a11033J7649j66779c2604
12685a05979M6956C50777C4953K14119c3455A6736K56870n3328L4972G3774K06321
12674B80095i5358O499a4036D69135A63194k3215k1154J60134f0277A02954J38803
$$ plain form
12663 241757 258163 199579 56396 -217089 23765 107063 86347 293215 271203 -46933 520683
12651 396694 233632 -240838 -19047 72461 -144547 228626 149071 209254 201870 -23705 -438731
12640 -438731 1538 137079 -171941 -53494 -46390 234841 -57579 -166404 242930 236920 64132
12628 302374 174580 38208 423251 223751 375510 43392 161026 61072 357536 -128027
12617 227440 292881 -139529 5836 83717 143159 260957 87589 -221347 -244243 227045 -68000
12605 -143614 -120304 492283 229545 -93504 64389 114137 210311 50229 349157 203460 -39693
12593 28747 -189364 54887 41642 105939 160638 -195700 217906 68503 189578 35619 -164671
12581 28572 82756 -130065 -165474 230797 -134332 151047 67800 -69698 27193 249650 -18254
$$ packed form
12663B41757J6406n8584E6396b17089B3765Q3298k0716K06868k2012d6933E20683
12651C96694j63062b40838a9047G2461a44547B28626p9555O0183p384b3705m15026
12640d38731A538J35541a71941e3494P104B34841e7579j08825B42930o010F4132
12628C02374j27794C8208L85043j99500J51759D3392J17634F1072K96464a28027
12617B27440O5441a39529E836P7881N9442J17798H7589b21347k2896B27045f8000
12605a43614K3310D92283B29545i3504F4389M9748R6174E0229K98928j45697c9693
12593B8747a89364E4887j3245O4297N4699a95700B17906F8503J21075C5619a64671
12581B8572N4184a30065l5409B30797a34332A51047F7800f9698B7193K22457a8254
$$ plain form
12569 287198 150098 191330 6309 70939 -14508 148031 4223 -119047 -215296 250867 -238560
12557 10424 -181733 -80507 -144061 -331136 -83995 344408 -88235 223618 234448 66346 -121502
12545 -69414 -66817 -48699 51712 102162 -287496 287038 -253442 -43780 23568 207319 -85817
12533 206 -218767 155459 42146 225611 204182 -192222 -83137 100221 23817 180892 -9908
12521 116478 -21945 -227180 5955 -56007 245144 213989 121935 59507 196252 156552 252009
12510 252009 49495 -15402 116530 86445 -49067 -34104 498039 91942 39732 -142569 -51636
12498 214720 -82293 141625 -214286 248898 -43074 -88418 104834 49858 -23168 401771
12487 110837 -105020 87608 -61256 -217460 -226482 -75296 78771 140320 -230148 -69300 87665
$$ packed form
12569B87198j37100M1232F309O4630a4508A48031D223a19047r6249B50867b38560
12557A0424a81733h0507o3554j87075h3995C44408h8235B23618J0830F6346a21502
12545f9414K597J8118E1712N0450b87496B87038b53442d3780B3568J83751h5817
12533B06b18767A55459D2146J83465k1429a92222h3137A00221B3817J57075i908
12521A16478b1945k05235E955e6007B45144l1155r2054E9507J36745l9700R5457
12510B52009D9495a5402A16530l0085d9067J4963D98039I1942C9732a42569e1636
12498B14720h2293A41625b14286B48898d3074m5344A04834D9858b3168D01771
12487A10837a05020H7608f1256j56204r022g5296G8771O1549b30148f9300H7665
$$ plain form
12475 41517 143359 46526 214211 -237045 -175080 92426 -117319 126159 -128410 19716
12464 94927 269300 35878 -154761 112754 -3518 149501 -295082 -26884 331202 -102673
12453 -315402 -85157 -184602 105745 -79689 178926 192296 -98774 -369422 -139337 113540
12442 -315936 36141 171143 254044 193634 -60293 -234905 -153739 36533 -265085 -72301 24417
12430 25819 18725 171122 -24975 -390032 165756 -8101 167231 67065 -188507 133437 3568
12418 -43199 -98544 -138852 -19737 -35642 36619 -56409 -156094 -307883 -95309 16515 -18212
12406 -344368 -110252 260262 288609 -172712 217867 351832 -87739 223666 265411 41112
12395 -111454 -9773 -65115 -147134 -130553 -203108 23707 -295441 605 -281368 144466 35661
$$ packed form
12475D1517J01842D6526J67685b37045O1965I2426a17319A26159a28410A9716
12464I4927J74373C5878a54761A12754c518A49501b95082b6884C31202a02673
12453c15402h5157r9445A05745g9689A78926J3370i8774k70648a39337A13540
12442c15936C6141J35002Q2901o0410f0293j74612Q1166C6533b65085g2301B4417
12430B5819p094J52397b4975l65057A65756h101A67231F7065a88507A33437C568
12418d3199n5345m0308a9737j5905C6619e6409r9685j51789i5309A6515a8212
12406c44368a10252B60262K8347a72712B17867J33965h7739B23666M1745D1112
12395a11454i773n5342q2019J6581p2555B3707b95441F05b81368A44466C5661
$$ plain form
12383 9329 -97957 121168 172886 -117753 -69293 209227 102508 255563 56016 -217430 237523
12371 -243089 -225054 305680 -11855 72726 73642 -95637 3314 172757 -98869 67372 95039 271123
12359 271123 -230138 82288 264137 -131484 -49172 -292120 198393 128979 241544 -37715
12348 142849 -12942 289929 161536 -67816 -195005 -8271 -53756 -74479 -33907 8072 5876
12337 5876 4734 262052 -28367 7880 96054 -218421 -267711 -162692 -151925 50606 193801
12326 193801 132112 123705 -192464 -172038 125154 -3087 -272127 160916 -95628 73637 -87462
12314 -382448 318838 145114 -424972 -387643 335828 -202603 -238916 -51589 -391342 -5418
12303 -210743 -24457 -206940 34868 -212401 7414 -141149 217449 -217229 178307 -12409
$$ packed form
12383I329i7957A21168N1718a17753M8460B09227A02508J53055E6016b17430B37523
12371b43089J8035C05680a1855G2726R16i5637C314J69443i8869F7372K7667J76084
12359B71123b30138H2288J81849a31484d9172k42948A98393o9414J12565c7715
12348A42849a2942B89929j28393f7816j27189h271m5485k0723c3907H072k196
12337E876j142K57318b8367G880Q8174b18421m9290J05019J0767E0606J43195
12326A93801o1689q407a92464K0426A25154c087k69040A60916i5628G3637h7462
12314c82448C18838A45114d24972L7329C35828b02603l6313e1589l39753e418
12303b10743b4457j82483C4868b12401G414a41149B17449b17229A78307a2409
$$ plain form
12292 246647 102477 132577 98258 126176 -12284 187348 183367 282620 90763 122764 275192
12281 275192 422683 235647 196911 207754 15333 411197 126732 74116 388980 214586
12271 214586 264288 329406 35604 53543 -692 151598 107512 49179 141891 -83135 161695
12259 59927 -15147 -49466 -207418 249486 303967 172155 -78298 7157 145904 139205 88120
12248 88120 -16863 11776 163187 54039 -37725 379432 335892 90466 119125 -14927 298524
12236 -212663 115173 190581 -65787 225707 75517 57929 500588 35231 294652 -73404 343876
12224 152053 394850 26345 239262 171745 177583 128808 182702 440084 316352 159547 285304
12213 285304 347556 -341513 -18072 92551 50809 58188 153975 400594 298920 51158 297236
$$ packed form
12292B46647A02477L0100l4319K7918a2284A87348l981R9253I0763L2001J52428
12281B75192J47491j87036l8736J0843A5333L95864A26732n2616L14864j74394
12271B14586M9702O5118C5604J7939f92A51598m4086D9179R2712h3135A61695
12259E9927a5147l4319j57952B49486N4481j31812g8298G157J38747o699n1085
12248H8120a6863A1776J51411E4039c7725C79432m3540I0466K8659a4927B98524
12236b12663A15173P5408f5787B25707G5517j7588M42659C5231K59421g3404C43876
12224A52053K42797B6345K12917o7517N838m8775N3894K57382j23732j56805J25757
12213B85304O2252c41513a8072I2551m1742P379R5787K46619j01674E1158K46078
$$ plain form
12202 297236 284950 223769 -287589 228912 -133820 -149017 424871 117042 40295 282776
12192 282776 261761 102436 -63875 -166405 218914 33435 13808 -20230 226956 141188 103576
12181 103576 11807 -237060 122638 123326 -306302 22013 221700 -50046 374861 114627 73419
12170 73419 605041 363109 223558 78407 27349 -47015 239571 -72917 309888 138979
12159 144089 193614 79202 -968 335421 255425 -65586 -124201 203650 119340 95269 -166321
12147 115003 -49997 257717 140872 -254925 224802 158837 -20249 -70767 66523 263339
12137 263339 75524 128912 167333 90199 -37800 87660 76474 56014 171656 -125767 93329
12125 109092 -95129 60026 66989 179243 -42196 114939 -90897 298480 -40259 98691 -147572
$$ packed form
12202B97236j2286o1181b87589B28912a33820j5197D24871A17042D0295K42481
12192B82776k1015A02436f3875j02530B18914C3435A3808b0230B26956q5768l7612
12181A03576A1807b37060A22638O88c06302B2013J99687e0046C74861A14627m1208
12170G3419N31622k41932j39551G8407B7349d7015B39571g2917C09888A38979
12159A44089M9525G9202i68C35421p9996f5586n8615B03650q4310k4071a66321
12147A15003d9997B57717j16845b54925B24802o5965b0249n0518F6523J96816
12137B63339G5524N3388L8421p7134c7800H7660j1186k0460J15642a25767I3329
12125A09092i5129F0026O963J12254d2196A14939i0897B98480d0259I8691a47572
$$ plain form
12113 -187203 -32668 -198845 53636 -356288 -238580 -108157 47375 -175703 742 -12834 406555
12101 460592 136698 -199378 -165024 208654 174891 -47209 109555 40787 36574 133143 173794
12090 173794 -32548 -40475 172235 -1899 89131 -120712 -182368 177430 -171549 188335 305457
12079 305457 17640 144115 1032388 1654023 357681 252197 98684 -19277 220904 38922
12068 234496 -139969 85078 250558 -324411 22608 31186 -101405 160307 295298 219448
12058 219448 44864 -174446 -252654 97120 -54708 119585 -11816 97212 53286 140567 355687
12047 355687 66815 -114842 59004 -114265 -139972 41242 -247432 46610 180094 -21679 315235
12035 -150742 -66449 -183151 -77740 -161800 -205052 99123 34605 144659 130961 -145398 -221585
$$ packed form
12113a87203c2668j66177E3636c56288J17708a08157D7375a75703G42a2834D06555
12101D60592A36698a99378L4354B08654l3763d7209A09555D0787m213R6569M0651
12090A73794c2548p927A72235a899H9131a20712o1656A77430a71549A88335J17122
12079C05457A7640J26475Q88273O21635C57681j05484I8684a9277B20904C8922
12068B34496a39969H5078J65480c24411B2608Q578a01405A60307J34991p5850
12058B19448D4864a74446p8208I7120e4708A19585a1816I7212m3926Q7281K15120
12047C55687F6815a14842E9004a14265k5707D1242b47432D6610J33484b1679C15235
12035a50742f6449j16702g7740q4060m3252I9123C4605J10054j3698a45398p6187
$$ plain form
12024 -221585 76644 20435 -54051 -93145 47945 69524 219360 18424 3867 -94338 237199
12012 35066 272323 -137690 -71322 -225385 -59587 -251015 -31798 168492 -56990 133031
12001 -308637 -61546 -263667 258951 148795 -161271 191984 -37831 -343329 160456 58268
11990 -25269 -26603 -66252 -212674 -118261 -141291 158232 239718 -312361 86258 -238150 324665
11978 -28490 209159 171397 201760 -210435 41082 58930 -73576 60758 -23467 -269040 255130
11966 -31577 366055 -48746 81449 181652 -105194 280664 94203 178968 179879 292183 -149516
11954 -218716 -351577 -229248 -202032 -57470 -54499 30907 2946 75158 -31386 -120232 -53475
11942 -44328 1000 -97732 111901 -22354 123068 197798 139656 -36489 -134709 175044 23770
$$ packed form
12024b21585G6644B0435e4051l9094D7945K1579J49836A8424C867i4338B37199
12012C5066K37257a37690O6368j54063e9587j91428c1798A68492e6990A33031
12001c08637f1546k02121B58951j10156a61271A91984c7831l05498A60456E8268
11990b5269j334l9649j46422R4413k3030A58232Q1486c12361H6258b38150C24665
11978b8490B09159l7762L0363b10435D1082J7848g3576F0758b3467k45573B55130
11966c1577C66055d8746H1449J00203a05194B80664I4203Q4765R11J12304a49516
11954b18716j32861J22329K7216e7470K971C0907B946P2212c1386q8846e3475
11942d4328A000i7732A11901b2354A23068P4730n8142c6489r8220A75044B3770
$$ plain form
11930 96872 100802 -23016 -68790 -471505 -233251 85522 -163485 229706 126140 33197 53318
11919 53318 -340102 47332 190664 280440 48513 224314 -112895 131967 -132720 -132523 -67930
11908 -67930 44380 -168895 -279264 40617 57532 45270 26516 32950 -166528 -251331 -107840
11896 -132036 155231 -26971 -238216 -12525 238963 -21925 -114323 -81445 -319609 137224
11885 203051 -386449 -20581 -170022 115852 -67211 278678 -175558 -151985 25755 9179 283841
11874 283841 -30829 1715 74707 162738 -100853 -211945 -98151 90944 -36223 -135679 52155
11862 -23270 -88597 -190074 -32596 231497 98119 -122636 243518 92740 -117538 -309812
11852 -309812 394776 -267850 139842 -191847 168357 32804 48655 126211 -118136 200082
$$ packed form
11930I6872L930b3016m5774m02715b33251H5522a63485B29706j03566C3197K0121
11919E3318c40102D7332J43332Q9776D8513J75801a12895A31967a32720J97O4593
11908f7930D4380a68895j10369D0617J6915j2262j8754O434a66528q4803a07840
11896a32036A55231b6971k11245a2525B38963b1925r2398L2878k38164A37224
11885B03051c86449b0581j49441A15852f7211B78678a75558K3573B5755I179K74662
11874B83841c0829A715P2992Q8031a00853j11092i8151I0944c6223r9456E2155
11862b3270o5327j01477c2596B31497I8119a22636B43518I2740a17538j92274
11852c09812C94776b67850A39842a91847A68357C2804J5851P7556a18136B00082
$$ plain form
11841 -152002 -74831 -63756 -203988 -398491 81439 44397 1575 -120693 -133666 19337 -194107
11829 -315461 62329 75589 117354 -463934 60991 -412818 257304 -45901 840 -216554 49436
11817 -157359 12838 -421669 207956 31059 300204 -186570 -24694 142717 70201 30558
11806 86075 -160964 20802 -53508 -216542 52111 23614 -186206 -129093 7349 310898 18849
11794 10954 -307272 -96537 146326 -265917 -88820 260050 97904 -101971 31214 -199478
11783 -323822 -218665 44044 163085 -271024 125198 122297 -332169 77371 -448185 226552
11772 7475 -88165 -116105 -279407 -75759 -256820 -327503 -117490 310724 20942 -114195 -8361
11760 322960 -159107 121199 98642 -151368 95558 105960 211288 -61458 61666 -150111
$$ packed form
11841a52002g4831J1075j40232j94503H1439l7042A575a20693j2973A9337a94107
11829c15461F2329J3260M1765d63934F0991d12818B57304d5901H40b16554D9436
11817a57359A2838d21669B07956C1059K69145a86570b4694A42717G0201C0558
11806H6075a60964B0802e3508j63034E2111B3614a86206N7113G349L03549A8849
11794A0954c07272i6537A46326b65917h8820B60050I7904a01971C1214a99478
11783c23822J05157D4044J19041b71024A25198k901c32169G7371d48185B26552
11772G475h8165k7940j63302g5759j81061p0683a17490C10724B0942a14195h361
11760C22960a59107A21199k2557a51368I5558J0402J05328f1458F1666a50111
$$ plain form
11749 82569 -286749 -47837 263354 -52615 228787 -5167 23602 48841 -260606 204831 -185590
11737 -205392 -210057 -275440 -303919 12855 21555 -263833 -69548 -187900 -164866 -199461 -280018
11726 -280018 197529 -181683 211475 42016 -104990 -216102 -48929 -186883 145699 20136
11715 60475 102341 -14733 -23801 108946 39874 -26308 157701 -187519 -14696 -282763 -66006
11703 239226 197784 17033 26501 33454 150152 467736 301447 310728 379029 -89306 99265
11691 -12120 -131263 -144659 132071 60846 -205815 202675 -199670 -172119 197855 -17904
11680 33902 170305 238754 362526 22699 29875 174952 27879 182572 173783 -11681 36403
11668 252070 87249 -72161 231277 44873 -226640 -53763 -232810 260025 -158362 -138942
$$ packed form
11749H2569b86749d7837B63354e2615B28787e167B3602K5239b60606B04831a85590
11737b05392m665o5383k8479A2855Q700b63833f9548j18352K3034l4595q0557
11726b80018A97529a81683B11475D2016a04990j11112d8929j37954A45699B0136
11715F0475M1866a4733r068A08946C9874b6308A57701a87519a4696k68067f6006
11703B39226m1442A7033R468O953J16698L17584j66289R281O8301h9306I9265
11691a2120j19143j3396A32071F0846b05815B02675a99670K7551A97855a7904
11680C3902J36403O8449J23772B2699P176J45077B7879J54693q789a1681C6403
11668B52070H7249g2161B31277D4873b26640e3763j79047B60025a58362J9420
$$ plain form
11658 -138942 -172189 362890 -179580 202876 175367 28557 183037 312681 224811 23498
11647 23088 -111525 37391 20540 39556 65429 104522 -12248 -168963 111052 -19452 5896
11635 151721 -1286 -202465 160404 36352 282051 -1795 -338726 1014 65039 136412 299515
11624 299515 -102483 107038 427539 84659 4474 53620 -195268 -116811 115324 241725
11614 241725 52003 13176 38729 -9008 43821 255807 -104018 -67668 -7794 126597 40336
11602 -20429 -216718 122998 -243263 68774 15009 63279 110502 -162567 264677 76526 396233
11591 396233 -103380 -53048 -102852 157099 -66844 195700 241811 98699 -56345 155905 264465
11580 264465 167498 153833 -254216 83262 264802 431111 -310474 80802 19918 -69462 -41790
$$ packed form
11658a38942l3247C62890a79580B02876k7509B8557J54480J29644q7870B3498
11647B3088a11525C7391j6851J9016K5873L9093a2248j56715A11052a9452E896
11635A51721a286k01179A60404C6352K45699a795l36931A014O4025P1373J63103
11624B99515a02483A07038L20501H4659D474M9146a95268P8457A15324J26401
11614B41725E2003A3176K5553i008D3821K11986a04018L6350g794A26597D0336
11602b0429j96289A22998b43263F8774A5009M8270M7223a62567B64677G6526L19707
11591C96233a03380N0332m9804A57099f6844A95700M6111I8699e6345A55905J08560
11580B64465r6967j3665b54216H3262J81540J66309c10474H0802A9918f9462K7672
$$ plain form
11569 -41790 153957 -51651 54310 179608 -31564 50205 79813 182759 -148068 -139739 27898
11557 -17506 -56318 183123 -93600 -31093 177882 -133023 234772 -11250 -286658 31435 -2457
11545 27539 144502 -160985 -308075 -2974 220047 451757 144198 161356 -100968 66880
11534 -35842 -103214 205602 -230613 -153531 69734 3594 82726 -104915 -116005 77972 78217 -5475
11521 -131689 107549 -82122 57561 -61548 122736 320832 208496 43082 296014 18644
11510 90822 139417 129244 -143562 212967 134155 -70315 487295 172241 -13088 294521 108663
11498 4817 295025 -105373 154794 -231017 187834 195600 103009 50632 -30580 249322 96894
11486 -82622 119230 256691 120555 528548 282231 29067 -17241 -18150 235110 149332 150923
$$ packed form
11569d1790A53957e1651E4310J25298c1564E0205K9608J02946a48068Q329B7898
11557a7506l8812A83123i3600c1093A77882a33023B34772a1250k75408C1435b457
11545B7539J16963a60985j47090b974B20047K31710A44198J7158a00968F6880
11534c5842o7372B05602b30613P7082F9734C594P9132a04915j1090G7972K45e475
11521a31689A07549h2122E7561f1548A22736J98096j12336D3082K52932A8644
11510I0822M8595j0173a43562B12967p8812g0315D87295A72241a3088B94521A08663
11498D817K90208a05373A54794b31017A87834P766r2591E0632c0580B49322I6894
11486h2622A19230J37461A20555M07993k46317B9067a7241r09B35110q5778J591
$$ plain form
11475 150923 67594 -100707 59327 51275 193437 253801 142394 315404 270344 201613 95107
11463 295073 -109412 247506 280326 103796 97356 266425 43275 16945 73840 -22861 147649
11451 280336 336963 -156933 21450 -54502 -266516 8601 34152 -143051 216985 -30841 229805
11439 15102 73917 -14812 -121077 -94108 -25142 -405780 25573 179934 -210212 261650 215057
11428 215057 -30376 -2059 71853 -90861 230156 64174 -180513 922 -18591 25537 198914
11417 198914 -166023 -160440 233678 85953 -310401 45182 22578 -416278 202582 292562 -70507
11405 263054 56405 301902 -187750 272917 -18665 87336 162559 -13891 -67468 409181 -186136
11393 133814 170867 243659 -116407 -155501 57930 211407 -166684 -259240 36294 229583 7017
$$ packed form
11475A50923F7594a00707E9327q052J42162O0364j11407J73010m5060o8731I5107
11463B95073a09412B47506L2820A03796o440J69069D3275A6945N6895b2861A47649
11451B80336N6627a56933B1450e4502k12014H601K5551a43051B16985c0841B29805
11439A5102N8815a4812j06265K6969b5142l80638B5573J54361b10212B61650m6593
11428B15057c0376b059G1853i0861B30156F4174a80513I22a8591B5537J73377
11417A98914a66023N583B33678H5953c10401D5182B2578d16278B02582Q9980g0507
11405B63054E6405K45497a87750B72917a8665H7336P5223a3891n3577D09181a86136
11393A33814L7053P2792a16407l9094E7930J53477a66684r2556C6294J93289G017
$$ plain form
11381 392748 45067 -213060 -17004 -32575 62162 158236 113598 -209437 340931 -7859 69131
11369 -198510 120121 -108936 31217 23600 1326 52944 111931 69475 -161308 154950 -53456
11357 -95390 -36459 -99923 -264676 -398911 -378295 -205633 -335328 80866 102968 -34505 179521
11345 -317972 192457 112447 -431080 59496 178959 59398 -328082 -47097 37693 -176221
11334 217722 77822 272585 -130261 67330 -54875 32378 -212905 -108709 401 -72557 -22806
11322 -146247 54133 223730 -79252 111999 101312 37443 -8729 -25876 -255639 146268 357961
11311 357961 -32877 -62364 54571 -120830 -162276 -157499 -273861 35322 5592 66241 -95423
11299 -42499 -174854 95539 431799 -162575 -252650 108639 -34198 42046 -257448 -127952
$$ packed form
11381C92748D5067b13060a7004j5571F2162R6074m4638b09437C40931g859F9131
11369a98510A20121a08936C1217p617A326N1618N8987m2456a61308A54950e3456
11357i5390c6459o3464j64753j34235K0616J72662j29695H0866K2102c4505A79521
11345c17972A92457q0010d31080E9496J19463E9398c28082d7097C7693a76221
11334B17722G7822J94763a30261F7330e4875C2378b12905J04196D01g2557b2806
11322a46247E4133J69597g9252A11999j0687C7443h729j7147k29763A46268K11693
11311C57961c2877k9487E4571a20830m1446M777j16362C5322E592O0649i5423
11299d2499j32355I5539L36260a62575r0075A08639c4198D2046b57448a27952
$$ plain form
11288 -27054 -189892 32988 311407 -162752 214041 47076 -241246 242299 25588 173270
11278 173270 17896 -288982 4334 149367 -237493 15510 171337 147666 66724 -92771 -133436
11267 -133436 -134294 32515 -157563 -40810 -89636 -421634 -76577 -399325 161229 16375 -148362
11255 -256210 235494 -34012 161804 -69680 -34814 222808 -406643 -102547 124797 -99157
11244 -191898 -11648 -217804 4197 -7887 184264 -92890 -376354 -61275 39201 -77843 -19320
11232 -27011 219549 -56001 24872 29144 -53261 -65952 -317083 -66884 -123228 251451 4699
11220 -137891 204423 -55266 -62283 -153130 119729 -196574 249726 -350653 -81284 50095 2022
11208 209461 -129385 197128 -110034 88521 -87306 112956 280608 -187447 -14266 -193746
$$ packed form
11288b7054j62838C2988K78419a62752B14041D7076b41246B42299B5588J47682
11278A73270A7896b88982D334J45033b37493A5510J55827k3671F6724i2771m0665
11267a33436q58C2515a57563d0810m8826l31998g6577l22748A61229A6375a48362
11255b56210B35494c4012A61804f9680c4814B22808d06643a02547A24797i9157
11244a91898a1648k06156D197g887A84264i2890k83464f1275C9201g7843a9320
11232b7011B19549e6001B4872M272e3261j2691k51131f6884n6344B51451D699
11220a37891B04423e5266p017r0847A19729a96574B49726c50653h1284E0095B022
11208B09461a29385A97128a10034H8521h7306A12956J67652a87447a4266j79480
$$ plain form
11198 -193746 -78350 -14972 -31735 -81372 86451 166478 -210303 -227647 -184025 -178564 31423
11186 -71478 174707 45128 -106043 53479 150980 -86244 -11564 10452 -95175 -79166 -28575
11174 -94740 -341172 -125402 -153345 64422 65241 120916 126693 -130639 143778 167297 -10694
11162 182002 -25250 -359448 66708 -53453 109315 -31486 -121242 -207342 80534 -6333 -540785
11151 -540785 238443 -115 178848 -262061 176816 -232994 106582 228193 1397 -330964
11140 -145472 -105001 -157658 -97809 60101 26104 286257 -54183 -165843 258727 -77581 -83390
11129 -83390 30336 99691 -198846 61610 248057 218340 -79081 148864 -220626 117468 133568
11118 133568 227639 17208 135507 -280083 91440 192210 45855 45177 179224 53486 -165805
$$ packed form
11198a93746g8350a4972j6763m9637H6451Q0027b10303j7344M3622N461C1423
11186g1478A74707D5128a06043E3479R7501h6244a1564A0452i5175J6009b8575
11174i4740k46432a25402k7943F4422Q19N5675N777a30639A43778K3519a0694
11162A82002b5250l34198F6708e3453A09315c1486q9756q6100H0534f333n34452
11151e40785B38443a15A78848b62061A76816b32994A06582J21611A397c30964
11140a45472M0471n2657N9849F0101B6104K60153e4183j11660B58727g7581n809
11129h3390C0336O9355a98846F1610J86447k9717g9081A48864b20626A17468J6100
11118A33568R4071A7208J18299b80083I1440J00770D5855o78J34047E3486a65805
$$ plain form
11106 120053 165673 50139 -52688 359750 -24676 143429 51328 95518 -6065 318337 464390
11095 464390 43298 128980 -110982 -78843 284392 102922 12073 217885 20848 260796
11085 260796 217472 161458 334980 -17582 47895 192874 79083 516647 216798 222583 25254
11073 229843 148043 58120 474319 201102 213175 -192621 336914 220909 637426 12951
11062 461617 675423 574417 373602 497156 476764 409509 415958 488082 827571 612197
11052 612197 427864 563776 601832 717502 711685 674573 833020 416461 815600 562968
11042 562968 592127 446508 899260 518286 755790 620185 405473 707133 695964 340833
11031 883337 848470 599316 692048 601978 586755 995355 932848 291326 433076 456934 847271
$$ packed form
11106A20053M5620E0139e2688C59750b4676A43429E1328M4190f065C18337J46053
11095D64390D3298Q5682a10982L2139B84392A02922A2073K05812B0848K39948
11085B60796m3324n6014J73522a7582D7895J44979G9083M37564B16798N785B5254
11073B29843q1800E8120M16199B01102J2073a92621C36914j16005M16517A2951
11062D61617K13806j01006k00815J23554k0392o7255O449P2124L39489k15374
11052F12197j84333J35912L8056J15670n817l7112J58447D16461L99139k52632
11042E62968K9159j45619M52752l80974K37504j35605k14712L01660j1169C40833
11031H83337l4867k49154R2732r0070j5223M08600o2507B91326J41750K3858L90337
$$ plain form
11020 847271 708698 328868 356374 510376 523104 93283 278004 488107 684425 455473
11010 455473 271321 408862 322078 667121 622829 517450 261847 552868 550857 834338
11000 834338 509752 710928 662584 407330 571803 346212 784092 782237 556318 759278
10990 759278 377760 835475 828578 662871 1025747 800769 1070750 689089 1062403 1144676
10980 1144676 1074339 875332 1585553 1396476 1595428 1906902 2129255 1988263 2392884 2632604
10970 2632604 2811273 2652425 2730952 2210038 2165186 1969789 1657316 1592215 1441807 1650596
10960 1650596 1542880 1338042 1631037 1803719 1534233 1736474 1625042 1507371 1246264
10951 1246264 777234 1384278 1031941 1058670 287034 739584 528430 153363 91828 -2588
$$ packed form
11020H47271j38573C28868K7506J54002J2728I3283J84721K10103J96318k28952
11010D55473j84152J37541q6784L45043m4292j05379k55603K91021k011K83481
11000H34338l24586K01176m8344k55254J64473k25591M37880j855k25919K02960
10990G59278C77760M57715o897j65707L62876k24978K69981l81661L73314Q2273
10980A144676p0337j99007P10221j89077J98952L11474K22353j40992M04621K39720
10970B632604J78669j58848P8527n20914m4852j95397l12473o5101j50408K08789
10960A650596j07716k04838K92995J72682k69486K02241j11432j17671k61107
10951A246264m69030O07044l52337K6729B87034M52550k11154A53363o1535b588
$$ plain form
10940 598690 440151 106522 34096 219019 124990 306265 327381 106124 122906 244122
10930 244122 -64839 197880 16175 385264 226168 -167819 8786 357169 191516 2340 -116392
10918 23208 46793 43381 -187754 104355 -66559 212570 49233 127301 112669 163752 -39481
10906 228542 -273518 162110 32763 -315068 -3350 -3299 77270 130779 159192 19905 -241469
10894 -228302 -18620 -78679 44391 263329 202406 -89763 117160 -208257 -22003 -1853 -408773
10883 -408773 35266 118497 -25838 63661 -317873 241801 82744 324098 -150199 548944
10872 -250338 4056 -173537 -77272 47792 -221453 -59052 -46532 -138959 -197393 -29052 -186173
10861 -186173 48094 175438 95936 23612 80609 75198 -67561 -20123 -36087 -438130 -8054
$$ packed form
10940E98690j58539A06522C4096J84923r4029J81275K1116A06124J6782J21216
10930B44122f4839A97880A6175L69089j59096a67819H786L48383j65653B340a16392
10918B3208K3585l412a87754A04355f6559B12570D9233P8068j4632N1083c9481
10906B28542b73518A62110C2763c15068c350N1G7270N3509K8413A9905b41469
10894b28302a8620o0059D4391K18938o0923h9763A17160b08257b2003a853m06920
10883d08773C5266Q3231b5838F3661c17873B41801H2744K41354a50199E48944
10872b50338D056a73537g7272D7792b21453e9052J2520r2427n8434b9052j57121
10861a86173D8094J27344p9502B3612N6997n411f7561b0123j5964m02043h054
$$ plain form
10849 199054 -113247 149720 76007 -43586 -212254 189370 115699 42585 -174632 86907
10838 124353 -146899 -207822 80312 232523 125082 62472 -345074 -169297 -240845 -203200
10828 -203200 10129 -70472 10407 84748 -129916 -6552 -183950 -311542 150644 -372943 70834
10816 -211289 -103631 38774 -179063 139137 135674 -55349 -15403 -327799 243897 -81364 181043
10804 -76169 -99939 -115012 447253 -75805 -199761 -42228 79745 -392569 -19492 -97379 -547508
10793 -547508 -5924 -392394 -87271 -326807 -151550 209994 -22428 -549806 154561 173627
10783 173627 -21193 -59484 -22493 -184272 -148701 -83836 3353 189778 69845 204664 97966
10771 -258198 -195689 84466 416254 -169584 -272460 -183649 74558 -128201 -12855 -206289
$$ packed form
10849A99054a13247A49720p3713d3586j68668A89370p3671D2585a74632H6907
10838A24353a46899o0923H0312J52211j07441F2472c45074a69297p1548L7645
10828b03200A0129g0472A0407P4341a29916f552j77398j27592A50644c72943G0834
10816b11289a03631C8774a79063A39137l463e5349a5403l12396B43897h1364A81043
10804g6169k3770j5073D47253g5805j23956d2228G9745c92569a9492p7887m50129
10793e47508e924l86470h7271k39536a51550B09994b2428n27378A54561J9066
10783A73627b1193l8291b2493j61779L5571O4865C353J86425F9845J34819I7966
10771b58198O2509H4466L31788a69584j02876Q8811G4558a28201a2855j93434
$$ plain form
10761 -206289 -49412 46623 -228526 -264506 -280813 26833 -247556 -200456 -273023 -166106 -375459
10750 -375459 -442846 -13913 -291737 172742 209121 -120611 72827 -110202 132658 -294136
10739 -33845 -115420 83281 206889 -175521 89587 -211049 268805 -77231 55634 139473 279115
10728 279115 113080 19500 -177334 198608 92013 142082 234705 -137848 -135 -31071 -106658
10717 -106658 -8555 97564 -277366 -151040 -2152 121013 129521 -75033 98266 22996 65592
10706 65592 -174338 300558 231133 -59805 329431 -288067 -297354 -97515 -50212 -340819 61495
10694 -17799 -132836 -251863 -122059 -237394 -410202 -27577 -102159 -330285 -9544 -81236 -166143
10683 -166143 -18315 30626 -67540 200779 -52094 53375 52060 97682 -18155 -138338 -52785
$$ packed form
10761b06289d9412D6623b28526l5980j6307B6833b47556M7100p2567J06917k09353
10750c75459o7387a3913k77824A72742L6379a20611G2827a10202A32658b94136
10739c3845q1575H3281J23608a75521H9587b11049B68805g7231E5634Q3839J39642
10728B79115A13080A9500a77334A98608I2013N0069R2623a37848a35l0936p5587
10717a06658h555I7564b77366J26326b152A21013Q508g5033I8266B2996M2596
10706F5592a74338C00558o9425e9805C29431b88067r287i7515M7303k90607F1495
10694a7799j15037j19027a22059j15335j72808b7577p4582k28126i544p1692q4907
10683a66143a8315C0626f7540B00779e2094E3375j315M5622a8155j20183e2785
$$ plain form
10671 156959 119446 -275860 89835 278240 293271 197139 72507 -40653 -303181 89786 268401
10660 268401 -133883 -113106 -123708 -163162 53803 21142 -230631 -224411 -262080 -116785 -38243
10648 -205083 -81342 -145474 10938 59054 328956 -18831 -98755 164567 115617 -276783 -183756
10637 -183756 173289 148507 99518 -264769 -356946 -140590 126990 -120604 126022 -2744
10626 -13640 -254143 103423 10551 47415 -348310 -30077 -146723 -155034 -21721 162060 274479
10615 274479 -246862 -2020 -35295 247468 28516 -244734 183163 -418820 -284784 -172558
10605 -172558 -145298 -188242 73397 33666 -71344 -364917 -467430 -231139 -8709 -63151 -136738
10594 -136738 -204042 45049 10850 -364054 -187270 -50601 4883 -138683 34620 -85424 -75903
$$ packed form
10671A56959l7513b75860H9835J88405J5031r6132G2507d0653k62528H9786J78615
10660B68401a33883K0777j0602l9454E3803B1142b30631O220l7669a16785c8243
10648b05083h1342o4132A0938M8116K69902a8831p9924A64567m8950b76783R3027
10637a83756A73289k4782m8989b64769r2177a40590A26990a20604A26022b744
10626a3640k40503A03423A0551L6864c48310c0077j16646q311b1721A62060J12419
10615B74479b46862b020l3275B47468B8516b44734A83163d18820J34036J12226
10605a72558K7260m2944G3397C3666g1344k93573j02513b31139h709n4442p3587
10594a36738o7304D5049A0850c64054J76784e0601D883a38683C4620h5424R521
$$ plain form
10583 -75903 115547 -51073 -69931 -425101 -29707 -299525 -20108 -233761 -6521 24193 -532156
10571 -698 -245372 169627 285467 -138352 76108 149680 -112102 -140372 31569 -86261 -22486
10559 31010 65342 -34952 105070 -75390 4429 -289233 -197606 -163082 105896 -252619 -13118
10547 35488 84290 -34211 30726 109608 32258 93741 29808 -34063 -44965 168741 -215508
10535 -232573 188489 -291164 65309 -227927 -4512 456 -91054 18919 -65024 -323068 29015
10523 -97423 -296353 241695 192175 -139884 -26513 -326080 -82173 -193308 53772 -65377 197164
10511 -58292 -38627 181087 -140258 109911 -18376 -64503 -111510 34033 289095 63077 -138117
10499 383841 -120075 -104095 -62436 378020 -53222 99825 51620 -97667 125023 159538 -137930
$$ packed form
10583g5903A15547e1073j8858l55170b9707k69818b0108k13653f521B4193e32156
10571f98k44674A69627J15840a38352G6108P3572a12102k8270C1569h6261b2486
10559C1010L4332c4952A05070g5390D429b89233R1627L4524A05896b52619a3118
10547C5488M8802c4211C0726P8882C2258O1483B9808c4063j0902A68741b15508
10535b32573A88489b91164F5309b27927d512D56i1054A8919f5024k58044B9015
10523i7423j98930B41695m9520a39884b6513k99567h2173j11135E3772f5377A97164
10511e8292J9665A81087a40258A09911a8376m6127m7007C4033K55062F3077a38117
10499C83841a20075J5980M1659C78020e3222I9825m8205i7667A25023L4515a37930
$$ plain form
10487 -11566 171374 -54270 52277 226598 -125743 331192 580065 280856 630992 187172
10476 453382 328069 -103007 387489 190377 229323 62998 147052 -103648 124458 287498
10466 287498 30004 174539 460 -409491 320189 -409196 382133 -200592 85589 196384
10456 196384 81715 154490 21044 130059 227143 65284 15884 -72502 16807 -71331 -188266
10445 -188266 -15318 552 33287 -13522 -18614 -29089 -178580 -106113 -70992 -199321 -233905 52501
10432 -57617 -163557 -11046 -74260 -128768 -50502 26704 12555 120492 -237190 -36885 77905
10420 36913 75338 188840 30832 84495 175370 -146831 -203039 20008 215002 -148226 -202990
10409 -202990 -33340 -116955 -81359 292255 39524 29301 -10215 -74209 -174292 -8412 -417973
$$ packed form
10487a1566A71374e4270E2277J74321a25743C31192K48873B80856L50136A87172
10476D53382j25313a03007C87489A90377L8946F2998Q4054a03648A24458J63040
10466B87498C0004J44535D60d09491C20189d09196C82133b00592H5589J10795
10456A96384H1715P2775B1044J09015R7084F5284A5884g2502A6807g1331j16935
10445a88266a5318E52L2735a3522n092j0475j49491P2467L5121j28329l4584E2501
10432e7617j05940a1046o3214n4508e0502B6704A2555J07937b37190c6885G7905
10420C6913L8425J13502C0832N3663R0875a46831n6208B0008J94994a48226n4764
10409b02990c3340q3615L5596B92255C9524j0223a0215o3994j00083h412m09561
$$ plain form
10398 -417973 14355 -266170 134178 -247278 268256 38332 413584 142741 -3739 284628
10387 98071 -151942 89393 130717 293496 173133 13479 -126066 57102 -110787 159080
10376 455375 369280 260399 44201 84969 -10761 134462 188978 6355 604572 441059 540850
10365 540850 656027 344282 444408 -91776 347191 192860 593533 337724 340324 261409
10355 261409 -110426 405171 316741 288665 54868 453155 250501 493087 428987 103389
10344 103879 279861 241597 316367 302298 82598 135733 29283 2453 454251 47387 -66726
10332 -102124 233682 -106251 130849 -96222 129570 -90015 73090 148698 219181 124632 252450
10321 252450 77856 396668 260238 79334 328144 -194161 374024 -196635 49914 183362
$$ packed form
10398d17973A4355b66170A34178b47278B68256C8332L75252A42741c739B84628
10387I8071a51942H9393M1324J62779j20363A3479a26066E7102a10787A59080
10376D55375q6095j08881D4201M0768a0761A34462N4516F355N98217j63513R9791
10365E40850J15177l11745J00126i1776C47191j54331M00673k55809K600p8915
10355B61409a10426D05171q8430k8076E4868L98287k02654K42586o4100A03389
10344A03879J75982l8264P4770j4069H2598N3135B9283B453M51798D7387f6726
10332a02124B33682a06251A30849i6222A29570i0015G3090P5608P0483r4549J27818
10321B52450G7856L18812j36430G9334K48810a94161C74024a96635D9914J33448
$$ plain form
10311 183362 239128 42814 -57533 16438 -20602 -71210 18265 -350774 204050 299388 75444
10299 73359 161246 -292472 -18977 275268 -282128 -116641 316768 -6342 -117730 -139152 166018
10287 85652 82775 -37250 -34370 24058 56196 -56098 -115294 233553 -42036 -122491 282686 -1977
10274 18088 8216 -163804 78892 -46713 22831 142869 173582 164887 218293 274663 -104963
10262 220115 131293 -43570 282436 55990 98432 353024 -61277 96502 217563 198690 178513
10251 178513 284069 180709 79475 210043 -97221 -177241 -158239 146906 -220712 -78160
10240 -26755 -74805 -31194 -311720 7228 125009 -17161 1153 201065 178204 -71328 232757
10228 -41248 81646 51906 -123093 148841 -270794 -93964 11846 -37624 -122046 97700 146255
$$ packed form
10311A83362N5766D2814e7533A6438b0602n0608A8265c50774B04050R5338G5444
10299G3359Q7887b92472a8977B75268b82128a16641C16768f342j11388k1422A66018
10287H5652k877c7250K880B4058L2138e6098n9196B33553d2036q0455B82686a977
10274A8088H216a63804G8892d6713B2831J20038L0713q695N3406N6370a04963
10262B20115q8822d3570B82436E5990M2442K54592f1277I6502J21061j8873k0177
10251A78513J05556j03360G9475J30568i7221q0020J9002A46906b20712g8160
10240b6755m8050c1194k80526G228J17781a7161A153J99912k2861g1328B32757
10228d1248H1646k9740a23093A48841b70794i3964A1846c7624q4422I7700M8555
$$ plain form
10217 146255 -80443 -35167 -149750 -165231 -166388 180493 -37310 -146231 -281823 131378 -297909
10205 -116875 98183 -10836 126695 -173397 -228323 -389636 312015 9377 -13596 -346616 -373378
10194 -373378 -117089 96631 -94440 -180101 249755 311324 -168117 -263810 -41853 195168 165294
10183 165294 -20852 -297426 193015 -123074 -162657 -273119 -242501 -40596 -114126 -18438 63089
10171 -267385 69519 3331 -144268 72967 68311 81995 286972 75602 -56403 -220286 -6863
10159 259616 -152737 -230225 -330434 31068 94236 -287540 -157586 52948 50162 94000 283292
10148 283292 -115880 42443 -264667 -167655 34172 292034 -109938 -271403 11224 67616
10138 67616 -241373 -70658 -202924 -179543 -141027 118712 -36843 118513 151090 -147714 35356
$$ packed form
10217A46255h0443c5167j14583j5481j157A80493c7310j08921j35592A31378b97909
10205a16875I8183a0836A26695a73397n4926j61313C12015I377a3596l33020k6762
10194c73378a17089I6631i4440q5661B49755O1569a68117r5693d1853A95168k9874
10183A65294b0852k76574A93015a23074l9583j10462L0618d0596p3530a8438F3089
10171b67385F9519C331a44268G2967m656J3684K04977G5602e6403j63883f863
10159B59616a52737p7488j00209C1068O3168b87540J29954E2948k786M3838J89292
10148B83292a15880D2443b64667R7012C4172K57862a09938j61465A1224N6392
10138F7616b41373g0658j32266K3381L8516A18712c6843A18513L2577a47714C5356
$$ plain form
10126 -11528 -41161 -264601 -250646 -170598 -277514 -48462 140930 214415 -3878 -447880 989
10114 -14351 -66348 -34611 -147916 14154 -225519 117025 60069 66655 68493 90578 -274292
10102 -260061 -251457 59779 11430 -107337 -228842 -5099 165430 -142018 238285 86688 -351017
10090 77985 88316 190105 9192 -337737 -253764 62706 -14605 -130991 183862 -62334 -376698
10079 -376698 -35771 163476 -248093 -120613 -151458 203262 -98118 -264566 262575 -98288
10068 -232270 235658 196628 -62598 -36866 54396 -335255 26384 19737 51443 110672 8366
10056 -180340 -205510 44162 -72425 -142176 349774 -35728 -65209 -99085 50400 -82606 -314089
10045 -314089 -73371 84179 -89286 -11069 -281486 -288641 -257668 71323 -56755 -117344 478164
$$ packed form
10126a1528k9633k23440J3955Q0048j06916d8462A40930P3485c878m44002I89
10114a4351n1997L1737j13305A4154b25519A17025n6956O586J838K2085b74292
10102b60061Q604E9779A1430a07337j21505e099A65430a42018B38285H6688c51017
10090G7985J0331J01789I192c37737Q3973F2706a4605j16386A83862f2334l14364
10079c76698c5771A63476b48093a20613l0845B03262i8118j66448B62575i8288
10068b32270B35658l9030f2598K5732E4396c35255B6384o647L1706N9229H366
10056a80340k5170D4162g2425o9751C49774c5728k9481l3876E0400h2606k31483
10045c14089g3371H4179h9286a1069k70417p155L0973G1323e6755o0589D78164
$$ plain form
10033 -85282 -179778 -171914 -349335 42093 -342737 -320777 47078 123159 27860 69018 14670
10021 -83122 -122512 -173925 83489 26246 -20965 395522 -256523 207581 -6256 -432599 202773
10009 85688 428585 69471 61634 -122393 -307450 -51884 -469626 -262371 -192867 366196 -129949
9997 -250338 21204 -55205 160881 -356444 -39035 -64990 -22639 -587379 170144 4711 82412
9986 82412 -75065 -6155 -491453 79640 -171973 -84316 2359 -240612 60954 148543 -196075
9974 347789 151316 -54839 2857 -144409 -237755 139458 112642 -104226 48661 -12801 -269331
9963 -269331 125531 -417615 -199695 -36537 -68099 303233 -4362 -199111 -161273 -107244 -256275
9952 -256275 -6182 185509 -88747 185774 -92215 -99196 -13458 -254591 -127705 -228133 -25354
$$ packed form
10033h5282r4496P864j77421D2093c42737K1960D7078P6081B7860M1158A4670
10021h3122l9390n1413H3489B6246b0965C95522b56523B07581f256m26343B02773
10009H5688L42897F9471p837a22393j85057e1884m17742K07255O9504C66196a29949
9997b50338B1204e5205A60881c56444c9035k5955b2639n64740A70144D711P7701
9986H2412g5065f155m85298G9640a71973h4316B359b40612F0954Q7589a96075
9974C47789A51316e4839B857a44409r3346A39458k6816a04226D8661a2801k56530
9963b69331A25531d17615a99695c6537l1562C03233d362j94749L7838N4029j49031
9952b56275f182A85509h8747A85774i2215o981a3458k41133J26886j00428b5354
$$ plain form
9940 -116356 -16571 -144180 -18598 126018 -433726 5801 29197 -195798 73968 -41964 348896
9928 381996 -12651 94973 214214 66126 -131847 -89038 -256994 10631 64000 -91588 -89279
9917 -89279 73419 110397 -211882 -177175 -53460 -307246 7519 264099 -158493 -190170 -211944
9906 -211944 -186594 -428456 651 -27327 -271194 -256587 -74993 -52871 196949 -72286 2450 -88579
9893 55804 -20868 -312206 -161206 -47433 -260383 327285 -83748 84854 36450 -300738 -155865
9882 -155865 100015 -130891 -42524 103831 28954 -399832 -79730 21734 -309509 -242267 -22905
9870 -76254 -213836 -34107 -20652 -30634 -46824 139852 -456762 -219871 140840 -65249 -493713
9859 -493713 -104769 -272481 195101 -93582 -132216 -176435 128810 -236210 -74349 63735 3396
$$ packed form
9940a16356a6571j27609a8598A26018d33726E801K3396a95798G3968d1964C48896
9928C81996a2651I4973J19241F6126a31847M2809j67956A0631N3369i1588K309
9917h9279G3419L6978b11882L4707e3460k53786G519K56580a58493l1677k1774
9906b11944K5350k41862F51b7327k43867J4607g4993K2122A96949g2286B450h8579
9893E5804b0868k91338J51000d7433k12950C27285h3748H4854C6450c00738J44873
9882a55865A00015a30891d2524A03831B8954c99832g9730B1734c09509O7242b2905
9870g6254j37582c4107J3455r982j6190A39852d56762b19871A40840f5249m28464
9859d93713a04769j67712A95101i3582l8634m4219A28810b36210g4349F3735C396
$$ plain form
9847 254691 106034 -99442 -4609 -56978 -58785 121146 65091 -172286 378864 357872 -203892
9835 -412170 -207906 -10853 60623 -64790 92392 144722 -144139 -263559 157018 74385 -19834
9823 -184992 -218954 -33060 -406846 63582 -157010 254107 -196405 -305691 116969 -202139
9812 -233750 -50803 135754 -90997 161766 -54367 -100973 -172213 86613 -353210 -445256 39535
9800 220420 -210063 22857 92902 18349 -165766 -161252 53202 -279392 -403320 -163804 -35422
9788 -34116 10769 -4696 12286 -156699 178244 225668 -378584 -72496 -185225 19201 -110194
9776 258257 49850 -287195 -88113 -45115 112490 -25644 100647 66895 -25550 127773 -210474
9764 -26485 154102 82878 0 111308 69301 138164 -199800 42203 215156 -16419 -12523 -84391
$$ packed form
9847B54691A06034i9442d609n2369j807A21146n6055a72286C78864k0992b03892
9835d12170K04264a0853F0623f4790I2392N2330a44139j19420A57018G4385a9834
9823a84992l3962c3060l73786F3582a57010B54107a96405j09286A16969b02139
9812b33750e0803A35754i0997A61766e4367m6606p1240H6613c53210r2046C9535
9800B20420b10063B2857P0045A8349a65766M514E3202b79392j23928a63804c5422
9788c4116A0769d696A2286a56699A78244M7424c78584g2496j12729A9201a10194
9776B58257D9850b87195h8113M2998A12490b5644A00647l3752b5550A27773b10474
9764b6485A54102p1224@A11308m2007O8863a99800D2203J72953a6419L896p1868
$$ plain form
9752 -84391 91528 -68710 96247 -111319 184620 -91584 207289 -111347 411499 -83696 -80197
9741 -80197 -16073 159073 92561 -60994 -45444 -174893 -137777 -376621 -89536 31583 -147832
9729 -231786 190858 -230028 124029 -88694 128563 -60434 6045 -257256 -17622 -301849 97144
9717 -375318 -229396 -143835 30376 132439 -211313 105653 168484 -38115 59584 -440255 149852
9705 -242888 115157 84479 -116589 267579 131242 62095 185247 70719 -149004 269993
9694 93217 115526 -135694 71058 -211360 194192 -71480 -55137 -68377 -302335 182274 -18078
9682 -139802 -246706 -71886 -494800 -194532 -86928 120416 -365323 -20953 -102162 -407735
9672 -407735 -35331 121957 -344723 209900 82105 -200772 -272046 -206488 27739 -198889 -63624
$$ packed form
9752h4391I1528f8710I6247a11319A84620i1584B07289a11347D11499h3696L499
9741h0197a6073A59073o6512f0994J5550j29449L7116k38844h9536C1583a47832
9729b31786A90858b30028A24029h8694A28563f0434F045b57256a7622k84227I7144
9717c75318J45922Q5561C0376J02063b11313A05653O2831c8115E9584d40255A49852
9705b42888A15157l0678a16589B67579A31242F2095J23152G0719a49004B69993
9694I3217K2309a35694G1058b11360A94192g1480J6343j3240k33958A82274a8078
9682a39802j06904g1886m22914a94532h6928A20416c65323b0953q1209l05573
9672d07735c5331A21957c44723B09900H2105b00772p1274O5558B7739a98889f3624
$$ plain form
9660 10925 -16725 -140290 92089 329142 200788 -43958 -56013 -54171 -175856 -29231 285341
9648 -125252 -371679 120336 40819 -191390 -90842 -62247 -39294 -159749 127008 -159331
9637 21351 172121 -40834 52856 4890 219093 -53581 -54032 -169442 -73086 -73685 32217 -3243
9624 -405993 281859 -58985 26228 -96393 30085 -47985 -74200 -311604 -63328 -315149 -22800
9612 -43743 -183891 -67446 -67808 -152836 84482 -204861 -137884 -166278 -34843 -144821 -260646
9601 -260646 -170053 -12280 140025 -391905 -79845 -204126 -50030 -185354 -109262 36879 126324
9590 126324 -199649 107971 -117786 -58279 94965 103131 -428649 -243868 -30043 -120725 307206
9578 -70127 125593 -276427 30843 107753 78635 25442 30268 2439 -115267 121133 94342
$$ packed form
9660A0925a6725j23565I2089K37053j28354d3958j2055J842j21685b9231B85341
9648a25252k46427A20336D0819a91390i0842K8595K2953j20455A27008a59331
9637B1351J50770d0834E2856D890K14203e3581m51j15410g3086n99C2217c243
9624d05993B81859e8985B6228i6393C0085d7985k6215k37404f3328k51821b2800
9612d3743j40148f7446l62q5028H4482b04861O6977k8394c4843j09978j15825
9601b60646R0593a2280A40025c91905g9845j24281e0030j35324P6092C6879Q9445
9590A26324a99649A07971a17786e8279I4965Q166d28649J84781c0043r0682C07206
9578g0127A25593b76427C0843P6910k9118B5442M826B439a15267A21133k6791
$$ plain form
9567 94342 -42188 119353 -39728 66755 62218 -184606 -95982 106856 -155415 -135865 -9549
9555 -172052 137489 34782 -301852 -239736 27755 129714 -44753 -42814 217486 -221674 -78712
9543 20916 14595 271026 -207404 23908 -349185 177201 -212199 -88707 -74797 50098 -233892
9531 34773 -305681 250059 20267 -190373 20775 169731 -263769 -155936 299344 -101307
9520 -366230 -25681 -161356 -171267 -8450 -412599 -29476 33794 -428261 -86828 2825 -107345
9508 31933 -3066 -252675 -233146 -360781 2635 -131443 221251 -19026 137735 -203588 275218
9496 98401 -64208 -203920 -176558 319370 -3245 109255 -49447 -22385 115606 -179831 220467
9484 -194377 -92545 -174939 -47390 -109390 -283419 120490 353293 26292 -164436 33224 -139061
$$ packed form
9567I4342d2188A19353c9728F6755m537a84606Q8624A06856a55415J9550i549
9555a72052A37489C4782c01852O2116B7755J01959d4753J939B17486b21674g8712
9543B0916o321K56431b07404B3908c49185A77201b12199h8707J3910E0098b33892
9531C4773c05681B50059B0267a90373B0775J48956b63769J07833B99344a01307
9520c66230b5681j35675r911h450m04149b9476C3794d28261h6828B825a07345
9508C1933c066k49609J9529j27635B635a31443B21251a9026A37735b03588B75218
9496I8401f4208j39712K7362C19370c245A09255d9447b2385A15606a79831B20467
9484a94377i2545q2394d7390o2000j74029A20490K32803B6292a64436C3224a39061
$$ plain form
9472 -120632 -153700 -159439 3266 54789 -219161 15006 -253273 168785 -274841 184629 -125564
9460 -61095 -29233 -399084 -10865 19042 208462 -24754 -217468 -79311 -235796 223548 -399958
9448 -182561 -71928 -329304 225763 -155123 -426712 -83070 23196 256793 94980 -40250 -236447
9437 -236447 88465 -110310 182016 67746 -37304 -222918 -96730 72403 -182758 215364 64308
9425 -84950 38425 -17393 283874 -195661 -59684 -52774 -108872 8799 157209 107168 47491 31462
9413 31462 108161 199724 -196548 -284758 78766 -626403 -32925 -171802 -11734 26367 -213925
9401 -289559 -205816 -313084 -259598 26157 38766 -33754 -115695 204490 -55058 -397719 -107269
9389 219512 -191258 -94287 76960 -82012 -188503 -292243 -134243 85902 -84525 -319445 -192376
$$ packed form
9472a20632l3068n739C266N1523b19161A5006b53273A68785b74841A84629a25564
9460f1095b9233l69851a0865A9042J89420b4754j92714g9311j56485B23548c99958
9448a82561g1928k57376B25763a55123k71589h3070B3196K33597I4980d0250j96197
9437b36447H8465a10310A82016F7746c7304j85614i6730G2403a82758B15364F4308
9425h4950C8425a7393B83874a95661e9684O910n6098H799J48410n0041D7491j6029
9413C1462P6699R1563a96548q8210G8766f26403c2925j38877a1734B6367b13925
9401b89559Q3743j07268N3486B6157J2609c3754q1941B04490e5058l42661a07269
9389B19512a91258i4287G6960h2012j06491j03740a34243H5902h4525k34920J27069
$$ plain form
9378 -192376 -154986 125859 -54721 -138584 -21100 -26772 -363335 -43786 -294319 -467292 -51836
9366 -131297 39001 -284046 -196104 -66575 -44341 -332328 77416 58609 -171348 28722 14598
9355 14598 96582 -361738 -90971 -210 62768 -205731 100773 -27472 -125961 9177 49840 13687
9342 -288658 -238324 17848 -74174 182224 -12943 -130078 89467 -158122 51456 -154062 120819
9330 -47891 -15020 -152807 87844 159603 -33053 -19668 -141684 2669 186798 67385 35530
9319 35530 38107 -186220 22662 -240785 -194812 -85610 205029 -132278 -4005 -65899 -762 -23240
9307 -23240 -69913 -318860 228109 -212228 -229435 -129983 156800 -324019 81905 -85122 -20365
9295 -180088 -204842 -96544 -170196 96942 -273928 -167304 104729 -167181 -33486 -48649 170955
$$ packed form
9378a92376L7390A25859e4721q3863b1100n672l36563d3786k50533j72973e1836
9366a31297C9001b84046Q7942f6575K2234k87987G7416j8807a71348B8722j4124
9355A4598Q1984c61738i0971b10F2768b05731A00773b7472r8489I177M0663A3687
9342b88658N0334A7848g4174A82224a2943j17135H9467a58122E1456a54062A20819
9330d7891a5020j37787H7844P1759c3053J3385j22016B669J84129F7385l1855
9319C5530K577a86220B2662b40785M5973h5610B05029a32278d005o1894g62k2478
9307b3240m6673k48947B28109b12228j7207R9452A56800c24019H1905h5122b0365
9295a80088k4754i6544p3652I6942b73928J06624A04729a67181c3486j5163A70955
$$ plain form
9283 -237551 -294463 196532 -271001 -105527 228523 230021 -396132 -64358 -122941 -56569 -243487
9272 -243487 -540194 -45283 -69030 -109534 -169556 -65313 -42907 12717 -110410 243469 -5263
9260 -115235 231480 103852 -168772 -58639 -236882 -10877 -155760 75537 10928 -321337
9249 -254902 -229231 12172 -81679 -228609 -50939 -164571 147295 -189499 -155741 -142603 -58515
9237 -72854 -238900 -76385 -29072 -259402 -345636 324797 123833 -79498 -98707 -254263 156254
9225 -42662 8677 -218650 71378 -206160 35575 143745 -132424 -183452 79864 -167440 -169535
9214 -169535 -178613 -224 209939 93756 35030 -62992 -72517 -41367 -300769 -295490 59429 126284
9202 126284 -247320 43523 41020 -43726 121235 27048 -62436 275220 -40158 -167014 -105933
$$ packed form
9283b37551n6912A96532b71001a05527B28523J498c96132f4358n8583e6569j86918
9272b43487k96707d5283k3747m0504o0022f5313K2406A2717a10410B43469e263
9260a15235B31480A03852a68772e8639j78243a0877j44883G5537A0928c21337
9249b54902K5671A2172h1679j46930e0939j13632A47295a89499L3758J3138e8515
9237g2854j66046g6385b9072k30330q6234C24797A23833g9498j9209j55556A56254
9225d2662H677b18650G1378b06160C5575J08170a32424n1028G9864a67440k095
9214a69535r078b24B09939I3756C5030f2992r525L1150k59402N279E9429O6855
9202A26284b47320D3523k503d3726A21235B7048f2436B75220d0158j26856O1081
$$ plain form
9191 -105933 -128734 -132469 -255969 370628 139211 196895 -267835 -217472 80288 -13943 18651
9179 71946 -135827 117759 -433124 157422 -119454 -88551 116461 76201 -166584 -46941
9168 -32254 -83925 -37578 -250708 -287506 -205362 -4011 55430 -95093 -61389 72465 -149747 217441
9155 -80591 -165665 147500 183029 -208139 -281924 80467 -195376 -142397 -343180 24855 12950
9144 12950 -108312 72141 208164 -20364 302081 118020 -13650 -32865 86209 -343838 -52898
9132 62567 -20719 -101042 -149338 21639 141302 -40260 7092 -240051 -159160 -502093 -155994
9120 -408197 -210758 -74877 94550 -10052 -123854 -31446 26353 -133847 -174650 -4154 -409906
9109 -409906 -40912 -152727 -273690 -333553 -200370 41610 -77201 -94950 65792 -237966 -184664
$$ packed form
9191a05933k2801l735j23500C70628A39211N7684b67835N0363H0288a3943A8651
9179G1946a35827A17759d33124A57422a19454L0903A16461m0260a66584d6941
9168c2254n1671c7578k13130l6798Q2144d011E5430i5093L3704G2465a49747B17441
9155h0591q5074A47500L5529b08139p3785H0467a95376N2979k00783B4855j1905
9144A2950a08312G2141J36023b0364C02081A18020a3650j9215H6209c43838e2898
9132F2567b0719q0323m8296B1639J19663d0260G092b40051Q0891l42933a55994
9120d08197J97439g4877I4550a0052j13802c1446B6353a33847m0803d154m05752
9109d09906d0912j11815j20963n9863J33183D1610g7201j7749F5792b37966N3302
$$ plain form
9098 -184664 259901 -76287 119016 -152706 -125520 -269459 53894 28604 -178150 -84383 162472
9086 -172145 125642 -179578 24344 -100798 134051 54991 28825 56967 109140 -154491 48738
9074 -135416 -20785 -118082 -41478 196416 90402 -96326 -23690 -301025 -101604 -108963 -284987
9063 -284987 -141237 -172045 54254 235312 -5054 -195989 -109825 78876 -205550 -107743 10609
9051 -12557 -139099 -44983 -63540 -238696 -486658 60112 -92092 -234964 31139 -76042 -95577
9040 -95577 -145325 -204894 -52362 -55033 -246539 -26011 -368694 65389 -58031 -49537 -30055 132831
9027 -63044 23185 -295366 -318348 224074 -126892 198095 -21261 17010 198011 25726 -441564
9015 -103310 134103 -142533 -264368 -132030 -54731 111534 -286125 36819 -17479 85531
$$ packed form
9098a84664B59901g6287A19016a52706K7186j43939E3894k5290a78150h4383A62472
9086a72145A25642a79578B4344a00798A34051E4991k6166K8142N2173a54491D8738
9074a35416b0785r7297d1478A96416I0402i6326b3690k77335a01604p359j76024
9063b84987a41237l0808E4254J81058e054j90935Q6164G8876b05550R7807A0609
9051a2557j26542d4983j8557j75156k47962F0112i2092j42872C1139g6042j9535
9040i5577m9748n9569e2362k671j91506b6011l42683F5389e8031Q494J9482A32831
9027f3044B3185b95366k2982B24074a26892A98095b1261A7010J81001B5726d41564
9015a03310A34103a42533j21835a32030e4731A11534b86125C6819a7479H5531
$$ plain form
9004 -25281 64386 -418926 202072 -34200 246195 -31078 -71629 -123295 -96839 -121237 -48659
8992 50249 -207596 -427426 74265 81948 29408 30572 4881 250750 -65621 123504 72562 -165655
8979 -178940 -51378 -42491 -248613 -73073 -287615 -140550 85053 1557 -84742 -120117 -72420
8968 -72420 -209067 -339748 -65971 -66733 -121994 -130067 -46706 -141370 -129762 -177654 -169206 246036
8955 73100 414586 45515 -65549 -191153 -129590 -188181 169433 -85596 -121485 -173824 -92938
8944 -92938 42400 19134 161072 -124197 -222811 -72942 200797 -153472 -207583 63946 -102971
8932 13358 -137240 -75400 206307 293982 103578 19048 -229717 -86506 -75620 137551 -398533
8920 37786 130527 266430 -78812 60975 31934 -102437 72991 130098 323489 -77710 -206637
$$ packed form
9004b5281F4386d18926B02072c4200B46195c1078m0551n1666K6456k4398d8659
8992E0249b07596k19830G4265P683B9408J164D881K45869f5621A23504n0942a65655
8979a78940e1378Q887k06122g3073k14542a40550H5053A557h4742l5375M7697
8968g2420j36647j30681f5971p62n5261q073d6706r4664J1608m7892Q448B46036
8955G3100L41486D5515f5549j25604O1563n8591A69433h5596l5889n2339Q0886
8944i2938D2400A9134J41938a24197r8614g2942B00797a53472n4111F3946a02971
8932A3358a37240O1840B06307Q7675A03578A9048b29717h6506J0886A37551c98533
8920C7786R2741J35903g8812F0975k9041a02437G2991N7107J93391g7710j28927
$$ plain form
8909 -206637 72275 -235872 -207206 -150824 154445 155015 61219 -74728 -468774 -141700 326419
8897 250758 -75004 -40245 -38903 -238149 -85299 59711 -20176 8745 -178793 -107130 381393
8885 -144365 -97715 3704 194474 51791 -10098 -111937 -88337 -196486 -278053 -49280 39330
8873 -124884 -123709 -71720 -243165 -280425 -311990 150238 -238662 181584 -304276 -121427 -66067
8862 -66067 80622 -115381 -177109 -19707 -135663 -57436 -134229 -90524 -151171 -150759 145638 -121070
8849 83425 -401159 -64046 -134068 -64720 -75994 -206202 58110 -99623 -19321 -345678 -34884
$$ packed form
8909b06637G2275b35872K8666N6382A54445N70F1219g4728l94046a41700C26419
8897B50758g5004L4759J342j99246h5299E9711b0176H745a78793P1663C81393
8885a44365M6650C704J90770E1791a0098j01839K3600j08149q1567d9280C9330
8873a24884J175N1989j71445l7260l1565A50238b38662A81584c04276a21427N5360
8862f6067H0622a15381o1728a9707j15956e7436p6793M3705o0647M12A45638a21070
8849H3425d01159f4046p0022f4720j1274j30208E8110i9623a9321l26357c4884
$$ [...]
##END NTUPLES=NMR SPECTRUM
##END=
