##TITLE=AC1740_SEN00013_9276343_qgJO3Bddgf
##JCAMPDX= 6.0         $$ Bruker NMR JCAMP-DX V2.0
##DATA TYPE= NMR SPECTRUM
##DATA CLASS= NTUPLES
##ORIGIN= BRUKER
##OWNER= Administrator
$$ 1.72 TOPSPIN		Version 2.1
$$ 2015-07-18 02:20:28.760 -0700  Administrator@X
$$ Compression mode = diff/dup
##.OBSERVE FREQUENCY= 400.02188249412
##.OBSERVE NUCLEUS= ^1H
##.ACQUISITION MODE= SIMULTANEOUS (DQD)
##.ACQUISITION SCHEME= undefined
##.AVERAGES= 8
##.DIGITISER RES= 22
##SPECTROMETER/DATA SYSTEM= spect
##.PULSE SEQUENCE= zg30
##.SOLVENT NAME= COFFEE_meoh
##.SHIFT REFERENCE= INTERNAL, COFFEE_meoh, 1, 14.98509
##AUDIT TRAIL= $$ (NUMBER, WHEN, WHO, WHERE, PROCESS, VERSION, WHAT)
$$ ##TITLE= Audit trail, TOPSPIN		Version 2.1
$$ ##JCAMPDX= 5.01
$$ ##ORIGIN= Bruker BioSpin GmbH
$$ ##OWNER= Administrator
$$ $$ E:\/data/COFFEE/nmr/AC1740_SEN00013_9276343_qgJO3Bddgf/20/pdata/1/auditp.txt
$$ ##AUDIT TRAIL=  $$ (NUMBER, WHEN, WHO, WHERE, PROCESS, VERSION, WHAT)
(   1,<2015-07-18 02:20:21.385 -0700>,<Administrator>,<X>,<go>,<TOPSPIN 2.1>,
      <created by zg
	started at 2015-07-18 02:19:14.807 -0700,
	POWCHK enabled, PULCHK disabled,
       configuration hash MD5:
       21 0F 79 D6 B3 7B B4 F6 88 20 88 DB 03 48 BD 9F
       data hash MD5: 64K
       A0 70 E7 A9 62 80 2C 53 0F EF A8 B6 AC 3E 40 0B>)
(   2,<2015-07-18 02:20:24.760 -0700>,<Administrator>,<X>,<proc1d>,<TOPSPIN 2.1>,
      <Start of raw data processing
       efp LB = 0 FT_mod = 6 PKNL = 1 PHC0 = 0 PHC1 = 0 SI = 32K 
       data hash MD5: 32K
       41 48 95 D4 20 CB 3F 32 13 B5 65 E1 BB 17 74 F2>)
(   3,<2015-07-18 02:20:25.072 -0700>,<Administrator>,<X>,<proc1d>,<TOPSPIN 2.1>,
      <pk PHC0 = 93.73535 PHC1 = 0 
       data hash MD5: 32K
       C3 F9 EB 24 4E A9 25 E9 03 43 04 42 81 22 0A CC>)
(   4,<2015-07-18 02:20:25.182 -0700>,<Administrator>,<X>,<proc1d>,<TOPSPIN 2.1>,
      <abs ABSG = 1 
       data hash MD5: 32K
       C7 8F A8 EC D2 B4 3D 4F 70 6E 7E 15 1E 06 9D 11>)
(   5,<2015-07-18 02:20:25.244 -0700>,<Administrator>,<X>,<proc1d>,<TOPSPIN 2.1>,
      <abs ABSG = 2 
       data hash MD5: 32K
       D7 1A A9 C7 62 DD 08 20 68 9C 74 BA 39 E9 CA 32>)
(   6,<2015-07-18 02:20:25.307 -0700>,<Administrator>,<X>,<proc1d>,<TOPSPIN 2.1>,
      <abs ABSG = 3 
       data hash MD5: 32K
       D7 3F B8 E8 4D 4A 47 15 F9 3F 42 BD C7 F3 7A 8E>)
(   7,<2015-07-18 02:20:25.369 -0700>,<Administrator>,<X>,<proc1d>,<TOPSPIN 2.1>,
      <abs ABSG = 4 
       data hash MD5: 32K
       C1 06 8F D6 E8 84 D1 D6 77 92 B0 21 0E 2D 46 60>)
(   8,<2015-07-18 02:20:25.447 -0700>,<Administrator>,<X>,<proc1d>,<TOPSPIN 2.1>,
      <abs ABSG = 5 
       data hash MD5: 32K
       09 55 83 D3 C9 77 88 D8 A9 6C E9 5E 25 45 6C D3>)
$$ ##END=
$$ 
$$ $$ hash MD5
$$ $$ 27 C7 80 D8 36 F7 EA B1 B5 04 D3 17 27 DC 04 12
##$RELAX= 
##$RELAX= 
##$RELAX= 
##$RELAX= 
##$RELAX= 
##$RELAX= 
##$RELAX= 
$$ Bruker specific parameters
$$ --------------------------
##$DU= <E:\>
##$EXPNO= 20
##$NAME= <AC1740_SEN00013_9276343_qgJO3Bddgf>
$$ [...]
##$TP= (0..7)
150 150 150 150 150 150 150 150
##$TP07= 0
##$TPNAME0= <>
##$TPNAME1= <>
##$TPNAME2= <>
##$TPNAME3= <>
##$TPNAME4= <>
##$TPNAME5= <>
##$TPNAME6= <>
##$TPNAME7= <>
##$TPOAL= (0..7)
0.5 0.5 0.5 0.5 0.5 0.5 0.5 0.5
##$TPOFFS= (0..7)
0 0 0 0 0 0 0 0
##$TUNHIN= 0
##$TUNHOUT= 0
##$TUNXOUT= 0
##$USERA1= <user>
##$USERA2= <user>
##$USERA3= <user>
##$USERA4= <user>
##$USERA5= <user>
##$V9= 5
##$VALIST= <valist>
##$VCLIST= <CCCCCCCCCCCCCCC>
##$VD= 0
##$VDLIST= <DDDDDDDDDDDDDDD>
##$VPLIST= <PPPPPPPPPPPPPPP>
##$VTLIST= <TTTTTTTTTTTTTTT>
##$WBST= 2048
##$WBSW= 25
##$XGAIN= (0..3)
0 0 0 0
##$XL= 0
##$YL= 0
##$YMAX_a= 615785
##$YMIN_a= -521715
##$ZGOPTNS= <>
##$ZL1= 120
##$ZL2= 120
##$ZL3= 120
##$ZL4= 120
##$ABSF1= 14.98509
##$ABSF2= -5.573092
##$ABSG= 5
##$ABSL= 3
##$ALPHA= 0
##$AQORDER= 0
##$ASSFAC= 0
##$ASSFACI= 0
##$ASSFACX= 0
##$ASSWID= 0
##$AUNMP= <proc_prof1d_extract_pilot.lims>
##$AXLEFT= 0
##$AXNAME= <>
##$AXNUC= <1H>
##$AXRIGHT= 0
##$AXTYPE= 0
##$AXUNIT= <>
##$AZFE= 0.1
##$AZFW= 0.1
##$BCFW= 0
##$BC_mod= 0
##$BYTORDP= 0
##$COROFFS= 0
##$CY= 15
##$DATMOD= 1
##$DC= 0
##$DFILT= <>
##$DTYPP= 0
##$F1P= 0
##$F2P= 0
##$FCOR= 0.5
##$FTSIZE= 32768
##$FT_mod= 6
##$GAMMA= 0
##$GB= 0
##$INTBC= 1
##$INTSCL= 1
##$ISEN= 128
##$LB= 0
##$LEV0= 0
##$LPBIN= 0
##$MAXI= 10000
##$MC2= 0
##$MEAN= 0
##$ME_mod= 0
##$MI= 0
##$NCOEF= 0
##$NC_proc= -8
##$NLEV= 6
##$NOISF1= 0
##$NOISF2= 0
##$NSP= 0
##$NTH_PI= 0
##$NZP= 0
##$OFFSET= 14.98509
##$PC= 1
##$PHC0= 93.73535
##$PHC1= 0
##$PH_mod= 1
##$PKNL= yes
##$PPARMOD= 0
##$PPDIAG= 0
##$PPIPTYP= 0
##$PPMPNUM= 2147483647
##$PPRESOL= 1
##$PSCAL= 4
##$PSIGN= 0
##$PYNMP= <proc.py>
##$REVERSE= no
##$SF= 400.02
##$SI= 32768
##$SIGF1= 0
##$SIGF2= 0
##$SINO= 400
##$SIOLD= 32768
##$SPECTYP= <>
##$SREGLST= <1H.CDCl3>
##$SSB= 0
##$STSI= 32768
##$STSR= 0
##$SW_p= 8223.68421052631
##$SYMM= 0
##$S_DEV= 0
##$TDeff= 65536
##$TDoff= 0
##$TI= <>
##$TILT= no
##$TM1= 0
##$TM2= 0
##$TOPLEV= 0
##$USERP1= <user>
##$USERP2= <user>
##$USERP3= <user>
##$USERP4= <user>
##$USERP5= <user>
##$WDW= 1
##$XDIM= 32768
##$YMAX_p= 442541470
##$YMIN_p= -670217
##$CURPLOT= <Network HP LaserJet P1505>
##$CURPRIN= <$Network HP LaserJet P1505>
##$DFORMAT= <normdp>
##$LAYOUT= <+/1D_H.xwp>
##$LFORMAT= <normlp>
##$PFORMAT= <normpl>
##$SURQMSG= 1
$$ End of Bruker specific parameters
$$ ---------------------------------
##NTUPLES= NMR SPECTRUM
##VAR_NAME=  FREQUENCY,     SPECTRUM/REAL,   SPECTRUM/IMAG
##SYMBOL=    X,             R,               I
##VAR_TYPE=  INDEPENDENT,   DEPENDENT,       DEPENDENT
##VAR_FORM=  AFFN,          ASDF,            ASDF
##VAR_DIM=   32768,         32768,           32768
##UNITS=     HZ,            ARBITRARY UNITS, ARBITRARY UNITS
##FACTOR=    0.250966925370066, 1,           1
##FIRST=     8223.43324360094, -87751,       596
##LAST=      0,             137693,          -31552
##MIN=       0,             -670217,         0
##MAX=       8223.43324360094, 442541470,    0
$$ Real data points
##PAGE= N=1
##DATA TABLE= (X++(R..R)), XYDATA
$$ [...]
23858 -164883 -3984 220436 -14721 -79094 214179 -140825 -164674 117326 8197 95452 173843
23847 173843 71249 258781 152490 -30496 -93907 -93132 -286026 -68878 -332505 -230414 -237237
23836 -237237 -52763 -133923 -89453 -366830 -215204 -144941 382953 -104262 161311 -313572
23825 -19542 89504 -381167 305030 -52843 -98795 -11577 42532 -94952 226585 88107 -72228
23813 -172584 48744 -13177 -51455 -226943 354993 123417 155852 220943 -13082 -108692 90496
23801 221431 -63052 168692 97003 104817 -335102 134694 -193859 -58767 56586 -31920 -273975
23790 -273975 -27822 -195585 8166 58020 -451324 -203610 226290 191866 -147130 262477
23779 -260084 -109917 -34872 -73663 -138344 129679 27396 104993 17820 43007 109017 -129129
23767 121363 156127 -135284 172787 69557 20727 68850 -21236 -89473 53779 -218965 146892
23755 -176328 -33912 -16331 235860 -39208 -108646 146810 -283508 -120842 133501 34172
23744 -8500 72397 -126742 72274 257238 55828 -71553 181238 -132478 -139866 245305 94347
23732 317336 -103902 140270 -95097 -87237 44849 24745 -161316 -53054 -181955 129799 -209317
23720 59102 75315 5680 -14194 -214006 -149946 -226405 -137881 116076 338510 -155604 -17589
23708 -193044 217242 -186981 -12798 143645 -320942 -236758 -36519 22165 102216 11501 117813
23697 117813 106276 -76901 -211717 -198721 52540 -90860 109462 -45922 156193 -182205 -28705
23685 -121937 -221698 -340025 117769 76513 99891 43457 -225561 -25745 -212331 55468 254184
23674 254184 -201843 179106 -119961 74249 -141177 103145 -178481 41222 -171843 -104031
23664 -104031 -112025 129987 -244403 -182555 -117916 38819 -138339 16725 29248 287476 -23549
23652 201709 -7854 10547 -103140 -25829 -220943 -193454 190752 11519 82755 -126158 186083
23640 154060 211821 -108490 55940 -196196 183995 205325 -9405 27092 -87911 -72048 -26878
23628 -150576 -82747 155022 -80896 -151052 -511827 37403 71451 -78985 -67401 89876 -4137
23616 -206345 20088 -225520 34729 -228388 247185 -199076 25570 -12582 67510 172342
23606 172342 -60467 -96416 328736 -180105 247460 245256 30348 20986 131220 -230030 4861
23594 283804 157035 14100 -179360 -59903 -119338 202290 152204 128114 36880 165096 137570
23583 137570 195803 48141 -141846 21252 165836 156287 -566682 -49302 -45046 279194 225551
23572 225551 -87624 2708 -72266 231360 -72105 -102277 -171107 152890 123303 38537 85619
23561 85619 -302961 43968 -145371 60114 -164411 59385 220840 740 226820 -470449 -204837
23549 -222342 -404565 70625 -97141 -302539 169121 151154 27320 -782 -40208 -59846 48387
23537 -394214 28400 -82438 -372504 -128672 165860 54254 155054 265177 52896 132219
23527 132219 91295 -34144 4043 44619 -10172 113539 -183831 -80343 112479 65498 -211366
23515 36512 -138829 39831 129869 270394 -136685 -168699 175793 -89255 37470 24586 192599
23504 192599 -41992 -228420 -121292 -202589 -120117 66196 -317609 209664 -247578 -61913
23493 -25917 -35186 -94177 -264302 -71187 -359757 132064 116834 35829 -434152 -439846 208251
23481 202429 79519 -207092 -171779 -200712 157233 -102738 193401 84263 -315385 -139587
23470 -77030 248180 -80468 81697 206859 160262 -184130 5981 245328 99285 121188 -103373
23458 484 231026 -96053 -161354 93208 -147928 -50278 -8640 110505 -31081 -5534 -72295 -3828
23445 -13332 -205596 300998 51604 12560 -143915 -160261 47529 -78097 -146160 85085 62313
23434 62313 -420046 100007 16886 348131 -59458 189782 108545 -114977 -105199 -120382 -99063
23423 -99063 -54574 332280 -68026 -236943 -206421 -433658 170823 -351118 -125835 -226952
23413 -226952 -62948 275845 -219742 -156529 -135270 -100764 292453 -153664 -264249 88999
23402 131795 -267385 -193189 350463 -26957 114977 -18238 171966 123886 84525 127569 -185423
23390 -321376 -319444 225474 -60002 164515 -17748 -118099 -50859 283901 91392 37792 152987
23379 152987 -101796 -251578 91130 -62223 -460711 166052 48505 -236333 -232964 -12451 -138288
23368 -138288 217925 -129097 41586 38930 -205678 100008 141815 129328 -221522 -93754 -188964
23357 -188964 50905 -340866 -142105 83905 137836 49855 -122053 130008 -136758 -227786
23347 -227786 -185517 -45469 -28306 -185188 -84202 -60841 16988 302547 -180593 295853 -58843
23335 19125 -94517 -246349 -472 230640 108175 -191598 -83038 -292797 -67397 16225 98975
23324 98975 -220747 -15281 227023 -16807 -25705 -21225 210401 -202291 172910 -164863 59618
23312 -77811 213308 184435 -86791 261953 -133409 -152857 138773 -61758 291141 105970
23301 11998 -5760 269604 -200592 -52566 138899 299047 104352 -174189 -41316 102570
23290 31308 17759 214172 292655 -116326 77397 35577 21098 19799 163337 58756 -6290
23278 39645 140412 228732 152122 373128 8624 -47518 -29504 224782 280178 -340266 47222
23266 -479827 -200351 66424 -144536 37 130849 -132688 -278958 -45890 -116213 -95133 -136628
23255 -136628 -102267 -92660 265229 498399 -787 -235528 -71418 -231189 -84059 36197 295605
23244 295605 -239190 -360787 6304 28099 187322 -151169 -213378 -77452 -147410 -43209 -272869
23233 -272869 -201168 99814 -220398 -5660 -219765 202951 -143605 46685 61934 -249782 355403
23221 -78788 -136968 -119777 21409 182441 150686 -133175 -195697 -118360 117112 264814 301381
23210 301381 17400 -59498 -214134 -325707 -111088 -104874 78767 7218 -87672 -213182 302341
23198 -47479 -166891 -197921 -170771 -252104 294503 -183310 -268188 -70883 222776 -104091 86428
23186 211379 -19393 -61797 -153570 -183449 -176994 213974 -170265 -45712 -284125 -50486 -158104
23175 -158104 -193161 24933 -495593 -90903 -43620 13635 38705 -170387 -332045 77764 228082
23164 228082 -25377 219983 83154 -314890 -96148 -69040 208696 -218737 133360 163275
23154 163275 35429 -25496 246551 -108367 59594 -133386 97876 -330122 154518 -59187
23143 4851 180964 -62688 2062 117606 55514 -36984 -88029 -171778 51510 174893 185704
23132 185704 54558 -85706 101852 314018 -389336 170679 -81342 146305 -298101 -160962
23122 -160962 132260 35348 -187953 280710 -297742 -3156 -94614 -182831 245879 -4965 -119022
23111 -119022 -18273 458769 -327111 288116 -342402 -90453 -133888 -53817 -94599 14552 -107196
23099 -71618 117662 -9783 494561 -45332 -279282 214464 77901 -121723 102170 -295045
23088 15811 244508 136994 -79646 -25559 22915 16038 -52661 -437097 180043 29060 -242981
23076 54243 -108265 -88296 -39732 22251 -35416 90603 -25480 73821 73959 95077 -114620 -27952
23063 140351 -135351 89880 -23727 653 229956 -165697 263075 -136974 -170709 43810 223170
23052 223170 -165982 57673 106216 -94737 371788 -53786 -11110 -25437 -90670 -262992 229881
23040 -126744 154334 -123532 -84354 130152 341294 61598 -122801 -244799 31728 100873
23030 100873 -134191 -40142 146931 -146949 -542335 -76096 63077 325418 346975 167199
23019 38219 -58736 -70929 4049 -27769 232121 -152408 -30250 -17581 -57580 -200120 211101
23007 -102019 21907 36623 -321501 82160 128864 190435 18591 177275 -130467 -87761 156124
22995 186894 -403637 24158 -110342 -176365 -325859 -61167 -70961 118244 118963 -206208 -12441
22983 53824 -166483 -61629 -130047 -58059 38065 -2021 187321 -310404 -237475 -43015 110611
22971 6377 144165 -248205 -301868 -130057 -155182 115917 65315 -211724 -135186 -50685 163072
22959 -417936 141403 -66470 -35558 86879 -179283 -279959 -139869 172724 134584 -102481
22948 63992 -191485 -120674 18512 -113906 262822 -215891 54469 -137200 -63056 2777 -66145
22936 -136179 -232708 -42681 209963 156075 36946 209366 63190 -132390 107813 -60539 -168532
22925 -168532 152862 -31353 -153809 217853 -164253 -63385 248108 48635 -67507 105754
22914 263729 -106689 317167 -316146 -392169 -68235 -263395 73012 82771 -282875 -207537 -15236
22902 -95053 -217510 19549 -146572 -210998 -29411 -25698 -8251 46284 134649 -150852 -207642
22891 -207642 55263 115792 89125 -141446 -113830 -165962 49975 -399960 -11719 -51801 146908
22879 -21379 30029 -49820 -161359 31675 300208 -151 355643 233072 -5838 -268324 -138762
22868 -138762 5794 68384 -172709 255175 -110866 -51886 -271057 351903 -191951 96961
22857 92560 -98303 61157 150215 -24466 -54692 11687 -64999 -1642 -70714 40420 -41555 109700
22844 138935 -272653 82945 142330 -147232 -139129 -96407 299378 -636 -236494 44012 262173
22833 262173 -83515 -89275 -276587 -364278 92247 8452 -115104 -14921 39848 -161354 153176
22821 -91283 -62627 -95877 -87801 -145807 -77309 -23407 -109356 -7451 -7327 103438 -176984 121144
22808 14123 -61357 -278097 4696 -26938 98626 -30098 7351 22267 -34665 235422 -181472
22796 -22591 -349657 4450 195360 160070 -32479 -59193 -234918 -140525 -158496 -89121 109818
22784 -222413 -87209 -45556 -110338 -106870 -119770 -290768 -79155 -38624 -275369 138703 -288770
22772 225616 -272720 118562 -94744 -138025 386000 91960 -6930 234364 -155535 -75778 204065
22760 94816 67392 236672 216219 -211702 -210534 50491 329388 -16834 17863 43934 39745
22749 39745 143490 136184 -21023 1378 -55627 12234 -192314 121984 35371 -239920 -116979
22737 -294456 50890 -132203 -35641 43142 -73656 13957 -14220 80379 -49228 21040 -16754
22725 -22243 -49446 -213658 -196180 25745 -174816 -99853 256888 -17518 459204 159386 -124558
22713 -599 166807 -62960 -102286 56735 258741 161959 -139948 147971 2073 168562 -63255
22701 -83056 -305904 -81153 -92950 -306272 -230710 -65239 -314348 -103440 18866 14774 180648
22690 180648 -9952 -180629 -14665 2944 29438 95873 -50969 116609 293041 183904 72555
22678 -245442 -119121 -307044 -2886 -21941 -42279 292070 266364 -202954 127903 -21311 -406072
22667 -406072 133734 163476 -16882 171445 -254066 -141876 30254 114466 -2746 -22315 74303
22655 267131 201641 -136854 -102304 253927 -59966 -155633 56369 118273 82538 -54845 163221
22643 -227829 -190324 57076 -234385 -2710 44823 -310669 -492206 -10366 -217463 190740 100410
22632 100410 164017 137053 37800 83286 201179 -109020 11864 81129 155940 -107821 -87742
22621 -87742 47048 97568 -199879 17446 -111128 105607 24124 -166581 -214308 290730 29950
22609 -193317 27287 -200474 60332 -32464 -56527 28124 -97316 -99727 -194931 -112287 17918
22597 -68066 -45378 202716 -287025 -100164 -262132 -253164 -192766 -71023 -433070 -71970 -77985
22586 -77985 7294 -79851 351495 130887 225110 -9529 333508 -62090 -102432 188528 -263955
22574 -180602 -33195 -19671 -113402 -240469 -231565 163729 -95539 217387 -51258 -72527 -117574
22563 -117574 206930 -46603 254975 -61107 220212 -24596 115982 -185372 -196070 -163579
22553 -163579 117989 -82687 65919 -135196 -53248 99883 32747 -118090 -253629 -95815 5207
22541 10484 -149371 -299666 -114132 -140086 -88791 -340383 129365 -29508 -111890 -246180
22531 -246180 204872 59619 52097 -80335 244467 -17019 -55361 19958 145780 52180 54351
22520 54351 -344454 119582 20039 -12606 -5214 -165264 232382 -87785 -120634 60991 -344135
22508 -209898 64584 -71958 57478 51200 -97258 144321 -362305 71114 163286 -176011 33750
22496 95678 127425 231794 -315115 -107042 -102202 77372 164268 18894 -278897 -72424 203115
22484 -152004 277813 -130936 -201350 132441 117822 193759 -384864 150782 91342 73164
22474 73164 -188424 -71233 -87661 118275 -25029 207827 -104449 170150 -54341 -58260 190640
22462 -122553 -411112 -106254 103374 167720 -52404 105588 -12323 145118 -105064 -370807
22452 -370807 145145 243002 -183199 -34548 -328136 -8996 -143226 -144961 -314550 -291285 104926
22440 11214 434505 179447 51430 -9665 -186058 -114324 -10388 158091 7684 -108797 -9197
22428 141430 -126161 204987 74903 -86003 -119786 -11467 22129 -80194 -15107 89993 12684
22416 -238255 178857 -55521 153549 -140292 -106126 286507 222856 5061 -13669 197441 -198875
22404 89095 -159167 101570 147162 202651 340253 17731 -79163 -423418 -171626 -266738 231980
22392 -144031 -34189 253405 -42302 84052 15903 -31171 -162756 -178393 115385 -23762 -191075
22381 -191075 -56929 167549 -112187 24480 -135306 -178939 -63207 -332685 -80713 -214923
22371 -214923 146013 -171280 -114269 -228642 469152 -20924 -104797 96292 -52977 92077 -89973
22359 -39771 -150786 56143 61695 -111901 53493 -217261 -70371 -73305 420462 36385 -226296
22347 -39209 -344464 -142492 -434420 -112965 -118277 -45232 -126514 45612 28460 73902 124114
22336 124114 -288943 -2478 -136372 -38347 25750 -291060 -181508 31842 -147665 -289194
22326 -289194 -84894 2333 128282 -64023 -153499 -207318 72855 23349 -126110 -70382 82359
22314 211091 -128275 -4222 -121446 25171 -262101 -124965 -43539 -509536 -315139 41676
22303 -81588 165383 -41924 -120260 -19401 119396 -181494 -45493 -66532 261056 197267 -134198
22291 -90622 -149737 146154 -156808 -43655 255653 15123 -50093 174711 -206859 97016 -327224
22279 10680 168461 -95023 -205151 -124908 99750 81023 238533 -143098 -93279 17303 246795
22268 246795 34810 -167862 -11179 157781 120635 -180527 -258622 281293 -85682 207164
22257 122913 24933 365224 -315274 -147211 -302268 -67213 -263004 104897 -25360 277853
22246 -227558 377907 177026 -401149 265247 -38924 -220400 117989 -9965 206286 -166009
22235 -142952 -130893 -162981 -30558 182851 -56779 -49886 -13377 121182 -328860 66510 57745
22224 57745 16462 -69898 65288 100090 30299 130899 26600 -85569 -314647 120436 109663
22213 109663 93457 -49305 -191244 -249756 -85715 260244 -121088 -95588 132669 29725 227953
22202 227953 7943 -251984 -259151 193772 188996 21792 -106156 16374 -337952 -134667 -146395
22191 -146395 -286059 -92212 278228 -98924 -55872 -3687 36034 -26960 -137671 77738 138919
22180 138919 -116359 121002 265083 -331945 -69503 -173536 -110096 -240625 -41548 -37193
22170 -37193 -81571 7447 85498 241754 -439094 76134 163187 86385 -152873 110494 -159416
22158 176446 -7967 14522 404943 408676 -160259 189456 148797 -240156 -27841 26575 8198
22146 20958 155515 -288856 34385 75672 122923 55341 -12245 95413 -298635 150587 -174727
22134 -200678 -24464 -290147 -156975 226695 39181 -175078 -96047 23187 -288145 43912
22123 269144 -58996 -199508 -31200 74609 146251 4622 -193450 -32080 112341 -23529 49015
22111 239375 140708 246455 125418 -80122 -137283 -71732 407244 -251312 -106916 24020
22100 286542 324236 19097 -265281 -24459 -170133 -112147 236042 -1435 6446 -96202 128121
22088 -83891 75021 193485 340 -18148 143334 -183250 -308099 -83432 -17037 -253631 -97871
22076 39422 -259126 -173315 6393 -238842 54580 -215006 -412509 -67519 -263443 -227342 153928
22064 -65580 -28956 -257152 -41214 29014 94032 190494 52955 -114209 -133063 -33999 -188735
22053 -188735 233848 -123932 -90714 -183625 42090 -244785 -23047 -393941 128503 91862
22043 91862 -321899 -166045 -32938 79483 -421554 203541 -191842 -110719 108025 -91170
22032 -55929 -324375 -67825 -280188 -124215 202770 48233 -249722 -74248 35943 -285400
22021 371625 -19379 -82238 -299571 -316398 76599 166291 200926 324145 234458 101764 14096
22009 -290916 11788 -203438 -327977 -37060 -97491 82200 45993 -184767 -153188 119299 -148273
21997 -254245 -117807 24632 -141544 -265086 -261286 -67120 -126751 -103600 23215 -6071 -260422
21986 -260422 -70211 -49965 -310304 244861 93788 66840 83060 89799 -78315 -16398 153515
21974 -69583 -5077 -171283 304117 -14309 122565 -50119 154692 76553 121657 126597 32005
21962 53281 123610 17847 -104288 -64105 -44746 -18101 258986 86416 -242013 8529 378793
21951 378793 -131301 19845 -34130 25773 132514 -200146 -287592 69101 -126177 -13314 50744
21939 -191163 -13535 -243913 253762 118914 -7569 37918 184355 195511 -3531 -15632 58290
21927 101198 -281225 -29892 -54165 -97725 39399 -206383 -57269 -116290 236352 -137434 -207933
21916 -207933 70562 251980 -30229 -190457 -125087 60882 -19932 -46838 -10694 -55727 -18538
21904 143952 122170 -101173 8461 -148839 221735 158327 87804 -194668 -217729 -87314 -93101
21893 -93101 -423720 -105477 223198 46659 -318672 -41013 -183922 27284 -89691 149492
21882 284766 -262101 5816 54858 8494 80050 -99111 -132083 -272019 -242706 68649 -176632
21870 6445 -510629 18763 12441 104455 55888 236581 -36940 -81412 -221834 138200 -94365
21858 -324595 -310395 -139433 88179 -40153 55207 -60046 13950 -27430 187086 73252 107466
21847 107466 -97886 -99222 -50669 -154320 -274660 -162090 -112610 -191823 472975 131757 -267067
21835 22636 158464 -313955 -164578 -272749 -217684 412336 34544 21201 -52860 7134 224169
21824 224169 -316709 -396049 64626 42194 -251552 104268 -3679 62305 -32937 -92611 -367478
21813 -367478 -165563 -213677 37879 145689 130426 -137067 -109715 -65949 48384 -7067 -285977
21802 -285977 404023 -395260 -260578 -99383 -11804 -427180 52118 -159953 125165 4114
21791 -188744 74511 -100114 -123983 78323 211750 -67070 -116824 -288279 140315 -53088 -105324
21780 -105324 -187506 -103423 194844 -164570 -163032 -149125 120571 -87978 -260020 35740 65755
21769 65755 -145017 -3239 24362 -314770 -132760 12730 57897 -244550 -276777 103159 -290581
21757 201498 160475 -418253 47446 183258 -22936 -143583 160378 163206 25607 -241278 160610
21745 -155727 1222 -97025 -156338 52124 32386 5475 -110458 -64472 -117190 -39607 -162281
21734 -162281 118705 -406466 56987 -81660 -234123 -155681 -12626 -301107 -87397 -26647 -386466
21723 -386466 -300968 1930 96315 181908 214800 -12144 -190585 -150032 -101846 36130 -292179
21711 -53453 -137429 -79807 -143602 42539 -139585 -221948 -5899 15035 -507305 -83574 164242
21699 179663 -103105 109804 -148923 -150632 27188 110157 -46122 -43538 -192397 -177053 18518
21687 265303 18598 242204 98304 -12231 -30828 48845 -23204 282123 33442 68211 317559
21676 317559 -273489 -173028 335043 229679 171710 -10288 11787 -276924 -23613 -539610
21666 -539610 -349742 91507 17737 -184106 -29180 172141 20489 -23886 -209106 -38922 45538
21654 -5498 -132657 -196466 -250138 -15253 -111108 -185288 135408 -37538 151294 -100564 229003
21642 360799 -109783 -65416 -219920 -221742 -178575 100638 55538 28667 128799 -62143 -95824
21631 -95824 118328 -185020 -217572 -161037 -187173 -267590 23262 -157307 49287 -366334 -583555
21620 -583555 28695 101012 153657 -377443 111723 -226364 -179816 154941 -165525 -244158
21610 -244158 92811 123556 157180 4826 -112508 -257682 -13156 56419 -68380 100008 -132688
21598 33724 -59327 250494 440583 -201695 9076 -428763 -202770 101650 -176760 89415
21587 275849 227291 92487 75574 54870 275451 83339 -159623 55457 -132625 -27064 -58128
21576 -58128 -85272 -117588 37551 -370172 28003 -75154 -130920 18869 -87379 -163498 -199041
21565 -199041 100456 -26314 -111446 -330795 -278808 94415 188392 -134386 -365795 121395
21554 -51781 -254468 87580 -189448 106721 -113614 -280645 27915 -317913 -138236 -50984
21543 -98835 -102707 146838 -86247 -24685 -208024 28861 -312463 -129609 -287879 -379635 -219641
21532 -219641 133221 -160363 156554 -134715 -21125 191065 294410 -138478 150218 -7620
21521 46350 2060 107406 94050 -25816 -172059 -152997 -51814 603 -144467 -257 -213929 -164936
21509 -164936 38075 27991 -18407 218015 80081 -150967 36570 369716 152333 -132301
21498 52848 -197858 -225347 16487 154632 -163149 -464579 86267 -314741 -405287 140067
21487 28590 -169834 -157520 -109432 -191802 -227907 -118239 -66562 141656 -88297 -217086 111577
21475 78087 -155874 -266134 250862 -2361 -33260 -21502 -467658 -74116 108422 192681 -177212
21463 -383811 67009 -95750 -276770 -145004 60725 253982 -286461 219937 -500577 30361
21452 92181 297578 -401321 14530 149265 146572 -63556 47324 17159 144416 318539 82158
21440 102020 49087 76286 183670 -34706 305409 428225 -66481 -242278 98853 387255
21430 387255 34281 -215431 -196862 62647 -214073 -171394 -207010 -191399 -29906 -310561 67990
21418 -28581 -4327 343511 69586 -165871 57779 -138917 6928 -124205 -214980 -40595 -29552
21407 -29552 -156628 -71683 -12169 -108026 246360 -165752 -56540 -235935 118097 -116432
21396 17533 -26088 -159290 66722 -347873 -115873 64306 -316129 -135545 -75724 -58577 45791
21384 -62464 -146872 -118711 -96532 9200 197447 213561 80340 71416 -162611 -168628 -271335 -221591
21372 -221591 200532 -187722 -294752 -24943 -86295 169411 189282 39854 -316959 22262
21361 -90034 12869 187258 -31152 -66124 -159122 -239950 -158752 -192169 -357053 -55383 -117748
21350 -117748 -165129 287094 106109 134771 86584 -319101 1590 -134226 -169637 -277008 -124930
21338 51328 -25006 56021 -36249 86561 -67664 -12947 9657 -346459 -287283 -362878 -183800
21327 -183800 108159 230000 32954 127437 -209382 126050 -85326 166079 -319788 37104
21316 159009 43811 -226534 55245 115746 56905 78254 59187 42447 -41778 -85025 11959
21304 -93215 -185295 -163418 -171940 -209829 -58813 95820 -106508 -225156 66694 17366 -34547
21292 290282 -157540 -141261 39232 314017 -59680 -389891 -282154 -141097 82957 200342
21282 200342 -216425 259005 -283546 -66918 -24223 -51786 -205056 -203394 167030 -142791
21271 123708 -131091 -210805 -164305 -515825 -10658 -384413 -105337 -28677 -94871 -51691 -75829
21260 -75829 88675 336038 190291 6937 -68925 -64000 -261499 -175412 68903 201994 -39598
21248 56183 -44669 -197248 -118449 -153965 -258048 328505 -84669 11588 59455 -380312 58774
21236 -145785 -35044 -117632 17920 17646 59195 -238048 -161979 -161677 -385316 14633 -351853 -144754
21223 -140201 -158829 300249 97657 -59806 -14486 81189 -45287 -104857 -24306 -228966 -146975
21212 -146975 6032 -18101 -52993 -206520 75342 24934 32359 -56532 219731 178003 -94923
21200 -490867 222594 -131884 142362 -100636 -26369 -91940 -279087 -176594 -50361 -260561
21190 -260561 -320746 222586 -17534 69727 8641 42044 186876 -191236 -160521 63944 192706
21179 192706 -118535 -21566 -225800 -77336 -373363 171692 36931 253169 -163600 -31298
21168 246447 -84837 230014 -166490 -291421 -119978 9877 -146005 104900 -171335 -70439
21157 36744 -261988 -16600 -76182 -172623 -108649 245921 -149001 205216 69269 115289 -242895
21145 7502 279140 -24855 164517 204726 -240037 -65402 -14949 -205043 -74926 28158 -54243
21133 -59637 20583 49328 147046 -133387 -272903 71294 175109 150413 100210 -150211 5666
21121 -268106 397272 -65296 -12568 -91532 115595 1234 -129771 -98231 -446558 -203292 32351
21109 -73548 39963 -70864 231925 -264271 261133 -58572 -2300 -379344 -163946 219166 130461
21098 130461 -44253 -94290 107468 -101708 -73814 100380 25771 -362972 -130476 44228
21087 -187733 -427240 -149081 -397353 -135471 212784 78408 -145144 52650 -418221 -325589
21077 -325589 73608 129695 -260774 -34430 -136899 -57900 38398 -98549 -270889 200543 19958
21065 51483 -52019 -211640 -56201 -15978 103267 -86021 -6405 -67759 271573 9522 -109055
21053 -138924 -155205 28171 -211603 154332 134408 -15608 -224457 -214838 22229 -189914 26701
21041 31376 168584 144839 166278 64211 53902 67689 87010 -174159 354805 -132817 4298
21029 -196868 98449 9399 -53189 -31240 -30732 133091 -91823 66512 -42824 132736 101492 -126442
21016 17339 98237 174682 82250 31172 146185 54128 -43443 288972 217562 -94590 517 98653
21004 98653 -103681 91555 161003 -238877 -70716 24654 248608 -29430 -14790 -163545 -250258
20993 -250258 -431142 37759 -145189 -306634 -185416 -289459 208298 -144474 -161181 -116864
20983 -116864 -57060 -167249 -236051 83820 -622738 40378 -133967 113491 -117247 -216863
20973 -216863 328302 26080 -49570 17596 17147 72028 165437 51916 24855 -152427 306044
20961 133249 -434209 220804 -110193 -441589 -136485 -32069 -32167 -173287 -21306 -35294 83456
20949 -127471 -93353 -278301 -158326 -324837 -78144 -68101 107631 -118476 -269690 -56963
20938 740 -76015 -171848 -49794 68463 -179757 -279165 191029 -77734 -59978 -59163 -122291 31757
20925 -160766 -219589 -340664 -157981 47876 285162 -67112 -309311 13352 218726 -370864
20914 -257526 12325 58615 -82614 16933 -2335 -406670 -53466 -5533 -477557 -17547 -300143
20903 -300143 -331187 -159302 -76275 -132266 -364367 -373509 25772 -11977 30378 35837 -81840
20891 99134 -25242 -25942 123996 162930 10047 -62385 -126584 -192922 -181959 -214668 -192408 65047
20878 78003 -114441 -249245 4016 101625 -529005 -86306 -77355 -32435 -380530 -49350 -129261
20867 -129261 -287628 161831 -227011 -273089 -206439 183840 38654 -297612 57839 155372
20857 155372 -127964 343014 -391840 -116004 -485362 -158684 142868 -177131 -298005 -156279
20847 -156279 -120222 120748 -64110 -186085 16373 268537 -82662 95630 81513 -278046 197866
20835 -129372 -47294 25648 50998 43626 57114 -25242 169448 -76292 -475419 115685 -155715
20823 1397 89363 -62015 -205950 289495 45516 -1949 -198302 328117 -220625 -249853 -141463
20812 -141463 -223980 -40034 -218374 -211122 -65445 -271110 24095 -161789 -171783 -50170 79765
20800 62198 59366 -196483 49519 248465 -197428 38134 -241166 9228 62027 -186315 -160140
20789 -160140 -236647 97756 -98203 -161385 -277383 128327 -165350 -124901 -329600 -99377 48984
20777 -5018 9241 137038 -43091 73388 282794 32926 -105732 87482 51797 -498014 38603
20765 -329731 -249152 58328 -435176 116512 349227 94769 3175 128867 -200253 -86080 -70080
20754 -70080 159221 14595 261215 -118372 -34189 326553 1156 -17552 -136355 -104972 -187356
20743 -187356 -35619 -226646 -134988 -229687 -96921 -15939 -216622 219263 -152092 -137103 123770
20731 -370561 -158691 212379 -53602 4671 105892 -289122 100228 88143 -40464 -267155
20721 -267155 -177424 -21695 14769 -269420 86060 -111742 -149404 -155663 -161316 124006 132458
20710 132458 -37415 228860 -269869 12590 -360109 -20575 157631 116738 -213262 46842
20699 -78522 -286727 83413 130002 22379 157661 -310268 -67239 -247011 38205 -159140 -72235
20687 87641 -243563 -10786 231732 -356148 17586 -103946 -351 28893 -19852 -273351 249983
20675 -260189 198397 -82245 -126271 -259889 42710 17570 -19832 -226795 -80123 -69761 228873
20663 105558 -114232 -35442 74059 -71884 60134 -66159 -115549 -180839 63084 -79436 -253191
20652 -253191 111707 -141133 -58797 84908 10670 -128192 100816 -182124 20644 -138589
20641 167920 9538 -33531 -337916 173748 444176 -141874 72209 -92576 21188 -281105 -91646
20629 -329703 -219943 -75604 18453 -63766 -133565 -76689 -96925 -112092 -71536 124592 5479
20617 72704 -27326 -37494 227631 127711 26077 -139572 -314109 109748 181256 -32808 -109676
20606 -109676 226711 138304 -54987 37895 -54389 147702 15946 -183238 -87596 -285729 -388030
20595 -388030 59029 92279 -202926 2203 334956 92549 114028 242371 -14415 130304 92610
20584 92610 -48415 -123345 -221237 -106782 -268939 -226049 93432 113768 193957 65923 -350323
20572 262482 63147 -184867 132473 -123764 226158 -142875 -203518 219209 -75876 72670
20561 -25489 171351 -243485 -106959 -113384 112828 31047 -4828 -82236 6944 -90896 -46659
20550 -46659 207263 4269 -57224 -39699 -192625 -60417 57624 -83563 -989 345188 134820
20538 -33844 5039 -20713 -243488 -71561 83479 -280899 -14303 43804 -214897 261497 418968
20527 418968 -139423 -131267 -167262 169066 -231840 -186683 -110749 -175524 180473 -95965 271052
20515 -58937 -124689 -90574 197919 307085 123038 64681 -138299 -453021 -117162 -333824
20505 -333824 -331928 -170230 37962 -187994 -113453 -169435 1659 38080 -203238 -244559 12043
20493 -325709 174166 179669 -93136 45682 129536 4483 -188542 -277110 157161 -132902 7654
20481 4139 -187119 -48949 -111654 -347399 79771 183623 -249612 78722 -183347 -363247 -120065
20469 52326 -177685 -253611 -202544 86389 -105941 65175 -69886 -101749 299906 69657 77677
20458 77677 -100169 144942 -50528 -16827 168115 -175492 117817 332190 87546 78462 -272487
20446 113226 17640 -184542 169275 -80916 -330971 110510 162158 32784 109215 -43830 -167633
20435 -167633 26865 53932 -35493 -15522 -23177 18432 188115 -460283 -249860 196073 127043
20424 127043 -205901 -250885 93146 -44536 82553 -116650 -61868 -30176 -212634 -93954 916
20412 -337959 -226060 -123132 -179958 118375 173368 -106318 -31308 14559 -196377 -295780
20402 -295780 -12615 250524 30883 225289 -198952 -207046 61806 -7001 -17006 -91342 -124845
20391 -124845 -108224 -99998 -343018 -6582 -83298 -10999 -171868 -44230 -197750 -228695 -289320
20380 -289320 -174366 -142855 -227541 -135223 213213 -161012 -78274 190755 15056 -271880
20369 194071 -43322 -33184 -222579 5756 37878 -119337 111732 -119542 793 -76572 215612
20357 118889 -17795 25208 -155883 293674 -393691 -183183 88492 -113415 -24836 -473613
20347 -473613 -53641 -161120 -280658 343073 -176287 -279438 -119236 -36144 -17002 -6944
20336 31746 -337426 37154 -293549 -153538 -165457 -15125 -352192 5769 -6709 264106 -389412
20324 -99937 -38610 34797 19565 -129696 -26850 -321476 211403 239051 -26608 -147975 -166214
20313 -166214 -132982 -67865 -218277 -166818 62460 -55922 111563 -52148 -134235 17899 63795
20302 63795 100585 -168272 -113799 25669 -163787 -330629 -277568 -144074 -327278 -133039
20291 -149334 -225072 -136536 -120363 -335755 55236 -53227 -139175 65467 284138 70075 -292159
20279 -102770 38716 30439 160489 119921 180583 55188 72338 -96429 -126539 37402 109341
20268 109341 62680 -109351 -231153 158657 -140170 -106970 -18452 -268427 -229147 93485
20257 -206582 -368389 -111408 -328586 8937 -97619 6726 -49767 240346 -32286 -125957 -127893
20246 -127893 -351316 67992 -247080 -102038 -210965 13401 -155135 -385369 116679 -216952
20235 53619 325616 -98630 49725 104354 -351279 -127171 -5289 264103 39714 148336 -80299
20223 -194846 -202479 -109410 110743 412625 -66055 -343067 136514 -69718 -63264 20488 -178128
20211 -164108 -40309 -239074 -87412 -113740 -97981 -356817 -182188 114093 -245480 -91270
20200 -15032 -164254 -82226 -70480 48150 -341320 -26631 195553 230019 16346 23215 52395
20189 52395 12762 -195950 -117650 -200881 26126 112573 58015 -58587 10822 -409130 134854
20177 -64964 -162573 -333038 118007 -172268 28690 135688 -79075 128740 359518 -132808
20166 13687 -342573 -66704 95288 -56607 -158044 -92612 353975 -207625 -293342 146216 -52264
20154 -205269 -192679 -63590 -85146 -42460 218779 -261833 -149000 28140 -137617 -76053 -174286
20143 -174286 79567 101683 148217 -29493 -71845 -140618 139666 -48261 220324 -260485 -296714
20132 -296714 116528 -82861 -211804 16077 114585 -77604 10814 -124736 -35650 -169519 120483
20120 23677 -352232 174662 -98549 -55736 29360 29620 -401395 -407189 221498 -4406 -109796
20109 -109796 -80957 47980 -204219 -267014 -6626 -301726 -10327 -40080 131452 -303319 98138
20097 -4061 -264617 -41646 111488 188860 -216991 -128687 101876 -194112 -37590 -126652 50969
20085 135501 39146 -104610 -139894 148466 -257319 17851 -64784 -422 -417334 -72212 62651
20073 -34445 211181 -5870 -322283 299546 -113158 192086 185904 -36855 -54385 299183 -117768
20061 -28114 -82242 -46298 -80579 -98644 154058 167571 -169899 -106511 -6708 -220036 156675
20049 -148950 35082 36405 62749 360366 -37188 -492761 -44483 -71469 -575319 -351413 -62240
20037 2546 -107692 79254 -54437 -351247 -145732 -276430 659324 6561 107925 -159924 54533
20025 -76848 -169001 -372182 -52318 167775 -1447 -290219 -129996 -103181 -21385 89802 46667
20014 46667 181834 -125878 -373920 -187849 1872 -323462 -117483 -265633 -200449 99963
20003 -34711 198185 -258857 -231956 -267962 -131041 -171587 129803 133285 62331 -105075 -26894
19991 107743 -157292 -183494 -136100 150661 176282 279 -120070 64675 -62493 61693 84709
19980 84709 -166260 -214133 127092 -168021 223620 81079 -207856 -92357 133402 117709
19970 117709 165023 79462 -75890 90226 -95067 4687 8837 161667 130539 -14578 -145750
19959 -145750 137436 230391 -44481 -420172 75784 241280 -265110 -97345 -57044 -81761 -102338
19948 -102338 -51132 48908 -25113 -11046 -210861 71831 -186527 -60996 -40431 -172572 242356
19936 -110297 -336305 -118762 -213568 -37371 309677 55423 -42185 -78226 -112669 63463 -283390
19924 -2563 -128420 58832 -157289 233368 7293 86901 -116889 162627 -145671 84280 33385
19912 -104287 77695 -52565 248303 -118021 285687 -348646 18265 -60333 194640 230447
19902 230447 -128719 -158764 -229122 -291635 -46112 -493449 148029 198848 -15699 8939 -260669
19890 104243 88643 4845 -143503 -237890 72129 -45683 -85595 -24575 -125497 69171 -5534
19878 -144980 107093 -106366 177961 -203861 148127 60463 189570 -155640 -7453 10761
19867 51143 -204690 -54521 -194736 -94679 -303743 22620 -132251 168973 -20062 84459 -127281
19855 -133375 -222752 49591 -119402 89361 -307732 -250620 -75631 -175896 89743 140752 -98977
19843 -240819 41321 -13083 -220335 66126 -61774 160083 -230571 160538 -53762 -96897 162950
19831 193747 -419177 -281377 -164569 144711 200811 32085 111743 -113947 -58009 -31615
19821 -31615 15346 -272307 -318341 54104 86451 28946 70559 -15025 9992 108284 -14523 -75188
19809 -75188 139851 -300721 -201918 -405712 180455 176526 56068 -221851 9257 -167473 -85769
19798 -85769 144687 140854 58002 -53012 -128832 -544220 -188600 128622 -237184 -123326 -135041
19787 -135041 -386107 -3525 -167389 311284 -182926 -21669 -246917 -77479 -285180 200460
19776 -132879 61606 -248795 -27363 183043 238324 -352332 -98504 -33943 -60994 -161547 98862
19764 -11505 -48155 216324 -106631 11631 -71243 101675 -83161 146922 -53613 209496 -34201
19752 23661 -67885 -55031 98764 -55424 67940 -317088 -282821 22142 401234 418305 -145082
19740 192576 -170011 73819 2965 -104155 -129213 -99308 -219017 -7945 -384643 18708 -41286
19728 92908 -33750 -118651 75981 -378685 -125663 -229173 69950 250110 -151735 -285587
19718 -285587 -430888 -12384 315487 160233 -206878 -38592 -213892 -320424 -177808 -267134
19708 -267134 -178261 -23252 -189738 -24782 36535 -81394 -221252 -126624 -133671 -174001 -270129
19697 -270129 4415 2007 286403 20637 -100377 -210640 24700 -51229 396257 -235293 -140552
19686 -140552 -22146 -91432 -220467 -161822 -210241 182440 -44094 26345 -171828 202182 -25161
19674 165900 -21563 -112868 -217374 -177072 -168876 1520 -288178 -31131 31411 -55609 33852
19662 159967 13322 -117675 -115090 -13344 177862 -89171 -123338 29454 159703 100267 38130
19650 199850 -114959 154195 57164 55516 -171466 -179266 -349112 76346 58143 50771 153840
19639 153840 -164401 -278669 120280 -382675 50757 -102336 -258806 169214 -33008 -1452
19628 -66343 -55423 231724 32736 48829 -296848 18969 37150 118855 -143809 78020 66638
19617 66638 39947 -5526 229657 52496 14829 20842 -21300 -162060 -14320 -104615 249954
19605 -33108 8303 -72017 291142 -32825 164038 -171676 311434 -2359 75233 -2998 -200658
19594 -200658 -329684 -144897 -225357 -22019 861 -285454 12008 -284845 -105797 20933 -139563
19582 -150730 71028 -120440 -22114 -84147 120198 177504 -265436 21302 50375 122790 -230062
19570 -21501 -15912 54367 4666 -200105 84617 -266521 -140955 173752 345417 114529 -271674
19558 -130990 -349373 -90683 -134973 -269102 -152266 -229287 -259015 -253440 71582 -266342 31530
19546 63039 47226 160471 -39283 -118958 -229084 44199 19186 -241225 -574 123999 -140132
19534 -135346 -66531 320618 -158321 -94872 -81523 -104904 43272 115038 -145738 -257694 -109560
19522 -543144 -266226 -215098 -119583 -88272 -112564 -105394 87568 -32086 298186 159888 -164026
19510 -80361 -212691 -11326 36120 402675 -286751 69504 -295554 312540 -114525 8759 -16214
19498 138297 8597 -206212 -168021 -199147 81469 -344132 18921 -172753 148214 -58601 90624
19486 -85412 -239188 -136564 198729 116940 -237234 -27038 961 171034 -88754 -103551 26225
19474 132322 -340810 -92392 69784 343175 27863 -245332 49738 -268428 -9485 -443603 -282903
19463 -282903 -18775 -45645 34567 -409903 -22860 79389 2937 -68502 -36458 -105674 -140101
19452 -140101 -124707 -23427 228122 -76174 24794 -204880 69010 -160260 201167 -558754
19441 125578 27011 -331145 122660 -271943 -90736 15634 -98933 -234987 -234501 85234 53010
19430 53010 152725 -59971 -223300 -199302 -31090 -265363 -63341 -283345 -377831 -59309 50882
19418 157537 27549 -381472 182833 -52040 -16486 -265845 56459 -179372 -57225 255211
19407 -71873 60711 106672 -38266 2529 138951 -233114 -60298 -51043 -27437 254736 -41802
19395 263198 -40468 80222 263648 -79458 -95877 55920 54656 -123275 -79775 -337027 43581
19383 -31095 48180 55712 -252634 32926 -155275 -73095 115207 -45484 -124538 -24062 3611
19371 -122477 38067 102632 -333225 105784 108608 -148986 -50700 -61975 -122611 -393630 184737
19359 -137338 -6750 -30471 253290 -80414 83944 -146565 93814 5171 235305 -479516 82646
19347 76932 -153951 15879 -209444 149008 -43427 139356 -3240 -315349 -312777 -25233 -499044
19336 -499044 -228846 202011 -121734 -259172 -15616 305603 10044 12625 -119253 37889
19325 -5902 -208206 474396 195558 -10763 71534 52967 -120336 406212 -80920 -288199 -88025
19313 -548967 -223784 80745 -139953 -106968 7449 31239 75490 -92965 -256076 89901 -162899
19301 74101 -24568 -322883 12326 -184599 -87357 -278017 -93110 -176323 -60726 -72743 -267589
19290 -267589 -228136 172250 177563 85398 -300864 260418 -42631 -322172 44163 -285292 -8709
19278 -264849 -319610 115420 -34332 -110461 -110783 225908 87938 -38467 -202618 112182 -103127
19266 -297398 -79060 -159907 -100343 -119317 233528 -313530 173987 50513 -139611 138719
19255 -14231 -102152 38289 -137638 267959 4817 248107 -110657 -227364 -49770 -39557 -257787
19244 -257787 -246787 303213 170891 -32936 -16178 2327 -107462 -70078 -318792 -4284 -242718
19233 -242718 -90452 -99181 49960 -14023 -70781 -27645 39169 -319525 -320052 376717 -14548 -270124
19221 -270124 -100164 15411 131056 -362280 -77859 -47930 130300 -53165 35794 15136 35291
19210 35291 -260690 -85181 -97629 -181811 -309522 -37039 50054 -90098 -115892 -183938 -45318
19198 108745 -185632 -8282 166046 -42566 -76874 -13982 10377 -204183 15020 -144156 -87792
19187 -87792 -8888 -69207 117252 214716 -98626 -20762 -348043 -123926 84345 -212408 -59103
19175 -24140 134286 45538 8912 -117996 -227134 269951 -293911 60566 192556 138534 18202
19163 51399 -191945 -196261 3104 -113391 -170178 -256825 -106120 43331 50898 -107262 14535
19151 -224807 198157 -378462 272796 58049 -213002 -35860 -203601 -210244 241405 -74381
19140 -203015 -117069 172857 -74858 117675 -343775 -27314 -331157 -328550 74249 -220213 -406204
19129 -406204 -19401 128489 54397 -110992 -100578 -174289 240292 -120374 -98425 158819
19118 -6350 -65626 14195 85208 24978 -120990 -318514 18539 104475 1762 107887 -154560
19106 -47729 18867 287127 124754 129656 -8559 19489 412229 -183190 17202 -179359 -226984
19095 -226984 -235990 103449 -25179 -70207 -369646 160441 363425 156612 -166734 125075
19084 99867 -251768 -239406 -242779 -32673 -82923 -79850 -170149 118037 5579 -302353 316187
19072 -106510 -352087 17116 45224 23372 -53091 -115968 110483 104513 -323486 18555 97337
19061 97337 -88207 -30581 -136160 -37405 111240 -248117 -76928 216286 -206095 82195 -286788
19049 -297523 126610 -156149 -65540 40804 -482604 -36513 -23420 37468 54983 -212644 -326339
19038 -326339 -149560 -23203 -66266 -22159 -259017 -171852 -84411 -29131 118324 89158 59024
19027 59024 117931 350474 -93382 280260 -30231 48814 -193592 192201 -63456 229283 -156342
19015 -197842 -165519 320368 155126 -285951 242250 -191503 48491 -136226 -203739 141736
19004 105038 225775 37144 -34778 -110846 -178027 80846 80062 -12093 -54259 -111801 64563 -356703
18991 8048 -151572 -30893 -99282 52588 -348568 -86969 88190 49650 -226636 -227976 -278426
18980 -278426 -362537 -262976 -141966 -172685 30237 96530 -214561 -208148 168954 -193204 -48720
18968 -83091 141138 -128827 61453 -474441 -415888 -94196 -140493 183601 -24914 115176 -17781
18956 256105 84556 -171960 108902 -102598 -81898 -22497 -35146 -6824 -8953 -128052 -393060
18945 -393060 -105572 68166 -437066 -245629 -146785 -52831 46904 -192788 72975 -55291 -387658
18934 -387658 -129620 125255 337447 139724 -197172 -112614 -77878 -30767 -203621 95163
18923 83109 306223 179670 -109599 227619 -39578 116130 84418 -30991 271278 -178641
18912 165672 88404 -124150 -92602 137918 141160 -15058 -1016 119208 -39019 -346417 -132639
18900 -7684 161741 -122225 -107973 -93652 4585 -1310 -290313 96741 301464 162209 -122344
18888 22183 -288569 -194261 -139661 45964 -95051 187297 -96790 9943 -205401 102909 -419843
18876 98203 -280920 -285028 -188337 -340895 -91522 105998 -376463 -145263 -293137 -178799
18866 -178799 33169 151914 -139329 189945 149995 137036 -55299 -137496 -292661 -42345 178972
18854 106098 31981 176974 45838 94453 172770 22883 -376726 341609 -39426 -109575 -172881
18843 -172881 -75517 -38206 -275805 -99921 -195940 193068 152337 147762 18289 63304 -42960
18831 -108551 -128048 -165680 -265699 -102506 -58333 58069 115270 -94021 -147499 237285 -260091
18819 -63137 179681 333639 18165 -195260 76004 135776 84502 176646 -247408 230699 -23839
18807 236287 -120595 162168 -173474 -111506 -426592 -100152 149222 219216 -134365 3887
18796 36249 -386845 -126081 -66406 -318701 9606 216407 -330483 -15525 10285 -110534 -52069
18784 -118586 232592 -126735 212750 -93679 141052 -284918 -195999 -121164 85526 -154196
18773 -190810 30131 -155203 -90772 -17169 -57265 -135792 -239817 286068 -251093 -281735 -143099
18762 -143099 -181824 9828 -171315 -104145 -95788 -304565 214601 -319294 -249037 -136232 -44024
18750 -45302 -24595 61796 -440865 -123923 -3483 -22928 -118931 -102618 419970 -341767 -372871
18739 -372871 -242152 -353840 -71399 -155769 -52899 -27055 -38868 91672 -997 -9376 -140842
18728 -140842 -79543 45516 -271469 -127426 -311309 307882 -35967 11017 -354495 169925
18717 -119255 23993 142823 14038 -201037 -300194 69037 -96672 149259 -4199 -136570 138329
18705 20818 -53030 29915 -258789 366847 -7414 -61289 90546 -42321 204851 -246809 271987
18693 -33242 -142512 -81845 81580 -261198 51893 23507 -2801 -137932 135678 19754 139699
18682 139699 -43979 -263885 -321944 424566 -246797 25730 -111903 45172 -132875 -270534
18672 -270534 108965 -55609 192910 -202644 234964 169823 -100985 83463 -73441 9861 -173937
18660 -46435 -70653 -297302 -518019 -119150 205192 -9997 -62610 301672 233601 -14851 -29324
18649 -29324 -126388 -246141 -24581 102651 85187 -136152 28410 -249091 -350534 -152997
18638 26894 87001 83322 -131542 -187555 41361 195649 35446 -42078 -236059 273600 127492
18626 -188655 -209411 -109779 -167056 -172264 -88783 -73986 26950 -22820 17406 104026 171159 -359781
18613 51308 -5790 -550949 -213418 -215831 -58184 -123094 8195 -6189 -61142 133610 80215 23360
18600 -238057 74412 16974 -276150 -148726 -86534 -63368 -55614 -224955 -290633 -120224 -123185
18589 -123185 157499 -230690 -103078 146009 248284 -69263 42703 -50110 4819 268 -64210
18577 73307 -45145 -409936 -28419 91187 -155793 -145528 -93395 -80848 215919 -121084 -24306
18565 230261 209710 -73812 -133641 -56657 -96862 -168673 283659 -164243 -333180 -97679 71578
18553 108748 125430 -22473 -73998 240418 61211 -210022 -174717 -196224 128483 110924 -395329
18541 -132133 -13983 -166611 -99748 -24533 -1028 -297543 -178857 23960 58448 -45320 -182092
18530 -182092 -175608 -161461 -70920 -180203 -141853 -158842 -293436 -184411 -341451 -24909 324810
18518 110702 237587 -41763 -194727 -69426 204294 280976 166024 72165 -231271 -24807
18507 -266470 66226 -135252 124653 -177298 86408 -142230 -133222 -266420 14228 39793 34821
18496 34821 -251504 -31853 -346829 -143917 284008 60703 48897 -10011 -145231 -131934 -92111
18485 -92111 -216656 -213150 -64067 205077 26825 177618 58587 321663 -205922 -92227 -59215
18474 -59215 24074 -181191 89304 -168970 117033 36935 66773 -185408 -181123 202098 -210613
18462 -183390 208044 -142743 -81254 -211211 -87761 -209620 -293889 179085 -160727 116274
18451 -175624 -39235 -129514 93488 -229112 17351 -104721 25127 38602 -234755 214184 -398508
18439 72458 134699 -79664 68532 159660 -60481 -54946 -380159 234468 36591 -8716 295452
18427 69998 224416 -288234 -57348 -302261 -110931 -143144 -38372 195771 192757 -23677 -189680
18416 -189680 -53671 -5288 387199 120827 201370 43354 104228 83367 -322688 49545 42362
18405 42362 -4638 -211399 149114 7450 96944 -183428 84570 -113184 -78434 -181159 -52780
18393 117983 -64756 138292 8154 -30858 -171076 -21403 -8129 -220951 41034 -180571 -52458
18381 -450623 -132546 -324636 -149753 -71678 270039 -85739 122112 153238 -257588 -179498
18371 -179498 -230502 170378 18384 -253371 28427 99544 -170751 -157458 -93603 194802 -292620
18359 29967 -110218 -72653 -31252 -263077 -281950 31876 -82517 -14429 165870 -142376 72125
18347 -353906 -171061 -215074 -162097 -109609 -40391 -147162 -48823 110497 58177 -94537 114703
18335 276680 -116900 -374338 -118169 -105203 -23218 -95318 -86912 -9626 29303 -213953 -32604
18323 106856 14732 150059 175707 51644 212227 129821 90627 9374 -242705 -236235 -255249
18312 -255249 -77450 -10295 -108744 -97041 -272142 -120564 -111242 -264188 212513 116437 -32391
18300 -277089 -107228 36159 -229562 -49828 194355 21458 -76082 96648 -215016 -148985 -245029
18289 -245029 101609 -187829 224737 -183789 3075 -122360 -102650 -68792 -190733 -14531
18278 -49534 123451 -31544 122626 71096 -125575 37095 75081 -110788 40082 -48699 96457
18266 -76875 -78117 139408 -37231 -81248 28608 -125412 35807 -114297 70560 -206682 -12620
18254 -93498 267141 46160 -173587 271431 -200550 79998 -128246 -116018 -173875 -3871 -101946
18243 -101946 300704 89976 -134165 200258 254518 206680 76882 -362098 -135761 -7758 -71128
18232 -71128 -12098 -457711 271138 -186803 -585370 285252 -227628 -88220 27719 394721
18222 394721 71222 125328 -3792 186042 -335541 192710 11611 -95301 -412463 -212255 -64343
18210 123643 -187093 -24150 -142928 26884 236785 16572 -161470 49785 -61991 -73194 -214046
18199 -214046 129718 -35284 -56559 -366509 42514 -64875 -64574 65730 245445 62809 -342268
18187 24651 61201 -241331 -42936 267961 28258 51012 333260 -13976 -319497 -8167 113963
18175 36652 -133658 -204642 128937 -21075 -160633 -146615 -144873 -19582 163950 28372 12625
18163 -154759 49767 -116909 9083 -6433 87418 69908 88684 16705 141101 -351838 -253505
18152 -253505 91246 -69710 5233 -41782 -228435 -27069 -316655 84892 176692 -21155 88213
18140 -46084 -154080 -330176 278191 -359582 -51903 -87888 99920 147775 -54482 -161823 -197534
18129 -197534 -154149 155980 379714 -54317 25880 123162 -45492 115469 5284 -189122 -67728
18117 -36598 88027 109849 -161385 -162847 -492999 261888 71329 61238 230567 -19023 -155803
18106 -155803 -16081 -200578 15791 -99281 -192029 106195 -48844 -146724 -40503 114556 -131691
18094 161439 -251260 -58841 -200264 146038 293117 177094 -184265 301560 -305001 -230732
18084 -230732 271549 204751 131874 -137906 -180223 92114 -19892 -150282 -99511 -205751 -261127
18073 -261127 -194501 -173620 -251194 289132 -214734 5099 35937 193581 -112899 -169601 27089
18061 -76437 -22587 -58107 -5697 -157159 8529 -44050 166114 -207984 -172343 347169 -90084
18049 -152265 30038 114638 283939 176910 -334000 -258788 -64209 -35246 54907 11654 -49096
18037 181985 78532 -26719 -5560 -451275 -243647 -24295 216856 -95536 -85244 128834 -11821
18025 -217411 -35700 -55095 -141991 -252665 154349 344478 6053 -123060 -162531 -162463 -21155
18013 -137196 145016 53387 -338783 87074 182941 -202979 -8481 130462 -157351 -334152
18003 -334152 92403 64316 169700 162167 286830 252736 -69249 83123 -45761 -213992 433343
17991 -103058 -91134 -37729 -193519 9217 -114008 69963 -120385 -90798 147723 235849 -69843
17979 -110561 176542 123520 27963 -36482 98731 -467279 96788 -189384 238863 -20268 30715
17967 225661 -111809 3781 -265132 39792 54333 -256635 -219598 339511 -38770 159085 89619
17956 89619 168923 198946 72165 -98573 176968 103079 -119923 108279 87698 -62100 -263450
17945 -263450 -270075 97680 86395 50746 132770 -153206 -424944 -112254 -29041 -23787 -306789
17934 -306789 -6646 265351 -188409 -225114 360476 24704 -230104 96355 244340 -277654
17923 -115529 -184898 -32314 84570 78945 -206130 199816 -3882 77175 123496 143533 12309
17911 76169 -13880 188156 -342456 -330262 82343 256626 -24158 -171941 -48127 -35334 -45195
17900 -45195 -11481 369313 -14603 191194 -10331 -5937 -44211 -43064 118918 399395 -362832
17888 -313092 -101700 119317 39378 -60528 -108897 -39695 201552 294882 78091 73994 -130587
17876 13960 192879 274307 -202917 -80992 33377 136568 -74372 82409 -174308 -297480 96450
17864 21857 37117 -181410 138065 58 37350 74074 39370 -2355 -145791 -163437 -49572 -151629
17852 -151629 -149526 -276053 -206034 -66244 215038 -102592 -1109 -18278 -257548 -96167 44786
17840 -193260 -206737 -323386 132005 81238 30624 -48521 -19968 -160073 -36053 113765 124190
17829 124190 -198611 5443 -94089 -16209 252529 -166990 54346 -214243 197589 -26427 286726
17817 165059 128883 71942 -117747 455023 -53172 -77776 -4689 -14622 -744 -221884 -105782
17805 29577 106835 120067 -265986 -67376 -18404 -11246 51874 -148602 121859 36210 78026
17794 78026 -56756 -148786 -4100 -299414 34450 -112819 -32667 -95947 -357472 143379 -191560
17782 71223 25296 272986 -43774 345521 -168579 325577 153140 -93997 -390 -31184 -36307
17771 -36307 280630 182878 99527 287003 199044 191677 -5743 296158 -21613 -43951 55025
17759 12628 -55542 -30937 -111381 -84878 42043 22920 4509 111921 -77806 19778 359063
17748 359063 -80549 159013 196603 -48834 134867 -417478 57468 -175573 89421 221061
17738 221061 88823 276708 162928 -123293 5834 -138032 -140910 26328 83468 -261154 -79332
17726 290698 -368601 126354 3350 170647 145294 -153716 235816 -178605 107878 -12064
17715 -110019 222637 87336 -258554 216463 385944 -3222 -162556 56952 148595 -247906
17704 211631 -90341 -218027 -185725 -240445 -101493 -45110 -56489 117446 508001 200374
17693 1772 58622 -415787 45184 -41874 -28111 -143249 125177 205772 -55855 228936 20984
17681 -187183 22423 -116646 167466 -352239 -239377 -34955 -80014 -119799 159228 -241298
17670 3681 85833 7988 29803 115375 -185633 18547 143153 212084 -86653 -128626 164086
17658 -158059 -328785 75779 -98147 169742 203691 181117 17348 24904 254594 346748 -124393
17646 113230 -24306 208719 -169094 -272294 202600 -182554 36896 204101 181775 -263592
17635 56845 -214383 -206263 122001 363494 122689 172842 -97400 105116 -208408 27141 170590
17624 170590 26508 14326 141984 138778 -15058 15359 -313865 -33336 -112687 -160673 77632
17612 23598 275374 224625 19005 -310932 -33275 -609519 79267 261886 148090 174419 -41062
17600 94786 -30677 -71595 180815 -14664 155749 34606 135689 -194313 -105522 -95376 156095
17588 8108 24765 -18774 105167 185142 12540 333897 884 323395 301837 346346 58812 211062
17576 211062 100433 104591 343633 68760 228451 382982 -178438 -136615 160158 109784
17566 109784 110531 -126498 241405 -85499 176150 124995 55050 -266575 26588 -20379 248525
17554 -232458 152387 -127421 35354 19835 146210 124771 -48958 297589 -39246 90461 152168
17543 152168 -156139 -177828 152678 89179 59278 178784 297997 257400 284592 -34295 131675
17531 203677 -155888 -146587 61350 -147611 89193 305238 -15448 140116 211356 134859 71652
17520 71652 -82688 32435 -2258 -228040 -19771 435120 34615 13974 382434 -17496 -22452
17509 -22452 -54631 -150980 253541 105798 -13327 26928 -342916 52726 -148467 33599 86077
17498 86077 161573 42631 160726 205844 -258618 -120646 -8530 189514 44462 -218682 475181
17486 80833 148943 171788 208489 76833 -194754 209114 -28636 59962 385514 110491 308178
17475 308178 273188 475807 59297 221013 -264091 308021 67524 145135 89094 128193 -144167
17463 271769 298412 238949 306953 -51215 31248 120773 146760 240743 -103119 445578 436778
17452 436778 171112 483360 229454 424528 -39596 74829 326859 368194 42721 51774 390204
17441 390204 29521 -144801 359251 166160 86476 180217 201320 96600 51720 118824 245717
17430 245717 375661 302823 196680 291108 292594 434440 -69896 295006 113126 467604
17420 467604 96189 451044 69291 188667 484804 57670 -29224 229913 63477 -19433 178361
17408 298988 242542 144051 273568 341444 -220094 170321 162306 266032 148641 83949 101245
17397 101245 207245 285753 48323 17064 181906 -40458 219372 -41391 103383 332347
17387 332347 -10413 188903 176632 527205 169988 -5910 441616 3836 152240 125095 418236
17376 418236 76169 270631 111462 3330 13395 389994 252837 106466 28809 116116 331125
17365 331125 151416 82809 84207 212639 188664 -71300 183587 -214502 -169129 294068 25393
17353 -81651 306348 -3696 219896 325780 90399 190976 225945 51485 159051 -71135 -99821
17342 -99821 56518 331483 -133977 294148 202302 16470 105877 227479 367567 -107965
17331 393196 331339 360065 -34848 91746 -136615 25739 -41901 -105165 74538 260819 278645
17320 278645 308843 515393 414156 449769 121923 325242 209164 -47726 251085 141200
17310 141200 140737 329275 -45153 318823 290031 276509 281041 -35598 341813 98198 313870
17299 313870 427352 -40059 69691 582931 128382 192053 167282 200813 -66778 247772 242543
17288 242543 220037 18347 189741 -70047 2562 241844 373329 355708 105352 288313 171322
17277 171322 169177 301994 181231 17947 218349 115136 147941 -39057 108598 31862 118641
17266 118641 277178 44216 218323 -60512 -164114 206944 281651 85540 406328 -140302
17255 97926 69528 272308 131064 113511 -25576 521714 116280 235489 270441 277114 -59920
17243 192429 203728 -30987 220778 385476 371798 42757 146468 318324 -229430 135535
17232 22738 -118010 44165 347384 41889 248449 258715 25010 213608 367151 130158
17221 338878 459817 148795 291114 525706 205342 -63569 63188 123567 -152277 147695
17210 353556 295761 621695 -79671 244547 217646 289810 154677 260296 543805 208113
17199 362220 344233 469760 148541 363437 402318 559095 283308 310095 156966 196218
17189 196218 194888 220889 450479 545748 181855 228629 297761 -94101 237575 14909 -26651
17177 256651 401889 432057 199918 -20893 416683 20687 249209 297731 131655 229507
17167 229507 509413 257708 -2442 152901 221294 358786 446080 345277 -39182 95774 96079
17156 96079 258665 514517 281068 19977 218058 375749 166803 492540 284215 331241
17146 331241 432304 202183 373252 74323 357760 252869 423277 356637 347262 398417
17136 398417 261396 666841 191820 19477 340443 776012 559579 -121827 341559 508235
17126 508235 309388 382579 547308 522067 280574 556732 377016 257216 266346 100133
17115 691527 313780 314312 439306 408213 413591 -24528 635228 296775 430656 629621 342678
17104 342678 302080 427101 23667 192508 603056 301537 222790 132389 368706 411984
17094 411984 371231 766597 453354 289931 477302 475321 449572 355561 250970 522131
17084 522131 355704 247224 531779 511033 323724 253408 339486 754351 315784 363658
17074 363658 473994 485552 623360 736248 336670 479754 644374 466521 581922 557821
17064 557821 360924 432326 366094 391297 689570 229355 521415 706945 360853 512815
17054 512815 385996 771128 193366 666412 369835 576733 361841 266307 488712 693068
17044 693068 360108 517886 840145 428039 474113 434495 588597 355005 310868 572399
17034 572399 735977 556935 461515 600955 746489 441899 430284 803337 578262 647108
17024 647108 657140 831368 541097 534887 877604 428343 612643 570291 815384 718341
17014 718341 571884 369902 687488 501385 752569 523657 821732 697519 906442 790176
17004 790176 785682 471111 757939 587249 629467 877533 803744 738771 563462 714709
16994 714709 762292 896159 853286 898886 882213 489695 669009 646628 795256 683910
16984 683910 631010 922307 947570 1072192 615876 763646 815572 824647 920200 1022593 846771
16973 846771 896473 1112606 894149 840890 916233 1347969 1300389 943020 1367342 973772
16963 973772 935464 755116 957741 1197528 1052574 915453 1085816 1010324 1120555 1225344
16953 1225344 1238784 1126700 1046573 971099 1309834 994660 1099354 1283335 1144950 1345835
16943 1345835 876020 1285123 961358 1353341 1295338 1138410 1324107 1596282 1411226 1091549
16933 1091549 1431859 1298227 1240135 1100271 1401618 1312914 1378696 1182869 1160798 1263104
16923 1263104 1412113 1473983 1535392 1308560 1747890 1343815 1426595 1607791 1452453 1677928
16913 1677928 1510835 1380759 1777324 1638055 1563997 1610719 1504851 1866713 1553324 1769970
16903 1769970 1907843 1618130 1905327 1520988 1650630 1930067 1754962 1965175 1914578 2169595
16893 2169595 1896249 1986827 1911117 1707348 1865224 2426337 1913025 2069890 2247579 2139362
16883 2139362 2242722 2335669 2117384 2098304 2051710 2295320 2346068 2458840 2405756 2447429
16873 2447429 2610941 2369886 2479110 2547393 2696135 2788716 2718331 2967489 3063602 3127845
16863 3127845 2717241 2684039 3132173 3157258 3237550 2840616 2684953 2948091 3109928 2970330
16853 2970330 3235025 3320167 3326856 3621676 3554872 3686773 3387846 3404752 3786561 3558707
16843 3558707 4113544 4094232 3863185 3850451 3860498 4123707 4357893 4232770 4611484 4386349
16833 4386349 4469108 4305945 4689609 4472713 4734143 4897686 5167559 5063611 5182078 5029749
16823 5029749 5414285 5417000 5190614 5804259 5459622 5582860 5839750 5989206 6092699 6501294
16813 6501294 6429931 6400309 6639283 6716355 7014187 7158837 7277511 7297015 7755177 7579882
16803 7579882 8060473 8259039 8064475 8683218 8463576 8738419 9123842 9191739 9435686 9843812
16793 9843812 10085240 10222219 10744691 10764838 11034476 11317452 11670297 12598689 12633329 12710866
16783 12710866 12830510 13614816 13573770 14170765 14612517 15024786 15599130 15917186 16500061
16774 16500061 17154739 17459271 17882723 18824635 19403047 20156602 20656990 21408421 22334295
16765 22334295 22879644 23953302 24883510 25830921 26683828 28065746 29039588 29978845 31264125
16756 31264125 32780466 34299316 35548658 37318121 39019207 40933920 42401511 44933916
16748 44933916 47124085 49277628 52031574 54302114 57218522 60487663 63367132 66691778
16740 66691778 70283757 74183279 78370816 82389838 86721510 91557955 96803551 101868901
16732 101868901 107150579 113158571 118912699 124535343 130725096 136175538 141771600 147253895
16724 147253895 152493075 156904492 161496832 164814943 167458216 169136569 170333317 170459903
16716 170459903 169657266 167782743 164786815 161592561 157427703 152804968 147594859 141750078
16708 141750078 135931945 130100673 123942231 117698227 112171678 106518799 101065407 95690100
16700 95690100 90556842 85464441 81106099 76591578 72516228 68741080 65345781 61648553
16692 61648553 58704055 55127511 52871736 50418539 47621919 45292224 43400939 40999616
16684 40999616 39197090 37263426 35720815 34232358 32720016 31055789 30078455 28816001
16676 28816001 27989139 26451091 25389965 24314994 23600357 22915175 21888777 21356840 20177082
16667 20177082 19459231 18596472 18274451 17681102 16927952 16408057 15842859 15182946 14886915
16658 14886915 14390260 14155934 13750503 12955537 12610900 12332119 11880522 11534744 11244684
16649 11244684 10987319 10518158 10465217 10093636 10047370 9842180 9385082 9288473 8979240 8517935
16639 8517935 8608422 8195919 8003331 7980123 7867743 7723357 7261954 7031354 6805495 6943476
16629 6943476 6426762 6515210 6593741 6115958 6300455 5906938 5600190 5923986 5935401 5584082
16619 5584082 5404089 5577738 5112602 4939641 4817247 5076482 4671595 4576617 4951487 4367568
16609 4367568 4260684 4169795 4526907 4288065 4111336 3815048 4461821 3814081 3842008 3740104
16599 3740104 3625105 3399461 3426013 3597280 3324677 3455416 3306821 3071585 2762969 3137415
16589 3137415 2995393 2799592 3366437 2893092 2745233 2717734 2823507 2772994 2732792 2868625
16579 2868625 2310809 2614220 2625558 2574536 2586478 2243097 2280599 2146400 2457902 2131270
16569 2131270 2110863 2107011 2039390 2421741 2383350 2143348 2310776 2063486 2014499 1918793 1951138
16558 1951138 1857586 1670653 1727997 1382458 1609440 2060084 1821921 1980537 1830072 1980254
16548 1980254 1627056 1594877 1565627 1871027 1491510 1635477 1647797 1701074 1752320 1615736
16538 1615736 1292945 1633398 1314480 1494352 1219154 1144272 1172112 1727154 1415568 1427872
16528 1427872 1583393 1335119 1335901 1314350 1233256 1195764 1303750 1205714 1229980 1340666 1506917
16517 1506917 1322521 882703 1011692 1203983 1069305 1081781 1105027 720369 815060 1245797
16507 1245797 1056751 1251049 1009569 1066096 1115018 909032 1215090 856273 996919 947696
16497 947696 1246235 798741 780333 698732 761564 1012696 1083255 991391 618122 786708
16487 786708 848734 992392 920345 842638 1158690 988803 768376 817606 775379 578062
16477 578062 719367 1112333 1014307 789784 807928 945433 1002820 580237 360783 581842
16467 581842 624709 728976 622594 609153 1027887 637741 660996 692390 513992 924483
16457 924483 861238 912542 631176 486857 638184 786824 589856 558918 584761 741466
16447 741466 556229 389212 845730 436211 483034 457046 761779 779582 478582 643157
16437 643157 518944 673015 691640 467789 512831 297232 631313 783121 494787 754169
16427 754169 466797 800657 472434 423703 723759 519610 460066 395893 299449 717721
16417 717721 359161 332806 629114 535270 504446 292113 666696 280522 440870 517431
16407 517431 275719 656326 523263 539400 366088 230273 449087 439652 477244 574647
16397 574647 550858 250448 384556 308620 315293 274045 311391 223636 501462 428881 503740
16386 503740 92326 388351 138748 342415 579400 259830 311836 207355 561159 538272
16376 538272 371010 470590 283214 270606 738603 410612 391177 552877 -47870 99196
16365 318653 153132 274299 378051 54355 544874 258794 365148 701178 356446 220291
16355 220291 220122 12377 459546 333489 22547 288454 411290 449536 353763 218876 307211
16344 307211 238035 102347 528126 46269 59829 107697 -81321 166326 11874 -151504 390084
16332 294167 -156258 323507 7302 63288 213553 -10196 640190 60854 46002 72494 148365
16321 148365 411038 91896 346837 51514 245512 456930 81350 382244 -71499 478866
16310 441983 -39959 131512 418837 371187 87598 274172 58039 438406 274336 33463
16299 -136055 52946 3772 -44151 533942 268595 647897 262924 139070 133486 42697 363162
16288 363162 98921 298010 179757 518982 176637 -37075 345374 135272 659398 123835
16277 -60668 -47392 94283 306178 314009 -52529 -738 -8220 301502 39095 422952 -37341 88640
16264 -273699 286875 161294 14359 -139716 313315 101578 345454 2232 81554 258559
16254 258559 86216 197685 347713 -3059 199823 -200398 54922 171610 71010 -72960 103796
16242 436339 129869 102894 -120363 340829 167699 158467 123970 157320 -6268 3347 -220242
16230 99599 86022 -86925 606081 139955 176407 164901 -296518 275875 -22724 13979 190940
16219 190940 104488 -105234 192069 -58233 -307315 -34832 440424 -112274 1260 32491 333771
16208 333771 158480 350940 183138 -284482 45078 125857 -133578 8696 202439 76771
16197 38054 164258 380455 5779 -26408 407469 166745 361676 -106135 31639 65510 -3745
16185 299991 13515 -60480 -72145 -61080 -151350 88262 106867 -243814 216154 47550 347191
16174 347191 -12885 1904 -53252 -122563 -197382 130349 116156 37456 308409 179718 403354
16163 403354 120372 -11381 47104 196990 209798 -117254 105177 48681 -266996 52903
16152 103170 268887 -120268 53530 -168415 67347 99 -47861 64093 -316545 123182 115863
16141 115863 -77449 135005 156677 -117109 124951 -16615 280361 191685 349123 -216182
16130 -7350 -186329 2461 -156506 460270 238690 189779 30051 87582 -161434 191152 -49138
16118 -253274 15699 -181078 27915 -295921 179862 181479 -78179 -89555 15290 27471 168732
16107 168732 61850 121355 143778 153794 3339 384239 3863 148254 -2291 261077 26685
16095 395520 -223904 -66831 179639 -134672 -198268 -73935 -215775 -11960 220037 -1064 349204
16083 158124 234855 -42775 165386 357115 -39311 -125371 -90072 169764 -97442 54916 -391963
16071 -280751 -26940 -295571 -232688 48564 359486 -160508 -505749 -83923 -230851 -244676
16061 -244676 -5652 9236 227786 -84589 -329384 308670 -29522 88013 42777 43644 49331 12775
16048 39419 -23746 21272 154614 -7618 -73349 72952 -76667 59231 -116911 -59250 186142
16036 -116751 -182129 182696 -163334 11552 -167196 -209193 75855 -108479 91235 -89488 -512229
16025 -512229 -177965 88009 168699 -262011 -131197 -169555 -206894 -32822 -45531 -86646 -8761
16013 -25942 -122799 -103110 146484 18743 -146013 15057 18525 187328 -330629 -71404 56884
16001 -87315 -52207 -79896 253079 -65714 184102 292586 211209 -108560 96874 -18626 90716
15989 -178641 86510 -213253 125178 -138547 147651 464871 227312 420965 262499 153713
15979 153713 97396 -30384 -60228 75715 -170491 336479 -6824 -59747 -264153 93507 141913
15968 141913 -367031 -208026 45584 -171072 -150099 -1452 -138981 119097 149181 -66292 160394
15956 -88786 -260774 -115125 -54992 -87028 41332 -249176 -141094 -2450 -247599 -207951 66214
15944 -64818 44783 -205019 118379 -201741 39906 -562315 -37065 -134393 59454 -178601 -11534
15932 -39097 -184489 -78787 -373486 31519 -309229 -150986 150029 80258 244660 -4135 134493
15920 -51050 139886 109132 -188257 20857 -110990 -78006 239255 67166 -43344 -216280 -92998
15908 122511 -131865 -136467 -104789 300928 461123 -73311 103756 -54762 -179052 -248050 -122644
15896 112172 174152 294314 -115046 59686 74369 -211395 101883 55677 332265 203886
15886 203886 5370 -40808 -136618 -61009 181937 39181 32774 264115 50994 13795 90242
15875 90242 155192 3919 -240871 17877 60360 160261 95895 -163910 -108356 -217408 291033
15863 -75468 66636 -184918 -65738 4341 -168820 -31117 -31946 332994 -188488 179888 -137141
15851 339989 266776 -155862 -111320 -239175 -168712 188147 -78760 -126681 120705 -242710
15840 -37494 118760 -9188 159903 -80976 251443 -399515 27928 366480 153105 190310 -76927
15828 142026 -189108 19939 31340 -382582 -74644 47195 16453 -18794 -291346 -70177 -163331
15817 -163331 -203023 -327756 -108268 81567 112815 -335310 132571 -352477 -249495 56315
15806 27556 -122005 -126742 -23097 -12108 7197 -262434 -136501 -160032 -264784 222639 -22755
15794 -195713 -211314 23958 -27284 -237606 -120166 171164 67183 149120 -118428 7939 -111160
15782 -269738 -183981 64152 -66835 285276 -71108 236596 131173 201371 273165 116750 -236147
15770 53082 -142796 38772 336971 -92160 24739 115184 -268561 -17871 88732 -68038 -25610
15758 71761 17189 285739 7145 -91127 -61569 -81217 -142875 -131037 -82240 176748 6151 -27621
15745 -436000 264920 -236807 132858 77310 -190629 -185261 -52936 -55964 8458 -216879 -190514
15734 -190514 43411 -266172 -400509 -88344 -443601 145975 21974 -325995 -103721 -93284
15724 -93284 34986 -190332 -55620 94014 476801 -14842 -160465 -101196 -186701 -10206 19460
15712 -170267 220499 135735 244241 -20974 -279512 175810 83802 -133073 25715 -312168
15701 206688 -96559 -234512 169213 -273725 312985 -239068 -62288 23428 120185 17634
15690 -147348 111163 179417 -21937 -14535 -76015 -1935 81899 117875 145968 -171767 2205 -15503
15677 -213511 81746 -24679 78424 137145 -25961 132213 131142 114854 401467 -185509 -158174
15666 -158174 -54737 -951 -85757 -30583 -985 21410 4107 -8157 -101818 -63749 386082 -167189
15653 45762 -180577 32163 151148 -231558 182055 -63902 -592 -126840 162996 -88937 17568
15641 64886 -31945 131772 -121947 -303780 -398330 8356 -153437 -125149 -16557 67691 -106216
15629 -128330 -181344 -172242 314344 2957 142190 -188258 -49564 -169965 -141638 -143534 67513
15617 166666 362411 105535 212590 111533 -83113 -7378 -234054 -1056 130982 -149811
15606 -122967 -94394 -229510 -1396 79599 63069 -13471 4226 25729 -114596 -437558 213923
15594 -114500 178102 -104598 100596 121999 134044 188416 31504 -79357 -124791 -234378 213345
15582 173808 -51869 -104604 82321 67012 -226281 -131960 -29066 81677 -423963 24917 -1732
15570 -102737 -172853 50110 -138695 272713 -178579 161512 -34634 102364 118616 279460
15560 279460 -728 -68158 -200031 -500795 1 156889 -127703 149248 10887 -294991 26643
15548 29101 -478396 -46327 -74421 231586 -120504 -244965 82210 -81424 683 -64945 49208
15536 180853 -12250 -141255 -24565 -74239 -45204 259435 -457118 -294413 101580 23953
15525 -33714 44323 -170721 -153549 2673 135383 -146889 268060 21556 -68667 -59360 -235655
15514 -235655 68430 -241374 138165 -167040 -64654 68427 205025 536745 307953 -102371
15503 -91090 33598 156827 -20436 342124 -10344 23762 -36913 254883 -297373 -15803 -54602
15492 -54602 308972 -134532 -193612 177922 -96188 -235135 -373325 35700 74712 92995 256268
15481 256268 118322 -129097 8857 163664 -31841 -166783 -113066 -211123 112144 74401 55839
15470 55839 54596 -92712 336436 -31138 -157173 41164 -120343 96069 -439353 -34058 192632
15458 8708 200302 -39954 -277607 19051 248912 -73690 196170 61704 -27720 187149 -133392
15446 2859 -352583 341623 -24745 -145479 -31012 107142 36710 -112560 -179229 -4233 33390
15434 160386 148425 364122 119478 -135396 -174831 -197063 198835 -87609 -143743 21004 -205266
15422 54539 -173132 6641 -122567 118638 216528 222433 -129208 -38496 35026 -327146 275818
15410 -76593 -71713 -187905 -99037 59658 -108929 -66588 202237 -52001 -31654 -45677 58262
15398 -191260 -157938 -132394 111375 -154765 61742 124315 -64526 -184364 204404 -91911 3908
15386 -233940 47550 -133496 -83613 -57055 229515 226500 -300370 167910 119799 -90439 130052
15374 -188210 -310957 209454 108136 -46924 87538 485049 258893 236088 435166 -197725
15363 -391503 -524755 -268425 166468 132438 -100214 -298788 56405 282571 124484 324798
15353 324798 -361362 216841 96726 69752 -120847 -48019 -313836 299082 -19857 213955
15342 -133206 235886 16122 -91449 11029 64583 -11869 -73335 52676 -26248 208001 177948
15331 177948 153639 227432 -82621 -235097 128784 -38801 -72043 50185 162792 -98502 390544
15319 -175010 -14206 22725 151679 -50608 58288 -70999 111458 177929 -20939 -19757 -135709
15308 -135709 25692 -63004 114149 151806 255466 -69182 57010 123202 -135844 -115661 -298974
15297 -298974 103705 321285 -19647 116334 60569 -274058 12457 -2927 96413 43246 -168198
15285 3051 54661 187460 4223 236555 177642 283650 113408 -268258 71580 282676 -170077
15273 -88369 103690 36874 -59739 57622 342932 -29926 23356 -60657 127235 276673 16350
15261 58180 5001 24006 99527 -13011 96355 26153 414483 4941 420642 155348 154777 342672
15249 342672 600521 1366957 1234696 1040111 1125654 520155 360212 308907 98895 16438
15238 -121755 11134 163008 100925 40860 -102580 83364 141750 -19927 305408 -2591 -240313
15227 -240313 -155607 55062 72666 -219642 124752 111327 -34636 -25473 144611 -135670 363902
15215 82890 -244591 -3900 -137764 6746 -35447 23240 -202275 -143788 86430 285673 319982
15204 319982 111218 -107466 184227 -45576 297453 -52565 253162 -30397 24613 133170
15194 133170 -239569 84442 119038 -133266 -2602 387566 120782 239281 116321 -272492
15183 207287 279381 149612 -56710 108712 -183418 -145391 44867 272663 333139 182049
15173 182049 -75410 78557 141153 157308 330833 539511 -205192 129613 277053 -100234
15162 92157 64089 44726 11567 291704 -145199 183742 -190434 -75465 -219541 134066
15151 -155761 33376 -165403 126279 -265970 104443 3003 204266 181750 417987 99773
15140 -86511 399898 127300 8 -4493 112993 121472 23427 209298 99203 28450 -13428 441458
15127 96868 265962 161549 293321 2653 148609 -89913 274344 -142530 -121254 1733 12264
15116 12264 178913 106366 128664 -32222 59161 -36681 30820 -25682 187618 30238 6202
15104 236682 81834 98251 288129 247492 316567 -2729 -53529 -157692 103849 225209 43739
15092 -480536 58651 171496 96235 242522 537947 107098 226266 393118 354113 -314238
15081 -44825 -98827 346562 258597 -42393 245941 209607 24790 39303 -13556 -69846 273313
15069 141999 241787 -11408 321446 50956 312746 66514 318121 -117819 80696 336077
15059 336077 60887 61951 287969 163367 249757 -188687 127451 108797 -166103 -24771 -148232
15048 -148232 328034 7722 23829 202520 188296 -31881 181178 105142 141382 260680 21207
15036 -56115 260588 369713 73826 257961 112047 -55 -5374 210716 34012 80729 204819
15025 204819 119066 497948 -123544 283187 145661 -214914 83318 -46716 186123 530002
15015 530002 -18051 439630 309020 657593 -69563 152220 266156 -1038 209618 388698
15005 388698 -65908 221309 150840 160795 153616 174515 274516 279193 270017 59393 517695 324491
14993 324491 541170 276184 126990 39120 158835 238726 210840 328693 231530 -220886
14982 29298 11603 59033 316046 116497 198000 430137 469892 257553 229141 149846 145244
14971 145244 231059 158683 178532 55951 257061 124606 306395 241862 612998 234236
14960 697508 112886 386997 211334 510388 147918 294849 189507 389348 -129935 380087
14949 174779 410463 201731 301460 301788 259749 -13364 334494 496915 -43274 199321 339858
14938 339858 216761 445524 237096 106510 587111 306869 335977 227645 430279 276118
14928 276118 287259 255222 340566 507753 516194 501027 526131 -65510 169193 368905 438105
14917 438105 189147 196616 357289 84078 123598 257742 322615 191810 46212 477237 178565
14905 329136 506223 488757 288678 205754 362008 337453 223399 341762 412320 252208
14895 252208 238281 211157 26526 252471 246171 434295 295012 151913 336676 365116 149917
14883 340637 422405 191776 265635 239725 349603 494503 278975 320268 672756 482973
14873 482973 415121 343457 415442 358946 179344 400074 347102 536397 200232 307909
14863 307909 113356 408262 235308 666827 222786 487394 334026 419877 423068 401559
14853 401559 455363 274826 537913 534977 509147 648432 385788 351245 79848 188658 272523
14842 272523 471649 332955 428980 483341 250048 620505 565493 203441 366513 504620
14832 504620 374806 225619 309901 506552 565984 460627 605298 477485 438065 392991
14822 392991 363903 630454 536046 355827 354907 315117 407326 408325 538814 334983 539110
14811 539110 665318 362524 338945 455010 505980 576975 338639 246269 616991 454993
14801 454993 321484 695806 355078 451251 713998 137761 738406 619645 438495 458177
14791 458177 365794 599844 373823 523620 755779 159089 691993 659842 542154 1038541
14781 1038541 391187 560831 608569 792722 499860 534639 936732 265960 628138 767006
14771 767006 638828 481686 762983 758203 656183 499514 564947 99843 485253 597411
14761 597411 553190 639821 694343 739794 286901 690046 968487 774820 840952 511176
14751 511176 499072 586091 918818 504274 732809 668835 451680 609433 772451 399562
14741 399562 646906 780596 742882 663292 907727 794002 541849 690491 848639 289704
14730 713783 695263 394057 883229 295158 812398 601156 905688 706581 770604 894042
14720 894042 896716 1003779 691013 725149 809449 895430 839125 683108 919662 692052 737083
14709 737083 655356 895528 860330 806082 856091 866280 768800 783704 602287 918879 837646
14698 837646 953333 821495 787268 751624 786550 707405 948059 718198 1064805 819723
14688 819723 984278 1076563 641542 673117 1215326 988452 889937 920722 1068669 1004033
14678 1004033 1145292 929847 931011 1018855 875656 1090864 807673 830195 989907 1069294
14668 1069294 955667 1057183 675786 1140800 800044 427510 909364 842386 832737 1086791
14658 1086791 1164425 739739 1044576 1101018 1061819 896527 1126237 1235268 1142727 1167583
14648 1167583 1102148 1030159 1265811 1260857 929606 1136813 1173766 1046206 1032542 1076815 941263
14637 941263 1323861 1286328 974649 1221602 1196909 1307863 1261910 1312363 1164912 1271788
14627 1271788 1342481 1117607 1048609 1238505 1267383 1318562 1488500 1275474 1029678 1575534
14617 1575534 1216984 1343908 1386240 1388776 1397155 1432793 1428401 1319197 1680387 1544062 1570608
14606 1570608 1476779 1799455 1230633 1795592 1441992 1599370 1466634 1565462 1738065 1684113
14596 1684113 1382301 1362194 1352186 1426184 1807473 1790149 1856045 1852441 1813276 1267232 1342477
14585 1342477 1832513 1585993 1763646 2084123 1525681 1850918 1886174 1836667 2034496 1777687
14575 1777687 2334040 1921547 1787770 2175100 2008848 2105242 2332593 2224632 2419370 2437555
14565 2437555 2364817 2425815 2507307 2599458 2679605 2305807 2850802 2786997 2646714 3354819
14555 3354819 3127495 3725912 3684288 4152766 4698440 6287219 8645873 13306788 22573134
14546 22573134 36873392 38794619 19343912 8450521 4357702 3032408 2464697 2091821
14538 2091821 2338197 1820421 2052880 1644672 1873248 1851389 2100642 2108553 1945150 2309770
14528 2309770 2285724 2190796 2260075 2228707 1872519 2210454 2409632 2587327 2675602 2431535
14518 2431535 2417812 2618207 2825976 2673794 2618261 2342364 2452647 2565224 2738413 2660065
14508 2660065 2698204 3135762 2780184 3045034 2568536 2673059 2862205 2856849 2923031 2804099
14498 2804099 3030656 3422112 3047690 3139668 3097739 3346295 3433650 3424750 3053851 2999774
14488 2999774 3374263 3287883 3509668 3551911 3507519 3778468 3615694 3730809 3640857 3779078
14478 3779078 3651099 3912905 3828478 4277805 4114173 3969347 4301640 4143649 4001000 3952551
14468 3952551 4489971 4304190 4573337 4118743 4331145 4457964 4556169 4275759 4793906 4646608
14458 4646608 4599266 4529495 5056031 4607026 4690788 4939368 5081577 5076297 4908488 5487802
14448 5487802 5267753 5654287 5097637 5303747 5532215 5841942 5549147 6119806 5727260
14439 5727260 5805378 6079659 5931931 6087298 6093467 6437353 6542164 6367626 6353076 6876495
14429 6876495 6782316 6782009 6783722 7029478 6991898 7235449 7130017 7390037 7413581 7486636 7580206
14418 7580206 7719922 8030751 7966046 8105172 8368742 8357352 8893678 8171143 8373769 8706813
14408 8706813 8779465 9093052 9123029 8886784 9376347 9841835 9593932 9864000 10054148 10186392
14398 10186392 10188521 10648749 10520436 10638870 11010599 11253732 11615536 11746369 12064083 12014735
14388 12014735 12370164 12447659 12677871 12928819 13112234 13468102 13920335 13660714 13734720 14349615
14378 14349615 14662876 14760050 15195479 15587194 15805854 15805912 16359287 16846000 17072249 17568994
14368 17568994 17949415 18089947 18607793 19038304 19586797 19702691 19843381 20444157 20835104
14359 20835104 21300332 21759460 22340089 23023003 23157187 23964331 24303301 24639632 25719879
14350 25719879 26362639 26988668 27492730 28442733 29009405 30006726 30555280 31212119 32240680
14341 32240680 33228130 33932619 34797583 36025265 36889414 37738425 39061776 40103803 41378496
14332 41378496 42776960 43809769 45413646 46620837 48467962 49334230 51121386 52722803
14324 52722803 54750895 56956103 58693627 60213409 62657298 64848233 67464144 69842423
14316 69842423 72440700 75563194 77813241 81225605 84087687 87937851 91200443 95193429
14308 95193429 99303020 103759494 107827800 113032296 118038601 123501445 129367699 135051242
14300 135051242 141509727 148553637 155577133 163235330 171510571 180009229 189201929 199089204
14292 199089204 209099264 219869264 231302364 242619133 255211336 267679079 281162478
14285 281162478 294908694 309008036 322882425 336792687 351320900 365320662 379105277
14278 379105277 392425567 404732807 416101264 425677373 433193481 437239002 438414080
14271 438414080 438772240 439305471 442541470 438370639 434766806 429894782 421550630 411327686
14263 411327686 399943333 387204655 373516546 358991015 344337687 329165965 313970767
14256 313970767 299182199 285429279 271964612 258338447 245623891 233500392 221674783
14249 221674783 210716113 200017279 190205992 181169915 172198066 164152919 156640814 148932783
14241 148932783 141825635 135231448 129412342 123432973 118275138 113224703 108011554 103695220
14233 103695220 99200085 95289928 91719911 88209721 84684487 81234428 78118763 74804917
14225 74804917 72429793 69660820 67081479 64410186 62526756 60454756 58295938 56389985
14217 56389985 54145437 52842002 51059207 49814744 48275060 46639879 44989527 43865932
14209 43865932 42593265 41483945 40478797 39190017 37955418 37079405 36050495 34801231
14201 34801231 34356157 33283496 32300434 31479938 30725053 29813056 29190560 28328186 27836229
14192 27836229 26955389 26054294 25750960 25052892 24319833 23770627 23252196 22869839 22692377
14183 22692377 21784146 21183530 20931455 20547443 20016025 19551517 19420262 18887885 18616808
14174 18616808 18200377 17587022 17560376 17211181 16662051 16687543 16145876 15862562 15517370 15207699
14164 15207699 14889839 14648988 14104731 14057096 13856371 13560363 13133263 13214846 13045897 12680413
14154 12680413 12357304 12196748 12061648 11899225 11710220 11507602 10951149 11248206 10968015
14145 10968015 11011749 10465275 10586512 10320466 10054956 9935290 9677912 9656872 9592013 9796893
14135 9796893 9326313 9259027 8961001 8754516 8817602 8525219 8561966 8255817 8405326 8034398
14125 8034398 7955357 8001164 7731319 7717418 7290780 7657023 7219479 7279649 7312707 7309775 6948531
14114 6948531 6777167 6769703 6587621 7143418 6742247 6241516 6524995 6340935 6195531 6303694
14104 6303694 6108896 6224544 5797215 5975465 5779056 5878623 5739410 5714245 5580758 5216118
14094 5216118 5503025 5454721 5552374 5108834 5328886 5345260 5326156 5164031 4936590 5019571
14084 5019571 5001002 4608149 4761566 4543380 5040958 4324498 4613232 4746531 4535826 4383476
14074 4383476 4486201 4245846 4181987 4272993 3984029 3963325 4045718 4220861 3820159 4075385
14064 4075385 3763105 4075318 3854473 3998566 3915128 4044441 3973856 3712206 3945314 3802139
14054 3802139 3298024 3484919 3621139 3660330 3365442 3607551 3490737 3345299 3220036 3436181
14044 3436181 3129840 3269476 3074377 3146403 3283558 2866623 3083968 2862745 2953091 2797012
14034 2797012 3044933 3009383 2911162 2865968 3187331 2856762 2734118 2657233 2782777 2605349
14024 2605349 2932843 2586941 2581180 2280460 2426737 2659647 2565293 2299615 2524846 2431094
14014 2431094 2428860 2502562 2391705 2250548 2184027 2491387 2230870 2476468 2054571 2342348
14004 2342348 2203551 2375458 2105261 2052291 2106251 2113304 2124562 1910018 2138417 2042759
13994 2042759 1934945 2269092 2602388 2620760 3040519 4456455 8392098 16213537 30792686
13985 30792686 40687791 23581440 12571071 7613991 5887969 4901117 4058020 3472793
13977 3472793 3681385 2792467 2938515 2573848 2670597 2504274 2396070 2535842 1894575 1980842
13967 1980842 2508052 2309273 1831435 1895485 2319033 1920204 2336008 2443721 1878687 2080120
13957 2080120 1983529 1871782 2420136 2090907 1913631 1913048 1586282 2012875 2056486 1706979
13947 1706979 1724804 1827758 1737900 1771639 1750165 1609623 1718144 1930948 1710280 1513418
13937 1513418 1937249 1431144 1855968 1612484 1384519 1476415 1739874 1848677 1673232 1764121
13927 1764121 1634649 1826114 1440469 1423309 1308259 1454645 1338892 1366899 1689662 1244941
13917 1244941 1122870 1186070 1366887 1914263 1768858 1432203 1445464 1540944 1286964 1337104
13907 1337104 1264620 1792914 1635646 1573719 1369863 1041765 1608134 1331562 1189755 1250545
13897 1250545 1405845 1392080 1330842 1115848 1496675 980834 1020335 1298425 1032199 996606
13887 996606 1089204 1118493 1165971 1131217 1159176 1172366 1024213 1282376 1379145 1073922 1081326
13876 1081326 953067 1045362 1101753 936399 1145945 978495 935100 1307725 1267824 1156049
13866 1156049 943564 841009 1253963 1337740 819772 1006391 1048815 973951 1056428 1112992
13856 1112992 1180999 891256 1050987 1000407 972595 902029 948408 716443 786383 1141847
13846 1141847 1081150 867997 1220315 1170219 1015035 789829 1036747 845352 1221712 780590
13836 780590 1286923 835629 576769 803691 756881 848861 897888 1030659 900340 1058227
13826 1058227 886968 729748 760506 1054761 771430 726157 526780 652413 877535 681298
13816 681298 577052 634161 1107016 650518 577434 790693 1111536 378673 1082460 840177
13806 840177 578699 887048 822601 607931 550499 943784 931222 758120 544631 529484
13796 529484 823917 679870 559225 788517 1199538 645691 763085 857128 789076 721767
13786 721767 701924 529458 539703 966288 782632 888302 459283 796058 536722 824786
13776 824786 822085 940146 838437 404981 826847 491546 600549 729536 737659 694791
13766 694791 838862 826290 421935 545569 712320 552605 716724 462587 680564 418206
13756 418206 741011 646130 509484 810651 636585 240995 540360 460442 682366 555992
13746 555992 521967 818756 754674 413283 489550 502488 771915 665932 407661 381098
13736 381098 645425 391853 702702 461305 765396 229525 537098 675766 663038 610992
13726 610992 609633 503583 105690 344244 667341 660668 374232 488994 546843 578175 296158
13715 296158 574399 635759 466508 456866 283549 768224 479223 643931 457096 724769
13705 724769 432896 290797 401641 456151 343874 515608 675640 416247 701619 519321
13695 519321 585545 489262 255916 226582 802594 254547 534377 550132 241960 600984
13685 600984 564655 548472 496051 394175 498900 622239 744805 77733 526940 532690 -158879
13673 341344 598297 677776 205493 453584 393674 587448 356309 532229 577237 399615
13663 399615 216555 333886 563722 370401 322472 504466 490590 190265 233077 246411
13653 246411 591338 324678 421700 278855 78827 602238 422454 198618 358856 473042
13643 473042 95677 624018 633170 472772 539375 460870 201891 188724 196073 418613 432180
13632 432180 556499 515616 465381 106750 496207 423980 125164 171032 597736 371342
13622 371342 54505 325342 442789 541001 177384 351442 569460 156330 457345 384262
13612 384262 317506 204556 419562 272012 689438 747353 389505 551696 344778 724009
13602 724009 104766 528256 255505 431985 533952 280642 157121 523071 28741 371582
13592 371582 258894 391101 314091 609458 422459 326243 330096 321274 500241 353202 441890
13581 441890 491362 274899 258336 434009 521890 85575 228855 615559 174629 164850 396791
13570 396791 375957 498378 199552 164538 465699 320738 -69524 182475 374607 119811
13559 284143 322571 214534 364020 484328 201664 72098 434937 258332 159298 66087
13548 288336 359969 215261 488414 309548 236481 281125 329350 54738 -43044 379695 22753
13536 210116 385708 383282 217737 382747 314799 209848 483404 337536 265861 403267
13526 403267 379456 349311 518875 78267 167053 326321 176936 25732 229520 356459
13516 356459 290145 344184 213978 -129789 410814 140276 594604 71548 77162 311151
13506 311151 203687 226786 67540 411628 225066 414346 236435 135233 178545 267572
13496 267572 248417 46662 322878 72280 181976 374206 218581 234667 158865 333922
13486 333922 217147 397509 -234343 231160 451651 -3631 236457 256734 425129 275686
13476 275686 20339 93505 70874 234330 383549 298140 319063 198249 140228 5665 26830
13465 26830 75383 297306 205941 10671 262572 132567 526256 96162 86742 256303 488999
13454 488999 204641 117492 102499 145718 308499 355642 450479 -4024 424024 249312 311818
13443 311818 386836 74186 459640 278473 266558 285501 35580 -129787 147245 186432 376429
13432 376429 -2069 -83754 551413 194700 88494 261718 292645 634558 221320 235275 -39309
13420 229851 293392 -42239 129405 233307 295412 193131 89850 66192 255841 174035 122762
13409 122762 661645 -44714 262796 526424 153726 16940 142321 391532 582247 356271
13399 356271 21250 322427 283516 93860 463063 334508 139700 134905 302589 110341
13388 277052 71199 -15396 58964 326543 261070 -49979 226346 -24121 73071 -47377 466076
13376 207908 506398 176290 -110309 402518 177669 199923 121258 115045 511720 216406
13365 245109 220330 61884 297939 427258 173948 61021 79002 421242 158001 98378
13355 98378 128315 466891 173526 302735 -62445 -54043 151690 364366 397306 219518 277301
13344 277301 173992 407424 81652 163455 420020 614352 446711 103631 275317 -120464
13333 45190 64879 97412 339443 129937 205947 448232 29155 220849 196993 -151146 223424
13321 141437 32557 204680 246995 197938 61482 354956 -119013 -178383 -40133 324558 -301381
13309 198807 -46907 242810 160513 95237 1006 168053 234409 85887 -3538 67204 232666
13298 232666 156477 228568 -98414 227663 247909 -129376 47472 191124 220035 409206 143613
13286 -107768 199945 -325611 216344 137243 338260 150261 -130285 -79780 329299 131176
13275 24183 39327 289961 174944 464139 169227 121015 130877 -48727 170449 -48678 338511
13263 489518 213598 -244782 144449 -158944 210199 301722 267365 -48637 142431 302698
13253 302698 251510 348133 130340 81394 52964 323654 -205269 213396 120650 -459481
13242 326783 186157 -39178 -337023 -66972 -226594 -4170 58018 166797 35991 196984 12976
13230 92730 313547 124663 -118105 36142 93041 -39934 172162 -2449 124492 -50957 -35094
13219 -35094 395408 -180054 57592 15071 223935 -179623 222362 19122 276750 118122
13208 105230 136214 28030 124773 128321 154705 157580 259817 175023 -168165 -173419 -109705 209750
13195 -240067 303553 159740 -28092 176147 -159210 -61078 99602 121897 29332 59231 -150287
13183 347897 52456 253865 86862 215372 217802 9429 164454 138493 -2035 199537 228783
13172 228783 -50741 199906 176480 -169325 197584 66915 147777 215285 242922 55646 31985
13161 31985 78458 -26121 -60949 -4841 213195 47053 12190 94554 30470 178026 114704
13150 114704 -185495 398423 -162405 -210063 -230399 41052 61169 307943 54034 155409
13140 155409 -241686 -456300 337773 -242837 30550 222669 360853 -78857 -127117 164774
13129 388929 89982 140059 249275 -178375 132358 187178 30773 215897 70300 -325344
13118 -87595 216978 59917 194923 208742 498890 329483 3331 -7968 129870 -100233 22704
13106 319170 -44508 -327468 146964 -118812 128029 -68653 -176213 -21316 -8522 -30262 65277
13094 168517 166434 -80460 -15594 89389 -87238 97654 168251 71000 127889 45387 76920 -97969
13081 -45296 240925 -66200 179803 236707 26951 663 -209394 -42671 319151 -183635 -116467
13070 -116467 -286144 -224920 407239 251480 158757 139120 -24748 130660 122375 15911 -27400
13058 286373 101374 242964 368020 -171604 -105919 73775 185644 -346587 355916 -228072
13047 248734 69809 231513 80745 139397 -26251 312860 40925 209638 -66565 287429 301811
13036 301811 87982 -119693 5133 280529 179029 -2857 425113 65657 141548 266517 -140922
13024 21551 43912 216103 -57033 55690 -38254 97484 86945 2756 358316 451689 31430
13012 91969 359960 -66115 -81732 113672 184460 182832 199689 -37754 100659 222971 -140447
13000 42812 -38217 175012 -204939 164368 -76947 165644 179149 320850 250034 189980 69547
12988 551060 -61481 83556 239836 84675 -179609 -206857 332389 -25641 -53067 -9540 91037
12976 -28864 223305 44525 135407 -148758 127777 -116115 133918 262845 310789 57628
12965 -23195 -63968 52807 -182324 -65836 48623 172131 -13490 422278 -167440 85617 -10539
12953 74537 1014 265804 207921 135172 158349 9928 -24669 13184 -71143 -108607 281896 -23121
12940 -51894 245150 -288477 -37833 -179370 -218859 188167 -83802 -273459 -340215 -232894
12930 -232894 240611 -148443 25861 -74735 92053 -72438 -98155 -278489 -97889 174457 61853
12918 325764 267229 -283235 -5492 -35283 202335 -8218 -100477 -50850 -118719 -60026 -157579
12907 -157579 14963 5057 220759 -53061 171806 66476 211925 88163 -10382 234301 262111
12896 262111 -127508 -111427 226413 153040 195172 -199696 194120 -84624 -115643 236 79708
12885 79708 180665 35527 -99073 246623 58847 169779 240072 -400964 175831 -91552 -67802
12874 -67802 -12534 323726 76340 352265 -176314 65238 -89214 -188662 36937 73080 -63267
12862 -133528 444018 37173 41408 -10577 -81255 268950 66286 -202499 298546 216665 210016
12851 210016 -179079 114928 20183 24712 153175 -80865 62163 -201320 57514 576140 184203
12839 92535 26218 -15421 -411879 277523 -142969 119756 -82499 7482 -25927 161107 -69109
12827 -211889 41429 -73159 -50418 205972 46668 -14042 83723 -43800 181644 51488 -116873
12815 5970 -171262 -126390 -76039 -165105 87905 -146936 -37060 -103020 114848 120066 183372
12804 183372 19241 226301 78417 -54529 -168729 -175524 72723 240074 58876 -281785 -76823
12792 -183438 249049 105413 235024 123070 195746 137433 76375 -54911 -88357 55132 269616
12781 269616 16393 -10304 -71625 141799 -314759 -175274 -65445 118404 287320 69065
12770 41937 -66567 78843 72505 33429 19098 -72752 47376 -37223 -78729 -19964 6523 26288
12758 26288 -201498 375794 132743 98928 -202162 20047 86418 160420 38299 186695 -88303
12746 -101380 -206348 -167350 84739 -8454 135989 222991 144824 177382 -104683 -230123 140373
12734 81799 347221 22050 105193 53113 -370834 -73721 81031 193037 71977 3590 557844
12723 557844 107219 138798 -21637 -54456 -118373 46258 -182363 223226 -95174 116426 -56438
12711 -352593 77812 93649 435698 365266 85919 162420 444748 -44991 137368 270144 -114716
12699 69112 104043 338160 267693 104724 -28796 173977 94870 -138190 -169249 -68384 274758
12687 75806 133067 252248 -23136 199105 164211 73466 -52497 338241 -56193 94045 -63559
12675 72136 28213 58352 -174465 329237 76859 -54320 111194 184336 459535 -86862 72567
12663 199395 57697 -53600 25295 135478 -10256 296028 210241 -91477 14872 110779 31942
12651 -122682 78176 35573 142500 118490 167893 24473 -128753 168735 112548 103611 212196
12640 212196 -90249 87169 195092 58216 -25056 130776 247 -3651 57026 297216 141957
12628 -86360 -229944 64038 268899 41883 167841 74119 321075 145609 127736 308028
12618 308028 273926 -338567 -198918 -94598 168334 -67850 -32925 -79948 272186 122616
12607 100896 11646 245502 -6913 60896 239896 -102183 70749 -31360 -33579 36755 -113798
12595 -90463 76908 -157368 296877 49803 131660 296663 -403478 -41559 -263963 30844 -198481
12583 -178955 174448 137379 314206 117730 -103162 43498 -39714 -112067 314124 -89015
12572 156867 -189176 43909 14565 1830 112897 49344 101944 -232135 139779 265533 172308
12561 172308 -153686 101365 -187977 129255 -131588 305771 232361 -125302 133665 96972
12551 96972 207889 54040 -78732 -217029 5283 -69879 244176 -186298 15061 15840 -72554
12539 -242091 157177 -183022 27895 228601 -83531 -69524 223665 253547 11143 150070
12529 150070 291698 157277 176 -64263 -35282 -54599 -17000 41585 128002 -34851 152546
12517 -131211 31884 83521 319214 -194001 -181229 3812 -55794 287504 -142311 75820 390099
12506 390099 -231206 284674 83236 -214779 -274188 -195593 342562 39344 69465 -26117 122018
12494 140219 -219346 68613 -127037 196315 -246753 -21397 -269177 -129482 -176741 139314
12483 -10443 251937 61293 -6559 -63316 228413 -275508 -33383 -5878 25246 7223 185728
12472 185728 165020 335449 -160555 -43246 38393 -132142 -7133 -2669 -223575 73177 -359473
12460 151917 72466 231130 90485 28483 -60038 -198705 137136 -130857 64712 175972
12450 175972 183712 -469709 49801 88000 15433 136412 162221 -280252 -148180 57342 12608
12438 -71450 169460 220684 -100828 -28649 -70926 -13463 -34600 754 -154911 112489 225446
12427 225446 -281407 -126055 -124460 -292531 74484 -171998 108687 -100702 -141072 54437
12416 57100 -54355 -66551 -114101 26197 -50385 -171936 107045 -110086 173744 -61000 -42330
12405 -42330 94407 29047 -372962 -10426 -40181 261583 110959 -13665 -42955 -157190 74160
12393 -29155 4657 -116655 199782 174445 98059 -160920 -63539 228982 -109202 47287 -331095
12381 133707 246480 211154 334751 -145048 -132278 142000 13601 -232211 -63391 127687
12370 128732 -33235 103718 133360 -80495 -44514 43341 73399 325022 248979 116539 -24631
12358 -29671 122371 143129 72213 86839 180390 158919 -12375 -75826 -80050 -204157 218912
12346 172581 -364777 -336082 -287386 -83989 -14392 148054 -35190 86337 205458 49095 28678
12335 28678 102785 -145542 -53245 -180423 -38459 16437 -295426 127029 160633 -35616 -45246
12324 -45246 25740 -121956 5170 80876 51206 109728 -98291 56008 66609 -94900 -412970
12313 -412970 -202802 -8638 109899 -59689 -383952 103562 -226771 -134304 -367582 -21726
12302 49471 -23763 -27339 -138654 2019 -158899 95289 -231946 3396 -158151 -123167 49941
12290 -30940 143003 128185 -148200 6223 46193 399142 164043 142434 -37854 -161829 28722
12278 -181894 32161 114166 14208 99874 -109341 36525 77618 188161 -19505 77344 439480
12267 439480 99369 -45228 -177872 153740 269101 -16710 102260 -205349 245178 -3066
12256 66251 81859 159514 260283 -70615 -144906 -9440 153664 57753 -131735 -91366 267217
12244 -846 123945 -80385 -155683 134648 53878 19189 -32839 25463 89652 3288 177367 4654
12231 -151151 100583 -219109 -66220 157735 122951 23269 62636 53059 210430 309319 247058
12220 247058 313019 195761 184610 287945 22353 583577 44190 -178072 -94901 434816
12209 185058 245885 133764 195338 115758 248967 53077 271185 167375 1161 282529 -68129
12197 132156 307648 361952 -89647 198860 16733 163361 18345 -9908 244503 252067 238058
12186 238058 158028 -157750 -48555 186587 151641 294189 146463 362919 6610 -19852 343971
12174 72439 -91338 349298 -222910 117074 105 133121 -160622 162683 75352 255452 179364
12163 179364 -44318 94503 155386 291815 182405 147221 -12135 -110220 -95700 122033 869
12151 102549 201407 29719 111797 67949 -121882 431392 123686 -117133 -64890 237894
12140 252642 362753 341413 -214600 215144 105327 -185432 -189795 41075 34872 139602 305438
12129 305438 55376 -81428 -234627 9136 -168211 -15294 -226576 -56811 61765 172815 9610
12117 89204 -239241 1393 294680 -41516 133797 43396 -45025 21095 68675 301163 32190
12105 -31580 -55618 -63237 -49242 161459 -241084 103644 -60575 81538 178269 20062 -87867
12093 -82523 24726 75724 13820 134182 207770 -110291 -168320 -259400 44789 359763 11895
12081 152859 -163376 -78782 279206 496509 1602626 915300 243405 -91486 331969 272049
12071 272049 -111782 218509 65784 -167223 343063 191548 59415 -41305 -297390 109199
12060 149354 73067 -54610 -139277 -80243 12129 -15479 -233495 31804 -7648 -125790 -250063
12049 -250063 -81495 -145770 -188553 -114690 -296301 -120151 19536 -187129 -148965 -93803 -50807
12038 -50807 287075 -164490 -223484 19902 110479 174608 -96800 47500 -57555 87708 -118768
12026 115215 258409 -93724 306427 -52217 78616 -225139 -421566 -189003 -47137 59595
12015 -194091 34592 212754 -143528 495799 -112403 68082 237215 -62243 -177510 172141
12004 144238 -230877 -157538 177216 -169063 44900 -35725 80438 -67815 152895 -156111
11993 -107259 -168552 -128516 115668 -536774 -4628 103445 -56043 -55439 -116389 79496 123924
11982 123924 -78686 250831 223474 -5125 174803 64931 -53671 -158569 -79458 -246930 -179808
11971 -179808 -5522 12194 60798 172258 -160204 117881 -321 67541 -104168 -183330 -91171
11959 100716 13395 175197 -287942 127652 -11299 93985 111485 212253 -295116 51302
11948 6731 -197367 193990 144582 -119735 -152836 32587 137706 -112404 -169149 -35624 161346
11936 90577 156109 133806 -91194 -106723 95875 -229189 -140027 304545 7038 -353993 98761
11924 39269 -101642 -19830 240173 -274019 48377 77803 -277132 -330859 -137451 257172
11913 -14527 134828 -131954 106369 -136673 58397 132776 -82554 88168 396139 -13172 -282648
11902 -282648 -108713 182 -102446 -253656 249333 191929 -323988 127019 -178167 -153377
11892 -153377 -13615 -146739 -197854 -193661 -110815 146825 -144071 -240058 162025 85805 -30876
11880 26359 -37509 -231147 185609 -13365 18428 122300 136285 -190356 27908 105285 -248191
11868 -191875 -11224 -240482 -342214 141379 170191 102960 108498 -165376 53025 142074 -107091
11856 294461 -220759 -162105 -65325 -186797 -161452 -226963 -106512 -78868 53133 311734 57225
11844 -149796 146652 240958 -99848 196504 -63970 175403 -270021 -109423 -151782 26261
11833 -6933 -352757 -348210 -37042 -54109 -241042 -51330 19962 110037 -243920 -88332 -182621
11822 -182621 -226949 -46556 -249927 10875 93678 156564 -284855 136345 -50678 -9899 -103141
11811 -103141 -185696 83994 -166591 99722 153691 -41233 65331 -69681 84251 306345 -238469
11799 -35005 165483 -6866 -49269 -41242 -87683 -229917 -209389 7581 -144787 121904 -240985
11787 -109259 66063 -72897 -126669 -150408 194695 -106360 -136136 9882 -71740 -362970 79520
11775 177914 -305544 49388 69589 192937 369306 -162645 -66829 -195605 244961 -256320
11764 -140343 -229601 -362360 -107372 138171 27355 -55536 62795 -259530 -73986 -74320 -111398
11753 -111398 -22616 55629 151609 12619 -18857 24636 -24023 -235647 260186 -289552 333980
11741 51392 126667 -89369 -202207 75027 -62209 69903 80032 -5920 193280 -174492 -47290
11729 70180 -304894 294724 48328 -313942 -129606 117415 24183 -224399 -133711 -165640
11719 -165640 30886 -25074 -210706 115675 91976 127688 47459 173447 -99809 124645 -136533
11707 -110040 25247 421646 -160157 119649 191489 79857 60805 -129588 390084 223445
11697 223445 10209 -67712 -209432 35953 -110055 -167234 -13136 59937 -137291 92845 -152552
11685 -63379 35508 11362 55393 74310 -311103 -18233 -9275 -61487 117571 -29475 15822
11673 276307 -197249 133258 1808 -54850 74267 22733 63225 -169755 -8231 238583 74141
11661 256491 -316923 -26069 32929 -183092 220607 -111026 -38119 9537 -45384 138730 -35657
11649 -25722 147823 -39421 68491 62256 10745 158554 -28322 -73751 -79351 -93431 123794
11637 103108 -29996 -128695 -26380 -11864 155080 139212 89993 -218122 251352 -265077 247213
11625 -71680 -124931 89067 190683 69579 272048 -2795 -30783 313007 -107851 17804 -248741
11613 -66965 149380 364523 -80373 64037 -92508 -171769 414737 -32934 324107 -151939 42796
11601 -78226 7631 200176 -43327 201362 -128542 315879 77069 -135597 124800 87512 -61836
11589 35319 315652 110035 137365 63030 -12102 157897 155915 99442 -315605 -5780 89139
11577 -44862 43287 114628 -52437 -425285 -16448 136418 -13024 239416 60184 -78836 63421
11565 82818 329427 -229345 51526 94934 -108714 -307160 16984 296573 -70185 -73451 99956
11553 27732 62990 81766 403286 170042 -329400 159680 117104 -216075 290205 -40332
11542 249272 136059 98840 -43909 35055 491737 91176 33909 -92830 96852 61032 -18113
11530 257391 32401 247830 -74914 49096 64032 76908 -167391 -26057 224247 107655 310632
11519 310632 -58921 275176 -32604 365441 -36709 59258 235982 -191088 130800 17945
11508 329278 141252 69340 179933 -59353 158083 125935 259802 227085 149863 -48722 -605
11496 29407 204392 59680 203434 421362 294299 306213 39331 134706 313168 119110
11485 -7218 173676 -154128 378602 277772 -212679 181100 255231 -289648 348223 -64047
11474 -305371 289909 -4679 250919 99836 137034 332507 267662 21159 123031 -136678 -281736
11463 -281736 198213 52660 -20161 -5831 45020 -373591 63685 105125 23162 327922 89241
11451 436038 -48690 -52568 96544 -58083 -216244 81831 -75273 -130692 -58921 -29870 12998
11439 107870 -2820 195981 242133 -9673 -302643 177531 -95202 -13775 110659 83016 245537
11428 245537 165224 42308 245249 -9348 340864 222661 237502 225554 -180697 178234 -143597
11416 15891 -89605 -186978 22745 27295 -272733 268633 -56985 59214 334211 18824 311028
11405 311028 -200785 73707 235720 -101154 129639 274579 6173 252544 28634 -507400
11394 -16076 -348256 -273464 23825 229078 -24701 294739 163112 93231 8512 101810 -61720
11382 -93003 -181127 -3379 265343 14634 114242 220658 131515 120438 -161316 134612 68150
11371 68150 139875 -379038 -86596 106244 183166 -21425 39553 -64094 -276506 20590 -318494
11359 -97318 -142315 -48433 -8766 280409 34071 22603 -146480 135433 58028 -16054 44026
11347 -44553 -48375 -158790 -150925 10472 150067 -102374 222699 52011 -91770 -60569 -92438
11336 -92438 -142321 174390 -201026 -61966 107057 69841 -139844 79320 -67778 -389162 156698
11324 -34033 156782 -2088 -93811 -26056 -11100 77619 274183 -45366 -150282 299848 -74542
11312 -97987 -283509 -199653 -92820 196253 -173360 -26679 119301 -93961 136355 184255 -144168
11300 -248644 63934 -144400 -56123 -102630 59341 91206 -114788 -135210 27695 376393 -2599
11288 -229766 253461 -55342 115080 -131266 36787 -150994 75985 -305808 -418019 -29618
11277 103582 271540 -99994 -110969 -238171 153974 -125537 -167088 15973 -71040 18017 57511
11266 57511 -55316 -263941 179650 -188120 80047 -401006 -105374 135462 -225999 417361
11255 -41642 -232484 116580 -306755 160268 108543 -77356 -166884 24895 -59323 -235598 60727
11243 65682 -54278 61391 -108416 -104639 190803 154372 -56154 76128 -174574 371585 139375
11231 36700 -492463 -169455 -138397 -195549 -333541 -52971 -173866 -40756 -42942 49873 -171720
11219 -233831 121146 -324066 -53451 71356 -200365 -356454 245947 171099 101237 19320
11208 396700 55889 297617 119588 -99149 -46819 -3772 -462405 -180039 -439490 48533 -221887
11196 55841 -110187 155249 40146 -9732 -118343 94598 64294 109217 -240208 -126656 165942
11184 137245 311159 -14080 153830 -50721 -44530 148519 8794 -146187 78573 -200078 156389
11172 -123296 126461 -64050 -10030 -316375 67156 128427 14403 -19038 -236621 104049 -275366
11160 159927 23946 5531 -168744 -374353 -217884 50893 249699 -132088 62547 -299323
11149 64685 -20580 -164609 78278 -175621 56545 -58493 40847 -296720 100394 14768 75369
11138 75369 -94836 -94309 -80758 -40322 57601 17602 136466 -6384 -235419 -83074 53144 259973
11126 259973 200763 68174 -34713 170756 128318 87457 -35536 -1229 55415 -71350 235928
11114 -34640 598016 315404 -117762 -27750 46215 -144156 -112532 129600 286595 294630 207247
11103 207247 209936 11509 241998 472246 99450 195370 -73282 220416 206853 298827 339341
11092 339341 23703 -148602 -50255 192109 500316 -99734 -45790 -88244 451979 -238162
11081 56485 508038 28465 104498 312090 93173 180045 236153 311687 139904 360634 184386
11070 184386 259565 27271 201204 226621 163323 263367 214523 679764 340720 362504 567601
11059 567601 648616 300400 769168 688524 416079 383373 585608 377708 422556 843486
11049 843486 808611 564009 569897 666400 760092 721851 609224 333293 663486 734374 283560
11037 396197 647330 412845 686546 672609 737183 977142 856171 812795 537538 280357
11027 280357 710033 743247 512686 552601 599350 420155 469855 614539 409873 758632
11017 758632 615593 836079 674454 543950 642173 589536 538098 442639 378162 458588 707094
11006 707094 369047 583733 391357 594401 339061 466515 787988 787674 1006184 701144
10996 701144 575095 569899 605085 343672 548799 462848 855389 385747 778067 752945
10986 752945 954927 1105628 1023953 1168714 1354344 972315 1482314 1362552 1412939 1621862
10976 1621862 2129421 1789183 1868098 2461692 2446983 2527484 2633632 2753104 2060443 1906123
10966 1906123 1564876 1809476 1472724 1387296 1492666 1352949 1513977 1630551 1927687 1529717
10956 1529717 1577462 1563139 1658875 1344311 1278781 926026 1036594 420006 589294 555836
10946 555836 469300 524499 155614 458228 98557 228643 353243 600929 189882 156999
10936 156999 265170 203761 44124 416921 -65927 178873 344877 -17012 296478 241217
10926 241217 109890 5347 -90194 -195153 31910 98742 258876 -18526 220827 -13842 -163209
10915 -163209 28949 1641 110445 -16875 149610 -3391 -101876 168060 -28356 -139055 -3528
10903 4703 92832 -40961 54728 -107522 -153005 -222059 -74964 135337 -226 38458 -198232 272887
10890 50321 25403 -173396 10629 209144 -86089 -74375 255347 47214 -14365 -229107 -113955
10878 -137271 -82393 -164986 -37073 195436 139966 136247 -219289 -28778 -252844 115792 70609
10867 70609 71864 -90841 102922 -170641 -387052 -24835 -150883 154685 18016 -195070 -61020
10855 -87273 -58552 337571 259850 -240614 36022 44831 315120 27062 -187972 -5832 69902
10843 178538 -261938 -224008 -97676 -16228 -256679 -366788 114733 6667 -89760 25499 20108
10832 20108 -9454 -23029 62535 -150233 254973 60529 -89985 49368 -197656 -95721 -176700
10821 -176700 -99345 32560 -157668 180578 -320368 -140020 129653 32792 -205635 -99937
10810 -214778 -82294 -41098 159036 -445441 391888 -219876 -76649 225263 50921 257707
10800 257707 35902 120875 311038 -167286 -107722 -103259 -216601 -174895 -245589 4377 -193778
10788 -45590 -5269 214401 -75166 383528 -254428 -226675 5923 -222781 -89942 -10278 92976
10776 -108257 -163610 -132375 -147336 -111137 -54045 -91333 80644 262167 -137864 141182 -57367
10764 -189249 -414077 3975 -299221 106125 97251 -114503 -268703 -90876 -117004 153882 294545
10753 294545 -212878 170317 -325314 114233 197903 -290258 317891 221327 208731 -6373
10742 125396 115495 -114395 -271959 95527 -310462 145737 -67179 143915 -322895 -302125
10732 -302125 -7400 -297262 61805 113170 -66038 18938 -90598 -113533 184231 96635 19447
10720 87407 -159305 5361 116388 -226966 49216 -138579 -39016 31199 -61727 203417 16211
10708 31495 -78277 -98677 85331 262508 -55803 227015 -133175 350773 -152535 -166192 82164
10696 -17177 72922 -41646 -153808 270 -124701 -122518 -238111 -152096 -66779 184980 -245809
10684 -141837 97107 -361880 5314 313136 -162151 206981 35577 101559 -103265 -95807 -240764
10673 -240764 -83116 84014 -8303 73056 -9094 282844 -54087 -50615 -136503 103111 190370 -264409
10660 74829 -42515 207585 93838 -90016 -404506 32867 -432186 -29119 -63481 -20196 111157
10648 251051 -332932 -240465 244994 5861 -300253 -114090 120304 37018 178583 -176320
10637 -111915 -222037 259242 -238601 -42036 -278502 216226 76684 -27470 12838 -249114
10626 165594 -6438 -39352 -93926 -14571 -239830 -118304 213730 -175740 -187583 -118588 -295693
10615 -295693 104762 -58326 -144393 -4021 37914 -258989 -407839 35073 -241040 -411394 114910
10603 -203258 -143780 -127247 -147696 260234 97633 -128623 -190462 -149833 53835 161098 -383621
10591 -363669 -21721 -170113 95245 -265815 -115452 -66159 47148 -76639 -117324 -32409 74181
10579 199786 181695 174085 -2759 147279 -281256 -15454 -276981 -14175 246745 -235280 123510
10567 130314 206618 -19265 -16637 36777 -88761 -370748 -26026 -292042 -177523 -18895 63566
10555 -172728 -90190 227270 193319 380328 72927 -78206 -180369 160014 143385 -198190
10544 112685 143949 -174377 -334223 9887 157421 110292 -2330 -350644 -104017 82309 7728
10532 -20972 -200417 -151480 -143663 16358 10571 -17179 68893 289280 -435935 116285 344118
10521 344118 -20226 72086 168588 40634 -50531 -43632 -94084 42055 160312 217385 -169240
10509 -350711 -75363 208862 -192373 -95317 -65961 12688 -69005 -128305 -115981 -328669 -174955
10498 -174955 -38869 -7451 73865 329266 -418747 -17876 -144162 195733 -26954 -199314 122201
10486 -172351 10571 2175 123018 182716 279932 435340 505187 660103 118964 66593 145666
10475 145666 195771 255084 62617 122124 -129541 -134458 111274 -115070 327522 140133 28926
10463 61369 127374 -26441 -125092 58203 -254042 3389 -390340 854 97375 13275 12991 61234
10451 61234 -101245 -135068 -242509 96488 -130152 -38618 -113569 -137538 274674 -57391 -37333
10440 -37333 -88736 -153045 248912 -282336 -3504 293107 -23448 352236 -16543 47223 -181095
10428 -243824 113964 6939 218145 -244020 68710 -39617 -97876 -133797 -225728 98791 -232874
10416 161498 221872 76065 -233412 125624 -86597 90878 -51309 274271 -34425 -20726 -144873
10405 -144873 -65581 108827 -150739 -185913 50602 -87971 154782 27554 109657 -146309 -3258
10393 79735 38402 314742 167328 291821 295025 -279045 35514 -23125 -389929 59400 -1264
10381 357121 226405 56843 -117967 257524 226615 161008 21928 253898 160317 207197 230023
10370 230023 361979 292822 521305 620680 332316 268399 516784 54843 179755 64504
10359 264341 482465 -28105 202527 123337 149684 -98748 263426 497868 613013 487284
10349 487284 293169 220988 158283 332927 259658 322843 292240 271171 57525 674774 153810
10337 245608 186203 192856 179616 36283 162045 150567 -111313 97501 471731 -20721 -37059
10326 -37059 147792 418984 -78861 257232 492528 52856 118045 45781 159660 93756 74170
10315 74170 36625 244654 -58097 -116257 49770 -206519 -90938 196137 -156081 28021 -15875
10303 8518 100728 -247476 -41624 215094 -308679 -120742 -183726 46291 -63524 -78385 42964
10291 -61895 -6281 76349 322384 -157403 77168 -106582 176966 62910 64046 -77515 188487
10279 -215271 -327548 -29098 -166232 307 -121149 -57868 -103887 -118508 -148049 -291929 -416871
10268 -416871 70749 -65451 20208 47519 55908 163448 28474 15000 175625 -141852 260777
10256 368074 179490 342989 32494 150502 16062 -134947 213671 134894 226647 133313
10246 133313 102959 104925 -39628 -227406 28229 122134 330257 45548 -187615 192997 -159077
10234 -157297 -93474 126035 -39707 140562 279 374600 50262 -225237 -20861 -5432 46395
10222 -218839 -85760 164930 26211 -54140 11015 -321045 -9784 -117749 161049 -78384 -136813
10211 -136813 -67999 108454 -90613 -65781 -219166 -191890 -49878 -2429 -169579 -262787 -15757
10199 -115192 -84455 -169612 47835 -86164 -230686 48711 -14780 -443441 -173819 -256309 256354
10187 -8205 -37427 -53930 34824 183583 -168448 3314 64730 53450 -195185 -163871 -9548 -238930
10175 -238930 -5143 -184964 -60802 -24611 111677 -57493 -195125 10382 -160307 61554 112506
10164 112506 -214556 197240 24806 -63528 -54597 -242804 60414 -108866 -131368 -218496 81194
10152 -312799 -79005 -165549 196035 -30968 -199462 29623 128141 -47299 -79119 34563 79501
10141 79501 -101770 -4611 16143 -258176 10453 -337155 -188060 -274102 -216109 105581 200985
10130 200985 81771 158094 134032 125398 45427 -40318 -73564 -265557 199912 -116867 -209648
10119 -209648 -330621 -238082 306967 -241565 -227840 -266767 -75787 85068 -174129 -408934
10109 -408934 -57385 -142841 -465823 -242414 -159533 191396 -288897 170130 -208200 -102481
10098 -132462 -28572 -252668 -405649 -144304 -226998 -144807 -324544 -23358 -39471 -45420 331985
10086 167389 -90605 -300582 -106563 -178257 -41396 254256 50227 270275 -135643 396829
10075 240776 -257329 -148211 -237778 -481172 4782 -166915 -179195 187218 36932 -313855
10064 -156865 -36653 222523 71272 7660 -329159 -121622 93751 34085 -347170 54782 -219779
10052 102874 20401 268751 31349 -100649 -122132 -166601 -154963 300438 -64582 -287710 -93677
10040 181406 -172769 13849 -84190 -87823 -72652 -89073 -141413 -216757 -4377 -233972 -8158 22312
10027 -179888 -203555 126622 185318 -165529 -118252 162645 95534 24359 -110870 137653
10016 16242 -266336 -15645 -77984 242157 183385 114970 86966 -20438 -236567 60992 52606
10005 52606 198447 -29355 66760 50317 -210178 -37771 -305843 53702 -42173 -259299 59344
9993 -230561 -426551 -94304 260984 -161890 -358631 -22340 -136691 176014 -189978 -338488
9983 -338488 -132095 191088 -29116 -40947 214536 -74582 -127358 139600 310239 18437 130185
9972 130185 -113963 -8470 -226084 42121 -85701 133666 24922 -177121 -67234 -134419 85351
9960 -5465 -185817 -64547 -163878 -53444 -70628 53669 -18286 -193132 -67811 12528 150283
9949 150283 -69800 26837 -263909 44060 -225644 57770 -125497 21995 -61822 30827 -156892
9937 -18746 31798 97075 -28713 266262 -2902 -253171 141246 -10129 -126841 60200 -236355
9925 -67493 -168101 123146 146847 -248795 -156060 -11696 14799 -59691 -57681 -79372 -137543
9914 -137543 -181557 -471295 368804 -170538 -163939 -143283 -87902 238418 -209129 98412 -150669
9902 224933 -270123 -238600 -166630 159034 -65506 43914 -3497 -117112 -157187 -1814 -17328
9891 -17328 164412 72083 -51034 -298311 -283216 -76149 -446890 -65693 79996 -527792 -364699
9880 -364699 65771 -133479 -35441 -68954 -175014 47099 -160970 90969 -69852 -3773 72304
9868 49860 63658 -362326 48586 -328341 -218187 133790 57619 -130252 -15981 -80528 210241
9856 128560 17390 -111877 -347621 -61853 -83952 9651 19753 -10789 157200 -177568 -262493
9845 -262493 -178615 -2821 -187330 40407 -177879 82260 -24818 -89938 -30604 -243611 -165160
9834 -165160 35424 26247 -302292 -88946 -15212 17151 331390 220400 178410 -52527 -19415
9822 -213594 -15375 -489583 232752 41246 -42746 -36249 -157025 69220 -231012 -153191 -269596
9811 -269596 -116732 -79811 -272594 42149 -104464 -76408 -72178 -222472 -238921 -47673 229705
9799 -87174 168706 -343330 82288 109883 204428 25162 -14781 129545 145950 -174421 -146432
9788 -146432 -311051 -142709 -139489 -220758 -178008 -175723 727 -256288 -199750 164879 58672 126715
9776 126715 227182 -374918 105159 -17310 -159037 -51055 214943 -101051 -149427 -68149
9765 -299895 -202231 12619 -106516 128257 175389 198114 -228382 -91778 176316 -189734 -67617
9753 -197864 -128843 -365798 194108 -169227 30492 119293 157837 -256055 -55760 -171394 -16728
9741 -243555 -216885 -62627 89456 258593 -128392 -424669 231541 -200611 -16997 -264505
9731 -264505 138302 -183342 166917 116554 -286888 69383 155205 -230673 -17399 -172585
9721 -172585 53115 15327 127152 -403097 124329 -117797 185251 -65940 -67007 -74558 84776
9709 -174013 -11065 144158 -248192 43056 262833 231689 28559 -65199 117561 -150066 -351066
9698 -351066 133106 -68521 -81435 97432 -58575 -207968 -33739 -49284 -192146 -157108 -28710
9686 232826 5992 -349171 189389 -337602 -150181 -248734 -222538 -67224 -311225 -262014 303844
9674 -301121 -111724 326667 117330 96794 -64579 135870 69072 -308238 24318 145581
9664 145581 148243 217481 -137060 148928 82719 -126013 -43984 194488 110393 -193629 -219375
9653 -219375 -29081 76638 -199032 64851 41457 -136061 -138218 -19844 -273999 -222511 83 332356
9641 332356 -260962 -31546 -84371 -418510 4485 -153018 -79876 225525 2442 132138 -204128
9629 276462 -83543 -227709 -250423 114948 113638 -97737 -27026 -92109 -127479 67937 -282063
9617 -66850 95930 -133458 -112697 -91440 53348 -198217 -112662 -188604 -266516 66194 265615
9606 265615 -165802 47172 -55807 30560 -230110 -13972 -294774 -73712 -109375 -66248 -1334
9594 233393 -193695 10066 -84504 -312013 -277521 -30564 -110919 -327727 -53608 -249036 -312510
9583 -312510 -213760 -42578 71845 127879 207409 42644 112357 -329378 -96679 -69302 80884
9571 99751 31313 -42263 -258439 -14715 -122320 -116991 -265374 -119375 -449009 200698 172946
9560 172946 -341578 -70575 -457141 -173839 -358358 -415466 204400 -73827 -21435 62659 63183
9549 63183 120097 -177010 -110068 241412 -147323 -164929 -7274 322493 -197850 -134886 -52467
9537 -247277 106342 -196397 -352762 205704 -21373 -527 -19076 -360019 -38401 68182 -420781
9525 26346 -91341 119324 -126133 115965 -433673 92442 33300 159470 -11300 -166784 18397
9513 75200 -6075 -363002 44693 -5181 3504 232685 -122005 15513 -152268 251965 -321688
9501 -192761 -21817 -160206 20758 -311152 -154136 115975 -143682 -7683 179454 -116313
9490 84996 -29682 -170774 -190925 -254579 79758 -215766 -78267 -338565 73660 63666 -132169
9478 -10044 -12942 -175720 -426066 -212362 -256289 -231837 46565 71132 -127862 91542 -170249
9466 -82598 339612 -156469 -167882 -148014 -363345 10533 -65904 449571 -107693 -320031 -109561
9454 -33833 213224 45962 -106681 -250763 -86979 14900 -141827 -54282 -53506 218314 37169
9442 -174383 -35553 -11918 127262 -27792 422486 -97993 60147 -10449 -172035 -166565 30760
9430 -10310 -41734 -286757 -97217 -114064 -59618 -312572 -337476 105355 -325802 5120 -49351
9418 30480 -11529 -398239 -77883 380078 138684 -295809 -209778 316628 867 128553 -20911
9406 293077 -177930 -49262 7173 -96171 20106 185568 14948 -101076 -121520 -45981 -23669
9395 -23669 -77123 -190731 -69201 42227 7965 210458 -88764 -17069 -57491 49670 -20321 -93106
9383 -93106 -45258 -183904 300185 -25974 -130497 4707 241488 50352 -5453 -348371 85587
9371 -230063 66501 -232376 278101 102075 -112544 -48890 -3800 87012 87782 29800 -80452
9359 192928 148524 -136648 -293895 -364451 -75462 -71251 -72624 3690 -53616 66492 -208192 50261
9346 27526 44263 -88045 268176 -53880 -36326 -166751 -347712 -62135 207752 -269504 -216666
9335 -216666 51188 199555 -347811 -162035 -61638 153508 141477 -45357 -293436 495035
9324 -173311 -56140 25238 -134738 3274 33879 97168 -86055 -103669 55990 -86479 70225 -169380
9311 -91638 78089 -278307 -28365 72021 -202106 204217 -148427 -300733 148637 -61512 129125
9299 149273 -73758 -342662 273530 -208545 77997 -289645 -102069 -90107 -165916 -93113 -57723
9288 -57723 -36550 272565 -125706 19534 -478 -123430 272389 -5532 56058 8624 -267319 11572
9275 -306772 -129611 -274506 -261294 9076 -4899 12869 -215676 97151 33258 -249995 -313624
9264 -313624 -259823 -78434 -285472 -181165 204644 -272878 18052 92942 11969 -234578 -284860
9253 -284860 20318 -45664 -479731 -271049 -264306 -21077 -120602 -230015 44321 136832 -258575
9241 -84752 -364112 -116115 -206463 -267470 53493 207151 48363 -89186 -262176 -18505 275046
9229 -266983 -106350 -108901 -31989 -210856 -34216 -81113 -45585 -98216 -168089 -228747 -23138
9217 185114 -230725 -199269 -237370 -143716 4786 -35237 113715 -26939 125837 215241 107726
9206 107726 -200202 45940 -93471 -37040 -213378 -309630 -145924 249493 -85410 146437 -80788
9194 -55179 -162082 -337965 -245719 -218015 -282942 31557 -170749 21823 12085 191425 1042
9182 3914 98861 -40588 -180601 -347406 -45439 -395351 192990 -102702 -38891 -211009 -13252
9170 -412614 57154 -6970 -223429 21881 77208 299126 -61104 -181963 18614 122195 -34254
9158 -140548 -53147 54536 -196738 -45574 -68747 61606 -41143 -32051 -221273 19737 215148
9147 215148 -164468 65389 -4036 50216 -48759 -61604 35823 -134567 -135832 19214 70868 -26597
9134 153454 -73474 -241571 22243 84897 106508 -176989 294678 -181390 -191319 -196006 78753
9122 10642 -135322 -131996 190177 60202 -305339 -129844 -262989 -318924 -166542 -470153 294837
9110 104528 80899 -62695 -117781 -425169 -128802 -58966 278629 -307745 -96865 44889 -26248
9098 -350470 -96211 36468 72895 78132 -648215 67642 -139767 374192 281886 96446 -136484
9086 -4144 135990 -118432 -194811 155055 262275 -321709 -112540 -285827 -154246 133059
9075 -52609 -5755 -199320 -169399 -11493 -136830 58056 165253 227202 59115 -128816 26429
9063 231281 -238490 216848 -126870 86944 -93426 135911 -253873 92542 -3308 21962 -279714
9051 65781 -539 -180367 56752 -88546 130262 156674 -258247 162104 144176 -33518 139928
9039 78005 21430 -101791 43388 -225060 -20028 83934 142082 -137444 -209865 -44750 -164746
9028 -164746 -266737 27998 -168906 46366 25004 -338610 -80704 -168535 372043 353852 186176
9017 186176 -34356 47689 -66012 -223971 -56048 -406749 -230079 29868 124961 140219 -77919
9005 10009 227849 82579 -28934 -224031 -237943 52253 -93346 94178 -278086 -71637 77426
8993 -141337 -124559 58563 62302 227889 -16405 -219357 135775 105407 -257545 -266808 157059
8981 -251281 156014 -55946 -60194 -511953 35258 -144944 90431 173195 77491 -235264 -72565
8969 -380832 -51356 -46850 77368 154685 -404835 -213041 113787 -262463 -59616 -19168 255367
8957 -186403 -219540 -147184 -128432 -245366 128280 -302768 100990 -148410 437901 41482
8946 4067 -32342 78395 -211271 -284514 84476 79915 -217270 -127427 19343 257760 -48390 -218442
8934 -218442 51516 99407 90534 86502 -388030 -75145 5943 -114535 39750 137393 19242 60830
8922 60830 323888 265367 187725 -313073 -5573 -74687 -123479 -202909 269591 -319146 -370172
8911 -370172 105134 201145 -47896 188145 65831 148275 -114828 138811 332593 -182096
8900 -60678 -216738 -123834 -7525 -337875 116152 -245067 -112739 -53550 36215 -9331 -109434
8889 -109434 -42846 31613 -121806 57769 -304259 50496 103320 76452 -406565 20985 -106578
8877 103299 -37342 -77326 266143 22888 88724 -77418 -118727 -96270 -30093 -111908 48694
8865 -83458 197563 -421088 -90796 -390966 25031 120556 -88883 138314 100796 9293 -234422
8853 -206104 -13966 48610 39615 -350375 -142565 -62848 167535 63291 98389 33369 -154086
8841 188381 -162584 112141 273325 -79966 108082 -176512 15662 62604 68202 -138134 -86875
8830 -86875 -74403 81529 17654 410158 -38837 295061 104006 -214726 158305 127744 -180140
8818 -175671 -148519 185241 57663 97217 256595 -25905 29461 -358729 -79614 24476 -365210
8806 -137015 -400606 199421 -202413 -40800 50007 77867 -151358 -47817 -439892 -212418
8795 87244 -139103 182967 53299 100755 -121059 125711 -176220 79268 -519693 -149505
8784 -70493 -257448 -71713 -127111 142315 -139157 13486 77141 90139 -351474 27699 -84391
8772 -144070 -120478 -56342 89975 -132901 472749 139227 80995 -140630 -85914 -364242 -204414
8761 -204414 -384183 -293078 212140 43587 60050 90446 -327984 -184535 -279810 190694 -84086
8749 -65180 49398 -93212 -419684 -291604 -160661 -80794 -189462 -331332 -21132 -376357 -110112
8737 -77852 -15710 6737 127511 -200765 -288029 -253877 -188612 138263 -137011 -85794 133680
8725 -194864 426532 186868 123148 14789 -147327 67710 -4570 10596 -187036 -75172 -218710
8714 -218710 129990 20304 -86259 -123667 -190274 -53140 -138129 10585 -264199 -39470 -105361
8703 -105361 45226 83682 -63480 82622 -32929 223694 116190 -134748 -294130 -83459 -46131
8692 -46131 80944 -487230 46513 76135 -109997 5466 10015 182832 -232072 -259619 50321
8680 226336 62117 31028 -121303 23199 375821 27426 2479 14343 -280755 -28247 11305
8668 160531 -19987 200534 -120127 43850 -258602 -28025 81450 -220506 217474 154825 -104708
8656 29534 -34945 48968 -300451 -267633 -59225 -73311 -150266 94210 -410220 -197000 -179203
8645 -179203 144867 295002 5428 -137462 42786 138676 29056 271854 113930 6268 -278666
8633 66159 -173372 -25736 2879 -114492 -132131 -103083 -112227 -165334 83716 -109811 127012
8621 203252 5221 21714 -230234 -298139 -390272 38669 -8666 -180222 -189358 -219013 -217736 311826
8608 -221388 -127544 10460 -195184 -163937 -78190 1990 -250121 -45797 -140736 6069 -129187
8596 62976 -399236 -29198 -210470 -237604 -103220 43772 -221219 26886 -216393 295169 -72343
8584 -155654 32658 36068 -137951 146241 -58571 141614 -212193 -169944 8329 -97879 -2471
8572 -22545 59685 192397 306624 190638 123165 16599 -190952 -97970 -122968 -29226 -29097
8561 -29097 -26456 -106863 16814 -71084 -163345 -156992 -237969 -298543 66923 142475 -425185 218631
8548 70452 -285533 -122579 278780 148923 -464 296161 -171514 82958 207241 -226679 -435104
8537 -435104 -226621 -342423 -187425 57410 62579 -70229 -143406 -377092 -60146 -220093 152004
8525 144543 82036 -255310 312994 -98226 -171604 81334 152305 -184226 -85858 -100427 93950
8513 122108 -27974 -113892 -59390 -402680 314777 344058 -8505 -193480 -235207 62023 358114
8502 358114 111184 179126 -262217 44385 -493026 -162394 192674 -133654 -52920 -357345
8492 -357345 -14709 -311564 -195706 -11351 -87903 -27906 -167805 88090 -67356 -204742 120096
8480 -199396 -37593 -244869 -96452 134655 73023 -56845 7310 -139107 -395506 26973 285866
8469 285866 -169034 -231262 -432866 271034 87372 -41862 323 -241088 17321 -82231 -97503
8458 -97503 -171104 -99937 -241581 174958 -9252 28176 -223440 79548 -70517 -383731 -44883
8446 -149565 331547 -108202 -193805 180845 133542 319326 -5886 204136 -74381 156597 -302458
8434 103829 -109077 -82256 -319269 27842 254213 -180963 -429470 36838 -190315 34975
8423 -167316 -24392 -220697 -172126 86125 -236526 -417647 -110259 270519 -107853 -185370
8413 -185370 -222436 -128923 -348080 -11034 -86038 2051 -59722 156907 153367 -202840 -46425
8401 -471760 -25290 -23616 418698 -9714 -221854 151950 117549 -17934 -8290 -2439 230347 -589556
8388 197578 301722 -107598 119645 -139365 -277317 110745 87474 36123 89763 -113326
8377 -210315 270875 109172 -12406 -296135 -205820 -17539 -205985 253541 21658 -163485
8366 -111106 126242 -72648 123275 197636 -172977 -26248 -241954 8245 -237937 -100314 -26647
8354 -223552 -299140 -42413 -40729 -259399 14932 81186 54271 -101374 -260087 83408 -89553
8342 -270093 74619 -68793 -462923 190806 -14512 20480 56806 -227383 -240192 332008 176169
8331 176169 -26458 -72613 20154 78752 -224548 -410289 474919 284874 -89026 -235731 -26033
8319 29107 -193723 -151182 -151940 -191682 205900 99109 -26577 -35626 123364 -123538 41129 -5084
8306 -193883 101537 -316943 -376860 -37687 -197970 -298402 -234846 -72607 61429 -242185 26837
8294 263129 -71563 -93064 -333344 40913 295936 -167401 -70806 -12782 -90424 241277 -158712
8282 -82933 -138179 112666 -94133 -119037 195297 -224160 61119 -85188 -135363 147646 12694
8270 72513 112869 111260 -90269 279704 39500 91130 -96625 195060 277341 38167 256937
8259 256937 -382911 101724 130909 95065 -3785 -180023 -201712 -391478 -81628 2597 339198
8248 339198 146540 -364037 -623952 -275896 170018 -100153 154118 -241054 -154976 -131809
8238 -131809 -285528 -55021 223814 19629 -141215 110053 -190669 -195011 -129818 -80593 -52528
8227 -52528 -282201 172134 -99939 -114856 72256 -207439 160926 -71280 18274 -46134 -239118
8216 -239118 55116 -127789 157951 -50110 -117711 252446 344610 -283818 -119418 40789 -180818
8204 -170221 21411 -41057 -62973 17781 -22604 111418 -29439 95861 -11604 -77996 -50199
8193 -50199 85795 17125 -378963 7896 -386421 -14373 -77100 -75147 -117504 -18877 -72833 -86563
8181 -86563 -206079 261207 -198501 -23282 -31089 -156770 -21112 -193493 -31017 -87282 57562
8169 -52052 14473 -186893 -28957 77424 -537858 -132625 -100795 137570 -255011 157318 -75538
8157 158752 305769 -85777 -313153 -138294 151835 -169425 -69545 318033 56539 -116766
8146 -279363 -52197 -209587 67669 24811 290547 237342 63291 -169006 330988 -300119 194098
8134 36575 -37777 -172522 -23944 -562365 -386407 64922 -404753 119782 -70609 -335804 -195225
8123 -195225 -149475 -230842 -432474 -1242 -163113 -215743 226998 -212560 -177776 -230939 133303
8111 -203079 -142637 -170359 -212841 -320931 27737 37316 -279365 49129 -122496 229856 141886
8100 141886 -14773 -231257 -75912 -216015 -62568 227871 -1119 -153473 9762 -265210 184125
8088 23756 -17663 150301 -277035 296217 302775 -398202 -66143 -95270 74677 -223644 241410
8076 269521 78889 -48333 171706 -36220 -51836 64857 290380 -118509 -40210 111748 239500
8065 239500 -109568 -49422 -43262 8198 -107827 -86466 92587 -41778 113337 -62990 -12752
8053 -43344 -168330 -150008 92221 -52539 -49146 -230665 -113833 -246345 -28358 -94016 290941
8041 -63124 -49185 -242409 32886 -92660 -66867 207389 -305473 22099 86517 21898 371441
8030 371441 -152808 -332283 54605 -193737 -242935 66804 -17435 -214974 81735 -247679 -44153
8018 64771 -320732 -214817 11803 115019 -105932 -161029 195885 119018 -28476 -82049 -104412
8007 -104412 -29551 16316 -162973 -39885 -8415 -132471 64115 153169 176733 181511 -130619
7995 -168299 85473 -20444 -50628 -39969 -54672 -16161 -402335 -48532 182409 -246334 113348
7983 -208800 -258354 92308 -514449 23310 16632 -48002 -177436 112187 46894 -69390 146136
7971 -19908 -226124 23455 -4187 23340 -182798 -13696 333538 -179006 25994 -164037 -81535
7959 -189140 23063 -103122 -158363 -23791 -511698 196467 194676 9991 213831 -133515 -38454
7947 -122871 -213255 155949 105917 -50684 -171710 158973 95866 -21837 197355 131286 -62382
7935 280826 102807 -317065 20497 -159544 195395 -146257 -105376 -80044 -115829 91985 245533
7924 245533 84535 -319498 -189615 229607 70644 91264 353906 -249665 -59714 -182417
7914 -182417 36508 -293129 -251564 115120 270896 104162 45222 -168048 191205 63225
7903 -168631 -21370 -259042 -122617 143488 4151 107153 -174997 42025 29141 -98610 140219
7891 -5128 199673 51801 -156689 -236292 171271 -189853 -436622 114070 -48536 109822 178695
7880 178695 -69290 83348 -204619 -40295 253856 -134752 263358 198784 -289533 275923
7869 -57133 11827 86018 97695 -121453 -187159 -95524 -160328 -281621 24765 -169315 35192
7857 351 -330129 98980 -63436 -40647 220743 -68799 148437 113727 -235576 -67305 -68406 107183
7844 82536 -138100 -119024 -155003 47728 -6470 216023 -118114 8989 241163 194532 -290321
7832 -89306 -27609 -78505 -244503 -181469 -57562 -258046 25253 -262385 -355066 178310 54074
7820 -53041 41537 353570 -136454 -12270 334973 -279777 -5497 -181344 -410289 131310 -249001
7808 -37007 297040 -26385 76603 -72256 -280082 61866 -162038 -211682 187091 -83168 -172129
7797 -172129 136146 17161 -226381 171798 -38201 94175 364041 -126779 -238671 252138
7786 271975 -306225 -40406 -21997 -239016 -84126 119699 -214186 -59826 -239057 -244299 -55606
7774 -73151 -212192 222537 -60502 -317789 -94952 -138081 -291695 -62753 147524 -22078 239651
7762 123700 128932 238886 -327287 -47795 -37815 -109792 -133818 -42153 17786 29614 26958 -53247
7749 209693 50303 195529 -216041 41922 -121897 -3944 -36810 -37020 188495 -299544 -36975
7737 23201 36021 81488 -110223 -114940 178908 -159009 93127 -92761 4195 -307452 67133
7725 46459 -140604 -179484 -114710 15407 -293337 -34258 -49305 97864 -113598 -180709 109707
7713 -71292 -157942 -169425 -82432 -286013 -58790 3176 152270 -156319 -80753 133397 -79882
7701 -333121 148333 152638 35880 175144 97096 182295 -111271 120534 -85989 -308411 31655
7689 -76467 -85105 -373756 142624 -43475 -186145 9454 -2537 17640 208206 -103579 -185637
7678 -185637 113967 172972 159575 -175000 -178316 136105 -72967 -225497 -9156 105405 -205096
7666 8710 41916 -141270 154910 267675 -212000 -37175 -36893 -347477 -107122 -130210 63922
7654 -195175 -205522 205643 -29527 -27741 61491 -160419 41329 91492 130878 87531 -367580
7642 77880 -59822 -155907 -62693 -5730 125621 -157176 -144220 -35287 202158 64145 118176
7631 118176 128710 -58260 69206 -259807 -140927 -50336 89477 -153455 -254902 414932 -105312
7619 17456 -118846 340190 -148633 67147 308124 -333331 -68079 150746 3538 -229102 4832
7607 117636 24431 -223832 153418 -2510 -51070 -121813 14035 -21020 -395616 11507 307565
7596 307565 -324431 114272 -38632 -238651 -340147 -382502 -134867 -157366 82143 -172889
7585 -29869 92715 -126495 125068 150798 57997 113485 -266548 -96734 266688 -65885 -210452
7574 -210452 -23507 359979 -61484 239468 -369629 5131 -102178 -15656 -19337 139085 -326555
7562 58879 -167827 -66873 -202106 301142 -190112 -147732 -186282 -77433 -431221 -409722 227302
7550 86816 168702 -145563 -49299 -229056 -414946 -379241 -338019 300578 45096 107868 -82009
7538 -10429 302570 -46471 -216273 63273 140507 -8274 -40919 137267 136447 55454 248101 -181832
7525 252285 -237450 -223531 270376 -33614 -310103 4789 19579 256998 100193 -190868 111240
7513 -107376 -38880 -286260 -76879 115170 31089 -129527 -347870 -146287 -21916 -71854 -126759
7502 -126759 -24382 -18391 170571 -311504 -80191 -116965 119675 -18680 -314527 -307315 261131
7490 121245 114412 -204734 -249189 63665 -154129 65220 -39914 -118504 -23813 -260406 -128679
7478 85974 80624 112260 -247882 -101645 -244546 417486 -70674 -21115 85359 -35038 11477
7466 197904 -88430 -6671 -143406 -64385 130556 75628 -35965 49818 -99933 -276851 44578
7454 -18263 -33211 -299692 62387 113578 -240391 -2413 -90770 -9265 258947 -86834 153369
7442 94796 52599 381940 -117829 -302793 -16090 -115620 114138 -128813 59502 -114978 232330
7430 -108516 -112777 356960 -39452 -104997 -157426 -35162 33876 46467 30623 138043 -17182
7418 -16824 -141629 -530060 115774 -80865 117811 81285 -70257 167672 -167741 196849
7407 -97496 31369 -274999 -55568 11717 -265948 -22430 -121124 92451 -191113 -100742 -103520
7396 -103520 122122 -44943 6750 73283 -9670 -29453 28943 8983 270621 94265 -45937 141214
7383 -41050 240659 112280 -24833 -180597 -127525 -66654 247679 -209261 -168457 -140273 -82021
7372 -82021 -195153 54664 -268140 63434 -244072 -194763 -183510 190523 -312749 -391429 -60204
7360 -148549 92549 78750 -100904 -154772 -27377 58929 -263434 -332129 -92715 277755 -93755
7348 -249743 469426 -34409 -22589 -27552 -50316 -253921 201475 -180419 13981 -58113 -350681
7337 -350681 6395 -52371 -76508 -64388 11727 -169658 -242790 25342 -4917 -92569 34183 205331
7325 205331 -119572 506339 31037 42596 -16175 69026 384439 183268 -148532 17286 -43422
7313 77355 -91768 278183 125904 -206517 64049 -244793 -301563 -155149 -106369 1224 32315
7302 32315 220680 144947 157082 33230 47088 -253185 -73163 205575 -206852 209342 -15544
7290 66118 -17978 -184228 162113 -103810 -447981 -79683 -41008 130445 -425460 -150691
7279 138492 172744 21428 9906 174228 -156960 76278 54075 -169883 29859 -40711 -322003
7268 -322003 145444 -228627 -130947 -113796 -97739 126401 -119761 -118513 -44844 -322386 271941
7256 134497 -276428 -168988 291870 236241 12330 245237 13887 -144384 50215 -120992
7245 213514 284940 -426387 110587 80590 14114 110999 304098 -118890 -36580 178995 163961
7234 163961 345243 98918 39477 250760 -14517 44706 -122320 -144095 184598 144534 35527
7222 107311 -27961 42313 463126 -51705 99456 -56508 65248 -166829 -524190 56742 -2772
7210 -82236 -29449 -242457 140687 52048 64775 309545 106850 -2468 117129 -14112 -204234
7199 -204234 -171189 -322065 199075 -41596 -210058 210394 -22688 -150581 -36551 -325117
7189 -325117 -65141 -175520 109296 -481760 -69840 160622 -65089 11616 -317636 -67845 16411
7177 93706 -42666 116139 1612 152531 -3657 -219850 118112 -120081 210989 144739 56015
7165 44469 -60494 -10366 -15478 60423 149446 59817 226780 106671 -26150 141407 31473
7153 101216 -296496 -258550 137347 121279 -107058 -343437 -230275 -126692 -234833 83923
7142 391773 68106 -178339 -261542 -94277 -577214 82986 365451 -242738 175907 -113210
7131 376556 -268346 -245271 23895 -211215 -48926 -227150 -214870 148091 -112839 -86922 60564
7119 87732 209222 -171885 -95588 -47369 71180 -24761 -18806 -88647 -8000 101061 -148564
7107 -394443 -327646 -82349 -53475 -83724 78236 33597 63013 -169591 -10561 -158648 -92118
7096 -92118 102690 126074 70734 298117 35298 -55943 99266 -187946 58548 -271108 -90713
7084 -29192 -12448 338573 -116372 104088 -211461 -128910 -198011 67772 -66772 -21266 171287
7072 157769 14528 47632 190367 13635 -32438 -150132 135616 112760 -162796 -165399 -39151
7060 -130897 131391 138316 -70797 -217741 -98490 -128455 54018 -39316 -180129 -440059 -343712
7049 -343712 -33603 -201214 -37337 32125 -203169 52169 -207194 194316 96337 79430 -103472
7037 -185639 172004 -260525 120846 -133894 170160 399130 21573 -61465 -279357 -151985
7027 -151985 -2087 165953 120781 183745 277782 -160806 62148 169701 61647 32780 104680
7016 104680 42318 300967 202315 186260 251102 -212531 -30357 176147 -114554 -73859 237683
7004 -200428 -163262 -217258 -84114 85982 -303344 -94515 101936 -89547 -59964 -53703 -248497
6993 -248497 -70392 -119847 -154183 35383 -51923 90442 319272 -10582 -38454 -74087 -24221
6981 -140747 -158149 265054 71828 12503 -97830 -69486 194063 -279214 -179610 -51880 157544
6969 -172304 179387 155857 -86541 -12463 154311 -30883 -181580 -90610 -75530 -6147 83594
6957 55924 -176524 -276238 -84319 -165766 40863 -30141 160136 52834 160353 -125227 44720
6945 -290792 8707 111461 75996 -132608 182362 105006 255949 -13302 155637 -12460 161067
6933 -55261 -235205 27064 62200 -35067 -71997 -265821 -104352 -96901 -169734 -149845 11649
6921 20040 349646 262395 -91858 81463 244964 5351 20714 157512 -170016 71484 143113
6910 143113 60073 -51434 -105020 -123615 153512 117106 44345 -242810 -135659 107704 2892
6898 -290737 -6695 -90322 10829 24214 -22177 -20311 319217 101742 265291 7895 -162006
6886 227828 43879 128120 1874 -156851 -202849 -956 -183407 -110255 -78508 -105372 35330 -4852
6873 -65068 -317911 54950 70402 -158105 203926 -45103 -206901 -183411 -167246 -15314 -119128
6862 -119128 -154190 -154338 307011 377776 -345 -71805 -98735 133593 893 130841 -66857 -124468
6850 -124468 -195095 109599 -300255 -185314 -48972 -189619 -17854 -223041 -164440 393960
6839 106553 313993 -177432 181118 129018 -24400 28028 -93599 -18148 150760 -345582 -100933
6827 -102300 60956 -160927 -17550 -46475 -58691 -94351 8737 -184476 -74980 5602 -163263
6815 -191461 -146434 -19837 -195694 7850 236678 182432 -127521 61306 259776 73009 80443
6804 80443 -167201 37629 -154637 -142814 144040 88070 134318 107025 189158 104595 -56929
6792 -96988 -129450 27587 -27801 146004 -338894 77804 670 81180 -42664 -76725 36541 -263910
6779 33642 -238782 -171201 11671 -133118 66546 243284 351434 28960 -112314 418941 117859
6767 -59482 -116878 142709 272443 -51578 7343 -97756 -76506 -208019 45970 74576 75245 321058
6755 321058 187013 -106844 -7900 60654 -161625 148248 -18156 201458 -112786 -84223 2631
6743 -110670 74772 -192847 -373683 -188308 148655 -404536 131893 -368896 315812 138756
6732 -182839 254464 218092 -85247 -104815 -179362 -98800 3415 -35663 -82401 166641 -405033
6720 33031 -369394 124 69822 -110924 104552 -13277 -124381 154894 -207007 -21663 137716
6708 -151135 187261 -113555 -5453 223832 -101171 40302 296829 -102357 268337 -40914
6697 -312592 -76433 -104259 -36876 -138879 -56905 233681 -23167 152065 -8424 18705 -193983
6685 -188928 -61339 -110631 -177126 67451 158295 -335545 -260967 -110482 149078 -265450 61043
6673 97358 -284199 -77577 -159651 122428 41680 158886 -332315 -151659 -182862 -260534 213489
6661 -45567 38429 132343 -243041 -76085 40668 -327649 33067 -22702 -120687 54620 -325248
6649 -233280 -178861 -240476 -279262 257189 -32275 34782 166735 19052 406355 11065 -70746
6637 9061 -472793 49742 43367 -37005 305677 -65129 140531 52806 182723 58010 -165151
6625 -65587 -224054 -145022 30078 -192726 -209873 -73985 175542 -47931 89644 -21472 -241043
6614 -241043 75377 237495 -50824 -142636 426174 58881 -18822 194515 228802 99107 -117455
6602 423368 -210833 238611 -6903 46012 2675 7383 102268 36217 -97104 -54828 -36679 223713
6589 81731 -202569 205342 108279 -126340 71113 74220 77973 -275364 -157812 -24419 59344
6577 41985 -376357 -78953 11193 -175186 -54475 93878 -178769 40960 -210515 -11712 -35211
6566 -35211 -273611 215527 143779 25842 -45781 182602 155710 -121660 66451 -248963 103201
6554 -385441 586309 253059 -10284 -83463 -91490 10387 -116559 136566 130567 -346203 -113285
6542 -85708 -106390 -140736 -192220 -50647 208485 255622 -5863 90253 -139481 53283 173842
6531 173842 3373 136525 -35345 336382 -69989 -40658 -206246 -243994 -114907 263785 276623
6520 276623 -163230 -206332 50884 -209730 -128906 11352 -5704 -64206 -67658 -196800 -181015
6509 -181015 70001 257977 -104896 -71103 -265291 -22329 -106860 -130404 -143570 49058 164539
6498 164539 5701 31129 -326494 -1132 -102770 117268 246601 -21483 -342053 -210171 -79459
6486 -22205 -223790 -175714 143091 7869 -201365 22311 97770 246133 181014 -40779 30136
6474 92226 76915 108701 -144741 33412 263363 -83630 -269722 -140324 -37242 -92939 -25847
6462 -171945 -12833 138010 -11323 -177460 -75347 -84695 -104411 42564 23822 59060 -104791
6450 -257228 -57506 -61307 248395 20381 112244 -199895 135 -48261 16269 -60849 141881 169530
6438 169530 -57356 258188 -97205 95746 -147550 -56168 -158477 -160929 -59988 73333 374896
6427 374896 -69406 -63626 47066 152704 86553 60945 28751 -60364 -93685 -200559 -333677
6416 -333677 -95487 309395 -3080 -120565 17746 -375230 225867 -25309 -42606 5865 99552
6405 99552 240081 -178044 -87578 91530 -60937 -28797 104462 -92849 -226021 -102451 -97115
6394 -97115 128049 164761 -352196 -115271 -195782 -346771 166937 203383 -83548 -63388 -81808
6383 -81808 80821 -208895 -128661 -240409 -555990 177759 -130842 -126797 132731 18608 288048
6372 288048 369934 -147700 20951 -217979 83279 425746 96763 -102430 -144906 126395 -4952
6360 285697 -8600 -111331 8343 -147305 90094 -212821 225335 37797 84932 67386 151912
6349 151912 -300361 101228 -286222 261612 -21309 220291 -170737 67801 188448 51358
6338 -232095 62843 30976 84871 77018 48799 -3917 -16417 -101726 -40434 220349 450944 -74138
6325 -151218 -32446 487219 162138 -119273 -184840 100347 -314391 -18782 -140808 -195018
6315 -195018 -99183 -102833 -11158 -206105 -225723 81038 -285320 -62411 -284458 -234518 22431
6303 27429 -127363 -228037 137846 -159572 173877 -45659 82753 74980 72194 12132 -69039
6291 -88333 100926 -118026 -31907 -116413 337897 -143027 -216134 -322551 230541 -47164 61806
6279 -121040 -314196 -160142 -111993 11793 240594 -99206 -51681 -152809 7787 133887 66925
6267 -5039 343250 129844 -76447 -257270 -133016 -230771 22736 -422692 -20673 -123466 -64912
6256 -64912 110132 60739 -107067 71492 -17806 -12644 104678 125084 222255 -72994 59051
6244 -41039 90941 66339 403210 -388381 -356009 -282428 84890 74342 42044 -408347 214196
6232 59973 -262124 361430 32269 5 405744 176098 -33633 -135418 14757 -4977 257428 77207
6219 -77872 172884 -321263 31631 -186175 -5740 -103438 -46637 -132804 -106354 -234407 92479
6207 252390 -310139 6349 -206811 -15561 255385 -350495 -46838 -78850 -145859 234662 -295424
6195 58375 -21319 143437 90170 -147676 -109797 -210693 -73871 68200 -67385 33718 -103058
6183 -160527 -120926 -27469 -119877 -36096 -141076 -143608 80767 -132715 61769 86318 -174073
6171 -175657 -41259 72579 149680 104165 123323 -228071 321458 162241 -31198 50685 114822
6160 114822 -573 -251639 -127523 -33653 75833 125677 -79690 -87088 -122010 -72487 93442 64850
6148 64850 -152618 -247239 -178506 35037 80591 72210 27846 -52859 208702 35853 153356
6137 153356 39215 -2091 -123106 -81765 351905 -334858 47486 148911 -81388 -137712 271647
6125 36545 -139776 204661 94118 -186199 -18351 -33043 28426 -38944 131509 102660 -80372
6113 -120086 -43843 -146010 67698 -169224 -121027 130652 78203 -60560 18767 60026 -60337
6101 15236 412911 -30411 79942 -1993 -298049 41956 140959 -159695 144385 357453 -265189
6089 114223 -153248 -31963 -292382 8585 -62907 69153 55027 -121958 18864 13140 -196033
6077 30589 35680 145579 156613 148509 -183371 -20339 40185 126697 -103217 -45503 2343 151793
6065 151793 127834 -261334 140469 -40966 11725 -61149 106903 187839 -72745 -58988 83948
6053 425509 69616 -273000 178787 -94015 -108445 -128018 -111074 -18012 -310748 -368207 -34750
6041 -94148 -42693 22342 137781 -113354 71484 193100 176279 44406 -89140 -146673 56369
6029 -161449 32321 238005 148748 -19556 235296 94207 186828 52235 -123334 -43537 79330
6017 136828 -7707 231865 -226294 226565 -68227 -25288 -142818 124201 -368835 -280095 125556
6005 246172 -98376 -25241 -135098 -173422 140954 84790 139310 93536 53684 -88559 -25434
5993 137300 11865 63998 9627 -157240 -124488 -224369 194382 116829 76034 -304123 6976
5981 -3879 -30186 -213592 84860 -109113 -75841 -144210 -220036 -90733 -515145 278919 61394
5969 38592 248119 -140405 209447 -65546 53774 53315 -145887 61861 -30264 -155081 146932
5957 81948 197158 349793 -155873 -210568 69769 9544 1136 -28008 -69098 149703 -25211
5945 37589 -6891 -49646 333904 167315 -131079 37988 308655 315465 35741 49072 60784
5934 60784 63748 347782 166674 72199 83984 -70503 -7751 -350573 -76959 -196479 -32360
5922 -21750 62306 -191959 220174 154924 71483 23803 -185995 -103289 208526 139901 158289
5911 158289 252591 464758 262964 -278089 -157020 62934 88745 -53946 -165212 -64441 -61401
5900 -61401 -309479 -71843 -92173 89206 -87087 -408193 -181200 83587 42850 -457946 58399
5888 -188632 -161109 47576 72372 -76998 42216 -36221 -212212 137819 -99448 -216236 -157134
5877 -157134 -195568 -140951 856 120161 73532 93633 179677 -70708 -228002 -78126 160550
5865 -160047 -176886 -9041 225963 80996 -79990 -95478 206295 -10147 86072 67804 25246
5853 205278 -33938 238491 -68753 -36203 -134132 -175638 46991 -358148 116102 -267741 276948
5841 -322607 -134991 166748 -101109 178972 107073 68754 -146750 -157326 -218252 -185235 100317
5829 101407 -13915 -114904 50457 104290 -176386 -344196 -200849 -19719 -190727 51853 -232222
5817 -38949 -123432 -80273 -55265 -101673 -92143 -126483 301957 123007 -46957 -195438 -241022
5806 -241022 -30353 -77493 -42231 -60878 -52692 -159161 -268151 -71398 209899 448311 64339
5794 -98135 -286941 172334 6663 -94183 325627 74537 -177547 -347301 -28524 -94304 29848
5782 135878 216481 -258704 -81879 168267 1476 -402544 -188932 161970 255108 -218311 -32088
5770 -37532 59832 -250568 -217475 -95744 95393 142325 136563 199899 198516 -123785 78240 246931
5758 246931 -29491 -189091 292431 -240902 -33720 56894 70067 46601 -5779 -61008 -245796
5747 -245796 -56910 48270 202577 287627 198352 -104826 -229085 -27052 -112113 -204976 -257387
5736 -257387 -69420 54535 -48717 237908 -119383 40138 118780 72157 -110971 -93353 -87281
5725 -87281 43985 -224471 -1855 202135 -75550 245349 319 47981 79736 72358 161469 173956
5713 173956 8310 125004 90498 207449 87349 185498 112504 -163209 -9765 -231917 -366422
5702 -366422 -91426 -414545 -186656 -77428 -98030 203607 -162109 -217899 216319 252078 -245
5690 75571 188167 -355085 39459 303514 -230104 151080 -22850 -61639 108031 323474
5680 323474 -12449 2633 367548 -196561 89209 52445 385111 -161851 -211835 -49896 58353
5668 -155475 51400 -288301 87229 42953 -193252 -6089 93313 122174 85429 126871 -373404
5656 -109718 252484 -323640 -371729 273973 -33408 -172993 201521 -197503 20507 99009
5646 99009 -98731 154683 37798 -89952 -346133 248913 -228113 148166 108352 139757 -131847
5634 7438 82553 30725 204043 -45696 292228 -161955 -85967 11350 -186400 256503 159413
5623 159413 89453 226142 -50365 -637 -102709 801 176873 58062 -269529 258889 -123851
5611 -93272 212353 -240312 44037 34723 70108 -239856 -76650 110841 106564 50214 -15977
5599 53747 -54898 -117511 -30762 42073 -89061 -153683 41792 -82036 264073 100481 -41450
5587 -173544 -147298 -37882 -112650 -37925 60162 -50770 135876 332624 -175652 -265419 -47977
5575 -325428 127089 -61571 -273623 -34740 -35797 -117787 -163112 16778 -284073 192526 137506
5564 137506 -478656 71887 -177 235079 351118 -298852 -49814 -64077 -188751 -33788 -114485
5553 -114485 44410 247161 44909 -158619 -115696 -33663 86315 -9319 -155628 -470894 55392
5541 -255643 -63427 51055 -211687 109696 101819 253030 118721 -233404 -73259 -193835 102033
5529 -47879 -94683 -151641 -284254 -147907 -209801 218524 -124063 125653 -226152 -216081 95024
5517 -265953 -83905 29470 -254303 -161851 -252349 59620 104192 -29058 -75783 318825 12546
5505 160261 -68404 -233432 304362 109065 -73436 57886 240177 -23834 65486 -267758 155200
5493 -200136 74716 209597 -33732 33588 94449 -128759 391593 -38894 -34900 -116347 236764
5481 -137461 124606 31204 -142818 -96772 -35042 201261 -76975 10906 185635 133471 43981
5469 73511 -37347 -106910 -17888 -118415 189034 150162 13878 170995 263225 39496 130554
5458 130554 443 -277317 2242 262717 -243799 -129455 186995 182641 53332 -73049 157091
5446 -245159 325184 -220120 -109371 275452 -48851 192161 113031 -81853 -35599 -147196
5436 -147196 -82042 153669 -147681 -1411 368458 68137 87445 432704 64856 -177111 -65308
5424 127615 139644 -193354 59739 87616 58392 -145433 1767 -54168 -210761 -198817 -32257
5412 57317 53512 -58567 83606 -124556 -103981 -39973 -47573 57265 -170398 17332 308959 -71492
5399 47396 430896 15072 -204145 -85746 76775 537479 -38268 -43056 186746 40560 31598
5388 31598 -73633 -288341 282850 14210 -102998 135197 -104657 69363 -7558 -217519 -14594
5376 -17256 235491 302099 6648 -337215 178641 -17008 335166 121444 127897 250762 256774
5365 256774 50609 105290 224873 -52641 235328 -162210 -15060 334157 -79234 -62966 4856
5353 439447 117610 -148858 130685 22437 -70281 -96912 -113354 97429 54481 -240133 332729
5341 -30654 229981 -151805 -225011 -226175 32128 84092 55407 97515 -142536 110589 -26575
5329 -11119 -227426 42632 -109873 25266 191242 65071 -249367 84549 -132999 53864 44372
5318 44372 -76596 -422274 30056 -146171 257829 -105017 -82114 23147 -280177 153525 -26854
5306 -100958 -77261 253457 11715 186395 51667 294980 142779 -124692 157191 -200882
5295 -97837 67969 -239923 -63236 -99372 -112016 -254383 -61501 193656 -95526 20829 -56087
5283 7784 261770 -30904 -70585 128486 297715 43838 -81120 -57885 4182 -72930 365880
5271 31275 220844 59484 -80419 239026 60469 -246673 -105480 350391 10265 -91142 -225370
5260 -225370 -5821 -62415 144978 106901 47834 239555 195774 447337 -184863 -313686 54996
5248 162557 98736 -204051 -417344 30911 -43436 -73132 264512 -167587 -78055 81091 -87156
5236 293755 304662 -26884 5755 274147 -175235 20099 -56099 -670217 218678 95914 168531
5225 168531 -208983 -77171 -103526 -186100 -29876 83489 104552 40710 -277294 357721 -35078
5213 -85711 -138803 152683 304104 -89721 -242091 -138443 272962 -21250 -27716 -141633 230026
5201 -340762 -278592 315931 -153835 -164976 -227082 66580 -11358 -356611 73866 -210859 234021
5189 53931 129997 247367 -180066 85262 -327504 -414235 41140 76372 -80275 -150698 5431
5177 49390 50304 -29913 -210146 160715 110189 57096 -42417 305192 -20406 90942 23627 94769
5165 94769 204777 -370507 -69365 118580 -23250 169286 527127 -99572 -161076 226983 13136
5153 -92388 112637 225731 -469 52727 -9775 -219867 -31900 28777 205279 -22213 203056
5141 49834 -62265 540605 286615 -30500 109768 115539 -113352 -34868 -243613 23884 34787
5130 34787 124716 153429 69315 16928 -52254 -29133 261554 -68577 26628 -41228 -95424 242967
5117 225373 277628 -92748 -329868 123228 -80328 102216 -29641 -165455 -12597 28247 44926
5106 44926 -75000 -52102 -55224 211848 -197490 -108565 -114042 -99651 -44385 -180341 219408
5094 149659 96320 472085 -344912 -27349 -244050 268327 -80658 119902 -213459 148878
5083 -246995 164065 270288 17946 -299131 28191 177302 134298 47335 -193468 -30393 -42678
5072 -42678 310172 -121360 -293901 218392 -19347 101649 -166629 -151255 -91618 -78826 -383240
5061 -383240 216169 137202 -98130 -39987 -223741 -70232 -7717 109089 59757 -72660 -183421
5050 -183421 -30262 -287980 112123 31458 175341 -90646 -131340 -61177 -180329 -228392 169372
5038 2980 -97266 -118747 -92814 -253879 -194679 48566 115851 134408 166614 -301192 -229232 2287
5025 -447842 230667 -92729 -316509 187451 -32314 19180 70953 215515 276694 131627 -21261
5013 -220491 -274466 2797 -102881 -56537 -47518 -61504 186656 46093 -157211 -57439 -263221
5002 -263221 146717 81383 89796 -102605 487931 -13894 -186546 -69113 -151992 59171 64371
4991 64371 -146563 80082 -127764 -190509 -118075 346265 -329585 -89473 36276 -39221 -72734
4980 -72734 178305 169305 166012 380055 150390 91684 122574 158894 -2213 431166 207243
4968 34126 -106108 -87640 204654 -152643 177154 -163299 3958 168607 -316346 -112936
4957 -170827 198555 3105 -168364 -155624 148888 -276847 -207417 294262 46724 213290 -129603
4945 -81065 77092 -131464 -138022 -249480 138659 230682 101534 -230238 325096 -232146 40874
4933 -50315 -22500 143169 -47379 -33619 86790 -152383 5557 48284 -3378 32161 -146966 47553
4920 -29726 -249715 -282719 75867 -249476 -62756 166931 -56649 -104191 -19931 -2029 131320
4908 184136 -201 -205220 -141239 -154835 -110041 320777 27870 4712 -230649 270742 -112774
4896 255256 49984 -114409 25932 -10269 -17555 135073 -312383 272917 59441 178357 57243
4884 113267 -40767 138000 33710 126630 197425 206288 -358909 -189522 37411 29879 320044
4873 320044 20752 384130 128175 -223738 14432 -100417 -124255 -46480 -134779 -194750 -4618
4861 -9969 128374 16864 71307 -302338 -265370 -225135 -169116 -106478 22297 93011 67818 -82883
4848 210281 -7814 -27755 -82455 -14830 -141497 -146010 78266 9522 -8966 159172 38855 175522
4836 175522 257886 53118 -390994 -256903 -93620 244048 -56147 -119795 198526 130970 -59217
4824 -265797 -109573 -163723 74943 -62101 132383 -88707 175104 -2895 -119256 379041 267352
4813 267352 162678 122807 -178441 199345 -334892 156283 58872 -12959 -86869 127688
4802 163877 76991 96609 94536 -169674 132776 -33079 100950 156423 270339 91980 212687
4791 212687 78665 -201758 -208460 41921 173097 165259 144521 268796 -187171 9618 88537
4780 88537 8571 124269 -61254 -101260 -275148 140733 231487 -97368 -14266 -319902 -207425
4769 -207425 -25095 -80775 -35257 -249411 -4839 -67909 22023 -101832 27694 129403 222148
4758 222148 60578 214379 41869 -26254 -150317 90142 -50630 15188 192004 -12671 -129913
4747 -129913 125398 421074 -112408 53484 -17080 -207191 -177479 -87564 -210520 36540 2882
4735 315542 2988 -122135 30595 221986 31381 120678 -88807 150530 190347 -174062 97412
4723 -1106 -150495 217918 25856 -62127 98569 -147680 320988 27593 110930 -100359 -270751
4712 -270751 51307 50121 -151442 170156 349475 103361 -34666 29147 -72110 109483 47226
4700 54220 -25038 57444 2389 243050 -82389 -48905 -46506 23573 -150253 -47883 -88027 -143526
4688 -143526 162206 -58673 1651 -134540 -21286 -74710 -152632 -138853 180730 32093 -156217
4676 -276270 -70898 538242 -264014 -72825 98296 -75448 34813 -396893 -307125 19451 153133
4665 153133 114757 63299 135892 26021 121459 -118166 139380 204762 -100568 22230 -36908
4653 -32792 434983 275086 -7943 28101 -64600 97946 242753 32920 -48291 192997 -23850
4641 -197252 260528 -200596 151345 23261 40222 -18157 220146 22374 264091 -162089
4630 -156231 319678 -77509 -26724 -84655 -94348 -80913 156117 297476 -265461 -11562 183551
4618 -267356 -6536 -141227 -218590 -166480 399661 -70837 -37895 244913 -12688 192932 29444
4606 117830 116932 229244 178443 -5891 135432 -83490 68301 -16246 -230370 -237510 218814 298676
4594 298676 -9889 -104877 122619 -116822 46686 3153 269328 -35035 10180 169931 31311
4582 -214894 39909 193460 72688 49869 66171 -2926 -52982 -52949 -20995 -50108 -23237 -86774
4570 -86774 -68283 -149363 12414 -382508 196139 171112 100628 -146851 -233937 280536 -49198
4558 294504 -317289 -112746 103012 -115354 268665 92804 118673 150433 188707 -58001 -117629
4547 -117629 235309 312203 181647 44941 103063 -105081 46232 -132890 70907 54194 -169433
4535 57844 -144397 -92651 8447 135018 219738 -179152 139999 -55116 295199 -159072 216592
4523 -39588 -139220 -225471 -62458 -31130 -81140 284805 -170805 37983 -155584 16108 -51157
4511 12593 89537 -267198 339956 24221 26845 -34040 224766 -120742 69958 -37642 338955
4499 70757 142402 82504 -166813 -170313 -54045 -111940 -296189 -87937 73113 -174978 167908
4487 -103731 176534 -111181 272540 57402 106754 -238437 57750 82757 46671 -22090 -58014
4476 -58014 -119783 38962 204845 -219432 -72657 105108 -26806 -63313 -13199 68022 57812
4465 57812 128749 -118934 33758 185432 124571 155679 -81745 154037 -160347 5400 -115953
4453 -110187 -45854 -222 75865 98182 126611 42234 9942 192958 151783 131521 -25918 -358385
$$ [...]
##END NTUPLES=NMR SPECTRUM
##END=
