##TITLE=AC1740_SEN00013_9276343_qgJO3Bddgf
##JCAMPDX= 6.0         $$ Bruker NMR JCAMP-DX V2.0
##DATA TYPE= NMR SPECTRUM
##DATA CLASS= NTUPLES
##ORIGIN= BRUKER
##OWNER= Administrator
$$ 1.72 TOPSPIN		Version 2.1
$$ 2015-07-18 02:33:34.057 -0700  Administrator@X
$$ Compression mode = diff/dup
##.OBSERVE FREQUENCY= 400.02188249412
##.OBSERVE NUCLEUS= ^1H
##.ACQUISITION MODE= SIMULTANEOUS (DQD)
##.ACQUISITION SCHEME= undefined
##.AVERAGES= 64
##.DIGITISER RES= 22
##SPECTROMETER/DATA SYSTEM= spect
##.PULSE SEQUENCE= noesygpps1d.comp
##.SOLVENT NAME= COFFEE_meoh
##.SHIFT REFERENCE= INTERNAL, COFFEE_meoh, 1, 14.96098
##AUDIT TRAIL= $$ (NUMBER, WHEN, WHO, WHERE, PROCESS, VERSION, WHAT)
$$ ##TITLE= Audit trail, TOPSPIN		Version 2.1
$$ ##JCAMPDX= 5.01
$$ ##ORIGIN= Bruker BioSpin GmbH
$$ ##OWNER= Administrator
$$ $$ E:\/data/COFFEE/nmr/AC1740_SEN00013_9276343_qgJO3Bddgf/22/pdata/1/auditp.txt
$$ ##AUDIT TRAIL=  $$ (NUMBER, WHEN, WHO, WHERE, PROCESS, VERSION, WHAT)
(   1,<2015-07-18 02:33:29.041 -0700>,<Administrator>,<X>,<go>,<TOPSPIN 2.1>,
      <created by zg
	started at 2015-07-18 02:21:58.650 -0700,
	POWCHK enabled, PULCHK disabled,
       configuration hash MD5:
       21 0F 79 D6 B3 7B B4 F6 88 20 88 DB 03 48 BD 9F
       data hash MD5: 64K
       A0 8D 44 97 06 20 59 03 49 EE 54 5C CD E9 B7 27>)
(   2,<2015-07-18 02:33:32.213 -0700>,<Administrator>,<X>,<proc1d>,<TOPSPIN 2.1>,
      <Start of raw data processing
       efp LB = 0.3 FT_mod = 6 PKNL = 1 PHC0 = 0 PHC1 = 0 SI = 128K 
       data hash MD5: 128K
       C8 6C 19 3B B3 9A 52 A0 44 6C DF 85 E8 42 A6 53>)
(   3,<2015-07-18 02:33:33.119 -0700>,<Administrator>,<X>,<proc1d>,<TOPSPIN 2.1>,
      <pk PHC0 = -83.93555 PHC1 = 0 
       data hash MD5: 128K
       07 A9 CD 92 9E 17 CE 57 8C 70 26 23 95 8D AF 16>)
(   4,<2015-07-18 02:33:33.541 -0700>,<Administrator>,<X>,<proc1d>,<TOPSPIN 2.1>,
      <abs ABSG = 1 
       data hash MD5: 128K
       0E D6 4C 2E 5E 8C FF 1E 02 A0 08 03 8C D4 8E F3>)
(   5,<2015-07-18 02:33:33.650 -0700>,<Administrator>,<X>,<proc1d>,<TOPSPIN 2.1>,
      <abs ABSG = 2 
       data hash MD5: 128K
       CD 56 FB 8E 86 C6 8B E0 61 47 21 92 0C CF E2 53>)
(   6,<2015-07-18 02:33:33.744 -0700>,<Administrator>,<X>,<proc1d>,<TOPSPIN 2.1>,
      <abs ABSG = 3 
       data hash MD5: 128K
       10 0B 84 20 52 32 65 2E FE 94 77 C7 01 E4 B2 96>)
(   7,<2015-07-18 02:33:33.807 -0700>,<Administrator>,<X>,<proc1d>,<TOPSPIN 2.1>,
      <abs ABSG = 4 
       data hash MD5: 128K
       03 96 4E 91 52 62 B7 CE FA 1D EB 31 F0 90 19 44>)
(   8,<2015-07-18 02:33:33.900 -0700>,<Administrator>,<X>,<proc1d>,<TOPSPIN 2.1>,
      <abs ABSG = 5 
       data hash MD5: 128K
       B9 D3 58 49 E1 9B 7F 05 4E 8B 2C AE 0F 97 B1 C3>)
$$ ##END=
$$ 
$$ $$ hash MD5
$$ $$ 64 B1 D3 3B 7B B1 4A 3B 99 18 33 DC F3 DA C3 8B
##$RELAX= 
##$RELAX= 
##$RELAX= 
##$RELAX= 
##$RELAX= 
##$RELAX= 
##$RELAX= 
##$RELAX= 
$$ Bruker specific parameters
$$ --------------------------
##$DU= <E:\>
##$EXPNO= 22
$$ [...]
##$TP07= 0
##$TPNAME0= <>
##$TPNAME1= <>
##$TPNAME2= <>
##$TPNAME3= <>
##$TPNAME4= <>
##$TPNAME5= <>
##$TPNAME6= <>
##$TPNAME7= <>
##$TPOAL= (0..7)
0.5 0.5 0.5 0.5 0.5 0.5 0.5 0.5
##$TPOFFS= (0..7)
0 0 0 0 0 0 0 0
##$TUNHIN= 0
##$TUNHOUT= 0
##$TUNXOUT= 0
##$USERA1= <user>
##$USERA2= <user>
##$USERA3= <user>
##$USERA4= <user>
##$USERA5= <user>
##$V9= 5
##$VALIST= <valist>
##$VCLIST= <CCCCCCCCCCCCCCC>
##$VD= 0
##$VDLIST= <DDDDDDDDDDDDDDD>
##$VPLIST= <PPPPPPPPPPPPPPP>
##$VTLIST= <TTTTTTTTTTTTTTT>
##$WBST= 2048
##$WBSW= 25
##$XGAIN= (0..3)
0 0 0 0
##$XL= 0
##$YL= 0
##$YMAX_a= 6070546
##$YMIN_a= -11594329
##$ZGOPTNS= <>
##$ZL1= 120
##$ZL2= 120
##$ZL3= 120
##$ZL4= 120
##$ABSF1= 14.96098
##$ABSF2= -5.597201
##$ABSG= 5
##$ABSL= 3
##$ALPHA= 0
##$AQORDER= 0
##$ASSFAC= 0
##$ASSFACI= 0
##$ASSFACX= 0
##$ASSWID= 0
##$AUNMP= <proc_prof1d_extract.lims>
##$AXLEFT= 0
##$AXNAME= <>
##$AXNUC= <1H>
##$AXRIGHT= 0
##$AXTYPE= 0
##$AXUNIT= <>
##$AZFE= 0.1
##$AZFW= 0.1
##$BCFW= 0
##$BC_mod= 0
##$BYTORDP= 0
##$COROFFS= 0
##$CY= 15
##$DATMOD= 1
##$DC= 0
##$DFILT= <>
##$DTYPP= 0
##$F1P= 0
##$F2P= 0
##$FCOR= 0.5
##$FTSIZE= 131072
##$FT_mod= 6
##$GAMMA= 0
##$GB= 0
##$INTBC= 1
##$INTSCL= 1
##$ISEN= 128
##$LB= 0.3
##$LEV0= 0
##$LPBIN= 0
##$MAXI= 10000
##$MC2= 0
##$MEAN= 0
##$ME_mod= 0
##$MI= 0
##$NCOEF= 0
##$NC_proc= -2
##$NLEV= 6
##$NOISF1= 0
##$NOISF2= 0
##$NSP= 0
##$NTH_PI= 0
##$NZP= 0
##$OFFSET= 14.96098
##$PC= 1
##$PHC0= -83.93555
##$PHC1= 0
##$PH_mod= 1
##$PKNL= yes
##$PPARMOD= 0
##$PPDIAG= 0
##$PPIPTYP= 0
##$PPMPNUM= 2147483647
##$PPRESOL= 1
##$PSCAL= 4
##$PSIGN= 0
##$PYNMP= <proc.py>
##$REVERSE= no
##$SF= 400.020009645067
##$SI= 131072
##$SIGF1= 0
##$SIGF2= 0
##$SINO= 400
##$SIOLD= 131072
##$SPECTYP= <>
##$SREGLST= <1H.CDCl3>
##$SSB= 0
##$STSI= 131072
##$STSR= 0
##$SW_p= 8223.68421052631
##$SYMM= 0
##$S_DEV= 0
##$TDeff= 65536
##$TDoff= 0
##$TI= <>
##$TILT= no
##$TM1= 0
##$TM2= 0
##$TOPLEV= 0
##$USERP1= <user>
##$USERP2= <user>
##$USERP3= <user>
##$USERP4= <user>
##$USERP5= <user>
##$WDW= 1
##$XDIM= 131072
##$YMAX_p= 404139596
##$YMIN_p= -11389
##$CURPLOT= <Network HP LaserJet P1505>
##$CURPRIN= <$Network HP LaserJet P1505>
##$DFORMAT= <normdp>
##$LAYOUT= <+/1D_H.xwp>
##$LFORMAT= <normlp>
##$PFORMAT= <normpl>
##$SURQMSG= 1
$$ End of Bruker specific parameters
$$ ---------------------------------
##NTUPLES= NMR SPECTRUM
##VAR_NAME=  FREQUENCY,     SPECTRUM/REAL,   SPECTRUM/IMAG
##SYMBOL=    X,             R,               I
##VAR_TYPE=  INDEPENDENT,   DEPENDENT,       DEPENDENT
##VAR_FORM=  AFFN,          ASDF,            ASDF
##VAR_DIM=   131072,        131072,          131072
##UNITS=     HZ,            ARBITRARY UNITS, ARBITRARY UNITS
##FACTOR=    0.0627417313425164, 1,          1
##FIRST=     8223.62146879497, -1839,        -57536
##LAST=      0,             1261,            -58832
##MIN=       0,             -11389,          0
##MAX=       8223.62146879497, 404139596,    0
$$ Real data points
##PAGE= N=1
##DATA TABLE= (X++(R..R)), XYDATA
$$ [...]
$$ plain form
61714 463330 465616 467873 469922 471151 471277 470506 469079 467025 464389 461494 458806 456482 454102 451037 447202
61699 447202 443303 440091 437454 434522 430720 426467 422666 419700 417152 414436 411453 408537 405927 403497
61685 403497 400964 398096 394650 390359 385356 380464 376696 374315 372659 370954 369044 367254 365929 365296
61671 365296 365424 366000 366346 365991 365103 364156 363449 363180 363669 365004 366692 368155 369504 371327 373758 376255
61655 376255 378376 380245 382090 383731 384830 385374 385684 386108 386861 388013 389530 391459 394020 397269 400730
61640 400730 403735 406154 408392 410581 412306 413350 414166 415153 415803 415146 412935 409934 407024 404417 401759
61625 401759 398663 394985 390787 386228 381554 377209 373874 372095 371717 371893 371825 371323 370482 369144 367053 364340
61609 364340 361370 358209 354635 350648 346526 342379 338092 333823 330071 327110 324677 322394 320102 317567
$$ packed form
61714D63330K286K257K049J229J26p71j427k054k636k895k688k324k380l065l835
61699D47202l899l212k637k932l802m253l801k966k548k716k983k916k610k430
61685D03497k533k868l446m291n003m892l768k381j656j705j910j790j325o33
61671C65296J28N76L46l55q88r47p07k69M89J335J688J463J349J823K431K497
61655C76255K121J869J845J641J099N44L10M24P53J152J517J929K561L249L461
61640D00730L005K419K238K189J725J044Q16R87O50o57k211l001k910k607k658
61625D01759l096l678m198m559m674m345l335j779l78J76o8n02q41j338k091k713
61609C64340k970l161l574l987m122m147m287m269l752k961k433k283k292k535
$$ plain form
61595 317567 314343 310341 306218 302797 300228 298123 296278 294814 293654 292429 291040 289921 289505 289616 289546
61580 289546 288619 286570 283613 280366 277720 276534 277183 279210 281488 283017 283726 284308 285199 286038 286374 286531
61564 286531 287253 288633 290017 290977 291820 292964 294271 295324 296027 296697 297763 299534 301934 304311 305877
61549 305877 306546 306955 307508 307896 307902 308054 308788 309419 308798 306901 305023 304370 305092 306729 308862 311094 313004
61532 313004 314479 315707 316645 316978 316738 316418 316202 315691 314764 314038 313887 313536 311974 309418 307017 305183 303155
61515 303155 300399 297637 296007 295774 296384 297420 298909 300846 302925 304828 306451 307752 308659 309253 309872
61500 309872 310865 312272 313905 315670 317653 319808 321759 323148 324136 325342 327156 329341 331405 333165 334675
61485 334675 335816 336401 336743 337688 339806 342742 345558 347572 348631 348792 348107 346745 344998 343060 341038
$$ packed form
61595C17567l224m002m123l421k569k105j845j464j160j225j389j119m16J11p0
61580B89546r27k049k957l247k646j186O49K027K278J529P09N82Q91Q39L36J57
61564B86531P22J380J384R60Q43J144J307J053P03O70J066J771K400K377J566
61549C05877O69M09N53L88OJ52P34O31o21j897j878o53P22J637K133K232J910
61532C13004J475J228R38L33k40l20k16n11r27p26j51l51j562k556k401j834k028
61515C03155k756k762j630k33O10J036J489J937K079J903J623J301R07N94O19
61500C09872R93J407J633J765J983K155J951J389R88J206J814K185K064J760J510
61485C34675J141N85L42R45K118K936K816K014J059J61o85j362j747j938k022
$$ plain form
61470 341038 339218 338080 337809 338003 338048 337627 336708 335243 333230 330989 328955 327222 325669 324552 324451 325386
61454 325386 326415 326497 325515 324149 323034 322494 322816 324119 325920 327406 328376 329522 331577 334519 337866 341388
61438 341388 345184 349190 352954 355958 358042 359523 360942 362604 364311 365637 366422 366855 367134 367384 367895
61423 367895 369047 370785 372522 373857 375118 376940 379449 382123 384260 385334 385138 384061 383085 383067 383884
61408 383884 384568 384328 383171 381531 379644 377523 375307 373312 371730 370460 369326 368418 368074 368460 369263 369965
61392 369965 370387 370781 371402 372213 373105 374087 375164 376290 377611 379461 381885 384465 386905 389405 392089 394484
61376 394484 396212 397979 401044 405588 410277 413643 415367 416018 416129 415960 415707 415449 415032 414305 413290 411948
61360 411948 410158 408164 406673 406129 406257 406769 408137 411055 415322 419929 424201 428226 432115 435570 438428
$$ packed form
61470C41038j820j138k71J94M5m21r19j465k013k241k034j733j553j117j01R35
61454C25386J029Q2r82j366j115n40L22J303J801J486R70J146K055K942L347L522
61438C41388L796M006L764L004K084J481J419J662J707J326P85M33K79K50N11
61423C67895J152J738J737J335J261J822K509K674K137J074j96j077r76j8Q17
61408C83884O84k40j157j640j887k121k216j995j582j270j134r08l44L86Q03P02
61392C69965M22L94O21Q11Q92R82J077J126J321J850K424K580K440K500K684K395
61376C94484J728J767L065M544M689L366J724O51J11j69k53k58m17p27j015j342
61360D11948j790j994j491n44J28N12J368K918M267M607M272M025L889L455K858
$$ plain form
61345 438428 440985 443404 445255 446064 446041 445873 446015 446583 447666 449358 451542 454007 456659 459249 461085 461487
61329 461487 460573 459187 458009 457068 456182 455444 455074 455112 455533 456426 457834 459577 461463 463635 466544 470630
61313 470630 476027 482440 489322 496340 503693 511795 520714 530250 540471 551581 563083 573683 582436
61300 582436 589477 595147 598913 599912 598311 595296 591761 587726 583076 578111 573106 567931 562455 556800
61286 556800 550912 544330 536791 528786 521176 514507 508925 504483 501239 499224 498489 498939 500024 500978 501540
61271 501540 502032 502513 502383 501283 499932 499505 500421 502260 504662 507772 511855 516984 523063 529721 536181
61256 536181 541633 545806 548971 551480 553552 555315 556662 557219 556815 555830 554674 553200 551145 548907 547105
61241 547105 545467 543050 539732 536632 534654 533385 531924 530150 528491 526980 525406 524206 524359 526315
$$ packed form
61345D38428K557K419J851Q09k3j68J42N68J083J692K184K465K652K590J836M02
61329D61487r14j386j178r41q86p38l70L8M21Q93J408J743J886K172K909M086
61313D70630N397O413O882P018P353Q102Q919R536J0221J1110J1502J0600Q753
61300E82436P041N670L766R99j601l015l535m035m650m965n005n175n476n655
61286E56800n888o582p539q005p610o669n582m442l244k015p35M50J085R54N62
61271E01540M92M81j30j100j351m27R16J839K402L110M083N129O079O658O460
61256E36181N452M173L165K509K072J763J347N57m04r85j156j474k055k238j802
61241E47105j638k417l318l100j978j269j461j774j659j511j574j200J53J956
$$ plain form
61227 526315 529580 533460 537693 542245 546960 551746 556794 562326 568269 574353 580423 586552 592949 599816
61213 599816 607099 614232 620330 624829 627903 630132 631887 633249 634435 636040 638764 643078 649130 656684
61199 656684 665070 673525 681982 691373 702753 716061 729883 742431 752552 759948 764897 767967 769635
61186 769635 769959 768817 766594 764236 762304 760257 757091 752476 746820 740374 732857 724118 714680 705316
61172 705316 696308 687394 678284 669005 659781 650731 641723 632490 622890 613041 603206 593620 584475 575922
61158 575922 567923 560277 553059 546971 542954 541341 541575 542876 544960 547966 551782 555674 558577 559679
61144 559679 558681 555680 551033 545439 539924 535333 531750 528650 525742 523432 522338 522641 524170 526920 531144
61129 531144 536990 544277 552564 561307 570132 579229 589356 601181 614739 629728 646087 663895 682882
$$ packed form
61227E26315L265L880M233M552M715M786N048N532N943O084O070O129O397O867
61213E99816P283P133O098M499L074K229J755J362J186J605K724M314O052P554
61199F56684Q386Q455Q457R391J1380J3308J3822J2548J0121P396M949L070J668
61186G69635L24j142k223k358j932k047l166m615n656o446p517q739r438r364
61172G05316r008q914r110r279r224r050r008r233r600r849r835r586r145q553
61158E75922p999p646p218o088m017j613K34J301K084L006L816L892K903J102
61144E59679r98l001m647n594n515m591l583l100k908k310j094L03J529K750M224
61129E31144N846P287Q287Q743Q825R097J0127J1825J3558J4989J6359J7808J8987
$$ plain form
61116 682882 702574 722906 744239 766629 789396 811554 832463 852110 870957 889442 907340
61105 907340 923725 937906 950185 961229 970853 978037 982175 983597 982738 979544 974097 967189 959655
61092 959655 951508 942313 932242 922230 913152 905233 898309 892317 887453 883977 881958 881195 881490 882956
61078 882956 885937 890601 896897 904937 915107 927536 941663 956554 971613 986906 1002912 1019973
61066 1019973 1037839 1055726 1072970 1089564 1105798 1121444 1135710 1148022 1158498 1167553 1175449 1182322
61054 1182322 1188230 1192977 1196315 1198550 1200583 1203110 1206106 1209246 1212399 1215451 1218158 1220626 1223600 1227876
61040 1227876 1233609 1240532 1248609 1258167 1269607 1283160 1298683 1315573 1333418 1352958 1375842 1403026
61028 1403026 1433847 1467035 1501983 1538495 1576084 1614589 1655273 1700452 1752108 1811536 1880032
$$ packed form
61116F82882J9692K0332K1333K2390K2767K2158K0909J9647J8847J8485J7898
61105I07340J6385J4181J2279J1044R624P184M138J422q59l194n447o908p534
61092I59655q147r195j0071j0012r078p919o924n992m864l476k019p63K95J466
61078H82956K981M664O296Q040J0170J2429J4127J4891J5059J5293J6006J7061
61066A019973J7866J7887J7244J6594J6234J5646J4266J2312J0476R055P896O873
61054A182322N908M747L338K235K033K527K996L140L153L052K707K468K974M276
61040A227876N733O923Q077R558J1440J3553J5523J6890J7845J9540K2884K7184
61028A403026L0821L3188L4948L6512L7589L8505M0684M5179N1656N9428O8496
$$ plain form
61017 1880032 1958993 2049223 2150879 2264361 2391149 2534218 2698468 2890669 3118526 3390054
61007 3390054 3714216 4101501 4563394 5113116 5769112 6557275 7507950 8652078 10021597
60998 10021597 11643896 13511621 15534351 17517499 19211430 20414558 21058745 21219972
60990 21219972 21066556 20798850 20606927 20627233 20885180 21258502 21511323 21397219 20766639
60981 20766639 19612130 18041738 16220309 14317794 12475813 10789272 9303026 8023537
60973 8023537 6936866 6021898 5256023 4617604 4087598 3649270 3286602 2984206 2729040
60964 2729040 2511255 2323191 2158478 2012310 1881621 1764338 1658880 1564466 1480988 1407983
60954 1407983 1344150 1288153 1239254 1196584 1158259 1121975 1086376 1051383 1017396 984687 953539
$$ packed form
61017A880032P8961R0230J01656J13482J26788J43069J64250J92201K27857K71528
61007C390054L24162L87285M61893N49722O55996P88163R50675J144128J369519
60998A0021597J622299J867725K022730J983148J693931J203128O44187J61227
60990B1219972j53416k67706j91923K0306K57947L73322K52821j14104o30580
60981B0766639j154509j570392j821429j902515j841981j686541j486246j279489
60973H023537j086671r14968p65875o38419n30006m38328l62668l02396k55166
60964B729040k17785j88064j64713j46168j30689j17283j05458r4414q3478p3005
60954A407983o3833n5997m8899m2670l8325l6284l5599l4993l3987l2709l1148
$$ plain form
60943 953539 924355 897339 872254 848649 826188 804737 784199 764394 745135 726473 708832
60932 708832 692653 677904 664159 651236 639407 628816 619093 609865 601306 593714 586794 579983 573330
60919 573330 567394 562234 557186 551850 546690 542246 538344 534537 530930 528001 525864 524293 523278 522997
60905 522997 523282 523579 523454 522728 521203 518825 516135 513909 512138 509877 506402 502050 497503 492648 486739
60890 486739 479596 472142 465651 460733 457150 454328 451847 449502 447034 443946 439734 434331 428294 422472
60876 422472 417490 413487 410226 407447 405150 403508 402513 401882 401510 401808 403336 406193 410023 414491 419398
60861 419398 424461 429399 434220 439008 443449 447101 450083 452945 455768 458055 459636 460942 462137 462776
60847 462776 462757 462815 463435 463985 463689 462805 461907 460548 457766 453630 449128 444617 439510 433643 427794 422469
$$ packed form
60943I53539k9184k7016k5085k3605k2461k1451k0538j9805j9259j8662j7641
60932G08832j6179j4749j3745j2923j1829j0591r723r228q559p592o920o811o653
60919E73330n936n160n048n336n160m444l902l807l607k929k137j571j015k81
60905E22997K85K97j25p26j525k378k690k226j771k261l475m352m547m855n909
60890D86739p143p454o491m918l583k822k481k345k468l088m212n403o037n822
60876D22472m982m003l261k779k297j642r95o31l72K98J528K857L830M468M907
60861D19398N063M938M821M788M441L652K982K862K823K287J581J306J195O39
60847D62776j9N8O20N50k96q84q98j359k782m136m502m511n107n867n849n325
$$ plain form
60831 422469 417182 411464 405781 400847 396627 392622 388685 385000 381668 378796 376635 375077 373306 370493
60817 370493 366738 362882 359494 356425 353265 349888 346526 343478 340738 337883 334571 331205 328736 327644
60803 327644 327496 327730 328409 329713 331155 331935 331939 331806 332041 332614 333395 334367 335302 335743 335632 335586 336229 337515 338941
60784 338941 340243 341589 343150 344773 346123 347006 347496 347797 347955 347763 346988 345731 344417 343352 342418 341386
60768 341386 340441 340078 340393 340789 340667 340210 340060 340294 340255 339608 339014 339277 340164 340659 340258 339399 338607 337819 336748
60749 336748 335409 334028 332865 332346 332957 334634 336587 338072 338997 339462 339162 337803 335799 333834 331804
60734 331804 328887 324843 320643 317531 315822 314875 313936 312739 311502 310639 310376 310535 310807 311309 312598 314888
60718 314888 317490 319383 320277 320783 321539 322524 323393 324168 325258 326851 328645 330260 331666 333024 334249 335023
$$ packed form
60831D22469n287n718n683m934m220m005l937l685l332k872k161j558j771k813
60817C70493l755l856l388l069l160l377l362l048k740k855l312l366k469j092
60803C27644j48K34O79J304J442P80Mj33K35N73P81R72R35M41j11m6O43J286J426
60784C38941J302J346J561J623J350Q83M90L01J58j92p75j257j314j065r34j032
60768C41386r45l63L15L96j22m57j50K34l9o47n94K63Q87M95m01q59p92p88j071
60749C36748j339j381j163n19O11J677J953J485R25M65l00j359k004j965k030
60734C31804k917m044m200l112j709r47r39j197j237q63k63J59K72N02J289K290
60718C14888K602J893Q94N06P56R85Q69P75J090J593J794J615J406J358J225P74
$$ plain form
60702 335023 335242 335219 335274 335296 334848 333659 331855 329759 327590 325407 323251 321282 319704 318551 317550 316272
60686 316272 314506 312494 310845 310219 311014 313152 316043 318878 321140 322910 324653 326700 328933 330979 332640
60671 332640 334098 335634 337144 338056 337873 336692 335022 333127 330850 328097 325193 322591 320458 318789 317738
60656 317738 317569 318386 320113 322591 325448 328032 329918 331461 333433 336021 338592 340579 342134 343566 344574
60641 344574 344603 343785 342878 342173 340991 338537 334861 330642 326392 322310 318785 316487 315742 316080 316571 316544 315997
60624 315997 315468 315544 316355 317410 318044 317983 317416 316607 315688 314843 314389 314533 315176 316001 316595 316545 315775 314891 314815 315868
60604 315868 317497 319033 320340 321490 322302 322703 323137 324035 325120 325907 326734 328533 331478 334632 337222 339606
60588 339606 342564 346079 349337 351626 352815 353145 353028 352965 353256 353765 354205 354634 355454 356955 359043 361430
$$ packed form
60702C35023K19k3N5K2m48j189j804k096k169k183k156j969j578j153j001j278
60686C16272j766k012j649o26P95K138K891K835K262J770J743K047K233K046J661
60671C32640J458J536J510R12j83j181j670j895k277k753k904k602k133j669j051
60656C17738j69Q17J727K478K857K584J886J543J972K588K571J987J555J432J008
60641C44574K9q18r07p05j182k454l676m219m250m082l525k298p45L38M91k7n47
60624C15997n29P6Q11J055O34o1n67q09r19q45m54J44O43Q25N94n0p70q84p6J053
60604C15868J629J536J307J150Q12M01M34Q98J085P87Q27J799K945L154K590K384
60588C39606K958L515L258K289J189L30j17o3K91N09M40M29Q20J501K088K387
$$ plain form
60572 361430 363893 366435 369416 373572 379637 387739 397155 406793 416027 425006 434040 442722 449940 454909
60558 454909 457931 459745 460322 458828 454890 449447 444125 440068 437576 436483 436498 437377 439151 442128 446454
60543 446454 451799 457775 464561 472795 482866 494603 507721 522269 538460 556163 574696 593069
60531 593069 610262 625242 636920 644431 647601 646996 643314 636936 628266 618265 608091 598253 588621
60518 588621 579336 571081 564184 558082 552224 547132 543872 542624 542429 542419 542787 544420 547994 553653 561354
60503 561354 571250 583794 599489 618520 640747 666233 695501 728854 765488 803750 842440 881447
60491 881447 920871 959858 996715 1029984 1058987 1083323 1102179 1114326 1118561 1113968 1099932 1076305
60479 1076305 1043803 1004106 959328 911341 861659 811872 763843 719246 678965 643062 611289
$$ packed form
60572C61430K463K542K981M156O065Q102R416R638R234Q979R034Q682P218M969
60558D54909L022J814N77j494l938n443n322m057k492j093J5Q79J774K977M326
60543D46454N345N976O786Q234J0071J1737J3118J4548J6191J7703J8533J8373
60531E93069J7193J4980J1678P511L170o05l682o378q670j0001j0174r838r632
60518E88621r285q255o897o102n858n092l260j248j95j0L68J633L574N659P701
60503E61354R896J2544J5695J9031K2227K5486K9268L3353L6634L8262L8690L9007
60491H81447L9424L8987L6857L3269K9003K4336J8856J2147M235m593j4036k3627
60479A076305l2502l9697m4778m7987m9682m9787m8029m4597m0281l5903l1773
$$ plain form
60468 611289 583424 559191 538056 519332 502499 487410 474183 462914 453457 445420 438314 431699
60456 431699 425341 419346 414041 409545 405462 401196 396617 392202 388412 385166 382153 379504 377762 377099
60442 377099 376902 376416 375660 375332 375788 376457 376497 375704 374420 372829 370918 369046 367749 366774 365048 362111 358945
60425 358945 356718 355276 353799 352500 352442 353693 354905 355130 355005 355526 356597 357656 359060 361735 365651
60410 365651 369535 372172 373405 373839 374116 374604 375346 376071 376486 376692 377178 378352 380165 382197 384039 385699
60394 385699 387707 390652 394526 398662 402354 405335 407656 409493 411223 413331 416001 419042 422297 425704
60380 425704 428812 430833 431528 431607 431872 432407 433010 433864 435164 436495 437270 437561 437935 438724 440029 442053 444718
60363 444718 447226 448819 449820 451134 452888 454480 455957 458324 462275 467491 473512 480325 487567 493970
$$ packed form
60468F11289k7865k4233k1135j8724j6833j5089j3227j1269r457q037p106o615
60456D31699o358n995n305m496m083m266m579m415l790l246l013k649j742o63
60442C77099j97m86p56l28M56O69M0p93j284j591j911j872j297r75j726k937l166
60425C58945k227j442j477j299n8J251J212K25j25N21J071J059J404K675L916
60410C65651L884K637J233M34K77M88P42P25M15K06M86J174J813K032J842J660
60394C85699K008K945L874M136L692K981K321J837J730K108K670L041L255L407
60380D25704L108K021O95P9K65N35O03Q54J300J331P75K91L74P89J305K024K665
60363D44718K508J593J001J314J754J592J477K367L951N216O021O813P242O403
$$ plain form
60349 493970 498470 501488 504385 507726 510683 512144 511931 510711 508932 506168 501675 495615 489388 484551
60335 484551 481481 479378 477275 474687 471548 468112 464923 462340 460064 457604 455165 453423 452398 451223
60321 451223 449232 446735 444506 443099 442936 444328 447007 450166 453504 457791 463882 471572 479930 488425
60307 488425 497066 505680 513777 521243 528668 536764 545646 554696 562878 569170 572966 574226 573207 569991
60293 569991 564309 555862 544883 532436 520069 509008 499733 492358 487033 483563 480936 477916 474172
60280 474172 470281 466559 462503 457664 452414 447482 443155 439334 435965 432919 429799 426349 422887 419941
60266 419941 417577 415419 413140 410657 408072 405752 404239 403683 403490 402853 401582 400188 399345 399473 400594
60251 400594 402233 403630 404385 404825 405553 406876 408857 411488 414308 416197 416228 414746 413090 412196 411907 411640
$$ packed form
60349D93970M500L018K897L341K957J461k13j220j779k764m493o060o227m837
60335D84551l070k103k103k588l139l436l189k583k276k460k439j742j025j175
60321D51223j991k497k229j407j63J392K679L159L338M287O091P690Q358Q495
60307D88425Q641Q614Q097P466P425Q096Q882R050Q182O292L796J260j019l216
60293E69991n682q447j0979j2447j2367j1061r275p375n325l470k627l020l744
60280D74172l891l722m056m839n250m932m327l821l369l046l120l450l462k946
60266D19941k364k158k279k483k585k320j513n56j93o37j271j394q43J28J121
60251D00594J639J397P55M40P28J323J981K631K820J889L1j482j656q94k89k67
$$ plain form
60235 411640 411264 411093 411403 412201 413370 414888 416956 419880 423711 428087 432555 436962 441326 445477 449131
60220 449131 452303 455415 458992 463396 468724 474746 481053 487517 494515 502415 510926 519264 526946 534104
60206 534104 541060 547939 554741 561464 567999 574101 579539 584151 587786 590426 592399 594165 595847 597146
60192 597146 597782 597787 597247 596013 593825 590613 586519 581660 575988 569460 562409 555685 550233 546316 543264
60177 543264 540165 536702 533150 529738 526398 523159 520370 518351 516964 515698 514098 512094 510050 508464
60163 508464 507460 506584 505297 503706 502528 502247 502535 502683 502451 502282 502744 503908 505270 506205 506514 506594 507059
60146 507059 508182 509724 511274 512661 514062 515891 518598 522406 527095 532159 537300 542684 548634 555128
60132 555128 561758 568127 574105 579672 584672 588827 591925 593970 595237 596211 597345 598745 600176 601518
$$ packed form
60235D11640l76j71L10P98J169J518K068K924L831M376M468M407M364M151L654
60220D49131L172L112L577M404N328O022O307O464O998P900Q511Q338P682P158
60206E34104O956O879O802O723O535O102N438M612L635K640J973J766J682J299
60192E97146O36Nn40j234k188l212m094m859n672o528p051o724n452l917l052
60177E43264l099l463l552l412l340l239k789k019j387j266j600k004k044j586
60163E08464j004q76j287j591j178k81K88J48k32j69M62J164J362R35L09Q0M65
60146E07059J123J542J550J387J401J829K707L808M689N064N141N384N950O494
60132E55128O630O369N978N567N000M155L098K045J267R74J134J400J431J342
$$ plain form
60118 601518 603063 605149 607532 609505 610679 611372 612039 612621 612725 612225 611333 610201 608780 607058 605163 603243
60102 603243 601400 599626 597640 595010 591820 588988 587414 586917 586583 586090 586002 586658 587580 588368 589397 590955
60086 590955 592234 592003 590071 587332 584474 581395 578001 574811 572365 570454 568348 565557 562059 557936
60072 557936 553167 547781 541960 535875 529553 523052 516726 511103 506446 502493 498757 494946 491010 486936
60058 486936 482826 479121 476433 474959 474252 473644 472794 471864 471431 472194 474481 477966 482089 486745 492161 498142
60042 498142 503953 509105 513770 518206 522292 525897 529150 531917 533543 533656 532796 531657 530095 527595 524361
60027 524361 521096 517884 514128 509595 504630 499193 492598 484617 476110 468045 460443 452882 445635 439570
60013 439570 435021 431366 427805 424222 421102 418800 417046 415167 412786 410273 408364 407393 407088 407129 407533
$$ packed form
60118F01518J545K086K383J973J174O93O67N82J04n00q92j132j421j722j895j920
60102F03243j843j774j986k630l190k832j574m97l34m93q8O56R22P88J029J558
60086E90955J279k31j932k739k858l079l394l190k446j911k106k791l498m123
60072E57936m769n386n821o085o322o501o326n623m657l953l736l811l936m074
60058D86936m110l705k688j474p07o08q50r30m33P63K287L485M123M656N416N981
60042D98142N811N152M665M436M086L605L253K767J626J13q60j139j562k500l234
60027E24361l265l212l756m533m965n437o595p981q507q065p602p561p247o065
60013D39570m549l655l561l583l120k302j754j879k381k513j909r71l05M1M04
$$ plain form
59998 407533 408340 409255 410038 411011 412738 415173 417596 419529 421355 423779 426993 430672 434596 438788 443043
59983 443043 446748 449413 451098 452166 452824 453049 452712 451548 449313 446300 443434 441446 440098 438627 436727
59968 436727 434640 432536 430526 429248 429580 431503 433889 435766 437219 438751 440355 441707 442753 443577 444062
59953 444062 444151 444076 443859 443060 441617 440461 440539 441480 442053 441843 441667 442244 443175 443485 442661 440889 438685 436578
59935 436578 434940 433907 433512 433861 435149 437719 442210 449187 458199 467519 475303 480875 484525 486494 486843
59920 486843 485954 484320 481921 478686 475527 473987 474611 476446 478388 480301 482504 485005 487760 491037 494870
59905 494870 498563 501348 503179 504375 504841 504264 502873 501368 500098 498857 497526 496462 496066 496314 496938
59890 496938 497926 499567 501998 504845 507463 509628 511851 514867 518870 523465 528302 533482 539242 545464
$$ packed form
59998D07533Q07R15P83R73J727K435K423J933J826K424L214L679L924M192M255
59983D43043L705K665J685J068O58K25l37j164k235l013k866j988j348j471j900
59968D36727k087k104k010j278L32J923K386J877J453J532J604J352J046Q24M85
59953D44062Q9p5k17p99j443j156P8R41N73k10j76N77R31L10q24j772k204k107
59935D36578j638j033l95L49J288K570M491O977R012R320P784N572L650J969L49
59920D86843q89j634k399l235l159j540O24J835J942J913K203K501K755L277L833
59905D94870L693K785J831J196M66n77j391j505j270j241j331j064l96K48O24
59890D96938R88J641K431K847K618K165K223L016M003M595M837N180N760O222
$$ plain form
59876 545464 551698 557521 562691 566995 570141 571957 572749 573267 574074 574964 575280 574850 574237 573945 573836 573619 573451
59859 573451 573553 573631 573337 573125 573975 576328 579838 584058 588766 593702 598732 604333 611128 618683 625372 629724
59843 629724 631418 630847 628404 624668 620713 617634 615897 615367 615598 615811 615041 612732 609045 604398 599034
59828 599034 593227 587509 582298 577594 573317 569661 566741 564156 561263 557823 554174 550900 548461 546888
59814 546888 545684 544291 542812 542001 542350 543504 544753 545735 546378 546538 546141 545509 545116 545030 544806 543913 542100
59797 542100 539462 536310 532947 529542 526214 523090 520073 516786 513131 509750 507352 505609 503308 499765
59783 499765 495465 491180 487096 483199 479887 477664 476561 476256 476483 477004 477568 478239 479446 481325 483349
59768 483349 484976 486375 488232 491120 495301 500768 507144 513883 520867 528389 536291 543667 549905 555614
$$ packed form
59876E45464O234N823N170M304L146J816P92N18Q07Q90L16m30o13k92j09k17j68
59859E73451J02P8k94k12Q50K353L510M220M708M936N030N601O795P555O689M352
59843F29724J694n71k443l736l955l079j737n30K31K13p70k309l687m647n364
59828E99034n807n718n211m704m277l656k920k585k893l440l649l274k439j573
59814E46888j204j393j479q11L49J154J249R82O43J60l97o32l93q6k24q93j813
59797E42100k638l152l363l405l328l124l017l287l655l381k398j743k301l543
59783D99765m300m285m084l897l312k223j103l05K27N21N64O71J207J879K024
59768D83349J627J399J857K888M181N467O376O739O984P522P902P376O238N709
$$ plain form
59754 555614 562021 569750 578579 588011 597553 606743 615355 623345 630396 635971 640178 643943 647792 651109
59740 651109 653265 654777 656453 657935 658232 657379 656376 655556 654176 651817 649130 646878 645095 643582 642431
59725 642431 641622 640703 639383 638011 637074 636578 636258 636030 635902 635688 635096 634006 632580 631288 630821 631674 633738
59708 633738 636584 640115 644551 649794 655268 660471 665321 669878 674240 678845 684374 691051 698378 705772
59694 705772 713132 720507 727528 733443 737487 739069 737963 734697 730545 726740 723630 720738 717474 713604
59680 713604 709104 703898 697879 691115 683910 676623 669518 662776 656554 650773 644936 638577 632041 626410
59666 626410 622371 619448 616753 614184 612477 612264 613544 615900 618710 621287 623386 625561 628559 632410
59652 632410 636593 640919 645511 649917 653062 654364 654196 652912 650107 645352 639085 632099 624485 615817
$$ packed form
59754E55614O407P729Q829R432R542R190Q612P990P051N575M207L765L849L317
59740F51109K156J512J676J482K97q53j003q20j380k359k687k252j783j513j151
59725F42431q09r19j320j372r37m96l20k28j28k14n92j090j426j292m67Q53K064
59708F33738K846L531M436N243N474N203M850M557M362M605N529O677P327P394
59694G05772P360P375P021N915M044J582j106l266m152l805l110k892l264l870
59680G13604m500n206o019o764p205p287p105o742o222n781n837o359o536n631
59666F26410m039k923k695k569j707k13J280K356K810K577K099K175K998L851
59652F32410M183M326M592M406L145J302j68j284k805m755o267o986p614q668
$$ plain form
59638 615817 606264 596927 588912 582433 576964 571990 567477 563684 560665 558011 555161 551847 548088 543790
59624 543790 538678 532728 526409 520340 514824 509831 505193 500712 496189 491543 486844 482228 477952 474458
59610 474458 472131 470825 469916 468957 468136 467953 468561 469578 470445 470888 471108 471573 472522 473731 474820 475730 476693
59593 476693 477857 479206 480842 482990 485581 488027 489512 489455 487807 485125 482304 479948 478018 476291 474903
59578 474903 474002 473026 470975 467521 463384 459493 456261 453721 451775 450078 448220 446296 444819 443839 442786
59563 442786 441441 440424 440268 440663 441188 442107 443694 445359 446347 446958 448057 449658 451040 452217 454121 457145
59547 457145 460562 463803 467370 471953 477490 483797 491413 501096 512945 526740 542583 560145 577455
59534 577455 591432 599864 602411 599882 593480 584887 576158 568891 563756 560940 560412 561423 562474 562506 561846
$$ packed form
59638F15817r553r337q015o479n469m974m513l793l019k654k850l314l759m298
59624E43790n112n950o319o069n516m993m638m481m523m646m699m616m276l494
59610D74458k327j306r09r59q21j83O08J017Q67M43K20M65R49J209J089R10R63
59593D76693J164J349J636K148K591K446J485n7j648k682k821k356j930j727j388
59578D74903r01r76k051l454m137l891l232k540j946j697j858j924j477r80j053
59563D42786j345j017j56L95N25R19J587J665R88O11J099J601J382J177J904L024
59547D57145L417L241L567M583N537O307P616R683J1849J3795J5843J7562J7310
59534E77455J3977Q432K547k529o402q593q729p267n135k816n28J011J051L2o60
$$ plain form
59519 561846 561422 561335 560827 559442 557436 554947 551471 546534 540513 534381 528790 523644 518461 512961 507276
59504 507276 501725 496491 491560 486954 482877 479550 477077 475580 475235 475930 477126 478347 479654 481276 482955
59489 482955 484181 485036 486244 488282 490922 493826 497104 501005 505359 509659 513512 516844 519889 523118
59475 523118 526893 530975 534575 537036 538351 538983 539431 539950 540328 539961 538588 537002 536450 537219 538430 539456
59459 539456 540844 543350 546746 550287 553924 558349 564026 570713 577762 584372 589828 594084 597925 601956
59445 601956 605578 607497 607137 604977 601605 597174 591902 586445 581456 577042 572866 568576 564088 559679
59431 559679 555829 552847 550688 549261 548731 549315 551054 554112 558991 565991 574603 583946 593801 604800
59417 604800 617584 632112 647892 664751 683338 704657 728568 752477 772050 783803 786965 782960
$$ packed form
59519E61846m24q7n08j385k006k489l476m937o021o132n591n146n183n500n685
59504E07276n551n234m931m606m077l327k473j497l45O95J196J221J307J622J679
59489D82955J226Q55J208K038K640K904L278L901M354M300L853L332L045L229
59475E23118L775M082L600K461J315O32M48N19L78l67j373j586n52P69J211J026
59459E39456J388K506L396L541L637M425N677O687P049O610N456M256L841M031
59445F01956L622J919l60k160l372m431n272n457m989m414m176m290m488m409
59431E59679l850k982k159j427n30N84J739L058M879P000Q612R343R855J0999
59417F04800J2784J4528J5780J6859J8587K1319K3911K3909J9573J1753L162m005
$$ plain form
59405 782960 773995 762683 752018 744430 740929 741822 747667 758309 771219 782102 787492 786183 778503
59392 778503 765602 749686 733564 719066 706367 695155 685687 678306 672723 668385 665043 662569 660690
59379 660690 659280 658389 657656 656319 654274 652521 651965 652106 651483 649214 645712 642174 639719 638825 639187 640138
59363 640138 641281 642604 644112 645835 648205 651916 657152 663348 669842 676425 683269 690860 700022 711286
59349 711286 724052 737059 749909 763446 778309 793878 809151 823908 838335 851982 863867
59338 863867 873303 880070 884022 885120 883702 880277 875068 868042 859183 848560 836406 823359 810258
59325 810258 797449 784654 771778 759312 747558 736003 724016 711832 700285 689777 680035 670713
59313 670713 661751 653241 645305 638099 631730 626248 621854 618862 617334 617088 618260 621482 627288 635671
$$ packed form
59405G82960q965j1312j0665p588l501Q93N845J0642J2910J0883N390j309p680
59392G78503j2901j5916j6122j4498j2699j1212r468p381n583m338l342k474j879
59379F60690j410q91p33j337k045j753n56J41o23k269l502l538k455q94L62R51
59363F40138J143J323J508J723K370L711N236O196O494O583O844P591R162J1264
59349G11286J2766J3007J2850J3537J4863J5569J5273J4757J4427J3647J1885
59338H63867R436O767L952J098j418l425n209p026q859j0623j2154j3047j3101
59325H10258j2809j2795j2876j2466j1754j1555j1987j2184j1547j0508r742r322
59313F70713q962q510p936p206o369n482m394k992j528k46J172L222N806Q383
$$ plain form
59299 635671 646292 658453 670404 679242 682279 678537 668798 654687 638171 621506 606727 594858
59287 594858 585713 578427 572169 566671 562404 560064 559796 561103 563484 566779 570856 575553 581109 588077
59273 588077 596577 606153 616495 627656 639294 650463 660588 669923 678638 686202 692217 697124 701345
59260 701345 704394 705568 704929 702893 699490 694899 690149 686264 683134 680211 677879 677011 677364 677617 677107
59245 677107 676632 677340 679628 683239 687747 692682 697673 702585 707196 710933 713403 715025 716478 717700 717969
59230 717969 716797 714153 709990 704306 697559 690324 682607 674123 665097 656077 647142 638093 629318 621531
59216 621531 614652 607870 601020 595028 590713 587868 585783 583963 582078 579930 577840 576488 576041 575942 575785
59201 575785 575832 576412 577358 578458 579981 582425 586047 590846 596596 602698 608434 613645 618785 624138 629408
$$ packed form
59299F35671J0621J2161J1951Q838L037l742r739j4111j6516j6665j4779j1869
59287E94858r145p286o258n498m267k340k68J307K381L295M077M697N556O968
59273E88077Q500R576J0342J1161J1638J1169J0125R335Q715P564O015M907M221
59260G01345L049J174o39k036l403m591m750l885l130k923k332q68L53K53n10
59245F77107m75P08K288L611M508M935M991M912M611L737K470J622J453J222K69
59230G17969j172k644m163n684o747p235p717q484r026r020q935r049q775p787
59216F21531o879o782o850n992m315k845k085j820j885k148k090j352m47r9j57
59201E75785M7N80R46J100J523K444L622M799N750O102N736N211N140N353N270
$$ plain form
59186 629408 634308 639071 644107 649497 655027 660287 664531 666948 667524 667303 667398 667941 668206 667483 665608 662986
59170 662986 660434 658700 657752 656726 654861 652306 649737 647455 645298 643269 641665 640398 638561 635065
59156 635065 629702 623376 617180 611382 605438 598871 591873 584976 578436 572187 566264 560976 556612 553038
59142 553038 549590 545401 540093 534179 528625 523947 519992 516532 513590 511065 508613 506265 504669 504257
59128 504257 504576 504967 505538 506918 509293 512330 515848 519989 524832 530390 536878 544521 553159 562487 572472
59113 572472 583034 593565 603424 612780 622312 632146 641761 650918 659948 668957 677348 684346 689544 692827
59099 692827 694263 694234 693280 691637 689256 686233 682862 679268 675453 671749 668807 667005 666172 665829 665420 664421
59083 664421 662655 660430 657964 654846 650561 645447 640503 636217 632080 627280 621457 614857 608188 602314
$$ packed form
59186F29408M900M763N036N390N530N260M244K417N76k21R5N43K65p23j875k622
59170F62986k552j734r48j026j865k555k569k282k157k029j604j267j837l496
59156F35065n363o326o196n798n944o567o998o897o540o249n923n288m364l574
59142E53038l448m189n308n914n554m678l955l460k942k525k452k348j596m12
59128E04257L19L91N71J380K375L037L518M141M843N558O488P643Q638R328R985
59113E72472J0562J0531R859R356R532R834R615R157R030R009Q391O998N198L283
59099F92827J436k9r54j643k381l023l371l594l815l704k942j802q33l43m09r99
59083F64421j766k225k466l118m285n114m944m286m137m800n823o600o669n874
$$ plain form
59069 602314 597580 593455 589214 584800 580624 576814 573351 570628 569030 567972 566200 563177 559569 556344
59055 556344 554040 552848 552577 552414 551498 549962 548706 548064 547441 546438 545547 545380 545919 546862 548118 549574
59039 549574 550901 551975 553164 554966 557709 561632 566763 572625 578511 584163 589722 595176 600518 606456
59025 606456 614099 623749 634607 645852 657372 669306 681508 693631 705046 714614 721275 725022
59013 725022 726586 726130 723182 718081 712431 707656 703922 700923 698851 697983 698066 698831 700579 703656 707779
58998 707779 712327 716938 721406 725503 729200 732620 735438 736877 736583 734950 732302 728398 723117 717088
58984 717088 711212 706040 701892 699002 697269 696407 696648 698690 702706 708011 713934 720350 727295 734903 743850
58969 743850 754789 767006 778720 789139 799079 809045 818035 825153 831138 837053 842371 845647 846489
$$ packed form
59069F02314m734m125m241m414m176l810l463k723j598j058j772l023l608l225
59055E56344k304j192k71j63r16j536j256o42o23j003q91j67N39R43J256J456
59039E49574J327J074J189J802K743L923N131N862N886N652N559N454N342N938
59025F06456P643R650J0858J1245J1520J1934J2202J2123J1415R568O661L747
59013G25022J564m56k948n101n650m775l734k999k072q68Q3P65J748L077M123
58998G07779M548M611M468M097L697L420K818J439k94j633k648l904n281o029
58984G17088n876n172m148k890j733q62K41K042M016N305N923O416O945P608Q947
58969G43850J0939J2217J1714J0419R940R966Q990P118N985N915N318L276Q42
$$ plain form
58956 846489 845621 843455 839731 834226 826833 817285 805839 793935 783194 773892 765155 756307 747251 737978
58942 737978 728788 720795 715157 711748 709292 706775 704076 701449 699171 697623 697028 697097 697458 698235 699672
58927 699672 701500 703275 705019 706874 708507 709624 710746 712550 714679 716155 716883 717819 719684 722424 725985
58912 725985 730718 736734 743631 751161 759526 768693 777965 786611 794628 802583 810887 819380 827530 834983
58898 834983 841865 848424 854362 858925 861796 863532 864940 866597 869283 874135 881743 891532 902673 915086
58884 915086 928840 943051 956298 967863 977787 985984 992273 997108 1001227 1004415 1005487 1003831 1000330
58871 1000330 996471 993005 989732 986184 982156 977695 972714 966710 959043 949497 938257 925336 910697
58858 910697 895126 880144 866438 853039 838811 824137 810256 797448 784977 772567 760811
$$ packed form
58956H46489q68k166l724n505p393r548j1446j1904j0741r302q737q848r056r273
58942G37978r190p993n638l409k456k517k699k627k278j548n95O9L61P77J437
58927F99672J828J775J744J855J633J117J122J804K129J476P28R36J865K740L561
58912G25985M733O016O897P530Q365R167R272Q646Q017P955Q304Q493Q150P453
58898H34983O882O559N938M563K871J736J408J657K686M852P608R789J1141J2413
58884I15086J3754J4211J3247J1565R924Q197O289M835M119L188J072j656l501
58871A000330l859l466l273l548m028m461m981o004p667r546j1240j2921j4639
58858I10697j5571j4982j3706j3399j4228j4674j3881j2808j2471j2410j1756
$$ plain form
58847 760811 750153 740386 731241 722574 713917 704672 694930 685335 676007 666340 656111 646114 637365 630141
58833 630141 624075 618769 614087 610102 606915 604404 602239 600333 599102 598940 599720 601178 603453 606699 610477
58818 610477 614217 618135 622987 628912 635062 640401 644438 647258 649306 651052 652416 652701 651439 649076
58804 649076 646322 643222 639471 635312 631332 627618 623874 620196 616884 613576 609430 604291 598945 594173
58790 594173 590175 586943 584487 582654 581352 581019 582209 584734 587844 591309 595609 601036 607289 614031
58776 614031 621096 627958 633706 637879 640752 642506 642591 640258 635432 628817 621308 613417 605127 596368 587672
58761 587672 580007 573652 567740 561518 555681 551626 549565 548238 546524 544596 543344 543313 544384 545932 547058
58746 547058 547109 546196 545017 544258 544429 546053 549440 554261 559785 565511 571303 577111 582940 588881 594826
$$ packed form
58847G60811j0658r767r145q667q657r245r742r595r328r667j0229r997q749p224
58833F30141o066n306m682l985l187k511k165j906j231j62P80J458K275L246L778
58818F10477L740L918M852N925O150N339M037K820K048J746J364K85j262k363
58804F49076k754l100l751m159l980l714l744l678l312l308m146n139n346m772
58790E94173l998l232k456j833j302l33J190K525L110L465M300N427O253O742
58776F14031P065O862N748M173K873J754Q5k333m826o615p509p891q290q759q696
58761E87672p665o355n912o222n837m055k061j327j714j928j252l1J071J548J126
58746E47058N1r13j179p59J71J624L387M821N524N726N792N808N829N941N945
$$ plain form
58731 594826 600427 605669 611067 616802 622205 626637 630413 634149 637757 640923 644106 648054 652631 657100
58717 657100 661298 665561 669741 673393 676832 680917 685705 690216 693560 695472 695761 694113 690508 685082
58703 685082 677630 667895 656174 642904 628020 611645 595037 579685 565725 552421 539944 529292
58691 529292 520565 512837 505838 500183 495646 490788 484962 479347 475178 472059 468892 465567 462820 461020
58677 461020 459862 458939 458100 457539 457750 459106 461446 464471 468339 473200 478476 483601 489377 497388 507894
58662 507894 519264 529595 537835 543258 545260 544232 541551 538027 533145 526215 517492 507889 498422 490207
58648 490207 484025 479517 475647 472216 469983 469100 468591 467810 467237 467274 467321 466752 465939 465677 466317 467943 470542
58631 470542 473466 475590 476583 477282 478318 479199 479235 478579 477789 477097 476601 476454 476442 476190 476194 477761 481370 485937
$$ packed form
58731E94826N601N242N398N735N403M432L776L736L608L166L183L948M577M469
58717F57100M198M263M180L652L439M085M788M511L344J912K89j648l605n426
58703F85082p452r735j1721j3270j4884j6375j6608j5352j3960j3304j2477j0652
58691E29292q727p728o999n655m537m858n826n615m169l119l167l325k747j800
58677D61020j158r23q39n61K11J356K340L025L868M861N276N125N776Q011J0506
58662E07894J1370J0331Q240N423K002j028k681l524m882o930q723r603r467q215
58648D90207o182m508l870l431k233q83n09p81n73L7M7n69q13k62O40J626K599
58631D70542K924K124R93O99J036Q81L6o56p90o92m96j47j2k52MJ567L609M567
$$ plain form
58613 485937 490252 494346 498845 503702 508225 511780 513990 514865 515162 516020 517821 519949 521791 523281 524276
58598 524276 524326 523377 521918 520289 518672 517758 518327 519993 521633 523274 526272 531318 537685 544888 553524
58583 553524 563739 574346 584378 594181 604080 613308 621358 629111 637347 645185 651405 656566 662499
58570 662499 670203 679362 689575 701120 714713 731151 750831 773273 797573 823461 850987 878961
58558 878961 904931 927278 946156 961814 973309 979755 981667 980155 975870 969666 963135 957329 951809
58545 951809 945842 939580 933130 925506 915625 903445 889151 872206 852312 830492 808117 785683
58533 785683 763469 742496 723736 707182 692680 680749 671530 663878 656616 649858 644071 638864 633870
58520 633870 629770 627095 624821 621535 617323 613286 609885 606970 604689 603156 601892 600684 600238 600917 601746
$$ packed form
58613D85937M315M094M499M857M523L555K210Q75K97Q58J801K128J842J490R95
58598E24276N0r49j459j629j617r14N69J666J640J641K998N046O367P203Q636
58583E53524J0215J0607J0032R803R899R228Q050P753Q236P838O220N161N933
58570F62499P704R159J0213J1545J3593J6438J9680K2442K4300K5888K7526K7974
58558H78961K5970K2347J8878J5658J1495O446J912j512m285o204o531n806n520
58545I51809n967o262o450p624r881j2180j4294j6945j9894k1820k2375k2434
58533G85683k2214k0973j8760j6554j4502j1931r219p652p262o758n787n207m994
58520F33870m100k675k274l286m212m037l401k915k281j533j264j208m46O79Q29
$$ plain form
58505 601746 601883 602111 603541 605669 607161 607754 607935 607533 606167 604477 603416 602846 602224 602074 603363 605966
58489 605966 609113 612855 617767 623744 630461 638446 648391 660019 672921 687734 705018 723711 742308
58476 742308 760906 780295 799513 816086 828399 836304 839830 839063 835111 829474 822485 813831 804388
58463 804388 796053 789811 785345 782423 781242 781621 783254 786753 793091 802067 812420 823157 833588 842440
58449 842440 848369 851120 850903 846991 838476 826232 812605 799175 786111 773613 762518 753360 746041
58436 746041 740549 737068 735416 735233 736563 739434 743290 747687 753046 759840 767677 776132 785585 796089
58422 796089 806315 814938 822191 828567 832943 833721 831118 826581 820586 812785 803786 794897 786426 777947
58408 777947 769860 762983 756966 750831 744777 739914 736591 734574 734288 736140 739066 741560 743779 746920
$$ packed form
58505F01746J37K28J430K128J492N93J81m02j366j690j061n70o22j50J289K603
58489F05966L147L742M912N977O717P985R945J1628J2902J4813J7284J8693J8597
58476G42308J8598J9389J9218J6573J2313P905L526p67l952n637o989q654r443
58463H04388q335o242m466k922j181L79J633L499O338Q976J0353J0737J0431Q852
58449H42440N929K751k17l912q515j2244j3627j3430j3064j2498j1095r158p319
58436G46041n492l481j652j83J330K871L856M397N359O794P837Q455R453J0504
58422G96089J0226Q623P253O376M376P78k603m537n995p801q999q889q471q479
58408G77947q087o877o017o135o054m863l323k017k86J852K926K494K219L141
$$ plain form
58394 746920 751011 755087 758995 763065 766368 767367 766082 763784 760907 757169 753408 751234 751042 752231 755099
58379 755099 760493 767734 774898 781207 787360 793729 800009 806442 813535 820784 827421 834073 841907 850591
58365 850591 859035 867622 877629 888870 900045 911035 922688 934701 945853 955938 965302 972980
58353 972980 977640 980021 982066 984051 985000 985436 987066 989956 992620 994827 997858 1002247 1007717 1014957 1024752
58338 1024752 1035702 1045695 1055432 1067612 1082711 1098543 1113944 1129827 1146385 1162252 1176787 1190382
58326 1190382 1202262 1210839 1216593 1221915 1227803 1233213 1237742 1242285 1247077 1251787 1257388 1265133 1273925 1281729
58312 1281729 1289259 1299025 1311066 1323104 1334776 1348025 1363271 1378816 1394227 1410657 1427721 1443721
58300 1443721 1459121 1476011 1494027 1510745 1526215 1542930 1561094 1578290 1594293 1611741 1631323
$$ packed form
58394G46920M091M076L908M070L303R99j285k298k877l738l761k174j92J189K868
58379G55099N394P241P164O309O153O369O280O433P093P249O637O652P834Q684
58365H50591Q444Q587J0007J1241J1175J0990J1653J2013J1152J0085R364P678
58353I72980M660K381K045J985R49M36J630K890K664K207L031M389N470P240R795
58338A024752J0950R993R737J2180J5099J5832J5401J5883J6558J5867J4535J3595
58326A190382J1880Q577N754N322N888N410M529M543M792M710N601P745Q792P804
58312A281729P530R766J2041J2038J1672J3249J5246J5545J5411J6430J7064J6000
58300A443721J5400J6890J8016J6718J5470J6715J8164J7196J6003J7448J9582
$$ plain form
58289 1631323 1650738 1669277 1689123 1711256 1734434 1758935 1786785 1817395 1847594 1877002 1908771
58278 1908771 1944046 1980531 2017623 2057874 2101990 2147325 2192846 2240703 2291408 2342471 2393277
58267 2393277 2446219 2501495 2556103 2609671 2665836 2726093 2787732 2849656 2914465 2982775 3051292
58256 3051292 3118795 3188227 3260652 3333096 3404715 3478989 3557479 3637751 3720025 3809162 3907186
58245 3907186 4010507 4117533 4232039 4355784 4485002 4617862 4758369 4909187 5067846
58236 5067846 5233909 5412311 5605466 5809660 6023612 6252818 6500919 6764849 7043363
58227 7043363 7342157 7665482 8011077 8378737 8775436 9206662 9671455 10171323 10714850
58218 10714850 11308143 11950709 12646339 13407540 14243845 15157917 16159748 17272041 18514954
$$ packed form
58289A631323J9415J8539J9846K2133K3178K4501K7850L0610L0199K9408L1769
58278A908771L5275L6485L7092M0251M4116M5335M5521M7857N0705N1063N0806
58267B393277N2942N5276N4608N3568N6165O0257O1639O1924O4809O8310O8517
58256C051292O7503O9432P2425P2444P1619P4274P8490Q0272Q2274Q9137R8024
58245C907186J03321J07026J14506J23745J29218J32860J40507J50818J58659
58236E067846J66063J78402J93155K04194K13952K29206K48101K63930K78514
58227G043363K98794L23325L45595L67660L96699M31226M64793M99868N43527
58218A0714850N93293O42566O95630P61201Q36305R14072J001831J112293J242913
$$ plain form
58209 18514954 19899972 21447034 23192952 25174488 27420050 29969164 32884669 36238093
58201 36238093 40105822 44594520 49850517 56032227 63300463 71856238 81968268 93957757
58193 93957757 108201745 125176363 145446029 169561032 197963693 230878502 267907045
58186 267907045 307262002 345257354 376880599 397427431 404139596 396811827 377330281
58179 377330281 348817629 314864876 278879193 243553992 210636034 181043646 155125865
58172 155125865 132855610 113958811 98046127 84715848 73582471 64276206 56467615
58165 56467615 49890752 44328556 39591537 35525112 32018792 28987023 26348433 24033066
58157 24033066 21993898 20194793 18595824 17161235 15870714 14710334 13660648 12703736
$$ packed form
58209A8514954J385018J547062J745918J981536K245562K549114K915505L353424
58201C6238093L867729M488698N255997O181710P268236Q555775J0112030J1989489
58193I3957757J4243988J6974618K0269666K4115003K8402661L2914809L7028543
58186B67907045L9354957L7995352L1623245K0546832O712165p327769j9481546
58179C77330281k8512652l3952753l5985683l5325201l2917958k9592388k5917781
58172A55125865k2270255j8896799j5912684j3330279j1133377r306265p808591
58165E6467615o576863n562196m737019m066425l506320l031769k638590k315367
58157B4033066k039168j799105j598969j434589j290521j160380j049686r56912
$$ plain form
58149 12703736 11832889 11044652 10328531 9673415 9076423 8536387 8045478 7595489 7185457
58140 7185457 6814728 6474728 6155480 5854608 5572787 5306261 5051320 4810745 4588320
58131 4588320 4381293 4184675 3998623 3825421 3663553 3510680 3368325 3237918 3116083
58122 3116083 2999120 2888257 2785627 2689195 2596539 2509373 2429307 2353213 2277922 2205658 2139687
58111 2139687 2078254 2017816 1958815 1903241 1849788 1796418 1744802 1697422 1652935 1608817 1565973
58100 1565973 1526542 1489845 1454618 1422501 1395113 1370243 1345009 1320269 1298111 1277606 1256988
58089 1256988 1237373 1220263 1203757 1185248 1165656 1147132 1128828 1108724 1087444 1066455 1044668
58078 1044668 1020675 996312 974118 953160 931127 908744 888353 869787 851409 833746 818454
$$ packed form
58149A2703736q70847p88237p16121o55116n96992n40036m90909m49989m10032
58140G185457l70729l40000l19248l00872k81821k66526k54941k40575k22425
58131D588320k07027j96618j86052j73202j61868j52873j42355j30407j21835
58122C116083j16963j10863j02630r6432r2656q7166q0066p6094p5291p2264o5971
58111B139687o1433o0438n9001n5574n3453n3370n1616m7380m4487m4118m2844
58100A565973l9431l6697l5227l2117k7388k4870k5234k4740k2158k0505k0618
58089A256988j9615j7110j6506j8509j9592j8524j8304k0104k1280k0989k1787
58078A044668k3993k4363k2194k0958k2033k2383k0391j8566j8378j7663j5292
$$ plain form
58067 818454 805014 791833 779349 768836 759491 749815 740449 732619 725265 716767 707973 700371 692799
58054 692799 683164 672051 661535 651784 641920 632747 625432 618746 610828 602452 595477 589401 582654 575999
58040 575999 571184 567270 561761 554659 548119 542734 537328 531866 527414 523523 518523 512145 505327 497955
58026 497955 489351 480394 472553 465395 457610 449829 443754 439126 434251 429051 424925 422038 419367 416992
58012 416992 415748 414971 413167 410632 408994 408499 408178 408250 409699 411769 412543 411982 411902 412939 413927 414363 415149
57995 415149 416646 418031 418726 418696 417451 414622 411296 408857 406806 403648 399543 395927 392833 388884 383794
57980 383794 378633 373664 368170 362516 358200 355643 353910 352757 352911 354032 354403 353127 351063 349302 348196
57965 348196 347993 348783 349666 349432 348196 347031 346160 344970 343562 342632 341890 340244 337508 334525 331731 329087
$$ packed form
58067H18454j3440j3181j2484j0513r345r676r366p830p354q498q794p602p572
58054F92799r635j1113j0516r751r864r173p315o686p918q376o975o076o747o655
58040E75999m815l914n509p102o540n385n406n462m452l891n000o378o818p372
58026D97955q604q957p841p158p785p781o075m628m875n200m126k887k671k375
58012D16992j244p77j804k535j638m95l21P2J449K070P74n61q0J037R88M36P86
57995D15149J497J385O95l0j245k829l326k439k051l158m105l616l094l949n090
57980C83794n161m969n494n654m316k557j733j153J54J121L71j276k064j761j106
57965C48196k03P90Q83k34j236j165q71j190j408r30p42j646k736k983k794k644
$$ plain form
57949 329087 327029 325833 324371 321331 317527 315204 315190 316460 318290 320920 324182 327494 331372 337117 344747
57934 344747 352880 360781 368841 376969 384224 390248 395345 398947 399675 397238 392794 387219 380532 373113
57920 373113 365829 358621 350461 341111 331666 323149 315786 309713 305074 301411 298227 296027 295464 295696 295128
57905 295128 293629 292357 291590 290506 289059 288165 287851 287050 285572 284643 285129 286718 289051 292136 295446 298218
57889 298218 300822 304368 308782 312851 316178 319361 322201 323658 323865 324236 325178 325550 324885 324251 324294 324250 323701
57872 323701 323566 324465 325609 326262 326925 328186 329666 330902 332154 333606 334825 335585 336251 337009 337778 339116
57856 339116 341806 345311 348137 350114 352720 356617 360515 363131 364740 366003 366743 366776 366543 366063 364520
57841 364520 361726 358753 356330 353871 350930 348307 346772 345900 345138 344880 345506 346390 346930 347702 349570 352406
$$ packed form
57949C29087k058j196j462l040l804k323j4J270J830K630L262L312L878N745P630
57934C44747Q133P901Q060Q128P255O024N097L602P28k437m444n575o687p419
57920C73113p284p208q160r350r445q517p363o073m639l663l184k200n63K32n68
57905B95128j499j272p67j084j447q94l14q01j478r29M86J589K333L085L310K772
57889B98218K604L546M414M069L327L183K840J457K07L71R42L72o65o34M3m4n49
57872C23701j35Q99J144O53O63J261J480J236J252J452J219P60O66P58P69J338
57856C39116K690L505K826J977K606L897L898K616J609J263P40L3k33m80j543
57841C64520k794k973k423k459k941k623j535q72p62k58O26Q84N40P72J868K836
$$ plain form
57825 352406 355507 358613 361764 364835 367810 370853 373687 375742 377218 378963 380832 381299 379269 375148
57811 375148 369542 362201 353043 343076 333383 324112 315211 307151 300147 293653 287481 282475 279164 276677
57797 276677 273893 270858 268253 266238 264718 263991 264194 264694 264828 264740 264871 265228 265789 267024 269395 272889
57781 272889 277402 282899 288761 293849 297745 301175 304744 308061 310539 312193 313146 313233 312595 311780 310766
57766 310766 308749 305385 301346 297285 293271 289644 287260 286270 285714 284926 284278 284096 284075 284335 285698 288193
57750 288193 290644 292562 295068 298946 303203 306755 310292 315082 320875 326262 330337 332859 333706 333354 333086
57735 333086 333558 333835 332891 331205 329797 328545 326714 324383 322206 320379 318952 318372 318598 318474 317214 315825
57719 315825 315807 317050 318242 318717 318700 318363 317918 318092 319163 319996 319241 317092 314717 312527 310299 308448 307726
$$ packed form
57825C52406L101L106L151L071K975L043K834K055J476J745J869M67k030m121
57811C75148n606p341r158r967r693r271q901q060p004o494o172n006l311k487
57797B76677k784l035k605k015j520p27K03N00J34q8J31L57N61J235K371L494
57781B72889M513N497N862N088L896L430L569L317K478J654R53Q7o38q15j014
57766C10766k017l364m039m061m014l627k384r90n56p88o48j82k1K60J363K495
57750B88193K451J918K506L878M257L552L537M790N793N387M075K522Q47l52k68
57735C33086M72K77r44j686j408j252j831k331k177j827j427n80K26j24j260j389
57719C15825j8J243J192M75j7l37m45J74J071Q33p55k149k375k190k228j851p22
$$ plain form
57702 307726 307982 308544 309603 311921 315344 318838 321878 324710 327292 329027 329451 328385 325705 321850 318132
57687 318132 315523 313437 310657 307048 303436 300309 297787 296403 296695 298311 300718 304437 310486 318931
57673 318931 329305 342129 358666 379358 403909 432802 467291 507497 551224 594312 631047
57662 631047 654878 660910 648699 622049 586062 545129 503118 463518 428539 398841 374356 354577
57650 354577 338219 323867 311279 301109 293228 286403 279819 273862 269094 265431 262615 260581 259036
57637 259036 257540 256324 256213 257412 259078 260352 261168 261871 262746 264029 265625 266696 266241 264307 261954
57622 261954 259959 258244 256628 255244 254089 252924 251883 251416 251432 251127 249885 247812 245304 242704 240417
57607 240417 238734 237491 236412 235715 235685 235840 235346 234212 233205 232570 231660 229880 227172 223604 219396 215430
$$ packed form
57702C07726K56N62J059K318L423L494L040K832K582J735M24j066k680l855l718
57687C18132k609k086k780l609l612l127k522j384K92J616K407L719O049Q445
57673C18931J0374J2824J6537K0692K4551K8893L4489M0206M3727M3088L6735
57662F31047K3831O032j2211k6650l5987m0933m2011l9600l4979k9698k4485j9779
57650C54577j6358j4352j2588j0170p881o825o584n957m768l663k816k034j545
57637B59036j496j216j11J199J666J274Q16P03Q75J283J596J071m55j934k353
57622B61954j995j715j616j384j155j165j041m67J6l05j242k073k508k600k287
57607B40417j683j243j079o97l0J55m94j134j007o35r10j780k708l568m208l966
$$ plain form
57591 215430 212747 211329 210153 208560 206750 204945 203080 201486 200830 200953 200670 199190 197023 195133 193849
57576 193849 192940 192079 190858 188909 186335 183636 181099 178713 176607 174923 173365 171540 169693 168332 167304
57561 167304 166129 165031 164577 164399 163622 162588 162702 164219 165623 165818 165687 166644 168752 171158 173477 175755
57545 175755 177774 179253 180283 180908 180854 180278 180180 181367 183491 185690 187618 189231 190139 190041 189464 189364 190057
57528 190057 191007 191453 190998 189902 189069 189332 190440 191212 190998 190490 190737 191897 193392 194750 195842 196706 197564
57511 197564 198709 200016 200982 201499 202071 202971 203743 203954 203856 203842 203788 203405 202790 202127 201303 200270 199359 198699 197759
57492 197759 196002 193648 191300 189190 187295 185863 185282 185562 186347 187231 187851 187995 187935 188242 188952 189317 188783
57475 188783 187819 187301 187399 187477 186850 185330 183309 181577 180701 180251 179092 176784 174348 173216 173736 175076 176244
$$ packed form
57591B15430k683j418j176j593j810j805j865j594o56J23k83j480k167j890j284
57576A93849r09q61j221j949k574k699k537k386k106j684j558j825j847j361j028
57561A67304j175j098m54j78p77j034J14J517J404J95j31R57K108K406K319K278
57545A75755K019J479J030O25n4n76r8J187K124K199J928J613R08r8n77j00O93
57528A90057R50M46m55j096q33K63J108P72k14n08K47J160J495J358J092Q64Q58
57511A97564J145J307R66N17N72R00P72K11r8j4n4l83o15o63q24j033r11o60r40
57492A97759j757k354k348k110j895j432n81K80P85Q84O20J44o0L07P10L65n34
57475A88783r64n18R8P8o27j520k021j732q76m50j159k308k436j132N20J340J168
$$ plain form
57458 176244 176789 176796 176637 176623 176722 176791 177097 178085 179498 180354 180110 179259 178397 177324 175625 173655 172326 172176 173036
57439 173036 174317 175301 175596 175628 176214 177330 177942 177542 177133 177917 179554 180670 180760 180639 181083 181909 182554 182897
57421 182897 183265 183953 184903 185705 186045 186220 186945 188315 189350 189041 187647 186490 186587 187894 189722 191468 192948
57404 192948 194343 195789 196932 197148 196382 195412 194992 195107 195412 195999 197128 198518 199555 200177 201031 202683
57388 202683 204980 207208 208667 209223 209533 210618 212900 215753 218171 219752 220829 221893 223180 224716 226451
57373 226451 228287 230028 231313 231760 231381 230732 230305 229848 228737 226986 225413 224796 225342 226852 228759 230050
57357 230050 229996 229063 228259 227548 225976 223628 222148 222645 224183 225254 225824 226820 228359 229688 230530 231392 232670
57340 232670 234316 236258 238449 240675 242911 245598 248939 252270 254769 256461 257834 258873 259277 259387 260032
$$ packed form
57458A76244N45Pj59j4R9O9L06R88J413Q56k44q51q62j073j699j970j329j50Q60
57439A73036J281R84K95L2N86J116O12m00m09P84J637J116R0j21M44Q26O45L43
57421A82897L68O88R50Q02L40J75P25J370J035l09j394j157R7J307J828J746J480
57404A92948J395J446J143K16p66r70m20J15L05N87J129J390J037O22Q54J652
57388B02683K297K228J459N56L10J085K282K853K418J581J077J064J287J536J735
57373B26451J836J741J285M47l79o49m27m57j111j751j573o17N46J510J907J291
57357B30050n4r33q04p11j572k348j480M97J538J071N70R96J539J329Q42Q62J278
57340B32670J646J942K191K226K236K687L341L331K499J692J373J039M04J10O45
$$ plain form
57325 260032 261542 263547 265620 267516 269004 270053 271012 272084 272913 273199 273270 273477 273621 273705 274629 277051 280027
57308 280027 281979 282783 283747 285642 287985 290318 292939 296007 298989 301490 303866 306600 309702 313071 316867
57293 316867 321122 325395 329131 332155 334744 337399 340395 343279 345124 345706 346015 347050 348582 349948 351525
57278 351525 354319 358250 362102 365191 368060 371431 375560 380814 387596 395284 402368 408250 414026 420842
57264 420842 428322 435343 441689 448112 455131 462548 470027 477560 485338 493416 501501 509098 516007 522616
57250 522616 529423 536464 543654 551448 560392 570100 579503 588227 596903 605906 614666 622668 630425 638891
57236 638891 648400 658644 669314 680317 691644 703316 715302 727421 739636 752404 766151 780404
57224 780404 794156 807267 820847 835931 852431 869724 887672 906517 926266 946597 967138
$$ packed form
57325B60032J510K005K073J896J488J049R59J072Q29K86P1K07J44Q4R24K422K976
57308B80027J952Q04R64J895K343K333K621L068K982K501K376K734L102L369L796
57293C16867M255M273L736L024K589K655K996K884J845N82L09J035J532J366J577
57278C51525K794L931L852L089K869L371M129N254O782P688P084N882N776O816
57264D20842P480P021O346O423P019P417P479P533P778Q078Q085P597O909O609
57250E22616O807P041P190P794Q944R708R403Q724Q676R003Q760Q002P757Q466
57236F38891R509J0244J0670J1003J1327J1672J1986J2119J2215J2768J3747J4253
57224G80404J3752J3111J3580J5084J6500J7293J7948J8845J9749K0331K0541
$$ plain form
57213 967138 987577 1007799 1028144 1049119 1070736 1092505 1114144 1135773 1157340 1178560 1199585
57202 1199585 1221024 1243007 1264975 1286786 1309301 1333371 1358897 1385408 1412962 1441827 1471792
57191 1471792 1502541 1534365 1567791 1602599 1637744 1672247 1705897 1739195 1772790 1806757 1840390
57180 1840390 1872964 1904735 1936629 1968980 2001274 2033325 2065829 2099328 2133532 2168302 2204504
57169 2204504 2242995 2283319 2324316 2365698 2408129 2451932 2496609 2541596 2586736 2631901 2676801
57158 2676801 2721380 2765962 2810733 2855273 2898783 2940700 2981080 3020262 3058053 3093370 3125126
57147 3125126 3153441 3179505 3204208 3227331 3248070 3265664 3279569 3290116 3299555 3311529 3328585
57136 3328585 3350537 3375631 3402694 3431553 3462159 3494304 3527867 3562540 3597531 3632118 3666202
$$ packed form
57213I67138K0439K0222K0345K0975K1617K1769K1639K1629K1567K1220K1025
57202A199585K1439K1983K1968K1811K2515K4070K5526K6511K7554K8865K9965
57191A471792L0749L1824L3426L4808L5145L4503L3650L3298L3595L3967L3633
57180A840390L2574L1771L1894L2351L2294L2051L2504L3499L4204L4770L6202
57169B204504L8491M0324M0997M1382M2431M3803M4677M4987M5140M5165M4900
57158B676801M4579M4582M4771M4540M3510M1917M0380L9182L7791L5317L1756
57147C125126K8315K6064K4703K3123K0739J7594J3905J0547R439J1974J7056
57136C328585K1952K5094K7063K8859L0606L2145L3563L4673L4991L4587L4084
$$ plain form
57125 3666202 3699774 3732413 3764077 3796060 3830366 3868469 3911325 3960081 4015745 4078336 4147270
57114 4147270 4222486 4304599 4394340 4492831 4602340 4725951 4866596 5027129 5211202 5423474
57104 5423474 5669399 5955808 6291665 6687881 7157222 7715644 8383314 9183258 10139592
57095 10139592 11278082 12627085 14215313 16068208 18206984 20648148 23398298 26446644
57087 26446644 29762423 33294714 36964789 40655249 44217956 47509913 50430763 52926365
57079 52926365 54958187 56474003 57406946 57694733 57297198 56206402 54455421 52123048
57071 52123048 49324187 46186982 42831822 39363453 35872858 32440120 29135074 26016592
57063 26016592 23130396 20505749 18154233 16072650 14247653 12658902 11281254 10087932
$$ packed form
57125C666202L3572L2639L1664L1983L4306L8103M2856M8756N5664O2591O8934
57114D147270P5216Q2113Q9741R8491J09509J23611J40645J60533J84073K12272
57104E423474K45925K86409L35857L96216M69341N58422O67670P99944R56334
57095A0139592J138490J349003J588228J852895K138776K441164K750150L048346
57087B6446644L315779L532291L670075L690460L562707L291957K920850K495602
57079E2926365K031822J515816R32943K87787l97535j090796j750981k332373
57071E2123048k798861l137205l355160l468369l490595l432738l305046l118482
57063B6016592k886196k624647k351516k081583j824997j588751j377648j193322
$$ plain form
57055 10087932 9053810 8156555 7376015 6694115 6095581 5568019 5101047 4685769 4314901
57046 4314901 3982604 3683888 3414412 3170651 2949678 2748717 2565363 2398244 2246978
57037 2246978 2111351 1990751 1884295 1791092 1710450 1642186 1586674 1544397 1515990 1503221 1508920
57026 1508920 1533768 1571934 1610350 1633224 1628287 1590553 1522662 1432885 1331719 1228418 1129411
57015 1129411 1038907 959602 892187 835032 785587 742297 704968 673709 648081 627064 609305
57004 609305 593502 578963 565814 554451 544951 537141 530900 526041 522133 518683 515382 512081 508886
56991 508886 506434 505607 506653 508991 512171 516589 522881 531076 540603 550493 558958 563359 561474 552751
56977 552751 537876 517672 493212 466664 440825 417521 397032 379090 363782 351316 341660 334825
$$ packed form
57055A0087932j034122q97255p80540o81900n98534n27562m66972m15278l70868
57046D314901l32297k98716k69476k43761k20973k00961j83354j67119j51266
57037B246978j35627j20600j06456r3203q0642o8264n5512m2277k8407j2769N699
57026A508920K4848L8166L8416K2874m937l7734o7891q9777j01166j03301r9007
57015A129411r0504p9305o7415n7155m9445m3290l7329l1259k5628k1017j7759
57004F09305j5803j4539j3149j1363r500p810o241m859l908l450l301l301l195
56991E08886k452q27J046K338L180M418O292Q195R527R890Q465M401j885q723
56977E52751j4875k0204k4460k6548k5839k3304k0489j7942j5308j2466r656o835
$$ plain form
56965 334825 331100 330640 333063 337805 344844 354988 369390 388582 411618 436021 458524 475942 485627
56952 485627 485933 476857 460170 438583 414719 390731 368244 348121 330518 315558 303729 295331
56940 295331 290019 287387 287735 291700 299477 311036 326866 347727 373613 403355 434943 465443 490698
56927 490698 506165 508821 498431 477195 448543 415963 382178 348965 317704 289715 265685 245195
56915 245195 227468 212452 200519 191299 183643 176741 170548 165104 160263 156249 153666 152587 152276 152092
56901 152092 152092 152462 153063 153980 155926 159518 164492 170086 175938 182251 189405 197882 208386 221606 237786
56886 237786 256534 276737 296422 312988 324082 328495 326351 318723 307191 293533 279479 266540
56874 266540 255833 247885 242685 240147 240445 243775 250008 258996 271097 287060 307490 332768 363359
$$ packed form
56965C34825l725m60K423M742P039J0144J4402J9192K3036K4403K2503J7418R685
56952D85627L06r076j6687k1587k3864k3988k2487k0123j7603j4960j1829q398
56940B95331n312k632L48L965P777J1559J5830K0861K5886K9742L1588L0500K5255
56927D90698J5467K656j0390k1236k8652l2580l3785l3213l1261k7989k4030k0490
56915B45195j7727j5016j1933r220p656o902o193n444m841m014k583j079l11j84
56901A52092%L70O01R17J946L592M974N594N852O313P154Q477J0504J3220J6180
56886B37786J8748K0203J9685J6566J1094M413k144p628j1532j3658j4054j2939
56874B66540j0707p948n200k538K98L330O233Q988J2101J5963K0430K5278L0591
$$ plain form
56861 363359 399634 441195 486444 532396 574421 606700 624253 625283 611565 586845 555435 521781
56849 521781 489721 461231 436441 415402 399345 389765 386986 390379 399625 415138 437589 467721
56837 467721 506546 555062 613564 681248 755835 832596 903595 958941 990166 993440 970326 926046
56825 926046 867177 800351 731858 667091 609588 560605 519842 486579 460193 440172 426348
56814 426348 419140 419211 426907 442364 466060 498708 540390 589675 643050 694564 736415 761263
56802 761263 765082 748209 714158 667966 615229 561248 510024 464000 424686 392913 368325 349398
56790 349398 334688 323939 317811 316860 321035 329832 342679 359445 380645 406589 435935 465226
56778 465226 489992 506137 510657 502235 481967 453219 420140 386105 353284 322887 295363 270743
$$ packed form
56861C63359L6275M1561M5249M5952M2025L2279J7553J030j3718k4720l1410l3654
56849E21781l2060k8490k4790k1039j6057r580k779L393R246J5513K2451L0132
56837D67721L8825M8516N8502O7684P4587P6761P0999N5346L1225L274k3114m4280
56825I26046n8869o6826o8493o4767n7503m8983m0763l3263k6386k0021j3824
56814D26348p208P1P696J5457K3696L2648M1682M9285N3375N1514M1851K4848
56802G61263L819j6873l4051m6192n2737n3981n1224m6024l9314l1773k4588j8927
56790C49398j4710j0749o128r51M175Q797J2847J6766K1200K5944K9346K9291
56778D65226K4766J6145M520q422k0268k8748l3079l4035l2821l0397k7524k4620
$$ plain form
56766 270743 249206 231024 215818 202433 189964 178556 168822 160882 154318 148703 143736 139219 135234
56753 135234 132052 129504 126870 123778 120775 118561 117058 115771 114683 114132 113984 113622 112749 111698 110858
56738 110858 110194 109448 108504 107462 106438 105384 104096 102602 101429 101198 101963 103326 105173 107680 110489
56723 110489 112630 113711 114580 116218 118462 120399 121665 122713 124023 125653 127388 128831 129490 129277 128816
56708 128816 128881 129643 130838 132355 134146 135731 136469 136340 135992 135941 136090 136085 135865 135748 136130 137042 137911 137945 136995
56689 136995 135841 135384 135758 136482 137232 138111 139297 140747 142206 143364 144163 145066 146747 149261 151779 153355
56673 153355 153691 152948 151252 148784 146089 143806 142177 141049 140209 139549 139166 139434 140649 142438 143899 144521
56657 144521 144520 144107 143078 141510 140163 139630 139575 139417 139264 139537 140140 140764 141667 143330 145512 147366 148424
$$ packed form
56766B70743k1537j8182j5206j3385j2469j1408r734p940o564n615m967m517l985
56753A35234l182k548k634l092l003k214j503j287j088n51j48l62q73j051q40
56738A10858o64p46r44j042j024j054j288j494j173k31P65J363J847K507K809
56723A10489K141J081Q69J638K244J937J266J048J310J630J735J443O59k13m61
56708A28816O5P62J195J517J791J585P38j29l48n1J49nk20j17L82R12Q69L4r50
56689A36995j154m57L74P24P50Q79J186J450J459J158P99R03J681K514K518J576
56673A53355L36p43j696k468k695k283j629j128q40o60l83K68J215J789J461O22
56657A44521jm13j029j568j347n33n5j58j53K73O03O24R03J663K182J854J058
$$ plain form
56640 148424 148925 149273 149749 150591 151774 152821 153311 153439 153704 154247 154896 155492 155701 154947 153149 151165 149861
56623 149861 149135 148505 148139 148423 148941 148960 148644 148676 148788 147906 145826 143570 141826 140163 138266 136825 136491
56606 136491 136709 136412 135461 134671 134678 135338 136156 136826 137311 137676 138005 138472 139365 140801 142397 143626 144641 146178
56588 146178 148238 149516 148940 147356 146761 148003 150173 152179 153895 155529 156850 157550 157820 158146 158879 160166
56572 160166 161908 163697 165236 166799 168844 171304 173980 177539 183191 191116 200041 208784 217565 227365
56558 227365 238490 250183 261160 270094 276038 278890 279358 278272 276138 273364 270448 267691 265038 262420
56544 262420 259911 257419 254549 250991 246860 242606 238818 236012 234175 232577 230448 227834 225315 223029
56530 223029 220604 217983 215595 213545 211366 208783 206168 203990 202369 201330 200902 200696 199963 198377 196300
$$ packed form
56640A48424N01L48M76Q42J183J047M90J28K65N43O49N96K09p54j798j984j304
56623A49861p26o30l66K84N18J9l16L2J12q82k080k256j744j663j897j441l34
56606A36491K18k97r51p90PO60Q18O70M85L65L29M67Q93J436J596J229J015J537
56588A46178K060J278n76j584n95J242K170K006J716J634J321P00K70L26P33J287
56572A60166J742J789J539J563K045K460K676L559N652P925Q925Q743Q781R800
56558B27365J1125J1693J0977Q934N944K852M68j086k134k774k916k757k653k618
56544B62420k509k492k870l558m131m254l788k806j837j598k129k614k519k286
56530B23029k425k621k388k050k179k583k615k178j621j039m28k06p33j586k077
$$ plain form
56515 196300 194157 192069 190248 189040 188254 187160 185608 184536 184800 185915 186548 185964 184458 182612 180719
56500 180719 178952 177681 177352 178005 178940 179145 178320 177314 177172 177900 178631 178859 178855 178977 179226 179605 180200 180746
56482 180746 180802 180580 180935 182239 183817 184815 185090 184963 184654 184346 184335 184715 185226 185633 185932 186065 185894 185629 185771
56463 185771 186388 186948 187022 186720 186254 185656 185104 184955 185210 185455 185541 185797 186405 187177 188163 189817 192212 194730
56445 194730 196881 198829 200791 202506 203733 204687 205554 205989 205529 204135 202110 199910 198249 197756 198258 198901
56429 198901 199223 199526 200028 200422 200564 200844 201424 201826 201718 201439 201296 201028 200483 200153 200465 201096 201536 201747 201775
56410 201775 201334 200393 199617 199578 199995 200290 200490 201070 202309 204181 206378 208117 208594 208053 207771 208547 209925
56393 209925 211287 212760 214395 215446 215475 215393 216407 218404 220326 221620 222388 222618 222328 222181 222916 224295
$$ packed form
56515A96300k143k088j821j208p86j094j552j072K64J115O33n84j506j846j893
56500A80719j767j271l29O53R35K05q25j006j42P28P31K28mJ22K49L79N95N46
56482A80746N6k22L55J304J578R98K75j27l09l08j1L80N11M07K99J33j71k65J42
56463A85771O17N60P4l02m66n98n52j49K55K45Q6K56O08P72R86J654K395K518
56445A94730K151J948J962J715J227R54Q67M35m60j394k025k200j661m93N02O43
56429A98901L22L03N02L94J42K80N80M02j08k79j43k68n45l30L12O31M40K11K8
56410B01775m41r41p76l9M17K95K00N80J239J872K197J739M77n41k82P76J378
56393B09925J362J473J635J051K9q2J014J997J922J294P68K30k90j47P35J379
$$ plain form
56377 224295 225382 225724 225582 225278 225032 225134 225587 225850 225600 225388 225853 226747 227514 228388 229955 231954 233528
56360 233528 234467 235242 235940 236183 236081 236283 236993 237806 238709 240406 243292 246700 249545 251380 252579 253747
56344 253747 255134 256568 257916 259517 261837 264687 267283 269304 271295 273670 275981 277700 279194 281230
56330 281230 283972 287046 290236 293492 296667 299789 303206 306877 309997 311865 312671 312812 312094 310417 308671
56315 308671 308003 308504 309387 310104 310469 310173 309191 308407 308864 310557 312748 315243 318529 322921 328456 335371
56299 335371 343684 352353 359807 365348 369324 372167 374131 375891 378391 381928 386097 390717 396113 402389
56285 402389 409079 415706 422317 429397 437518 446784 456365 464954 472210 479272 487368 496473 505978 516040
56271 516040 527322 539851 553157 567335 583026 600491 619531 640202 662920 688016 715826
$$ packed form
56377B24295J087L42j42l04k46J02M53K63k50k12M65Q94P67Q74J567J999J574
56360B33528R39P75O98K43j02K02P10Q13R03J697K886L408K845J835J199J168
56344B53747J387J434J348J601K320K850K596K021J991K375K311J719J494K036
56330B81230K742L074L190L256L175L122L417L671L120J868Q06J41p18j677j746
56315C08671o68N01Q83P17L65k96r82p84M57J693K191K495L286M392N535O915
56299C35371Q313Q669P454N541L976K843J964J760K500L537M169M620N396O276
56285D02389O690O627O611P080Q121R266R581Q589P256P062Q096R105R505J0062
56271E16040J1282J2529J3306J4178J5691J7465J9040K0671K2718K5096K7810
$$ plain form
56260 715826 746889 781426 819050 859811 905121 956831 1015747 1081910 1155835 1238447 1330056
56249 1330056 1430366 1539235 1656525 1781463 1913043 2050703 2193561 2339160 2483877
56240 2483877 2624334 2757568 2880235 2988791 3080331 3152405 3202391 3228209 3229593 3207852 3164627
56229 3164627 3101672 3021443 2926845 2820596 2705491 2584647 2460512 2334255 2207189 2082061
56219 2082061 1961680 1846975 1737752 1634680 1538900 1450262 1367735 1291277 1221579 1158199
56209 1158199 1099624 1045107 994826 948472 905359 865848 830862 799991 771805 746024 723577
56198 723577 704473 687471 672068 658907 647899 637794 628093 619588 612500 605831 599191 593552 589505
56185 589505 586324 583404 581056 579113 576343 572247 568142 565469 564090 563067 562143 561661 561882 563004 565121
$$ packed form
56260G15826L1063L4537L7624M0761M5310N1710N8916O6163P3925Q2612R1609
56249A330056J00310J08869J17290J24938J31580J37660J42858J45599J44717
56240B483877J40457J33234J22667J08556R1540P2074M9986K5818J384k1741m3225
56229C164627o2955q0229r4598j06249j15105j20844j24135j26257j27066j25128
56219B082061j20381j14705j09223j03072r5780q8638q2527p6458o9698o3380
56209A158199n8575n4517n0281m6354m3113l9511l4986l0871k8186k5781k2447
56198G23577j9104j7002j5403j3161j1008j0105r701q505p088o669o640n639m047
56185E89505l181k920k348j943k770m096m105k673j379j023r24m82K21J122K117
$$ plain form
56170 565121 567709 569983 572035 574781 578597 582952 587481 592364 597608 603113 609457 617352 626236 634817
56156 634817 643116 652583 664034 676973 691106 707006 724960 744654 766350 791050 819305 851261
56144 851261 888033 931604 983299 1043728 1113890 1194161 1281917 1372130 1460656 1545144 1622873
56133 1622873 1690445 1746677 1793803 1834930 1871905 1905997 1938156 1967313 1990316 2004792 2010856
56122 2010856 2009513 2001337 1987446 1969695 1948634 1922590 1889421 1847578 1795189 1730576 1654920 1572723
56110 1572723 1488685 1405769 1326725 1254979 1192614 1139259 1093999 1056610 1026134 1000486 978670
56099 978670 961456 948908 939299 931446 925900 922717 920382 918215 917509 918933 921051 922868 925459 929572
56085 929572 934030 938276 944110 952838 962840 972055 980910 990700 1000942 1010584 1020289 1031333 1043497
$$ packed form
56170E65121K588K274K052K746L816M355M529M883N244N505O344P895Q884Q581
56156F34817Q299R467J1451J2939J4133J5900J7954J9694K1696K4700K8255L1956
56144H51261L6772M3571N1695O0429P0162Q0271Q7756R0213Q8526Q4488P7729
56133A622873O7572N6232M7126M1127L6975L4092L2159K9157K3003J4476O064
56122B010856j343q176j3891j7751k1061k6044l3169m1843n2389o4613p5656q2197
56110A572723q4038q2916p9044p1746o2365n3355m5260l7389l0476k5648k1816
56099I78670j7214j2548r609p853n546l183k335k167p06J424K118J817K591M113
56085I29572M458M246N834Q728J0002R215Q855R790J0242R642R705J1044J2164
$$ plain form
56072 1043497 1055871 1068580 1082135 1096330 1111069 1126923 1143830 1160855 1178110 1196887 1216937
56061 1216937 1235981 1253024 1269653 1286840 1303265 1318303 1333747 1350661 1367328 1382353 1397130
56050 1397130 1413218 1429977 1446842 1465129 1485400 1505886 1525832 1547472 1572274 1598242 1623576
56039 1623576 1649970 1679410 1710668 1742048 1774779 1810561 1848491 1887548 1929401 1975485 2023937
56028 2023937 2072594 2122266 2173843 2225169 2274344 2323286 2374421 2426704 2478624 2532231 2590200
56017 2590200 2651596 2714508 2780183 2850561 2924391 2999832 3078279 3161682 3248907 3338770 3433613
56006 3433613 3535624 3642658 3752007 3865173 3984674 4109617 4239017 4375837 4522804
55997 4522804 4677920 4839138 5009571 5192760 5387017 5590226 5805979 6038739 6287249
$$ packed form
56072A043497J2374J2709J3555J4195J4739J5854J6907J7025J7255J8777K0050
56061A216937J9044J7043J6629J7187J6425J5038J5444J6914J6667J5025J4777
56050A397130J6088J6759J6865J8287K0271K0486J9946K1640K4802K5968K5334
56039A623576K6394K9440L1258L1380L2731L5782L7930L9057M1853M6084M8452
56028B023937M8657M9672N1577N1326M9175M8942N1135N2283N1920N3607N7969
56017B590200O1396O2912O5675P0378P3830P5441P8447Q3403Q7225Q9863R4843
56006C433613J02011J07034J09349J13166J19501J24943J29400J36820J46967
55997D522804J55116J61218J70433J83189J94257K03209K15753K32760K48510
$$ plain form
55988 6287249 6549337 6828948 7131488 7456572 7802610 8174143 8577123 9011669 9477599
55979 9477599 9982371 10534958 11136725 11787401 12495204 13271870 14123329 15055694 16085197
55970 16085197 17231838 18509602 19934709 21537364 23353713 25414383 27755773 30436503
55962 30436503 33530433 37115439 41287956 46179434 51940163 58720620 66695334 76099704
55954 76099704 87229489 100433184 116142951 134888195 157223175 183629031 214427935
55947 214427935 249494209 287556534 325469444 358340394 380935400 389625289 383584908
55940 383584908 364648179 336283697 302472643 266867783 232261619 200382010 172025883
55933 172025883 147376456 126280548 108409627 93363202 80744829 70188646 61352945
$$ packed form
55988F287249K62088K79611L02540L25084L46038L71533M02980M34546M65930
55979I477599N04772N52587O01767O50676P07803P76666Q51459R32365J029503
55970A6085197J146641J277764J425107J602655J816349K060670K341390K680730
55962C0436503L093930L585006M172517M891478N760729O780457P974714R404370
55954G6099704J1129785J3203695J5709767J8745244K2334980K6405856L0798904
55947B14427935L5066274L8062325L7912910L2870950K2595006Q689889o040381
55940C83584908j8936729k8364482l3811054l5604860l4606164l1879609k8356127
55933A72025883k4649427k1095908j7870921j5046425j2618373j0556183q835701
$$ plain form
55926 61352945 53928748 47661495 42348563 37817665 33922394 30552525 27627890 25078728
55918 25078728 22841557 20868835 19126737 17582632 16204754 14971333 13868229 12878402
55910 12878402 11983108 11171152 10436932 9770811 9160350 8599232 8086033 7615653 7180237
55901 7180237 6777012 6407017 6067329 5752090 5459741 5191679 4945006 4713919 4497204
55892 4497204 4297292 4112879 3939324 3775500 3623668 3483357 3351737 3229276 3118690
55883 3118690 3018649 2924297 2833371 2746123 2660119 2571409 2480756 2392985 2310043 2229828 2151589
55872 2151589 2077040 2006019 1936205 1867523 1802195 1740370 1680238 1622451 1569722 1521876 1475810
55861 1475810 1430666 1388724 1350864 1315429 1282041 1252492 1227188 1204378 1183268 1164428 1146867
$$ packed form
55926F1352945p424197o267253n312932m530898l895271l369869k924635k549162
55918B5078728k237171j972722j742098j544105j377878j233421j103104r89827
55910A2878402q95294q11956p34220o66121o10461n61118n13199m70380m35416
55901G180237m03225l69995l39688l15239k92349k68062k46673k31087k16715
55892D497204j99912j84413j73555j63824j51832j40311j31620j22461j10586
55883C118690j00041r4352r0926q7248q6004q8710r0653q7771q2942q0215p8239
55872B151589p4549p1021o9814o8682o5328o1825o0132n7787n2729m7846m6066
55861A475810m5144m1942l7860l5435l3388k9549k5304k2810k1110j8840j7561
$$ plain form
55850 1146867 1128299 1108540 1089208 1069945 1048505 1024798 1001278 978931 956311 932925 910254
55839 910254 888913 867935 847310 828254 810620 792987 775657 760560 747857 735579 722996
55828 722996 711505 701749 692631 683587 675172 667028 657818 647556 637549 627906 617565 606829 597233
55815 597233 588793 580042 570925 562998 556648 550775 545414 541898 540136 538418 536376 535617 537056 540076
55801 540076 544501 550823 558138 564361 568819 572270 574252 573041 568442 561974 554141 544304 533507 524425
55787 524425 517885 512251 506745 502378 498804 493293 484134 472515 459983 446604 432816 420522 410827
55774 410827 402773 395533 389832 386128 383418 380999 379385 378434 376643 373481 370392 368298 366093 362895
55760 362895 359836 358195 357464 356629 355723 354774 352824 349352 345295 341391 336876 331014 324536 318395 312414
$$ packed form
55850A146867j8568j9759j9332j9263k1440k3707k3520k2347k2620k3386k2671
55839I10254k1341k0978k0625j9056j7634j7633j7330j5097j2703j2278j2583
55828G22996j1491r756r118r044q415q144r210j0262j0007r643j0341j0736r596
55815E97233q440q751r117p927o350n873n361l516j762j718k042p59J439L020
55801E40076M425O322P315O223M458L451J982j211m599o468p833r837j0797r082
55787E24425o540n634n506m367l574n511r159j1619j2532j3379j3788j2294r695
55774D10827q054p240n701l704k710k419j614r51j791l162l089k094k205l198
55760C62895l059j641p31q35r06r49j950l472m057l904m515n862o478o141n981
$$ plain form
55745 312414 306326 300787 296121 291230 285053 278096 271445 265233 259104 253158 247495 241745 235979 231184
55731 231184 228004 225850 223884 221908 219766 216986 213715 210864 208698 206340 203227 199851 196562 193017
55717 193017 189482 187233 186730 186645 185602 183767 181913 180124 178323 176964 176283 175868 175679 176375 177880 178873
55701 178873 178551 177705 177166 176450 174959 173266 172021 170648 168478 166278 165380 165939 167208 168949 171406 174278
55685 174278 176775 178530 179774 180908 182397 184648 187556 190624 193794 197484 201532 204957 207133 208329
55671 208329 208707 207754 205231 201813 198243 194676 191253 188348 185824 183024 180022 177879 177171 177344 178048
55656 178048 179910 183269 187264 191020 194761 198914 203016 206322 208723 210328 210892 210271 208700 206126 202141
55641 202141 196999 191634 186176 179678 171974 164582 158992 155177 152595 151315 151126 150766 149324 147568 146719
$$ packed form
55745C12414o088n539m666m891o177o957o651o212o129n946n663n750n766m795
55731B31184l180k154j966j976k142k780l271k851k166k358l113l376l289l545
55717A93017l535k249n03q5j043j835j854j789j801j359o81m15j89O96J505R93
55701A78873l22q46n39p16j491j693j245j373k170k200q98N59J269J741K457K872
55685A74278K497J755J244J134J489K251K908L068L170L690M048L425K176J196
55671B08329L78r53k523l418l570l567l423k905k524k800l002k143p08J73P04
55656A78048J862L359L995L756L741M153M102L306K401J605N64o21j571k574l985
55641B02141n142n365n458o498p704p392n590l815k582j280j89l60j442j756q49
$$ plain form
55626 146719 146739 146848 146870 146933 146606 145501 144155 143276 142684 141891 141029 140257 138935 136383 132948 129452 126178
55609 126178 123196 120963 119642 118490 116822 115007 113695 112802 112071 111876 112454 113115 113191 113040 113060 112490 110339
55592 110339 106999 103805 101547 100362 100464 101814 103572 104997 106441 108433 110419 111625 112584 114448 117093
55577 117093 119262 120453 121466 123098 125423 128400 132211 136881 142294 148472 155128 161136 165227 167090
55563 167090 167192 165805 163021 159363 155505 151493 146957 141953 136882 131844 126750 121844 117506 113786
55549 113786 110781 109034 108854 109605 110408 111148 112104 113020 113415 113414 113463 113524 113328 113067 113039 113024 112834 113024 114101 115447
55529 115447 116024 115834 115621 115384 114293 112019 109180 106438 103963 101733 99551 96882 93466 89992 87470
55514 87470 86110 85553 85773 86773 87622 86980 84753 82367 81255 81705 83123 84657 85567 85683 85525 85451 84958
$$ packed form
55626A46719K0J09K2O3l27j105j346q79n92p93q62p72j322k552l435l496l274
55609A26178k982k233j321j152j668j815j312q93p31j95N78O61P6j51K0n70k151
55592A10339l340l194k258j185J02J350J758J425J444J992J986J206R59J864K645
55577A17093K169J191J013J632K325K977L811M670N413O178O656O008M091J863
55563A67090J02j387k784l658l858m012m536n004n071n038n094m906m338l720
55549A13786l005j747j80P51Q03P40R56R16L95jM9O1j96k61k8j5j90J90J077J346
55529A15447N77j90k13k37j091k274k839k742k475k230k182k669l416l474k522
55514H7470j360n57K20J000Q49o42k227k386j112M50J418J534R10J16j58p4m93
$$ plain form
55497 84958 83514 81709 80652 80384 79923 78867 77939 77805 78274 78911 79664 80572 81449 82175 82860 83609 84441 85426
55479 85426 86514 87339 87607 87540 87570 87830 88381 89486 91040 92137 91931 90649 89068 87356 85280 83200 81858
55462 81858 81287 80830 80164 79456 78618 77399 76210 75917 76668 77755 78716 79720 80703 81019 80325 79140 78224
55445 78224 77852 77912 78232 78637 79099 79910 81353 83211 84977 86413 87502 88037 87833 87186 86555 85900 84916 83766
55427 83766 82978 82717 82720 82846 83115 83334 83294 83206 83418 83826 84135 84493 85232 86209 87023 87574 87834 87391 86018 84376
55407 84376 83291 82606 81587 80232 79199 78606 77984 77350 77327 78057 78944 79590 80195 80908 81560 82080 82478 82415
55389 82415 81580 80443 79853 79920 80108 80304 80847 81544 81723 81367 81249 81765 82514 83153 83708 83939 83410 82464 82138
55370 82138 82779 83550 83675 83404 83430 84034 85083 86252 87083 87396 87659 88266 88577 87638 85779 84418 84171 84299
$$ packed form
55497H4958j444j805j057k68m61j056r28j34M69O37P53R08Q77P26O85P49Q32R85
55479H5426J088Q25K68o7L0K60N51J105J554J097k06j282j581j712k076k080j342
55462H1858n71m57o66p08q38j219j189k93P51J087R61J004R83L16o94j185r16
55445G8224l72O0L20M05M62Q11J443J858J766J436J089N35k04o47o31o55r84j150
55427H3766p88k61LJ26K69K19m0q8K12M08L09L58P39R77Q14N51K60m43j373j642
55407H4376j085o85j019j355j033n93o22o34k3P30Q87O46O05P13O52N20L98o3
55389H2415q35j137n90O7J88J96N43O97J79l56j18N16P49O39N55K31n29r46l26
55370H2138O41P71J25k71K6O04J049J169Q31L13K63O07L11r39j859j361k47J28
$$ plain form
55352 84299 84166 83992 83751 82673 80547 78509 77689 77890 78272 78567 78837 78679 77570 75664 73663 72132 71324
55335 71324 71291 71814 72531 73342 74350 75409 76304 77364 79106 81156 82401 82457 82106 81981 81755 81081 80353 79930
55317 79930 79398 78312 77019 76123 75696 75594 75946 76717 77342 77425 77363 77703 78329 78781 78990 79171 79342 79418 79455 79511
55297 79511 79569 79740 80082 80129 79299 77996 77472 78218 79287 79698 79694 80012 80643 81085 81265 81437 81583 81573 81573 81692 81565
55276 81565 80821 79633 78391 77233 76300 75992 76459 77250 77871 78306 78622 78676 78610 79041 80177 81289 81608 81207
55258 81207 80479 79381 77962 77076 77617 79259 80665 80839 79788 78177 76931 76855 77980 79383 80139 80255
55242 80255 80302 80467 80453 80008 79061 77645 76187 75515 76018 77029 77563 77444 77230 77311 77618 77967 78207 78197 78104 78474
55222 78474 79545 80697 81044 80403 79348 78534 78288 78572 78942 78854 78330 78086 78642 79694 80638 81237 81458 81211
$$ packed form
55352H4299j33j74k41j078k126k038q20K01L82K95K70j58j109j906k001j531q08
55335G1324l3N23P17Q11J008J059Q95J060J742K050J245N6l51j25k26o74p28m23
55317G9930n32j086j293q96m27j02L52P71O25Q3o2L40O26M52K09J81J71P6L7N6
55297G9511N8J71L42M7q30j303n24P46J069M11mL18O31M42J80J72J46j0%J19j27
55276H1565p44j188j242j158r33l08M67P91O21M35L16N4o6M31J136J112L19m01
55258H1207p28j098j419q86N41J642J406J74j051j611j246p6J125J403P56J16
55242H0255M7J65j4m45r47j416j458o72N03J011N34j19k14Q1L07L49K40j0r3L70
55222G8474J071J152L47o41j055q14k46K84L70q8n24k44N56J052R44N99K21k47
$$ plain form
55204 81211 80804 81069 82382 83896 84385 83589 82219 81020 80378 80472 81102 81581 81382 80748 80228 79993 80080 80826
55186 80826 82304 83704 84096 83690 83562 84208 85023 85273 84942 84543 84539 85051 85815 86386 86546 86352 85716 84340 82347
55167 82347 80502 79426 79005 79009 79721 81329 83171 84355 84874 85458 86544 88000 89590 90974 91549 91048 90179
55150 90179 89960 90469 90922 90829 90356 89605 88368 86747 85386 84792 84859 85162 85397 85405 85127 84620 84009 83471 83350
55131 83350 83946 84952 85462 84946 83913 83213 83009 82902 82710 82575 82557 82638 82868 83056 82633 81408 80165 79900
55113 79900 80692 81891 83166 84717 86567 88247 89168 88988 87858 86640 86452 87507 88809 89439 89615 89948
55097 89948 90378 90680 91345 92912 94845 96164 96854 97570 98298 98538 98592 99292 100453 100897 100255 99526 99514 99830
55079 99830 99801 99360 98617 97527 96406 95951 96264 96631 96604 96564 96831 97092 97140 97387 98104 98840 99105 98979 98609 97822
$$ packed form
55204H1211m07K65J313J514M89p96j370j199o42R4O30M79j99o34n20k35Q7P46
55186H0826J478J400L92m06j28O46Q15K50l31l99mN12P64N71J60j94o36j376j993
55167H2347j845j076m21MP12J608J842J184N19N84J086J456J590J384N75n01q69
55150I0179k19N09M53r3m73p51j237j621j361n94O7L03K35Qk78n07o11n38j21
55131H3350N96J006N10n16j033p00k04j07j92j35j8Q1K30J88m23j225j243k65
55113G9900P92J199J275J551J850J680R21j80j130j218j88J055J302O30J76L33
55097H9948M30L02O65J567J933J319O90P16P28K40N4P00J161M44o42p29j2L16
55079I9830k9m41p43j090j121m55L13L67k7m0K67K61M8K47P17P36K65j26l70p87
$$ plain form
55059 97822 96812 96478 97340 98636 99157 98639 97683 96702 95642 94552 93735 93320 93085 92724 92050 91038 89911
55042 89911 89078 88811 89097 89885 91209 92945 94703 96131 97127 97669 97733 97437 97000 96510 96000 95732 95987 96543
55024 96543 96793 96443 95727 94911 94074 93384 93060 92929 92550 91917 91542 91690 92084 92495 93035 93643 93934 93895 94155
55005 94155 95114 96263 96850 96865 96926 97440 98275 99087 99627 99858 99921 99941 99860 99735 100046 101250 103049 104656 105788
54986 105788 106717 107290 106845 105448 104363 104604 105686 106462 106636 106646 106463 105500 103669 101749 100522 100080 100106
54969 100106 100454 101193 102291 103413 104032 103863 103221 102791 102916 103355 103794 104270 104844 105217 105060 104488 103864 103244
54951 103244 102402 101325 100379 99884 99778 99768 99699 99678 99853 100172 100451 100675 100970 101160 100682 99340 97885 97350 97937
54932 97937 99073 100416 102104 104009 105607 106906 108791 111992 116234 120850 125667 130720 135544 139452
$$ packed form
55059I7822j010l34Q62J296N21n18r56r81j060j090q17m15k35l61o74j012j127
55042H9911q33k67K86P88J324J736J758J428R96N42O4k96m37m90n10k68K55N56
55024I6543K50l50p16q16q37o90l24j31l79o33l75J48L94M11N40O08K91l9K60
55005I4155R59J149N87J5O1N14Q35Q12N40K31O3K0q1j25L11J204J799J607J132
54986A05788R29N73m45j397j085K41J082P76J74J0j83r63j831j920j227m42K6
54969A00106L48P39J098J122O19j69o42m30J25M39M39M76N74L73j57n72o24o20
54951A03244q42j077r46m95j06j0o9k1J75L19K79K24K95J90m78j342j455n35N87
54932I7937J136J343J688J905J598J299J885L201M242M616M817N053M824L908
$$ plain form
54918 139452 142330 144584 146383 147487 147782 147533 146995 146093 144557 142177 138950 135125 131140 127385 124008
54903 124008 120940 118035 115230 112763 111183 110843 111348 111814 111791 111627 111867 112596 113514 114311 114797 114976 115139
54886 115139 115639 116512 117668 119395 122108 125443 128301 130172 131861 134372 137576 140639 143419 146577 150308
54871 150308 153695 155554 155514 153990 151405 147863 143561 139204 135687 133289 131332 128838 125509 121980 119260
54856 119260 118080 118497 119721 120485 120012 118627 117066 115359 112986 110003 107236 105173 103427 101617 100100
54841 100100 99330 99039 98614 97958 97412 97064 96663 96129 95780 95993 96845 98015 98963 99317 99095 98437 97318 95916
54823 95916 95031 95464 96938 98343 99142 99823 100770 101589 102009 102558 103698 104945 105587 105731 105880 105927 105403 104426
54805 104426 103658 103487 103888 104816 106064 106987 107097 106802 106813 106986 106541 105463 104807 105393 106821 108073 108578 108362
$$ packed form
54918A39452K878K254J799J104K95k49n38r02j536k380l227l825l985l755l377
54903A24008l068k905k805k467j580l40N05M66k3j64K40P29R18P97M86J79J63
54886A15139N00Q73J156J727K713L335K858J871J689K511L204L063K780L158L731
54871A50308L387J859m0j524k585l542m302m357l517k398j957k494l329l529k720
54856A19260j180M17J224P64m73j385j561j707k373k983k767k063j746j810j517
54841A00100p70k91m25o56n46l48m01n34l49K13Q52J170R48L54k22o58j119j402
54823I5916q85M33J474J405P99O81R47Q19M20N49J140J247O42J44J49M7n24r77
54805A04426p68j71M01R28J248R23J10k95J1J73m45j078o56N86J428J252N05k16
$$ plain form
54787 108362 107598 106480 105395 104849 105103 105935 106846 107597 108487 109904 111611 112841 113295 113695 115095 117890
54771 117890 121679 125758 129466 132431 134955 137951 142101 147270 152943 158819 164575 169423 172503 173574
54757 173574 172880 170589 166831 162026 156606 150601 144028 137490 131847 127448 124219 122278 121749 122060 122223
54742 122223 121873 121401 120968 120178 118960 118035 117993 118397 118347 117709 117269 117748 119094 120803 122609 124645 127075
54725 127075 129877 133074 136887 141313 145708 149224 151752 153956 156167 157706 157659 156002 153596 151273 149264
54710 149264 147295 144901 141807 138220 134636 131283 128171 125756 124861 125475 126236 125782 124241 122720 121730
54695 121730 120881 119870 118867 117917 116752 115365 114210 113646 113543 113442 112814 111355 109450 108110 107900 108124
54679 108124 107713 106715 106166 106569 107298 107589 107362 106896 106410 106231 106765 107915 108965 109313 108987 108307 107493 106815
$$ packed form
54787A08362p64j118j085n46K54Q32R11P51Q90J417J707J230M54M00J400K795
54771A17890L789M079L708K965K524K996M150N169N673N876N756M848L080J071
54757A73574o94k291l758m805n420o005o573o538n643m399l229j941n29L11J63
54742A22223l50m72m33p90j218r25m2M04n0o38m40M79J346J709J806K036K430
54725A27075K802L197L813M426M395L516K528K204K211J539m7j657k406k323k009
54710A49264j969k394l094l587l584l353l112k415q95O14P61m54j541j521r90
54695A21730q49j011j003r50j165j387j155n64j03j01o28j459j905j340k10K24
54679A08124m11r98n49M03P29K91k27m66m86j79N34J150J050L48l26o80q14o78
$$ plain form
54661 106815 106690 107312 108419 109549 110329 110552 110375 110435 111296 112655 113555 113472 112768 111971 111145 110185 109303 108885
54643 108885 109116 109943 111117 112155 112575 112409 112207 112352 112565 112278 111363 110363 110000 110469 111194 111414 111056 110757
54625 110757 110887 110948 110251 108818 107235 106009 105520 106152 107752 109315 109991 110168 110759 111689 112053 111619 111029
54608 111029 110485 109442 107890 106791 106721 107085 107277 107716 108978 110617 111692 111988 112010 112201 112789 113977 115601
54591 115601 116920 117396 117466 117900 118606 118657 117469 115487 113776 113283 114291 116161 117682 118048 117482 116744 116260
54574 116260 115991 115828 115660 115251 114530 113949 114145 115182 116357 116819 116273 115137 114149 113735 113710 113693 113739 114269 115343
54555 115343 116421 117005 117134 117004 116535 115696 114949 114872 115407 115890 115832 115422 115276 115853 117112 118606 119895 120933
54537 120933 122007 123295 124531 125037 124113 121716 118976 117672 118655 120924 122738 123465 123720 123933 123732 122896
$$ packed form
54661A06815j25O22J107J130P80K23j77O0Q61J359R00q3p04p97q26r60q82m18
54643A08885K31Q27J174J038M20j66k02J45K13k87r15j000l63M69P25K20l58k99
54625A10757J30O1o97j433j583j226m89O32J600J563O76J77N91R30L64m34n90
54608A11029n44j043j552j099p0L64J92M39J262J639J075K96K2J91N88J188J624
54591A15601J319M76P0M34P06N1j188j982j711m93J008J870J521L66n66p38m84
54574A16260k69j63j68m09p21n81J96J037J175M62n46j136r88m14k5j7M6N30J074
54555A15343J078N84J29j30m69q39p47p7N35M83n8m10j46N77J259J494J289J038
54537A20933J074J288J236N06r24k397k740j304R83K269J814P27K55K13k01q36
$$ plain form
54521 122896 121970 121470 121176 120733 120348 120338 120487 120419 120277 120498 121140 121851 122296 122318 121902 121244 120604 119938 119036 118129
54501 118129 117835 118320 119136 120062 121341 122743 123319 122743 122095 122485 123520 124061 123908 123712 123649 123370 123084 123531
54483 123531 124787 126015 126578 126669 126702 126855 127321 128238 129187 129403 128756 127993 127871 128535 129827 131570 133417 134999
54465 134999 136447 138207 140189 141659 142193 142128 141883 141403 140593 139662 138652 137204 135297 133695 133054 132945
54449 132945 132433 131402 130604 130454 130444 129973 129241 128962 129470 130413 131265 131825 132171 132294 132012 131264 130368 129919 130361
54430 130361 131641 133156 134101 134039 133286 132591 132383 132451 132430 132364 132523 132881 133108 133045 132896 132954 133311 133898 134574 135125
54410 135125 135306 134938 134000 132781 131939 132096 133132 134114 134286 133944 133995 134851 136182 137684 139468 141568 143516
54393 143516 144718 145029 144755 144294 143884 143555 143189 142697 142136 141536 140719 139595 138563 138257 138781 139565 140129 140668
$$ packed form
54521A22896r26n00k94m43l85j0J49o8j42K21O42P11M45K2m16o58o40o66r02r07
54501A18129k94M85Q16R26J279J402N76n76o48L90J035N41j53j96o3k79k86M47
54483A23531J256J228N63R1L3J53M66R17R49K16o47p63j22O64J292J743J847J582
54465A34999J448J760J982J470N34o5k45m80q10r31j010j448j907j602o41j09
54449A32945n12j031p98j50j0m71p32k79N08R43Q52N60L46J23k82p48q96m49M42
54430A30361J280J515R45o2p53o95k08O8k1o6J59L58K27o3j49N8L57N87O76N51
54410A35125J81l68r38j219q42J57J036R82J72l42N1Q56J331J502J784K100J948
54393A43516J202L11k74m61m10l29l66m92n61o00q17j124j032l06N24P84N64N39
$$ plain form
54375 140668 141607 142861 143872 144313 144469 144928 146096 148010 150415 152921 155150 156916 158359 159902 161922
54360 161922 164287 166287 167172 166821 165769 164621 163550 162385 160981 159417 157959 156948 156593 156655 156402 155117
54344 155117 152817 150302 148328 146835 145232 143379 141886 141283 141319 141420 141464 141586 141522 140906 140148 140212 141236
54327 141236 142142 142049 141389 141089 141211 141169 140873 140809 141163 141714 142557 144060 145889 146786 145775 143161 140106 137588
54309 137588 136013 135366 135259 135054 134403 133590 133164 133305 133803 134509 135517 136864 138325 139618 140640 141393 141753
54292 141753 141556 140983 140669 141140 142145 142841 142739 142219 141942 141975 141853 141339 140786 140645 140912 141213 141290 141273 141406
54273 141406 141619 141575 141202 140936 141099 141263 140786 139963 139954 141295 143137 144439 145327 146623 148465 150250 151747
54256 151747 153401 155428 157318 158498 158990 159200 159430 159730 159903 159550 158437 156837 155266 153938 152839 152209
$$ packed form
54375A40668R39J254J011M41J56M59J168J914K405K506K229J766J443J543K020
54360A61922K365K000Q85l51j052j148j071j165j404j564j458j011l55O2k53j285
54344A55117k300k515j974j493j603j853j493o03L6J01M4J22o4o16p58O4J024
54327A41236R06r3o60l00J22m2k96o4L54N51Q43J503J829Q97j011k614l055k518
54309A37588j575o47j07k05o51q13m26J41M98P06J008J347J461J293J022P53L60
54292A41753j97n73l14M71J005O96j02n20k77L3j22n14n53j41K67L01P7j7J33
54273A41406K13m4l73k66J63J64m77q23rJ341J842J302Q88J296J842J785J497
54256A51747J654K027J890J180M92K10K30L00J73l53j113j600j571j328j099o30
$$ plain form
54240 152209 152387 153122 153640 153556 153259 153195 153241 153058 152592 151940 151078 150080 149341 149240 149681 150175 150229 149600 148414 147133
54220 147133 146162 145381 144338 142972 141787 141170 140938 140791 140799 141091 141345 141040 140129 139132 138577 138561 138824 139107 139420
54201 139420 140024 141132 142612 144138 145541 146821 147846 148344 148228 147687 146940 146186 145792 146109 146997 147882 148373
54184 148373 148471 148137 147244 146239 146257 148023 150873 153289 154246 153774 152536 151300 150632 150581 150630 150237 149415 148560
54166 148560 147877 147293 146778 146360 145854 144925 143514 141984 140783 140128 139994 140255 140771 141428 142073 142413 142140 141221
54148 141221 139952 138697 137804 137761 138971 141110 143130 144284 144862 145490 146043 145885 145006 144201 144010 144147 144228
54131 144228 144456 145156 146072 146679 147004 147603 148695 149779 150268 150196 150076 150260 150698 151274 152066 153176 154500 155814
54113 155814 156991 157999 158808 159523 160533 162274 164787 167706 170661 173448 175807 177434 178432 179364 180560
$$ packed form
54240A52209J78P35N18q4k97o4M6j83m66o52q62r98p39j01M41M94N4o29j186j281
54220A47133r71p81j043j366j185o17k32j47QK92K54l05r11r97n55j6K63K83L13
54201A39420O04J108J480J526J403J280J025M98j16n41p47p54l94L17Q88Q85M91
54184A48373R8l34q93j005J8J766K850K416R57m72j238j236o68n1M9l93q22q55
54166A48560o83n84n15m18n06r29j411j530j201o55j34K61N16O57O45L40k73r19
54148A41221j269j255q93m3J210K139K020J154N78O28N53j58q79q05j91J37Q1
54131A44228K28P00R16O07L25N99J092J084M89p2j20J84M38N76P92J110J324J314
54113A55814J177J008Q09P15J010J741K513K919K955K787K359J627R98R32J196
$$ plain form
54098 180560 181566 181663 180786 179531 178352 177200 176004 175002 174327 173620 172436 170901 169578 168736 168126 167576
54082 167576 167433 168092 169286 170205 170362 169984 169510 169079 168766 168944 169953 171544 173112 174449 175821 177237
54066 177237 178199 178419 178358 178664 179360 179957 180168 180074 179774 179322 178984 179057 179429 179713 179937 180587 181785 182951 183726
54047 183726 184808 187259 191112 195339 199230 203140 207595 212320 216784 221289 226754 233430 240558 247458
54033 247458 254292 261458 268731 275557 281815 287716 293146 297642 301060 303761 306089 307986 309215 309670
54019 309670 309408 308656 307754 306852 305673 303828 301329 298383 294805 290198 284820 279623 275091 270569 265222
54004 265222 259301 253825 249181 244736 239921 235161 231358 228795 226912 225083 223217 221502 219859 217996
53990 217996 215972 214319 213460 213218 213135 213101 213313 213761 214137 214327 214618 215338 216536 218180 220370 223190 226608
$$ packed form
54098A80560J006R7q77j255j179j152j196j002o75p07j184j535j323q42o10n50
54082A67576j43O59J194R19J57l78m74m31l13J78J009J591J568J337J372J416
54066A77237R62K20o1L06O96N97K11r4l00m52l38P3L72K84K24O50J198J166P75
54047A83726J082K451L853M227L891L910M455M725M464M505N465O676P128O900
54033B47458O834P166P273O826O258N901N430M496L418K701K328J897J229M55
54019C09670k62p52r02r02j179j845k499k946l578m607n378n197m532m522n347
54004B65222n921n476m644m445m815m760l803k563j883j829j866j715j643j863
53990B17996k024j653q59k42q3l4K12M48L76J90K91P20J198J644K190K820L418
$$ plain form
53973 226608 230767 236229 243531 252333 261085 267678 270688 270157 267211 262917 257650 251558 245242 239580
53959 239580 235067 231744 229600 228518 227910 227067 226051 225711 226535 227961 229076 229612 229915 230376 231285 232880
53943 232880 235018 236988 238175 238888 240180 242872 247039 252247 257930 263442 268212 272094 275526 279156
53929 279156 283285 287581 291428 294639 297842 301965 307269 313073 318460 323153 327640 332714 338956 346455
53915 346455 354837 363675 372853 382358 391849 400767 408892 416383 423119 428429 431684 432876 432488 431101
53901 431101 429267 427373 425374 422933 419933 416528 412638 407905 402345 396495 390627 384292 377037 369084
53887 369084 360890 352512 343859 335167 326736 318613 310994 304492 299411 295108 290708 286135 281897 278151
53873 278151 274634 271195 267743 264012 260071 256719 254507 252620 249669 245497 241206 237463 233821 229907
$$ packed form
53973B26608M159N462P302Q802Q752O593L010n31k946m294n267o092o316n662
53959B39580m513l323k144j082o08q43j016l40Q24J426J115N36L03M61R09J595
53943B32880K138J970J187P13J292K692M167N208N683N512M770L882L432L630
53929B79156M129M296L847L211L203M123N304N804N387M693M487N074O242P499
53915C46455Q382Q838R178R505R491Q918Q125P491O736N310L255J192l88j387
53901D31101j834j894j999k441l000l405l890m733n560n850n868o335p255p953
53887C69084q194q378q653q692q431q123p619o502n081m303m400m573m238l746
53873B78151l517l439l452l731l941l352k212j887k951m172m291l743l642l914
$$ plain form
53859 229907 226204 223254 221010 219433 218893 219352 219855 219517 218541 217598 216639 215036 212644 210088 208020 206627
53843 206627 205784 205333 205171 205329 205880 206558 206656 205635 203757 201845 200485 199776 199727 200458 201826 203178 203803
53826 203803 203643 203363 203638 204500 205506 206458 207604 209055 210353 210952 210945 211011 211713 213116 214985 217010 218983
53809 218983 221081 223916 227910 232687 237552 242470 248047 254490 261198 267608 273882 280358 286791 292586
53795 292586 297507 301758 305487 308652 311348 313953 316812 319834 322447 324043 324606 324751 324883 324427 322385
53780 322385 318677 314384 310403 306393 301531 295874 290395 285784 281790 277747 273333 268647 263950 259550
53766 259550 255735 252591 249885 247258 244473 241521 238537 235764 233481 231766 230241 228259 225565 222755
53752 222755 220851 220329 220727 221167 221013 220038 218365 216502 215063 214155 213304 212261 211455 211243 211204 210820 210515
$$ packed form
53859B29907l703k950k244j577n40M59N03l38r76r43r59j603k392k556k068j393
53843B06627q43m51j62J58N51O78R8j021j878j912j360p09m9P31J368J352O25
53826B03803j60k80K75Q62J006R52J146J451J298N99pO6P02J403J869K025J973
53809B18983K098K835L994M777M865M918N577O443O708O410O274O476O433N795
53795B92586M921M251L729L165K696K605K859L022K613J596N63J45J32m56k042
53780C22385l708m293l981m010m862n657n479m611l994m043m414m686m697m400
53766B59550l815l144k706k627k785k952k984k773k283j715j525j982k694k810
53752B22755j904n22L98M40j54r75j673j863j439r08q51j043q06k12l9l84l05
$$ plain form
53735 210515 211084 212225 212526 211169 208917 207138 206472 206706 207320 207782 207807 207713 208130 209133 210162 211023 212283
53718 212283 214296 216468 218143 219683 221915 224808 227446 229266 230687 232468 234912 237748 240475 242799
53704 242799 244893 247160 249641 251974 254059 256333 259015 261622 263761 265987 269156 273220 277389 281262
53690 281262 284960 288188 290131 290445 289600 288004 285658 283074 281611 282068 283427 283896 282955 281610 280690 279886
53674 279886 278777 277956 278406 280018 281514 281822 280987 279615 278048 276497 275513 275577 276268 276447 275477 273869 272614
53657 272614 272279 272909 274226 275627 276385 276402 276471 277331 278668 279589 279896 280305 281431 283137 285020 286974 289091
53640 289091 291360 293749 296261 298731 300824 302409 303698 304856 305768 306393 307027 307963 309079 310095 311053
53625 311053 312214 313588 314950 316278 317853 319845 322098 324445 326984 329874 333061 336399 339928 343746
$$ packed form
53735B10515N69J141L01j357k252j779o66K34O14M62K5r4M17J003J029Q61J260
53718B12283K013K172J675J540K232K893K638J820J421J781K444K836K727K324
53704B42799K094K267K481K333K085K274K682K607K139K226L169M064M169L873
53690B81262L698L228J943L14q45j596k346k584j463M57J359M69r41j345r20q04
53674B79886j109q21M50J612J496L08q35j372j567j551r84O4O91J79r70j608j255
53657B72614l35O30J317J401P58J7O9Q60J337R21L07M09J126J706J883J954K117
53640B89091K269K389K512K470K093J585J289J158R12O25O34R36J116J016R58
53625C11053J161J374J362J328J575J992K253K347K539K890L187L338L529L818
$$ plain form
53611 343746 347639 351119 353954 356446 359052 361869 364720 367638 370984 374926 379021 382484 384874 386361
53597 386361 387364 388062 388387 388417 388623 389602 391514 393785 395384 395469 393900 391307 388692 386752 385423 384056
53581 384056 382112 379650 377107 374725 372290 369407 365925 362180 358870 356584 355294 354386 353290 351938
53567 351938 350492 348917 347144 345509 344595 344661 345507 346810 348159 348863 348367 347065 346167 346405 347224 347611 347364
53550 347364 347128 347437 348202 349126 350190 351662 353791 356534 359457 362062 364356 366950 370323 374157 377772
53535 377772 381163 385186 390521 396773 402900 408453 414104 420920 429354 439072 449513 460218 470684
53522 470684 480477 489806 499606 510620 522613 534959 547773 561874 577710 594937 613117 632168
53510 632168 651973 672191 692777 714133 736324 758644 780356 801496 822560 843751 864856
$$ packed form
53611C43746L893L480K835K492K606K817K851K918L346L942M095L463K390J487
53597C86361J003O98L25L0K06R79J912K271J599Q5j569k593k615j940j329j367
53581C84056j944k462k543k382k435k883l482l745l310k286j290r08j096j352
53567C51938j446j575j773j635r14O6Q46J303J349P04m96j302q98K38Q19L87k47
53550C47364k36L09P65R24J064J472K129K743K923K605K294K594L373L834L615
53535C77772L391M023N335O252O127N553N651O816Q434R718J0441J0705J0466
53522D70684R793R329R800J1014J1993J2346J2814J4101J5836J7227J8180J9051
53510F32168J9805K0218K0586K1356K2191K2320K1712K1140K1064K1191K1105
$$ plain form
53499 864856 885472 904986 922756 938844 954193 969706 985466 1001285 1017468 1034341 1051435
53488 1051435 1067892 1083483 1098539 1113148 1127235 1141290 1156052 1171411 1186494 1201059 1215968
53477 1215968 1231854 1247919 1262524 1274635 1284388 1292525 1299601 1305484 1309384 1310531 1308886 1305002 1299211
53464 1299211 1291343 1281236 1269164 1255644 1241257 1226713 1212650 1199114 1185516 1171268 1156211
53453 1156211 1140395 1123883 1106851 1089536 1071943 1054037 1036269 1019376 1003403 987494 971057
53442 971057 954766 939930 927177 916175 906497 898331 892330 888946 887891 888119 888533 888780 889225 890190
53428 890190 891648 893740 897059 902036 908397 915610 923529 932262 941742 951996 963615 977366 993321
53415 993321 1010799 1029197 1048476 1068812 1090155 1112338 1135380 1159524 1185054 1212088 1240484
$$ packed form
53499H64856K0616J9514J7770J6088J5349J5513J5760J5819J6183J6873J7094
53488A051435J6457J5591J5056J4609J4087J4055J4762J5359J5083J4565J4909
53477A215968J5886J6065J4605J2111R753Q137P076N883L900J147j645l884n791
53464A299211p868j0107j2072j3520j4387j4544j4063j3536j3598j4248j5057
53453A156211j5816j6512j7032j7315j7593j7906j7768j6893j5973j5909j6437
53442I71057j6291j4836j2753j1002r678q166o001l384j055K28M14K47M45R65
53428H90190J458K092L319M977O361P213P919Q733R480J0254J1619J3751J5955
53415I93321J7478J8398J9279K0336K1343K2183K3042K4144K5530K7034K8396
$$ plain form
53404 1240484 1269979 1300578 1332661 1366548 1402089 1438957 1477273 1517557 1560005 1604187 1649605
53393 1649605 1696263 1744412 1793820 1843577 1892686 1940760 1988137 2035410 2082824 2129995 2176072
53382 2176072 2220181 2261843 2301082 2338110 2372884 2404940 2433643 2458520 2479350 2496103 2508948
53371 2508948 2518222 2524149 2526508 2524608 2517620 2504918 2486252 2461756 2431840 2397024 2357940 2315489
53359 2315489 2270769 2224731 2177997 2131082 2084453 2038222 1992239 1946841 1903102 1861790 1822351
53348 1822351 1783598 1745183 1707620 1671007 1634709 1598455 1562768 1527962 1493617 1459641 1427059
53337 1427059 1396959 1369252 1343259 1319031 1297190 1277726 1259880 1243217 1228048 1214749 1203228
53326 1203228 1193038 1183467 1173523 1162430 1150247 1137540 1124541 1111210 1098047 1086031 1075528 1065996
$$ packed form
53404A240484K9495L0599L2083L3887L5541L6868L8316M0284M2448M4182M5418
53393A649605M6658M8149M9408M9757M9109M8074M7377M7273M7414M7171M6077
53382B176072M4109M1662L9239L7028L4774L2056K8703K4877K0830J6753J2845
53371B508948R274N927K359j900o988j2702j8666k4496k9916l4816l9084m2451
53359B315489m4720m6038m6734m6915m6629m6231m5983m5398m3739m1312l9439
53348A822351l8753l8415l7563l6613l6298l6254l5687l4806l4345l3976l2582
53337A427059l0100k7707k5993k4228k1841j9464j7846j6663j5169j3299j1521
53326A203228j0190r571r944j1093j2183j2707j2999j3331j3163j2016j0503r532
$$ plain form
53314 1065996 1057045 1049193 1043122 1038695 1035230 1032411 1030447 1029555 1029731 1030930 1033156 1036419 1040812 1046537
53300 1046537 1053697 1062228 1072188 1083898 1097586 1113071 1129997 1148147 1167316 1187171 1207635 1229177
53288 1229177 1252237 1276325 1300097 1322393 1342919 1361890 1379453 1395683 1410763 1424706 1436906
53277 1436906 1446316 1452215 1454679 1454320 1451725 1447256 1441109 1433252 1423334 1410950 1396126 1379359 1361080
53264 1361080 1341307 1319982 1297457 1274359 1251059 1227510 1203549 1179078 1154004 1128354 1102503
53253 1102503 1077034 1052234 1027930 1003860 979986 956426 933370 911147 890030 869783 849685
53242 849685 829228 808617 788420 768986 750401 732678 715673 699014 682541 666655 651939
53231 651939 638545 626363 615584 606539 598920 591685 583999 575969 568227 561052 554091 546729 538519
$$ packed form
53314A065996q951p852o071m427l465k819j964q92J76J199K226L263M393N725
53300A046537P160Q531R960J1710J3688J5485J6926J8150J9169J9855K0464K1542
53288A229177K3060K4088K3772K2296K0526J8971J7563J6230J5080J3943J2200
53277A436906R410N899K464l59k595m469o147p857r918j2384j4824j6767j8279
53264A361080j9773k1325k2525k3098k3300k3549k3961k4471k5074k5650k5851
53253A102503k5469k4800k4304k4070k3874k3560k3056k2223k1117k0247k0098
53242H49685k0457k0611k0197j9434j8585j7723j7005j6659j6473j5886j4716
53231F51939j3394j2182j0779r045p619p235p686q030p742p175o961p362q210
$$ plain form
53218 538519 529349 519349 508614 497041 484651 472014 460012 449094 439021 429507 420731 412960
53206 412960 405955 399168 392370 385762 379435 373093 366337 359074 351593 344365 337707 331497 325219 318420
53192 318420 311143 303882 297237 291631 287129 283350 279800 276462 273796 271856 269723 266350 261845 257361
53178 257361 253723 250805 248400 246953 246890 247564 247562 246112 243829 241944 241017 240560 239866 239005 238723 239327 240000
53161 240000 239637 238193 236740 236190 236462 236977 237335 237216 236195 234213 231923 230047 228621 227278 226074 225493
53145 225493 225741 226496 227277 227619 227048 225517 223917 223558 224880 227045 229015 230570 232058 233552 234669 235040
53129 235040 234594 233495 232111 231017 230708 231231 232198 233184 234062 234959 236036 237347 238790 240122 241070 241575
53113 241575 241916 242455 243134 243422 242922 241890 240852 239837 238486 236941 235926 235656 235242 233785 231655 230069
$$ packed form
53218E38519r170j0000j0735j1573j2390j2637j2002j0918j0073r514q776p771
53206D12960p005o787o798o608o327o342o756p263p481p228o658o210o278o799
53192C18420p277p261o645n606m502l779l550l338k666j940k133l373m505m484
53178B57361l638k918k405j447o3O74kj450k283j885r27m57o94q61k82O04O73
53161B40000l63j444j453n50K72N15L58j19j021j982k290j876j426j343j204n81
53145B25493K48P55P81L42n71j531j600l59J322K165J970J555J488J494J117L71
53129B35040m46j099j384j094l09N23R67R86Q78Q97J077J311J443J332R48N05
53113B41575L41N39O79K88n00j032j038j015j351j545j015k70m14j457k130j586
$$ plain form
53097 230069 229655 230100 230961 231987 232708 232585 231851 231458 231840 232317 232136 231466 230911 230525 229940 229139 228491 228154
53079 228154 227957 227767 227548 227116 226264 225113 223981 222955 221941 221092 220746 220903 221102 220999 220696 220330 219614
53062 219614 218133 216000 213913 212497 211781 211420 211258 211427 211932 212446 212699 212875 213408 214510 216121 218130
53046 218130 220305 222065 222781 222441 221678 221083 220841 221080 222028 223502 224684 224946 224638 224597 224999 225197 224703 223842
53028 223842 223279 223255 223508 223724 223759 223487 222734 221520 220270 219553 219571 220094 220935 222195 223762 224891 224801 223656
53010 223656 222426 221733 221364 221035 221031 221748 223052 224549 226067 227482 228467 228874 229083 229475 229850 229858 229691 229741 229745
52991 229745 229019 227516 225997 225113 224888 225266 226516 228854 232110 235918 239836 243123 245009 245559 245861 246964
52975 246964 248921 251112 253065 254476 254881 254055 252690 252011 252490 253354 253571 252960 252112 251577 251522 251938 252647
$$ packed form
53097B30069m14M45Q61J026P21j23p34l93L82M77j81o70n55l86n85q01o48l37
53079B28154j97j90k19m32q52j151j132j026j014q49l46J57J99j03l03l66p16
53062B19614j481k133k087j416p16l61j62J69N05N14K53J76N33J102J611K009
53046B18130K175J760P16l40p63n95k42K39R48J474J182K62l08m1M02J98m94q61
53028B23842n63k4K53K16L5k72p53j214j250p17J8N23Q41J260J567J129r0j145
53010B23656j230o93l69l29mP17J304J497J518J415R85M07K09L92L75Qj67N0M
52991B29745p26j503j519q84k25L78J250K338L256L808L918L287J886N50L02J103
52975B46964J957K191J953J411M05q26j365o79M79Q64K17o11q48n35n5M16P09
$$ plain form
52958 252647 253046 252377 250543 248373 246781 245860 245078 244086 242865 241328 239482 238004 237881 239097 240309 240366
52942 240366 239652 239318 239619 239767 239207 238196 237083 235814 234417 233323 232843 232709 232500 232205 232099 232327 232813
52925 232813 233341 233549 233123 232148 231012 229859 228532 227238 226783 227715 229572 231403 232834 234103 235203 235600
52909 235600 235020 234034 233507 233574 233515 232681 231376 230596 230903 231786 232303 232145 231740 231411 230970 230317 229950 230473 231836
52890 231836 233408 234661 235475 235937 236212 236566 237152 237832 238389 238814 239095 238964 238291 237661 237958 239317 241005
52873 241005 242505 244161 246456 249172 251741 254005 256070 257658 258273 257950 257283 256681 256062 255340 254642 253924
52857 253924 252859 251361 249772 248290 246629 244568 242359 240173 237585 234248 230792 228363 227289 226814
52843 226814 226155 225247 224311 223269 221846 219937 217731 215729 214648 214840 215750 216416 216592 216809 217293 217565 217473
$$ packed form
52958B52647L99o69j834k170j592r21p82r92j221j537j846j478j23J216J212N7
52942B40366p14l34L01J48n60j011j113j269j397j094m80j34k09k95j06K28M86
52925B32813N28K08m26r75j136j153j327j294m55R32J857J831J431J269J100L97
52909B35600n80r86n27O7n9q34j305p80L07Q83N17j58m05l29m41o53l67N23J363
52890B31836J572J253Q14M62K75L54N86O80N57M25K81j31o73o30K97J359J688
52873B41005J500J656K295K716K569K264K065J588O15l23o67o02o19p22o98p18
52857B53924j065j498j589j482j661k061k209k186k588l337l456k429j074m75
52843B26814o59r08r36j042j423j909k206k002j081J92R10O66J76K17M84K72r2
$$ plain form
52826 217473 217800 219167 220880 221622 220987 219650 218310 217221 216622 216778 217542 218520 219707 221330 223004 223796
52810 223796 223446 222919 223259 224308 224881 223976 221538 218345 215482 213630 212524 211239 209267 207184 206011
52795 206011 206054 206638 206884 206483 205770 205278 205230 205382 205297 204852 204358 204180 204347 204664 205056 205679 206738 208352 210526
52776 210526 213095 215683 217834 219255 219908 219835 218979 217303 215131 213200 212116 211712 211223 210187 208968 208220
52760 208220 208079 208160 208196 208345 208938 210250 212493 215674 219314 222541 224607 225278 224815 223774 222816 222494 223079
52743 223079 224596 226847 229277 231067 231747 231713 231809 232407 233156 233621 233856 234264 235116 236271 237206 237415 237004 236685
52725 236685 236869 236950 235990 234013 231983 230462 228997 227097 225190 224073 223847 223962 224100 224490 225369 226572
52709 226572 227730 228673 229500 230290 230786 230491 229300 227959 227547 228420 229969 231422 232468 232924 232407 230870
$$ packed form
52826B17473L27J367J713P42o35j337j340j089n99J56P64R78J187J623J674P92
52810B23796l50n27L40J049N73r05k438l193k863j852j106j285j972k083j173
52795B06011M3N84K46m01p13m92m8J52q5m45m94j78J67L17L92O23J059J614K174
52776B10526K569K588K151J421O53p3q56j676k172j931j084m04m89j036j219p48
52760B08220j41Q1L6J49N93J312K243L181L640L227K066O71m63j041r58l22N85
52743B23079J517K251K430J790O80l4R6N98P49M65K35M08Q52J155R35K09m11l19
52725B36685J84Q1r60j977k030j521j465j900j907j117k26J15J38L90Q79J203
52709B26572J158R43Q27P90M96k95j191j341m12Q73J549J453J046M56n17j537
$$ plain form
52693 230870 229151 228391 228939 230172 231329 232089 232345 231937 230868 229575 228719 228660 229193 229725 229702 228993 227987
52676 227987 227347 227550 228530 229720 230538 230929 231357 232154 233001 233188 232347 230832 229520 229350 230763 233238 235585
52659 235585 237079 238222 240001 242514 244947 246817 248557 250623 252658 253953 254218 253471 251630 248815 245845
52644 245845 243778 242888 242453 241606 240124 238396 236910 235934 235572 235928 237065 238797 240623 242079 243111 243932
52628 243932 244628 245153 245683 246556 247796 248946 249429 248895 247301 245066 243107 242233 242349 242638 242553 242214 241794
52611 241794 241158 240307 239638 239363 239087 238300 237010 235691 234965 235394 237062 239152 240520 240969 241402 242409 243336
52594 243336 243184 241900 240282 239159 239095 240282 242120 243407 243628 243653 244593 246450 248516 250522 252526 254135
52578 254135 254797 254680 254404 254072 253364 252454 252026 252427 253479 254959 256547 257490 257152 255829 254315 252821 251109
$$ packed form
52693B30870j719p60N48J233J157P60K56m08j069j293q56n9N33N32k3p09j006
52676B27987o40K03R80J190Q18L91M28P97Q47J87q41j515j312j70J413K475K347
52659B35585J494J143J779K513K433J870J740K066K035J295K65p47j841k815k970
52644B45845k067q90m35q47j482j728j486r76l62L56J137J732J826J456J032Q21
52628B43932O96N25N30Q73J240J150M83n34j594k235j959q74J16K89q5l39m20
52611B41794o36q51o69k75k76p87j290j319p26M29J668K090J368M49M33J007R27
52594B43336j52j284j618j123o4J187J838J287K21K5R40J857K066K006K004J609
52578B54135O62j17k76l32p08r10m28M01J052J480J588R43l38j323j514j494j712
$$ plain form
52561 251109 249457 248485 248094 247608 246956 246705 246821 246518 245579 244695 244159 243374 242203 241688 242622 244276 245448
52544 245448 246077 246930 248171 249235 249862 250374 250982 251466 251621 251564 251532 251664 251905 251939 251462 250705 250374 250789 251381
52525 251381 251410 250894 250465 250549 251104 251993 253201 254700 256427 258340 260297 262005 263323 264502 265924 267693
52509 267693 269655 271648 273561 275260 276566 277232 276929 275447 273005 270150 267325 264750 262671 261356 260744
52494 260744 260425 259989 259100 257332 254518 251304 248835 247674 247537 248105 249333 250775 251513 251363 251431 252711
52478 252711 254663 255959 256238 256302 256818 257652 258430 259080 259729 260562 261786 263381 264986 266461 268353 271232
52462 271232 274723 277829 280170 282276 284569 286646 287745 287411 285554 282395 278653 275365 273116 271585
52448 271585 270046 268177 266226 264572 263313 262278 261335 260625 260377 260446 260269 259485 258435 257750 257591 257594 257480
$$ packed form
52561B51109j652r72l91m86o52k51J16l03r39q84n36p85j171n15R34J654J172
52544B45448O29Q53J241J064O27N12O08M84J55n7l2J32K41L4m77p57l31M15N92
52525B51381K9n16m29Q4N55Q89J208J499J727J913J957J708J318J179J422J769
52509B67693J962J993J913J699J306O66l03j482k442k855k825k575k079j315o12
52494B60744l19m36q89j768k814l214k469j161j37N68J228J442P38j50O8J280
52478B52711J952J296K79O4N16Q34P78O50O49Q33J224J595J605J475J892K879
52462B71232L491L106K341K106K293K077J099l34j857l159l742l288k249j531
52448B71585j539j869j951j654j259j035r43p10k48O9j77p84j050o85j59Lj14
$$ plain form
52431 257480 257306 257112 256732 256088 255368 254763 254252 253811 253689 254310 255937 258418 261209 263658 265431 266671 267762
52414 267762 268993 270507 272362 274532 277030 280220 284774 290986 298276 305628 312416 318492 323615 327225
52400 327225 328786 328107 325323 320881 315503 309870 304331 299097 294591 291265 289170 288042 287746 288199 288910
52385 288910 289126 288595 287859 287639 288235 289547 291274 292916 294006 294608 295369 296917 299444 302941 307438 312704
52369 312704 318084 322999 327386 331317 334422 336081 336145 335156 333840 332622 331578 330589 329537 328495 327740
52354 327740 327403 327235 326959 326827 327469 329073 330978 332304 332872 333382 334755 337419 341116 345142 348825 352029
52338 352029 355287 359298 364204 369553 375047 381063 388164 396299 404890 413686 423092 433537 444923 456933
52324 456933 469578 483075 497379 512168 527177 542282 557305 572060 586594 601184 616037
$$ packed form
52431B57480j74j94l80o44p20o05n11m41j22O21J627K481K791K449J773J240J091
52414B67762J231J514J855K170K498L190M554O212P290P352O788O076N123L610
52400C27225J561o79k784m442n378n633n539n234m506l326k095j128k96M53P11
52385B88910K16n31p36k20N96J312J727J642J090O02P61J548K527L497M497N266
52369C12704N380M915M387L931L105J659O4r89j316j218j044r89j052j042p55
52354C27740l37j68k76j32O42J604J905J326N68N10J373K664L697M026L683L204
52338C52029L258M011M906N349N494O016P101Q135Q591Q796R406J0445J1386J2010
52324D56933J2645J3497J4304J4789J5009J5105J5023J4755J4534J4590J4853
$$ plain form
52313 616037 631181 646601 662336 678445 694998 712034 729378 746633 763521 780119 796506
52302 796506 812329 827085 840825 854157 867443 880210 891459 900397 906819 910994 913268 913633 911728
52289 911728 907445 901455 894843 888245 881629 874879 868124 861419 854621 847937 842175 838002 835208 833182
52275 833182 831948 832259 834616 838653 843628 849191 855432 862463 870285 878966 888583 898897 909313 919395
52261 919395 929341 939850 951545 964647 979022 994185 1009216 1023146 1035783 1047964 1060582 1073393
52249 1073393 1085085 1094458 1101217 1105601 1107683 1107283 1104279 1098783 1091153 1082041 1072272 1062460 1052700 1042726
52235 1042726 1032240 1021076 1009271 997234 985716 975313 965896 956739 947287 937796 929131 921988
52223 921988 916352 911738 907825 904688 902373 900497 898563 896580 895100 894615 895136 896419 898329 900855 904009
$$ packed form
52313F16037J5144J5420J5735J6109J6553J7036J7344J7255J6888J6598J6387
52302G96506J5823J4756J3740J3332J3286J2767J1249Q938O422M175K274L65j905
52289I11728m283n990o612o598o616o750o755o705o798o684n762m173k794k026
52275H33182j234L11K357M037M975N563O241P031P822Q681R617J0314J0416J0082
52261I19395R946J0509J1695J3102J4375J5163J5031J3930J2637J2181J2618J2811
52249A073393J1692R373O759M384K082m00l004n496p630r112r769r812r760r974
52235A042726j0486j1164j1805j2037j1518j0403r417r157r452r491q665p143
52223I21988n636m614l913l137k315j876j934j983j480m85N21J283J910K526L154
$$ plain form
52208 904009 907795 912095 916435 920097 922726 924685 926645 928977 931720 934895 938540 942585 947032 952192
52194 952192 958364 965268 972185 978742 985121 991314 996585 1000001 1001278 1000716 998513 994633 989300 983124
52180 983124 976523 969419 961726 953781 945972 938210 930299 922745 916625 912447 909529 906831 904089 901821
52166 901821 900460 899977 900329 901753 904304 907364 910020 911955 913715 916000 918846 921666 924010 926021 928020
52151 928020 929852 930895 930729 929580 928070 926720 925769 925278 925225 925583 926432 927893 929819 931685 932930 933362
52135 933362 933202 932893 933090 934619 938142 943849 951643 961508 973424 987048 1001902 1017942 1035610 1055259
52121 1055259 1076818 1100052 1124659 1149802 1174066 1196562 1217997 1239986 1263125 1286149 1307297
52110 1307297 1326077 1343223 1359197 1373495 1385642 1396159 1405978 1415175 1422985 1429028 1433782 1437603
$$ packed form
52208I04009L786M300M340L662K629J959J960K332K743L175L645M045M447N160
52194I52192O172O904O917O557O379O193N271L416J277n62k203l880n333o176
52180I83124o601p104p693p945p809p762p911p554o120m178k918k698k742k268
52166I01821j361m83L52J424K551L060K656J935J760K285K846K820K344K011J999
52151I28020J832J043j66j149j510j350r51m91n3L58Q49J461J926J866J245M32
52135I33362j60l09J97J529L523N707P794R865J1916J3624J4854J6040J7668J9649
52121A055259K1559K3234K4607K5143K4264K2496K1435K1989K3139K3024K1148
52110A307297J8780J7146J5974J4298J2147J0517R819R197P810O043M754L821
$$ plain form
52098 1437603 1439943 1440074 1438137 1434791 1429939 1422563 1411900 1398220 1382290 1364672 1345937 1327129 1309370
52085 1309370 1293115 1278166 1264374 1251944 1241003 1231332 1222769 1215616 1210327 1206891 1204841 1203884 1204167
52072 1204167 1205778 1208313 1211401 1215567 1222040 1231455 1243073 1255553 1268198 1281103 1294375 1307782
52060 1307782 1321162 1334603 1348016 1360951 1373187 1385118 1397067 1408268 1417031 1422138 1423843 1423327
52048 1423327 1421327 1417577 1411504 1403039 1392491 1379909 1365096 1348293 1330401 1312293 1294205 1276117
52036 1276117 1258384 1241563 1225731 1210525 1195831 1182034 1169464 1157963 1147088 1136362 1125188
52025 1125188 1112963 1099707 1086358 1074033 1062975 1052528 1042085 1031733 1021810 1012163 1002276 992109
52013 992109 982410 973865 966100 957921 948554 938231 927410 915866 902951 888441 872724 856335
$$ packed form
52098A437603K340J31j937l346m852p376j0663j3680j5930j7618j8735j8808j7759
52085A309370j6255j4949j3792j2430j0941r671q563p153n289l436k050r57K83
52072A204167J611K535L088M166O473R415J1618J2480J2645J2905J3272J3407
52060A307782J3380J3441J3413J2935J2236J1931J1949J1201Q763N107J705n16
52048A423327k000l750o073q465j0548j2582j4813j6803j7892j8108j8088j8088
52036A276117j7733j6821j5832j5206j4694j3797j2570j1501j0875j0726j1174
52025A125188j2225j3256j3349j2325j1058j0447j0443j0352r923r647r887j0167
52013I92109r699q545p765q179r367j0323j0821j1544j2915j4510j5717j6389
$$ plain form
52001 856335 839780 823697 808692 794939 782312 770847 760662 751389 742197 732471 722056 710817
51989 710817 698487 685161 671443 657801 644122 630136 615855 601339 586561 571858 558004
51978 558004 545302 532983 520267 507841 497557 490567 486316 483532 481647 480942 481733 483924 487306
51965 487306 491818 497298 503177 508703 513504 517647 520985 522712 521982 518909 514517 509699 504675 499580
51951 499580 495011 491605 489482 488548 489083 491588 496260 503078 512216 523923 538128 554624 573549 595131
51937 595131 618834 643111 666013 685706 700529 709256 711674 708562 700886 689211 674011 656073
51925 656073 636267 615200 593466 572011 551820 533280 516210 500487 486352 473978 463101
51914 463101 453300 444534 437207 431718 428111 426135 425466 425852 427205 429625 433199 437639 442207 446082 448739
$$ packed form
52001H56335j6555j6083j5005j3753j2627j1465j0185r273r192r726j0415j1239
51989G10817j2330j3326j3718j3642j3679j3986j4281j4516j4778j4703j3854
51978E58004j2702j2319j2716j2426j0284o990m251k784j885p05P91K191L382
51965D87306M512N480N879N526M801M143L338J727p30l073m392m818n024n095
51951D99580m569l406k123r34N35K505M672O818R138J1707J4205J6496J8925K1582
51937E95131K3703K4277K2902J9693J4823Q727K418l112p676j1675j5200j7938
51925F56073j9806k1067k1734k1455k0191j8540j7070j5723j4135j2374j0877
51914D63101r801q766p327n489l607j976o69L86J353K420L574M440M568L875K657
$$ plain form
51899 448739 449921 449478 447446 444091 439563 433579 425825 416691 407286 398699 391500 385875 381774 378850
51885 378850 376783 375824 376547 378875 381909 385064 388816 393846 399952 406453 413262 420669 428225 434704 439312
51870 439312 442297 444151 444808 443969 441808 438977 436021 433005 429673 426015 422749 421036 421394 423101 425021
51855 425021 426869 429121 431808 434052 434896 433993 431339 426978 421300 415105 408928 402629 395981 389348 383413
51840 383413 378519 374615 371517 368875 366178 363303 360964 360194 361333 363732 366348 368422 369710 370388 370735
51825 370735 370747 370129 368754 366949 365146 363508 362128 361279 361114 361249 361149 360863 360958 361695 362659 363312 363574 363672
51807 363672 363688 363519 363158 362866 362989 363677 364754 365903 366984 368071 369158 369948 370047 369259 367591 365246 362772
51790 362772 360947 360153 359976 359814 359782 360595 362540 365037 367285 368949 369978 370228 369632 368536 367545 367180 367844
$$ packed form
51899D48739J182m43k032l355m528n984p754r134r405q587p199n625m101k924
51885C78850k067r59P23K328L034L155L752N030O106O501O809P407P556O479M608
51870D39312K985J854O57q39k161k831k956l016l332l658l266j713L58J707J920
51855D25021J848K252K687K244Q44r03k654m361n678o195o177o299o648o633n935
51840C83413m894l904l098k642k697k875k339p70J139K399K616K074J288O78L47
51825C70735J2o18j375j805j803j638j380q49j65J35j00k86R5P37R64O53K62R8
51807C63672J6j69l61k92J23O88J077J149J081J087J087P90R9p88j668k345k474
51790C62772j825p94j77j62l2Q13J945K497K248J664J029K50n96j096r91l65O64
$$ plain form
51773 367844 369854 373171 377316 381938 387336 394024 401821 409833 417291 423928 429383 432787 433347 431050
51759 431050 426444 419956 411899 403044 394652 387716 382324 377810 373289 368145 362433 357008 352962 350673
51745 350673 349559 348890 348568 348860 349739 350987 352790 355664 359709 364391 369241 374289 379519 384282 387731
51730 387731 389754 391070 392519 394603 397698 402133 407721 413396 417661 419456 418642 415844 412029 408079
51716 408079 404506 401455 398962 396981 395054 392231 387847 382421 377427 374036 372338 371847 372286 373490 374945
51701 374945 376010 376531 376779 376868 376723 376547 376724 377131 377166 376698 376299 376112 375165 372513 368645 364985 362194 359792
51683 359792 357386 355348 354077 353396 353103 353532 355037 357311 359737 362088 364495 366986 369589 372711 376884
51668 376884 382123 387978 394213 401081 408782 416899 424380 429859 432090 430515 425724 419238 412639 406905
$$ packed form
51773C67844K010L317M145M622N398O688P797Q012P458O637N455L404N60k297
51759D31050m606o488q057q855q392o936n392m514m521n144n712n425m046k289
51745C50673j114o69l22K92Q79J248J803K874M045M682M850N048N230M763L449
51730C87731K023J316J449K084L095M435N588N675M265J795q14k798l815l950
51716D08079l573l051k493j981j927k823m384n426m994l391j698m91M39J204J455
51701C74945J065N21K48Q9j45j76J77M07L5m68l99j87r47k652l868l660k791k402
51683C59792k406k038j271o81k93M29J505K274K426K351K407K491K603L122M173
51668C76884N239N855O235O868P701Q117P481N479K231j575m791o486o599n734
$$ plain form
51654 406905 402468 399654 398810 400035 402851 406214 408967 410473 410732 409858 407625 403822 398917 393899 389344
51639 389344 385035 380679 376568 373099 369972 366485 362620 359209 356820 354990 352943 350656 348706 347278
51625 347278 345931 344324 342587 340832 338883 336756 334880 333363 331485 328513 324795 321439 319044 317405
51611 317405 316397 316316 317106 318020 318523 319028 320237 322180 324407 326724 329137 331462 333749 336994 342588 350900
51595 350900 360923 371361 381349 389893 395447 396780 394051 388642 382134 375717 370171 365796 362434 360010
51581 360010 359041 360244 363710 368869 375229 382749 391349 400532 409733 418792 427876 437108 446424 455644
51567 455644 464511 472776 480396 487618 494924 503108 513409 527159 544954 566292 590108 615386 641046
51554 641046 665638 687655 706073 720257 729542 733491 732522 727645 719366 707420 691897 674108 655863
$$ packed form
51654D06905m437k814q44J225K816L363K753J506K59q74k233l803m905n018m555
51639C89344m309m356m111l469l127l487l865l411k389j830k047k287j950j428
51625C47278j347j607j737j755j949k127j876j517j878k972l718l356k395j639
51611C17405j008q1P90R14N03N05J209J943K227K317K413K325K287L245N594Q312
51595C50900J0023J0438R988Q544N554J333k729n409o508o417n546m375l362k424
51581C60010r69J203L466N159O360P520Q600R183R201R059R084R232R316R220
51567D55644Q867Q265P620P222P306Q184J0301J3750J7795K1338K3816K5278K5660
51554F41046K4592K2017J8418J4184R285L949r69m877q279j1946j5523j7789j8245
$$ plain form
51541 655863 638145 620953 604179 588087 572964 558828 545539 532853 520299 507363 493969
51530 493969 480567 467686 455594 444362 433942 424089 414567 405618 397940 391970 387393 383535 380041
51517 380041 376913 374055 371145 367944 364499 361002 357618 354445 351519 348846 346526 344779 343751 343362
51503 343362 343470 344118 345357 346844 347913 348229 348187 348442 349079 349491 349138 348284 347837 348472 350036 351787 353051
51486 353051 353602 353573 353213 352765 352405 352182 351980 351552 350546 348590 345512 341527 337148 332844 328794 324953
51470 324953 321273 317789 314567 311577 308686 305817 303195 301288 300371 300239 300495 301014 301857 302830 303496 303780
51454 303780 304197 305302 307143 309435 312018 314888 318086 321904 327066 334339 343963 355636 368801 382538
51440 382538 395370 405857 413596 419291 423652 426624 427799 427105 424711 420608 414820 407845 400437 392954
$$ packed form
51541F55863j7718j7192j6774j6092j5123j4136j3289j2686j2554j2936j3394
51530D93969j3402j2881j2092j1232j0420r853r522q949p678n970m577l858l494
51517C80041l128k858k910l201l445l497l384l173k926k673k320j747j028l89
51503C43362J08O48J239J487J069L16m2K55O37M12l53q54m47O35J564J751J264
51486C53051N51k9l60m48l60k23k02m28j006j956l078l985m379m304m050l841
51470C24953l680l484l222k990k891k869k622j907r17j32K56N19Q43R73O66K84
51454C03780M17J105J841K292K583K870L198L818N162P273R624J1673J3165J3737
51440C82538J2832J0487P739N695M361K972J175o94k394m103n788o975p408p483
$$ plain form
51426 392954 385301 377461 369699 362225 355139 348880 344283 341807 340949 340743 340742 341181 342208 343304 343654 342979
51410 342979 341849 341117 341039 341033 340474 339651 339639 341079 343421 345689 347710 350043 352883 355713 358228 361000 364813
51393 364813 369766 375477 381844 389022 396783 404605 412560 421612 432688 445789 460410 476691 495721
51380 495721 518599 545464 575655 608614 644241 682106 720529 756801 788416 813941 832758
51369 832758 844425 848608 845449 835599 819891 799135 774146 745718 714533 681270 646704 611576
51357 611576 576565 542631 511227 483719 460540 441157 424827 411032 399293 389126 380469 373717
51345 373717 369039 365815 363027 360036 356807 353633 350886 348856 347517 346463 345264 343826 342286 340659
51331 340659 338758 336442 333818 331223 328983 327119 325240 322906 320191 317732 316154 315519 315425 315435 315332 315132
$$ packed form
51426C92954p653p840p762p474p086o259m597k476q58k06jM39J027J096L50o75
51410C42979j130p32p8on59q23j2J440K342K268K021K333K840K830K515K772L813
51393C64813M953N711O367P178P761P822P955R052J1076J3101J4621J6281J9030
51380D95721K2878K6865L0191L2959L5627L7865L8423L6272L1615K5525J8817
51369H32758J1667M183l159r850j5708k0756k4989k8428l1185l3263l4566l5128
51357F11576l5011l3934l1404k7508k3179j9383j6330j3795j1739j0167q657o752
51345C73717m678l224k788k991l229l174k747k030j339j054j199j438j540j627
51331C40659j901k316k624k595k240j864j879k334k715k459j578o35r4J0j03k00
$$ plain form
51315 315132 315030 315266 315951 317097 318723 320699 322493 323499 323712 323684 323602 322850 320911 318415 316727 316577 317557
51298 317557 318873 320086 321046 321545 321389 320610 319421 318058 316799 316038 316219 317571 319892 322598 325177 327689
51282 327689 330733 334812 339872 345501 351337 356999 361803 364957 366130 365651 364166 362258 360357 358725
51268 358725 357467 356698 356698 357720 359576 361604 363159 364087 364656 365039 364901 363587 360883 357546 354813 353183
51252 353183 351881 349685 346113 341613 336883 332408 328583 325810 324350 324230 325265 326992 328664 329679
51238 329679 330070 330281 330457 330218 329207 327526 325578 323724 322291 321587 321659 322083 322179 321482 320017 318322 317211
51221 317211 317307 318639 320693 322882 324837 326319 327147 327394 327549 328245 329795 331934 334021 335571 336738 338297
51205 338297 340982 344886 349532 354362 358903 362545 364635 364953 363897 362081 359979 358027 356686 356003 355296
$$ packed form
51315C15132j02K36O85J146J626J976J794J006K13k8q2p52j939k496j688j50R80
51298C17557J316J213R60M99j56p79j189j363j259p61J81J352K321K706K579K512
51282C27689L044M079N060N629N836N662M804L154J173m79j485j908j901j632
51268C58725j258p69%J022J856K028J555R28N69L83j38j314k704l337k733j630
51252C53183j302k196l572m500m730m475l825k773j460j20J035J727J672J015
51238C29679L91K11J76k39j011j681j948j854j433p04P2M24R6o97j465j695j111
51221C17211R6J332K054K189J955J482Q28K47J55O96J550K139K087J550J167J559
51205C38297K685L904M646M830M541L642K090L18j056j816k102j952j341o83p07
$$ plain form
51190 355296 353762 351506 349672 349362 350469 351742 351970 351035 349891 349692 350935 353203 355508 356958 357308
51175 357308 356959 356394 355688 354676 353409 352093 350716 349177 347794 347168 347347 347688 347870 348538 350392 353023
51159 353023 355266 356463 356777 356480 355691 354803 354378 354389 354095 352969 351302 349736 348584 347860 347546 347519 347508 347408
51141 347408 347418 347704 348172 348691 349255 349779 350049 350056 350103 350434 351016 351753 352584 353255 353490 353547 354158 355601 357326 358805
51121 358805 360233 361956 363700 365037 366253 368006 370245 372156 373257 373945 374866 376227 377894 379713 381525
51106 381525 383105 384327 385214 385773 385999 386055 386233 386663 387344 388443 390208 392415 394197 394742 394088 393077 392586
51089 392586 392910 393783 394757 395491 395793 395618 395168 394935 395383 396364 397019 396542 395120 393931 394036 395371 396890
51072 396890 397682 397856 398376 400166 403489 408118 413844 420630 428465 437447 448057 461031 476765 494947
$$ packed form
51190C55296j534k256j834l10J107J273K28r35j144j99J243K268K305J450L50
51175C57308l49n65p06j012j267j316j377j539j383o26J79L41J82O68J854K631
51159C53023K243J197L14k97p89q88m25J1k94j126j667j566j152p24l14k7j1j00
51141C47408J0K86M68N19N64N24K70PM7L31N82P37Q31O71K35N7O11J443J725J479
51121C58805J428J723J744J337J216J753K239J911J101O88R21J361J667J819J812
51106C81525J580J222Q87N59K26N6J78M30O81J099J765K207J782N45o54j011m91
51089C92586L24Q73R74P34L02j75m50k33M48R81O55m77j422j189J05J335J519
51072C96890P92J74N20J790L323M629N726O786P835Q982J0610J2974J5734J8182
$$ plain form
51058 494947 514739 534980 554107 570341 582493 590751 596579 601919 608371 616546 625707 634160 640488
51045 640488 644479 646683 647188 645225 639951 631291 620055 607669 595891 586242 579161 573683 568161 561408
51031 561408 553179 543770 533452 522374 510920 499962 490546 483257 478003 474476 472654 472725 474710 478438
51017 478438 483857 491041 499789 509452 519313 528990 538379 547339 555632 563147 570067 576642 582737 587702
51003 587702 590928 592637 593910 595654 597603 598568 597695 595272 592324 589670 587525 585852 584863 585125 587154
50988 587154 590916 595878 601697 608796 618088 630112 644606 660842 678060 695454 712070 727108
50976 727108 740493 753151 766678 782638 801878 824431 850112 879234 912552 950499 992723
50965 992723 1038602 1087956 1140919 1197238 1256101 1316701 1378543 1440875 1502140 1560424 1614423
$$ packed form
51058D94947J9792K0241J9127J6234J2152Q258N828N340O452Q175R161Q453O328
51045F40488L991K204N05j963n274q660j1236j2386j1778r649p081n478n522o753
51031E61408q229r409j0318j1078j1454j0958r416p289n254l527j822P1J985L728
51017D78438N419P184Q748R663R861R677R389Q960Q293P515O920O575O095M965
51003E87702L226J709J273J744J949R65q73k423k948k654k145j673r89K62K029
50988E87154L762M962N819P099R292J2024J4494J6236J7218J7394J6616J5038
50976G27108J3385J2658J3527J5960J9240K2553K5681K9122L3318L7947M2224
50965I92723M5879M9354N2963N6319N8863O0600O1842O2332O1265N8284N3999
$$ plain form
50954 1614423 1663704 1708045 1746994 1780161 1807586 1829493 1845946 1857131 1863945 1867913 1870476 1872468
50942 1872468 1874206 1875705 1876670 1876464 1874319 1869662 1862350 1852715 1841253 1828086 1812794 1794932 1774506
50929 1774506 1751588 1725665 1695940 1662280 1625278 1585277 1541953 1495240 1446119 1396039 1345935
50918 1345935 1296246 1247525 1200448 1155498 1113174 1074308 1039519 1008413 979913 953443 929244
50907 929244 907560 888118 870568 854851 840829 828036 816161 805425 796059 787680 779599 771715
50895 771715 764711 759302 755449 752392 749427 746594 744561 743805 744061 744754 745838 747816 750894 754546 758121
50880 758121 761591 765506 770454 776875 785068 794946 805837 816945 828151 840119 853554 868593 884921
50867 884921 902237 920442 939599 959949 981881 1005778 1031978 1061069 1094024 1131735 1174445
$$ packed form
50954A614423M9281M4341L8949L3167K7425K1907J6453J1185O814L968K563J992
50942A872468J738J499R65k06k145m657p312r635j1462j3167j5292j7862k0426
50929A774506k2918k5923k9725l3660l7002m0001m3324m6713m9121n0080n0104
50918A345935m9689m8721m7077m4950m2324l8866l4789l1106k8500k6470k4199
50907I29244k1684j9442j7550j5717j4022j2793j1875j0736r366q379q081p884
50895G71715p004n409l853l057k965k833k033p56K56O93J084J978L078L652L575
50880G58121L470L915M948O421Q193R878J0891J1108J1206J1968J3435J5039J6328
50867H84921J7316J8205J9157K0350K1932K3897K6200K9091L2955L7711M2710
$$ plain form
50856 1174445 1221987 1274578 1333068 1398263 1470429 1549741 1636804 1732192 1835619 1946124 2063020
50845 2063020 2186104 2314854 2448032 2584206 2721982 2859205 2992372 3117475 3231283
50836 3231283 3331439 3415758 3482238 3529930 3559327 3571814 3569182 3553796 3528771 3497510 3462995
50825 3462995 3427546 3393141 3361946 3336427 3318660 3309160 3306407 3307588 3309576 3309040 3302178 3285340 3256153
50812 3256153 3213688 3157553 3087428 3003713 2907959 2802165 2687997 2567149 2442258 2316845
50802 2316845 2194233 2076735 1965780 1862416 1767499 1681646 1605197 1538175 1480170 1430368
50792 1430368 1387925 1352426 1323821 1301813 1285361 1272945 1263267 1255657 1249901 1245966 1243789 1242940 1242367
50779 1242367 1240853 1237911 1233933 1229280 1223610 1216438 1207935 1198741 1189165 1179053 1168192 1156388 1143275
$$ packed form
50856A174445M7542N2591N8490O5195P2166P9312Q7063R5388J03427J10505J16896
50845B063020J23084J28750J33178J36174J37776J37223J33167J25103J13808
50836C231283J00156Q4319O6480M7692K9397J2487k632j5386k5025l1261l4515
50825C462995l5449l4405l1195k5519j7767r500k753J181J988n36o862j6838k9187
50812C256153m2465n6135p0125q3715r5754j05794j14168j20848j24891j25413
50802B316845j22612j17498j10955j03364r4917q5853p6449o7022n8005m9802
50792A430368m2443l5499k8605k2008j6452j2416r678p610n756l935k177q49n73
50779A242367j514k942l978m653n670p172q503r194r576j0112j0861j1804j3113
$$ plain form
50766 1143275 1128557 1112406 1095225 1077180 1058451 1039841 1022456 1006729 992315 979056 967506
50755 967506 958344 951742 947562 945773 946485 949843 956017 965018 976515 990232 1006510 1026048 1049078
50742 1049078 1075330 1104819 1138001 1174985 1215294 1258724 1305793 1356945 1411847 1469961 1531242
50731 1531242 1595650 1662387 1730263 1798598 1867212 1935635 2002894 2068039 2130457 2189590 2244553
50720 2244553 2293952 2335909 2368368 2389608 2398507 2394523 2377981 2350624 2315441 2275620 2233861 2192751
50708 2192751 2155079 2123227 2098492 2081319 2071678 2068707 2070439 2074565 2079362 2083443 2084985 2081800 2071926
50695 2071926 2053605 2025057 1985214 1934819 1876231 1812076 1744446 1675233 1606496 1540279 1478429
50684 1478429 1422542 1373523 1331152 1294637 1263815 1239472 1222470 1212929 1210266 1213543 1221723 1234051
$$ packed form
50766A143275j4718j6151j7181j8045j8729j8610j7385j5727j4414j3259j1550
50755I67506r162o602m180j789P12L358O174R001J1497J3717J6278J9538K3030
50742A049078K6252K9489L3182L6984M0309M3430M7069N1152N4902N8114O1281
50731A531242O4408O6737O7876O8335O8614O8423O7259O5145O2418N9133N4963
50720B244553M9399M1957L2459K1240Q899l984j6542k7357l5183l9821m1759m1110
50708B192751l7672l1852k4735j7173r641k971J732M126M797M081J542l185r874
50695B071926j8321k8548l9843n0395n8588o4155o7630o9213o8737o6217o1850
50684A478429n5887m9019m2371l6515l0822k4343j7002r541k663L277Q180J2328
$$ plain form
50672 1234051 1250397 1270882 1295071 1321769 1349494 1376819 1402475 1425845 1447432 1468228 1488378
50661 1488378 1507027 1523580 1538592 1553159 1568029 1583555 1599916 1616887 1633839 1650406 1666906
50650 1666906 1683862 1701574 1720509 1741588 1765460 1791768 1819785 1849571 1881908 1917160 1954833
50639 1954833 1994300 2035400 2078043 2121593 2164862 2206582 2245774 2281967 2315282 2346278 2375626
50628 2375626 2403985 2431960 2459576 2485268 2505377 2515076 2510440 2490299 2456783 2414429 2368569 2323897
50616 2323897 2283682 2249718 2222678 2202577 2189048 2181361 2178372 2178634 2180649 2183060 2184618 2183977 2179508
50603 2179508 2169367 2151889 2126086 2091815 2049496 1999782 1943629 1882578 1818622 1753536 1688371
50592 1688371 1623698 1560285 1499280 1441638 1387611 1337060 1290195 1247582 1209379 1175001 1143870
$$ packed form
50672A234051J6346K0485K4189K6698K7725K7325K5656K3370K1587K0796K0150
50661A488378J8649J6553J5012J4567J4870J5526J6361J6971J6952J6567J6500
50650A666906J6956J7712J8935K1079K3872K6308K8017K9786L2337L5252L7673
50639A954833L9467M1100M2643M3550M3269M1720L9192L6193L3315L0996K9348
50628B375626K8359K7975K7616K5692K0109R699m636k0141l3516m2354m5860m4672
50616B323897m0215l3964k7040k0101j3529p687k989K62K015K411J558o41m469
50603B179508j0141j7478k5803l4271m2319m9714n6153o1051o3956o5086o5165
50592A688371o4673o3413o1005n7642n4027n0551m6865m2613l8203l4378l1131
$$ plain form
50581 1143870 1116138 1092236 1072016 1054972 1041171 1031141 1024698 1020688 1018306 1018030 1020683 1026148 1033668
50568 1033668 1043008 1054527 1068272 1083742 1100519 1118564 1137914 1158711 1181493 1206771 1234139
50557 1234139 1262348 1290528 1318864 1347963 1377970 1408571 1439465 1470517 1501700 1533080 1564700
50546 1564700 1596403 1627978 1659487 1691210 1723424 1756667 1792181 1831536 1875733 1925055 1979742
50535 1979742 2040082 2105636 2175142 2247706 2323704 2404168 2489725 2580517 2676652 2778084 2884172
50524 2884172 2993739 3105426 3217678 3328630 3436261 3538441 3632622 3715931 3785956 3841160
50514 3841160 3880204 3901337 3903087 3885358 3849316 3796413 3728058 3646143 3553305 3452634 3347507
50503 3347507 3241575 3138432 3041286 2953236 2877607 2817297 2773642 2746324 2734340 2736622 2751800
$$ packed form
50581A143870k7732k3902k0220j7044j3801j0030o443m010k382k76K653N465P520
50568A033668R340J1519J3745J5470J6777J8045J9350K0797K2782K5278K7368
50557A234139K8209K8180K8336K9099L0007L0601L0894L1052L1183L1380L1620
50546A564700L1703L1575L1509L1723L2214L3243L5514L9355M4197M9322N4687
50535A979742O0340O5554O9506P2564P5998Q0464Q5557R0792R6135J01432J06088
50524B884172J09567J11687J12252J10952J07631J02180R4181Q3309P0025N5204
50514C841160L9044K1133J750j7729l6042n2903o8355q1915r2838j00671j05127
50503C347507j05932j03143r7146q8050p5629o0310m3655k7318j1984K282J5178
$$ plain form
50492 2751800 2778005 2813051 2854089 2896767 2935312 2964040 2978704 2976338 2954532 2911689 2848035
50481 2848035 2765897 2668895 2561072 2446684 2330128 2215393 2105191 2000547 1901342 1807438
50471 1807438 1719409 1638167 1563988 1496112 1433423 1375410 1322444 1275287 1234407 1199632 1170221
50460 1170221 1145281 1124252 1107082 1093956 1084909 1079670 1077768 1078728 1082270 1088463 1097660 1110144 1125755
50447 1125755 1143864 1163730 1184934 1207548 1231963 1258465 1286565 1314428 1339076 1357730 1369453
50436 1369453 1375456 1377663 1377185 1374454 1370403 1366656 1364302 1363177 1362844 1363839 1367294 1373592 1382186 1392749
50422 1392749 1405796 1421852 1440619 1461511 1484799 1511638 1542951 1578708 1618417 1661983 1709715
50411 1709715 1761554 1816562 1873337 1930811 1988543 2046261 2103300 2158508 2210531 2258075 2300021
$$ packed form
50492B751800K6205L5046M1038M2678L8545K8728J4664k366k1806m2843o3654
50481B848035q2138r7002j07823j14388j16556j14735j10202j04644r9205r3904
50471A807438q8029q1242p4179o7876o2689n8013n2966m7157m0880l4775k9411
50460A170221k4940k1029j7170j3126r047n239j902R60L542O193R197J2484J5611
50447A125755J8109J9866K1204K2614K4415K6502K8100K7863K4648J8654J1723
50436A369453O003K207m78k731m051l747k354j125l33R95L455O298Q594J0563
50422A392749J3047J6056J8767K0892K3288K6839L1313L5757L9709M3566M7732
50411A709715N1839N5008N6775N7474N7732N7718N7039N5208N2023M7544M1946
$$ plain form
50400 2300021 2335477 2363755 2384138 2395607 2396859 2386712 2364620 2330906 2286545 2232794 2171094
50389 2171094 2103303 2031776 1958974 1887048 1818009 1754152 1697779 1650292 1611812 1581865 1560157
50378 1560157 1546515 1540487 1541488 1549069 1562488 1579949 1598693 1615890 1629198 1636602 1636349 1627457 1609995
50365 1609995 1584580 1551778 1512363 1468110 1421921 1376833 1334767 1296173 1260798 1228646 1199954
50354 1199954 1174203 1149461 1123190 1093850 1061581 1027456 992513 957738 924540 894559 868826
50343 868826 847377 829768 815662 804700 796160 789246 783802 780311 779010 779335 780548 782614 785993
50330 785993 790668 795915 801130 806378 811932 817684 823380 829088 835097 841515 848308 855518 863090 870654
50316 870654 877804 884422 890384 895247 898774 901607 904803 908685 912767 916894 921787 928172 935927 944520
$$ packed form
50400B300021L5456K8278K0383J1469J252j0147k2092l3714m4361n3751o1700
50389B171094o7791p1527p2802p1926o9039o3857n6373m7487l8480k9947k1708
50378A560157j3642o028J001P581J3419J7461J8744J7197J3308P404k53q892j7462
50365A609995k5415l2802l9415m4253m6189m5088m2066l8594l5375l2152k8692
50354A199954k5751k4742k6271k9340l2269l4125l4943l4775l3198k9981k5733
50343H68826k1449j7609j4106j0962q540o914n444l491j301L25J213K066L379
50330G85993M675N247N215N248N554N752N696N708O009O418O793P210P572P564
50316H70654P150O618N962M863L527K833L196L882M082M127M893O385P755Q593
$$ plain form
50302 944520 953850 964214 975736 988290 1001844 1016553 1032686 1050772 1071559 1095466 1122353 1152303
50290 1152303 1186239 1224706 1265453 1302647 1328992 1338981 1330792 1306309 1270204 1228493 1186638 1148052
50278 1148052 1114088 1085226 1061909 1044280 1031724 1023205 1018015 1015925 1016674 1019627 1024041 1029493 1035981
50265 1035981 1043739 1052998 1063826 1076181 1090128 1105839 1123135 1141096 1158482 1174635 1189724 1204047
50253 1204047 1217463 1229733 1241072 1251996 1262662 1272516 1280376 1284672 1283972 1277765 1266729 1252048
50241 1252048 1234713 1215749 1196710 1179238 1164137 1151440 1141255 1133794 1128332 1122862 1115213 1104142
50229 1104142 1089091 1069640 1045971 1019546 992511 966285 941108 916874 893880 872645 853458
50218 853458 836298 820897 806753 793414 780936 769823 760323 752065 744615 738081 732718 728106 723311
$$ packed form
50302I44520R330J0364J1522J2554J3554J4709J6133J8086K0787K3907K6887K9950
50290A152303L3936L8467M0747L7194K6345R989q189k4483l6105m1711m1855l8586
50278A148052l3964k8862k3317j7629j2556q519n190k090P49K953M414N452O488
50265A035981P758R259J0828J2355J3947J5711J7296J7961J7386J6153J5089J4323
50253A204047J3416J2270J1339J0924J0666R854P860M296p00o207j1036j4681
50241A252048j7335j8964j9039j7472j5101j2697j0185p461n462n470p649j1071
50229A104142j5051j9451k3669k6425k7035k6226k5177k4234k2994k1235j9187
50218H53458j7160j5401j4144j3339j2478j1113r500q258p450o534n363m612m795
$$ plain form
50205 723311 718036 713115 709477 706944 704496 701550 698431 695578 692858 689884 686527 682791 678619 674231
50191 674231 670256 666954 663597 659296 654329 649917 646631 643782 640651 637613 635535 634554 634040 633426 632579
50176 632579 631542 630479 629744 629516 629402 628838 627885 627198 627144 627399 627577 627944 629245 631969 635983 640797 646065
50159 646065 651845 658446 666080 674808 684843 696746 711108 728102 747552 769361 793630 820374
50147 820374 849383 880464 913599 948721 985343 1022479 1058936 1093848 1127137 1159482 1191737
50136 1191737 1224380 1257486 1290930 1324289 1356567 1386195 1411230 1429375 1438148 1435725 1421996 1398608
50124 1398608 1367864 1331782 1292069 1250399 1208229 1166604 1126460 1088884 1054724 1024107 996693
50113 996693 972277 950734 931505 913719 896936 881342 867009 853447 840192 827447 815741
$$ packed form
50205G23311n275m921l638k533k448k946l119k853k720k974l357l736m172m388
50191F74231l975l302l357m301m967m412l286k849l131l038k078r81n14o14q47
50176F32579j037j063p35k28j14n64r53o87n4K55J78L67J301K724M014M814N268
50159F46065N780O601P634Q728J0035J1903J4362J6994J9450K1809K4269K6744
50147H20374K9009L1081L3135L5122L6622L7136L6457L4912L3289L2345L2255
50136A191737L2643L3106L3444L3359L2278K9628K5035J8145Q773k423j3729k3388
50124A398608l0744l6082l9713m1670m2170m1625m0144l7576l4160l0617k7414
50113I96693k4416k1543j9229j7786j6783j5594j4333j3562j3255j2745j1706
$$ plain form
50102 815741 805227 795777 787531 780664 774617 768245 761080 753985 748152 743838 740474 737726 735845 735060
50088 735060 735213 736063 737528 739552 742142 745628 750402 756191 762065 767429 772655 778468 785060 792171 799567
50073 799567 806891 813383 818464 822486 826207 829553 831635 832131 831860 831554 830763 828644 825398 822147 819585
50058 819585 817464 815434 813556 811733 809302 805808 801816 798437 796133 794480 793057 792095 792146 793584 796703
50043 796703 801964 809674 819540 830835 843009 855909 869501 883704 898541 914195 930804 948367
50031 948367 966955 986762 1007905 1030279 1053656 1077696 1101843 1125515 1148487 1170789 1192054
50020 1192054 1211385 1228155 1242613 1255343 1266358 1275190 1281639 1285915 1288008 1287328 1282992 1274119 1259846
50007 1259846 1239488 1212910 1180590 1143533 1103461 1062928 1024513 989622 958404 930823 907191
$$ packed form
50102H15741j0514r450q246o867o047o372p165p095n833m314l364k748j881p85
50088G35060J53Q50J465K024K590L486M774N789N874N364N226N813O592P111P396
50073G99567P324O492N081M022L721L346K082M96k71l06p91k119l246l251k562
50058H19585k121k030j878j823k431l494l992l379k304j653j423r62N1J438L119
50043G96703N261P710R866J1295J2174J2900J3592J4203J4837J5654J6609J7563
50031I48367J8588J9807K1143K2374K3377K4040K4147K3672K2972K2302K1265
50020A192054J9331J6770J4458J2730J1015Q832O449M276K093o80m336q873j4273
50007A259846k0358k6578l2320l7057m0072m0533l8415l4891l1218k7581k3632
$$ plain form
49996 907191 887433 870543 855362 841539 829252 818344 808296 798803 789740 780583 770426 758692
49984 758692 745568 731744 717961 704695 691938 679319 666727 654690 643851 634262 625677 618294
49972 618294 612542 608117 603977 599519 595141 591342 587853 584161 580394 577109 574472 572229 570329 569083
49958 569083 568697 569110 570343 572703 576618 582466 590385 599897 609784 618754 626261 632405 637142 640119 641363
49943 641363 641610 641635 641590 641219 640364 638929 636571 632848 627634 621164 613731 605567 596902 587917 578701 569499
49927 569499 560907 553512 547374 542135 537720 534624 533352 533730 534983 536397 537792 539396 541424 543788
49913 543788 546169 548316 550283 552439 555284 559301 564812 571772 579668 587757 595586 603278 611263 619743
49899 619743 628391 636501 643374 648586 652077 654090 655061 655341 654847 652986 649132 643236 635828 627376 617924
$$ packed form
49996I07191j9758j6890j5181j3823j2287j0908j0048r493r063r157j0157j1734
49984G58692j3124j3824j3783j3266j2757j2619j2592j2037j0839r589q585p383
49972F18294n752m425m140m458m378l799l489l692l767l285k637k243j900j246
49958E69083l86M13J233K360L915N848P919R512R887Q970P507O144M737K977J244
49943F41363K47K5m5l71q55j435k358l723n214o470p433q164q665q985r216r202
49927E69499q592p395o138n239m415l096j272L78J253J414J395J604K028K364
49913E43788K381K147J967K156K845M017N511O960P896Q089P829P692P985Q480
49899F19743Q648Q110O873N212L491K013R71K80m94j861l854n896p408q452r452
$$ plain form
49884 617924 607606 597271 588124 580660 574250 567903 561226 554555 548482 543500 539913 537699 536417 535502
49870 535502 534763 534506 535107 536592 538708 541327 544619 548791 553763 559239 565111 571645 579232 588054 598031
49855 598031 608877 619994 630428 639294 646306 651715 655745 658398 659780 660187 659681 657897 654543 649800
49841 649800 643969 637001 628801 619808 610845 602484 594920 588435 583447 579997 577580 575705 574325 573564
49827 573564 573339 573479 573936 574710 575841 577728 581151 586532 593330 600552 607821 615513 623787 631919 638842
49812 638842 644112 648103 651437 654399 656829 658332 658613 657720 655946 653442 650084 645959 641847 638780 636926
$$ packed form
49884F17924j0318j0335r147p464o410o347o677o671o073m982l587k214j282r15
49870E35502p39k57O01J485K116K619L292M172M972N476N872O534P587Q822R977
49855E98031J0846J1117J0434Q866P012N409M030K653J382M07n06j784l354m743
49841F49800n831o968q200q993q963q361p564o485m988l450k417j875j380p61
49827E73564k25J40M57P74J131J887L423N381O798P222P269P692Q274Q132O923
49812F38842N270L991L334K962K430J503K81q93j774k504l358m125m112l067j854
$$ [...]
##END NTUPLES=NMR SPECTRUM
##END=
