##TITLE=AC1740_SEN00013_9276343_qgJO3Bddgf
##JCAMPDX= 6.0         $$ Bruker NMR JCAMP-DX V2.0
##DATA TYPE= NMR SPECTRUM
##DATA CLASS= NTUPLES
##ORIGIN= BRUKER
##OWNER= Administrator
$$ 1.72 TOPSPIN		Version 2.1
$$ 2015-08-07 21:16:00.000 -0700  Administrator@X
$$ Compression mode = diff/dup
##.OBSERVE FREQUENCY= 400.02188249412
##.OBSERVE NUCLEUS= ^1H
##.ACQUISITION MODE= SIMULTANEOUS (DQD)
##.ACQUISITION SCHEME= undefined
##.AVERAGES= 64
##.DIGITISER RES= 22
##SPECTROMETER/DATA SYSTEM= spect
##.PULSE SEQUENCE= noesygpps1d.comp
##.SOLVENT NAME= COFFEE_meoh
##.SHIFT REFERENCE= INTERNAL, COFFEE_meoh, 1, 14.96102
##AUDIT TRAIL= $$ (NUMBER, WHEN, WHO, WHERE, PROCESS, VERSION, WHAT)
$$ ##TITLE= Audit trail, TOPSPIN		Version 2.1
$$ ##JCAMPDX= 5.01
$$ ##ORIGIN= Bruker BioSpin GmbH
$$ ##OWNER= Administrator
$$ $$ E:\/data/COFFEE/nmr/AC1740_SEN00013_9276343_qgJO3Bddgf/32/pdata/1/auditp.txt
$$ ##AUDIT TRAIL=  $$ (NUMBER, WHEN, WHO, WHERE, PROCESS, VERSION, WHAT)
(   1,<2015-08-07 21:15:54.688 -0700>,<Administrator>,<X>,<go>,<TOPSPIN 2.1>,
      <created by zg
	started at 2015-08-07 21:04:25.172 -0700,
	POWCHK enabled, PULCHK disabled,
       configuration hash MD5:
       21 0F 79 D6 B3 7B B4 F6 88 20 88 DB 03 48 BD 9F
       data hash MD5: 64K
       03 50 FE 28 51 6A 54 8E 54 A9 52 A7 C8 FD 8E 03>)
(   2,<2015-08-07 21:15:57.891 -0700>,<Administrator>,<X>,<proc1d>,<TOPSPIN 2.1>,
      <Start of raw data processing
       efp LB = 0.3 FT_mod = 6 PKNL = 1 PHC0 = 0 PHC1 = 0 SI = 128K 
       data hash MD5: 128K
       50 E6 C6 25 0A F1 52 3F 11 06 CD B3 25 39 D4 96>)
(   3,<2015-08-07 21:15:58.797 -0700>,<Administrator>,<X>,<proc1d>,<TOPSPIN 2.1>,
      <pk PHC0 = -84.27612 PHC1 = 0 
       data hash MD5: 128K
       50 E5 EE AC 16 DC F6 3F 3A 90 B0 6C 75 58 11 EC>)
(   4,<2015-08-07 21:15:59.172 -0700>,<Administrator>,<X>,<proc1d>,<TOPSPIN 2.1>,
      <abs ABSG = 1 
       data hash MD5: 128K
       4F 5D 18 B8 A2 F2 FF 1F ED 5B 04 69 49 D5 BC E9>)
(   5,<2015-08-07 21:15:59.281 -0700>,<Administrator>,<X>,<proc1d>,<TOPSPIN 2.1>,
      <abs ABSG = 2 
       data hash MD5: 128K
       17 FA 05 B4 EE 6A F6 48 7C 09 BE 57 0E 3B 20 D5>)
(   6,<2015-08-07 21:15:59.359 -0700>,<Administrator>,<X>,<proc1d>,<TOPSPIN 2.1>,
      <abs ABSG = 3 
       data hash MD5: 128K
       8F BC 25 0A 0A 2A 1E 79 EC E2 40 90 99 16 3E BE>)
(   7,<2015-08-07 21:15:59.438 -0700>,<Administrator>,<X>,<proc1d>,<TOPSPIN 2.1>,
      <abs ABSG = 4 
       data hash MD5: 128K
       86 D2 0D DD 2A 5F 78 61 58 3C BA 4A 10 92 09 74>)
(   8,<2015-08-07 21:15:59.563 -0700>,<Administrator>,<X>,<proc1d>,<TOPSPIN 2.1>,
      <abs ABSG = 5 
       data hash MD5: 128K
       10 79 EF 26 DE 1E E9 BE 0B 94 BD CE 4A E2 DC 1E>)
$$ ##END=
$$ 
$$ $$ hash MD5
$$ $$ 2E AB 62 4D 09 AE 6D 25 3B BB 3B D4 20 59 A3 ED
##$RELAX= 
##$RELAX= 
##$RELAX= 
##$RELAX= 
##$RELAX= 
##$RELAX= 
##$RELAX= 
##$RELAX= 
$$ Bruker specific parameters
$$ --------------------------
##$DU= <E:\>
##$EXPNO= 32
$$ [...]
##$TP07= 0
##$TPNAME0= <>
##$TPNAME1= <>
##$TPNAME2= <>
##$TPNAME3= <>
##$TPNAME4= <>
##$TPNAME5= <>
##$TPNAME6= <>
##$TPNAME7= <>
##$TPOAL= (0..7)
0.5 0.5 0.5 0.5 0.5 0.5 0.5 0.5
##$TPOFFS= (0..7)
0 0 0 0 0 0 0 0
##$TUNHIN= 0
##$TUNHOUT= 0
##$TUNXOUT= 0
##$USERA1= <user>
##$USERA2= <user>
##$USERA3= <user>
##$USERA4= <user>
##$USERA5= <user>
##$V9= 5
##$VALIST= <valist>
##$VCLIST= <CCCCCCCCCCCCCCC>
##$VD= 0
##$VDLIST= <DDDDDDDDDDDDDDD>
##$VPLIST= <PPPPPPPPPPPPPPP>
##$VTLIST= <TTTTTTTTTTTTTTT>
##$WBST= 2048
##$WBSW= 25
##$XGAIN= (0..3)
0 0 0 0
##$XL= 0
##$YL= 0
##$YMAX_a= 5954924
##$YMIN_a= -11759412
##$ZGOPTNS= <>
##$ZL1= 120
##$ZL2= 120
##$ZL3= 120
##$ZL4= 120
##$ABSF1= 14.96102
##$ABSF2= -5.597161
##$ABSG= 5
##$ABSL= 3
##$ALPHA= 0
##$AQORDER= 0
##$ASSFAC= 0
##$ASSFACI= 0
##$ASSFACX= 0
##$ASSWID= 0
##$AUNMP= <proc_prof1d_extract.lims>
##$AXLEFT= 0
##$AXNAME= <>
##$AXNUC= <1H>
##$AXRIGHT= 0
##$AXTYPE= 0
##$AXUNIT= <>
##$AZFE= 0.1
##$AZFW= 0.1
##$BCFW= 0
##$BC_mod= 0
##$BYTORDP= 0
##$COROFFS= 0
##$CY= 15
##$DATMOD= 1
##$DC= 0
##$DFILT= <>
##$DTYPP= 0
##$F1P= 0
##$F2P= 0
##$FCOR= 0.5
##$FTSIZE= 131072
##$FT_mod= 6
##$GAMMA= 0
##$GB= 0
##$INTBC= 1
##$INTSCL= 1
##$ISEN= 128
##$LB= 0.3
##$LEV0= 0
##$LPBIN= 0
##$MAXI= 10000
##$MC2= 0
##$MEAN= 0
##$ME_mod= 0
##$MI= 0
##$NCOEF= 0
##$NC_proc= -2
##$NLEV= 6
##$NOISF1= 0
##$NOISF2= 0
##$NSP= 0
##$NTH_PI= 0
##$NZP= 0
##$OFFSET= 14.96102
##$PC= 1
##$PHC0= -84.27612
##$PHC1= 0
##$PH_mod= 1
##$PKNL= yes
##$PPARMOD= 0
##$PPDIAG= 0
##$PPIPTYP= 0
##$PPMPNUM= 2147483647
##$PPRESOL= 1
##$PSCAL= 4
##$PSIGN= 0
##$PYNMP= <proc.py>
##$REVERSE= no
##$SF= 400.020009629381
##$SI= 131072
##$SIGF1= 0
##$SIGF2= 0
##$SINO= 400
##$SIOLD= 131072
##$SPECTYP= <>
##$SREGLST= <1H.CDCl3>
##$SSB= 0
##$STSI= 131072
##$STSR= 0
##$SW_p= 8223.68421052631
##$SYMM= 0
##$S_DEV= 0
##$TDeff= 65536
##$TDoff= 0
##$TI= <>
##$TILT= no
##$TM1= 0
##$TM2= 0
##$TOPLEV= 0
##$USERP1= <user>
##$USERP2= <user>
##$USERP3= <user>
##$USERP4= <user>
##$USERP5= <user>
##$WDW= 1
##$XDIM= 131072
##$YMAX_p= 407243726
##$YMIN_p= -12012
##$CURPLOT= <Network HP LaserJet P1505>
##$CURPRIN= <$Network HP LaserJet P1505>
##$DFORMAT= <normdp>
##$LAYOUT= <+/1D_H.xwp>
##$LFORMAT= <normlp>
##$PFORMAT= <normpl>
##$SURQMSG= 1
$$ End of Bruker specific parameters
$$ ---------------------------------
##NTUPLES= NMR SPECTRUM
##VAR_NAME=  FREQUENCY,     SPECTRUM/REAL,   SPECTRUM/IMAG
##SYMBOL=    X,             R,               I
##VAR_TYPE=  INDEPENDENT,   DEPENDENT,       DEPENDENT
##VAR_FORM=  AFFN,          ASDF,            ASDF
##VAR_DIM=   131072,        131072,          131072
##UNITS=     HZ,            ARBITRARY UNITS, ARBITRARY UNITS
##FACTOR=    0.0627417313425164, 1,          1
##FIRST=     8223.62146879497, 2836,         -49592
##LAST=      0,             4346,            -49958
##MIN=       0,             -12012,          0
##MAX=       8223.62146879497, 407243726,    0
$$ Real data points
##PAGE= N=1
##DATA TABLE= (X++(R..R)), XYDATA
$$ [...]
67855 98709 98883 98704 98034 96982 95905 95116 94466 93464 92058 90938 90673 90827 90440 89265 87953 87068 86484
67838 86484 85850 85117 84374 83653 83160 83323 84268 85510 86571 87666 89412 91934 94632 96860 98535 99976
67822 99976 101413 102853 104300 105882 107712 109710 111615 113090 113779 113372 111865 109778 107882 106534 105325
67807 105325 103535 100843 97525 94138 91292 89600 89433 90511 91906 92585 91959 90053 87407 84895 83333
67792 83333 82939 83134 82996 82003 80455 79251 79221 80458 82218 83565 84171 84414 84712 84941 84601 83446 81822
67775 81822 80415 79750 79925 80693 81661 82447 82828 82990 83557 85066 87318 89519 91203 92689 94375 95951
67759 95951 96811 97029 97326 98023 98545 98149 96761 94975 93607 93380 94542 96452 97882 98150 97804 97872 98671
67742 98671 99636 100123 99952 99224 98009 96331 94238 91865 89552 87858 87191 87405 87888 88075 87780 87139 86423
67725 86423 85837 85322 84587 83548 82687 82661 83494 84345 84289 83250 82063 81678 82311 83308 83757 83276 82262 81412
67707 81412 81077 81071 81009 80726 80403 80441 81182 82630 84396 85896 86656 86462 85422 83899 82282 80685 79016 77392
67689 77392 76315 76242 77093 78380 79713 80983 82153 83180 84171 85362 86824 88316 89388 89599 88802 87464
67673 87464 86509 86456 86765 86494 85656 85349 86290 87763 88483 88162 87662 87805 88572 89480 90159 90455 90431 90544 91460
67654 91460 93351 95593 97370 98396 98769 98448 97306 95668 94314 93785 93949 94408 95049 95995 97153 98092
67638 98092 98386 97985 97281 96837 96943 97360 97632 97710 98082 99108 100487 101650 102516 103369 104057 103900 102700 101412
67620 101412 101293 102488 103870 104298 103771 103268 103734 105352 107627 109923 111867 113305 114062 113984 113270 112520 112148
67603 112148 111848 110905 109047 106754 104690 103077 101724 100426 99127 97806 96448 95086 93813 92771 92158
67588 92158 92118 92454 92566 91890 90451 88831 87589 86862 86566 86779 87670 89107 90607 91745 92476 92916 93013 92715
67570 92715 92333 92367 92822 93012 92339 91087 90214 90394 91511 92967 94193 94900 95151 95258 95383 95225 94393 93109
67552 93109 92101 91671 91272 90359 89334 89183 90289 92033 93543 94477 95029 95521 96171 97031 97966 98743 99182
67535 99182 99190 98687 97694 96470 95383 94634 94248 94242 94539 94712 94211 93052 91986 91731 92201 92703 92768 92478 92089
67516 92089 91713 91460 91583 92137 92634 92338 91025 89321 88099 87675 87739 88014 88632 89687 90783 91363 91399 91372
67498 91372 91604 91966 92332 92851 93625 94414 94959 95324 95627 95694 95297 94589 93948 93503 93176 93128 93740 95038 96459
67479 96459 97309 97279 96500 95353 94321 93742 93568 93503 93433 93489 93660 93670 93418 93254 93551 94230 94940 95527 96095 96750
67459 96750 97627 99006 101025 103258 104948 105740 105915 105847 105566 105027 104506 104383 104689 105114 105409 105530 105497 105439 105774
67440 105774 106971 108958 110997 112379 113074 113523 113969 114295 114418 114478 114579 114673 114755 114910 115016 114689 113789 112765
67422 112765 112245 112372 112784 113106 113184 112923 112276 111451 110833 110568 110416 110110 109744 109671 110111 110896 111558 111679 111311
67403 111311 111009 111326 112250 113251 113783 113610 112759 111472 110220 109440 109131 108956 108788 108837 109174 109424 109182 108474
67385 108474 107610 106806 106183 105980 106434 107469 108646 109410 109360 108515 107469 107130 108047 110035 112508 115018 117386
67368 117386 119516 121315 122609 123009 122065 119803 116966 114484 112793 111770 111105 110590 110321 110840 112754 115882
67352 115882 119042 121101 122029 122591 123228 123751 123957 123941 123794 123538 123433 123871 124822 125731 126123 126031 125807 125857 126618
67333 126618 128420 131184 134492 137985 141454 144591 146977 148384 148768 148100 146578 144893 143701 142802 141431
67318 141431 139448 137624 136575 136075 135718 135580 135729 135689 134994 134002 133605 134370 136363 139372 142779 145543 146960
67301 146960 147327 147404 147457 147409 147671 148987 151382 153838 155224 155137 153829 151860 149974 148762 148110 147258 145695
67284 145695 143811 142485 142216 142742 143320 143242 142346 141167 140493 140685 141574 142960 144921 147535 150550 153537
67268 153537 156149 158124 159214 159349 158799 158046 157508 157412 157745 158246 158512 158271 157576 156708 155919 155254 154567 153677
67250 153677 152555 151340 150197 149266 148768 148976 149896 151095 152030 152511 152715 152865 153077 153436 153968 154562 155112
67233 155112 155641 156121 156291 155951 155377 155095 155243 155481 155521 155417 155255 154977 154661 154652 155166 156039 157022 158054 158982
67214 158982 159315 158665 157310 155993 155162 154709 154474 154677 155616 157112 158540 159487 160204 161250 162721 164076
67198 164076 164818 165149 165700 166735 167882 168638 168863 168740 168498 168326 168444 169047 170163 171542 172676 173105 172899
67181 172899 172696 173029 173686 174079 174217 174828 176410 178517 180249 181122 181217 180788 180107 179626 179878 181118 183127
67164 183127 185375 187362 188915 190182 191269 191937 191924 191526 191431 191918 192659 193442 194488 195674 196067 194981 193172
67147 193172 192146 192333 192737 192476 191844 191547 191672 191945 192466 193455 194593 195334 195834 196930 198985 201277 202782
67130 202782 203249 203271 203550 204385 205689 207143 208355 209136 209708 210462 211497 212558 213464 214355 215374 216334 216914
67113 216914 217121 217334 217844 218559 219239 219903 220912 222641 225048 227518 229210 229694 229314 228849 228843 229292 229869 230264
67095 230264 230373 230375 230628 231273 231957 232236 232287 232877 234449 236579 238579 240304 242000 243546 244451 244592 244542 244967
67077 244967 246018 247420 248897 250282 251446 252448 253690 255633 258279 261019 263096 264206 264656 265032 265746
67062 265746 266808 267930 268816 269491 270419 272167 274759 277370 278916 279108 278814 279291 281119 283943 287022 289765
67046 289765 291889 293412 294660 296082 297912 300045 302211 304216 306037 307867 310025 312639 315339 317447
67032 317447 318631 319236 319956 321301 323451 326295 329430 332277 334536 336452 338380 340220 341661 342935 344850
67017 344850 347853 351488 355066 358522 362147 365732 368602 370499 371889 373301 374853 376685 379291 383052
67003 383052 387686 392620 397667 402940 408329 413526 418472 423330 428026 432261 435990 439523 443107 446793
66989 446793 450761 455294 460358 465655 471190 477224 483407 488605 492131 494800 498122 502664 507720 512512
66975 512512 517042 521712 526680 531932 537616 543902 550610 557290 563741 570290 577443 585274 593325 601159
66961 601159 608882 616877 625214 633670 642291 651418 660964 670234 678853 687457 696867 706923 716814 726411
66947 726411 736470 747400 758596 769445 780396 792431 805687 819175 831907 843919 856074
66936 856074 869120 883165 897942 913329 929436 946305 963731 981412 999067 1016371 1033120
66925 1033120 1049699 1067105 1086060 1106179 1126384 1146103 1165716 1185879 1206909 1228927 1252099
66914 1252099 1276425 1301524 1326912 1352348 1377845 1403542 1429714 1456664 1484419 1512678 1541185
66903 1541185 1569993 1599273 1629076 1659418 1690346 1721748 1753327 1784930 1816766 1849130 1882097
66892 1882097 1915598 1949567 1983867 2018270 2052737 2087517 2122790 2158386 2194011 2229507 2264692
66881 2264692 2299181 2332657 2365170 2396904 2427837 2457819 2486735 2514347 2540275 2564581 2588090
66870 2588090 2611587 2634727 2656268 2675382 2692308 2707636 2721476 2733539 2743604 2751587 2757397 2761043
66858 2761043 2762790 2762997 2761794 2758975 2754100 2746732 2736788 2724731 2711271 2696785 2681097 2663819 2644659
66845 2644659 2623449 2600157 2574982 2548204 2519876 2489979 2458983 2427862 2397212 2366549 2334831
66834 2334831 2301578 2267211 2232436 2197623 2162859 2128288 2094171 2060662 2027556 1994306 1960388
66823 1960388 1925717 1890685 1855757 1821178 1787081 1753621 1720837 1688587 1656850 1625943 1596062
66812 1596062 1566743 1537161 1507045 1476958 1447622 1419333 1392107 1365900 1340346 1314635 1288247
66801 1288247 1261731 1236293 1212496 1189732 1167103 1144459 1122293 1100885 1079958 1059157 1038481
66790 1038481 1018135 998238 978887 960362 942958 926567 910624 894570 878291 862045 846101
66779 846101 830571 815577 801345 788012 775407 763176 751131 739382 728085 717120 706122
66768 706122 694811 683175 671354 659492 647808 636648 626195 616161 606060 595906 586447 578382
66756 578382 571507 564866 557756 550274 542882 535754 528706 521494 513956 506046 497954 490100 482754 475768
66742 475768 468867 462073 455581 449328 443056 436790 430903 425649 420953 416673 412671 408549 403772 398337
66728 398337 392919 388000 383187 377830 372072 366776 362497 358957 355482 351560 347006 342047 337287 333190
66714 333190 329576 326006 322607 319929 317871 315411 311810 307586 303821 300870 298274 295671 293190 291011
66700 291011 288994 286806 284149 280890 277292 274022 271596 269814 268076 266136 264145 261996 259186 255489
66686 255489 251372 247465 243962 240806 238179 236406 235394 234454 232791 230144 227007 224206 222191 220765
66672 220765 219506 218293 217182 215977 214407 212680 211280 210039 208052 204916 201587 199333 198134 196821
66658 196821 194766 192679 191519 191245 191042 190369 189284 187976 186527 185172 184330 184181 184409 184543 184389 183959
66642 183959 183107 181540 179234 176675 174559 173297 172810 172640 172145 170851 168942 167304 166717 166928 166876 165945
66626 165945 164630 163688 163008 161811 159787 157526 155815 154888 154456 154089 153439 152434 151421 150828 150522 149793
66610 149793 148168 145972 143825 141895 140006 138287 137238 137100 137527 137946 137967 137448 136472 135461 135013 135304
66594 135304 135685 135175 133463 131332 129951 129785 130294 130683 130745 130785 130881 130613 129620 128185 127011 126594 126972 127844
66576 127844 128670 128841 128135 126991 125991 125189 124312 123599 123791 125033 126214 125897 123742 120692 117935 116047
66560 116047 115047 114779 115028 115446 115589 115105 113962 112584 111606 111318 111381 111284 111000 110934 111234 111474 111141 110243 109266
66541 109266 108631 108375 108264 108089 107823 107577 107425 107291 107013 106501 105802 105046 104390 103948 103660 103258 102477 101386
66523 101386 100421 100061 100488 101423 102192 102079 100934 99483 98765 99143 100034 100641 100664 100195 99342 98322 97580 97285
66505 97285 96851 95523 93514 91969 91568 91681 91293 90364 89706 89728 89893 89528 88671 87928 87770 88209 88958 89689
66487 89689 90224 90613 90913 90919 90286 89046 87739 86901 86604 86658 87011 87688 88544 89396 90277 91300 92395 93467
66469 93467 94614 95812 96544 96276 95244 94227 93471 92467 90928 89355 88235 87277 85966 84483 83514 83459
66453 83459 84358 86258 88927 91355 92377 91963 91336 91620 92855 94421 95834 96821 97139 96735 95838 94572
66437 94572 92836 90829 89330 89005 89570 90036 89729 88813 87923 87551 87747 88175 88471 88650 89036 89716 90322 90545
66419 90545 90600 90842 91140 91032 90404 89628 89066 88771 88646 88546 88210 87420 86324 85365 84840 84735 84923 85240 85422
66400 85422 85340 85344 85949 87096 88061 88238 87697 86877 86147 85781 85908 86193 86006 85292 84873 85448 86637 87539 87929
66381 87929 88300 88865 89217 89035 88521 88037 87771 87870 88357 88819 88732 88284 88224 88638 88585 87453 86023 85418 85504 85210
66361 85210 84175 83079 82326 81375 79755 78003 77124 77542 78987 80955 82828 83876 83692 82581 81268 80333
66345 80333 80054 80481 81322 81988 82121 81996 82157 82816 83779 84690 85055 84427 83013 81833 81672 81994 81517 79868
66327 79868 78095 77409 77960 78991 79689 79631 78916 78232 78419 79520 80524 80466 79632 79217 79858 80903 81271 80620
66309 80620 79467 78401 77558 76853 76374 76287 76461 76520 76345 76292 76805 77991 79683 81640 83466 84570 84555 83550
66291 83550 81974 80197 78691 78080 78508 79178 79215 78874 79226 80597 82083 82774 82710 82351 81814 81153 80765 80906
66273 80906 81206 81171 80875 80624 80322 79731 79151 79199 80018 81144 82062 82489 82297 81575 80678 79846 79003 78273 78309 79518
66253 79518 81203 82181 82086 81407 80413 78953 77356 76593 77099 78085 78482 78099 77429 76818 76288 75885 75689 75614 75535
66234 75535 75487 75493 75363 74957 74515 74466 75005 76030 77362 78784 79956 80536 80456 79983 79499 79241 79171 79075 78893 78925
66214 78925 79543 80637 81584 81837 81449 80898 80550 80388 80203 79916 79708 79764 79991 80138 80260 80735 81593 82168 81882
66195 81882 81170 81021 81635 82172 81947 81268 80818 80768 80892 81128 81532 81942 82159 82321 82726 83360 83897 84114 84016 83644
66175 83644 83019 82268 81617 81224 81104 81181 81373 81726 82447 83635 84960 85885 86286 86565 87022 87440 87494 87278 87130
66156 87130 87186 87375 87637 87811 87514 86498 85066 83849 83203 83024 83034 83042 82973 82902 83030 83509 84341 85473 86815
66137 86815 88061 88778 88938 89087 89727 90707 91487 91834 91956 92160 92638 93371 93927 93615 92277 90758 90091 90316
66119 90316 90650 90772 91245 92483 93918 94667 94684 94758 95486 96630 97552 98018 98389 99060 99871 100229 99820 99076 98793
66100 98793 99342 100414 101496 102420 103363 104420 105299 105546 105008 103982 102850 101797 101039 101001 101775 102604 102568 101921
66082 101921 101976 103339 104932 105351 104621 103865 103616 103328 102475 101334 100484 100112 100036 100036 100044 100273 101159 102815 104599
66063 104599 105621 105666 105289 105062 105136 105419 105696 105632 105132 104627 104499 104323 103340 101664 100282 99798 99886 100103 100461
66044 100461 100946 101300 101658 102654 104359 105805 106148 105749 105485 105574 105790 106348 107655 109384 110653 111178 111656
66027 111656 112869 114860 117038 118744 119715 120260 120923 121802 122396 122329 121923 121783 122166 123137 124871 127209 129297
66010 129297 130415 131032 132345 134809 137802 140724 143746 147349 151665 156448 161250 165545 169127 172396
65996 172396 175821 179146 181653 183212 184425 185651 186519 186575 185796 184248 181812 178578 174938 171023 166594
65981 166594 161781 157362 153853 150811 147515 143905 140379 137111 134135 131774 130406 129939 129919 129951 129693 128822
65965 128822 127485 126461 126287 126506 126337 125835 125716 126227 126968 127788 129109 131227 133905 136800 139751 142497
65949 142497 144702 146445 148218 150217 152078 153515 154765 156220 158037 160279 162945 165616 167551 168494
65935 168494 169013 169769 170889 172342 174402 177281 180678 184187 187785 191451 194713 197248 199664 202991 207469
65920 207469 212424 217268 221978 226586 230851 234586 237794 240362 242145 243433 244741 245935 246203 245279 244126
65905 244126 243892 244570 245260 245435 245255 244716 243215 240216 235943 231156 226455 221979 217595 213138 208513 203722
65889 203722 198821 193807 188566 182988 177191 171586 166665 162572 158960 155384 151890 149039 147254 146306
65875 146306 145624 145007 144770 145118 145601 145410 144244 142688 141623 141305 141180 140630 139659 138719 138039 137444 136794 136244
65857 136244 135928 135660 135171 134515 134031 134001 134464 135309 136342 137295 137946 138278 138434 138489 138388 138193 138304 139277 141313
65838 141313 143948 146423 148405 150211 152283 154661 157228 160224 164067 168638 173230 177485 182046 187894
65824 187894 195131 202697 209239 214098 217464 219800 221239 221539 220521 218417 215638 212362 208576 204459
65810 204459 200372 196416 192411 188432 184996 182436 180369 178113 175427 172557 169804 167366 165494 164399
65796 164399 164050 164238 164785 165513 166184 166718 167338 168338 169977 172685 176943 182503 188191 193122 197870 203723
65780 203723 210889 218196 224551 229859 234302 237526 239060 238979 237575 234716 230068 223769 216516 209113 202268
65765 202268 196610 192472 189642 187624 186154 185321 185277 186082 187819 190733 195220 201684 210197 220195 230682
65750 230682 240924 250877 260843 270851 280512 289331 296968 303191 307683 309933 309460 306311 301221 294948
65736 294948 287444 278094 266848 254666 242589 230861 219377 208511 198850 190262 181982 173774 166459
65723 166459 160975 157226 154169 150926 147503 144472 142130 140105 137787 135056 132466 130653 129677 129047 128277
65708 128277 127283 126308 125639 125418 125547 125731 125735 125681 126038 127240 129266 131570 133399 134289 134356 134167 134287 134917 135876
65689 135876 136880 137844 138999 140714 143153 146092 149218 152605 156789 162323 169357 177648 186818 196518
65675 196518 206508 216781 227625 239444 252370 265987 279482 292196 304065 315368 326019 335289
65663 335289 342402 347228 350226 351963 352982 353847 354824 355630 355968 356282 357491 359934 363064 366184 368966
65648 368966 371160 372443 372763 372250 370475 366391 359354 349750 338245 325022 310263 294784 279483
65635 279483 264498 249551 234825 220854 207847 195888 185610 177793 172194 167486 162577 157449
65623 157449 152643 148509 145169 142660 140754 138994 137169 135483 134118 132925 131739 130665 129883 129368 128997
65608 128997 128732 128598 128637 128929 129483 130068 130330 130117 129509 128625 127654 127000 127044 127717 128543 129147 129526 130008 131221
65589 131221 133875 138082 142993 147647 152140 157400 163910 171346 179486 188609 198701 209127 219616
65576 219616 230833 243309 256305 268525 279567 289873 299447 307472 313259 316811 318217 317077 312928
65563 312928 305909 296712 286014 274212 261592 248536 235517 222968 211149 200213 190375 181922
65551 181922 174922 168972 163407 157870 152646 148435 145697 144220 143380 142929 143368 145302 148521 152105 155427
65536 155427 158602 161781 164488 166062 166442 166061 165167 163688 161740 159769 158041 156297 154091 151343 148427
65521 148427 145832 143803 142308 141234 140518 139961 139076 137426 135190 133104 131681 130695 129621 128352 127253
65506 127253 126724 126954 127921 129326 130660 131638 132494 133645 135242 137295 139946 143107 146057 148005 149139
65491 149139 150600 153232 156787 160481 163867 166899 169623 172195 174871 177509 179317 179532 178321 176626
65477 176626 175139 173745 171983 169702 167122 164484 161795 158905 155778 152706 150089 147893 145464 142245
65463 142245 138600 135554 133644 132360 130885 129011 127082 125383 124009 123153 123058 123668 124702 126046 127719
65448 127719 129453 130787 131717 132826 134449 136086 137062 137522 138311 139945 142157 144514 147055 150091 153587
65433 153587 157068 160101 162703 165095 167044 167651 166085 162540 158187 154125 150686 147876 145886 144733
65419 144733 143769 142310 140600 139537 139439 139685 139627 139187 138449 137396 136450 136591 138293 140747 142744 144074 145530
65402 145530 147812 151036 155165 160119 165296 169676 172765 175069 177258 179186 180098 179582 177931 175630 172903
65387 172903 169875 166856 164233 162258 161113 161006 161917 163286 164331 164779 165061 165653 166518 167383 168294 169563
65371 169563 171321 173425 175660 177743 179390 180776 182747 186007 190204 194437 198661 203851 210664 218757
65357 218757 227773 238125 250040 262393 273431 282503 290268 297225 302760 305890 306432 305123 302826
65344 302826 299846 295865 290443 283593 275847 267750 259458 250946 242354 233906 225729 218007 211121 205266
65330 205266 200097 195119 190299 185907 181919 178073 174471 171579 169454 167444 164887 161854 158934 156491
65316 156491 154419 152587 151293 151072 151947 152994 153001 151719 150147 149361 149347 149369 149192 149402 150586 152756 155665
65299 155665 159187 163210 167433 171470 174918 177293 178200 177775 176753 175982 175916 176513 177382 177979 177974 177496 176949
65282 176949 176583 176362 176168 175907 175551 175310 175627 176602 177487 177131 175026 171662 167966 164683 162196 160491 159232
65265 159232 158194 157555 157432 157216 155974 153578 150954 149097 148244 148094 148294 148523 148545 148443 148455 148508 148299 147884
65247 147884 147660 147648 147381 146689 145957 145349 144446 143105 142023 141907 142529 143170 143557 143810 143881 143692 143500 143522 143465
65228 143465 143037 142594 142590 142586 141658 139764 137995 137288 137500 137906 138093 138150 138330 138716 139019 138747 137862 137124 137343 138400
65208 138400 139519 140411 141473 142791 143727 143824 143549 143696 144447 145430 146312 146894 146887 146183 145354 145403 146825 149078
65190 149078 151085 152193 152582 152792 153025 153046 152830 153006 154345 156894 159910 162608 164664 165982 166395 165853
65174 165853 164674 163404 162501 162210 162553 163398 164717 166787 169869 173638 177290 180354 183106 186008 189069
65159 189069 192046 195017 198420 202661 207945 214327 221624 229440 237632 246687 257335 269777 283667
65146 283667 298897 316087 336090 359115 384404 410551 436021 459649 481052 500722 519546
65135 519546 538081 556167 573132 588189 600615 609745 615096 616563 614360 608782 600226 589485 577646
65122 577646 565299 551905 536248 517519 495814 471797 446396 420892 396717 374682 354531
65111 354531 335554 317553 300986 286299 273389 261701 250675 240144 230510 222472 216321 211443
65099 211443 206688 201335 195619 190261 185663 181732 178409 176024 174895 174701 174672 174451 174425 174960 175679 175942
65083 175942 175781 175767 176015 176054 175775 175775 176399 177134 177476 177823 178775 179930 180194 179201 177677 176422 175610 175143 174991
65064 174991 174964 174731 174371 174402 175056 175966 176791 177604 178395 178719 178317 177619 177135 176770 176250 175895 176245 177139 177871
65045 177871 178293 179004 180320 181610 181963 181045 179025 176084 172465 168760 165617 163077 160506 157338 153809
65030 153809 150841 149248 149110 149821 150567 150648 149600 147423 144791 142725 141785 141783 142399 143743 145951 148514 150580
65013 150580 151853 152764 153753 154880 156251 158295 161282 164833 168179 170755 172492 173699 174822 176062 177134
64998 177134 177640 177756 178236 179578 181500 183426 185134 186612 187642 188030 188158 188855 190585 192979 195254 196953
64982 196953 198201 199278 200033 199944 198900 197680 197142 196956 195769 192846 189046 185779 183487 181623 179714
64967 179714 177756 175796 173847 172188 171166 170597 169825 168447 166602 164545 162396 160367 158768 157631 156682
64952 156682 155789 155142 154892 154966 155272 155744 156170 156381 156626 157236 157845 157576 156280 154990 154747 155435 156250 156869
64934 156869 157502 158070 158064 157278 156176 155364 155024 154957 154888 154662 154358 154271 154576 154952 154752 153710 152350 151620 152151
64915 152151 153838 156038 158081 159692 161036 162419 164035 165998 168545 172014 176554 181855 187260 192255
64901 192255 196939 201976 208025 215215 223058 230720 237351 242440 246091 248861 251181 253018 254219 254896
64887 254896 255187 254881 253667 251591 248840 245229 240421 234652 228701 223142 218121 213877 210880 209261 208683
64872 208683 208901 209868 211091 211618 211074 210139 209529 209037 208056 206528 204772 202870 200905 199380 198593 197855 196065
64855 196065 193001 189339 185595 181800 178201 175457 173897 173156 172756 172556 172457 172184 171678 171353 171696 172762
64839 172762 174121 175125 175223 174326 172894 171450 170113 168880 168138 168412 169663 171378 173349 175832 178922
64824 178922 182323 185878 189781 194086 198468 202663 206798 211119 215822 221269 227888 235649 244054 252689
64810 252689 261332 269439 276216 281413 285315 287658 287331 283762 277904 271184 264045 256334 248559 241707
64796 241707 235969 230646 225317 220197 215275 210095 204794 200504 198102 197143 196634 196430 197075 198457 199491
64781 199491 199418 198884 199337 201554 205107 209165 213406 218034 223162 228564 234089 239987 246624 253916 261314
64766 261314 268407 275291 282204 288941 294946 300018 304628 309282 313762 317343 319757 321558 323353 324988
64752 324988 325732 325016 322704 318848 313591 307249 300151 292417 284157 275710 267352 258922 250335 242401 236424
64737 236424 232690 229952 226823 223297 220481 219226 219484 220764 222599 224539 226047 226577 225727 223499 220609
64722 220609 218316 217619 218678 221129 224674 229000 233364 236808 238861 239746 239918 239593 238651 236634 232963
64707 232963 227584 221473 216139 212456 210123 208287 206373 204265 202021 199719 197454 195280 193202 191330
64693 191330 189953 189334 189440 189947 190545 191270 192537 194835 198360 203000 208587 214993 222006 229354 236958
64678 236958 244945 253337 261978 270842 280010 289031 296654 301698 303990 304084 302276 298476 292888 286134 278650
64663 278650 270570 262415 255209 249513 244791 240168 235481 231233 227850 225468 224243 224261 225141 226188 227083
64648 227083 228213 230280 233822 239088 246049 254392 263715 273886 285102 297516 310897 324622 337807
64635 337807 349488 358906 365847 370579 373413 374475 374006 372612 370896 368938 366405 363139 359325 355057
64621 355057 350107 344366 338234 332253 326448 320441 314240 308576 304252 301248 298625 295210 290362 284202
64607 284202 277349 270451 263962 258225 253509 249664 245819 240868 234543 227805 221898 217166 213071 209298
64593 209298 206337 204851 204755 205274 205888 206898 208976 212311 216394 220556 224486 228158 231547 234656 237661
64578 237661 240648 243260 244925 245491 245314 244665 243476 241827 240197 238773 236909 233862 229925 226220 223280
64563 223280 220429 216815 212600 208727 205795 203531 201337 198976 196648 194674 193287 192607 192590 192916 193057
64548 193057 192714 192193 192164 192919 194005 194764 195162 195857 197420 199641 201651 202648 202504 201761 201068 200604 200087 199290
64530 199290 198378 197635 197113 196764 196726 197174 197978 198855 199836 201189 202820 204132 204750 205137 206193 208319 211166
64513 211166 214267 217638 221591 226145 230941 235809 241130 247344 254290 261443 268727 276541 284780 292433
64499 292433 298576 303250 306742 308451 307384 303650 298498 292770 286289 279084 272220 266616 261789 256666
64485 256666 251258 246601 243264 240852 238985 237792 237133 236143 234058 231041 227710 224332 220944 217925 215778
64470 215778 214481 213619 213170 213608 215101 217090 218985 220932 223487 226661 229686 231763 232780 233216 233560
64455 233560 233908 234022 233627 232741 231752 231143 231135 231633 232537 233919 235872 238328 241122 244165 247512 251360 256010
64438 256010 261646 268052 274772 281684 289290 298196 308457 319672 331666 344821 359790 377133 397272
64425 397272 420672 448067 480621 519716 566413 621219 684538 756996 838752 928362 1022590
64414 1022590 1117378 1208922 1294390 1372520 1443707 1508687 1566622 1614778 1650278 1671687 1678750
64403 1678750 1671626 1651280 1620040 1580410 1532974 1476135 1408195 1329346 1241803 1148931 1054704
64392 1054704 963232 877787 800063 730545 669357 616325 570460 530138 494197 462624 435860
64381 435860 413584 394553 377639 362685 350101 339808 330893 322289 313476 304492 295649 287494 280670
64368 280670 275364 270912 266374 261510 256899 253112 250124 247645 245602 244054 242985 242504 243046 245011 248286
64353 248286 252426 257232 262851 269304 276204 282963 288927 293304 295348 294933 292772 289794 286417 282631
64339 282631 278620 274975 272195 270217 268556 266787 264821 262840 261144 260090 260120 261677 264925 269473 274495
64324 274495 279209 283170 286011 287205 286447 284201 281438 278741 276023 273215 270694 268691 266654 263753
64310 263753 259877 255644 251470 247141 242386 237440 232839 228958 225938 223761 222141 220570 218812 217202
64296 217202 216261 216110 216511 217331 218651 220409 222326 224310 226683 229822 233733 238177 243081 248533 254427
64281 254427 260448 266564 273273 281104 289944 299080 307784 315611 322255 327505 331395 334031 335180 334432
64267 334432 331958 328722 325621 322779 320059 317869 316883 317130 317937 318669 318896 317865 314608 308955 301970
64252 301970 295006 288546 282220 275613 268763 262079 256045 250897 246445 242344 238554 235325 232786 230902
64238 230902 229806 229658 230052 230200 230021 230425 232029 234107 235402 235579 235211 234679 233951 233308 233386 234229 234939 234556
64220 234556 232923 230539 228011 225892 224550 223856 223229 222269 221156 220276 219764 219661 220190 221434 222862 223623
64204 223623 223474 223171 223682 225113 226622 227577 228605 231202 236195 242951 250266 257774 266093 275824 286959
64189 286959 299292 312790 327188 341522 354396 364609 371387 374285 373264 368866 362046 353636 343965
64176 343965 333022 320975 308525 296677 286080 276686 268160 260503 254030 248816 244554 241065 238589
64163 238589 237293 236698 235931 234573 233022 231981 231691 231779 231851 232137 233394 236089 239801 243591 246880 249732
64147 249732 252365 254742 256748 258446 259917 261020 261518 261315 260389 258648 256114 253185 250498 248532 247450
64132 247450 247229 247702 248502 249226 249747 250312 251309 253099 255952 259864 264307 268499 272223 276284 281826 289217
64116 289217 297857 307082 316848 327274 337859 347637 355979 362791 367918 370944 371856 371501 371015 371078 372100
64101 372100 374785 379825 386957 394837 402068 408106 413044 416903 419401 420303 419743 418195 416138 413674 410504
64086 410504 406363 401379 395843 389789 383182 376370 369844 363490 356638 349122 341813 335706 330846 326586
64072 326586 322636 319291 316740 314685 312748 310844 309039 307301 305586 303964 302587 301637 301290 301586 302314
64057 302314 303235 304448 306329 309035 312273 315735 319602 324449 330628 337879 345626 353621 362188 371786
64043 371786 382428 393712 405338 417331 429675 442098 454345 466292 477405 486452 492351 495238
64031 495238 496128 495586 493341 489375 484648 480350 476878 474030 471687 469695 467371 463872 458984 453034 446080
64016 446080 437893 428766 419613 411023 402899 395344 389154 384734 381061 376615 371213 366140 362475 360079
64002 360079 358374 357319 357139 357676 358643 360224 362852 366493 370650 375081 380071 385901 392418 399303 406542
63987 406542 414379 422836 431424 439364 446199 452233 458310 465000 472046 478731 484690 490245 496060 502828
63973 502828 511266 521966 534991 549800 565875 583316 602579 623687 646022 669004 692730 717781
63961 717781 744665 773798 806052 842935 885971 936013 993402 1058752 1133434 1219397 1318819
63950 1318819 1433932 1566776 1718841 1890952 2083518 2296601 2529623 2781174 3049355
63941 3049355 3332147 3627176 3931188 4239832 4547737 4848500 5134717 5398553 5632790
63932 5632790 5831655 5991097 6108594 6182677 6212295 6196433 6134392 6026509 5874833 5683473
63922 5683473 5458519 5207315 4937202 4654574 4364880 4073126 3784046 3501945 3230696
63913 3230696 2973747 2733757 2512172 2309418 2125475 1960028 1812165 1680365 1562976
63904 1562976 1458614 1366172 1284687 1213171 1150399 1094975 1045859 1002524 964213 929263 895852
63893 895852 863356 832372 803319 775706 748962 723245 699024 676398 655327 636092 619005
63882 619005 603919 590497 578784 569093 561517 555952 552480 551370 552708 556277 561743 568846 577480
63869 577480 587669 599266 611703 624446 637778 652525 668748 685260 700904 715697 730090
63858 730090 743620 755211 764583 772450 779188 784073 786011 784510 779768 772373 763130 752739 741337
63845 741337 728621 714457 699075 682646 665152 646715 627541 607379 585645 562462 539162
63834 539162 517297 497385 478846 460918 443297 426216 410307 396217 383943 372652 361546
63823 361546 350775 341182 333158 326251 319931 314246 309426 305199 300980 296643 292657 289375 286596 284081
63809 284081 282137 281206 280944 280198 278112 274946 271671 269027 267159 265818 264515 262628 259865 256610 253558
63794 253558 250951 248480 245961 243785 242488 242018 241618 240491 238514 236295 234496 233232 232223 231399 230964
63779 230964 230865 230664 230163 229695 229444 228926 227681 226191 225425 225626 226163 226532 226801 227058 227122 227030 227156 227532 227587
63760 227587 226956 226117 225814 226129 226517 226504 225982 225049 223975 223212 223122 223707 224776 226278 228278 230715 233366
63743 233366 236043 238727 241537 244532 247465 249909 251843 253900 256561 259269 261010 261782 262728 264586 266820
63728 266820 268726 270584 272993 275767 278426 281385 285543 290750 295719 299580 302625 305246 307020 307397
63714 307397 306685 305715 304837 303802 302385 300658 298733 296688 294750 293182 291937 290715 289525 288948 289617
63699 289617 291499 293903 296222 298516 301149 304079 306850 309332 312046 315459 319219 322446 324624 325851
63685 325851 326347 326173 325455 324454 323287 321922 320546 319577 319192 319135 319165 319360 319791 320266 320650 321129 321787 322240
63667 322240 322139 321850 322112 323011 323774 323695 322867 321770 320463 318454 315251 310892 306019 301535 298005 295259
63651 295259 292670 289872 287010 284290 281654 279167 277356 276743 277176 278088 279314 281167 283713 286551 289503
63636 289503 292941 297027 301145 304605 307654 311163 315472 320187 325134 330859 337937 346251 355309 364941
63622 364941 375329 386587 398646 411467 425088 439497 454708 471049 489309 510495 535284
63611 535284 563418 593557 623953 653382 681323 707222 729924 748028 760639 767621 769441 767076
63599 767076 761931 755465 748696 742042 735434 728484 720742 712003 702229 691044 677607 661334 642640
63586 642640 622672 602394 582250 562578 543914 526738 511152 496973 484078 472698 463453 456978
63574 456978 453325 451839 451775 452881 455139 458203 461559 465205 469709 475485 482314 489622 496922 503937 510679
63559 510679 517626 525564 535143 546763 560852 577816 597564 619537 643528 670203 700433 734163
63547 734163 769993 805488 837576 863106 879868 887531 887525 881996 872907 861882 850345 839483 830070
63534 830070 822429 816408 811311 805938 798919 789173 776142 759692 739948 717378 692931 667764 642611
63521 642611 617572 592724 568687 546193 525210 505080 485667 467806 452305 438925 426787
63510 426787 415472 405193 396079 387910 380570 374235 368919 364212 359645 355071 350568 346314 342709 340268
63496 340268 339063 338494 337928 337395 337229 337178 336430 334754 333189 333166 335012 337673 339927 341551 343172 345318
63480 345318 347964 350903 354112 357556 360903 363701 365771 367178 367825 367325 365423 362465 359337 356830 355006
63465 355006 353171 350575 347231 343973 341619 340217 339238 338364 337761 337623 337901 338728 340738 344456 349488 354764
63449 354764 359673 364628 370358 377074 384574 392860 402144 412350 423173 434760 447969 463700 482229
63436 482229 503283 526340 550361 573440 593346 608750 619950 628455 636066 644187 653564 664404
63424 664404 676897 691699 709761 731634 757182 785962 817496 850840 884185 915325 942535
63413 942535 964772 981117 990541 992554 988033 979179 968584 958181 948772 940219 931832 922613 911470
63400 911470 897546 880551 860698 838278 813418 786321 757615 728308 699478 672045 646588
63389 646588 623156 601313 580644 561271 543794 528801 516574 507109 500061 494701 490317 486925
63377 486925 485430 486849 491360 498095 505796 513674 521819 530896 541413 553267 566054 579745 594863
63364 594863 612037 631654 653929 679003 706731 736619 768082 800468 832625 862774 889285
63353 889285 911449 929146 941953 949147 950652 947484 941117 932788 923567 914438 905728 896639 885939
63340 885939 873115 858497 842281 823973 803031 779680 754719 728684 701649 673934 646738
63329 646738 621834 600576 583259 569356 558260 549786 544047 540937 539595 538261 534789 527698 516991
63316 516991 503861 489474 474206 458228 442482 428475 416996 407520 399151 391770 385864 381468
63304 381468 377853 374326 370892 367990 365828 364234 362996 362066 361435 360890 359937 357980 354733 350505 345961
63289 345961 341540 337244 333019 329153 326080 323905 322333 321034 319925 319096 318596 318307 317956 317276 316262
63274 316262 315275 314771 314971 315786 316912 317848 318018 317229 316064 315568 316376 318259 320508 322590 324404 326192
63258 326192 328342 331076 334143 337028 339616 342471 346252 350989 356194 361520 367029 372899 379208 385973
63244 385973 393119 400342 407308 414112 421364 429815 440024 452321 466729 482873 500287 518946 539140
63231 539140 560685 582649 604206 625490 647210 669573 692011 713861 734901 755178 774765
63220 774765 793942 813340 833578 854786 876577 898442 920061 941168 961143 978801 992739
63209 992739 1002025 1006501 1006414 1001909 993031 980025 963327 943366 920688 896303 871530 847325 823938
63196 823938 801380 780043 760647 743718 729356 717567 708608 702808 700044 699656 701150 704915 711819
63183 711819 721922 733972 746559 759462 773419 788815 805165 821838 838566 855150 871301
63172 871301 887086 903031 919429 935887 951800 966817 980527 992112 1000692 1005616 1006087 1001075
63160 1001075 990311 975001 956816 936368 913304 887714 860609 832995 805269 777811 751488
63149 751488 727095 704638 683507 663220 643894 626235 611112 598822 588672 579579 571114 563621
63137 563621 557432 552457 548609 545954 544244 542900 541830 541726 543144 545737 548853 552446 556855 562030
63123 562030 567570 573290 579125 584625 589126 592461 595062 597372 599600 601941 604478 606812 608295 608796
63109 608796 608836 608837 608646 607961 606820 605456 604011 602620 601473 600497 599211 597245 594874 592800 591487 590898
63093 590898 590777 590864 590861 590410 589299 587702 586206 585527 586066 587654 589816 592304 595250 598811 602860 607116
63077 607116 611398 615593 619577 623392 627437 632293 638341 645645 654080 663357 673018 682709 692605 703383
63063 703383 715650 729525 744890 761915 781137 803054 827801 855245 885193 917461 951931
63052 951931 988759 1028468 1071575 1117967 1166733 1216667 1266911 1317161 1367408 1417625 1467576
63041 1467576 1516772 1564678 1611147 1656647 1701897 1747242 1792501 1837388 1881803 1925482 1967497
63030 1967497 2006321 2040398 2068525 2089696 2102775 2106503 2099850 2082349 2054221 2016358 1970224 1917597
63018 1917597 1860198 1799432 1736537 1672976 1610622 1551438 1496967 1448117 1405398 1369165 1339552
63007 1339552 1316314 1298972 1287289 1281427 1281473 1286835 1296385 1309365 1325935 1346605 1371189 1398609
62995 1398609 1427695 1457818 1488564 1519208 1548928 1577484 1605324 1632947 1660393 1687332 1713289
62984 1713289 1737560 1759039 1776334 1787988 1792617 1789173 1777393 1757918 1731628 1698835 1659375 1613569
62972 1613569 1562850 1509273 1454601 1399973 1346146 1293684 1242949 1194313 1148421 1105915 1066708
62961 1066708 1029843 994360 960119 927545 896851 867918 840804 815768 792689 770928 750001
62950 750001 730005 711088 692920 675103 657887 641941 627559 614533 602719 592109 582334 572769
62938 572769 563471 555431 549361 544592 539764 534423 529277 524959 521244 517750 514772 512886 512044 511554 510789
62923 510789 509494 507486 504646 501292 498193 495902 494268 492665 490500 487468 483676 479718 476335 473722
62909 473722 471299 468439 465213 462191 459689 457531 455435 453259 450975 448783 447221 446742 447083 447366 446960
62894 446960 446002 445070 444634 444903 445859 447211 448493 449348 449645 449415 448963 448911 449678 450858 451631 451884 452332 453281
62876 453281 453903 453208 451283 449056 447225 446046 445767 446427 447323 447470 446752 446069 446188 447014 448138 449523 451255
62859 451255 453008 454273 455002 455705 456885 458566 460387 462066 463683 465510 467648 470008 472646 475753 479101
62844 479101 481778 482872 482308 480672 478450 475876 473419 471817 471462 472093 473175 474283 475114 475538 475748 476074
62828 476074 476587 477174 477967 479283 481140 483274 485681 488604 491890 494893 497286 499527 502190 505261 508329
62813 508329 511104 513428 515182 516545 518146 520638 524254 528812 533838 538589 542532 546056 550231 555547
62799 555547 561346 566821 572097 577932 584895 593397 604007 617107 632506 649981 669918 692861 718818
62786 718818 747700 780111 816927 858333 904072 954463 1010228 1071301 1136707 1205763 1278505
62775 1278505 1354673 1433008 1511903 1590009 1665808 1737191 1801945 1858251 1904421 1938699 1959842
62764 1959842 1967534 1961883 1942914 1911062 1867796 1815279 1755503 1690075 1620477 1548087 1474045 1399537
62752 1399537 1326079 1255173 1187691 1123837 1063620 1007177 954712 906377 862154 821788 784961
62741 784961 751593 721695 694903 670555 648419 628895 612164 597568 584299 572368 562257
62730 562257 553869 546458 539629 533766 529308 526072 523506 521313 519620 518769 519096 520779 523766 527978 533520
62715 533520 540505 548674 557553 567086 577884 590703 605891 623532 643923 667594 694791 725167
62703 725167 758161 793640 832071 874064 919930 969778 1023769 1081856 1143374 1207304 1273016
62692 1273016 1340187 1407678 1472984 1533282 1586792 1632611 1669504 1695649 1709641 1711217 1700851
62681 1700851 1679187 1647069 1605689 1556381 1500514 1439753 1376074 1311194 1246219 1182030 1119767
62670 1119767 1060575 1005078 953334 905170 860343 818640 780136 745252 714211 686514 661248
62659 661248 637896 616570 597508 580657 565737 552366 540012 528101 516422 505252 494967
62648 494967 485679 477356 470061 463836 458482 453762 449782 446904 445177 444153 443424 443103 443420 443923 443500
62633 443500 441387 437945 434221 430944 428246 426164 424901 424386 424001 423196 422235 421977 422962 425065 428130 432404
62617 432404 437985 444143 449749 454406 458650 462990 467331 471704 476925 483759 491632 499144 506054 513941
62603 513941 524410 537312 551378 566198 582717 602000 624385 649901 678619 710197 743703
62592 743703 778365 814136 851105 888710 925901 961718 995206 1025005 1049639 1068222 1080467
62581 1080467 1086037 1084370 1075331 1059704 1038841 1014024 986281 956546 925609 893818 860997 826993
62569 826993 792508 759198 728571 700718 674554 649493 626407 606505 589680 574604 560327
62558 560327 547164 535900 526696 518961 511898 504968 498191 492148 487406 483812 480642 477449 474355 471423
62544 471423 468433 465557 463614 463045 463018 462231 460409 458444 457188 456706 456662 456858 457303 458236 460222 463784 468807
62527 468807 474697 481212 488745 497660 507854 519216 532097 546956 563945 583246 605506 631445
62515 631445 661054 693567 728170 764458 802293 841627 882463 924613 967368 1009575 1050072
62504 1050072 1087815 1121606 1150105 1172398 1188428 1198724 1203913 1204697 1202167 1197846 1193355 1190083 1189145
62491 1189145 1191466 1197853 1209025 1225507 1247327 1273813 1303998 1337495 1374858 1416560 1461234 1504996
62479 1504996 1542978 1571969 1591755 1604023 1610059 1609311 1599740 1579231 1546907 1503638 1451576 1393120
62467 1393120 1330159 1264170 1196777 1129851 1065007 1003228 945135 891416 842752 799394 761097
62456 761097 727496 698384 673530 652359 634047 618024 604328 593353 585184 579257 574800 571580
62444 571580 570029 570566 573028 576924 581993 588146 594886 601256 606487 610417 613061 614126 613283 610712 606897
62429 606897 601967 595664 588056 579813 571614 563599 555661 547910 540529 533452 526602 520202 514390 508715
62415 508715 502592 496262 490610 485878 481250 476144 471340 468086 466370 464818 462386 459538 457542 457059
62401 457059 457721 458741 459569 460076 460474 461143 462394 464278 466551 468676 470000 470235 469948 470336 472263 475612
62385 475612 479689 484093 488922 494292 500055 506092 512591 519759 527382 534854 541709 548085 554681 562270
62371 562270 571197 581270 592139 603805 616737 631496 648334 667279 688616 713121 741681 774703
62359 774703 812011 853260 898190 946326 996620 1047632 1097940 1146049 1190000 1227546 1257062
62348 1257062 1278146 1291243 1296981 1296125 1289801 1279120 1264391 1245066 1220615 1191383 1158629 1124106
62336 1124106 1089653 1056792 1026272 998076 972043 948389 927443 909047 892585 877625 864238
62325 864238 852553 842174 832198 821709 810210 797619 784008 769412 753833 737428 720605 703915
62313 703915 687833 672674 658595 645573 633363 621609 610060 598700 587746 577596 568644 560959
62301 560959 554156 547831 542150 537722 534743 532545 530224 527545 524944 522849 521426 520907 521577 523233 525085
62286 525085 526582 528066 530214 533006 535684 537780 539735 542366 545984 550262 554757 559327 564132 569465
62272 569465 575631 582871 591350 601231 612678 625770 640491 656885 675157 695583 718451 744236
62260 744236 773782 808077 847707 892482 941519 993649 1047774 1102923 1157850 1210471 1257918
62249 1257918 1297562 1328222 1350323 1364885 1372556 1373602 1368337 1357066 1339683 1315784 1285381 1249262
62237 1249262 1208597 1164437 1117797 1070020 1022693 977139 934127 894027 857036 823248 792681
62226 792681 765373 741323 720344 702090 686344 673099 662232 653191 645182 637614 630273 623195
62214 623195 616605 610966 606779 604218 603056 602986 603823 605306 606973 608500 610142 612548 616094 620531 625415
62199 625415 630743 636997 644498 652858 661182 668794 675661 682143 688544 695041 701810 708907 716131 723381
62185 723381 731201 740441 751118 761961 771516 779521 786764 793784 800277 805854 810820 815961 821961 829373
62171 829373 838894 851315 867275 887285 911721 940440 972551 1006961 1043056 1080344 1117299 1151070
62159 1151070 1178837 1199438 1213520 1222289 1226407 1226012 1221307 1212750 1200694 1185086 1165629 1142225
62147 1142225 1115341 1086066 1055829 1025881 996921 969240 943296 919897 899616 882142 866658
62136 866658 852883 841298 832067 824180 816217 807801 799748 792775 786613 780634 774843 769776 765644 762135
62122 762135 759122 757180 757171 759425 763512 768776 774902 781802 788919 794874 798077 797825 794702 789938 784614
62107 784614 779505 775183 771775 768629 764647 759061 751699 742583 731721 719572 707355 696480 687593
62094 687593 680409 674449 669722 666649 665556 666376 668762 672294 676567 681187 685766 690049 694181 698890
62080 698890 705191 713712 724288 736352 749683 764517 780909 798332 816158 834407 853704 874597
62068 874597 897232 921580 947532 974627 1002118 1029567 1056966 1083877 1108718 1129433 1144859
62057 1144859 1155035 1160273 1160574 1156141 1147887 1136842 1123174 1106218 1085447 1061103 1033874 1004297
62045 1004297 972688 939501 905463 871300 837537 804681 773488 744738 718625 694603 672051
62034 672051 650976 631810 614673 599246 585389 573373 563240 554312 545701 537126 528845 520957
62022 520957 513207 505451 497890 490727 483935 477560 471931 467307 463428 459715 455887 452250 449343 447441
62008 447441 446415 445960 445960 446623 448295 451074 454652 458595 462795 467470 472569 477309 480583 482040 482584 483564
61992 483564 485388 487124 487407 485546 481732 476513 470320 463385 455909 448277 441181 435337 430964 427670
61978 427670 424959 422634 420594 418562 416418 414541 413307 412301 410615 408050 405480 403783 402806 401760
61964 401760 400257 398457 396433 393987 391197 388699 387138 386527 386311 385999 385577 385392 385830 387172 389611 393186
61948 393186 397627 402510 407799 414116 422158 431847 442360 453119 464439 476963 490689 504857 518676
61935 518676 531907 544810 557742 570744 583300 594521 603805 611343 617789 623458 627991 630719 631174
61922 631174 629304 625525 620648 615533 610720 606496 603242 601346 600770 601122 602457 605714 611972 621320 632713
61907 632713 644871 657043 668878 679860 689187 696149 700494 702327 701793 699006 694320 688443 682036
61894 682036 675242 667850 659954 652196 645204 638976 633037 627058 621116 615367 609709 603784 597167 589495
61880 589495 580504 570150 558774 547157 536202 526328 517237 508537 500590 494362 490244 487433 484875
61867 484875 482538 481269 481593 483292 486189 490616 496805 504303 512490 521340 531315 542762 555868 570998
61853 570998 588498 608131 629135 650980 673754 697669 722385 746888 769900 790407 808051
61842 808051 823047 835567 845238 851394 853667 852125 847110 839529 831084 823378 816565 809681 802775 797966
61828 797966 797643 802100 809732 819091 829679 840805 850933 858748 864092 867265 867930 865309 859137 849836
61814 849836 837974 824008 808383 791405 773119 753722 734020 715004 696961 679383 661810
61803 661810 644448 627958 613003 600112 589539 580915 573221 565434 557262 549238 542168 536523 532164
61790 532164 528525 525129 521939 519161 516724 514207 511369 508501 506080 504249 502872 501959 501667 501791 501642
61775 501642 500737 499508 498962 499488 500254 500107 499007 498275 499304 502252 506164 510169 514240 518916 524624 531401
61759 531401 538996 546971 554705 561454 566598 569972 571960 573093 573442 572531 569989 566072 561308 555861 549679
61744 549679 543165 537121 531829 526642 520822 514488 508428 503199 498774 494901 491471 488592 486567 485723
61730 485723 486000 486825 487643 488472 489591 490843 491715 492136 492768 494345 497012 500433 504140 507598 510306 512174
61714 512174 513589 514881 515907 516354 516135 515191 513225 510124 506478 503105 500110 496895 493161 489323 485716
61699 485716 481947 477450 472329 467171 462209 457190 452063 447363 443727 441214 439183 436772 433555 429905
61685 429905 426677 424359 422576 420649 418502 416660 415382 414203 412526 410335 408081 406131 404545 403222
61671 403222 401947 400468 398783 397293 396455 396332 396685 397378 398436 399784 401230 402766 404643 407064 409919
61656 409919 412848 415408 417247 418295 418800 419008 418883 418385 417960 418420 420239 423202 426739 430306 433430 435872
61640 435872 437992 440563 443857 447176 449622 451045 451757 451563 449769 446293 442162 438539 435545 432376 428397
61625 428397 423810 419320 415477 412364 409740 407412 405536 404515 404475 404878 404863 404056 402878 401911 401093 399751
61609 399751 397373 394080 390306 386324 382330 378682 375607 372659 368972 364276 359423 355596 353147 351376
61595 351376 349337 346641 343562 340651 338236 336137 333913 331496 329467 328453 328351 328452 328312 328120 328129 328085
61579 328085 327496 326237 324651 323187 322179 321895 322515 323925 325623 326883 327119 326284 324965 323935 323504 323411
61563 323411 323390 323603 324315 325422 326628 327990 329859 332266 334685 336530 337630 338146 338284 338288 338465 338993 339795
61546 339795 340776 342024 343549 345007 345951 346299 346270 346012 345685 345899 347512 350656 354298 357166 358905 359973
61530 359973 360626 360614 359884 358993 358446 358009 357114 355748 354485 353639 352775 351197 348722 345918 343683 342626 342628
61513 342628 342960 342948 342567 342275 342378 342880 343922 345894 348818 351889 354001 354648 354127 353122 352396 352716 354525
61496 354525 357560 361052 364399 367402 369915 371701 372837 373909 375489 377586 379795 381837 383698 385427
61482 385427 387087 388824 390721 392506 393570 393298 391391 388052 384060 380511 378167 376980 376324 375641 374693
61467 374693 373399 371812 370253 369150 368657 368600 368811 369185 369423 369110 368246 367369 366930 366798 366588 366213 365848 365635
61449 365635 365743 366537 368260 370698 373496 376657 380329 384212 387751 390915 394252 398002 401665 404744 407441
61434 407441 410221 413027 415460 417483 419457 421484 423196 424257 424747 424969 425184 425675 426740 428432 430497
61419 430497 432723 435130 437658 439840 441096 441335 441063 440853 440848 440772 440335 439590 438965 438963 439761 441087 442484 443637
61401 443637 444372 444454 443680 442290 441042 440598 440791 440745 439820 438328 437131 436624 436356 435649 434333 432698 430974
61384 430974 429247 427837 427299 427798 428704 429185 429099 428997 429233 429492 429383 429151 429419 430334 431381 432081 432519 433065
61366 433065 433857 434777 435697 436508 437081 437498 438203 439582 441430 443226 445000 447556 451618 457026 463030 469054
61350 469054 474884 480299 485108 489566 494283 499391 504103 507463 509471 511194 513689 516982 520192 522511
61336 522511 523913 524942 526037 527175 528026 528212 527383 525385 522611 520035 518540 518169 518251 518261 518285 518587 519124
61319 519124 519808 521008 523283 526574 530023 532857 535306 538433 543161 549604 557295 565822 575121 585359
61305 585359 596646 608833 621267 632681 641580 647114 649665 650435 650386 649631 647807 644768 640748 636022
61291 636022 630663 624634 617947 610690 603036 595232 587517 580016 572771 565838 559347 553483 548537 544847
61277 544847 542546 541360 540760 540335 539994 539913 540377 541512 543013 544293 545177 546341 548680 552286 556511 561083
61261 561083 566628 573750 582000 590168 597322 603126 607434 610185 611688 612546 613116 613330 613007 612030 610223
61246 610223 607468 604064 600643 597602 594930 592624 590901 589863 589351 589244 589463 589471 588393 586188 584245 584152
61230 584152 586020 588667 591255 594010 597288 600856 604598 609291 615906 624243 632798 640058 645630 650121
61216 650121 654355 658888 663979 669629 675469 680786 684929 687826 690093 692491 695300 698342 701568 705352
61202 705352 710041 715443 721105 727105 734354 743980 756464 771294 787242 802884 817047 829087 838836
61189 838836 846288 851429 854414 855739 855947 855196 853371 850600 847283 843403 838251 831211 822598 813264 803569
61174 803569 793308 782662 772478 763294 754570 745303 735043 723988 712464 700833 689610 679117
61162 679117 669157 659504 650554 642948 636664 631090 626004 621891 619247 618184 618850 621509 625800 630489
61148 630489 634410 637324 639482 640800 640974 640081 638508 636479 634145 632015 630761 630601 631290 632761 635443
61133 635443 639882 646339 654660 664277 674438 684868 696202 709409 724794 741923 760512 780873
61121 780873 803313 827553 853014 879404 906745 935030 964115 993855 1024149 1054945 1086220
61110 1086220 1117806 1149128 1179364 1208009 1235085 1260748 1284925 1307505 1328471 1347539 1363917
61099 1363917 1376837 1386244 1392669 1396626 1398504 1398892 1398330 1396575 1392662 1386110 1377717 1368763 1359528 1349121
61085 1349121 1336775 1322850 1308318 1293565 1278181 1261859 1245075 1228573 1212448 1196096 1179067
61074 1179067 1161550 1143915 1126160 1108196 1090420 1073544 1057790 1042715 1027956 1013850 1001029
61063 1001029 989642 979253 969437 960233 952089 945514 940632 936904 933469 930026 927288 926245 927109 929396
61049 929396 932949 938288 945738 954756 964566 975104 986855 999867 1013530 1027413 1041957 1058053
61037 1058053 1076029 1095276 1114923 1134812 1155676 1178289 1202640 1228156 1254688 1282879 1313527
61026 1313527 1346877 1382556 1419754 1457387 1494730 1532428 1572601 1617666 1669390 1729299 1799204
61015 1799204 1880417 1972836 2075793 2189995 2318345 2465459 2637377 2841673 3086917 3381886
61005 3381886 3735983 4160635 4670373 5283817 6024971 6923322 8012548 9331174 10922127
60996 10922127 12813562 14968219 17228730 19321899 20955916 21958888 22355951 22332726
60988 22332726 22133510 21979161 22030595 22358680 22898197 23430671 23653636 23319421 22350003
60979 22350003 20848649 19018206 17062308 15131378 13317474 11669022 10204946 8925622
60971 8925622 7821628 6878433 6077787 5399723 4825861 4340808 3930648 3581724 3281593
60962 3281593 3020248 2789921 2584625 2400504 2235694 2088894 1958252 1841910 1738913
60953 1738913 1648771 1570427 1502177 1442334 1389366 1341502 1296717 1253305 1210435 1168283 1127734
60942 1127734 1089683 1054333 1021191 989708 959685 931064 903745 877791 853498 831091 810558
60931 810558 791855 774899 759240 744159 729357 715235 702340 690829 680580 671392 662832 654391
60919 654391 646119 638700 632443 626622 620326 613721 607884 603461 600000 596655 593099 589586 586387 583471
60905 583471 580732 578296 576323 574408 571510 566867 560919 554865 549340 543977 538257 532190 525989 519728
60891 519728 513660 508376 504173 500691 497557 494999 493391 492561 492003 491462 490813 489709 487850 485427 482841
60876 482841 480169 477308 474400 471690 469220 467090 465702 465293 465512 466016 467172 469562 473038 476984 481302
60861 481302 486340 491938 497382 502380 507311 512230 516339 518743 519296 518465 516895 515378 514767 515446 517001
60846 517001 518514 519038 517937 515304 512102 509308 506690 502881 496878 489000 480184 470957 461582 452693
60832 452693 445086 438943 433707 428700 423629 418621 414083 410515 408139 406683 405566 404188 401999 398562
60818 398562 393923 388806 384114 380224 376961 374255 372480 371939 372202 372317 371809 371243 371462 372391 373045 372892
60802 372892 372686 373473 375081 376284 376469 376465 377443 379480 381657 383282 384532 385921 387495 388758 389303 389355 389573
60785 389573 390278 391026 391077 390199 388777 387173 385250 382642 379382 376113 373619 372084 370842 369007 366483
60770 366483 364119 362739 362265 362049 361822 361833 362203 362638 362854 362969 363337 364191 365427 366547 366967 366695 366515 367078
60752 367078 367909 367869 366616 365120 364634 365613 367711 370322 372823 374685 375625 375556 374359 372020 368959 365819
60736 365819 362889 360104 357594 355733 354570 353802 353416 353790 354949 356363 357754 359475 361693 363808 365235
60721 365235 366272 367613 369310 370828 371916 372821 373747 374575 375130 375406 375525 375662 375871 375842 375083 373559 371818
60704 371818 370251 368599 366559 364481 362980 362094 361311 360262 358876 357013 354518 351635 348927 346692 344761
60689 344761 342934 341389 340569 340726 341510 342064 341841 341436 342134 344420 347412 350086 352532 355437 358811 361980
60673 361980 364616 366966 369082 370543 371057 370796 369959 368435 366054 362891 359327 356058 353890 353110 353157 353330
60657 353330 353657 354586 355984 357154 357826 358426 359281 360281 361552 363739 367095 370785 373606 375155 375871 376117
60641 376117 375664 374067 371300 367981 365028 362982 361607 360221 358378 356081 353544 351111 349385 348950 349749
60626 349749 351058 352233 353255 354412 355762 357077 358059 358434 358077 357236 356476 356279 356780 357838 359148 360270
60610 360270 360878 361040 361055 361001 360761 360435 360303 360342 360306 360393 361264 363062 364923 365917 366176 366594 367677 369230 371081
60591 371081 373494 376681 380240 383427 385850 387742 389499 391112 392202 392622 392820 393412 394517 395759 396822
60576 396822 397737 398721 400078 402205 405302 409092 413271 418237 424773 432856 441413 449579 457700 466568 476081
60561 476081 485257 493282 499958 505151 508386 509129 507269 503328 498427 493835 490241 487509 485370 484167
60547 484167 484536 486540 489603 493284 497693 503100 509573 517169 526137 536754 549225 563847 580938
60534 580938 600332 621112 642129 662680 682398 700470 715258 724985 728849 727415 721916 713328
60522 713328 702304 689806 677262 665768 655386 645580 636237 627921 621144 615832 611649 608471 606293
60509 606293 604952 604336 604802 607007 611227 617220 625001 635541 650247 669735 693411 720381 750437
60496 750437 783910 820837 860664 902632 945924 989350 1031315 1070352 1105622 1136845 1163995
60485 1163995 1187019 1205404 1217790 1222350 1217820 1203950 1180826 1148311 1106780 1058174 1005709 952403
60473 952403 900194 850363 804138 762495 725652 693155 664440 639085 616638 596517 578251
60462 578251 561707 546868 533449 520995 509454 499296 490729 483051 475288 467463 460607 455330 451002
60449 451002 446677 442316 438476 435262 432289 429502 427275 425653 424166 422566 421168 420203 419296 417910 415970
60434 415970 413801 411707 409858 408375 407222 406193 405178 404339 403829 403513 403152 402742 402497 402588 403054 403871 405009
60417 405009 406464 408250 410302 412420 414490 416705 419263 421804 423509 423882 423185 422055 421123 421067 422419
60402 422419 424831 427069 428343 429358 431381 434487 437524 439796 441909 444663 447907 451006 453894 456957
60388 456957 460170 463044 465444 467908 470958 474419 477598 480000 481745 483373 485266 487310 489191 491034
60374 491034 493412 496522 499668 502014 503621 505185 506848 507961 508262 508538 509608 511131 512136 512477 513072
60359 513072 514652 516989 519635 522928 527764 534541 542614 550771 558035 564047 568926 572910 576156 578788
60345 578788 580926 582489 583088 582369 580454 577841 574889 571608 567985 564199 560408 556609 552826 549194 545622
60330 545622 541609 536737 531278 526078 521822 518510 515587 512467 509069 505976 503996 503428 503793 504435 505228
60315 505228 506625 509162 513163 518765 525922 534305 543347 552368 560704 567945 574299 580549 587416 595037
60301 595037 603198 611752 620335 627857 632849 634523 633177 629492 623842 616402 607545 597842 587877 578209
60287 578209 569343 561594 555128 550102 546381 543032 538689 532841 526446 520825 516213 511854 507272 502753
60273 502753 498551 494315 489661 484861 480547 476927 473693 470601 467806 465606 464091 463119 462413 461602 460314
60258 460314 458460 456442 455026 454905 456286 458735 461360 463267 464084 464180 464299 464913 465907 466904 467744 468527 469258
60241 469258 469693 469607 469114 468605 468424 468636 469121 469854 471082 473123 475907 478865 481472 483865 486652 490065
60225 490065 493628 496880 500120 504107 509143 514840 520800 527114 534044 541521 549222 556993 564969 573345
60211 573345 582240 591713 601642 611503 620516 628210 634819 640954 646910 652391 656926 660425 663251 665914
60197 665914 668760 671783 674478 675926 675391 673010 669753 666486 663164 659060 653659 647139 640103 633168
60183 633168 626803 621219 616228 611402 606554 602016 598301 595577 593580 592000 590797 590125 589940 589750 588821
60168 588821 586813 584171 581726 579866 578295 576652 575056 573797 572759 571543 570119 569002 568725 569367 570596
60153 570596 571921 572834 573045 572720 572341 572262 572614 573650 575772 578954 582478 585713 589015 593398 599270 605887
60137 605887 612199 617947 623729 630176 637343 644804 652036 658640 664413 669420 673949 678197 681987 684940
60123 684940 687021 688734 690546 692296 693438 693851 694041 694457 694949 695091 694726 693950 692823 691446 690064 688707
60107 688707 686845 683894 679999 675904 672052 668283 664518 661174 658614 656639 654994 654077 654647 656838 659841
60092 659841 662621 664672 666068 666984 667398 667143 666133 664487 662419 660050 657388 654477 651418 648159 644479
60077 644479 640291 635832 631348 626712 621549 615711 609449 603114 596878 590784 584873 579168 573611 568126
60063 568126 562722 557488 552495 547746 543261 539196 535832 533359 531635 530286 529090 528224 528084 528929 530804
60048 530804 533763 538000 543687 550694 558489 566301 573439 579582 584849 589576 593953 597823 600792 602508
60034 602508 602842 601838 599703 596892 594085 591765 589745 587257 583593 578542 572175 564542 555789 546394
60020 546394 536999 528069 519850 512496 505999 500169 495009 490929 488188 486208 483921 480833 477309 473832
60006 473832 470533 467611 465619 464897 464985 464998 464433 463445 462575 462434 463372 465166 467212 469269 471871 475741 480940
59989 480940 486697 491940 495935 498777 501381 504605 508121 510532 510909 509784 508274 506735 504862 502671
59975 502671 500585 498644 496369 493514 490410 487516 485109 483429 482619 482394 482210 481925 481976 482871 484823 487853
59959 487853 491755 495931 499723 503041 506177 508921 510449 510357 509310 508315 507716 507259 506769 506303 505820 505123
59943 505123 504090 502745 501192 499661 498440 497518 496431 494795 493004 492244 493691 497629 503240 509249 514951
59928 514951 520616 526770 533133 538508 541724 542417 541034 538539 536174 534833 534259 533283 531320 529339 528914
59913 528914 530556 533525 537075 541184 545901 550635 554558 557445 559713 561731 563451 564720 565633 566337 566615
59898 566615 565980 564232 561804 559460 557789 557058 557356 558564 560250 561859 563136 564353 566086 568856 572809
59883 572809 577586 582568 587467 592582 598305 604464 610430 615716 620130 623408 625229 625755 625795 626175 627114
59868 627114 628243 628992 628908 627958 626660 625625 624853 623762 621995 619849 617791 615983 614487 613502 613085 613024
59852 613024 613419 615038 618632 624088 630740 638438 647759 659032 671369 682813 691421 696385 698352 698730
59838 698730 698666 698760 699509 701474 704656 708061 710330 710719 709274 706279 701931 696506 690464 684275 678210 672271
59822 672271 666245 659909 653231 646234 638792 630890 623099 616302 610778 606035 601761 598372 596202 594698
59808 594698 593030 591171 589755 589117 589111 589687 590961 592771 594663 596278 597279 597135 595682 593830 592897 593057
59792 593057 593090 591903 589724 587520 585793 584362 582967 581603 580329 578982 577144 574403 570848 567155 563970
59777 563970 561329 559009 557204 556258 555826 555049 553747 552786 552943 553978 555211 556576 558648 561888 566274
59762 566274 571502 577263 583393 589929 596887 604022 611099 618346 626183 634459 642513 650139 657823 665777
59748 665777 673427 680355 687114 694457 702168 709302 715289 720179 724164 727553 730984 734841 738506 740927
59734 740927 741907 742182 742266 741939 740977 739584 737819 735332 732073 728721 725939 723663 721530 719548 717820 715911
59718 715911 713148 709453 705448 701837 699092 697661 697912 699716 702365 705107 707654 710279 713622 718326
59704 718326 724510 731516 738460 745076 751781 758918 766337 773862 781760 790319 799123 807124 813461 817979
59690 817979 821030 823073 824506 825603 826379 826614 826127 824968 823251 820876 817494 812729 806405 798704 790165
59675 790165 781424 772847 764424 756141 748346 741584 736026 731226 726577 721965 717888 714923 713195 712405
59661 712405 712277 712815 714130 716205 718980 722557 727017 732047 736945 741158 744665 747672 749998 750971 749962
59646 749962 746918 742267 736339 728987 719925 709483 698836 689209 680877 673198 665668 658637 652791 648227
59632 648227 644390 640774 637255 633674 629535 624342 618055 610964 603243 594909 586256 578009 570777 564399
59618 564399 558083 551279 544209 537476 531443 526330 522674 521078 521376 522501 523462 524164 525031 526215 527534
59603 527534 528913 530387 531748 532611 532851 532696 532465 532511 533308 535156 537776 540498 542852 544708 545880 546082
59587 546082 545363 544238 543201 542314 541320 539889 537736 534820 531503 528220 524985 521566 518172 515438 513537
59572 513537 511793 509499 506781 504327 502605 501604 501029 500404 499315 497991 497391 498221 499977 501398 501795
59557 501795 501533 501320 501507 502088 502936 503827 504543 505133 505995 507626 510423 514587 519995 526245 533133 541049
59541 541049 550696 562567 577019 594525 614883 635863 653391 663909 666640 663441 656873 648902
59529 648902 640963 634275 629614 627127 626633 627863 630256 632831 634640 635290 634833 633304 630619 626891 622548
59514 622548 618001 613291 608119 602165 595370 588025 580603 573491 566923 561169 556557 553080 550106 546887
59500 546887 543392 540297 538064 536393 534876 533835 534067 535809 538369 540783 542600 544021 545557 547612
59486 547612 550167 552785 555056 557048 559231 562023 565563 569746 574174 578187 581346 583888 586309 588501
59472 588501 589760 589780 589107 588334 587325 585713 583875 582809 583074 584285 585784 587524 590147 594294 599905
59457 599905 606192 612319 618130 624074 630461 637038 643378 649338 654909 659875 663895 666743 668158 667716
59443 667716 665238 661204 656399 651207 645660 640059 635087 631178 628183 625725 623577 621587 619660 617987
59429 617987 617019 617078 618265 620794 625019 630981 638350 647047 657490 669885 683794 698919 715934 735814
59415 735814 758619 783711 810870 839870 868358 891366 904308 906609 901812 894333 886776 880134
59403 880134 875334 873809 877007 885757 899529 915497 928597 933706 928670 915363 897731 878947 860292
59390 860292 842120 825040 809850 796675 784745 773281 762356 752633 744366 737060 730191 723927
59378 723927 718902 715521 713656 712756 711992 710575 708380 706178 704878 704582 704700 704892 705462 706772 708731 711041
59362 711041 713626 716618 720160 724452 729837 736676 745194 755382 766899 779209 792150 806297 822334
59349 822334 840034 858283 876178 893592 910562 926801 942125 956760 970635 982678 991376 995875
59337 995875 996273 993180 987391 979628 970010 958053 943635 927704 911438 894998 877872 860258 843214
59324 843214 827353 812210 797210 782586 768974 756666 745610 735680 726520 717605 708809 700533
59312 700533 692951 685628 678360 671898 667130 663871 661226 659038 658236 659656 663218 668512 675639 685079
59298 685079 697035 711102 726108 739860 749420 752363 748125 738150 724887 710707 697390 685988
59286 685988 676797 669551 663783 659138 655565 653469 653602 656476 661749 668388 675550 683170 691608 700943
59272 700943 710905 721371 732577 744631 757010 768783 779363 788820 797369 804736 810364 814192 816851
59259 816851 818841 819865 819351 817465 815115 812956 810856 808485 806002 803884 802440 801801 802061 803061 804240
59244 804240 805080 805596 806059 806386 806211 805457 804444 803391 802130 800325 797716 794157 789652 784338 778253 771309
59228 771309 763704 756037 748547 740535 731237 721149 711704 703579 696096 688531 681202 674833 669573 665168
59214 665168 661572 658766 656437 654428 653124 652813 652986 652925 652768 653317 654954 657386 660326 663689 667117 670093
59198 670093 672727 675832 679874 684328 688375 691824 695013 698085 700804 702965 704698 706401 708453 710881
59184 710881 713164 714506 714534 713739 713062 712980 712977 711971 709342 705533 701599 698194 695160 692118 689119 686516
59168 686516 684472 682984 682223 682428 683432 684587 685292 685418 685207 684910 684492 683471 681116 677087 671912 666508
59152 666508 661223 655622 649319 642650 636306 630579 625256 620082 614964 609742 604145 598133 592142 586746
59138 586746 582070 577644 572831 567405 561803 556926 553608 552006 551431 551015 550674 551248 553581 557687 562990
59123 562990 568982 575284 581474 587527 594247 602569 612372 622603 632634 642831 653677 665112 677047
59110 677047 689675 702669 714706 724517 732163 738760 745279 752056 758935 765200 769669 771578 771259 769485
59096 769485 766480 762230 757419 753202 750080 747685 745669 744126 743083 742226 741277 740224 739077 737770 736281
59081 736281 734473 731956 728509 724496 720342 715801 710394 704410 698725 693630 688564 683031 677111 670992
59067 670992 664729 658662 653393 649090 645372 642032 639257 636963 634566 631721 628715 625916 623345 621008
59053 621008 619048 617344 615558 613838 612842 612702 612620 611896 610786 609867 609090 608070 606891 606050 605816 606154 607120
59036 607120 608944 611867 616097 621714 628417 635642 643095 650894 659087 667483 676118 685420 695675 706819
59022 706819 718921 732200 746096 758935 769118 776330 781196 784165 785248 784434 781807 777532 772182
59009 772182 766850 762405 758912 756133 754326 754041 755417 758174 762133 767318 773700 781148 789334 797352
58995 797352 803775 807589 808891 808390 806554 803617 799919 795656 790632 784883 779226 774579 770972 767842
58981 767842 765089 763201 762522 763123 765276 769319 775020 781733 789262 798008 808210 819508 831306 843041
58967 843041 854114 864098 873133 881644 889633 896697 902751 908155 913029 916922 919275 919720 917838 913173
58953 913173 905740 896122 884930 872654 860172 848766 839135 830761 822665 814580 806998 800334 794521
58940 794521 789394 785023 781504 778611 775921 773241 770858 769293 768905 769824 772156 775914 780598 785182 788811
58925 788811 791358 793070 793971 794070 793913 794381 795835 797897 800152 802652 805691 809540 814607 821439 830188
58910 830188 840269 850798 861263 871642 882092 892767 903786 915070 926207 936597 945736 953258
58898 953258 958889 962598 964821 966327 967740 969331 971370 974514 979629 987229 997325 1009732 1024124
58885 1024124 1039555 1054408 1067376 1078485 1088660 1098232 1106279 1111532 1113613 1113314 1112061 1111204 1111279 1111619
58871 1111619 1110897 1108358 1104288 1099242 1093206 1085839 1077083 1067110 1055942 1043574 1030298 1016489 1002173
58858 1002173 987154 971520 955701 940070 924715 909585 894715 880369 867017 855002 844097
58847 844097 833674 823389 813436 803948 794433 784090 772484 759844 746998 735049 724656 715433
58835 715433 706569 698178 691430 686983 683994 681237 678633 676992 676737 677591 679171 681088 682716 683658 684373
58820 684373 685738 688137 691502 695941 701507 707457 712568 716269 718853 720585 721319 721025 720049 718628 716682
58805 716682 714179 711249 707910 704140 700284 696864 693897 690791 686985 682374 677228 672145 667915 664889
58791 664889 662508 660036 657654 656198 655875 655994 656160 657009 659454 663652 668999 674732 680381 685976 692015
58776 692015 698901 706272 713086 718374 721664 722893 722288 720279 717045 712307 705988 698815 691630 684287
58762 684287 676035 667015 658542 651702 646372 641846 637767 634114 630780 627597 624486 621401 618349 615531
58748 615531 613174 611311 610110 610166 611859 614539 617108 619433 622483 627030 632918 639674 646937 654055 660112
58733 660112 664869 669104 673661 678642 683807 689137 694568 699665 704057 707904 711654 715622 719934 724535
58719 724535 729141 733598 738371 744208 751235 758821 766293 773145 778548 781515 781863 780309 777319 772513
58705 772513 765444 756281 745400 732982 719403 705387 691257 676608 661152 645408 630173 615807
58693 615807 602409 590207 579298 569446 560546 552925 546824 541920 537657 533672 529757 525804 522027
58680 522027 518766 515972 513372 511130 509652 508656 507298 505525 504431 504945 507001 510378 515345 521900 529307
58665 529307 537153 546032 556320 566938 576246 583602 589113 592386 592584 589599 584369 578080 571572 565233
58651 565233 558884 551980 544478 537267 531278 526559 522727 519848 518179 517404 516903 516646 517125 518493 520310
58636 520310 522113 523789 525448 527292 529470 531775 533664 534799 535351 535591 535570 535399 535369 535529 535646 535798 536454
58619 536454 537685 539002 540383 542660 546317 550625 554664 558493 562550 566511 569677 572032 574075 575934
58605 575934 577426 578730 580159 581514 582295 582304 581479 579573 576715 573928 572280 571773 571737 572045 573199 575474
58589 575474 578793 583297 589321 596840 605504 615122 625637 636733 647874 658539 668229 676691 684431
58576 684431 692421 700832 708791 715893 723135 731628 741255 751604 763527 778629 797675 820479 846829
58563 846829 876352 907867 939998 972101 1003525 1032358 1056213 1074051 1086154 1092664 1093606 1090280
58551 1090280 1085081 1079632 1074184 1068983 1064925 1062383 1060398 1057457 1052302 1043797 1031029 1014050 993883
58538 993883 971505 947413 922312 897416 873719 851528 830888 811880 794425 778425 764264
58527 764264 752561 743298 735739 729281 723838 719374 715636 712407 709500 706511 703133 699621 696397 693384
58513 693384 690293 687370 685126 683540 682228 681205 680675 680276 679431 678347 677773 677889 678271 678840 679844 680919
58497 680919 681217 680645 680101 680340 681392 683166 685811 689395 694021 700222 708483 718382 729079 740613 753829
58482 753829 769101 786079 804668 825076 846682 867867 887304 904593 919351 930482 936701 937346
58470 937346 932696 924178 914093 904331 895395 887266 880763 876956 875585 875390 875988 878218 882655 889054
58456 889054 897257 907241 918088 928237 937053 944916 951484 955130 954439 949132 939375 925570 909199
58443 909199 892497 876741 861926 848313 836872 827793 820113 813506 809042 807363 807455 808177 809891 813635
58429 813635 819619 827406 836753 847416 858795 870436 882171 893321 902634 909440 913896 915680 913652
58416 913652 907502 898661 888862 878811 868884 859948 852532 846075 839849 833826 828072 822340 817029 813484
58402 813484 812455 813153 814628 817075 820865 825344 829689 834189 839568 845671 851736 857427 862737 867474
58388 867474 871651 875800 880188 884280 887597 890448 893256 895957 898715 902356 907281 912695 917653 922214
58374 922214 926881 931676 936442 941351 946521 951840 957685 964873 973386 982188 990886 1000384 1011161 1022240
58360 1022240 1032828 1043680 1055532 1067203 1076638 1083086 1087082 1089028 1089100 1088039 1086818 1085867 1085419 1086040
58346 1086040 1087960 1090564 1093474 1097524 1103759 1112126 1121991 1133260 1146074 1160045 1174744 1190341 1206948
58333 1206948 1223893 1240448 1256624 1272466 1287257 1300166 1311020 1319812 1326324 1330979 1335168 1339897
58321 1339897 1344888 1349634 1354324 1358995 1362957 1366106 1369848 1375716 1383888 1393852 1405461 1418359 1431439
58308 1431439 1444014 1456744 1470473 1485021 1499877 1515044 1530352 1545033 1558896 1572909 1587806
58297 1587806 1603202 1618746 1634805 1651321 1667494 1683482 1700782 1719989 1739853 1759635 1780567
58286 1780567 1803776 1828628 1854458 1882054 1911882 1942792 1974251 2008027 2045718 2086271 2127890
58275 2127890 2170796 2216080 2263295 2311180 2359459 2408088 2456174 2503478 2551520 2601462 2652417
58264 2652417 2703575 2756090 2810982 2867096 2923211 2980159 3038665 3097153 3154129 3210782 3268805
58253 3268805 3327694 3386839 3448241 3514252 3584514 3657943 3735793 3819850 3909523 4003682 4103488
58242 4103488 4210351 4323033 4439916 4562270 4692211 4829529 4973608 5126225 5289175
58233 5289175 5461503 5642551 5835247 6042797 6264729 6499950 6750874 7020556 7308700
58224 7308700 7614824 7942459 8295893 8676005 9083924 9525346 10006387 10529009 11095728
58215 11095728 11714643 12394248 13138217 13952100 14850752 15852609 16972125 18225849 19640953
58206 19640953 21250354 23086608 25191271 27625595 30464405 33789428 37701904 42334768
58198 42334768 47841302 54384644 62159831 71428301 82533092 95908290 112091388 131699301
58190 131699301 155374290 183773366 217500581 256598800 299454708 341865543 377539481
58183 377539481 400389630 407243726 398953569 379223490 352384447 321846051 289853003
58176 289853003 257944581 227326618 198925035 173316376 150720662 131079774 114170000
58169 114170000 99698234 87354704 76832463 67843239 60135826 53500655 47760538
58162 47760538 42766425 38400855 34573858 31210551 28245512 25625418 23307080 21250532
58154 21250532 19418843 17783261 16321580 15011403 13830793 12764737 11804468 10940211
58146 10940211 10159970 9454832 8819474 8247172 7729548 7261292 6839959 6460524 6114585
58137 6114585 5795112 5497831 5218219 4951799 4697794 4458467 4234435 4024080 3827199
58128 3827199 3645162 3477269 3320681 3174149 3038343 2912464 2794121 2682756 2579804
58119 2579804 2485157 2396592 2312861 2234304 2160307 2089195 2020872 1956664 1896380 1838238 1781775
58108 1781775 1728044 1676962 1627271 1579157 1534001 1491392 1449261 1407343 1367799 1332079 1299725
58097 1299725 1270563 1245341 1223556 1203104 1182819 1163411 1145479 1128566 1112427 1097265 1082411
58086 1082411 1066771 1050734 1035745 1021819 1007389 991605 974842 956976 937308 916336 895550
58075 895550 875344 855088 835235 817208 801059 785310 769342 753962 739549 725726 712967
58064 712967 702388 693685 685393 677292 670372 664266 657157 648662 640403 633128 625571 616911 608121 599982
58050 599982 591877 583556 576169 570426 565480 560606 556254 552466 547960 541947 535436 529665 524540 519534
58036 519534 514766 510212 505212 499778 495157 492061 489368 485495 480133 473850 467053 460163 453878 448442
58022 448442 443394 438585 434543 431368 428280 424754 421124 417613 413913 410193 407380 405832 404796 403700
58008 403700 402854 402364 401628 400573 400177 400949 401996 402339 402139 401907 401546 400984 400705 400821 400523 399223 397332
57991 397332 395186 392209 388039 383539 379753 376697 374054 372221 371576 371408 370652 369271 367994 367109 366332
57976 366332 365535 364827 364170 363517 363076 362969 362977 363032 363483 364411 365111 364799 363518 361968 360807 360363 360586 360997 361043
57957 361043 360660 360103 359243 357744 355875 354251 352674 350276 347142 344723 344079 344568 344907 344798 344912 345963
57941 345963 348358 352232 357348 363315 370052 377483 384903 391631 398331 406412 415735 424235 430340 434437
57927 434437 437166 437618 434438 427794 419117 409615 400061 391299 383761 376894 370072 363726 358751 355194
57913 355194 352345 349704 347111 344392 341731 340045 340121 341690 343908 346319 348622 350001 349625 347550 344403
57898 344403 340467 335840 331152 327340 324817 323430 323013 323430 324438 326102 328940 332976 337003 339561 340411
57883 340411 340417 340296 340214 340322 340786 341328 341452 341171 340971 341078 341288 341524 342137 343647 346422 350548 355739 361523
57865 361523 367690 374280 381073 387467 393090 398053 402463 406261 409822 413963 418950 424107 428834 433245
57851 433245 437314 440307 441841 442728 443853 444821 444639 443246 441376 439314 436751 433595 430047 426163 422195
57836 422195 419010 417232 416256 415057 413711 413127 413482 414055 414530 415380 416841 418522 420273 422499 425331 428220
57820 428220 430687 432872 435104 437462 439951 442632 445448 448250 450965 453206 453915 452131 448160 443271
57806 443271 438178 432536 426127 419736 414520 410973 408806 407332 405731 403390 400327 397009 393644 390034
57792 390034 386247 382867 380287 378154 375919 373725 372382 372537 374076 376317 378606 380762 382978 385439
57778 385439 388096 390815 393537 396194 398609 400532 401634 401575 400424 398964 398065 397604 396535 394217 391099
57763 391099 387862 384593 381205 377923 374784 371334 367530 364304 362439 361498 360787 360790 362500 365707 369198
57748 369198 372541 376421 381167 386134 390864 395835 401639 408211 415203 422373 429252 435130 439855 444104
57734 444104 448495 452836 456479 458992 460309 460626 460334 459758 458939 458016 457592 458094 458895 458901 458055 457384 457433 457522
57716 457522 456958 456101 455726 455948 456345 456623 456613 456050 454888 453585 452666 452253 452335 453156 454993 457787 461357 465752
57698 465752 471130 477414 484225 490971 496935 501539 504623 506180 505919 503549 499551 495045 490663 486106
57684 486106 481120 476411 473159 471925 472359 473778 475774 478562 482966 489842 499398 511408 526140 544648
57670 544648 568038 597086 632738 676027 726346 779652 828803 865956 885153 883916 863731 829331
57658 829331 786826 741652 697541 656683 620312 589059 562948 541299 522997 507255 494084
57647 494084 483722 475676 468874 462804 457917 454639 452508 450664 448767 446978 445357 443791 442306 441049
57633 441049 439997 439001 438041 437161 436219 434982 433456 431950 430786 430048 429504 428737 427447 425756 424142 423042
57617 423042 422614 422837 423601 424623 425519 426051 426217 426044 425457 424406 423066 421933 421740 422977 425274 427538
57601 427538 429107 430408 432011 433416 433594 432565 431441 430758 429800 427987 426070 425219 425553 426276 426855 427334
57585 427334 427739 427887 427750 427514 427281 427099 427242 428101 429754 431799 433557 434361 433883 432436 430870 429941 429846
57568 429846 430372 431204 431919 432043 431467 430798 431011 432667 435397 438162 440171 441722 443920 447252 450756 453136
57552 453136 454468 456062 458690 461834 464849 467955 471630 475719 479694 483295 486484 489290 492107 495584
57538 495584 499756 503788 507055 509896 512800 515407 517006 517554 517585 517544 517892 519386 522400 526188 529590 532348
57522 532348 535096 538248 541630 545027 548435 551820 555216 558946 563200 567549 571491 575269 579474 583946
57508 583946 587873 590986 593954 597472 601482 605462 608964 611801 614094 616209 618273 619864 620563 620648 620784
57493 620784 621303 622317 624219 627246 630745 633747 636277 639214 642854 646455 649357 651638 653498 654925
57479 654925 656311 658508 661741 665162 667951 670211 672335 674211 675621 676857 678362 680311 683018 687081
57465 687081 692445 697878 702170 705410 708415 711390 714098 716904 720484 724670 728708 732732 737871 744459
57451 744459 751178 756604 760881 765187 770095 775255 780400 785822 791813 798214 804664 810917 816883 822702
57437 822702 828816 835575 842646 849211 854944 860421 866297 872421 878189 883575 889274 895850 903193 910885
57423 910885 918659 926291 933450 940009 946277 952665 959245 965903 972627 979368 985840 991915 998116 1005250
57409 1005250 1013465 1022095 1030459 1038475 1046363 1054131 1061581 1068560 1074934 1080584 1085663 1090723 1096332 1102650
57395 1102650 1109596 1117278 1125897 1135281 1144894 1154505 1164529 1175414 1186865 1198073 1208762 1219639
57383 1219639 1231557 1244422 1257228 1269078 1279891 1290173 1300451 1311011 1321833 1332533 1342570
57372 1342570 1351743 1360424 1369151 1378099 1387012 1395489 1403243 1410340 1417304 1424785 1432880 1440990 1448518 1455499
57358 1455499 1462315 1469138 1475982 1483152 1491176 1500336 1510543 1521641 1533543 1546168 1559502 1573636
57346 1573636 1588467 1603515 1618397 1633338 1648819 1664839 1681002 1697263 1714057 1731582 1749446
57335 1749446 1767180 1784685 1801995 1819005 1835629 1851889 1867669 1882760 1897350 1912046 1927102
57324 1927102 1941989 1956129 1969764 1983640 1998007 2012480 2026871 2041619 2057140 2073137 2088913
57313 2088913 2104277 2119834 2136299 2153721 2171518 2189143 2206473 2223531 2240208 2256563 2273251
57302 2273251 2291188 2310613 2330648 2350097 2368656 2387235 2406966 2427997 2449402 2470264 2490590
57291 2490590 2510934 2531387 2551448 2570926 2590404 2610477 2630952 2651272 2671448 2692032 2713293
57280 2713293 2734935 2756638 2778420 2800407 2822605 2845039 2867822 2890981 2914446 2938154 2961912
57269 2961912 2985222 3007635 3029330 3050950 3072798 3094551 3115868 3136920 3158154 3179840 3201945
57258 3201945 3224142 3245803 3266378 3286075 3305930 3326952 3349241 3372027 3394404 3415933 3436782
57247 3436782 3457449 3478256 3499035 3519341 3538955 3558041 3576916 3595895 3615207 3634711 3653798
57236 3653798 3672024 3689828 3708115 3727092 3746011 3764194 3781800 3799317 3816815 3834036 3850868
57225 3850868 3867414 3883900 3900783 3918522 3936879 3954785 3971308 3986521 4001083 4015274 4028886
57214 4028886 4041845 4054380 4066597 4078275 4089160 4099207 4108575 4117587 4126667 4136110 4145941 4156078
57202 4156078 4166457 4176866 4186937 4196586 4206301 4216655 4227612 4238563 4249022 4259065 4269117 4279514
57190 4279514 4290213 4300791 4310733 4319758 4327780 4334647 4340174 4344505 4348046 4350879 4352655 4353334 4353538 4353695
57176 4353695 4353157 4350790 4346362 4340802 4335119 4329499 4323552 4316951 4309637 4301673 4293188 4284345 4275278 4266070
57162 4266070 4256792 4247477 4238103 4228604 4218747 4207992 4195754 4181986 4167206 4151711 4135076 4116727
57150 4116727 4096640 4075009 4051530 4025652 3997424 3967517 3936441 3904265 3871051 3836905 3801518
57139 3801518 3764385 3725833 3687284 3650132 3614777 3581082 3549269 3519765 3492449 3466787 3442832
57128 3442832 3421630 3404350 3391074 3380561 3371226 3362359 3354354 3347784 3342536 3338109 3334530 3332351 3331795
57115 3331795 3332566 3334833 3339923 3349703 3365802 3389767 3423415 3468373 3525693 3596743 3684375 3792714
57103 3792714 3926230 4090180 4292478 4545117 4864396 5270706 5787992 6442240 7259768
57094 7259768 8266544 9487442 10943569 12648891 14608722 16818567 19259895 21894934
57086 21894934 24665953 27496680 30287674 32910758 35224605 37120504 38567894 39614605
57078 39614605 40335965 40777751 40938933 40794051 40321089 39511964 38370823 36913205 35168951
57069 35168951 33185143 31026099 28767898 26486817 24247399 22098105 20074081 18199704
57061 18199704 16489024 14949227 13586134 12401883 11382607 10490707 9675950 8898519
57053 8898519 8143264 7415174 6725509 6082386 5489450 4948004 4458454 4020275 3631314
57044 3631314 3287626 2984406 2717160 2481858 2274472 2091153 1928804 1784978 1657346
57035 1657346 1543815 1443030 1354116 1276025 1207762 1149175 1100916 1063811 1039105 1029214 1036759
57024 1036759 1061266 1096178 1129270 1146858 1139420 1105191 1049577 981193 907830 834894 765760
57013 765760 702202 644676 593133 547849 509140 476503 448683 424578 403624 385401 369485
57002 369485 355639 343584 332530 321514 310311 299564 289858 281034 272504 263906 255454 247914 242203
56989 242203 238653 236800 236216 237434 241634 249500 260602 273438 285530 293931 296661 293826 286866 276853
56975 276853 264242 250007 235933 223444 212928 204396 198040 193715 190695 188599 188128 190392 195768
56962 195768 203823 214160 227010 243117 263188 287053 312976 337727 357491 369003 370536 362664
56950 362664 348153 330483 312078 294000 276945 261747 248812 237814 228359 220553 214757 211326
56938 211326 210807 213839 220569 230639 244114 261960 285068 313003 343753 374155 400195 417631
56926 417631 423518 417655 402506 381638 358091 333723 309479 286020 264111 244414 227114 211939
56914 211939 198545 186756 176561 168159 161832 157375 153784 149963 145703 141596 138148 135580 134332
56901 134332 134899 136954 139354 141360 143357 146056 149566 153607 158155 163483 169964 178169 188811 202290
56887 202290 218501 237127 257582 278326 296721 310056 316673 316250 309657 298840 286177 273321
56875 273321 260817 248981 238688 230930 226030 223692 223562 225595 230300 238860 252495 271442 295106
56862 295106 323508 357893 399166 445897 494056 538212 572846 593676 599095 590608 571567 545553
56850 545553 515924 485910 458096 433893 413975 398950 389200 384579 385017 391183 404010 423950
56838 423950 451354 487315 533435 590884 659890 739079 823689 904385 969368 1009066 1019572
56827 1019572 1002752 964360 911938 852752 792110 733166 678158 629289 588239 555419 530235
56816 530235 511960 500174 494684 495479 502905 517775 541209 574230 617257 669500 727973 786294
56804 786294 834827 863772 867824 848362 811166 762544 707743 651443 597542 547990 502903 462367
56792 462367 427427 399007 376739 359523 346857 339135 337000 340911 351124 367655 390167 417875
56780 417875 449096 480529 507262 524190 528045 518562 498128 470404 438873 406058 373626 342792
56768 342792 314410 288806 265897 245517 227457 211343 196791 183785 172600 163226 155149 147866
56756 147866 141411 136106 131836 127801 123075 117394 111358 105941 101885 99476 98563 98543 98578 98267 98016 98339
56740 98339 98870 98667 97542 96359 95734 95162 93999 92644 91996 92159 92515 92874 93703 95206 96972 98666 100431
56723 100431 102360 104147 105531 106703 107978 109394 110820 112191 113397 114205 114570 114875 115639 116978 118461
56708 118461 119524 119966 120034 120042 120050 120040 120259 121007 122057 122756 122829 122715 122905 123331 123733 124210 125062 126370 128122 130409
56688 130409 133069 135428 136803 137101 136643 135781 135076 135340 136875 138954 140646 141895 143198 144547 145459 145839
56672 145839 146012 145942 145211 143818 142306 140967 139550 137918 136437 135519 135180 135153 135081 134610 133684 132765 132407 132657
56654 132657 133184 133787 134377 134731 134811 135066 135790 136429 136310 135866 136221 137630 139200 140227 140882 141422 141699 141816
56636 141816 142410 143736 145075 145571 145232 144724 144529 144629 144682 144279 143336 142328 141849 141918 142162 142492 142964 143034 141850
56617 141850 139516 137280 136103 135691 135263 134624 134050 133651 133331 133041 132729 132380 132247 132575 133033 133030 132742 133087
56599 133087 134335 135491 135552 134784 134197 134258 134711 135307 136109 137188 138410 139490 140217 140862 142258 144903 147954
56582 147954 149811 149910 149264 149032 149327 149788 150525 151869 153783 156043 158513 160792 162279 163119 164487 167276
56566 167276 171092 175196 179857 185942 193590 202250 211793 222652 234751 246930 257547 265348 269946
56553 269946 271928 272392 272014 270713 268475 266007 264038 262315 260007 256915 253642 250632 247685 244570 241542
56538 241542 239067 237257 235680 233626 230641 227041 223769 221568 220366 219549 218588 217234 215470 213536 211798
56523 211798 210292 208659 206672 204504 202302 199937 197502 195600 194642 194180 193376 191927 190161 188443 186905
56508 186905 185547 184272 182907 181347 179510 177152 174241 171566 170305 170646 171515 172059 172648 173834 175112
56493 175112 175627 175579 175944 177058 178379 179464 180341 180989 181338 181825 183196 185588 188321 190669 192334 193204
56477 193204 193301 193023 192917 193065 193115 192943 192844 193009 193256 193393 193453 193487 193390 193070 192560 191979 191596 191774 192549 193347 193440
56456 193440 192686 191612 190882 190909 191799 193291 194806 195940 196903 198267 200320 202792 205097 206677 207294 207221
56440 207221 207030 207053 207238 207547 208080 208636 208594 207567 205857 204007 202225 200540 199113 198051 197256 196758 196758 197085
56422 197085 197106 196606 196241 196613 197395 197897 198070 198315 198706 199053 199434 200023 200667 201223 202047 203513 205298 206728
56404 206728 207634 208277 208655 208498 207796 206852 205963 205474 205833 207105 208758 210424 212425 214998 217486 219053
56388 219053 219844 220660 221832 223178 224717 226492 227925 228271 227649 226812 226042 225149 224422 224539 225457 226356 226907
56371 226907 227742 229367 231366 233071 234450 235921 237687 239522 240991 241754 241893 241971 242535 243624 244985 246551
56355 246551 248345 250116 251492 252395 253011 253592 254589 256513 259206 261558 262520 262177 261434 261038 261358 262556
56339 262556 264347 265976 267115 268338 270177 272291 274303 276797 280554 285236 289775 293649 296905 299436
56325 299436 301296 303241 305844 308485 310303 311695 313606 315774 317112 317584 318200 319247 320007 320243 320512
56310 320512 320933 321113 321530 323475 327175 331290 334692 337637 340837 344585 349146 354703 360441 364940 368001
56295 368001 370974 374710 378410 381157 383468 386479 390473 395062 400180 406141 413158 421277 430289 439491
56281 439491 448160 456457 465162 474415 483621 492699 502326 512668 523068 533439 544850 558087 572636
56268 572636 587728 603516 620542 638972 659029 681449 706822 735085 766237 800952 840093
56257 840093 884345 934677 992303 1057702 1130466 1210571 1298948 1396324 1502410 1616787 1739655
56246 1739655 1870959 2009447 2153186 2300256 2448260 2593792 2733035 2862398 2978255
56237 2978255 3077000 3156006 3213868 3249309 3260797 3247987 3212718 3157812 3085528 2997894 2897800
56226 2897800 2788769 2673844 2555318 2435175 2315223 2196963 2081613 1969943 1862023
56217 1862023 1757779 1657973 1564013 1476695 1395918 1321676 1254203 1192781 1135553 1081235 1030163
56206 1030163 983134 940011 900067 862926 828571 797101 768939 744586 723725 705259 688502
56195 688502 673561 660435 648696 638326 629642 622104 614406 606282 598985 593394 588903 584812 581482
56182 581482 579272 577537 575631 573862 572579 571308 569747 568626 568751 570036 572232 575536 579715 583715
56168 583715 587091 590795 595645 601113 606554 612518 619741 627839 636186 645228 655824 668040 681561
56155 681561 696431 712400 728505 744438 761609 781757 805093 830685 857983 887280 919638
56144 919638 957123 1002077 1055280 1115845 1183662 1260478 1347154 1440923 1536608 1629639 1716791
56133 1716791 1795393 1863898 1923073 1975486 2023951 2070776 2117103 2161690 2201086 2232087 2253473
56122 2253473 2265027 2266546 2258902 2244425 2224408 2197091 2159371 2109481 2046940 1971605 1884857 1790894
56110 1790894 1695013 1601035 1511462 1428855 1355197 1290584 1234073 1185262 1143814 1108478 1078115
56099 1078115 1052937 1033368 1018471 1006777 997711 990875 985083 979618 975454 973714 973893 974984 977206
56086 977206 981061 985821 990565 995666 1001744 1008328 1015089 1023031 1032791 1043051 1052432 1061646 1071961 1083002
56072 1083002 1094024 1105942 1119943 1135324 1150813 1166709 1183619 1200489 1216161 1231512 1247655
56061 1247655 1263431 1277226 1289887 1303243 1317008 1329978 1343059 1358072 1374523 1390483 1405936
56050 1405936 1422344 1439672 1456719 1473836 1492587 1513218 1534926 1557943 1582854 1608761 1634690
56039 1634690 1661969 1692555 1725964 1760336 1795461 1832128 1869776 1907633 1946869 1988673 2031557
56028 2031557 2073564 2115608 2159431 2203873 2246772 2289012 2332974 2378449 2423979 2470776 2521166
56017 2521166 2574445 2628509 2684335 2744542 2808697 2874565 2942828 3015976 3093506 3172907 3254467
56006 3254467 3340517 3431005 3524586 3622889 3728677 3840942 3956943 4077859 4207014 4343915
55996 4343915 4485765 4633694 4791464 4959211 5134683 5319499 5517681 5729108 5951204
55987 5951204 6186039 6438799 6710314 6998328 7305025 7635752 7991628 8371540 8780195
55978 8780195 9225745 9710805 10234795 10803740 11428257 12113737 12863132 13688192 14607214
55969 14607214 15633808 16780278 18070734 19538621 21214442 23131717 25344846 27928080
55961 27928080 30962120 34541009 38790101 43858155 49897041 57076509 65625657 75852188
55953 75852188 88144724 102991963 120984069 142760070 168978397 200315296 237151557
55946 237151557 278593865 321276931 359248094 385786509 396282857 390127329 370349821
55939 370349821 341665759 308559996 274388464 241342952 210714126 183150393 158870423
55932 158870423 137819466 119765424 104374653 91288632 80170232 70707956 62617057
55925 62617057 55657587 49641330 44414518 39845133 35829074 32291041 29168726 26403376
55917 26403376 23947373 21767481 19833706 18113111 16577765 15208887 13988686 12896213
55909 12896213 11914516 11033622 10242902 9527902 8877790 8288663 7756257 7271928 6828456
55900 6828456 6423359 6053624 5713008 5397034 5105136 4835745 4584608 4349754 4132712
55891 4132712 3933030 3746855 3572553 3412348 3266656 3132053 3006607 2892182 2789558
55882 2789558 2696088 2609748 2530525 2456114 2381296 2303821 2226486 2151510 2077293 2002576 1929177
55871 1929177 1858349 1788592 1719389 1653268 1591917 1533853 1477950 1425713 1378044 1333203 1290080
55860 1290080 1250337 1215412 1184375 1156354 1131977 1110854 1090828 1071318 1054154 1039435 1023825
55849 1023825 1004810 983634 962274 940606 918375 896959 877006 857030 836219 816110 797707
55838 797707 779685 761287 744333 730290 717795 705037 692283 680199 668032 655450 643977
55827 643977 634635 626187 617490 609467 602838 596023 587295 577210 567090 556941 546690 537542 530162
55814 530162 523169 515336 507740 501964 497845 494721 493226 493872 495407 496646 498694 503380 510523 518449
55800 518449 526143 533182 538546 541231 541342 539183 534108 525545 514336 501869 488781 475661 464015
55787 464015 455270 449433 445524 442366 438290 431429 421441 409983 398667 387702 377139 367857 360271
55774 360271 353501 346983 341573 337979 335457 333180 331418 330208 328276 324739 320538 316850 313300 309099
55760 309099 304670 300701 296771 292440 288575 286087 284253 281682 278035 273544 267960 261444 255453 251152
55746 251152 247754 243893 239771 236447 233867 231190 228410 226019 223644 220534 217058 214261 212243 210256
55732 210256 208145 206551 205890 206032 206616 206837 205508 202288 198351 194973 192122 189229 186550 184661 183383
55717 183383 182254 181354 180573 178945 175988 173046 171927 172690 173980 175012 175889 176471 176399 176118 176624 178148
55701 178148 179909 180968 180599 178357 174699 171143 168816 167241 165373 163300 161909 161456 161574 162254 163601
55686 163601 165006 165751 166276 167781 170692 174441 178521 182833 187189 191404 195687 200164 204203 207018 208629
55671 208629 209453 209348 207968 205755 203672 202238 201634 202331 204587 207606 210198 212115 213897 215624 216747
55656 216747 216971 216437 215195 213391 211775 211085 210920 210040 207780 204517 200869 197139 193415 189498 184726
55641 184726 178541 171311 164173 158163 153691 150493 147687 144356 140552 137375 135637 134998 134802 135012 135649
55626 135649 136106 135899 135484 135504 135767 135764 135591 135420 134704 132946 130752 129088 127871 126328 124347 122404 120519
55609 120519 118334 116037 114225 113048 112286 111894 111708 111085 109779 108660 108573 109023 109146 109345 110573 112372
55593 112372 113167 112436 111182 110294 109768 109644 110376 111969 113806 115556 117346 119040 120363 121818 124397 128287
55577 128287 132800 137642 143236 149775 157078 165476 175702 187647 200188 212381 223763 233413 239990
55564 239990 243156 243871 242777 239228 232423 222743 211544 200342 190496 182778 176741 171091 165002 158579
55550 158579 152013 145276 138860 133827 130572 128258 125937 123568 121589 120169 119368 119378 120110 121019 121692 122161
55534 122161 122451 122399 122105 121910 121622 120491 118251 115621 113385 111617 110129 108997 108137 106934 104829 101915
55518 101915 98645 95362 92446 90427 89488 89181 88947 88555 87873 86724 85295 84260 84050 84383 84763 85075
55502 85075 85319 85170 84223 82497 80429 78547 77330 77073 77622 78377 78729 78401 77434 76157 75126 74724 74753
55485 74753 74813 74978 75617 76564 77126 77089 77119 77840 79033 80112 80989 82036 83418 84825 85757 85921 85468 84920
55467 84920 84733 84852 84912 84771 84576 84341 83902 83369 83234 83815 84818 85591 85717 85257 84503 83546 82196 80512
55449 80512 79246 79173 79930 80213 79514 78845 79166 79895 79888 79242 78964 79269 79483 79459 79735 80233 80087 79099 78257 78372
55429 78372 79152 80042 81050 82246 83198 83486 83205 82567 81602 80595 80178 80578 81369 82302 83736 85842 88011
55412 88011 89526 90265 90383 89872 88916 88078 87614 87080 86096 85039 84432 84078 83375 82226 81184 80791 81118 81785
55394 81785 82236 82199 82004 82194 82839 83638 84617 86110 87925 89256 89719 89820 90073 90260 89948 89171 88180 87052
55376 87052 85986 85431 85465 85510 85118 84581 84265 83877 82957 81772 81110 81360 82179 82793 82362 80488 77856 75931
55358 75931 75518 75925 76036 75798 76007 76928 77903 78263 78016 77519 76999 76518 76089 75647 75130 74642 74397 74500 74885
55339 74885 75422 75957 76319 76429 76388 76381 76539 76875 77281 77575 77643 77450 76907 76001 75185 75231 76278 77391 77605 77081
55319 77081 76607 76279 75613 74829 74928 76266 77930 78878 78927 78369 77446 76636 76653 77603 78728 79424 79890 80324 80192
55300 80192 78957 76958 74967 73350 72250 72070 73031 74554 75751 76380 76807 77324 78002 78925 80026 80844
55284 80844 80964 80618 80479 80972 82007 83137 83746 83402 82384 81550 81364 81349 80890 80198 80047 80777 81999 83159
55266 83159 84007 84576 84969 85158 85021 84654 84484 84687 84708 83950 82853 82482 83022 83553 83539 83549 84108 84772 84926 84624
55246 84624 84023 82819 81077 79835 79941 80795 81223 81143 81387 82218 83032 83454 83804 84317 84585 84033 82654 81146
55228 81146 80353 80347 80120 78707 76675 75686 76348 77468 77942 78275 79321 80508 80584 79537 78519 78201 78368 78885
55210 78885 79921 81249 82330 83073 83714 84142 84166 84175 84586 84929 84500 83671 83372 83495 83149 82441 82509 83491 83935
55191 83935 82891 81376 80957 81752 82686 83008 82796 82488 82633 83697 85439 86785 86943 86392 86234 86738 87084
55174 87084 86561 85514 84895 85093 85498 85343 84817 84915 86110 87628 88418 88410 88248 88122 87657 86813 86087 85718 85411
55155 85411 84988 84715 84742 84819 84782 84847 85150 85486 85744 86117 86614 86780 86285 85462 85018 85402 86585 88123 89242
55136 89242 89212 87975 86264 84941 84364 84449 85047 86047 87282 88519 89516 90055 90028 89527 88779 88025 87483 87268
55118 87268 87241 87129 86911 86797 86766 86543 86289 86752 88240 89901 90629 90364 89882 89643 89564 89644 90007 90442 90699 91118
55098 91118 92169 93462 94070 93845 93498 93345 93030 92654 93083 94575 96030 96301 95615 95042 95136 95734 96606 97522
55080 97522 98000 97787 97539 98330 100336 102409 103220 102588 101530 101126 101521 102067 102256 102183 102050 101654 100706 99416
55062 99416 98333 97712 97388 97111 96618 95604 94130 92951 92864 93762 94854 95708 96489 97200 97443 97117 96742 96775
55044 96775 97039 97056 96593 95717 94643 93670 93018 92660 92530 92754 93366 93995 94271 94331 94418 94240 93427 92407 92037
55025 92037 92457 93108 93779 94780 96040 97009 97581 98224 98992 99321 99010 98514 98088 97615 97487 98509 100435 101724
55007 101724 101432 100374 99742 99546 99283 99209 99897 101172 102514 104014 105928 107695 108406 108030 107332 106750 106108
54990 106108 105279 104404 103552 102775 102329 102301 102248 101780 101246 101214 101556 101730 101701 101863 102169 102165 101854 101834 102445 103380 104253
54969 104253 105073 106018 107112 108195 108921 108917 108290 107865 108450 109896 111271 111926 111967 111728 111249 110386 109149 107826
54951 107826 106915 106879 107772 109201 110752 112256 113499 114071 113825 113206 112761 112565 112415 112238 111945 111187 109782
54934 109782 108167 107003 106531 106756 107935 110346 113795 117835 122246 126795 130887 134218 137533 141916 147243
54919 147243 152116 155404 157168 157896 157555 155795 152597 148330 143526 138927 135314 132877 130922 128576 125716
54904 125716 122970 120902 119470 118291 117166 116183 115404 114746 114261 114279 114963 115859 116289 116185 116131 116555 117360 118455
54886 118455 120037 122055 124026 125855 128343 132329 137657 143507 149367 155054 160154 164139 166935 168740
54872 168740 169425 168654 166481 163247 159035 153825 148093 142609 137723 133400 129900 127714 126828 126670 126812
54857 126812 127056 126843 125483 123208 121238 120390 120175 119651 118606 117462 116429 115280 113689 111450 108576
54842 108576 105529 103134 101935 101736 101927 102020 101757 101027 100015 99233 99034 99192 99192 98896 98714 99111 100056 100986
54824 100986 101301 100925 100397 100316 100769 101421 102004 102466 102731 102695 102559 102829 103776 105043 105942 106052 105487 104697 104132
54805 104132 104033 104491 105534 106977 108166 108296 107252 105898 105185 105187 105412 105804 106813 108470 110041 110832 110926
54788 110926 110938 111353 112298 113648 115095 116324 117242 117930 118377 118544 118681 119218 120260 121569 123137 125349 128428
54771 128428 132123 136267 141205 147221 153773 159777 164601 168422 171544 173735 174432 173417 171070 167965
54757 167965 164397 160429 156294 152469 149253 146477 143863 141465 139442 137559 135327 132666 130066 127942
54743 127942 126212 124671 123446 122765 122506 122386 122563 123635 125853 128515 130499 131419 132027 133311 135434 137864
54727 137864 140385 143449 147435 152020 156582 160790 164450 167075 168165 167750 166320 164324 162024 159577
54713 159577 156805 153183 148603 143948 140275 137601 135197 133049 132065 132541 133273 132797 131038 129125 127887
54698 127887 127130 126202 124781 123043 121428 120299 119678 119314 119057 119015 119124 118786 117308 114799 112380 111290
54682 111290 111759 112852 113429 113123 112315 111422 110592 110041 110102 110656 111004 110784 110590 111105 111888 111752 110323 108542
54664 108542 107457 107140 106981 106569 106028 105813 106368 107704 109202 110153 110537 110931 111643 112404 112942 113325 113643 113905
54646 113905 114314 115046 115607 115169 113872 112970 113141 113414 112579 111137 110756 111966 113370 113383 112030 110672 110388
54629 110388 111082 111978 112602 113100 113670 113999 113603 112649 111958 112001 112349 112397 112220 112243 112463 112579 112656 113075 113866 114717
54609 114717 115573 116654 117825 118568 118776 118986 119506 119818 119258 118000 116886 116454 116553 116762 116794 116489 115807 114934
54591 114934 114110 113308 112410 111719 111904 113147 114703 115634 115743 115410 114805 113861 112971 112971 114183 115972 117477 118317
54573 118317 118323 117280 115506 114172 114253 115374 116390 116933 117596 118662 119521 119644 119398 119465 119967 120533 120887 120980
54555 120980 120816 120503 120314 120435 120827 121455 122438 123791 125221 126392 127253 127984 128761 129601 130304 130587 130470 130450
54537 130450 130935 131615 131798 131307 130518 129550 128105 126244 124653 123829 123549 123445 123491 123574 123221 122332 121652 121878
54519 121878 122668 123154 123152 123198 123611 124171 124635 125009 125287 125357 125199 124864 124383 124007 124285 125430 126786 127394 127024
54500 127024 126187 125294 124372 123535 123063 122907 122680 122381 122630 123880 125756 127471 128648 129437 130097 130766 131518
54483 131518 132283 132687 132291 131154 130034 129779 130550 131784 132894 133724 134226 134125 133405 132880 133651 135887 138626
54466 138626 140931 142724 144326 145731 146748 147404 147699 147308 145986 144118 142409 141165 140190 139196 138008
54451 138008 136564 135099 134120 133887 134080 134284 134479 134701 134600 133871 132896 132340 132281 132255 132060 131930 132054 132513 133558
54432 133558 135296 137027 137641 136865 135571 134689 134352 134341 134730 135626 136616 137030 136757 136528 137322 139435 142046
54415 142046 143741 143669 142215 140437 139038 138127 137703 137809 138225 138514 138492 138278 137878 137199 136569 136713 137952 139812
54397 139812 141636 143234 144655 145703 146063 145774 145248 144925 145003 145387 145719 145578 144803 143601 142373 141585 141676
54380 141676 142767 144380 145748 146502 146808 146862 146709 146668 147470 149555 152464 155313 157772 160284 163325 166686
54364 166686 169542 171144 171408 170879 170185 169634 169324 169333 169501 169243 168024 166063 164175 162836 161740 160339 158414
54347 158414 155992 153187 150429 148476 147724 147648 147305 146348 145220 144421 143989 143853 144331 145836 148053 149846
54331 149846 150305 149727 149169 149067 148897 148266 147681 147692 147861 147402 146507 146134 146476 146616 145961 145146 145018 145382 145394
54312 145394 144773 143977 143338 142608 141363 139577 137778 136723 136751 137333 137538 137095 136713 137158 138343 139604 140521
54295 140521 141096 141410 141524 141607 141825 142186 142696 143477 144487 145363 145794 145862 145752 145435 144936 144647 144938 145675 146493
54276 146493 147237 147740 147532 146467 145432 145635 147113 148679 149497 150002 150948 152269 153440 154504 155998 158010
54260 158010 159884 160950 161163 160990 160996 161593 162841 164246 165058 164988 164534 164343 164346 163815 162308 160243 158439 157418
54242 157418 157336 158143 159334 159849 158929 157061 155446 154447 153281 151526 150074 150001 151119 152413 153436 154374
54226 154374 155072 155079 154644 154607 155072 155181 154603 154309 155200 156732 157715 157908 157938 157967 157427 156059 154359 152839 151544
54207 151544 150477 149892 149772 149530 148634 147319 146398 146478 147471 148639 149081 148454 147336 146636 146581 146662 146623 146905 147790
54188 147790 148709 148980 148940 149588 151220 153024 154132 154523 154768 155323 156354 157840 159485 160687 160908 160136 158913
54171 158913 157900 157353 156900 155931 154331 152742 151864 151654 151557 151384 151447 151823 152045 151752 151204 150831 150607 150170
54153 150170 149304 148032 146511 145108 144346 144457 145138 145980 146854 147652 147961 147406 146200 144996 144289 144185 144600
54136 144600 145364 146290 147386 148827 150537 152034 153009 153718 154465 155057 155303 155732 157178 159706 162588 165290
54120 165290 167909 170630 173363 175997 178511 180762 182670 184604 186993 189424 190763 190416 188918 187076
54106 187076 185098 182879 180533 178161 175532 172502 169462 166934 164928 163094 161320 159863 159089 159302 160603
54091 160603 162563 164295 165174 165336 165200 164787 163893 162706 161796 161576 162099 163299 165035 166974 168804 170561
54075 170561 172434 174310 175861 177046 178189 179489 180801 181939 182862 183422 183260 182294 181141 180741 181475 182733
54059 182733 183398 182786 181230 179872 179781 181109 183045 184706 186088 187934 190568 193132 194417 194377 194355 195675
54043 195675 198421 201908 205863 210618 216393 222941 229902 237039 244139 251085 257969 264787 271112 276559
54029 276559 281383 286083 290498 294038 296813 299678 302966 305995 308201 309950 311722 313275 314256 314969 315662
54014 315662 315547 313502 309566 304935 300571 296536 292575 288533 284125 279070 273666 268625 264138 259702
54000 259702 255149 251292 249030 248133 247352 245642 242984 240077 237537 235535 234058 233234 233182 233612 233955 234097
53984 234097 234706 236556 239694 243537 247647 252127 257422 263971 271701 279316 284290 284379 279522 271962 264316
53969 264316 257704 251703 245599 239351 233637 229290 226632 225165 223991 222638 221432 220967 221316 221846 221816
53954 221816 221126 220478 220679 221778 223026 223767 224180 224998 226699 229216 232231 235435 238553 241423 244090 246721
53938 246721 249527 252847 256920 261285 264794 266808 268185 270427 273913 277604 280542 282943 285608 288929
53924 288929 292902 297586 302996 308856 314940 321499 328917 337074 345434 353713 362109 370836 379801 388850
53910 388850 398041 407414 416492 424224 429661 432794 434600 436099 437424 437982 437425 436059 434293 432085 429182
53895 429182 425565 421307 416194 409972 402940 395890 389261 382602 375070 366335 356875 347509 338854 331146
53881 331146 324274 317888 311693 305849 300958 297372 294526 291241 286746 281209 275251 269288 263626 258783
53867 258783 255226 252761 250572 248041 245346 243136 241780 241021 240272 239146 237653 235925 233857 231232 228205
53852 228205 225405 223297 221659 219983 218262 217000 216439 216174 215700 215064 214666 214527 214122 213064 211771 211186
53836 211186 211759 212911 213668 213730 213651 214027 214788 215352 215225 214335 213077 212186 212236 213062 213904 214272 214410 214705 215062
53817 215062 215267 215635 216782 218826 221246 223518 225566 227646 230087 233085 236472 239813 242999 246632 251466
53802 251466 257547 264214 270774 276891 282553 288094 294061 300562 306823 311916 315842 319391 322974 326174
53788 326174 328423 329558 329663 329017 328278 328083 328155 327378 325094 321856 318580 315428 311957 308080 304338 301226
53772 301226 298490 295183 290462 284467 278344 273230 269237 265711 262194 258666 255062 251279 247694 244946
53758 244946 242990 241030 238643 236308 234466 232713 230427 227667 224920 222390 220059 218110 216720 215699
53744 215699 214826 214324 214529 215267 215921 216004 215378 214188 212896 212082 211844 211687 211338 211304 212090 213210 213698 213463
53726 213463 213475 214539 216425 218349 219880 221179 222647 224469 226379 227861 228658 229009 229279 229619 230183 231364
53710 231364 233387 235898 238382 240837 243595 246637 249621 252543 255769 259341 262759 265687 268432 271480
53696 271480 274841 278121 281029 283615 286076 288486 290620 292014 292268 291407 289881 288258 286980 286352 286506
53681 286506 287328 288460 289461 289998 290022 289792 289595 289376 288855 288085 287603 287808 288407 288771 288618 288059 287195 286165
53663 286165 285452 285641 286692 287782 288018 287143 285516 283704 282227 281457 281508 282233 283410 284916 286654 288347
53647 288347 289527 289847 289484 289128 289409 290389 291740 293244 294836 296306 297519 298910 301161 304140 306770
53632 306770 308298 309154 310180 311572 313194 315368 318489 322086 325072 326946 328101 329017 329837 330791 332325
53617 332325 334602 337344 340315 343529 346893 350100 353055 356013 359228 362766 366655 370783 374666 377810
53603 377810 380372 382949 385697 388236 390524 393163 396520 400053 402784 404075 403772 402113 399792 397621
53589 397621 395847 394155 392515 391400 390871 390066 388177 385461 382756 380403 378246 376313 374828 373728 372776
53574 372776 371992 371375 370363 368321 365596 363416 362501 362271 361675 360370 358763 357251 355871 354593 353591
53559 353591 353058 352893 352731 352351 351924 351703 351604 351390 351329 352205 354336 356915 358753 359519 359868 360475 361430 362528
53541 362528 363584 364363 364741 365209 366765 369886 373885 377691 381142 385078 390217 396424 403176 410337 418104
53526 418104 426442 435015 443718 452960 463235 474613 486714 499005 511048 522794 534927 548646
53514 548646 564564 581902 599240 616135 633513 652346 672535 693412 714716 736451 758145
53503 758145 779050 799066 818835 838813 858736 878121 896790 914735 931961 948748 965580
53492 965580 982423 998477 1013208 1027422 1042709 1059720 1077460 1094412 1110029 1124966 1140186
53481 1140186 1156173 1172854 1189880 1206848 1223399 1239271 1254266 1268208 1280925 1292240 1301897
53470 1301897 1309501 1314654 1317264 1317687 1316439 1313643 1308795 1301251 1291004 1278947 1266284 1253684 1241027
53457 1241027 1227887 1214102 1199877 1185467 1170861 1155762 1139859 1123179 1106194 1089463 1073155
53446 1073155 1057008 1040821 1024784 1009190 993974 978857 963972 950077 937990 928021 920061 914012
53434 914012 909774 906878 904525 902200 900142 898991 899112 900373 902531 905569 909598 914641 920672 927793
53420 927793 936242 946254 958005 971529 986529 1002321 1018328 1034671 1052100 1071197 1091835 1113478
53408 1113478 1135796 1158811 1182663 1207484 1233447 1260729 1289479 1319934 1352495 1387534 1425194
53397 1425194 1465435 1508033 1552409 1597765 1643728 1690603 1738647 1787361 1835982 1884435 1933186
53386 1933186 1982174 2030618 2077924 2124068 2168806 2211280 2250965 2288503 2324993 2360652 2394633
53375 2394633 2425897 2453756 2477744 2497528 2513053 2524486 2531877 2534985 2533283 2526041 2512616 2492923
53363 2492923 2467530 2437247 2402828 2365141 2325171 2283563 2240507 2196357 2151926 2107790 2063673
53352 2063673 2019082 1974313 1930403 1888281 1848336 1810429 1773809 1737327 1700349 1663227 1626407
53341 1626407 1589520 1552161 1515207 1480294 1448044 1417762 1388923 1361896 1336967 1313713 1291882
53330 1291882 1272034 1254717 1239621 1226099 1213873 1202571 1191168 1178687 1165253 1151766 1138691
53319 1138691 1125778 1112909 1100605 1089479 1079499 1070011 1060464 1051148 1043140 1037350 1033690 1031402 1030072
53306 1030072 1029783 1030372 1031226 1032072 1033399 1035818 1039642 1045372 1053759 1064797 1077304 1090292 1104269 1120356
53292 1120356 1138546 1157787 1177576 1198446 1220804 1244153 1267668 1290812 1313107 1333978 1353225
53281 1353225 1371165 1387985 1403334 1416812 1428490 1438567 1446787 1452514 1455275 1455033 1452128 1447123 1440524
53268 1440524 1432374 1422183 1409417 1394004 1376343 1356960 1336307 1314769 1292631 1269988 1246752
53257 1246752 1222840 1198424 1173891 1149452 1124855 1099742 1074361 1049576 1025924 1002980 980028
53246 980028 957117 934855 913266 891512 868980 846150 824022 803013 782799 763044 743873
53235 743873 725612 708374 692069 676722 662630 650146 639292 629694 620960 613014 605836 598956
53223 598956 591577 583380 574954 567157 560084 552876 544481 534443 522968 510485 497327 483732 470004
53210 470004 456651 444380 433879 425349 418207 411411 404276 396949 390034 383826 378032 372117 365740
53197 365740 358879 351777 344771 338025 331394 324666 317837 311009 304163 297368 291093 285857 281552 277584
53183 277584 273761 270536 268141 266067 263762 261403 259495 258066 256757 255471 254418 253642 252927 252068 250941
53168 250941 249511 248146 247562 247962 248487 248139 247029 246048 245407 244414 242726 240986 239864 239204 238535 237823 237232
53151 237232 236570 235564 234383 233448 232865 232395 231796 230911 229695 228464 227859 228160 228801 228983 228629 228346 228601
53134 228601 229362 230520 232142 234136 236028 237329 238011 238475 239149 240163 241329 242332 243018 243559 244314 245481
53118 245481 246857 247967 248478 248606 249030 250216 251826 253006 253325 253186 253198 253447 253610 253503 253154 252470 251298
53101 251298 249798 248350 247038 245595 243999 242725 242175 242094 241850 241098 239916 238445 236787 235227 234114
53086 234114 233428 232728 231749 230804 230352 230317 230146 229481 228539 227785 227476 227651 228316 229421 230674 231571 231698 231021
53068 231021 229896 228804 228037 227587 227310 227131 227031 226887 226491 225800 225076 224717 224959 225669 226359 226485 225952 225318
53050 225318 225261 225823 226452 226820 227224 227943 228557 228340 227207 225896 225208 225346 225963 226540 226699 226434 226181 226426
53032 226426 227176 227942 228303 228322 228314 228436 228605 228710 228768 228892 229199 229702 230267 230689 230867 230938 231228 232005 233106 233914
53012 233914 233906 233308 232902 233087 233452 233482 233356 233608 234255 234760 234797 234560 234301 234010 233692 233512 233556 233704 233949 234508
52992 234508 235488 236656 237679 238384 238790 239191 240266 242620 246002 249320 251713 253331 254810 256347 257641
52977 257641 258433 258700 258484 257983 257700 258075 258956 259805 260404 261035 261900 262763 263306 263555 263747 263924 263852 263235 261933
52958 261933 260124 258377 257414 257542 258268 258647 258133 257050 256139 255641 255009 253591 251475 249447 248179 247747
52942 247747 247958 248792 250187 251583 252100 251282 249517 247683 246521 246314 246862 247565 247732 247122 246255 245983 246697
52925 246697 248022 249315 250227 250651 250377 249232 247530 246051 245423 245690 246532 247558 248250 248093 247172 246374 246504
52908 246504 247311 247825 247622 247155 246789 246116 244599 242464 240569 239582 239657 240708 242520 244625 246415 247572
52892 247572 248239 248750 249291 249832 250231 250346 250068 249302 247980 246164 244169 242461 241459 241424 242450 244336 246510
52875 246510 248431 250167 252353 255392 258921 262247 265118 267817 270662 273645 276479 278695 279808 279655
52861 279655 278617 277195 275379 272688 268953 264781 261058 258177 255932 253953 251882 249209 245406 240574
52847 240574 235712 232012 229906 229012 228843 229164 229614 229549 228602 227171 225969 225276 224919 224777 224888 225151 225348
52830 225348 225518 225916 226544 226993 226898 226250 225257 224113 222981 222004 221299 221063 221534 222599 223664 224336 225000 226208
52812 226208 227675 228625 229071 229808 230911 231210 229837 227525 225680 224742 224197 223689 223226 222560 221314 219700
52796 219700 218454 217995 218159 218659 219256 219587 219495 219464 220075 221050 221523 221291 221051 221214 221321 220960 220564 220747 221398
52777 221398 221949 222174 222177 221916 221316 220651 220254 219939 219194 217969 216855 216430 216766 217604 218646 219587 220199 220622
52759 220622 221322 222513 223717 224159 223603 222614 221929 221808 222139 222991 224702 227326 230304 232939 235015 236696
52743 236696 237990 238723 239055 239606 240818 242433 243793 244487 244519 244071 243429 243055 243391 244478 245963 247484 248901
52726 248901 250033 250460 249818 248264 246458 245014 244078 243444 242916 242427 241954 241531 241366 241745 242707 243865 244610
52709 244610 244491 243461 241948 240656 240095 240143 240221 239974 239618 239485 239481 239289 238947 238817 238922 238772 238030 237124 236835
52690 236835 237344 237981 238003 237399 236775 236597 236826 237261 237912 238767 239404 239154 237687 235269 232565 230408 229650 230656
52672 230656 232765 234645 235475 235578 235702 236025 236242 236361 236881 238150 239911 241584 242800 243607 244371 245488
52656 245488 247124 249231 251804 254862 257987 260184 260634 259496 257667 255828 254088 252404 250868 249526
52642 249526 248335 247442 247118 247281 247420 247184 246749 246362 245849 244897 243706 242995 243354 244711 246450 247970 249123
52625 249123 250213 251525 252898 253791 253809 253069 252019 251035 250215 249497 248912 248713 249196 250274 251355 251818 251624
52608 251624 251299 251330 251708 252054 251991 251442 250714 250362 250775 251824 253024 254028 254858 255695 256630 257650 258653 259439
52590 259439 259822 259909 260139 260950 262358 263917 265136 265962 266747 267662 268322 268308 267913 267876 268275 268335 267575 266540 265880
52571 265880 265369 264539 263804 263933 264649 264810 263997 262921 262064 260951 259206 257406 256269 255676 255122 254544 254071
52554 254071 253465 252518 251650 251426 251719 251957 251933 251743 251217 250136 248908 248320 248572 249148 249671 250335 251382 252609
52536 252609 253570 253911 253500 252587 251818 251738 252290 253213 254706 257108 259912 261943 262799 263411 264729 266460 267688
52519 267688 268266 268831 269668 270398 270894 271784 273693 276398 279151 281614 284107 287005 290180 293012 294761 294903
52503 294903 293398 290740 287644 284576 281606 278708 275973 273432 270898 268219 265643 263652 262428 261674
52489 261674 261011 260392 260063 260319 261325 263048 265179 267237 268826 269765 270033 269766 269300 269021 269125 269713 271053
52472 271053 273347 276122 278287 279202 279515 280576 283130 286785 290581 293706 295809 297069 298076 299254 300263
52457 300263 300210 298598 295899 293048 290576 288322 285855 282996 280034 277560 276026 275296 274717 273769 272608
52442 272608 271755 271296 270699 269585 268417 267964 268152 267906 266396 264105 262325 261833 262433 263607 265018 266324
52426 266324 267059 267026 266493 265789 265016 264329 264185 264934 266402 268145 269898 271556 272976 274241 275927 278617
52410 278617 282206 286150 290442 295901 303249 312134 321205 328971 334492 337452 337877 335913 331926 326669
52396 326669 321107 315832 310767 305655 300753 296790 294245 292908 292226 291889 291960 292568 293579 294618 295384 295949
52380 295949 296652 297672 298854 300067 301528 303584 306261 309223 312150 315006 318049 321656 325981 330554
52366 330554 334414 336897 338153 338698 338700 338158 337547 337592 338290 338710 338082 336652 335228 334258 333752 333779 334516 335878
52348 335878 337528 339289 341187 343065 344519 345422 346241 347562 349420 351369 353175 355195 358006 361863 366658
52333 366658 372236 378570 385736 393866 403066 413147 423555 433803 444005 454692 466107 477954
52321 477954 489860 501688 513279 524297 534714 545196 556618 569314 583040 597509 612627
52310 612627 628210 643826 659056 673892 688875 704793 721995 739937 757693 774988 792316
52299 792316 809799 826456 841123 853767 865226 875815 884821 891398 895405 897225 897270 895864 893301
52286 893301 889826 885666 881066 876108 870714 865137 860251 856847 854715 852916 850935 849086 847905 847720
52272 847720 848775 851077 853984 856637 858993 861852 865660 869994 874503 879615 885928 893567 902677 913869
52258 913869 927448 942601 958085 973479 989184 1005415 1021798 1037719 1052489 1065333 1075852
52247 1075852 1084393 1091439 1096757 1099715 1100309 1099201 1096739 1092625 1086722 1079640 1072246 1064942 1057600 1049901
52233 1049901 1041580 1032641 1023439 1014341 1005313 996089 986666 977309 968144 959149 950556 942772 935851 929444
52219 929444 923359 917719 912513 907573 903170 900090 898748 898758 899707 901789 905103 908756 911441 912819 913719
52204 913719 915016 916900 919359 922729 927376 933158 939572 946343 953635 961715 970534 979568 987989 995023
52190 995023 1000234 1003509 1004870 1004479 1002726 1000027 996342 991104 983873 975061 965853 957412 950224 944139
52176 944139 938769 933745 928791 923846 919155 915082 911735 908906 906491 904822 904400 905293 907056 909252 911787
52161 911787 914580 917191 919096 920265 921126 921955 922615 922969 923165 923311 923185 922653 922167 922430 923557 924952 926042
52144 926042 926758 927198 927254 926833 926142 925390 924451 923233 922234 922263 923561 925614 928000 931047 935438 941445 948907
52127 948907 957811 968559 981550 996735 1013678 1031949 1051307 1071530 1092177 1112664 1132598 1152001
52115 1152001 1171148 1190263 1209419 1228588 1247594 1265999 1283295 1299346 1314519 1329270 1343661
52104 1343661 1357467 1370649 1383513 1396253 1408408 1418888 1426578 1430951 1432102 1430297 1425633 1418212
52092 1418212 1408482 1397226 1385129 1372443 1359165 1345449 1331722 1318342 1305242 1292136 1279115
52081 1279115 1266856 1255976 1246345 1237354 1228879 1221503 1215650 1210964 1206888 1203472 1201091 1199708 1199071 1199583
52067 1199583 1202295 1207865 1215993 1225988 1237305 1249386 1261597 1273865 1286983 1301766 1318002 1334520
52055 1334520 1350101 1363992 1375754 1385052 1391715 1395818 1397747 1398114 1397263 1394731 1389590 1381652 1372031 1362161
52041 1362161 1352539 1342887 1333124 1323464 1313633 1302788 1290507 1277347 1264158 1251230 1238360 1225405
52029 1225405 1212353 1199015 1184993 1170042 1154421 1138887 1124306 1111079 1098899 1087175 1075716
52018 1075716 1064836 1054831 1045569 1036704 1028101 1019900 1012233 1004894 997228 988394 977909 965951 952986
52005 952986 939175 924462 909221 894421 880920 868818 857640 846972 836678 826645 816580
51994 816580 806077 794764 782459 769233 755243 740446 724654 707994 691116 674715 658948
51983 658948 643500 628114 612791 597585 582557 568086 554892 543528 533967 525900 519307 514500
51971 514500 511617 510370 510432 511872 515023 519983 526337 533198 539379 543742 545764 545835 544783 543074 540693
51956 540693 537713 534542 531517 528724 526510 525808 527546 531924 538565 547192 557840 570727 586376 605567
51942 605567 628389 653197 677024 697273 712796 723425 729182 730294 727537 722071 714920 706694 697506
51929 697506 686995 674701 660635 645281 629020 611968 594541 577629 561761 546511 531302
51918 531302 516593 503644 493157 484680 477434 471233 466420 463244 461606 461223 461823 463199 465167 467502
51904 467502 469961 472360 474463 475659 474985 471767 466177 458942 450618 441488 432027 422938 414587 406857
51890 406857 399762 393848 389697 387277 386173 386240 387728 390762 394986 399870 405244 411525 419348 428798 438884
51875 438884 447956 454836 459515 462645 464614 465394 465115 464273 463215 461795 459816 457658 456152 455780 456179
51860 456179 456578 456757 457460 459635 463137 466307 467172 465077 460938 455887 450093 443137 435133 426895 419072
51845 419072 411679 404595 398074 392427 387568 383231 379469 376518 374283 372457 371205 371231 372845 375257 377183
51830 377183 378059 378365 378821 379572 380228 380397 380008 379209 378111 376641 374726 372671 371235 370998 371645 372231 372299
51813 372299 372346 372881 373434 373146 372154 371633 372297 373543 374489 375201 376263 377594 378543 379064 379912 381457 383030
51796 383030 383824 383886 383685 383188 382007 380292 378855 378314 378535 378963 379132 378779 377805 376384 374943 373889 373419
51779 373419 373550 374207 375346 377231 380482 385537 392026 399050 406143 413591 421643 429787 437081 442869 446822
51764 446822 448614 448021 445286 440957 435453 429133 422652 416601 410721 404095 396473 388891 382579 377640
51750 377640 373361 369499 366467 364343 362540 360768 359654 359875 361191 362907 364988 367956 371817 375863
51736 375863 379730 383932 388897 393877 397388 398649 398260 397549 397609 398947 401701 405868 411207 416957 421794
51721 421794 424467 424655 423087 420728 417983 414838 411427 408149 405275 402759 400415 398097 395764 393580
51707 393580 391920 391083 391053 391686 392947 394708 396430 397356 397080 395722 393769 391967 391124 391492 392342 392589 391869
51690 391869 390596 389063 387120 384842 382844 381528 380498 379147 377498 376102 375373 375351 375915 376905 378224
51675 378224 379987 382231 384349 385299 384878 384352 385351 388451 393343 399929 408372 418076 427422 434724 439016
51660 439016 440036 438147 434450 430303 426378 422603 419197 417209 417718 420901 426145 432610 439289 444878
51646 444878 448202 448761 446759 442780 437523 431433 424311 415693 405923 396397 388312 381508 375102 368930
51632 368930 363692 359802 356829 354160 351668 349625 348375 348173 348848 349572 349447 348485 347474 346683 345268 342350
51616 342350 338211 333969 330433 327797 326104 325380 325293 325265 325081 325066 325576 326580 327803 329118 330718 333120
51600 333120 336984 342720 350224 359115 369043 379499 389398 397351 402521 404973 405122 403261 399873 395959
51586 395959 392575 390079 388131 386416 385162 384996 386532 390079 395487 402240 409814 417960 426545 435272
51572 435272 443843 452387 461396 470992 480487 488949 496233 503331 511733 522547 536202 552770 572419
51559 572419 595483 621972 650897 680113 707192 730672 750498 767141 780498 789880 794855 795603
51547 795603 792358 784990 773501 758574 741149 721589 699752 675898 651074 626528 603117 581302
51535 581302 561239 542616 524818 507633 491571 477196 464435 452880 442502 433611 426153 419516
51523 419516 413092 406824 401200 396853 393955 391705 388654 384021 378664 374259 371502 369596 367579 365561
51509 365561 364336 364236 364815 365373 365425 364897 364323 364689 366579 369373 371645 372510 372369 372267 372751 373532 374053 374147
51491 374147 374117 374370 375073 376132 377288 378167 378322 377408 375425 372703 369592 366247 362727 359220 356054 353476
51475 353476 351470 349781 348053 345984 343410 340313 336827 333278 330109 327619 325757 324247 322947 321966
51461 321966 321396 321028 320508 319838 319626 320640 322994 325910 328463 330556 332944 336370 340986 346705 353686
51446 353686 362166 372151 383613 396598 410581 423871 434371 441071 444483 445704 445574 444688 443405
51433 443405 441432 437948 432514 425515 417438 408304 398286 388426 380011 373406 368040 363445 359737 357088
51419 357088 355275 353928 352871 352027 351223 350283 349252 348490 348471 349294 350352 350840 350854 351576 353980 357634 361272
51402 361272 364289 367052 369940 372903 376031 379718 383954 388149 392150 396788 402813 409749 416553 423179
51388 423179 430716 440026 451055 463687 478574 496572 517712 541258 566689 594333 625087 659738
51376 659738 698261 739192 779555 815904 845823 868432 883552 890848 890086 881838 867365 847838
51364 847838 823998 796459 765924 733022 698422 663218 628847 596362 566069 538058 512828
51353 512828 491067 472956 457944 445151 433912 424062 415771 408975 403022 397146 391235 385642 380256
51340 380256 374463 368369 363266 360169 358355 356177 353083 349975 347650 345789 343668 341137 338546 336261
51326 336261 334573 333670 333381 333242 333000 332786 332680 332487 332087 331635 331283 331060 331194 332118 333953 336340 338914
51309 338914 341478 343533 344301 343725 342943 343222 344606 346075 346686 346055 344103 341131 338107 336133 335373 334936
51293 334936 333994 332624 331463 330947 331181 332214 334074 336643 339726 343287 347480 352451 358055 363739 368764
51278 368764 372613 375139 376298 375971 374289 371992 370072 369070 368958 369614 371011 372943 375057 377316 379968
51263 379968 382722 384451 384242 382513 380432 378342 375522 371663 367770 364969 362914 360254 356589 353145
51249 353145 351242 350783 350713 350432 350119 349925 349554 348690 347323 345519 343307 340947 339004 337912 337670 338010 338592
51232 338592 338979 338796 338095 337268 336464 335424 334099 332993 332533 332403 331990 331351 331251 332308 334469 337326 340491
51215 340491 343575 346142 347983 349310 350621 352421 355041 358487 362367 366124 369460 372509 375504 378315
51201 378315 380348 380988 380204 378712 377328 376184 374762 372765 370627 368974 367907 367116 366513 366324 366668 367392
51185 367392 368298 369219 369907 370180 370204 370329 370634 370870 370804 370310 369209 367474 365584 364233 363534 362928 362007 360999
51167 360999 360254 359725 359292 359173 359611 360449 361419 362612 364292 366355 368362 369956 370921 371112 370732 370521 371064
51150 371064 371978 372342 372003 371839 372470 373282 373148 371812 370093 368913 368560 368845 369534 370434 371314 371956 372306 372509
51132 372509 372782 373220 373750 374306 375011 376042 377318 378551 379716 381231 383443 386047 388293 389771 390766 391748
51116 391748 392705 393140 392764 392073 392104 393506 395841 397979 399247 400006 401032 402566 404260 405812 407252 408648
51100 408648 409943 411184 412561 413973 414874 414810 413977 413065 412672 413016 414010 415351 416641 417648 418449 419168 419741
51083 419741 420122 420525 421141 421701 421705 421074 420261 419663 419275 419073 419405 420708 423014 426056 429823 434782 441434
51066 441434 449789 459394 469857 481310 494309 509328 526423 545297 565332 585290 603203 617092
51054 617092 626135 631153 634014 636644 640334 645343 650754 654967 656770 656107 653781 650444 645936 639502
51040 639502 630600 619617 607961 597463 589585 584899 582902 581992 579910 574895 566812 557040 547175 538057
51026 538057 530019 523521 519172 517308 517833 520267 523787 527649 532005 537984 546400 556552 566744 575852
51012 575852 583764 590470 595615 599193 601939 604461 606407 607025 606243 604718 602968 600984 598647 596089 593525
50997 593525 591048 588697 586582 584951 584285 585226 588128 592678 598268 604775 612653 622182 633030 644818
50983 644818 657858 672874 690039 708592 727356 745326 761726 776056 788583 800712 814512
50972 814512 831695 853073 878879 909285 944451 984274 1028351 1076130 1126976 1180170 1235124
50961 1235124 1291631 1349623 1408484 1466761 1522859 1575969 1625999 1672527 1714248 1749842 1779214
50950 1779214 1803408 1823284 1838725 1849399 1855932 1859971 1863275 1867028 1871721 1877005 1881527 1883392 1881337
50937 1881337 1875507 1867060 1857130 1846072 1833304 1817710 1798483 1775834 1750664 1723316 1692936 1658431
50925 1658431 1619853 1578333 1534776 1489222 1441680 1393086 1344970 1298463 1254019 1211944 1172638
50914 1172638 1136206 1102264 1070457 1041021 1014513 991072 970117 950820 932641 915373 898947
50903 898947 883433 869111 856284 844991 834994 826062 818153 811392 805991 802143 799774 798412 797494
50890 797494 796841 796597 796707 796807 796805 797226 798649 800975 803683 806796 811110 817198 824457 831557 837884 844268
50874 844268 852135 862083 873486 885391 897500 910240 924201 939743 956938 975599 995459 1016605
50862 1016605 1039723 1065718 1095150 1128275 1165520 1207564 1255008 1308369 1368367 1435784 1510930
50851 1510930 1593658 1683982 1782149 1887934 2000406 2118786 2243051 2373141 2507788 2644490
50841 2644490 2780332 2912308 3037129 3151423 3252336 3337755 3406165 3456866 3490379 3508203
50831 3508203 3511999 3503282 3483935 3456786 3425462 3393630 3364208 3339088 3319570 3306837 3301500 3302413
50819 3302413 3306421 3309721 3309244 3302407 3286246 3257840 3215673 3160007 3091870 3012200 2921867 2821867
50807 2821867 2713459 2598655 2480523 2362279 2245994 2132932 2025072 1925218 1835086 1754161
50797 1754161 1681068 1615413 1557672 1507946 1465763 1430721 1402467 1380163 1362737 1349625 1340597
50786 1340597 1334911 1331280 1328809 1327367 1326826 1326439 1325321 1323245 1320687 1318143 1315563 1312341 1307736 1301347
50772 1301347 1293238 1283619 1272549 1259984 1245968 1230589 1213886 1196019 1177459 1158762 1140125 1121446
50760 1121446 1102855 1085036 1068867 1054819 1042799 1032571 1024263 1018393 1015428 1015477 1018465 1024387 1033146
50747 1033146 1044328 1057532 1072890 1090945 1111988 1135892 1162632 1192513 1225790 1262580 1303312
50736 1303312 1348743 1399138 1453854 1512077 1573523 1637908 1704210 1771124 1838069 1905096 1971939
50725 1971939 2037741 2101637 2162891 2220258 2271723 2315047 2348304 2369873 2378574 2374218 2357906 2331714
50713 2331714 2298284 2260669 2222051 2185172 2151990 2123843 2101669 2085927 2076456 2072492 2072832 2076157
50701 2076157 2081262 2086747 2090197 2088184 2077695 2057561 2027992 1989012 1940298 1882739 1819219 1753237
50689 1753237 1687210 1622471 1560230 1501702 1447601 1398309 1354577 1317446 1287378 1263897 1246203
50678 1246203 1233807 1226556 1224445 1227629 1236289 1250219 1268579 1290153 1313787 1338577 1363822 1388891
50666 1388891 1413125 1435855 1456650 1475508 1492738 1508695 1523772 1538504 1553301 1567970 1581788
50655 1581788 1594294 1605888 1617504 1629781 1642795 1656441 1670767 1685922 1702097 1719733 1739561
50644 1739561 1762221 1787846 1816228 1847277 1881130 1917804 1956952 1997937 2039814 2081131 2120162
50633 2120162 2155817 2188386 2219152 2249276 2279291 2309607 2340918 2373373 2404999 2431014 2445187
50622 2445187 2442699 2422703 2388848 2347476 2304862 2265358 2231208 2203356 2182077 2167131 2157887 2153650
50610 2153650 2153763 2157231 2162335 2166957 2169314 2168138 2162060 2149265 2128186 2098402 2060454 2014889 1962015
50597 1962015 1902704 1838889 1772863 1706280 1640076 1575051 1512084 1451881 1394841 1341273 1291516
50586 1291516 1245857 1204459 1167337 1134301 1105000 1079141 1056563 1037048 1020280 1006116 994723
50575 994723 986331 981111 979378 981468 987052 994961 1004124 1014387 1026019 1038873 1052717 1068091 1085920
50562 1085920 1106205 1127869 1149974 1172402 1195293 1218731 1243299 1269999 1298972 1328915 1358447
50551 1358447 1387566 1417080 1447009 1476362 1504297 1530732 1555890 1580075 1604104 1629398 1657252
50540 1657252 1688224 1722394 1759961 1801458 1847485 1898311 1953660 2012983 2076097 2143513 2216054
50529 2216054 2294307 2378573 2469004 2565399 2666952 2772468 2880636 2989773 3097541 3201415
50519 3201415 3299308 3389265 3468719 3534797 3585511 3620055 3637785 3637563 3618641 3581745 3528813 3461943
50507 3461943 3383084 3294609 3199725 3102222 3006082 2915245 2833374 2763475 2707544 2666414 2639987
50496 2639987 2627861 2629806 2645392 2673034 2709712 2751743 2795450 2836770 2870783 2892450 2898031 2885490
50484 2885490 2853765 2802452 2732552 2647039 2550163 2446095 2338178 2228892 2120043 2013013
50474 2013013 1909224 1810369 1717997 1632883 1555031 1484209 1420263 1362907 1311605 1265844 1225373
50463 1225373 1190010 1159368 1133007 1110792 1092896 1079384 1069952 1064095 1061462 1061935 1065452 1071822 1080748
50450 1080748 1091953 1105228 1120385 1137220 1155653 1175952 1198711 1224319 1252162 1280266 1305852
50439 1305852 1326478 1340848 1348852 1351249 1349474 1345447 1340914 1336653 1332491 1328258 1324517 1322128 1321335 1321785
50425 1321785 1323410 1326808 1332598 1340864 1351543 1364998 1381747 1401843 1425132 1452105 1483940 1521407
50413 1521407 1564064 1610753 1660596 1713208 1768189 1824831 1882290 1939655 1995801 2049419 2099365
50402 2099365 2144862 2185286 2219915 2247915 2268365 2280081 2281535 2271200 2248193 2212727 2166153
50391 2166153 2110702 2048992 1983423 1915894 1848175 1782540 1721652 1667575 1620958 1581436 1548809
50380 1548809 1523600 1506530 1497774 1496854 1503026 1515420 1532815 1553302 1574187 1592316 1604846 1610002
50368 1610002 1607168 1596297 1577536 1551542 1519875 1484743 1448387 1412799 1379581 1349441 1321682
50357 1321682 1294483 1265829 1234100 1198222 1158012 1114743 1070896 1028947 990363 955649 924861
50346 924861 897811 874220 854069 837568 824516 814087 805681 799642 796506 795750 795988 796387 797142 798401
50332 798401 799519 799900 800027 800965 803118 806087 809604 813920 819182 825112 831681 839599 849513 860818 871836
50317 871836 881312 889420 897095 904699 911724 917688 922845 927860 933127 938757 945101 952834 962397 973613
50303 973613 986047 999641 1014882 1032483 1053069 1077028 1104416 1135095 1169317 1208146 1252565
50292 1252565 1301117 1348040 1384257 1401369 1395845 1370302 1331305 1285871 1239155 1194110 1152320
50281 1152320 1114939 1083058 1057363 1037588 1022614 1011445 1004035 1000949 1002283 1007255 1014861 1024479
50269 1024479 1035702 1048083 1061534 1076693 1094244 1113857 1134194 1154038 1172982 1190999 1207898
50258 1207898 1223524 1238140 1252162 1265676 1278381 1289734 1298890 1304829 1306963 1305444 1300479 1291528
50246 1291528 1277765 1259349 1237835 1215330 1193663 1174326 1158561 1147047 1139605 1135225 1132078 1127585
50234 1127585 1119253 1105957 1088328 1067827 1045818 1023573 1002357 982868 964886 948009 932411
50223 932411 918419 905663 893378 881442 870435 860561 851140 841410 831416 821814 813021 804778 796455
50210 796455 787732 779043 771294 764952 759526 754138 748467 742872 737748 733167 729028 725076 720801 715797
50196 715797 710317 705060 700338 695823 691177 686492 681980 677704 673793 670517 667925 665730 663741 662044
50182 662044 660603 659087 657333 655636 654310 653335 652655 652416 652572 652647 652343 652047 652274 652870 653294 653571 654393
50165 654393 656266 659005 662126 665427 669110 673650 679721 688057 699171 713189 729910 749075 770730
50152 770730 795404 823792 856094 891726 929650 968810 1008238 1047029 1084412 1119762 1152609
50141 1152609 1183052 1212184 1241599 1272106 1303115 1333355 1361585 1386288 1405227 1416025 1417165
50130 1417165 1408292 1389985 1363699 1331437 1294863 1254905 1212645 1170157 1129735 1092500 1058375
50119 1058375 1027224 999244 974422 952416 932969 915740 899786 884090 868720 854659 842346
50108 842346 831244 821038 812238 805105 798906 792935 787517 783131 779096 774112 767849 761163 754844 749036
50094 749036 743882 739852 737068 734962 733065 731732 731579 732383 733067 732865 732205 732220 733597 736180 739564 743668
50078 743668 748536 753966 759776 766202 773538 781481 789314 796769 804137 811393 817813 822795 826596 829824
50064 829824 832638 834937 837003 839270 841503 842778 842462 840862 838728 836351 833346 829328 824699 820624
50050 820624 818058 816824 815928 814838 814149 814871 817494 821981 828240 836121 845256 855498 867431 881906
50036 881906 899040 918137 938651 960772 984941 1011243 1039457 1069314 1100387 1131917 1163034
50025 1163034 1193022 1221200 1246713 1268797 1287318 1302932 1316574 1328689 1338874 1346143 1349479 1348120
50013 1348120 1341488 1329131 1310855 1286743 1257053 1222415 1184303 1144926 1106225 1069072 1033782
50002 1033782 1001090 972068 947149 925857 907598 892097 878921 867253 856628 847348 839626 832604
49990 832604 824817 815447 804575 792407 778987 764776 750816 737913 725962 714420 703188 692715
49978 692715 683397 675184 667741 660810 654402 648739 643978 639952 636279 632702 629116 625262 620830 616081
49964 616081 611943 609092 607226 605789 605170 606475 610013 614755 619664 624979 631604 639573 647725 654781
49950 654781 660234 664175 666802 668356 669183 669572 669528 668833 667264 664768 661478 657583 653159 648246 643121
49935 643121 638223 633561 628430 622044 614365 606029 597605 589398 581929 575962 571833 569191 567607 567046
49921 567046 567438 568233 568859 569419 570479 572261 574445 576704 578969 581217 583456 586168 590382 596898 605499
49906 605499 615140 624885 634431 643758 652624 660718 668129 675255 682047 687687 691344 693032 693320 692291
49892 692291 689315 684052 677173 669666 661723 652787 642650 632080 622276 613967 607127 601273 595845 590412
49878 590412 584780 579015 573481 568780 565561 564109 564101 564832 565842 567305 569758 573541 578508 584279 590541
49863 590541 597070 603637 610156 616887 624241 632332 640926 649808 658779 667125 673643 677678 679950 681847
49849 681847 684040 686199 687753 688240 686985 683300 677290 669865 661712 652869 643598 634930 627740 621820
49835 621820 616491 611736 608049 605480 603601 602304 601880 602307 603081 603945 605286 607579 610922 615313 621027
49820 621027 628375 637136 646408 654993 661993 667201 670994 673885 676209 678174 679830 680830 680544 678703
49806 678703 675646 671730 666925 661463 656410 652816 650397 647720 643689 638266 631872 624849 617632 610660
49792 610660 603896 597064 590617 585709 582780 580846 578804 576854 575949 576200 576691 576776 576849 577726 579796 582899
49776 582899 586618 590565 594725 599682 606109 613797 621416 627550 631891 635257 638520 641796 644641 646713
49762 646713 647930 648116 646915 644227 640518 636468 632345 627825 622335 615516 607633 599737 593214 588766
49748 588766 585936 583872 582318 581427 580869 579892 578397 577315 577572 579098 581181 583372 585724 588510 592118
49733 592118 596931 602815 608849 613963 617885 621311 625236 630328 636774 644455 653210 663014 673837 685329
49719 685329 696843 707838 717918 726455 732510 735432 735214 732086 726184 717910 708248 698284 688720 680184
49705 680184 673588 669540 667697 667329 668339 670946 674419 676965 677216 675290 672165 668569 664915 661900 660532
49690 660532 661489 664637 669263 674754 681107 688718 697552 706807 715768 724878 735451 748471 764250 783098
49676 783098 805217 829203 851360 867485 875534 876276 871837 864306 855555 847326 840831 836470 834282
49663 834282 834539 837682 843702 851532 858849 862568 860110 850747 835832 817714 798487 779677 762525
49650 762525 747935 736087 726472 718484 711882 706673 702890 700611 699946 700730 702345 704065 705485 706464
49636 706464 706788 706166 704418 701358 696634 690157 682737 675710 669717 664229 658585 653037 648310 644535 641256
49621 641256 638340 636210 635175 635081 635705 636885 638123 638672 638450 638398 639469 641501 643534 645010 646212 647582
49605 647582 649087 650376 651242 651817 652427 653326 654418 655317 655797 656119 656692 657497 658067 657993 657240 656002 654550
49588 654550 653284 652657 652851 653613 654457 654947 654862 654336 653913 654182 655199 656425 657357 657993 658618 659403 660509 662391
49570 662391 665686 670753 677492 685558 694593 704400 715034 726509 738180 748646 756753 762612 767169
49557 767169 770787 772795 772521 770152 766363 761713 756824 752537 749200 746156 742685 739206 736801 735711
49543 735711 735129 734513 734172 734297 734365 734045 733992 735098 737460 740742 745102 751030 758575 767507 778054 790775
49527 790775 805835 823214 843538 867695 895175 923340 948759 968979 983085 991376 995060 995826
49515 995826 995173 994239 994276 996683 1002129 1009987 1018950 1027708 1034609 1037317 1033834 1024020 1009647 992923 975338
49500 975338 957690 940532 924317 909414 896032 883901 872220 860456 849216 839876 833242 828949
49488 828949 826163 824333 823168 822476 822370 823174 824754 826259 826908 826747 826359 826102 826021 826204 826781 827681 828797
49471 828797 830258 832156 834159 835845 837406 839533 842562 846120 849758 853504 857613 862044 866413 870200
49457 870200 872793 873613 872544 870174 867314 864269 860782 856682 852338 848399 845209 842615 840300 838229
49443 838229 836725 836145 836512 837527 838956 840967 844035 848527 854404 861384 869353 878573 889481 902265
49429 902265 916532 931279 945218 957529 968641 980171 993503 1008020 1020788 1028322 1028865 1023269
49417 1023269 1014097 1004071 994962 987370 981320 977111 975525 977140 981746 988704 997674 1008647 1021468
49404 1021468 1035837 1051637 1068688 1086194 1103155 1119512 1136220 1153839 1171602 1188277 1203350
49393 1203350 1216840 1228517 1238179 1246363 1253803 1260144 1263999 1264488 1262020 1257346 1250508 1241249 1229992
49380 1229992 1217867 1205929 1194693 1184278 1174723 1166288 1159614 1155363 1153503 1153277 1154130 1156336 1160205
49367 1160205 1164968 1169051 1171490 1172551 1172917 1172774 1171844 1169726 1165840 1159461 1150404 1139551 1128263 1117273
49353 1117273 1106489 1095834 1085773 1076890 1069362 1063131 1058261 1054723 1052001 1049371 1046563 1043740 1040798
49340 1040798 1037176 1032672 1028104 1024791 1023454 1023989 1026281 1030889 1038711 1049959 1063396 1076480 1086369
49327 1086369 1091154 1090445 1085097 1076660 1067076 1058181 1050765 1044087 1036821 1028597 1020199 1012162 1003814 994116
49313 994116 983130 972141 962455 954456 947844 942398 938313 935895 935042 935071 935229 935423 936311 938527 941978
49298 941978 946002 949911 953153 955203 955796 955292 954427 953596 952522 950551 947026 941460 933829 924877 915914
49283 915914 908067 901782 897005 893598 891573 891246 893202 897790 904528 912341 920563 929382 939099 949327
49269 949327 959226 968127 975496 980614 983009 983232 982625 982136 981786 981492 981993 984595 990079 998126 1007731 1018036
49253 1018036 1028679 1039269 1048527 1054260 1054646 1049622 1040631 1028995 1015011 998872 981854 965962
49241 965962 952492 941395 931930 923541 916171 910233 906412 905150 906149 908640 912208 917136 923814 932097
49227 932097 941408 951256 961476 972110 983227 994702 1006025 1016444 1025455 1033109 1039770 1045674 1050783
49214 1050783 1054941 1058052 1060239 1061895 1063564 1065808 1069275 1074760 1082859 1093499 1106068 1120047 1135165
49201 1135165 1150887 1166305 1180857 1194773 1208412 1221465 1233331 1244077 1254502 1265201 1276009
49190 1276009 1286388 1296015 1304915 1313345 1321684 1330222 1338954 1347707 1356503 1365724 1376060 1388466 1404002
49177 1404002 1423428 1447047 1475216 1508681 1547850 1591617 1637192 1680986 1719382 1749120 1768210
49166 1768210 1777139 1778747 1776414 1772383 1767757 1763296 1759533 1756435 1753576 1750646 1747490 1743931 1740099 1736864
49152 1736864 1735333 1735763 1737402 1739569 1742567 1747267 1754097 1762742 1772671 1783532 1795043 1806897 1819034
49139 1819034 1831746 1845257 1859339 1873672 1888446 1904152 1920751 1937595 1954343 1971465 1989463
49128 1989463 2008131 2027096 2046651 2067289 2088691 2110042 2131411 2154045 2179112 2206818 2237075
49117 2237075 2270490 2308441 2352587 2404589 2465962 2538182 2623602 2726281 2850489 2996556 3157366
49106 3157366 3319623 3470597 3606470 3735633 3871723 4018814 4160647 4266122 4309405 4287645
49096 4287645 4220565 4133728 4041570 3943176 3830161 3697300 3547877 3391898 3240444 3101216
49086 3101216 2977782 2871073 2780472 2704237 2640334 2587251 2543597 2507306 2476099 2448651 2424448
49075 2424448 2402596 2381890 2362204 2344748 2330456 2318819 2308685 2299416 2290794 2282486 2274271 2266389
49063 2266389 2259159 2252532 2246392 2240881 2236057 2231578 2227165 2223090 2219860 2217678 2216568 2216765 2218678 2222547
49049 2222547 2228192 2234723 2240310 2242768 2240921 2235350 2227710 2219599 2212048 2205470 2199668 2194325 2189932 2187887
49035 2187887 2189222 2193533 2199569 2206577 2214540 2223314 2232177 2240313 2247366 2253386 2258447 2262374 2264812 2265616
49021 2265616 2265183 2264195 2263013 2261655 2260414 2260028 2260952 2262910 2265502 2268845 2273212 2278402 2283935 2289661 2295715
49006 2295715 2302104 2308754 2315750 2323045 2330092 2336244 2341461 2346255 2351004 2355682 2360173 2364425 2368351 2371888
48992 2371888 2375084 2377875 2379894 2380804 2380663 2379703 2377968 2375572 2373000 2370641 2368154 2364861 2360611 2355787 2350510
48977 2350510 2344432 2337307 2329213 2320213 2310391 2300235 2290461 2281233 2272085 2262748 2253667 2245549 2238854 2233840
48963 2233840 2230628 2229078 2229053 2230947 2235466 2242688 2251837 2262244 2273993 2287301 2301810 2316912 2332384
48950 2332384 2348177 2363913 2379112 2393694 2407857 2421687 2435345 2449427 2464674 2481439 2499830
48939 2499830 2520186 2542926 2568039 2595255 2624644 2656485 2690530 2726075 2763013 2802224 2844494
48928 2844494 2889371 2935571 2982324 3029885 3078834 3129302 3181033 3233879 3287905 3343058 3398872
48917 3398872 3454613 3509727 3564125 3618004 3671324 3723564 3774081 3822738 3870025 3916419 3961718
48906 3961718 4005218 4046576 4086200 4124567 4161334 4195509 4226492 4254579 4280350 4303980 4325429
48895 4325429 4344927 4362786 4378899 4392928 4404986 4415645 4425104 4432809 4438164 4441280 4442613 4441996 4438421
48882 4438421 4430869 4419141 4403809 4385461 4364094 4339263 4310867 4279587 4246291 4210951 4172542
48871 4172542 4130227 4084465 4036693 3988151 3939283 3890040 3840343 3790307 3740400 3691369 3643733
48860 3643733 3597450 3552421 3509094 3467997 3428717 3390129 3351841 3314765 3279930 3247420 3216966
48849 3216966 3188958 3164096 3142404 3123396 3107027 3093728 3083445 3075352 3068736 3063679 3060681 3060039
48837 3060039 3061758 3065724 3071732 3079599 3089380 3101241 3114989 3130029 3145842 3162340 3179642 3197708
48825 3197708 3216218 3234623 3252425 3269673 3287102 3305389 3324262 3342777 3360518 3378089 3396312
48814 3396312 3415346 3434824 3454417 3474000 3493489 3512799 3531924 3550993 3570337 3590393 3611279
48803 3611279 3632620 3654226 3676792 3701279 3727498 3753916 3779091 3802697 3824918 3845480 3863825
48792 3863825 3879835 3893964 3906907 3919406 3931983 3944427 3955780 3965106 3972075 3976687 3978915 3978876 3976815
48779 3976815 3972572 3965527 3955419 3942656 3927424 3909132 3887360 3862695 3835869 3806553 3773927 3738116
48767 3738116 3700103 3660382 3618699 3575154 3530674 3486185 3442005 3398289 3355414 3313623 3272789
48756 3272789 3232761 3193663 3155762 3119321 3084566 3051386 3019127 2987184 2955793 2925834 2897875
$$ [...]
##END NTUPLES=NMR SPECTRUM
##END=
