##TITLE=AC1741_SEN00014_9276431_AB4jOIfaEK
##JCAMPDX= 6.0         $$ Bruker NMR JCAMP-DX V2.0
##DATA TYPE= NMR SPECTRUM
##DATA CLASS= NTUPLES
##ORIGIN= BRUKER
##OWNER= Administrator
$$ 1.72 TOPSPIN		Version 2.1
$$ 2015-07-15 01:03:39.463 -0700  Administrator@X
$$ Compression mode = diff/dup
##.OBSERVE FREQUENCY= 400.02188249412
##.OBSERVE NUCLEUS= ^1H
##.ACQUISITION MODE= SIMULTANEOUS (DQD)
##.ACQUISITION SCHEME= undefined
##.AVERAGES= 8
##.DIGITISER RES= 22
##SPECTROMETER/DATA SYSTEM= spect
##.PULSE SEQUENCE= zg30
##.SOLVENT NAME= COFFEE_meoh
##.SHIFT REFERENCE= INTERNAL, COFFEE_meoh, 1, 14.98509
##AUDIT TRAIL= $$ (NUMBER, WHEN, WHO, WHERE, PROCESS, VERSION, WHAT)
$$ ##TITLE= Audit trail, TOPSPIN		Version 2.1
$$ ##JCAMPDX= 5.01
$$ ##ORIGIN= Bruker BioSpin GmbH
$$ ##OWNER= Administrator
$$ $$ E:\/data/COFFEE/nmr/AC1741_SEN00014_9276431_AB4jOIfaEK/10/pdata/1/auditp.txt
$$ ##AUDIT TRAIL=  $$ (NUMBER, WHEN, WHO, WHERE, PROCESS, VERSION, WHAT)
(   1,<2015-07-15 01:03:32.166 -0700>,<Administrator>,<X>,<go>,<TOPSPIN 2.1>,
      <created by zg
	started at 2015-07-15 01:02:25.838 -0700,
	POWCHK enabled, PULCHK disabled,
       configuration hash MD5:
       21 0F 79 D6 B3 7B B4 F6 88 20 88 DB 03 48 BD 9F
       data hash MD5: 64K
       1E 9F 47 64 78 2C 73 FE 0C 22 D1 82 78 E6 92 09>)
(   2,<2015-07-15 01:03:35.307 -0700>,<Administrator>,<X>,<proc1d>,<TOPSPIN 2.1>,
      <Start of raw data processing
       efp LB = 0 FT_mod = 6 PKNL = 1 PHC0 = 0 PHC1 = 0 SI = 32K 
       data hash MD5: 32K
       F6 44 6F DE 27 47 86 67 93 38 48 92 18 0C 25 6E>)
(   3,<2015-07-15 01:03:35.604 -0700>,<Administrator>,<X>,<proc1d>,<TOPSPIN 2.1>,
      <pk PHC0 = 89.0332 PHC1 = 0 
       data hash MD5: 32K
       E4 D0 A6 97 66 9B 69 08 A9 DB 38 92 5E 40 B1 CB>)
(   4,<2015-07-15 01:03:35.697 -0700>,<Administrator>,<X>,<proc1d>,<TOPSPIN 2.1>,
      <abs ABSG = 1 
       data hash MD5: 32K
       6E FD 47 66 60 5E E4 3C 8D DE 4D 50 72 62 3E 1B>)
(   5,<2015-07-15 01:03:35.775 -0700>,<Administrator>,<X>,<proc1d>,<TOPSPIN 2.1>,
      <abs ABSG = 2 
       data hash MD5: 32K
       84 B1 20 61 AA F9 EA 64 2E E9 4E B8 62 5C 8F 01>)
(   6,<2015-07-15 01:03:35.854 -0700>,<Administrator>,<X>,<proc1d>,<TOPSPIN 2.1>,
      <abs ABSG = 3 
       data hash MD5: 32K
       17 41 72 84 74 82 02 57 67 E6 47 94 9B 37 15 F6>)
(   7,<2015-07-15 01:03:35.916 -0700>,<Administrator>,<X>,<proc1d>,<TOPSPIN 2.1>,
      <abs ABSG = 4 
       data hash MD5: 32K
       E5 61 05 BD 0E 94 E4 B9 2D E3 04 A7 19 23 9E AF>)
(   8,<2015-07-15 01:03:35.963 -0700>,<Administrator>,<X>,<proc1d>,<TOPSPIN 2.1>,
      <abs ABSG = 5 
       data hash MD5: 32K
       51 08 BB E5 F5 18 B9 22 EC E3 BE AB D7 30 3C 7A>)
$$ ##END=
$$ 
$$ $$ hash MD5
$$ $$ 5D 31 B2 47 70 44 A8 E7 AB B9 8A 79 B9 7B FC FE
##$RELAX= 
##$RELAX= 
##$RELAX= 
##$RELAX= 
##$RELAX= 
##$RELAX= 
##$RELAX= 
$$ Bruker specific parameters
$$ --------------------------
##$DU= <E:\>
##$EXPNO= 10
##$NAME= <AC1741_SEN00014_9276431_AB4jOIfaEK>
$$ [...]
150 150 150 150 150 150 150 150
##$TP07= 0
##$TPNAME0= <>
##$TPNAME1= <>
##$TPNAME2= <>
##$TPNAME3= <>
##$TPNAME4= <>
##$TPNAME5= <>
##$TPNAME6= <>
##$TPNAME7= <>
##$TPOAL= (0..7)
0.5 0.5 0.5 0.5 0.5 0.5 0.5 0.5
##$TPOFFS= (0..7)
0 0 0 0 0 0 0 0
##$TUNHIN= 0
##$TUNHOUT= 0
##$TUNXOUT= 0
##$USERA1= <user>
##$USERA2= <user>
##$USERA3= <user>
##$USERA4= <user>
##$USERA5= <user>
##$V9= 5
##$VALIST= <valist>
##$VCLIST= <CCCCCCCCCCCCCCC>
##$VD= 0
##$VDLIST= <DDDDDDDDDDDDDDD>
##$VPLIST= <PPPPPPPPPPPPPPP>
##$VTLIST= <TTTTTTTTTTTTTTT>
##$WBST= 2048
##$WBSW= 25
##$XGAIN= (0..3)
0 0 0 0
##$XL= 0
##$YL= 0
##$YMAX_a= 602456
##$YMIN_a= -524354
##$ZGOPTNS= <>
##$ZL1= 120
##$ZL2= 120
##$ZL3= 120
##$ZL4= 120
##$ABSF1= 14.98509
##$ABSF2= -5.573092
##$ABSG= 5
##$ABSL= 3
##$ALPHA= 0
##$AQORDER= 0
##$ASSFAC= 0
##$ASSFACI= 0
##$ASSFACX= 0
##$ASSWID= 0
##$AUNMP= <proc_prof1d_extract_pilot.lims>
##$AXLEFT= 0
##$AXNAME= <>
##$AXNUC= <1H>
##$AXRIGHT= 0
##$AXTYPE= 0
##$AXUNIT= <>
##$AZFE= 0.1
##$AZFW= 0.1
##$BCFW= 0
##$BC_mod= 0
##$BYTORDP= 0
##$COROFFS= 0
##$CY= 15
##$DATMOD= 1
##$DC= 0
##$DFILT= <>
##$DTYPP= 0
##$F1P= 0
##$F2P= 0
##$FCOR= 0.5
##$FTSIZE= 32768
##$FT_mod= 6
##$GAMMA= 0
##$GB= 0
##$INTBC= 1
##$INTSCL= 1
##$ISEN= 128
##$LB= 0
##$LEV0= 0
##$LPBIN= 0
##$MAXI= 10000
##$MC2= 0
##$MEAN= 0
##$ME_mod= 0
##$MI= 0
##$NCOEF= 0
##$NC_proc= -8
##$NLEV= 6
##$NOISF1= 0
##$NOISF2= 0
##$NSP= 0
##$NTH_PI= 0
##$NZP= 0
##$OFFSET= 14.98509
##$PC= 1
##$PHC0= 89.0332
##$PHC1= 0
##$PH_mod= 1
##$PKNL= yes
##$PPARMOD= 0
##$PPDIAG= 0
##$PPIPTYP= 0
##$PPMPNUM= 2147483647
##$PPRESOL= 1
##$PSCAL= 4
##$PSIGN= 0
##$PYNMP= <proc.py>
##$REVERSE= no
##$SF= 400.02
##$SI= 32768
##$SIGF1= 0
##$SIGF2= 0
##$SINO= 400
##$SIOLD= 32768
##$SPECTYP= <>
##$SREGLST= <1H.CDCl3>
##$SSB= 0
##$STSI= 32768
##$STSR= 0
##$SW_p= 8223.68421052631
##$SYMM= 0
##$S_DEV= 0
##$TDeff= 65536
##$TDoff= 0
##$TI= <>
##$TILT= no
##$TM1= 0
##$TM2= 0
##$TOPLEV= 0
##$USERP1= <user>
##$USERP2= <user>
##$USERP3= <user>
##$USERP4= <user>
##$USERP5= <user>
##$WDW= 1
##$XDIM= 32768
##$YMAX_p= 442501606
##$YMIN_p= -725777
##$CURPLOT= <Network HP LaserJet P1505>
##$CURPRIN= <$Network HP LaserJet P1505>
##$DFORMAT= <normdp>
##$LAYOUT= <+/1D_H.xwp>
##$LFORMAT= <normlp>
##$PFORMAT= <normpl>
##$SURQMSG= 1
$$ End of Bruker specific parameters
$$ ---------------------------------
##NTUPLES= NMR SPECTRUM
##VAR_NAME=  FREQUENCY,     SPECTRUM/REAL,   SPECTRUM/IMAG
##SYMBOL=    X,             R,               I
##VAR_TYPE=  INDEPENDENT,   DEPENDENT,       DEPENDENT
##VAR_FORM=  AFFN,          ASDF,            ASDF
##VAR_DIM=   32768,         32768,           32768
##UNITS=     HZ,            ARBITRARY UNITS, ARBITRARY UNITS
##FACTOR=    0.250966925370066, 1,           1
##FIRST=     8223.43324360094, -845,         -231589
##LAST=      0,             197854,          -135731
##MIN=       0,             -725777,         0
##MAX=       8223.43324360094, 442501606,    0
$$ Real data points
##PAGE= N=1
##DATA TABLE= (X++(R..R)), XYDATA
$$ [...]
$$ plain form
19558 34331 -90494 84684 -233948 -103063 -269260 -321438 -4422 -66672 -2611 -15956 -390169
19547 -390169 -328116 -51502 -218904 -27325 -84800 -28456 160855 120812 -106810 224600 -17964
19535 -131657 -87 -123711 244073 160507 -399643 316407 66361 -79026 -30924 -71975 -289114
19524 -289114 -365221 -260815 -307659 19707 -17747 -37784 129673 152658 -78825 -68115 33754
19512 -106930 -155439 -230060 -116685 149173 118929 -6651 200325 -71068 -149701 -109775 21074
19500 -85828 -60464 83741 -9585 -85712 -7948 75959 111801 1055 -368755 335498 -205715 -28246
19487 31115 -11645 84934 -5914 167901 -248913 -67605 -318877 112188 135622 -335095 -130939
19475 -33626 196096 -168251 -241532 -172567 -132942 -40434 110997 42765 -69490 -259041 -120575
$$ packed form
19558C4331i0494H4684b33948a03063j66197n2178d422o2250b611j3345l74213
19547c90169O2053e1502j67402b7325n7475b8456A60855m0043a06810B24600a7964
19535a31657h7j23624B44073q3566c99643C16407F6361g9026c0924m1051k17139
19524b89114p6107J04406m6844A9707a7747k0037A29673K2985g8825J0710C3754
19512a06930m8509p4621J13375A49173l0244f651B00325g1068p8633L9926B1074
19500h5828K5364H3741i585p6127g948G5959L5842A055c68755C35498b05715b8246
19487C1115a1645H4934e914A67901b48913f7605k51272A12188K3434c35095a30939
19475c3626A96096a68251p3281O8965L9625d0434A10997D2765f9490j89551a20575
$$ plain form
19463 -232577 114127 -46539 -182621 45990 -313880 -120950 57382 -214991 67282 -238899
19452 222390 202287 -235284 125230 -106173 245422 -3153 -175135 -164677 -46314 37307 -230757
19440 -62710 -214556 -53374 -122112 202599 -98302 174527 103927 -164237 147112 -112124
19429 -450439 189717 -228576 3730 125563 -27393 -9599 -26011 204053 47503 -14587 -49843
19418 -49843 -75019 -52469 -24132 105919 -57200 -226132 -252550 -49738 -263040 -117556 92128
19406 -68043 -60966 2327 -194658 95466 -330901 -3706 150845 102997 53832 -149754 81260
19394 -347678 224972 69852 -173594 -159841 -129149 -22311 46274 18100 -310046 -178471 124777
19382 -152974 134480 -40309 57767 -159343 -545904 58078 -519930 -224054 -410925 -192185
$$ packed form
19463b32577A14127d6539j36082D5990c13880a20950E7382b14991F7282b38899
19452B22390k0103b35284A25230a06173B45422c153j71982J0458d6314C7307b30757
19440f2710j51846e3374o8738B02599i8302A74527p0600a64237A47112a12124
19429d50439A89717b28576C730J21833b7393i599j6412B04053D7503a4587l5256
19418d9843k5176K2550b4132A05919e7200j68932k6418d9738k13302a17556I2128
19406f8043P077B327a94658I5466c30901c706A50845m7848m9165a49754H1260
19394c47678B24972F9852a73594J3753L0692b2311D6274A8100c10046J31575A24777
19382a52974A34480d0309E7767a59343l86561E8078e19930b24054j86871a92185
$$ plain form
19371 -263965 18558 -39148 6156 -150863 116374 -322479 44544 -165828 67674 -210980 333983
19359 -38215 73864 100926 45662 -184823 135927 -107573 170457 142864 -104581 -108127 187986
19347 -96409 -1894 -119097 -8398 158912 -136543 -218785 -250365 37200 -325185 81638 -8750
19335 -256631 -122577 -125791 261865 64810 32314 -62447 215901 75338 -23179 -133276 162583
19323 -384678 21217 90712 -175808 142069 -265315 -404659 -151708 -378783 187334 -143644
19312 -168421 64586 48398 -101355 229423 195646 318252 57773 1528 -209348 779 42372
19301 42372 -305710 -122814 12411 -180017 -134422 -91234 35448 -387270 -296145 -110383 -159283
19290 -159283 89253 -25739 -173001 -212496 170024 72574 -14466 -54820 -53707 170398 -111985
$$ packed form
19371b63965A8558c9148F156a50863A16374c22479D4544a65828F7674b10980C33983
19359c8215G3864K7062D5662a84823A35927a07573A70457k7593a04581l546A87986
19347i6409a894j17203h398A58912a36543q2242l1580C7200c25185H1638h750
19335b56631a22577l214B61865F4810C2314f2447B15901G5338b3179j10097A62583
19323c84678B1217O9495a75808A42069b65315j39344a51708k27075A87334a43644
19312a68421F4586j6188a01355B29423l3777J22606E7773A528b09348G79M1593
19301D2372c05710a22814A2411a80017M5595M3188C5448c87270R1125a10383m8900
19290a59283H9253b5739j47262l9495A70024G2574a4466m0354J113A70398a11985
$$ plain form
19278 74242 -135297 -217921 -54302 23810 54613 -101286 -411929 121720 -91911 -289843 -64574
19266 -99536 -17340 -24333 -67078 -251891 -117571 -80163 162195 -206715 239070 -143978 -444772
19255 -444772 -125804 -7348 -87004 -72045 -124365 9351 24021 64781 -40437 -232183 -207797
19244 -207797 -85372 -98285 -29976 -371904 69144 -407854 44029 -73932 -53651 -591717 219894
19232 -73414 38366 313535 -220366 -166996 256053 -89749 76855 106506 270301 109328 110839
19221 110839 -91419 -127282 274743 74292 -33751 140632 22105 -209018 93235 -65661 182173
19209 -260454 102997 -189963 -301277 -131504 -82697 59807 -142112 97369 15520 -270730
19198 -103396 -21043 68001 204369 -101675 50874 -129733 -114695 -99632 -32859 86273 104503
$$ packed form
19278G4242a35297q2624e4302B3810L0803a01286l10643A21720i1911j97932f4574
19266i9536a7340o993m2745j84813a17571L7408A62195b06715B39070a43978l00794
19255d44772a25804g348p9656J4959n2320I351J4670M0760d0437j91746K4386
19244b07797h5372j2913b9976l41928F9144d07854D4029g3932K0281n38066B19894
19232g3414C8366K75169b20366N3370B56053h9749G6855K9651J63795A09328J511
19221A10839i1419l5863B74743G4292c3751A40632B2105b09018I3235f5661A82173
19209b60454A02997a89963j11314a31504M8807E9807a42112I7369A5520b70730
19198a03396b1043F8001J36368a01675E0874a29733J5038J5063c2859H6273J8230
$$ plain form
19187 104503 86600 -113552 73184 -143791 -38275 -283497 -218532 -72260 226374 -192047
19176 48737 170139 -20530 -88608 64019 -457 -82844 194074 808 -92794 57480 -286814 79219
19163 -61959 -26447 157147 69018 -229417 77110 92199 45491 -92812 174718 -79243 -192295
19152 -192295 -269347 79353 -140241 -323916 -231684 -535197 -61196 -152166 -217260 -399759 100289
19140 -64209 3572 -14903 -245805 -156181 324298 -29361 -203215 -91913 -78271 -87093 468859
19128 -83237 -102328 393682 -261245 108717 57997 -138686 -127930 134873 -201653 173755
19117 53260 -227114 -25603 240863 -102729 -157169 51387 -63740 -56578 -39540 141410 -34996
19105 -340692 202870 -159205 11384 -243916 -311743 -20420 -97130 -176816 -100160 175211 303183
$$ packed form
19187A04503j7903a13552G3184a43791c8275k45222O4965g2260B26374a92047
19176D8737J21402b0530o8078F4019d57q2387A94074H08i2794E7480b86814G9219
19163f1959b6447A57147F9018b29417G7110J5089D5491i2812A74718g9243j13052
19152a92295p7052G9353a40241j83675R2232l03513f1196r0970o5094j82499A00289
19140f4209C572a4903k30902Q9624C24298b9361j73854i1913J3642q822D68859
19128h3237j9091C93682b61245A08717n0720a38686J0756A34873b01653A73755
19117E3260b27114b5603B40863a02729n4440E1387f3740P162J7038A41410c4996
19105c40692B02870a59205A1384b43916o7827b0420p6710p9686P6656A75211J27972
$$ plain form
19094 303183 -149369 -276368 34003 -85530 -19392 -293391 -62793 -310090 -172158 -146650
19084 -146650 174797 161652 -213441 66917 -47303 332413 -129981 80044 -37332 -111967 -10586
19072 49203 47056 -238624 74071 -178285 213136 -179368 -202512 186095 -333942 -26710 6495
19060 -5535 -137653 188161 98331 119289 -128106 -187719 76086 -449908 -23636 183170 50996
19048 -323914 -285907 -25075 -226906 89098 150980 121787 -139217 47976 -257623 41810 -62794
19036 -1725 -49457 65961 -41 154148 145119 -55492 144258 -178080 14581 292030 -82929 148302
19023 129097 115517 82836 290080 6475 329570 -130708 -104942 -208920 108034 -8744 106407
19011 -66298 -91324 -127539 -34343 65896 74499 24371 -114094 37810 3922 -76488 -44414 123969
$$ packed form
19094C03183a49369j26999C4003h5530a9392k73999f2793k47297J37932K5508
19084a46650A74797j3145b13441F6917d7303C32413a29981H0044c7332p4635a0586
19072D9203k147b38624G4071a78285B13136a79368k3144A86095c33942b6710F495
19060e535j32118A88161q9830K0958a28106n9613G6086d49908b3636A83170E0996
19048c23914L8007b5075k01831H9098O1882k9193a39217D7976b57623D1810f2794
19036a725m7732F5961d1A54148r029e5492A44258a78080A4581K77449h2929A48302
19023A29097j3580l2681K07244F475L23095a30708K5766j03978A08034h744A06407
19011f6298k5026l6215c4343F5896Q603B4371a14094C7810C922g6488L2074A23969
$$ plain form
18998 -205490 239347 374261 -1112 -329146 -265508 -116123 -198764 84969 -126613 -191748 30581
18986 -60798 -493051 -61480 -196792 148120 -258725 119585 20181 -17822 -92015 -107628 -17018
18974 109085 36334 -253234 -203713 148308 -584943 -35568 14530 145453 -160732 -185104
18964 -185104 -310266 171145 -460765 43609 -28963 56069 95789 -63034 -34005 6089 -52900
18952 4481 -234560 122439 -119387 -159738 -344424 72061 -83831 70940 -85320 -141982 -158008
18941 -158008 -214386 -106199 196812 5025 -149443 143370 -215870 163713 93951 -57644
18930 -179554 -81211 196950 -330019 -141784 -13707 -25625 -164617 91298 135098 56690 -15272
18918 118518 -84351 -332275 150650 -265587 -349928 124211 -28198 -63810 -55940 -262923 -98191
$$ packed form
18998b05490B39347J34914a112l28034O3638a16123q2641H4969a26613o5135C0581
18986f0798m32253f1480j35312A48120b58725A19585B0181a7822p4193j5613a7018
18974A09085C6334b53234M9521A48308e84943c5568A4530J30923a60732k4372
18964a85104j25162A71145d60765D3609b8963E6069L9720f3034K9029F089e2900
18952D481b34560A22439a19387m0351j84686G2061h3831G0940h5320n6662j6026
18941a58008n6378a06199A96812E025a49443A43370b15870A63713o9762e7644
18930a79554h1211A96950c30019a41784a3707j1918j38992I1298M3800E6690a5272
18918A18518h4351k47924A50650b65587q4341A24211b8198l5612P870k06983i8191
$$ plain form
18906 34277 -430 -33494 317579 77101 214414 -142367 -224847 152026 265218 -140515 17641
18894 -106007 13101 62677 -374706 -36881 -308726 -21157 -132301 168562 -14371 -107422 11991
18882 16810 81792 -88687 26922 160057 -14243 -131507 50016 -260025 182352 21260 38789
18871 38789 -71796 369908 -200774 -189240 106782 98480 55698 -237014 -234045 368394 -169642
18859 111154 151233 -345322 -52995 503179 183745 -105737 -5408 -69380 -221044 -3481 -172335
18848 -172335 23805 -3732 2538 -27271 58061 -205411 -40730 -172685 23834 -50766 11263
18836 -90171 -93683 120703 -123155 109732 118086 -198560 -163667 11756 10909 -333743 -221617
18825 -221617 -73328 -114611 -8083 110243 46651 154718 -55005 -93659 20440 308694 27080
$$ packed form
18906C4277d30l3064C17579G7101J37313a42367q2480A52026J13192a40515A7641
18894a06007A3101M9576c74706c6881k71845b1157j11144A68562a4371r3051A1991
18882A6810O4982h8687B6922J33135a4243j17264E0016b60025A82352B1260J7529
18871C8789g1796C69908b00774J1534A06782q302m2782b37014K969C68394a69642
18859A11154M0079c45322e2995E03179A83745a05737e408o3972j51664c481j68854
18848a72335B3805c732B538b7271E8061b05411d0730j31955B3834e0766A1263
18836i0171l512A20703a23155A09732Q354a98560L4893A1756q47c33743J12126
18825b21617g3328m1283h083A10243D6651J08067e5005l8654B0440K88254B7080
$$ plain form
18813 33799 17225 -18462 74134 327532 55648 113170 -77359 93516 295884 -369838 -75737
18801 -7594 -181741 162496 7404 -229964 77646 73476 -134088 69594 -418443 123522 -252157
18789 -144651 -162561 -23171 -291262 -88789 -114329 -253572 -227584 80456 -108552 -264056 -110120
18777 -108058 -208586 -171401 -116957 -61264 269293 -119257 40972 -164905 -132060 124691
18766 -464303 145589 -69567 -184176 95361 -190823 50059 -68702 -104702 -48421 -108783 -121792
18755 -121792 116467 53606 29337 199258 78726 -258826 -139692 -17821 11214 -164033
18744 234037 -126954 -219468 -293434 -30962 -467791 78488 -262754 -83739 230410 10103 -185878
18732 142498 -230889 -10552 234520 197726 -184794 166571 81499 70368 -188874 -235635
$$ packed form
18813C3799j6574a8462G4134K53398E5648N7522g7359I3516K02368c69838g5737
18801g594j74147A62496G404b29964G7646m170a34088F9594d18443A23522b52157
18789a44651j7910b3171k68091h8789k5540j39243K5988H0456a08552j55504a10120
18777a08058j00528L7185N4444N5693B69293a19257D0972a64905L2845A24691
18766d64303A45589f9567j14609I5361a90823E0059f8702l6000d8421o0362j3009
18755a21792A16467E3606k4269J69921G8726b58826J19134a7821A1214a64033
18744B34037a26954r2514p3966c0962m36829G8488b62754h3739B30410A0103a85878
18732A42498b30889a0552B34520l6794a84794A66571H1499j1131a88874m6761
$$ plain form
18722 -235635 -177356 169258 45281 40710 114568 -224916 -121693 -3644 -146239 -8912 -181997
18711 -181997 -122451 -40593 -15584 -68238 128868 113680 -74157 -271873 -167236 -40377 -74629
18700 -74629 163314 72898 2841 4689 -242704 176091 112241 -43239 217437 84524 -76201
18688 -171877 312597 233632 91959 4772 129143 32878 -48644 -22430 -126343 -216793 88988
18676 -273243 -119108 -219639 -143346 56214 199950 130522 87138 -53582 -143108 37242 -297258
18664 -133959 -216069 39123 -21479 94327 37720 -145258 104421 55037 -183319 -242707 128338
18652 144597 -31183 -33572 -120510 381767 170866 -138226 75774 31082 220081 143789 -24166
18640 -96757 228076 70101 -174639 -52177 -125264 -131871 -233984 -195932 66988 -60155 -122432
$$ packed form
18722b35635N8279A69258D5281m571P3858b24916J03223c644j42595h912j73085
18711a81997N9546d0593a5584n2654A28868j5188g4157j97716J04637d0377l4252
18700g4629A63314G2898B841J848b42704A76091o3850d3239B17437H4524g6201
18688a71877C12597p8965I1959D772J24371C2878d8644b2430j03913r0450H8988
18676b73243a19108j00531P6293E6214J43736o9428m3384e3582q9526C7242b97258
18664a33959q2110C9123b1479I4327C7720a45258A04421m9384a83319n9388A28338
18652A44597c1183k389q6938C81767A70866a38226G5774C1082J88999p6292b4166
18640i6757B28076G0101a74639e2177p3087o607j02113L8052F6988f0155o2277
$$ plain form
18629 -122432 -242994 197947 -25469 -136554 -27789 -64756 -321463 -199397 -391593 -15397
18618 -131894 -174003 325491 -26774 -73066 -235736 -40604 31838 -159725 -139456 -80077 98883
18606 251769 -15918 44287 6637 87696 -269567 -229758 6717 -217420 72258 84086 -285335
18594 -341317 165202 9682 -191109 -37198 -47624 -97735 -29055 -248721 47670 -262121 44640
18582 -342001 -76787 -205174 127338 175361 -282583 -31591 -142328 -193474 139409 333238
18572 333238 198667 -166610 -41817 -63376 110092 -432026 -30943 -141170 46084 216594
18562 216594 276752 -296382 -127918 99531 74422 153662 -363887 -293637 -135923 39387 11568
18550 121668 -233841 73606 5535 -132454 -43696 -117811 -254216 250151 -206748 293303
$$ packed form
18629a22432j20562A97947b5469j11085b7789l6967k56707J22066j92196a5397
18618a31894m2109C25491b6774m6292j62670d0604C1838a59725K0269N9379I8883
18606B51769a5918D4287F637Q1059b69567L9809F717b17420G2258J1828b85335
18594c41317A65202I682a91109c7198j0426n0111b9055k19666D7670b62121D4640
18582c42001g6787j28387A27338M8023b82583c1591j10737n1146A39409J93829
18572C33238j34571a66610d1817k1559A10092d32026c0943j10227D6084J70510
18562B16594O0158b96382a27918I9531k5109P9240c63887P0250a35923C9387A1568
18550A21668b33841G3606E535a32454d3696p4115j36405B50151b06748B93303
$$ plain form
18539 137200 204838 168728 -89893 -191814 168669 137754 -223206 -212646 31641 -171667 171459
18527 170581 57282 -120209 -363529 -91473 244860 246108 -163363 -426372 -87171 -277760
18517 -277760 -183249 26386 -40075 -49906 -403285 -78163 13061 -384193 -9876 335434 55052
18505 -141533 -212029 18402 -59134 -52756 -432020 -182044 -204327 201430 -205016 155861 7654
18493 66438 -133398 -169718 192167 -24351 -126401 50864 -98913 -278550 -98534 -81209 66231
18481 166450 210648 -129736 -5528 -197590 -180020 -185236 -97954 -126769 38912 192823 -67049
18469 -369133 -70891 151162 -16174 -246129 -140021 -481493 -77885 -68455 -238566 37289 103614
18458 103614 -126731 -106175 24034 -159808 -70232 -68032 154878 -51620 -54254 54682 338576
$$ packed form
18539A37200O7638l6110h9893j01921A68669l0915b23206J0560C1641a71667A71459
18527A70581E7282a20209k43320i1473B44860J248a63363k63009h7171j90589
18517b77760R4511B6386d0075r831l53379g8163A3061c84193i876C35434E5052
18505a41533p0496A8402e9134O378l79264a82044k2283B01430b05016A55861G654
18493F6438a33398l6320A92167b4351j02050E0864i8913j79637i8534J7325F6231
18481A66450M4198a29736e528j92062J7570n216Q7282k8815C8912J53911f7049
18469c69133g0891A51162a6174k29955J06108l41472g7885R430j70111C7289O6325
18458A03614a26731K0556B4034a59808g0232K200A54878e1620k634E4682K83894
$$ plain form
18447 338576 -164584 84804 -126162 -115914 208009 -20706 -94794 127198 168226 -94303 18101
18435 326235 81448 -231447 -199907 19086 113461 -20471 -109448 1782 35880 140265 -39765
18423 -422036 -144309 -205299 -8747 -114350 36259 -313402 1710 163613 -169492 207048 69856
18411 298541 99646 268080 -180590 157060 -157147 32860 96687 179048 10774 -326415
18400 116888 80888 -73977 -129190 -257062 200407 166287 -274885 -107601 -335488 153537
18389 127567 -155188 -65249 199820 -283249 91492 -245863 135965 -126 -102717 -52559 -205707
18378 -205707 -135888 -27704 -112011 171767 -40828 313864 46722 152913 158373 141234 238060
18367 238060 27728 -183762 107640 110947 167879 115389 -195428 -12803 -257679 -64758 32036
$$ packed form
18447C38576a64584H4804a26162J0248B08009b0706p4088A27198M1028i4303A8101
18435C26235H1448b31447L1540A9086R4375b0471q8977A782L4098J04385c9765
18423d22036a44309o0990h747j05603C6259c13402A710J61903a69492B07048F9856
18411B98541I9646J68434a80590A57060a57147C2860O3827Q2361A0774c26415
18400A16888l6000g3977n5213j27872B00407l4120b74885a07601k27887A53537
18389A27567a55188f5249A99820b83249I1492b45863A35965a26j02591N0158j53148
18378b05707O9819b7704q4307A71767d0828C13864D6722J06191N460j7139R6826
18367B38060B7728a83762A07640L307N6932n2490a95428a2803k44876f4758C2036
$$ plain form
18355 -67973 -237383 -40984 -614175 196142 -343690 -198519 -8889 -209773 -279158 122548
18344 -207976 -207436 190130 106356 -79386 -80969 -239131 -246847 117626 -82665 22678 154061
18333 154061 -159643 -46366 -120741 -163589 -192936 -313131 -44473 -60199 -4926 113930 -36266
18321 -206241 185721 79688 -296978 -118859 -88653 106718 -99190 163637 -143712 225521
18310 89447 318273 -72031 -76035 372522 -189789 -10535 -233239 -78942 62090 51166 207844
18299 207844 -159318 140723 -60619 170107 -230992 170429 -174146 5547 1537 136002
18289 136002 410452 33320 -429783 63446 269247 105410 -249089 172965 -114249 -308657
18279 -308657 -385670 29463 -184554 -189577 -50666 -397263 -59350 11775 204602 94750 44236
$$ packed form
18355f7973j69410d0984n73191A96142c43690J45171h889k00884o9385A22548
18344b07976N40A90130q3774g9386j583j58162p716A17626h2665B2678J31383
18333A54061a59643d6366p4375m2848k9347j20195d4473j5726d926A13930c6266
18321b06241A85721G9688b96978a18859L0206A06718i9190A63637a43712B25521
18310H9447K28826g2031m004C72522a89789a0535k22704g8942F2090j0924J56678
18299B07844a59318A40723f0619A70107b30992A70429a74146E547A537J34465
18289A36002K74450C3320d29783F3446K05801A05410b49089A72965a14249j94408
18279c08657p7013B9463a84554n023e0666l46597e9350A1775J92827I4750D4236
$$ plain form
18267 -255082 108210 76706 -19281 37776 165859 -70210 163735 -24594 -75083 -129440 -128498
18256 -128498 -108289 -127152 97987 22581 -90180 -20096 -70074 -101481 85828 -97473 -9093 -190748
18244 -190748 -233418 -171985 -67132 38731 110463 74050 -54364 77936 147552 -156673 -48123
18232 -88431 -74220 -142622 135571 108776 -79733 -40436 1739 -102401 -5388 96138 -207653
18220 139827 -31392 376177 -149996 -201508 50289 -93576 98557 100165 42799 -133237 -355900
18209 -355900 96416 -229130 82321 -85331 -411013 -129419 191517 -149185 89503 -103857
18198 -277638 -228129 -221277 32340 169168 -213924 -287705 -105721 -102151 -240889 -60403 -6690
18186 226026 26223 177225 176614 -393228 3039 -40024 182873 -313769 146657 25400 -227209
$$ packed form
18267b55082A08210l1504a9281C7776J28083g0210A63735b4594n0489n4357R42
18256a28498K0209j8863I7987B2581i0180b0096m9978l1407H5828i7473i093j81655
18244a90748m2670O1433f7132C8731P1732l6413e4364G7936O9616a56673d8123
18232h8431J4211o8402A35571k6795g9733L9297A739a02401e388I6138b07653
18220A39827c1392C76177a49996n1512E0289i3576I8557J608D2799a33237k22663
18209c55900I6416b29130H2321h5331l25682a29419A91517a49185H9503a03857
18198b77638M9509O852C2340J36828b13924p3781a05721L570j38738f0403f690
18186B26026B6223J51002o11c93228C039d0024A82873c13769A46657B5400b27209
$$ plain form
18174 -17897 -169700 60644 -83902 43514 323464 137210 224269 -90028 79648 -134852 -358489
18163 -358489 -60277 -79527 152719 -81640 51169 -219729 -242618 308461 59589 -188192 -125995
18152 -125995 15784 -17699 -216257 52494 -22486 122040 16179 -310296 -73304 266266 104144
18140 -150864 -221636 -107119 -43341 -213045 -299913 116908 103328 17767 -102539 -6362 -97811
18129 -97811 -205428 -8062 -34552 -119791 -1807 320543 -16606 118571 -157125 -22541 -162833
18118 -162833 -215668 -172467 57816 -35782 123409 116453 68008 -448628 -199562 -399245 63970
18106 70527 -200328 -65769 -64476 -153915 -106335 37389 -180124 -176087 203628 -94233 35461
18094 -104877 176240 -117594 -25749 52720 -208887 401238 2848 10516 -32910 -152458 -96865
$$ packed form
18174a7897j51803F0644h3902D3514K79950A37210Q7059i0028G9648a34852k23637
18163c58489f0277j9250A52719h1640E1169b19729k2889C08461E9589a88192O2197
18152a25995A5784a7699j98558E2494b2486A22040A6179c10296g3304B66266A04144
18140a50864p0772a07119d3341j69704q6868A16908j3580A7767a02539f362r1449
18129i7811j07617h062k6490q5239a807C20543a6606A18571a57125b2541j40292
18118a62833n2835M3201E7816c5782A23409o956m8445d48628a99562j99683F3970
18106G0527b00328f5769J293q9439M7580C7389a80124M037B03628i4233C5461
18094a04877A76240a17594b5749E2720b08887D01238B848P668c2910j19548N5593
$$ plain form
18083 -96865 -468334 194402 96488 58889 -201132 -222701 -42699 44545 -9766 -80384 -208634
18072 -208634 -39915 -84264 -258956 -115619 -88844 -100437 207652 -39473 -61590 -107032 155124
18060 53945 -157453 -4617 51152 -259721 -259056 10447 -57464 -58520 -43478 -172197 34197 -220171
18047 185359 -88701 -357667 -109965 -127838 -123145 253929 -345399 19670 75814 94215 152688
18036 152688 319087 44760 -109935 63862 -151177 93911 -4980 144020 -7191 -334784 126329
18024 24922 91062 -34339 -173216 23633 68409 178348 -483962 -103338 126867 6139 7119
18013 7119 -116684 -194547 118633 -85869 -119271 63540 67651 303699 -68851 15837 55678
18002 55678 1012 149137 -101704 -152258 391599 -70887 83873 264141 84170 -55553 -211926
$$ packed form
18083i6865l71469A94402I6488l7599b01132k1569d2699D4545i766p0618j28250
18072b08634c9915m4349j74692a15619K6775j1593B07652c9473k2117m5442A55124
18060E3945a57453d617E1152b59721O65A0447e7464j056J5042j28719C4197b20171
18047A85359h8701k68966a09965j7873M693B53929c45399A9670N6144J8401N8473
18036A52688J66399D4760a09935F3862a51177I3911d980A44020g191l27593A26329
18024B4922O6140c4339j38877B3633M4776J09939d83962a03338A26867F139R80
18013G119a16684p7863A18633h5869l3402F3540M111K36048f8851A5837L9841
18002E5678A012J48125a01704n0554C91599g0887H3873J80268H4170e5553j56373
$$ plain form
17991 -211926 -198149 -138911 -155547 8524 -157522 4904 123573 21016 149709 432141 -122178
17979 -19351 -271285 33873 84669 -200264 -261230 -58033 -233435 363013 -144383 343041
17968 -38526 134880 -198326 -157791 -116865 -70485 27642 -85498 -377172 -20825 -75408 -523823
17957 -523823 -77007 24371 58150 -148922 -267897 96475 -179093 -94071 -248728 -47140 33925
17945 206656 26162 214375 137085 -24403 137060 -17231 -237026 -184985 99703 -84086 -72481
17934 -72481 -305452 -253729 -104401 -260444 -20959 195662 -196805 -105433 147278 -21437
17923 -88628 -187005 -131471 174861 242783 -74350 115620 -1939 210022 -106280 110791 230148
17912 230148 -137687 183791 132169 -118993 -8911 -286821 151638 -230006 56316 -320175
$$ packed form
17991b11926J3777N9238j6636H524a57522D904J18669B1016J28693K82432a22178
17979a9351k51934C3873N0796b00264o0966e8033j75402C63013a44383C43041
17968c8526A34880a98326M0535M0926M6380B7642h5498k91674b0825n4583m48415
17957e23823g7007B4371L3779a48922j18975I6475a79093Q5022j54657d7140C3925
17945B06656B6162J88213p7290b4403A37060a7231k19795N2041I9703h4086J1605
17934g2481k32971N1723a04401j56043b0959A95662a96805R1372A47278b1437
17923h8628r8377N5534A74861O7922g4350A15620a939B10022a06280A10791J19357
17912B30148a37687A83791n1622a18993h911k77910A51638b30006E6316c20175
$$ plain form
17901 -148334 -14050 -73723 114165 -320791 183017 -338805 11070 -58105 -38845 122333
17890 -45186 -338581 -242947 63186 27895 154768 393495 -4387 -162493 150166 -147 54515
17878 -251205 15259 -129714 156207 38163 -160612 79 -88980 63819 17050 -132959 6189
17866 103585 -127939 233886 53081 -219145 -7887 247648 -126264 106231 2227 116745
17856 116745 -179821 -112996 -52348 19141 -315944 -184906 -180725 -44389 238366 157928 -30736
17844 320731 236684 -164915 -314488 -65552 141055 191534 418036 -100190 113567 36557
17833 182878 54875 122279 62890 -105526 50140 -102412 -223296 -33303 309595 -113368
17822 78330 -266858 86153 153636 94379 -59476 -48492 -277941 113081 59494 -126315 85595
$$ packed form
17901a48334a4050n9673A14165c20791A83017c38805A1070e8105J9260A22333
17890d5186k93395R5634F3186B7895J26873K38727d387j58106A50166a47E4515
17878b51205A5259a29714A56207C8163a60612G9h8980F3819A7050a32959F189
17866A03585a27939B33886E3081b19145g887B47648a26264A06231B227J14518
17856A16745a79821O6825e2348A9141c15944J31038M181d4389B38366q0438c0736
17844C20731q4047a64915j49573f5552A41055N0479K26502a00190A13567C6557
17833A82878E4875O7404n9389a05526E0140a02412j20884c3303C09595a13368
17822G8330b66858H6153O7483n9257e9476J0984k29449A13081n3587a26315H5595
$$ plain form
17810 -266614 220153 98893 -70397 -166550 150579 -53015 -146750 249417 -222978 -191134 124173
17798 -226633 -274621 219501 143821 -204004 -52375 -241373 70888 -129958 -179868 257402
17787 -299742 51654 -165153 -156880 -50842 21986 77896 -460764 130612 -332452 176472 39066
17775 -165176 137651 -298535 456663 67891 279418 -31520 -73794 -212221 275553 -220368
17764 -201242 -248240 -101704 184241 73640 72751 89744 238466 -316378 -68481 179327 166386
17753 166386 258387 106029 109133 -193162 151340 -17378 -240808 21055 11760 134543 -7375
17741 60748 122652 69998 32548 -234939 -42507 77842 -173357 145989 -110129 -47619 -139046
17730 -139046 5275 -216369 2221 -257250 -52098 -82035 -12191 85715 166179 -132974 35931
$$ packed form
17810b66614B20153I8893g0397r6153A50579e3015r3735B49417b22978L1844A24173
17798b26633m7988B19501p5680b04004e2375j88998G0888a29958m9910B57402
17787b99742E1654a65153Q273e0842B1986N5910d60764A30612c32452A76472C9066
17775a65176A37651b98535D56663F7891K11527c1520m2274j38427B75553b20368
17764b01242m6998a01704A84241G3640q89J6993J48722c16378f8481A79327j2941
17753A66386R2001A06029L104a93162A51340a7378k23430B1055r295J22783g375
17741F0748O1904n2654C2548b34939d2507G7842a73357A45989a10129d7619r1427
17730a39046E275b16369B221b57250e2098k9937a2191H5715Q0464a32974C5931
$$ plain form
17718 202279 53349 -78524 -159958 58879 -203024 -314776 -56110 32426 -181644 -66862 210730
17706 -119400 -15146 -253900 -83638 -307459 -140303 20514 174012 -141295 31054 161925
17696 161925 153968 7242 -78986 -51810 -183031 85103 157137 122857 -276515 -122244 -209886
17685 -209886 59132 417893 265081 163508 -102512 -50516 47088 297762 -147812 222426
17674 134831 -211520 30809 168242 -226 84665 109210 168878 -49653 194693 -91774 -30955
17662 -39356 138433 -237286 192696 -126336 -142240 -171654 -267829 187436 110008 71939 -24758
17650 -39191 35910 91967 -58166 129430 -161203 -299283 -347116 52283 119946 -173010 254071
17638 -78417 67889 106709 -190758 280590 -47262 -229326 243752 125628 -187870 138231
$$ packed form
17718B02279E3349g8524q1434E8879b03024j11752e6110C2426a81644f6862B10730
17706a19400a5146k38754h3638k23821a40303B0514J53498a41295C1054J30871
17696A61925p957G242g8986K7176j31221H5103P2034l4280b76515a22244q7642
17685b09886E9132L58761j52812j01573a02512e0516D7088K50674a47812B22426
17674A34831b11520C0809J37433b26H4665K4545N9668d9653A94693i1774c0955
17662c9356A38433b37286A92696a26336j5904k9414r6175A87436p7428l8069b4758
17650c9191C5910N6057e8166A29430a61203j38080m7833E2283O7663a73010B54071
17638g8417F7889L8820a90758B80590d7262j82064B43752j18124a87870A38231
$$ plain form
17627 268802 161383 44672 538548 -124132 -202768 -54333 54233 182805 250646 262539 133042
17616 133042 149353 -159938 -61316 165399 58967 -245601 -292095 -425576 -252818 -27496
17605 -48301 213573 -112771 86203 -293071 -5218 -190662 41318 -130050 178279 -151847
17594 259932 170627 160785 -148226 151667 -199155 301724 147726 -277933 87086 -55823
17583 -189500 377185 -167774 -303617 46732 157805 6143 208562 151058 -52037 -139240 261177
17571 192838 229540 -13527 259834 84052 -109607 93791 146496 320849 -255433 -169383 -37872
17559 -27427 79342 -968 89684 91409 161604 140176 279715 -24937 -202858 61503 70656 165581
17547 165581 -95452 97256 51779 -6877 -42882 166205 184498 -119947 -15152 61652 -46499
$$ packed form
17627B68802j07419D4672M93876a24132p8636e4333E4233J28572O7841J1893j29497
17616A33042J6311a59938f1316A65399E8967b45601m6494j33481J72758b7496
17605d8301B13573a12771H6203b93071e218j85444D1318a30050A78279a51847
17594B59932q9305r842a48226A51667a99155C01724A47726b77933H7086e5823
17583a89500C77185a67774j35843D6732J11073F143K02419n7504e2037q7203B61177
17571A92838L6702a3527B59834H4052a09607I3791N2705J74353b55433Q6050c7872
17559b7427G9342i68H9684J725P0195k1428J39539b4937j77921F1503R153R4925
17547A65581i5452I7256m5477f877l6005A66205J8293a19947a5152F1652d6499
$$ plain form
17535 101577 22619 -145137 283819 -224432 422233 -135507 -8680 156606 293965 -18794
17524 -44196 -179854 53098 194195 -39076 -5488 40740 71110 129240 249824 -120600 216596
17512 -221691 58638 13193 184269 122068 55166 358074 189084 -61090 100876 -13289 67539
17500 -54347 100058 -177242 -74410 168149 -60606 8035 213534 -30367 154826 -77538 -39248
17489 -39248 100466 -185671 94802 -206954 141809 369128 234075 366213 -349 2176 335867
17478 335867 290024 394457 -12566 250426 -130612 322301 204193 103161 307884 261186
17468 261186 -266300 -63398 86334 366031 84212 301511 367823 -210961 178272 164962
17458 164962 116776 423511 278993 32544 -280875 184182 309268 260104 271314 278806 9316
$$ packed form
17535A01577B2619a45137B83819b24432D22233a35507h680A56606J37359a8794
17524d4196j35658E3098J41097c9076e488D0740L0370N8130J20584a20600B16596
17512b21691E8638A3193J71076o2201E5166L02908j68990f1090A00876a3289F7539
17500e4347A00058a77242g4410A68149f0606H035K05499c0367A54826g7538L8290
17489c9248A00466a85671I4802b06954A41809K27319j35053J32138c49B176L33691
17478C35867m5843J04433a2566B50426a30612C22301j18108j01032K04723m6698
17468B61186b66300f3398H6334K79697H4212K17299O6312b10961A78272j3310
17458A64962m8186L06735j44518C2544b80875A84182J25086m9164J1210P492I316
$$ plain form
17446 404900 389987 444129 -260900 1189 83506 500442 294666 272910 322187 264258 -17127
17434 69259 492259 306950 164504 168423 703541 351828 -38030 257567 -205885 135377
17423 95471 247333 282068 229968 104813 433109 430630 -61908 291691 306819 332039 -38397
17411 312658 -81638 294662 220138 335434 226978 129921 123838 345067 523127 134715
17400 137755 199958 259851 243351 177863 157048 438767 318317 222597 210607 213855 160006
17389 160006 116773 190020 135440 110997 114423 104984 131914 52661 -54690 -127185 382513 -93626
17376 -115021 254049 -23849 -79357 -44227 98710 227701 352572 -153082 162232 206344
17366 206344 -98466 8152 68735 75597 -14597 299041 165531 154737 238623 215887 274818
$$ packed form
17446D04900j4913N4142b60900A189Q2317M16936k05776k1756M9277n7929a7127
17434F9259M23000j85309j42446L919N35118l51713c8030B57567b05885A35377
17423I5471J51862L4735n2100A04813L28296k479f1908B91691J5128K5220c8397
17411C12658h1638B94662p4524J15296j08456r7057o083K21229J78060A34715
17400A37755O2203N9893j6500o5488k0815K81719j20450r5720j1990L248n3849
17389A60006m3233P3247n4580k4443L426r439K6930E2661e4690p2495C82513i3626
17376a15021B54049b3849n5508L5130I8710J28991J24871a53082A62232M4112
17366B06344i8466H152O0583O862a4597B99041j33510j0794Q3886k2736N8931
$$ plain form
17355 274818 182296 193211 343510 326259 50824 306308 318330 102003 354616 151390
17344 28585 411479 178560 78457 344962 -132676 324480 116874 110979 342402 174268
17334 174268 383202 186407 105022 2566 -19610 98166 -191407 322708 -95533 -160149 16825
17322 279168 -72517 -17568 309693 334181 180837 94499 -144180 -90115 74190 61146 44678
17311 44678 149604 121287 -16050 289826 -162419 128162 422823 49835 18236 79048 -23559
17299 182238 -167033 -124584 -243749 -111143 422790 296656 -213493 -156573 498854 89394
17288 39167 411497 281713 -130672 144103 292185 -128696 28308 255412 -21028 403088
17277 372942 22229 295113 264708 15691 226731 130537 183781 125385 51588 178391 157923
$$ packed form
17355B74818r2522J0915J50299j7251E0824K55484J2022A02003K52613A51390
17344B8585L82894A78560G8457K66505a32676C24480A16874n895K31423j68134
17334A74268K08934A86407q1385B566a9610I8166a91407C22708i5533o4616A6825
17322B79168g2517a7568C09693K4488j53344q6338a44180N4065G4190j3044j6468
17311D4678J04926k8317a6050B89826a62419A28162K94661D9835A8236O0812b3559
17299A82238a67033M2449j19165a11143D22790j26134b13493N6920D98854H9394
17288C9167L72330j29784a30672A44103J48082a28696B8308K27104b1028D03088
17277C72942B2229K72884l0405A5691K11040r6194N3244n8396E1588J26803k0468
$$ plain form
17266 157923 63829 93522 -41122 193437 14396 25274 52385 192340 -53159 81579 -89486
17254 212879 426190 -51048 50023 270332 179316 81896 230120 289101 35880 201104 35991
17242 -21889 -7192 -245464 66303 -202247 122383 34709 -58184 217001 130348 111672 188530
17231 188530 -85148 193919 58039 250410 90832 -47267 200071 415960 351477 76933 289990
17220 289990 90347 112925 292068 176242 345583 261467 102557 237934 -23911 326729
17209 31680 197211 349992 129898 265361 170885 52048 307226 339031 527726 367083
17199 367083 174840 366170 316884 214909 99219 47324 142543 -100832 328187 -112818
17188 231483 300038 -20623 120317 482253 405913 259721 352065 97146 344126 560932
$$ packed form
17266A57923F3829K9693d1122A93437A4396J0878K7111J39955e3159H1579h9486
17254B12879K13311e1048E0023K20309r1016H1896J48224N8981C5880J65224C5991
17242b1889g192k38272F6303b02247A22383C4709e8184B17001q6653j8676P6858
17231A88530h5148A93919E8039J92371I0832d7267B00071K15889o4483G6933K13057
17220B89990I0347K2578J79143j15826J69341q4116A02557J35377b3911C26729
17209C1680J65531J52781A29898J35463r4476E2048K55178L1805J88695j60643
17199C67083A74840J91330m9286j01975I9219D7324R5219a00832C28187a12818
17188B31483O8555b0623A20317L61936p6340j46192R2344I7146K46980K16806
$$ plain form
17178 560932 360045 -5735 205715 171446 570646 503209 347958 203944 399412 331961
17168 331961 239294 -9442 299463 343015 160059 358741 531529 112959 450450 175665
17157 385548 150791 40079 64506 208031 316913 148320 269374 463855 199243 428834
17147 428834 362492 363577 245016 195792 678653 340540 465304 140764 411178 175453
17136 228938 205478 504938 405126 465651 724567 397722 514967 253601 411812 202315
17125 233640 233064 499878 511588 272775 264853 308500 436366 190863 175307 31384 264678
17114 264678 565969 327385 -124393 305372 561736 493769 472380 532544 514957 227111
17103 373160 131352 226419 148921 333638 294994 469929 241325 305759 433132 545268
$$ packed form
17178E60932k00887e735B05715l4269L99200o7437j55251j44014J95468o7451
17168C31961r2667i442B99463M3552A60059J98682J72788A12959L37491A75665
17157C85548A50791D0079K4427J43525J08882A48320J21054J94481A99243K29591
17147D28834o6342J085j18561m9224M82861l38113J24764A40764K70414A75453
17136B28938k3460K99460r9812O0525K58916l26845J17245B53601J58211B02315
17125B33640n76K66814J1710k38813p922M3647J27866A90863j5556C1384K33294
17114B64678L01291k38584a24393C05372K56364o7967k1389O0164j7587B27111
17103C73160A31352R5067p7498J84717l8644J74935k28604O4434J27373J12136
$$ plain form
17093 545268 340106 225880 421087 224388 417528 321258 363504 233492 235275 414056
17083 414056 470017 171008 779107 211683 582754 359052 408110 522239 555055 467293
17073 467293 102666 381096 478698 525995 647185 410246 643609 402616 387796 645250
17063 645250 298538 817336 428025 579779 368118 595169 380516 465685 723803 375499
17053 375499 589003 372381 497743 680981 342834 415820 477787 760813 608762 424870
17043 424870 509098 405676 490863 345986 339248 969078 441088 579784 217263 596776
17033 596776 709927 553580 693683 925367 317522 518359 502123 859375 701381 695180
17023 695180 442248 627884 628791 648543 679305 685403 467255 629723 785050 291959 583661
$$ packed form
17093E45268k05162j14226J95207j96699J93140r6270M2246j30012J783J78781
17083D14056N5961A71008O08099B11683L71071k23702M9058J14129L2816q7762
17073D67293A02666K78430R7602M7297J21190k36939K33363k40993j4820K57454
17063F45250B98538N18798l89311J51754k11661K27051k14653Q5169K58118l48304
17053C75499K13504k16622J25362J83238l38147P2986O1967K83026j52051j83892
17043D24870Q4228j03422Q5187j44877o738O29830D41088J38696B17263L79513
17033E96776J13151j56347J40103K31684C17522K00837j6236L57252j57994o201
17023F95180k52932J85636R07J9752L0762O098k18148J62468J55327B91959K91702
$$ plain form
17012 583661 482681 617471 597653 654371 309016 519623 621758 786908 402680 738052
17002 738052 920749 351657 390299 734983 718601 609824 841002 436526 693747 594489
16992 594489 914157 617278 791799 572209 952916 758696 644435 1156942 681928 823908
16982 823908 667577 756833 744727 733995 653355 716861 781379 710400 1052637 644620 778618
16971 778618 771143 977400 792580 841659 963277 486122 841594 854741 939025 1034579 1124984
16960 1124984 902409 853957 822586 772539 1070773 823787 964810 974541 893900 1067785
16950 1067785 869481 1005583 1067997 1116006 1002705 1316134 993188 889906 1128673 1296588
16940 1296588 1220889 851329 1162486 1625104 1064203 1270425 1111959 1305046 1342548 1298298
$$ packed form
17012E83661j00980J34790j9818N6718C09016K10607J02135J65150l84228L35372
17002G38052J82697C51657L8642L44684j6382j08777K31178m04476K57221r9258
16992E94489L19668k96879J74521k19590L80707j94220j14261N12507m75014J41980
16982H23908j56331Q9256j2106j0732q0640O3506O4518p0979L42237m08017J33998
16971G78618p475K06257j84820M9079J21618m77155L55472J3147Q4284R5554R0405
16960A124984k22575m8452l1371n0047K98234k46986J41023R731q0641J73885
16950A067785j98304J36102O2414M8009j13301L13429l22946j03282K38767J67915
16940A296588p5699l69560L11157M62618n60901K06222j58466J93087L7502m4250
$$ plain form
16930 1298298 1184411 1551696 1110153 1036529 1281503 1184982 1523011 1333828 1431739 1219838
16920 1219838 1331532 1142281 1207284 1275886 1694091 1453299 1458325 1442667 1443536 1593394 1476900
16909 1476900 1374562 1624940 1472503 2001863 1470786 1647443 1363501 1539115 1488549 1532452
16899 1532452 1979410 1679616 1511236 1819718 1831723 1796283 1737128 1959563 2285853 2041305
16889 2041305 2311737 1769482 1926331 1869203 1732007 2153510 2008005 2182760 1792116 1944595
16879 1944595 1949038 2041109 2229719 2400802 2155347 2503840 2343778 2356527 2577996 2217143
16869 2217143 2620765 2709707 2476543 2602357 2644954 2364107 2842664 2614744 2617341 2511937
16859 2511937 2958539 3016761 2999719 2696733 2831568 2955826 2974561 3170152 3041789 2936593
$$ packed form
16930A298298j13887L67285m41543p3624K44974r6521L38029j89183R7911k11901
16920A219838J11694j89251O5003O8602M18205k40792N026j5658Q69J49858j16494
16909A476900j02338K50378j52437N29360n31077J76657k83942J75614n0566M3903
16899A532452M46958k99794j68380L08482J2005l5440n9155K22435L26290k44548
16889B041305K70432n42255J56849n7128j37196M21503j45505J74755l90644J52479
16879A944595M443R2071J88610J71083k45455L48493j60062J2749K21469l60853
16869B217143M03622Q8942k33164J25814M2597k80847M78557k27920K597j05404
16859B511937M46602N8222j7042l02986J34835J24258J8735J95591j28363j05196
$$ plain form
16849 2936593 3274377 3595513 3264274 3104263 3267505 3398601 3325269 3482437 3849651 3373441
16839 3373441 3907186 3950421 3974098 3978814 4185695 3872745 4100133 4137806 4363774 4689363
16829 4689363 4441876 4407072 4740844 4548641 4964386 4639083 4908045 5053485 5311774 5181726
16819 5181726 5581463 5427393 5539293 5418491 5809940 5446241 6187451 5916024 6128747
16810 6128747 6197654 6780229 6810050 6775868 6832698 7041883 6895954 7218768 7922354 7861839
16800 7861839 7880330 7678733 8403148 8313800 8897479 9158044 9374570 9416443 9412923 9999486
16790 9999486 10015588 10587059 10809910 10959804 11633463 11352273 11895723 12411239 12962738 13147533
16780 13147533 13503697 14061745 14470620 14696775 15169612 15778016 16211466 16612498 17092040
$$ packed form
16849B936593L37784L21136l31239j60011J63242J31096p3332J57168L67214m76210
16839C373441N33745M3235K3677M716K06881l12950K27388L7673K25968L25589
16829D689363k47487l4804L33772j92203M15745l25303K68962J45440K58289j30048
16819E181726L99737j54070J11900j20802L91449l63699P41210k71427K12723
16810F128747O8907N82575K9821l4182N6830K09185j45929L22814P03586o0515
16800G861839J8491k01597P24415q9348N83679K60565K16526M1873l520N86563
16790I999486J6102N71471K22851J49894O73659k81190N43450N15516N51499J84795
16780A3147533L56164N58048M08875K26155M72837O08404M33450M01032M79542
$$ plain form
16771 17092040 17588634 18281308 19061847 19495849 20213392 21160528 21423357 22351507 23515944
16762 23515944 24604906 25132512 26248795 27537363 28823157 29721003 31002563 32251895
16754 32251895 33593797 35181403 36630483 38601244 40284812 42183890 43946888 46419121
16746 46419121 48690894 50789977 53699122 56449268 59624825 62717985 65756655 69618452
16738 69618452 73733588 77316024 82107296 86973904 91658004 96662252 102156040 108012109
16730 108012109 113843309 120322525 127105835 133490346 140021080 146830773 153035465 159127224
16722 159127224 164657715 169788836 173724157 177264520 179710888 180750672 180553813 179639027
16714 179639027 177308099 174187990 169779903 164777906 159183356 153057786 146460544 139747769
$$ packed form
16771A7092040M96594O92674P80539M34002P17543R47136K62829R28150J164437
16762B3515944J088962N27606J116283J288568J285794Q97846J281560J249332
16754C2251895J341902J587606J449080J970761J683568J899078J762998K472233
16746D6419121K271773K099083K909145K750146L175557L093160L038670L861797
16738F9618452M115136L582436M791272M866608M684100N004248N493788N856069
16730A08012109N831200O479216O783310O384511O530734O809693O204692O091759
16722A59127224N530491N131121L935321L540363K446368J039784j96859r14786
16714A79639027k330928l120109m408087n001997n594550o125570o597242o712775
$$ plain form
16706 139747769 132618242 125644694 119164528 112562362 106489976 99973701 94790085 88847286
16698 88847286 83763314 79062420 74519868 70535250 66145174 62597197 59260616 56139343
16690 56139343 52781328 50168425 47640793 45180652 42751519 40741216 39052088 37081420
16682 37081420 35387196 33229713 32089884 30539203 29455658 28010745 27040589 25347352
16674 25347352 24767079 23547037 22694839 21940302 20943265 20308549 19269262 18771682 18008471
16665 18008471 17402112 16690248 16445199 15874958 14740886 14637461 14151750 13779589 13338351
16656 13338351 12954606 12306037 12068488 11843079 11262858 11037235 10843574 10497698 9968151
16647 9968151 10096091 9425985 9057642 8810310 8923943 8695054 8424280 8313655 8034504
$$ packed form
16706A39747769p129527o973548o480166o602166o072386o516275n183616n942799
16698H8847286n083972m700894m542552l984618m390076l547977l336581l121273
16690E6139343l358015k612903k527632k460141k429133k010303j689128j970668
16682C7081420j694224k157483j139829j550681j083545j444913r70156j693237
16674B5347352n80273j220042q52198p54537r97037o34716j039287m97580p63211
16665A8008471o06359p11864k45049n70241j134072j03425m85711l72161m41238
16656A3338351l83745o48569k37549k25409n80221k25623j93661l45876n29547
16647I968151J27940o70106l68343k47332J13633k28889k70774j10625k79151
$$ plain form
16638 8034504 7982665 7447744 7491253 7160713 7313455 6918834 6737074 6373455 6234259 6256968
16628 6256968 5997301 5844340 6007607 5924217 5560565 5623010 5367471 5337654 4802232 5060406
16618 5060406 5002578 4792373 4721110 4885699 4635074 4519434 4439109 4292614 4155889 4169664
16608 4169664 4201235 3781705 3701762 4114080 3735527 3630237 3777127 3603957 3578733 3456247
16598 3456247 3450963 3444472 3319520 2982368 2950686 3041179 3252392 3284417 2638619 2918660 2817926
16587 2817926 2945646 2604318 2787927 3103529 2476962 2587426 2639980 2192731 2675381 2621817
16577 2621817 2449341 2338823 1932009 2238179 2418178 2058399 2523545 2376377 2420806 2090088
16567 2090088 2114011 2000946 2127003 1950594 1858307 1940269 2191058 1914502 1722958 1767973
$$ packed form
16638H034504n1839n34921M3509l30540J52742l94621j81760l63619j39196K2709
16628F256968k59667j52961J63267q3390l63652O2445k55539k9817n35422K58174
16618E060406n7828k10205p1263J64589k50625j15640q0325j46495j36725J3775
16608D169664L1571m19530p9943M12318l78553j05290J46890j73170k5224j22486
16598C456247n284o491j24952l37152l1682R0493K11213L2025o45798K80041j00734
16587B817926J27720l41328J83609L15602o26567J10464N2554m47249M82650n3564
16577B621817j72476j10518m06814L06170J79999l59779M65146j47168M4429l30718
16567B090088K3923j13065J26057j76409r2287Q1962K50789k76556j91544M5015
$$ plain form
16557 1767973 1944155 1619367 1577283 1592802 1567075 1900763 1476937 1750704 1699387 1684705
16547 1684705 1849941 1908643 1280340 1212216 1703700 1118993 1475280 1447773 1246448 1432379
16537 1432379 1270561 1290284 1647350 1583939 1017023 1358698 877245 1256273 1492106 1123186
16527 1123186 1369893 871498 971687 1243842 1332198 1211580 765457 1018704 1139358 1062699
16517 1062699 1069451 1115849 851482 1084175 934688 1180489 992922 1142169 992593 1043760
16507 1043760 1189002 1374669 761630 808258 986580 1323332 1026833 907719 919107 1022497
16497 1022497 806909 1071546 943679 938838 923167 918144 671282 779080 372939 706374
16487 706374 592917 734079 859443 628954 967810 794894 540127 819403 663107 918080
$$ packed form
16557A767973J76182l24788m2084J5519k5727L33688m23826K73767n1317j4682
16547A684705J65236N8702o28303o8124M91484n84707L56287k7507k01325J85931
16537A432379j61818J9723L57066o3411n66916L41675m81453L79028K35833l68920
16527A123186K46707m98395J00189K72155Q8356j20618m46123K53247J20654p6659
16517A062699O752M6398k64367K32693j49487K45801j87567J49247j49576N1167
16507A043760J45242J85667o13039M6628J78322L36752k96499j19114J1388J03390
16497A022497k15588K64637j27867m841j5671n023k46862J07798C72939L33435
16487G06374j13457J41162J25364k30489L38856j72916k54767K79276j56296K54973
$$ plain form
16477 918080 481769 592206 674049 810750 872159 769226 843575 330684 445915 442562
16467 442562 742127 566058 600132 838805 393888 420661 541478 506295 447498 652294
16457 652294 493071 563046 414377 436850 548453 426937 469868 540753 376168 466983
16447 466983 697304 566904 604036 302702 619067 421525 484799 360455 340545 576230
16437 576230 377389 699752 268568 817006 564584 721805 476157 692104 652068 449949
16427 449949 255276 766744 584616 779785 428632 579168 632240 432638 520890 413265
16417 413265 694851 306970 603331 277227 518143 462034 566083 212261 295070 1058619
16407 1058619 546202 608838 39067 182135 437791 77720 307620 217497 249240 318857
$$ packed form
16477I18080m36311J10437Q1843J36701O1409j02933P4349C30684J15231l353
16467D42562K99565j76069L4074K38673C93888K6773J20817l5183n8797K04796
16457F52294j59223O9975j48669K2473J11603j21516M2931P0885j64585R0815
16447D66983K30321j30400L7132l01334L16365j97542O3274j24344j9910K35685
16437E76230j98841L22363B68568N48438k52422J57221k45648K15947m0036k02119
16427D49949j94673N11468j82128J95169l51153J50536N3072j99602Q8252j07625
16417D13265K81586C06970K96361B77227K40916n6109J04049B12261Q2809P63549
16407A058619n12417O2636C9067J43068K55656G7720K29900r0123L1743O9617
$$ plain form
16397 318857 155181 349696 272339 279465 489480 388061 324301 205652 483459 554525
16387 554525 350536 215796 79995 282695 73880 126537 534105 271721 214088 175924
16377 175924 248122 178098 93969 293226 66572 151277 331615 99320 241724 135603 304901
16366 304901 169534 473834 244344 251609 503991 241525 49996 144707 94483 205124
16356 205124 237178 327364 53899 297448 69356 352507 204799 351971 577 488309 466887
16345 466887 523439 194244 250345 146286 -28045 224495 267595 54364 414518 364978 127050
16333 436874 156988 115400 32837 224744 273816 398166 200759 294987 140045 475527
16323 475527 129476 333190 161500 107200 400194 294056 78697 140569 57878 -177722
$$ packed form
16397C18857A55181J94515p7357P126K10015j01419o3760j18649K77807P1066
16387E54525k03989j34740G9995K02700G3880N2657M07568k62384n7633l8164
16377A75924P2198p0024q4129J99257F6572Q4705J80338I9320J42404j06121J69298
16366C04901j35367L04300k29490P265K52382B41525D9996R4711n0224J10641
16356B05124L2054R0186E3899K43549F9356K83151j47708J47172E77M87732k1422
16345D66887N6552A94244N6101j04059b8045B24495M3100E4364L60154m9540A27050
16333D36874A56988m1588C2837J91907M9072J24350j97407R4228A40045L35482
16323D75527A29476K03714A61500n4300K92994j06138G8697O1872E7878a77722
$$ plain form
16312 329357 288393 140878 110487 69337 234284 409335 421516 232104 289600 293702 -100510
16300 403005 222763 231322 394461 -80069 248712 -52697 232770 408267 225656 161697
16290 161697 -56525 298135 -25100 -20042 81253 -8048 306885 88360 191234 250601 100135
16278 310679 10585 154873 59002 343209 189157 6664 212293 89066 30372 122660 26385
16266 -158736 164433 3708 21149 269131 87384 50911 -28291 170106 356895 -63946 9187
16254 -90880 26452 21185 63502 35725 197868 81970 278526 199373 20263 126795 -102021
16242 201475 127023 267745 233888 25501 -172999 -7970 477490 160240 191332 -245620 -217928
16231 -217928 136109 37687 137209 77535 220064 131531 -40101 -86583 99761 27770 46595
$$ packed form
16312C29357m0964A40878l0391m1150J64947J75051J2181j89412N7496M102a00510
16300D03005j80242Q559J63139h0069B48712e2697B32770J75497j82611o3959
16290A61697e6525B98135b5100N058H1253h048C06885H8360J02874N9367A00135
16278C10679A0585J44288E9002K84207j54052F664K05629H9066C0372R2288B6385
16266a58736A64433C708J7441K47982H7384l6473b8291A70106J86789f3946I187
16254i0880B6452n267M2317k7777J62143H1970J96556p9153B0263J06532a02021
16242B01475p4452J40722l3857B5501a72999g970D77490A60240L1092b45620K7692
16231b17928A36109C7687R9522n9674J42529q8533d0101m6482I9761B7770J8825
$$ plain form
16220 46595 -27279 67093 99900 182055 -137964 39512 211449 188115 -19660 -134186 -258858
16209 -258858 -20758 129096 44094 42448 268501 11003 248305 257385 208780 140691 63180
16197 128150 72409 274975 -302304 132421 181927 -61359 20933 -33962 40188 244003 46591
16185 188737 -55449 65607 25662 -69223 -61664 155820 148113 -224411 89789 43846 11432
16173 28731 -25215 25886 106902 -70037 -287038 118693 112146 65687 231107 142680 26352
16161 155246 -131619 -53265 410187 316332 -190545 -228602 423134 -8214 281619 -175350
16150 113405 -305200 191518 -175424 -36125 -71767 3712 -68973 -174777 8465 -97688 87433
16138 111942 -216751 -64299 -42837 -65832 -271345 83308 -119934 -174531 -41691 172994 64434
$$ packed form
16220D6595b7279F7093L2807Q2155a37964C9512J71937k3334a9660j14526j24672
16209b58858b0758A29096D4094j646K26053A1003K37302R080m8605o8089F3180
16197A28150n5741K02566c02304A32421M9506f1359B0933c3962D0188K03815D6591
16185A88737e5449F5607B5662f9223P559A55820p707b24411H9789D3846A1432
16173B8731b5215B5886Q1016g0037k17001A18693o547m6459J65420q8427B6352
16161A55246a31619e3265D10187r3855a90545l8057D23134h214B81619a75350
16150A13405c05200A91518a75424c6125l5642C712f8973j05804H465i7688H7433
16138A11942b16751f4299K1462k2995k05513H3308a19934n4597d1691A72994F4434
$$ plain form
16126 82099 -7036 70329 -15234 108739 -31385 -76752 70639 -18628 13468 -17498 13312 183370
16114 183370 -277163 153635 -110117 208698 109833 -68906 2369 -100591 22214 165371
16104 165371 -264638 68131 -43783 -7439 -8352 373160 27020 -96964 103201 301530 -26068
16092 -251521 -301894 24435 188523 100777 163091 -5624 -52875 -235019 -464059 -182318 89333
16080 -182244 52573 11200 -45670 273143 -63135 13345 273228 -190471 89238 -201040 123779
16068 284737 -125325 14053 -135838 -283580 246238 1871 -255694 15159 126268 272522
16058 272522 94996 -282832 149958 -214971 -104192 -47070 -180691 44909 -50455 101928
16047 -116466 -112714 -279421 106545 -158675 -2723 -159898 -8900 -28762 173509 -58079 102228
$$ packed form
16126H2099g036G0329a5234A08739c1385m5367G0639a8628A3468a7498A3312J70058
16114A83370b77163A53635a10117B08698r8865f8906B369a00591B2214J43157
16104A65371b64638F8131d3783g439r13C73160B7020i6964A03201J98329b6068
16092b51521n0373B4435J64088q7746O2314e624m7251j82144k29040a82318H9333
16080a82244E2573A1200d5670B73143f3135A3345K59883a90471H9238b01040A23779
16068B84737a25325A4053a35838j47742B46238A871b55694A5159J11109J46254
16058B72522I4996b82832A49958b14971a04192d7070j33621D4909e0455A01928
16047a16466L752j66707A06545a58675b723j57175h900j9862A73509e8079A02228
$$ plain form
16035 -30451 116969 49101 79902 -4172 -14638 30728 -281397 82863 -291466 107871 221554
16024 221554 119572 4269 -245397 -329190 -239052 155480 4334 134105 86407 -80546 -96945
16013 -96945 -218438 -101621 44018 16028 81919 -227737 -370006 228922 67724 477 76262
16002 76262 35474 111753 129866 21815 177311 -385939 87040 -219807 275390 -365501 -181067
15990 -206977 -8257 -100243 -197851 117800 -187426 -181500 287443 334554 307007 369901 462697
15979 462697 156839 76224 279684 -83331 -280791 -250298 293451 -163593 -357052 -273108
15969 -273108 -327595 -32261 224590 -141203 -344965 -194409 81721 240532 -257244 55700
15958 250760 -383551 77982 58875 -50784 -60219 -218954 -219316 225229 82864 112550 -247552
$$ packed form
16035c0451A16969D9101L0801d172j0466C0728b81397H2863b91466A07871J13683
16024B21554j01982D269b45397q3793R0138A55480D334J29771m7698h0546j6399
16013i6945j21493a01621D4018A6028O5891b27737j42269B28922F7724D77P5785
16002G6262C5474P6279J8113B1815J55496c85939H7040b19807B75390c65501a81067
15990b06977h257r1986r7608A17800a87426N926B87443M7111k7547O2894R2796
15979D62697A56839G6224K03460h3331j97460L0493B93451a63593j93459Q3944
15969b73108n4487c2261B24590a41203k03762J50556H1721J58811b57244E5700
15958B50760c83551G7982j9107e0784r435j58735l62B25229H2864K9686b47552
$$ plain form
15946 -210914 -79147 188397 -47006 -111773 34663 83810 -19119 -109803 -59264 -174564 -108452
15935 -108452 -20978 41784 247976 -236949 -76668 -242527 85372 67799 -23109 -29813 -90070
15924 -90070 -382676 -93475 -50745 79001 -142300 3874 -122312 -83846 -140755 -213216 -97862
15912 -106838 183714 185779 69115 -24162 109648 272195 88892 -143790 -234775 -28604 2486
15900 -55217 -230447 237966 61832 188782 154196 80596 298627 -146780 95580 -288347
15889 68736 43005 75059 -84439 -58951 -180302 -163384 87451 226165 -17810 -41247 -160755
15878 -160755 202106 28800 -209546 197474 115987 97441 76683 -260261 -117607 105602
15867 -44169 -195762 -156310 206688 -20730 -274595 -52046 -70911 -166654 -490706 69175 11094
$$ packed form
15946b10914g9147A88397d7006o4767C4663M9147a9119r0684N0539j15300O6112
15935a08452b0978D1784K06192b36949g6668j65859H5372j7573b3109o704o0257
15924i0070k92606i3475M2730G9001a42300C874a22312L8466n6909p2461i7862
15912a06838A83714K065F9115b4162A09648J62547H8892a43790r0985b8604B486
15900e5217j75230B37966F1832J26950l4586p3600K18031a46780I5580b88347
15889F8736k5731L2054h4439K5488j21351J6918H7451J38714a7810k3437j19508
15878a60755B02106B8800b09546A97474q1487j8546k0758b60261a17607A05602
15867d4169j51593L9452B06688b0730k53865e2046j8865r5743l24052F9175A1094
$$ plain form
15855 120200 -115121 1194 -322877 193046 220059 -73305 87600 -134462 -93503 23657 78704
15844 78704 -122029 -81539 -98360 181110 -149794 124842 230454 16072 -132296 96837
15833 -225699 -1733 27166 -422169 -88933 -363590 275268 -276560 -351227 2621 -32346 78042
15821 -53663 -272007 44845 41654 -21886 65709 -126403 -124246 16774 -270405 140086 -327399
15809 -43452 200655 -206119 95958 -16393 -336902 484381 -14508 -162987 -19738 -214765
15799 -214765 -66844 -84117 -132386 78784 -207478 -153428 -229316 28250 -24490 -104157 120183
15787 -12806 30389 267513 269157 163919 62900 -25581 -127927 40743 276763 102608 -69193
15775 -78723 -13707 121396 11426 42342 -370411 63311 297655 48561 -129590 -282598 -120976
$$ packed form
15855A20200a15121A194c22877A93046K7013g3305H7600a34462M0959B3657N5047
15844G8704a22029M0490j6821A81110a49794A24842J05612A6072a32296I6837
15833b25699a733B7166d22169h8933k74657B75268b76560p4667B621c2346G8042
15821e3663k18344D4845l191b1886F5709a26403K157A6774b70405A40086c27399
15809d3452B00655b06119I5958a6393l20509D84381a4508j48479a9738j95027
15799b14765f6844j7273m8269G8784b07478N4050p5888B8250b4490p9667A20183
15787a2806C0389K37124J644j05238F2900b5581j02346D0743K36020A02608f9193
15775g8723a3707A21396A1426L0916c70411F3311K34344D8561a29590j53008a20976
$$ plain form
15763 -240196 149008 -119105 193639 72945 154921 -105008 54218 -9339 -246931 359780
15752 242678 -12715 -311448 -20772 79297 109664 269415 67884 -198785 -209962 128247 -32928
15740 -349276 -243282 -221392 142926 25916 -57613 -20220 -202874 -220942 -63020 -26722 -94845
15729 -94845 -164515 -111052 115590 -107424 -140543 137991 -248563 -422685 -120752 -75765
15719 -75765 -134984 -88454 -455169 178239 25323 126876 311640 -73663 165272 74965 -88467
15707 -284061 -274517 345303 251262 -66165 126029 -108644 -67790 -52629 -725777 -195763 -301541
15696 -301541 19853 -34309 -251323 114495 233488 191100 206023 208216 -75584 9383 58524
15685 58524 -220211 174658 61065 45939 149590 101548 202144 -269509 -147463 -117106
$$ packed form
15763b40196A49008a19105A93639G2945Q1976a05008E4218i339k37592C59780
15752B42678a2715k98733b0772G9297L0367J59751F7884a98785j1177A28247c2928
15740c49276J05994K1890A42926B5916e7613b0220j82654j8068f3020b6722o8123
15729i4845o9670N3463A15590a07424l3119A37991b48563j74122a20752M4987
15719g5765n9219M6530l66715A78239B5323J01553J84764g3663A65272G4965h8467
15707b84061R544C45303r4041f6165A26029a08644M0854J5161o73148a95763j05778
15696c01541A9853c4309k17014A14495J18993m2388J4923K193g5584I383M9141
15685E8524b20211A74658F1065j5126J03651m8042J00596b69509J22046L0357
$$ plain form
15675 -117106 129118 -109769 302133 259316 -55814 -131173 -46432 65378 105939 -13305 -317052
15664 -317052 -81179 -322739 -50870 -127310 -70902 -204611 -25545 117889 -163948 117808
15653 -113951 70054 -356005 -116601 90020 16366 -178701 324243 -68808 39657 111124 -345079
15641 243497 71135 180990 -174260 241057 -14326 -176667 123837 -202138 15264 -273300
15630 -167831 -104255 134843 -159062 -23851 165828 70787 -56202 48185 -84226 -987 260262
15618 177257 63503 255760 81524 -10243 197485 328869 -81287 330445 140639 -161703
15607 141045 370812 -20323 -23083 64617 -242722 -168542 60340 -317543 -311888 -29347 31325
15595 -114061 198479 68113 102096 162349 -44989 51639 -311186 66541 -97959 56968 -323126
$$ packed form
15675a17106A29118a09769C02133m2817e5814p5359d6432F5378M0561a3305l03747
15664c17052h1179k41560e0870p6440N6408j33709b5545A17889a63948A17808
15653a13951G0054c56005a16601I0020A6366a78701C24243f8808C9657P1467c45079
15641B43497G1135J09855a74260B41057a4326j62341A23837b02138A5264b73300
15630a67831O3576A34843a59062b3851A65828G0787e6202D8185h4226i87B60262
15618A77257F3503J92257H1524a0243A97485J31384h1287C30445A40639a61703
15607A41045K29767b0323k760F4617b42722P4180F0340c17543N655b9347C1325
15595a14061A98479F8113L3983O0253d4989E1639c11186F6541i7959E6968c23126
$$ plain form
15583 38936 -66786 120825 -117692 52364 -65436 -114537 102038 -48716 -185346 61900 160597
15572 160597 18123 -96149 -207651 181600 -137901 139597 161271 136621 -109781 125958
15561 220054 163078 78714 84500 -126773 106221 225464 35873 -155192 -160960 -97160 -208759
15550 -208759 248376 67608 260612 -34733 42886 270973 167853 -18541 -161071 225196
15539 -71896 -140764 191087 -326382 -247320 21649 -295693 -124660 -4678 21397 96794 -14704
15527 71410 121444 -115811 134436 -96553 29677 138371 69317 -5095 -218589 40991 -397856
15515 -140093 33820 258431 -252997 -99188 -297843 206098 -80747 -75989 -122470 -239540 -80387
15503 39801 -14182 219466 -287701 114704 -388925 139815 349446 -95417 -65047 -267442
$$ packed form
15583C8936f6786A20825a17692E2364f5436m9101A02038d8716j36630F1900R8697
15572A60597A8123i6149j11502A81600a37901A39597K1674k4650a09781A25958
15561B20054n6976G8714N786a26773A06221J19243C5873a55192n768O3800j11599
15550b08759B48376F7608J93004c4733D2886K28087j03120a8541j42530B25196
15539g1896o8868A91087c26382P9062B1649b95693a24660d678B1397P5397a4704
15527G1410N0034a15811A34436i6553B9677J08694o9054e095k13494D0991c97856
15515a40093C3820K24611b52997i9188j98655B06098h0747M758m6481j17070h0387
15503C9801a4182B19466b87701A14704c88925A39815K09631i5417L0370k02395
$$ plain form
15493 -267442 229181 185860 -144117 -6200 -289946 33201 124008 -551916 105802 -133362
15482 7682 -242260 -46461 50942 -103169 -196378 6913 45191 115556 -13771 87442 -120561
15470 -107836 -65020 16475 -10041 -281115 84375 180496 79429 -168014 192846 199697 323761
15459 323761 -185461 -83016 30887 -249037 -11446 -113237 -135375 -82569 -50766 -36484 94592
15447 335777 170090 -21675 -2757 3727 -146362 -11420 -99891 -149829 110648 142923 -244502
15435 98548 -165534 13984 -170534 51447 1514 34518 -228600 -64755 -199774 -3633 -314794
15424 -314794 -54448 26530 -223255 -53581 199447 168817 -52825 212023 130170 -220900 -25148
15412 189937 -66593 -17578 -65170 62549 269910 -90478 -41033 -77736 31031 62149 -131784
$$ packed form
15493b67442B29181m3321a44117f200k83746C3201R0807e51916A05802a33362
15482G682b42260d6461E0942a03169r3209F913L8278P0365a3771H7442a20561
15470a07836M2816A6475a0041k71074H4375R6121G9429a68014A92846O851J24064
15459C23761a85461h3016C0887b49037a1446j01791k2138N2806L1803J4282I4592
15447C35777j65687b1675b757C727a46362a1420q8471m9938A10648L2275b44502
15435I8548a65534A3984a70534E1447A514L3004b28600f4755j35019c633l11161
15424c14794e4448B6530b23255e3581A99447l0630e2825B12023q1853b20900b5148
15412A89937f6593a7578m7592F2549K07361i0478d1033l6703C1031L1118a31784
$$ plain form
15400 40519 -165962 -207695 -27084 29175 15424 75756 -440763 95614 -194683 8092 -9827
15388 -127574 118364 -233703 23664 -264650 246643 -42216 141659 409702 -3140 -22616
15378 -22616 -50312 403157 -45632 -229156 -39294 218631 336279 -30698 -61729 8339 12249
15367 12249 -45653 255585 -42302 -40182 479222 -120101 -7637 33980 -214890 305245 -143874
15355 127619 90901 -93863 -68663 20100 -116413 365440 366317 44208 -85621 -277713 61441
15343 -94345 -6264 68914 138365 -232157 -57542 97792 24494 149469 31450 33569 -172702
15331 -63858 183510 -194579 -138751 78205 -87486 -68489 -224440 175197 3154 135112 69100
15320 69100 -173940 48687 -58759 -48844 105030 252467 -48972 -138349 -58075 66345 241964
$$ packed form
15400D0519a65962m1733b7084B9175j3751O0332d40763I5614a94683H092i827
15388a27574A18364b33703B3664b64650B46643d2216A41659K68043c140j9476
15378b2616k7696D03157d5632j83524c9294B18631J17648c0698l1031H339L910
15367A2249d5653B55585d2302K120D79222a20101g637C3980b14890C05245a43874
15355A27619l6718i3863K5200B0100a16413C65440Q77D4208h5621j92092F1441
15343i4345f264F8914O9451b32157e7542I7792B4494J24975C1450K119a72702
15331f3858A83510a94579N5828G8205h7486J8997j55951A75197C154J31958o6012
15320F9100a73940D8687e8759R915A05030J47437d8972q9377e8075F6345J75619
$$ plain form
15309 241964 6487 166698 43820 -133758 -32354 119886 85065 245985 -141386 203996
15298 -164930 -124667 -281039 261434 56040 401889 -21718 170033 34318 200477 -278681
15287 33160 161854 53671 -186006 -137652 62575 -28745 159710 -33833 16307 140436 -83729
15275 -72844 108989 -24193 179619 30690 -63575 256745 88455 72199 16476 175179 102316
15264 102316 194726 -236315 48466 600869 -128488 -60540 244098 -14091 -44006 109698
15253 111292 225197 123655 250795 381888 354891 1051046 1443281 904216 1154366 759701
15243 759701 500016 88040 -66240 -118580 164009 7479 -69961 -10193 244230 12871 234053
15232 234053 -167630 -1052 -218491 -7268 -20385 -76749 31241 221406 -72271 100579 288925
$$ packed form
15309B41964F487J60211D3820a33758c2354A19886l4821J60920a41386B03996
15298a64930M0263j56372B61434E6040L45849b1718A70033C4318J66159b78681
15287C3160J28694E3671a86006M8354F2575b8745A59710c3833A6307J24129h3729
15275g2844A08989b4193A79619C0690f3575B56745H8455j6256A6476J58703p2863
15264A02316R2410b36315D8466N52403a28488f0540B44098a4091k9915A09698
15253A11292J13905j01542J27140J31093k6997O96155L92235n39065K50150l94665
15243G59701k59685H8040f6240n2340A64009G479f9961a0193B44230A2871K21182
15232B34053a67630a052k17439g268j3117n6364C1241J90165g2271A00579J88346
$$ plain form
15221 288925 -113056 -52126 171539 -22770 23305 107590 225923 25431 80174 276279 41981
15209 82208 -1579 256065 148044 -239831 290226 171689 65626 108681 296619 120524
15198 290276 26280 -31292 44249 -35381 -339698 265717 257888 122371 202514 186397 15808
15186 134144 184005 -262792 141368 -21111 -6290 -122022 276378 388098 35904 42347 210971
15175 210971 113434 367766 136405 -163134 128312 -45838 -155493 259920 135248 118668
15165 118668 115826 57712 -6669 128088 -1513 310211 -54501 51781 214535 -118482 77599
15153 87267 362951 248830 143378 -52782 -43973 297731 51946 60619 169964 67025 154735
15142 154735 142384 121925 -37846 163658 -289823 255496 86884 -161329 -36042 116429
$$ packed form
15221B88925a13056e2126A71539b2770B3305Q4285J18333B5431N4743J96105D1981
15209H2208a579B56065j08021b39831B90226j18537F5626M3055J87938A20524
15198B90276B6280c1292D4249c5381l04317B65717p829A22371Q0143j6117A5808
15186A34144M9861b62792A41368b1111f290j15732B76378J11720C5904O443J68624
15175B10971r7537K54332A36405a63134A28312d5838j09655B59920j24672j6580
15165A18668k842E7712f669A28088a513C10211e4501E1781J62754a18482G7599
15153H7267K75684j14121j05452e2782Q809B97731E1946Q673J09345F7025Q7710
15142A54735j2351k0459c7846A63658b89823B55496H6884a61329c6042A16429
$$ plain form
15131 379387 -33583 248114 332048 310986 245124 -118546 73406 -10320 92611 190876 111485
15120 111485 21033 -11420 -257077 280689 55585 385788 -107386 60394 69027 113687 -124586
15108 218680 -61072 488371 122919 -37671 180142 324653 -85564 331037 156864 279900
15098 279900 -355315 150535 173983 283224 -94938 28066 36538 -23260 32709 278040 650818
15087 650818 82331 45495 323885 -158640 -46197 -15291 196960 68761 -8575 56831 129102
15076 129102 191377 464845 137808 39157 38377 290538 -39822 235102 292331 186188 -127254
15064 96296 94568 316505 36782 386863 34707 128079 316921 -175475 -59626 348106 317454
15053 317454 89330 110189 79118 108686 41313 340878 124205 172368 102393 196772 230863
$$ packed form
15131C79387c3583B48114Q3934k1062o5862a18546G3406a0320I2611R8265p9391
15120A11485B1033a1420k45657B80689E5585L30203a07386F0394Q633M4660a24586
15108B18680f1072D88371A22919c7671A80142J44511h5564C31037A56864J23036
15098B79900c55315A50535K3448J09241i4938B8066Q472b3260C2709K45331L72778
15087F50818H2331l6836K78390a58640d6197a5291A96960F8761h575E6831P2271
15076A29102O2275K73468A37808C9157p80K52161c9822B35102N7229j06143a27254
15064I6296j728K21937C6782L50081C4707R3372J88842a75475e9626C48106l0652
15053C17454H9330K0859l1071K9568D1313K99565A24205M8163o9975R4379L4091
$$ plain form
15042 230863 26959 363661 -98819 36972 75945 364987 -57561 148353 317569 36992 -13930
15030 197411 260130 168141 316491 72271 137639 93543 403295 -73924 -29284 -112569 131564
15018 -34134 234139 282602 223058 334396 125817 48191 187716 726612 205019 12500
15007 -118678 250532 203356 135362 117575 228478 43020 -45788 31586 33676 286830 104713
14995 254341 -78642 404712 17429 443785 176401 316137 73971 142119 353757 111639
14984 112798 198461 322147 210153 -27665 -35050 152881 465057 735145 32143 54900 458412
14973 458412 321152 2332 115538 147757 201952 562048 115843 117262 71157 429915 501795
14962 501795 252551 319266 121198 -25620 332774 99657 657605 22665 224525 187872
$$ packed form
15042B30863B6959L36702i8819C6972L8973K89042e7561A48353J69216C6992a3930
15030A97411O2719r1989J48350G2271O5368m4096L09752g3924b9284q3285A31564
15018c4134B34139M8463n9544J11338A25817D8191J39525N38896B05019A2500
15007a18678B50532m7176o7994j7787J10903D3020d5788C1586K090K53154A04713
14995B54341g8642D04712A7429M26356A76401J39736G3971O8148K11638A11639
14984A12798Q5663J23686j11994b7665p385A52881L12176K70088C2143K2757M03512
14973D58412j37260B332J13206L2219N4195L60096A15843J419m6105L58758P1880
14962E01795k49244O6715A21198b5620C32774I9657N57948B2665K01860l6653
$$ plain form
14952 187872 285924 266932 148083 267738 393650 333065 310123 55512 -163505 165291
14941 56966 -78047 92665 186469 191723 265874 176832 507860 -23224 289514 68570 231552
14930 231552 275767 -82893 370264 308793 414425 275197 511279 419251 408541 304046
14920 304046 436218 342416 420375 212447 136195 85251 407283 419209 340139 626251 263344
14908 437743 17911 112055 295718 213314 -30490 311181 229286 -6843 389053 449706 260935
14897 260935 301673 805885 33009 426140 384729 56817 186362 462861 224558 290838
14887 290838 296623 346995 251528 163831 55297 242818 383994 274688 188291 244294 467443
14876 467443 408782 211937 241510 201008 298746 199532 308352 349080 358678 342701 241411
$$ packed form
14952A87872R8052j8992j18849J19655J25912o0585k2942E5512a63505A65291
14941E6966g8047I2665R3804N254P4151q9042L31028b3224B89514F8570J62982
14930B31552M4215h2893C70264o1471J05632j39228K36082r2028j0710j04495
14920C04046J32172r3802P7959k07928p6252n0944L22032J1926p9070K86112B63344
14908D37743A7911R4144J83663q2404c0490C11181q1895f843C89053O0653j88771
14897B60935M0738N04212C3009L93131m1411E6817J29545K76499B24558O6280
14887B90838N785N0372r5467q7697E5297J87521J41176j09306q6397N6003K23149
14876D67443n8661j96845K9573m0502R7738r9214J08820M0728R598j5977j01290
$$ plain form
14865 241411 26984 290696 313345 63251 161144 210873 349748 464404 267919 479620
14855 479620 332153 320696 497468 191180 176753 348756 455851 733369 611065 200265
14844 463288 411483 330753 361141 257837 326165 70893 494684 191594 587682 429937
14834 429937 590428 252080 404729 571461 451676 569103 470255 313117 428717 426626
14824 426626 218136 250278 403154 421577 548728 614109 252254 466742 510885 307053
14814 307053 686903 476352 292959 676137 382901 179424 657868 366595 539005 428012
14804 428012 700044 398823 182362 345186 636311 421772 398401 497849 320820 250482
14794 250482 352875 487892 397155 562472 416107 341224 223664 617455 597244 440384
$$ packed form
14865B41411B6984K63712K2649F3251R7893M9729J38875J14656j96485K11701
14855D79620j47467j1457J76772A91180j4427J72003J07095K77518j22304B00265
14844D63288n1805q0730L0388j03304O8328G0893M23791A91594L96088j57745
14834D29937J60491B52080J52649J66732j19785J17427r8848j57138J15600k091
14824D26626k08490L2142J52876J8423J27151O5381B52254K14488M4143k03832
14814C07053L79850k10551j83393L83178k93236A79424M78444k91273J72410j10993
14804D28012K72032l01221A82362J62824K91125k14539k3371R9448j77029p0338
14794B50482J02393J35017r0737J65317j46365p4883j17560L93791k0211j56860
$$ plain form
14784 440384 192312 291306 572396 254751 586902 277642 583156 501152 757876 687400
14774 687400 823301 582695 738019 542652 536598 590918 739934 737700 454061 448238 785807
14763 785807 482961 654607 968489 337258 517659 205352 640468 588920 262058 605292
14753 605292 675732 246642 996654 493695 549291 574328 882446 552572 897363 620732
14743 620732 460140 462308 824802 556180 503231 287647 715190 782159 591838 663737
14733 663737 609296 572455 434425 690367 642388 624192 847032 703903 923436 930348 600714
14722 600714 735788 783334 648022 668813 710377 471191 752769 419639 1100546 846106
14712 846106 798519 787686 686000 655053 1028889 904826 643068 833655 892622 684346
$$ packed form
14784D40384A92312R8994K81090B54751L32151B77642L05514q2004K56724p0476
14774F87400J35901k40606J55324j95367o054N4320J49016k234k83639n823L37569
14763G85807l02846J71646L13882C37258J80401B05352M35116n1548B62058L43234
14753F05292P0440B46642P50012D93695N5596K5037L08118l29874L44791k76631
14743F20732j60592K168L62494k68622n2949k15584M27543O6969j90321P1899
14733F63737n4441l6841j38030K55942m7979j8196K22840j43129K19533O912l29634
14722F00714J35074M7546j35312K0791M1564k39186K81578l33130O80907k54440
14712H46106m7587j0833j01686l0947L73836j24063k61758J90587N8967k08276
$$ plain form
14702 684346 699606 886459 706649 860099 879297 567545 988831 534493 802279 799427
14692 799427 703195 792747 886161 1040292 1110954 1171331 847173 949637 905272 1091933 935463
14681 935463 1086256 723751 922546 831785 1000637 983995 948862 1055004 991705 850653
14671 850653 908549 820498 1060760 888278 641344 1273858 830865 1018445 1003982 796456
14661 796456 1106601 1378745 936275 926506 1141909 1053594 1194315 1220517 710778 1229123
14651 1229123 1097724 827088 1178956 1172490 1026907 1307801 841089 1132980 1085101 924076
14641 924076 902187 1482007 1436516 1205366 1073724 978947 1137012 1299418 1277020 1332534
14631 1332534 1241291 1097167 1197702 804898 1119970 1660662 1132405 1209406 1716706 1032085
$$ packed form
14702F84346J5260J86853j79810J53450J9198l11752M21286m54338K67786k852
14692G99427r6232Q9552R3414J54131P0662O0377l24158J02464m4365J86661j56470
14681I35463J50793l62505J98795r0761J68852j6642l5133J06142o3299j41052
14671H50653N7896q8051K40262j72482k46934O32514m42993J87580j4463k07526
14661G96456L10145K72144m42470r769K15403q8315J40721K6202n09739N18345
14651A229123j31399k70636L51868o466j45583K80894m66712K91891m7879j61025
14641I24076k1889N79820m5491k31150j31642r4777J58065J62406k2398N5514
14631A332534r1243j44124J00535l92804L15072N40692n28257P7001N07300o84621
$$ plain form
14621 1032085 1347257 1275411 1255928 1685141 1241398 1451090 1317439 1352351 1294902 1357928
14611 1357928 1130127 1349849 1605330 1415997 1819692 1524394 1324770 1179861 1467118
14602 1467118 1659164 1402014 1560862 1672793 1615019 1202059 1682272 1753475 1743966 1373575
14592 1373575 1746828 1511384 1752960 1618663 1533858 1935943 1750046 1945668 1465707 1931576
14582 1931576 1583040 1922296 1838340 1753783 2101527 2240059 1958843 2217264 1759225 2090718
14572 2090718 2184072 2124323 2116390 2422326 2312486 2240266 2122463 2402638 2427893 2709089
14562 2709089 2615434 2730052 2404460 2878124 2700948 3006362 3069181 3099696 3482973 3709743
14552 3709743 3674257 4592929 5746507 8307052 11544058 18340709 32187006 42769914
$$ packed form
14621A032085L15172p1846j9483M29213m43743K09692j33651L4912n7449O3026
14611A357928k27801K19722K55481j89333M03695k95298j99624j44909K87257
14602A467118J92046k57150J58848J11931n7774m12960M80213P1203r509l70391
14592A373575L73253k35444K41576j34297q4805M02085j85897J95622m79961M65869
14582A931576l48536L39256q3956q4557L47744J38532k81216K58421m58039L31493
14572B090718R3354n9749p933L05936j09840p2220j17803K80175K5255K81196
14562B709089r3655J14618l25592M73664j77176L05414O2819L0515L83277K26770
14552C709743l5486R18672J153578K560545L237006O796651J3846297J0582908
$$ plain form
14544 42769914 23069740 10773724 5102704 3038486 2335961 2381915 2025938 1848488
14536 1848488 1862473 1615485 2182492 1795965 1694006 2139986 2229332 2260790 2136582 2056738
14526 2056738 2144628 2059767 2042639 2044108 2086072 2446175 2221254 2469884 2343758 2263760 2534550
14515 2534550 2233541 2634590 2592338 2508032 2424730 2555728 2807683 2891805 2536706 3089488
14505 3089488 2991652 2871102 2721500 2858645 3022428 2833886 3297648 2812490 2881553 2964436
14495 2964436 3107722 3365354 3062305 3283799 3101473 3268829 3431479 3812421 3371084
14486 3371084 3436124 3709882 3576177 3661233 3224236 3600144 3626624 3532916 3925921 3673966
14476 3673966 3658806 3978509 4031396 3998950 4225038 4125163 4057382 4365891 4379699 4304497 4178640
$$ packed form
14544D2769914j9700174A0773724E102704k064218p02525M5954l55977j77450
14536A848488J3985k46988N67007l86527j01959M45980Q9346L1458j24208p9844
14526B056738Q7890q4861j7128J469M1964L60103k24921K48630j26126p9998K70790
14515B534550l01009M01049m2252q4306q3302J30998K51955Q4122l55099N52782
14505C089488r7836j20550j49602J37145J63783j88542M63762m85158O9063Q2883
14495B964436J43286K57632l03049K21494j82326J67356J62650L80942m41337
14486C371084O5040K73758j33705Q5056m36997L75908K6480r3708L93005k51955
14476C673966j5160L19703N2887l2446K26088r9875o7781L08509J3808p5202j25857
$$ plain form
14465 4178640 4463374 4475325 4653905 4619364 4749586 4824619 4907260 4781034 4827368 4882861
14455 4882861 4715135 4469747 5180284 5053035 5203356 5484007 5108241 5253377 5614764
14446 5614764 5566246 5543224 5424335 5463836 5775962 5545940 6036686 5695170 5981153 6137632
14436 6137632 6101252 6164136 6190353 6250876 6633056 6601426 6686659 6726208 6699575 6787302 7231115
14425 7231115 7115530 7007628 7217194 7236096 7551439 7725670 7660444 7759332 7671371 8020296
14415 8020296 8322040 8307235 8360764 8466001 8614831 8475561 8927348 9228491 9275970 9003539
14405 9003539 9515088 9495239 9625286 9792656 10228070 10086517 10313459 10661908 10512332 11182122
14395 11182122 11130440 11312906 11845095 11618571 11885576 11883359 12695203 12535614 12604274 13260330
$$ packed form
14465D178640K84734J1951J78580l4541J30222P5033Q2641j26226M6334N5493
14455D882861j67726k45388P10537j27249J50321K80651l75766J45136L61387
14446E614764m8518k3022j18889L9501L12126k30022M90746l41516K85983J56479
14436F137632l6380O2884K6217O0523L82180l1630Q5233L9549k6633Q7727M43813
14425G231115j15585j07902K09566J8902L15343J74231o5226R8888q7961L48925
14415H020296L01744j4805N3529J05237J48830j39270M51787L01143M7479k72431
14405I003539N11549j9849J30047J67370M35414j41553K26942L48449j49576O69790
14395A1182122n1682J82466N32189k26524K67005k217Q11844j59589O8660O56056
$$ plain form
14385 13260330 13462585 13564766 13906166 13958283 14025776 14537670 14563536 15111420 15582069 15668412
14375 15668412 16054374 16603637 16627853 16889870 17250383 17263720 17951664 18277606 18608293 19376004
14365 19376004 19208751 19978178 20436575 20942236 21158265 21714396 22198341 22651803 23145238
14356 23145238 23766103 24384623 24900234 25689609 26181776 26757954 27392961 28367783 29132373
14347 29132373 29325793 30712148 31262850 32167767 32453646 33499711 34703313 35762104 36637531
14338 36637531 37589749 38693360 39818780 40759617 42050340 43551905 44485311 45982356
14330 45982356 47608340 48953587 50536775 52375687 53832692 55624500 57451886 59401746
14322 59401746 61416099 63830025 66211718 68396174 70634732 73765303 76086672 79125437
$$ packed form
14385A3260330K02255J02181L41400N2117O7493N11894K5866N47884M70649Q6343
14375A5668412L85962N49263K4216K62017L60513J3337O87944L25942L30687P67711
14365A9376004j67253P69427M58397N05661K16029N56131M83945M53462M93435
14356B3145238O20865O18520N15611P89375M92167N76178O35007R74822P64590
14347B9132373J93420J386355N50702R04917K85879J046065J203602J058791Q75427
14338C6637531R52218J103611J125420R40837J290723J501565R33406J497045
14330D5982356J625984J345247J583188J838912J457005J791808J827386J949860
14322E9401746K014353K413926K381693K184456K238558L130571K321369L038765
$$ plain form
14314 79125437 82267418 85593373 89222785 92388698 96208629 100583895 104801025 109303094
14306 109303094 113788719 118729994 123826292 129397939 134912291 141045130 147299026 154309646
14298 154309646 161452049 169357796 177116975 185549623 194968883 204068045 214062148 224435882
14290 224435882 235538765 246884977 259112673 271513291 284413166 298039248 311591306
14283 311591306 325517832 339207194 353590548 368366844 382379547 396035268 408739007
14276 408739007 420584532 430648519 437553529 440064772 440201284 440826666 442501606 441251811
14268 441251811 436609033 431251401 425524855 416639843 406484537 394383062 380879659
14261 380879659 366303290 351075525 335758958 320236125 304922072 290121907 275703700
$$ packed form
14314G9125437L141981L325955L629412L165913L819931M375266M217130M502069
14306A09303094M485625M941275N096298N571647N514352O132839O253896P010620
14298A54309646P142403P905747P759179Q432648R419260R099162R994103J0373734
14290B24435882J1102883J1346212J2227696J2400618J2899875J3626082J3552058
14283C11591306J3926526J3689362J4383354J4776296J4012703J3655721J2703739
14276D08739007J1845525J0063987O905010K511243J36512O25382J674940j249795
14268D41251811m642778n357632n726546q885012j0155306j2101475j3503403
14261C80879659j4576369j5227765j5316567j5522833j5314053j4800165j4418207
$$ plain form
14254 275703700 262787109 249661660 236823268 224940085 213824001 202829787 192612167
14247 192612167 183134909 174107664 165567757 158126901 150312796 143532776 136607181 130348157
14239 130348157 124308231 119429902 114372191 109243023 104426240 99859301 95669877 91875138
14231 91875138 88635665 84974246 81400142 78574970 75772824 72578627 70260660 67655520
14223 67655520 65031681 62711429 60200495 58428044 56539002 54751092 52890882 50927911
14215 50927911 49857306 48139183 46996003 45409506 43786361 42681516 41059473 40413361
14207 40413361 39628395 38168252 37003863 36069767 34795922 33959528 33422727 32598782 31580117
14198 31580117 30718572 30023961 29021503 28152540 27539851 27269207 26550574 25750396 25058388
$$ packed form
14254B75703700j2916591j3125449j2838392j1883183j1116084j0994214j0217620
14247A92612167r477258r027245q539907p440856p814105o780020o925595o259024
14239A30348157o039926m878329n057711n129168m816783m566939m189424l794739
14231I1875138l239473l661419l574104k825172k802146l194197k317967k605140
14223F7655520k623839k320252k510934j772451j889042j787910j860210j962971
14215E0927911j070605j718123j143180j586497j623145j104845j622043o46112
14207D0413361p84966j460143j164389r34096j273845q36394n36801q23945j018665
14198C1580117q61545o94611j002458q68963o12689k70644p18633q00178o92008
$$ plain form
14189 25058388 24525879 23836051 23554786 22876485 22304909 21970083 21158076 20559985 20758273
14180 20758273 20132760 19874231 19328994 18631554 18488913 18088155 17910262 17392981 17094570
14171 17094570 16761547 16769451 16157810 15781068 15525377 14971825 15043917 14600602 14513625 14250984
14161 14250984 13957516 13668823 13577461 13110602 12885512 12932672 12899249 12364479 12108959 11871760
14151 11871760 11784629 12026943 11678332 11409059 10911289 10979360 10594397 10584469 10583368 10321069
14141 10321069 9904112 9980807 9949740 9567007 9255394 9557548 9129003 9369053 9166223 8972931
14131 8972931 8943705 8747603 8378208 8340311 8494830 8016857 7948454 8063146 7804335 7893757
14121 7893757 7504923 7430078 7456522 7438865 7090331 6944832 6813284 7006720 6893380 6881695
$$ packed form
14189B5058388n32509o89828k81265o78301n71576l34826q12007n98091J98288
14180B0758273o25513k58529n45237o97440j42641m00758j77893n17281k98411
14171A7094570l33023P904o11641l76742k55691n53552P2092m43315q6977k62641
14161A4250984k93468k88693r1362m66859k25090M7160l3423n34770k55520k37199
14151A1871760q7131K42314l48611k69273m97770O8071l84963r928j101k62299
14141A0321069m16957P6695l1067l82733l11613L02154m28545K40050k02830j93292
14131H972931k9226j96102l69395l7897J54519m77973o8403J14692k58811Q9422
14121G893757l88834p4845K6444j7657l48534j45499j31548J93436j13340j1685
$$ plain form
14111 6881695 6633640 6561254 6236660 6511482 6232512 6712034 6215175 6210260 6198348 5799598
14101 5799598 5635170 5931611 5871230 5415755 5705090 5395205 5333782 5559817 5473296 5364375
14091 5364375 5203698 5217116 4842789 5239758 5086969 4880528 4911846 4575164 4766225 4755535
14081 4755535 4542313 4968929 4326088 4375952 4557016 4633496 4637568 4266010 4551551 4272642
14071 4272642 4340772 4296618 4220093 4165100 3886162 3961366 4200518 3893504 3874858 4150577
14061 4150577 3882975 3655923 4007665 3957096 3851887 3800948 3541364 3525642 3737502 3419764
14051 3419764 3633982 3152121 3373137 4034093 3249042 3529595 3430943 3232536 3237722 3134238
14041 3134238 3172610 2796235 3051249 3159562 3063842 2814057 3370208 3004073 2838548 3126197
$$ packed form
14111F881695k48055p2386l24594K74822k78970M79522m96859m915j1912l98750
14101E799598j64428K96441o0381m55475K89335l09885o1423K26035q6521j08921
14091E364375j60677J3418l74327L96969j52789k06441L1318l36682J91061j0690
14081D755535k13222M26616o42841M9864J81064P6480M072l71558K85541k78909
14071D272642O8130m4154p6525n4993k78938P5204K39152l07014j8646K75719
14061D150577k67602k27052L51742n0569j05209n0939k59584j5722K11860l17738
14051C419764K14218m81861K21016O60956p85051K80553r8652j98407N186j03484
14041C134238L8372l76375K55014J08313r5720k49785N56151l66135j65525K87649
$$ plain form
14031 3126197 3019274 3179025 2887810 2887810 2815594 2821905 3048985 2628634 2557657 2720594 2522968
14020 2522968 2675405 2678801 2404976 2814848 2488512 2305447 2699381 2414772 2486970 2673597
14010 2673597 2369251 2495848 2540056 2493184 2186786 2394085 1962324 2140205 2231540 1952847
14000 1952847 2429014 2037196 2120700 1835130 1954843 2258186 2292165 2170394 2261311 2591512
13990 2591512 2932619 4411900 7188323 12454978 25549984 42512980 26345179 14354158
13982 14354158 8499104 5666127 4706840 4118778 3330584 3242903 3028513 2954550 3085710
13973 3085710 2706373 2420396 2739295 2406291 2234172 2597935 1953334 2160363 2118409 1893097
13963 1893097 2132745 2025368 1889007 2091637 1993880 2013154 2409696 1882129 2061151 1831619
$$ packed form
14031C126197j06923J59751k91215%p2216O311K27080m20351p0977J62937j97626
14020B522968J52437L396k73825M09872l26336j83065L93934k84609P2198J86627
14010B673597l04346J26597M4208m6872l06398K07299m31761J77881R1335k78693
14000A952847M76167l91818Q3504k85570J19713L03343L3979j21771R0917L30201
13990B591512L41107J479281K776423N266655J3095006J6962996j6167801j1991021
13982A4354158n855054k832977r59287n88062p88194q7681k14390p3963J31160
13973C085710l79337k85977L18899l33004j72119L63763o44601K07029m1954k25312
13963A893097K39648j07377j36361K02630r7757J9274L96542n27567J79022k29532
$$ plain form
13953 1831619 1900921 1973849 1868405 2014435 1913179 1785910 1582339 1615155 1863119 1804021
13943 1804021 1595561 1398391 1551045 1644805 1741038 1612058 1740400 1340484 1959326 1566836
13933 1566836 1600351 1537169 1255860 1563753 1720764 1429487 1462245 1230155 1426087 1442201
13923 1442201 1231757 1285506 1324619 1493436 1391593 1513915 1117128 1603852 1476133 1636945
13913 1636945 1430482 1286104 1306130 1757035 1543577 1605355 1389222 1460107 1504297 1282781
13903 1282781 1171931 1219888 1326194 1325671 1436153 1321858 1195310 1634158 1358813 1380073
13893 1380073 1404323 1205860 1082473 1325439 995284 1521762 1474720 906885 1098039 1400952
13883 1400952 1118813 1362657 1231090 1411333 1083000 1040586 1149645 1485250 969323 1070589
$$ packed form
13953A831619O9302P2928j05444J46030j01256j27269k03571L2816K47964n9098
13943A804021k08460j97170J52654R3760R6233j28980J28342l99916O18842l92490
13933A566836L3515o3182k81309L07893J57011k91277L2758k32090J95932J6114
13923A442201k10444N3749L9113J68817j01843J22322l96787M86724j27719J60812
13913A636945k06463j44378K0026M50905k13458O1778k16133P0885M4190k21516
13903A282781j10850M7957J06306n23J10482j14295j26548M38848k75345K1260
13893A380073K4250j98463j23387K42966l30155N26478m7042n67835J91154L02913
13883A400952k82139K43844j31567J80243l28333m2414J09059L35605n15927J01266
$$ plain form
13873 1070589 1209126 918084 904538 875543 1145780 1280948 1104501 901717 1189254 1068546
13863 1068546 1232615 1318602 1404381 1047454 1212910 1222331 1100900 890520 1102956 1146283
13853 1146283 1167422 1002005 1137079 941394 1260671 967882 1178881 717338 967576 1021524
13843 1021524 918044 1001834 1177896 959673 958789 980964 1110441 918094 1068896 895483
13833 895483 1025793 806950 918184 699486 759172 1237694 834477 798189 971399 835537
13823 835537 1029231 1143481 871946 986309 501504 1012296 853693 985935 698610 965293
13813 965293 985900 538284 650825 451346 829234 795311 879919 642021 790709 826963
13803 826963 562321 870563 678252 509550 913246 501666 646173 894368 658672 648523
$$ packed form
13873A070589J38537k91042j3546k8995K70237J35168j76447k02784K87537j20708
13863A068546J64069Q5987Q5779l56927J65456R421j21431k10380K12436M3327
13853A146283K1139j65417J35074j95685L19277k92789K10999m61543K50238N3948
13843A021524j03480Q3790J76062k18223q84K2175J29477j92347J50802j73413
13833H95483J30310k18843J11234k18698N9686M78522m03217l6288J73210j35862
13823H35537J93694J14250k71535J14363m84805N10792j58603J32242k87325K66683
13813I65293K0607m47616J12541j99479L77888l3923Q4608k37898J48688L6254
13803H26963k64642L08242j92311j68702M03696m11580J44507K48195k35696j0149
$$ plain form
13793 648523 536585 701533 667798 1050461 784223 656765 863045 647078 1032163 839342
13783 839342 1012525 882257 962447 620968 759844 705352 680222 434457 639309 908727
13773 908727 394904 610921 562289 798425 926144 953339 469880 675134 633810 855342
13763 855342 516483 681487 500704 560507 889730 794190 719625 805537 485424 662579
13753 662579 336052 513627 664116 405101 735417 551982 626894 677305 568345 751008
13743 751008 552174 440409 526777 453063 725909 597973 699955 573728 240138 420243
13733 420243 596741 438680 818310 603082 718362 422077 462678 847673 588170 698426
13723 698426 519149 485666 669145 650689 510307 444207 721983 719245 526329 501105 420691
$$ packed form
13793F48523j11938J64948l3735L82663k66238j27458K06280k15967L85085j92821
13783H39342J73183j30268Q0190l41479J38876n4492k5130k45765K04852K69418
13773I08727C94904K16017m8632K36136J27719K7195D69880K05254m1324K21532
13763H55342l38859J65004j80783N9803L29223r5540p4565Q5912l20113J77155
13753F62579l26527J77575J50489k59015L30316j83435P4912N0411j08960J82663
13743G51008j98834j11765Q6368p3714K72846j27936J01982j26227B40138J80105
13733D20243J76498j58061L79630k15228J15280k96285M0601L84995k59503J10256
13723F98426j79277l3483J83479j8456j40382o6100K77776k738j92916k5224q0414
$$ plain form
13712 420691 1015404 208306 838900 500646 418638 698630 868756 244524 410836 455399
13702 455399 184005 405467 614265 330963 593717 786026 935108 596537 325534 595130
13692 595130 600854 465863 439785 495586 435574 317884 375655 405987 607776 332102 550791
13681 550791 347556 363651 255870 303714 228416 448385 396709 512749 583725 365679
13671 365679 346470 342495 275594 406906 311987 735753 489191 244256 536637 709127
13661 709127 508368 672059 368279 400184 612488 277251 892513 608586 290699 174627
13651 174627 164791 315335 640336 637256 436473 339099 397296 271935 404555 450823 137438
13639 550847 552827 411869 508715 240907 408746 210522 394308 531348 529128 413737
$$ packed form
13712D20691N94713B08306O30594l38254q2008K79992J70126B44524J66312M4563
13702D55399A84005K21462K08798k83302K62754J92309J49082l38571k71003K69596
13692E95130N724j34991k6078N5801o0012j17690N7771L0332K01789k75674K18689
13681E50791k03235J6095j07781M7844p5298K19969n1676J16040P0976k18046
13671C65679j9209l975o6901J31312r4919M23766k46562B44256K92381J72490
13661G09127k00759J63691l03780L1905K12304B77251O15262k83927B90699j16072
13651A74627r836J50544L25001l080k00783r7374N8197j25361J32620M6268A37438
13639E50847J980j40958R6846B40907J67839j98224J83786J37040k220j15391
$$ plain form
13629 413737 430593 274870 598775 229830 442443 319346 142822 692586 354199 458500
13619 458500 429810 627140 51097 514154 261151 348081 33839 507536 158915 540570
13609 540570 573651 526279 173680 249554 128467 390603 500376 162298 305038 419440
13599 419440 556104 367970 347681 486007 27044 172477 333367 369281 287713 -35411
13588 300021 46706 41139 335054 380100 83954 347477 359268 200865 111870 241589 207850
13577 207850 272661 -21835 423679 283077 544551 496051 110135 329072 360356 423456
13567 423456 112248 308699 155715 411495 402025 165587 -77777 122011 87946 728869
13557 728869 404501 92632 237089 214605 227436 554850 285664 231896 306418 386617 243489
$$ packed form
13629D13737J6856j55723L23905B29830K12613j23097A42822N49764l38387J04301
13619D58500k8690J97330E1097M63057k53003Q6930C3839M73697A58915L81655
13609E40570L3081m7372A73680P5874j21087K62136J09773A62298J42740J14402
13599D19440J36664j88134k0289J38326B7044J45433J60890L5914q1568c5411
13588C00021D6706n567K93915M5046H3954K63523J1791j58403q8995J29719l3739
13577B07850O4811b1835D23679j40602K61474m8500A10135K18937L1284O3100
13567D23456A12248J96451j52984K55780r470A65587g7777A22011l4065O40923
13557G28869l24368I2632J44457k2484J2831L27414k69186n3768P4522Q0199j43128
$$ plain form
13546 243489 366235 185272 383514 452953 47164 593482 471937 98573 367606 356862
13536 356862 154665 211846 2723 325738 186817 185531 237700 276164 290977 590859 100230
13524 273576 124341 580636 269322 575942 233614 267512 228597 349599 511130 138957
13513 240278 57927 304767 281982 307936 235897 220742 303493 112974 159056 392729 344122
13502 344122 243450 572620 243451 526096 482688 -40857 177227 -52391 319313 545635
13492 545635 315575 524981 494664 130715 298765 -61390 127415 174319 123980 328469
13482 328469 308838 171419 401567 105499 400407 364302 713340 140109 226280 -217050
13471 517961 251211 425637 426649 14688 233577 383471 -98109 337504 651611 132662
$$ packed form
13546B43489J22746j80963J98242O9439D7164N46318j21545I8573K69033j0744
13536C56862A54665N7181B723L23015j38921j286N2169L8464J4813K99882A00230
13524B73576A24341M56295B69322L06620B33614L3898l8915J21002J61531A38957
13513B40278E7927K46840k2785K5954p2039j5155Q2751A12974M6082K33673m8607
13502C44122j00672L29170B43451K82645m3408d0857A77227e2391C19313K26322
13492E45635k30060K09406l0317A30715J68050f1390A27415M6904n0339K04489
13482C28469j9631j37419K30148A05499K94908l6105L49038A40109Q6171b17050
13471E17961B51211J74426J012A4688K18889J49894i8109C37504L14107A32662
$$ plain form
13460 49859 406386 -108787 362472 234595 270982 78265 102503 -50768 327043 22882 560813
13449 560813 96335 108217 85790 -21662 164552 470119 120429 192633 -23973 -37728 333677
13437 462064 353384 403796 -6077 352537 -110037 327068 157921 313210 23476 -71509
13426 65020 -111081 226288 317637 526190 83746 -180951 41112 -96639 226174 257576 391070
13415 391070 379486 -105875 275249 32945 346056 -133811 76781 -45611 183952 159870
13405 159870 194533 273290 461814 148567 257075 373308 453225 217397 44737 386246
13395 386246 2504 112975 113218 -4108 248292 -26135 94701 277989 33803 134020 320810
13384 320810 259486 174601 154917 100592 220656 219328 -72076 515642 637392 213274 355915
$$ packed form
13460D9859L56527a08787C62472j27877L6387G8265K4238e0768C27043B2882N37931
13449E60813I6335J1882k2427b1662A64552L05567A20429P2204b3973j3755C33677
13437D62064j08680N0412f077C52537a10037C27068A57921J55289B3476g1509
13426F5020a11081B26288R1349K08553H3746a80951D1112i6639B26174L1402J33494
13415C91070j1584a05875B75249C2945L13111a33811G6781d5611A83952k4082
13405A59870L4663P8757J88524A48567J08508J16233P9917B17397D4737L41509
13395C86246B504J10471K43d108B48292b6135I4701J83288C3803J00217J86790
13384C20810o1324q4885j9684n4325J20064j328g2076E15642J21750B13274J42641
$$ plain form
13373 355915 3796 -183883 -30931 122912 25763 135888 391768 210766 -7983 433062 281173
13362 281173 409145 243286 485934 101086 297465 342453 159299 343695 320352 407541
13352 407541 234561 526101 40188 142527 73859 104770 -180829 275641 504526 382117
13342 382117 430464 610832 -197385 203019 423921 -50923 148265 425479 200428 343641
13332 343641 -46439 394642 401801 -96464 -118889 344780 131901 497254 398149 59807 372287
13321 372287 391784 -94412 259110 -91082 203216 134537 440389 305937 -40525 17317 338096
13310 338096 74135 34895 448853 376515 135941 204675 -31901 -164776 -170400 -43554 41777
13298 215101 9044 139995 129807 112751 -70803 185900 46911 -122282 182784 63903 136005
$$ packed form
13373C55915C796a83883c0931A22912B5763J10125K55880j81002g983D33062j51889
13362B81173J27972j65859K42648A01086J96379M4988A59299J84396k3343Q7189
13352D07541j72980K91540D0188J02339o8668L0911a80829B75641K28885j22409
13342C82117M8347J80368a97385B03019K20902e0923A48265K77214B00428J43213
13332C43641d6439C94642P159i6464k2425C44780A31901L65353r9105E9807L12480
13321C72287J9497i4412B59110i1082B03216o8679L05852j34452d0525A7317L20779
13310C38096G4135C4895M13958p2338A35941O8734c1901j32875n624d3554D1777
13298B15101I044J30951j0188j7056g0803A85900D6911a22282A82784F3903P2102
$$ plain form
13287 136005 113912 458485 219049 156187 197064 215213 -19535 352882 40843 259775 57250
13275 139231 156245 240506 236847 103340 36415 119557 965 202260 -22301 -117432 169774
13263 224455 -90354 424127 228893 -11407 -38012 122503 197604 -82756 142496 383313
13253 383313 5123 122675 -223156 -99178 -221853 84943 271727 -220376 18913 294011
13243 294011 19320 -68937 46543 -217392 264964 362120 -107184 87160 326314 -161475
13232 -6875 270163 -185321 96160 -251277 344899 221975 136805 89986 -294271 -133595
13221 163993 -131549 -169955 122922 148629 518793 302081 320892 151579 38674 206085
13211 206085 -124028 5711 -136078 -18310 74142 -77027 105622 136609 241367 125309 52853
$$ packed form
13287A36005k2093L44573B19049o2862M0877J8149a9535C52882D0843K18932E7250
13275A39231J7014Q4261l659A03340C6415Q3142I65K01295b2301r5131A69774
13263B24455i0354D24127j95234a1407k6605A22503P5101h2756A42496K40817
13253C83313E123J17552b23156i9178j22675H4943J86784b20376A8913K75098
13243B94011A9320f8937D6543b17392B64964R7156a07184H7160K39154a61475
13232f875B70163a85321I6160b51277C44899j22924q5170m6819b94271a33595
13221A63993a31549l8406A22922K5707L70164k16712J8811A51579C8674J67411
13211B06085a24028E711a36078a8310G4142g7027A05622L0987J04758j16058E2853
$$ plain form
13199 457829 217545 -5228 340321 -24875 131749 -36796 326382 240935 9803 -34678 308072
13187 16511 336930 95398 421911 254151 163821 -35559 91273 147359 -1487 -134921 78613
13175 141399 268000 -30017 -83475 -21415 -30500 48002 67858 -193458 98779 319450 -19188
13163 -108836 -14368 457819 117250 4368 386335 115197 186381 115420 376759 2724 44743
13152 44743 166165 138574 78078 405060 -94091 -62381 185935 -196838 174120 35559 142282
13141 142282 -11237 12642 556205 -82077 97442 -109624 80836 -41356 194547 346347 -80349
13129 -69060 -279561 127417 21871 44737 37147 61636 28356 263843 395259 -51953 69068
13117 -197685 323051 64768 -15205 -146606 98882 -122733 -124166 205681 -95045 144703 479403
$$ packed form
13199D57829B17545e228C40321b4875A31749c6796C26382q5447I803c4678C08072
13187A6511L20419I5398L26513j67760r0330c5559I1273N6086a487j33434G8613
13175A41399J26601c0017n3458b1415r085D8002J9856a93458I8779K20671a9188
13163a08836a4368D57819A17250D368L81967A15197P1184p0961K61339B724M2019
13152D4743J21422k7591o0496L26982i4091L1710A85935a96838A74120C5559J06723
13141A42282a1237A2642N43563h2077I7442a09624H0836d1356A94547J51800h0349
13129f9060k10501A27417B1871K2866p590K4489B8356K35487J31416e1953F9068
13117a97685C23051F4768a5205j31401I8882a22733j433B05681i5045A44703L34700
$$ plain form
13106 479403 54613 35971 -155893 -100598 -408535 230735 55691 -22105 246730 -25809 -74770
13095 -74770 201351 -19473 -6403 57118 -106713 -254825 -296653 249815 88030 -58311 156104
13083 192872 311614 198094 -48455 -212799 170754 46349 -25263 -143389 46598 54445 94642
13072 94642 100460 915 129189 -88534 -150899 142904 38748 -26213 324113 410454 -108016
13060 -106419 227333 275783 269254 247060 -151813 240929 225546 200926 262946 46102 225254
13049 225254 188413 -257115 -60402 139852 88649 276693 193620 76753 173284 35986 36971
13038 36971 204073 -68831 -100601 -82669 85420 -399173 43690 117520 -44841 -144931 334663
13026 78616 366799 -30721 393876 291079 176999 95918 36616 50353 208934 40497 167064
$$ packed form
13106D79403E4613j8642a55893N5295l07937B30735E5691b2105B46730b5809m8961
13095g4770B01351a9473f403E7118a06713j48112m1828B49815H8030e8311A56104
13083A92872J18742j13520d8455j64344A70754D6349b5263j18126D6598P847M0197
13072I4642N818I15J28274h8534o2365A42904C8748b6213C24113Q6341a08016
13060a06419B27333M8450o529k2194a51813B40929j5383k4620O2020D6102J79152
13049B25254l6841b57115f0402A39852n1203J88044q3073G6753R6531C5986R85
13038C6971J67102f8831l1770J7932H5420c99173D3690P3830d4841j00090C34663
13026G8616K88183c0721C93876j02797j14080q1081C6616J3737J58581D0497J26567
$$ plain form
13015 167064 71992 11560 -249804 276871 64600 222697 168260 -107261 -184145 161409
13004 -8033 153142 -72919 1022 381713 187425 166013 205899 36948 84507 157858 -71106
12992 -46854 195616 168187 230215 232946 258638 -70385 -94210 -181028 -201558 195049 -54747
12980 134781 163254 121634 -82959 251254 -18583 -8010 111521 110638 -239039 -121478 196918
12968 123461 -79638 561 -116161 -89477 -127966 104184 178321 165968 194555 139942 206351
12957 206351 -9163 37037 166662 47870 -55011 70878 160887 157481 62586 466271 -72020
12945 13543 -150531 273710 180722 -160569 -143906 26203 -51873 269943 85955 -200661 -65572
12933 -149755 164968 23711 149933 45880 -30004 -128815 67600 232167 -132196 107668
$$ packed form
13015A67064G1992A1560b49804B76871F4600J58097n4437a07261p6884A61409
13004h033A53142g2919A022L80691A87425k1412L9886C6948M7559P3351g1106
12992d6854A95616k7429O2028K731K5692g0385k3825q6818k0530A95049e4747
12980A34781K8473m1620h2959B51254a8583h010A11521q83b39039J17561A96918
12968A23461g9638E61a16161K6684l8489A04184P4137j2353K8587n4613O6409
12957B06351i163C7037J29625D7870e5011G0878R0009l406F2586M03685g2020
12945A3543a50531B73710r2988a60569J6663B6203e1873B69943H5955b00661f5572
12933a49755A64968B3711J26222D5880c0004r8811F7600J64567a32196A07668
$$ plain form
12922 627645 34043 82755 -210290 -37433 258012 249085 13143 -33713 72923 -89903 -330849
12911 -330849 -41846 87341 97330 -1406 277021 -16847 441416 -292394 -8558 16414 -3445 -141373
12899 -141373 27557 -63112 -131894 29026 -77837 -25370 -40064 302645 153961 -44797 13186
12887 70468 -138837 298901 378981 59553 222020 42743 94593 -285138 -307141 68325 57588
12876 57588 101758 -25553 33148 93210 226639 74738 -162866 -184100 247696 -4014 152611
12864 -33241 -219702 58275 -149943 -48997 42027 -95449 -21293 115368 253058 227948 -39006
12852 -56404 -59418 -55250 66519 -51006 -207439 -115233 9757 64398 -103013 -136129 130213 -180308
12839 152065 67393 -60398 103229 267547 -92839 -149308 31156 -362179 -33469 86904 179093
$$ packed form
12922F27645C4043M8712b10290c7433B58012q927A3143c3713G2923h9903k40946
12911c30849d1846H7341R989a406B77021a6847D41416b92394h558A6414c445j37928
12899a41373B7557f3112o8782B9026g7837b5370j4694C02645j48684d4797A3186
12887G0468a38837B98901Q0080E9553J62467D2743N1850b85138k2003F8325j0737
12876E7588M4170b5553C3148O0062J33429G4738a62866k1234B47696d014A52611
12864c3241j86461E8275a49943d8997D2027i5449b1293A15368J37690k5110c9006
12852e6404l014M168F6519e1006j56433R2206I757N4641a03013l3116A30213a80308
12839A52065F7393f0398A03229J64318i2839n6469C1156c62179c3469H6904R2189
$$ plain form
12828 179093 83098 46535 -197505 232749 268100 156156 44443 66975 -210419 -155190 104586
12816 120381 166308 -196800 -75029 138269 -176974 86201 -207283 147832 -290722 -127827
12805 -35119 263438 -110879 12180 140812 30613 330786 9864 185737 -90800 432508 31740
12793 -120214 -81597 -25688 -96960 220993 224098 -237819 204158 320275 -145797 -61170 -251144
12782 -251144 17344 229217 85078 116256 58293 79895 -201358 56433 110614 -182518 153230
12770 157790 17869 -24518 384241 -113860 114470 46259 141300 -77149 7112 443538 82065
12758 -112141 309257 44484 182982 29170 50474 -366693 20856 383036 -224680 144667
12747 46272 -130896 -41138 109902 -66526 -127105 41734 94446 -60384 -35429 224819 477426
$$ packed form
12828A79093H3098l6563a97505B32749L5351j11944D4443K2532b10419N5229A04586
12816A20381M5927a96800g5029A38269a76974H6201b07283A47832b90722a27827
12805c5119B63438a10879A2180J28632C0613L00173I864J75873i0800D32508C1740
12793a20214L8617b5688p1272B20993L105b37819B04158J16117a45797f1170j89974
12782b51144A7344K11873H5078L1178n7963K1602b01358E6433N4181a82518A53230
12770A57790A7869b4518C84241a13860A14470D6259R5041g7149G112M36426H2065
12758a12141C09257D4484J38498B9170K1304c66693B0856L62180b24680A44667
12747D6272a30896d1138A09902f6526o0579D1734N2712f0384K4955B24819K52607
$$ plain form
12736 477426 -131574 247016 401481 -145969 76689 48220 133193 -5327 -171779 -235182 22383
12724 -41773 -73077 19875 72142 -94232 -45449 -343 -393092 -985 161135 78745 16832 1030
12711 -96340 189963 97002 -13700 258271 479843 -20646 69215 438010 420512 78233 303926
12700 303926 34275 -19142 65360 143566 -103602 168292 73582 211922 434108 287155
12690 287155 -11716 210216 208578 167808 353445 -40427 -499 66654 -302928 -50290 37297
12678 -134084 228875 -119531 11918 114318 113194 190704 -8209 8253 19241 19766 14087 484205
12666 484205 45098 275501 4734 234347 256611 -96454 -55979 43524 -66505 103508 -40950
12654 109053 326265 65931 -81028 163402 454987 65987 243684 -122244 100114 146376
$$ packed form
12736D77426a31574B47016J54465a45969G6689k8469Q4973e327j66452o3403B2383
12724d1773l1304A9875N2267i4232d5449c43l92749i85A61135G8745A6832A030
12711i6340A89963r2961a3700B58271K21572b0646F9215L68795j7498G8233K25693
12700C03926C4275a9142F5360P8206a03602A68292G3582J38340K22186j46953
12690B87155a1716B10216j638m0770J85637d0427d99F6654c02928e0290C7297
12678a34084B28875a19531A1918J02400j124P7510h209H253J0988N25n679M70118
12666D84205D5098K30403D734K29613K2264i6454M0475D3524f6505A03508d0950
12654A09053K17212F5931h1028A63402K91585F5987J77697a22244A00114M6262
$$ plain form
12644 146376 -15463 110711 85704 331737 195562 -48903 -192651 72726 51504 246673
12634 246673 -107543 -9665 -174053 -39083 44924 -154820 107540 8676 291952 13192 13736
12623 13736 -49504 171201 298351 202140 299640 -46220 9914 201857 106371 313147 -78638
12611 -45234 -85696 -38663 131633 -93070 89349 58702 105664 -142885 159477 179647 206800
12600 206800 -86352 525097 356591 -200490 57156 332271 -107229 34795 124487 32204
12589 65295 254206 123710 159368 -100190 226216 -32455 362964 74414 119887 -225093
12578 -131249 311164 -13517 -18104 -127749 20222 83693 182225 274096 163622 264996 -58274
12566 -100785 25981 275801 31258 391488 155236 73512 -243231 60614 -14347 -232150
$$ packed form
12644A46376a5463A10711k5007K46033j36175d8903j43748G2726k1222J95169
12634B46673a07543i665j64388c9083D4924a54820A07540H676K83276A3192N44
12623A3736d9504A71201J27150r6211R7500d6220I914J91943r5486K06776g8638
12611d5234m0462c8663A31633i3070H9349l0647M6962a42885A59477K0170K7153
12600B06800h6352E25097j68506b00490E7156K75115a07229C4795Q9692C2204
12589F5295J88911A23710L5658a00190B26216c2455C62964G4414M5473b25093
12578a31249C11164a3517m587j09645B0222O3471R8532R1871j10474J01374e8274
12566a00785B5981K49820C1258L60230A55236G3512b43231F0614a4347k17803
$$ plain form
12556 -232150 -218734 39784 -128279 -54725 150976 9808 -24140 11848 -10660 -49767 242696
12544 120224 -1416 -294098 -264393 126746 -221668 92925 39447 159615 -354097 -60533 100269
12532 -33132 67732 284169 -10808 -20575 -8133 267205 -46633 227995 -95751 53443 107620
12521 107620 -392190 -221425 136341 64076 -170732 -137871 41431 47571 -126335 8891 -18852
12509 -9890 24788 -147601 -208487 -169419 63826 32201 89149 213410 179936 84049 25855
12497 -142897 135741 276518 199533 -41359 -67442 74480 35830 -304707 41827 193789 -327898
12485 -15214 197261 56687 46065 -156532 253463 -41305 -55802 -106161 103445 56704 -107776
12473 131137 -116279 303396 9187 187041 91236 -92615 -112438 25742 -95116 181285 -202
$$ packed form
12556b32150J3416C9784a28279e4725A50976I808b4140A1848a0660l9107B42696
12544A20224a416k92682K9705A26746b21668I2925C9447J20168c54097f0533A00269
12532c3132F7732K16437a0808r767h133B67205d6633B27995i5751E3443N4177
12521A07620c92190J70765A36341F4076a70732L2861D1431O140a26335H891a8852
12509i890B4788a47601o0886L9068F3826l1625N6948J24261l3474H4049B5855
12497a42897A35741J40777p6985d1359k6083G4480C5830c04707D1827J51962c27898
12485a5214A97261E6687j0622a56532B53463d1305j4497n0359A03445m6741a07776
12473A31137a16279C03396I187J77854I1236i2615j9823B5742i5116A81285b02
$$ plain form
12461 47484 255833 -250608 -58362 -279274 299401 29672 -60476 110891 -76448 -300775
12451 -300775 82204 132995 -178390 -45072 191758 35957 188819 -119272 55519 -133134
12440 63436 -50370 -172534 -78323 -262591 -267769 -179928 -41910 166301 168379 250712 155045
12429 155045 123026 68664 213586 -147436 20404 391118 -180914 -63263 -29649 -15972 -74066
12418 -74066 149314 -34359 -110882 186266 -177093 215857 -67673 -55705 37501 -57778 -148583
12407 -148583 -125215 -122120 153795 44476 52145 -227539 -57766 28385 -176759 -126932 175883
12395 -108383 -28555 79821 -203982 17342 12950 125209 -52646 90378 26384 24603 -42654
12383 3618 5601 -157799 48937 -21923 34359 -116248 -104061 145345 -113022 -58245 -30357
$$ packed form
12461D7484K08349b50608e8362k20912B99401B9672f0476A10891g6448k24327
12451c00775H2204N0791a78390d5072A91758C5957J52862a19272E5519a33134
12440F3436e0370j22164g8323j84268n178Q7841d1910A66301K078Q2333r5667
12429A55045l2019n4362J44922a47436B0404L70714a80914f3263b9649J3677n8094
12418g4066A49314c4359p6523A86266a77093B15857f7673J1968C7501e7778r0805
12407a48583K3368L095A53795D4476P669b27539e7766B8385a76759M9827A75883
12395a08383b8555G9821b03982A7342m392J12259e2646I0378B6384j781d2654
12383C618J983a57799D8937b1923C4359a16248J2187A45345a13022N4777K7888
$$ plain form
12372 -30357 -67478 -19652 474799 144230 119464 100878 -41558 -83044 77908 -4582 40963
12360 294466 -7538 -130256 202450 60869 58757 77585 165424 -59274 305943 -132543 97032
12348 61519 46576 -111232 345053 83147 -281439 172813 32223 224500 -215705 -113911
12338 -113911 221930 -87507 -50175 -35668 101203 -466156 67164 35084 -28831 -189422 35582
12326 -85802 -272090 292068 334567 -25719 272184 -29879 -191509 83022 196177 9299 32222
12315 32222 -5805 -111059 -81510 140694 -111264 183397 219028 -323296 149142 -199601
12304 342472 -8145 130357 -143770 -68371 145188 13733 218433 14583 20831 135348 117778
12293 117778 290429 -88143 154198 -110164 131244 -55692 17241 -28272 109731 -67325
$$ packed form
12372c0357l7121a9652D74799A44230k4766j8586d1558m1486G7908d582D0963
12360B94466g538j22718B02450F0869k112J8828Q7839e9274C05943a32543I7032
12348F1519j4943a11232C45053H3147b81439A72813C2223J92277b15705J01794
12338a13911B21930h7507L7332J4507A01203d66156F7164l2080b8831j60591C5582
12326h5802j86288B92068M2499b5719B72184b9879j61630H3022J13155I299K2923
12315C2222e805j05254K9549A40694a11264A83397L5631c23296A49142a99601
12304C42472h145A30357a43770f8371A45188A3733K04700A4583O248J14517j7570
12293A17778J72651h8143A54198a10164A31244e5692A7241b8272A09731f7325
$$ plain form
12282 208266 -133658 302849 106257 201485 110466 409732 13499 233929 246514 300111
12272 300111 -81503 255992 -341007 31678 -108358 21668 103935 73157 219119 -58988 174077
12260 -136991 165431 -139706 454386 65558 -34924 41405 -78489 194209 226556 271035 -38872
12248 -180264 -191213 266592 -40652 -219389 418489 163784 78065 136295 163003 106583 217840
12237 217840 309924 116861 275877 138078 24128 322199 18160 171469 168009 277019
12227 277019 55757 388059 131232 -4866 106494 14001 69567 55293 -52473 94945 193788
12216 193788 454645 410874 111668 -18971 135508 35332 -93097 179489 236659 -47631 -15232
12204 304425 182990 -67429 31352 -96572 157830 208414 159297 189250 103636 -34662 272930
$$ packed form
12282B08266a33658C02849A06257R5228r1019K99266A3499K20430J2585N3597
12272C00111h1503B55992c41007C1678a08358B1668Q2267l0778J45962e8988A74077
12260a36991A65431a39706D54386F5558c4924D1405g8489A94209L2347M4479c8872
12248a80264j0949B66592d0652j78737D18489A63784G8065N8230K6708n6420J11257
12237B17840R2084A16861J59016j37799B4128K98071A8160J53309l460J09010
12227B77019E5757L32302A31232d866A06494A4001N5566j4274e2473I4945R8843
12216A93788K60857m3771A11668a8971A35508C5332i3097A79489N7170d7631a5232
12204C04425j21435f7429C1352i6572A57830N0584m9117K9953q5614c4662B72930
$$ plain form
12192 451405 68828 278740 11221 306481 143025 183928 558751 137419 -155989 -143526
12182 -143526 -109075 -33806 -87077 -154570 -207276 246965 134325 -18139 -139124 -54742 132536
12170 -206830 -28209 372527 119410 -41997 94109 387436 180075 171568 171562 -71007 288864
12158 104636 -69158 -79062 -120711 407928 29495 -191317 -133190 236366 -93139 257133 -104844
12146 140262 -260294 265177 -204657 131083 111883 234527 450469 -265517 -24839 205726
12135 179353 74814 -191754 116656 -117649 -37803 -208524 122177 239321 -58585 -22128
12124 367015 93470 -156184 -278836 143150 67920 -49704 176615 52578 117266 -15043 -48349
12113 -48349 -208196 167779 -162819 -61987 21382 38144 262410 10952 154446 116062 -83474
$$ packed form
12192D51405F8828K09912A1221K95260A43025M0903L74823A37419a55989J2463
12182a43526L4451c3806n3271o7493n2706B46965j12640a8139j20985e4742A32536
12170b06830b8209C72527A19410d1997I4109K93327A80075q507og1007B88864
12158A04636f9158r904m1649D07928B9495a91317N8127B36366i3139B57133a04844
12146A40262b60294B65177b04657A31083j9200J22644K15942b65517b4839B05726
12135A79353G4814a91754A16656a17649c7803j70721A22177J17144e8585b2128
12124C67015I3470a56184j22652A43150F7920d9704A76615E2578O4688a5043l3306
12113d8349j59847A67779a62819f1987B1382J6762K24266A0952J43494l8384h3474
$$ plain form
12101 -25762 169407 181693 -15555 -205030 -167027 41484 -135153 185431 -201233 -163781 80932
12089 -213340 27490 18234 26842 436899 -87363 -78628 306127 -64083 75779 -175899 359289
12077 -29183 -22253 164732 1271307 1968259 682683 -10518 -58714 -29781 285342 286758 77712
12065 105742 123300 -40760 9292 -66535 -42077 41803 126434 -136892 -2338 305070 88559
12053 -157111 18406 -123537 -102755 -43033 -274528 69101 -37812 47115 -273909 -3246 -299548
12042 -299548 -12514 84203 -89762 -76324 333833 212826 -111554 -294361 77365 217039
12032 217039 82726 92023 267504 136165 -129375 347225 215720 -287409 -286280 -89132 -290554
12021 -290554 154049 -84914 -95801 17743 -81478 -82539 661 203630 10313 147094 221142
$$ packed form
12101b5762A69407J2286a5555j89475L8003D1484a35153A85431b01233L7452H0932
12089b13340B7490r256Q608M10057h7363Q735C06127f4083G5779a75899C59289
12077b9183O930A64732J106575O96952F82683a0518m8196K8933B85342J416G7712
12065A05742J7558d0760I292f6535K4458D1803Q4631a36892b338C05070H8559
12053a57111A8406a23537K0782d3033k31495F9101c7812D7115b73909c246k96302
12042b99548a2514H4203h9762J3438C33833j21007a11554j82807G7365J39674
12032B17039H2726R297J75481j31339a29375C47225j31505b87409J129h9132k01422
12021b90554A54049h4914j0887A7743h1478j061F61K02969A0313J36781P4048
$$ plain form
12010 221142 105592 -220590 -63839 69311 41814 -127244 -10864 -49649 -239438 177519
11999 -111268 -314551 -54006 -124316 115688 77447 238283 -29309 161876 129315 226005 40935
11987 3691 -264997 -98152 -93170 -52180 -92438 -17511 171271 210757 -222853 -312114 -61518
11975 35699 227809 -126385 157308 159654 -173890 -14298 22062 122616 -49397 -161736 195549
11963 -336531 -39762 -10838 -18318 -17864 -1166 185142 -192758 -64624 -7958 -239460 -101616 -43602
11950 -231356 -2995 -45337 113225 82508 -169469 135350 -109193 -127089 -8402 -153356 109440
11938 -175894 55692 140324 -25626 48385 212133 -238317 -68001 -110577 102942 15599 -42968
11926 113853 -159737 -8031 124524 -194868 145972 -66978 311228 -101466 125701 184709
$$ packed form
12010B21142A05592b20590f3839F9311k7497a27244a0864l8785j89789A77519
11999a11268k03283e4006p0310A15688l8241J60836b9309A61876l2561R6690D0935
11987C691b64997i8152M982M0990m0258a7511A71271L9486b22853q9261f1518
11975C5699J92110a26385A57308K346a73890a4298B2062J00554d9397j12339A95549
11963c36531c9762a0838p480M54a166A85142a92758f4624g958k31502a01616d3602
11950b31356b995m2342A13225l0717a69469A35350a09193j7896h402j44954A09440
11938a75894E5692Q4632b5626D8385J63748b38317f8001m2576A02942A5599d2968
11926A13853a59737h031A24524a94868A45972f6978C11228a01466A25701N9008
$$ plain form
11916 184709 -432637 9133 -1477 174294 -253928 -197138 -222316 -207214 -102512 59722 178794
11905 178794 -84355 25784 330272 60308 -119847 295788 78183 204731 -84062 -237669
11895 -237669 -162496 -56105 -71612 -187186 16211 69175 60145 -408432 -24052 146935 159776
11884 159776 -292708 -64136 -269113 -190478 202142 -272919 83951 307900 275605 -85496
11873 102402 -153619 114120 -334616 79185 -31560 -348726 153020 -32256 -39351 20854 256655
11862 256655 153135 99573 131920 -102866 -56453 220075 208022 242436 -96821 -39965 154758
11850 114349 139012 -44550 -218151 -198336 83903 63407 249596 107693 -47701 -26006 75566
11838 -29356 213174 -104325 -11284 166933 83508 -234004 -109802 -109711 -205100 47236 145574
$$ packed form
11916A84709d32637I133a477A74294b53928N6790k5178J5102a02512E9722J19072
11905A78794h4355B5784L04488F0308a19847B95788G8183J26548h4062j53607
11895b37669P5173e6105j5507j15574A6211N2964r030d08432b4052A46935J2841
11884A59776b92708f4136k04977P8635B02142b72919H3951K23949l2295h5496
11873A02402a53619A14120c34616G9185c1560l17166A53020c2256p095B0854K35801
11862B56655j03520n3562L2347a02866M6413B20075j2053L4414i6821c9965A54758
11850A14349K4663d4550j73601J9815H3903k0496J86189A07693d7701K1695G5566
11838b9356B13174a04325a1284A66933q3425b34004a09802R1r5389D7236R8338
$$ plain form
11827 145574 70893 -90707 205469 -68186 70358 -183089 -51170 -92275 -188339 65777 -54605
11815 37275 -81472 60446 266905 -126067 302536 9174 -2595 -248997 31697 197776 256539
11804 256539 48724 1312 97269 -91140 -92709 -33976 -169235 164239 -133631 67338 176213
11793 176213 146135 308396 -217333 -128443 -329142 223030 -393433 -157599 -174458 102528
11782 -233611 217983 288287 -265959 141172 197727 -49394 -98765 90568 116045 -206961 -104522
11771 -104522 68020 -327446 -6055 -16488 -175209 -83380 337621 -273352 -29298 211212 -36051
11759 70067 29576 122661 -72986 -89897 -200415 93064 -394265 -21060 293591 -174512 66690
11747 89432 -110571 -40046 -200761 -223909 31268 -245949 -60140 239044 -261205 -44250 208681
$$ packed form
11827A45574G0893i0707B05469f8186G0358a83089e1170m1105r6064F5777e4605
11815C7275h1472F0446K06459a26067C02536I174b595k46402C1697J66079N8763
11804B56539D8724A312R5957i1140j569c3976j35259A64239a33631F7338J08875
11793A76213l0078J62261b17333Q8890k00699B23030c93433a57599j6859A02528
11782b33611B17983P0304b65959A41172N6555d9394m9371I0568K5477b06961J02439
11771a04522F8020c27446f055j0433j58721h3380C37621b73352b9298B11212c6051
11759G0067B9576R3085g2986j6911j10518I3064c94265b1060B93591a74512F6690
11747H9432a10571d0046j60715k3148C1268b45949f0140B39044b61205d4250B08681
$$ plain form
11735 -51436 39816 47558 -522141 18830 172288 64647 -101638 125687 -116012 -131942 -45490
11723 237300 -25317 59362 352111 -193293 210196 52633 2839 -267889 49090 -191192 -55263
11711 87452 -223947 36153 108431 142935 97749 70704 -255890 233563 181808 198379 -171008
11699 117086 35228 101188 7855 -82862 182827 186605 832 -19614 -91039 -9908 39086 160424
11687 160424 165087 236991 18058 -119602 -66622 -291778 235357 225577 -247910 260346 43862
11675 -222428 -72171 -129489 111348 -19085 25545 454640 -221371 -19317 -34720 -143742 -86503
11664 -86503 -155592 19033 219006 -212512 271358 34270 -52635 154553 160273 32713 9564
11652 -27830 -154961 -70770 26172 -100622 212781 -53775 5891 -46081 -151322 -158763 205663
$$ packed form
11735e1436C9816P742e22141A8830J53458F4647a01638A25687a16012j5930d5490
11723B37300b5317E9362K92749a93293B10196E2633B839b67889D9090a91192e5263
11711H7452b23947C6153P2278L4504m5186k7045b55890B33563n1755J6571a71008
11699A17086C5228O5960G855h2862A82827L778H32a9614p1425i908C9086J21338
11687A60424M663P1904A8058a19602N2980k25156B35357r780b47910B60346D3862
11675b22428g2171n7318A11348a9085B5545M29095b21371a9317j5403j09022N7239
11664h6503o9089A9033J99973b12512B71358C4270e2635A54553N720C2713I564
11652b7830j27131g0770B6172a00622B12781e3775E891d6081j05241p441B05663
$$ plain form
11640 -76344 -26006 5925 -185557 63594 49896 -159334 -186899 91924 -204702 -125793 -4745
11628 69702 164127 -115965 145455 142221 180645 -155294 -67227 178325 107312 -83866 238874
11616 -79678 -127836 185917 78705 364972 -135276 -106567 -122756 -136313 -108552 259264 -53351
11604 52024 123756 -122043 239775 -15274 276964 -109293 33996 -72714 -30637 159191 31088
11592 -131474 -136576 -14059 237743 -51552 -53125 129174 146776 301187 -13578 -38866 187038
11580 131959 -52651 -196817 -223680 158859 -140313 179908 -55245 152611 81202 19350
11569 138155 136249 34222 -43833 22192 -244356 27897 26239 179996 189430 35231 -285403
11557 90092 -28883 186843 17088 -291329 -113920 69108 121581 60066 -219937 -246893 -80951
$$ packed form
11640g6344b6006E925a85557F3594j3698a59334k7565I1924b04702P8909d745
11628F9702R4425a15965A45455l234L8424a55294f7227A78325p1013h3866B38874
11616g9678m8158A85917G8705K86267a35276K8709j6189j3557K7761B59264e3351
11604E2024P1732a22043B39775a5274B76964a09293C3996g2714c0637A59191C1088
11592a31474n102a4059B37743e1552j573A29174J7602J54411a3578k5288A87038
11580A31959e2651j44166k6863A58859a40313A79908e5245A52611p1409A9350
11569A38155j906C4222d3833B2192b44356B7897j658J53757R434C5231b85403
11557I0092b8883A86843A7088b91329a13920F9108N2473F0066b19937k6956h0951
$$ plain form
11545 -123959 -59437 217505 262751 205530 159600 99283 222303 271964 -203078 -9089 141447
11533 44807 254547 153286 226002 98483 174882 350701 40398 114859 208039 -61166 80493
11521 222382 17059 -11782 133049 120767 350220 -127449 293625 112690 -4095 198080
11510 211068 60362 300961 -21722 45547 -160984 102570 290721 344312 113415 152340
11500 152340 34214 11134 267792 51253 -93983 351939 258884 150283 190070 44477 44339
11489 44339 -151699 27181 201201 324301 36407 113328 -5090 256757 103020 66209 263189
11478 263189 282684 218191 250796 359579 -7236 399686 219697 330314 265081 126373 81930
11467 81930 -109495 72456 309276 75632 18794 187083 122629 -226974 65014 -163687 209726
$$ packed form
11545a23959e9437B17505M5246n7221m5930o0317J23020M9661b03078i089A41447
11533D4807K09740j01261P2716I8483P6399J75819D0398P4461R3180f1166H0493
11521B22382A7059a1782A33049j2282K29453a27449B93625A12690d095A98080
11510B11068F0362K40599b1722D5547a60984A02570J88151N3591A13415L8925
11500A52340C4214A1134K56658E1253i3983C51939r3055j08601L9787D4477j38
11489D4339a51699B7181J74020J23100C6407P6921e090B56757A03020l6811J96980
11478B63189J9495o4493L2605J08783g236C99686j79989J10617o5233A26373m4443
11467H1930a09495G2456K36820G5632A8794J68289o4454b26974F5014a63687B09726
$$ plain form
11455 93123 -16325 102221 152576 299717 69909 -311512 404562 157975 -120745 -291980
11445 -291980 157081 93365 214590 63309 -168395 85095 -137138 -4778 166410 -80802 493775
11433 104893 166247 -73505 14520 -172736 -17582 -51322 -56042 50137 170517 27505 218927
11422 218927 5132 -59452 267815 66652 -150835 202372 -97810 -180096 85059 261069 -465248
11410 47392 -95347 218649 249266 159503 108101 340939 -215863 -87586 104342 -148389 -65824
11398 326878 37392 -27067 247309 187940 219283 -99012 116857 -112865 -179898 -127315 -127258
11387 -127258 -46465 -221087 -246307 19946 -220963 57584 214052 137832 210414 165081 25061
11375 -77527 71127 45641 61870 -421874 53088 -12680 -198420 -185480 -31199 79608 -17009
$$ packed form
11455I3123a6325A02221N0355J47141F9909c11512D04562A57975a20745j71235
11445b91980A57081o3716J21225F3309a68395H5095a37138d778A66410h0802D93775
11433A04893O1354g3505A4520a72736a7582l3740m720E0137J20380B7505J91422
11422B18927E132e9452B67815F6652a50835B02372i7810q2286H5059J76010d65248
11410D7392i5347B18649L0617q9763n1402K32838b15863h7586A04342a48389f5824
11398C26878C7392b7067B47309n9369L1343i9012A16857a12865o7033N2583N7
11387a27258d6465j74622k5220A9946b20963E7584J56468p6220P2582m5333B5061
11375g7527G1127k5486J6229d21874E3088a2680j85740J2940c1199G9608a7009
$$ plain form
11363 -101640 -190450 -183448 92872 499241 71686 -22127 -4091 -318542 -110112 -132852 -12396
11351 -124428 98131 37965 -253671 112944 -436737 461071 318679 32279 -187311 -89419
11340 50519 10573 -34010 130815 -127580 -133602 15118 192311 229061 -39952 45219 -68118
11328 -172766 -246957 -77895 27259 -109509 1650 -6495 62464 117762 -146385 -71105 -102662
11317 -102662 81642 -104233 344503 -23955 -92201 504086 -92340 48455 -140978 -205928 118435
11305 -267250 -51336 -13043 41539 201863 -72102 -281212 101792 -72126 116196 -388833
11294 -213123 20700 -64474 211129 -308777 -98431 11475 50792 -130907 54678 35586 6397
11282 -21798 255530 7634 -15602 295348 -34997 -156780 -66789 -18612 123619 55608 -81280
$$ packed form
11363a01640q8810P002I2872M06369G1686b2127d091l14451a10112k2740a2396
11351a24428I8131C7965b53671A12944d36737D61071j42392C2279a87311h9419
11340E0519A0573c4010A30815a27580o022A5118J77193L6750c9952D5219f8118
11328a72766p4191g7895B7259a09509A650f495F2464N5298a46385g1105l1557
11317a02662H1642a04233C44503b3955o8246E04086i2340D8455a40978o4950A18435
11305b67250e1336a3043D1539J60324g2102k09110A01792g2126A16196c88833
11294b13123B0700f4474B11129c08777i8431A1475L9317a30907E4678j9092F397
11282b1798B55530G634a5602B95348c4997j21783f6789a8612A23619E5608h1280
$$ plain form
11270 -93094 3464 17069 -60762 -75365 -61359 74592 2358 -35013 -206717 -277452 176850 46149
11257 -27078 -35606 185483 -114555 116366 -10599 326029 103024 -121801 71512 -86865 -92356
11246 -92356 149778 -3294 23954 -4630 -133688 -88839 189749 45722 -56837 -162866 82354
11234 -100036 -212455 84922 -70402 82554 227612 -41791 -254111 372491 -125383 -168972
11224 -168972 18815 -173803 49323 -338963 99843 -149698 -117095 58541 277942 -75946 86564
11212 191430 -60096 68934 218184 -255498 -233646 32382 131398 -18415 -101533 -72436 129779
11200 -118140 5436 -116260 -232866 -134054 -216237 -8354 215952 23423 -8235 -112166 -12270
11188 236527 187599 255149 -25033 -172121 96736 -23605 -281661 96577 285306 -38669 11091
$$ packed form
11270i3094C464J3605f0762j4603J4006G4592B358c5013j71704p0735A76850D6149
11257b7078q528A85483a14555A16366a0599C26029A03024a21801G1512h6865n491
11246i2356A49778c294B3954d630j29058M4849A89749D5722e6837j06029H2354
11234a00036j12419H4922g0402H2554J45058d1791k12320C72491a25383m3589
11224a68972A8815a73803D9323c38963I9843a49698L2603E8541K19401g5946H6564
11212A91430f0096F8934J49250b55498K1852C2382R9016a8415q3118K9097A29779
11200a18140E436a16260j16606R8812q2183h354B15952B3423h235j03931a2270
11188B36527m8928O7550b5033j47088I6736b3605k58056I6577J88729c8669A1091
$$ plain form
11176 -239530 91314 -179360 140465 118146 -76011 -56938 30366 13334 -178986 29126 45141
11165 45141 -247943 -55377 -6889 -125089 -185920 -192403 81627 19021 72124 -127607 165395
11153 54296 -112925 -308517 77870 -99691 109872 -32847 -29078 -155164 -158941 -160102 -37020
11141 -137126 -87914 181620 -143857 207550 -14623 69178 127691 -66657 185531 -78369 18685
11129 102548 184966 -9104 15272 103006 449 -219334 13656 196113 -999 101384 255772 3545
11116 -250130 -46391 64031 -56209 -333679 30263 1632 118137 -262924 319226 86212 -207474
11104 65093 153425 250311 204130 478333 -83856 254661 512095 297280 80166 31595 -84816
11092 164039 330340 175662 130103 51263 94081 275413 244550 -65367 174290 220972 295573
$$ packed form
11176b39530I1314a79360A40465k2319g6011J9073C0366A3334a78986B9126J6015
11165D5141b47943e5377f889j18200o0831o483H1627A9021N3103a27607A65395
11153E4296a12925j95592G7870i9691A09872c2847L769j26086l777j161c7020
11141a37126M9212A81620a43857B07550a4623F9178N8513f6657A85531g8369A8685
11129A02548Q2418i104A5272Q7734D49b19334A3656J82457i99A01384J54388C545
11116b50130d6391F4031e6209k77470C0263A632J16505b62924C19226H6212b07474
11104F5093Q8332R6886m6181K74203h3856B54661K57434k14815H0166C1595h4816
11092A64039J66301j54678m5559E1263M2818J81332l0863f5367A74290M6682P4601
$$ plain form
11081 295573 382111 133900 358545 86032 28744 340057 423831 308792 278096 130682
11070 242493 16124 432152 362385 478131 112688 -43389 35055 202664 474275 288515
11060 288515 399025 534764 555125 465387 475015 678683 800927 662668 719703 706663 342742
11048 577224 758743 403748 529028 666436 501078 768005 705153 583012 563643 699887
11038 699887 909731 418061 709307 535057 573090 778313 637745 480833 754619 195331
11027 195798 371881 591228 883377 429754 907599 380216 625862 671615 156136 578034
11017 578034 500182 671677 440853 514494 494800 526767 540756 425757 564073 510660 484218
11006 484218 457961 515782 659840 489865 507016 474765 328659 875692 536339 690701
$$ packed form
11081B95573Q6538A33900K24645H6032B8744L11313Q3774j15039l0696A30682
11070B42493A6124M16028o9767J15746A12688d3389C5055J67609K71611j85760
11060B88515J10510J35739K0361q9738R628K03668J22244j38259N7035j3040C42742
11048E77224J81519l54995J25280J37408j65358K66927o2852j22141j9369J36244
11038F99887K09844D18061K91246j74250L8033K05223j40568j56912K73786A95331
11027A95798J76083K19347K92149D29754M77845C80216K45646M5753A56136M21898
11017E78034p7852J71495k30824P3641j9694L1967J3989j14999J38316n3413k6442
11006D84218k6257N7821J44058j69975J7151l2251j46106N47033l39353J54362
$$ plain form
10996 690701 865390 411843 651206 919755 399516 351628 794148 613701 402644 654379
10986 654379 553966 714081 835754 1034268 1201459 1104154 1006336 1129493 1385491 1307869
10976 1307869 1463582 1561715 2240765 2390483 2202436 2433746 2473700 2467382 2165612 2100220
10966 2100220 1623686 1631307 1378244 1557003 1694220 1400169 1258956 2024904 1391649 1829751
10956 1829751 1761736 1377743 1225209 1323880 1118419 1429128 610243 349897 449890 602984
10946 602984 161320 508309 407152 576463 -36920 88039 -285013 467053 141076 162286
10936 162286 72093 -192392 -64898 45587 44414 11787 202577 272639 -134608 216644 112162
10925 112162 106297 489728 247997 26379 -102566 52256 -263494 168039 1520 39093 192379
$$ packed form
10996F90701J74689D11843K39363K68549C99516m7888M42520j80447k11057K51735
10986F54379j00413J60115J21673J98514J67191r7305r7818J23157K55998p7622
10976A307869J55713R8133O79050J49718j88047K31310L9954o318l01770o5392
10966B100220m76534P621k53063J78759J37217k94051j41213P65948o33255M38102
10956A829751o8015l83993j52534R8671k05461L10709F10243k60346R9993J53094
10946F02984A61320L46989j01157J69311c6920H8039b85013D67053A41076K1210
10936A62286G2093a92392f4898D5587j173A1787J90790P0062a34608B16644j04482
10925A12162n865L83431k41731B6379a02566E2256b63494A68039A520L7573J53286
$$ plain form
10914 192379 161383 -136518 -236593 239822 -110494 -84658 163370 -348824 116682 25859
10903 212761 219089 -30973 -328870 -58648 -146206 -14717 57834 78794 41603 -128835 -180313
10892 -180313 -219143 -146889 2945 200925 25365 -13438 -372154 115580 101664 -138022 180551
10880 -165285 -90147 -133410 -60867 -196969 175541 119474 -327009 -70482 5100 -45584 -61882
10869 -61882 55021 207332 514566 -195384 -66654 -254350 -236308 221541 369400 60953
10858 -230379 190832 429550 -83698 271991 126125 -18375 75982 39022 -41277 1248 314151
10847 314151 83670 -56554 -77298 -23186 406057 72668 -93823 79221 358244 -374 -277727
10836 -277727 24145 -258841 -223297 242881 -116605 -145750 47067 448681 293859 234989
$$ packed form
10914A92379l0996a36518j00075B39822a10494K5836A63370c48824A16682B5859
10903B12761O328c0973k97897e8648q7558a4717E7834K0960l7191a28835n1478
10892a80313l8830P2254B945J97980B5365a3438l58716A15580j3916a38022A80551
10880a65285P5138m3263f0867j36102A75541n6067c27009g0482E100d5584j6298
10869f1882E5021J52311L07234a95384f6654j87696J8042B21541J47859F0953
10858b30379A90832K38718h3698B71991A26125a8375G5982l6960d1277A248L12903
10847C14151H3670e6554k0744b3186D06057G2668i3823G9221K79023c74k77353
10836b77727B4145b58841L5544B42881a16605k9145D7067M01614j54822n8870
$$ plain form
10826 234989 157114 -204195 69724 -129840 12193 196238 -355128 -310531 -145908 -219906
10816 -219906 134269 -56772 111721 108714 -116303 28654 -14134 -50405 229209 -172476 -96442
10805 -96442 -164878 395514 -80514 -31230 -100788 -135328 -74562 191176 -76734 -326930 100828
10793 -166297 102903 273004 -71582 28551 -58792 -81417 264645 161865 -107593 -196536
10783 -196536 -27429 -169272 -75776 -13335 -77025 41053 20649 14055 -7441 -190930 -128621
10772 -128621 -249534 59623 93559 17294 4271 -310930 193819 -119957 181461 13847 -40045
10760 -101194 13982 -125941 292708 113971 95234 13310 -200324 56918 -325268 -105989
10749 -108015 175654 87600 -481346 -152894 -70550 -15048 -14478 -103432 64632 -120861 91769
$$ packed form
10826B34989p7875b04195F9724a29840A2193J84045c55128M4597a45908p3998
10816b19906A34269e6772A11721l007a16303B8654a4134l6271B29209a72476P6034
10805i6442o8436C95514h0514c1230o9558l4540O0766A91176g6734k50196A00828
10793a66297A02903J70101g1582B8551e8792k2625B64645j02780a07593q8943
10783a96536b7429j41843g5776a3335o3690D1053k0404o594g441j83489O2309
10772a28621j20913E9623L3936A7294D271c10930A93819a19957A81461A3847d0045
10760a01194A3982a25941B92708A13971j8737A3310b00324E6918c25268a05989
10749a08015A75654H7600d81346a52894g0550a5048N70q8954F4632a20861I1769
$$ plain form
10737 96273 -286349 264091 -205594 153229 -431658 -143847 -264997 -14980 101879 -36062
10726 73744 43924 -256188 82155 -157932 108587 7405 5265 -494177 -101421 176101 441142
10715 441142 52898 198677 72417 67788 118111 60656 431807 -244577 328951 62484 -316805
10703 143183 -274003 -29853 -290257 -159559 -192025 -18098 -7294 -143375 -231426 -42694 -31707
10692 -31707 -175849 -265109 -82425 -100510 101402 -278955 -80454 -2673 -209487 -182556 152720
10680 -14558 181659 -92636 95386 -89470 25990 138561 285112 -156267 -102740 3586 -21902
10668 33363 -153098 -28826 -178659 271767 86860 -165995 -416491 -207641 -173499 -209565
10658 -209565 -25163 -195584 60462 -231191 23691 50193 -303992 -236321 183153 -460359
$$ packed form
10737I6273b86349B64091b05594A53229d31658a43847j21150a4980A01879c6062
10726G3744k9820b56188H2155a57932A08587G405k140d94177a01421A76101K65041
10715D41142E2898J45779G2417m629N0323n7455L71151b44577C28951F2484c16805
10703A43183b74003b9853k60404J30698l2466a8098g294j36081q8051d2694J0987
10692c1707j44142q9260h2425j8085A01402b78955h0454b673k06814K6931A52720
10680a4558A81659i2636I5386h9470B5990J12571J46551a56267N3527C586b1902
10668C3363a53098b8826j49833B71767H6860a65995k50496b07641L4142l6066
10658b09565b5163j70421F0462b31191B3691K6502c03992O7671A83153d60359
$$ plain form
10647 -225183 -308600 -249330 358286 70055 -45822 -173376 -47318 -129847 202001 -118882 -317178
10636 -317178 110181 -114650 70371 -334156 19888 214650 -2425 131409 -155410 335248
10625 -85735 83418 -181508 -366887 -140129 -19594 86023 -426263 181545 -150242 125860
10614 75337 127214 96436 20372 -175302 -187883 74202 44957 95470 -154969 -131224 -119880
10603 -119880 -153084 -91773 113351 -196170 -98351 252982 179338 -199254 25759 -39433 74690
10591 -220168 58695 -77284 -54011 51554 -249231 -235932 -138825 -26075 -174278 -395 -88480
10580 -88480 -67540 -236758 114556 -168249 32783 -402079 88763 91489 144265 -247838 -285909
10569 -285909 -2389 16177 -435777 104342 -118280 -98182 -236425 -39294 -74504 -202466 -164421
$$ packed form
10647b25183q3417N9270C58286G0055d5822j27554d7318q2529B02001a18882j98296
10636c17178A10181a14650G0371c34156A9888J94762b425A31409a55410C35248
10625h5735H3418a81508j85379a40129a9594H6023d26263A81545a50242A25860
10614G5337N1877l0778B0372a75302j2581G4202k9245N0513a54969K3745J1344
10603a19880l3204O1311A13351a96170R7819B52982p3644a99254B5759c9433G4690
10591b20168E8695g7284K3273E1554b49231J3299R7107b6075j48203c95q8085
10580h8480K0940j69218A14556a68249C2783d02079H8763K726N2776b47838l8071
10569b85909b389A6177d35777A04342a18280K0098j38243c9294l5210j27962L8045
$$ plain form
10558 -164421 -282876 149389 123 -31608 128805 -174485 -241671 -158495 -51683 -331959 -171115
10547 -171115 59330 -56882 6621 -79568 -193081 -48096 -70049 173934 -166951 -6157 24012
10535 104950 172892 -24070 242 117279 94474 -30461 -88954 247105 -16701 -19294 -72973 -273755
10523 -273755 75871 -215739 32900 211143 70763 -64702 237574 -56548 204008 -159491
10512 20824 -242557 -110875 -264136 411276 -212502 -54804 15099 103428 55181 81906 -2909
10500 -213792 -56285 25516 69566 25571 -208908 285032 199873 -209254 -180704 -251769 133781
10488 355568 127563 368793 239504 -63565 -3832 -11500 510689 255017 289981 -106585 360981
10476 -57165 126251 142385 -1472 -281714 -29218 -194045 175387 262154 -356307 121597 397386
$$ packed form
10558a64421j18455A49389A23c1608A28805a74485o7186Q3176e1683k80276J60844
10547a71115E9330e6882F621g9568j13513d8096k1953A73934a66951f157B4012
10535A04950O7942b4070B42J17037k2805c0461n8493B47105a6701k593n3679k00782
10523b73755G5871b15739C2900J78243G0763f4702B37574e6548B04008a59491
10512B0824b42557a10875j53261D11276b12502e4804A5099Q8329m8247K6725b909
10500b13792e6285B5516M4050B5571b08908B85032q5159b09254K8550p1065A33781
10488C55568A27563K41230j29289f3565c832p668E10689B55017L4964a06585C60981
10476e7165A26251J6134a472k80242b9218j64827A75387Q6767c56307A21597K75789
$$ plain form
10465 397386 257276 -39445 -93098 3257 -78567 -251324 163024 -71387 153161 -132137 93259
10453 17883 -459515 -10601 -15689 18936 -262727 -128972 -369347 376850 117040 -526 106656
10441 -29817 -142654 -234616 4094 -40908 -74998 -234699 -258493 -435034 108451 -55685 -130707
10430 -130707 -187638 -225107 -24218 94566 -184572 170945 -19411 -23411 158321 17433 -42771
10418 -205593 274 27958 -204660 -55005 -67676 145985 80215 -157511 -260364 -270410 -120563
10406 -42151 -6626 -168780 -66730 69145 -92411 -51570 -145794 -168364 -167612 99118 37773 -117511
10393 -42061 -84515 -86451 -150075 527057 -156242 -301055 17046 157829 108154 15909 -72788
10381 173120 48123 59607 109825 147842 80344 260415 288410 245179 196857 555155 280876
$$ packed form
10465C97386j40110c9445n3653C257g8567j72757A63024g1387A53161a32137I3259
10453A7883d59515a0601n088A8936b62727a28972k40375C76850A17040e26A06656
10441b9817j12837r1962D094d0908l4090j59701k3794j76541A08451e5685p5022
10430a30707n6931l7469b4218I4566a84572A70945a9411m000A58321A7433d2771
10418b05593B74K7684b04660e5005j2671A45985o5770a57511j02853j0046a20563
10406d2151f626j62154f6730F9145i2411M0841r4224k2570P52I9118C7773a17511
10393d2061m2454j936o3624E27057a56242j44813A7046J40783m9675A5909g2788
10381A73120D8123J1484N0218L8017o7498J80071K7995m3231m8322L58298k74279
$$ plain form
10370 280876 228541 94807 211961 112953 555231 424886 258634 552121 13490 459182
10360 459182 172277 22190 218927 -142362 91051 364281 379187 169964 258090 316105
10350 316105 492489 503526 280034 42191 99558 301200 422695 276671 194722 293099
10340 293099 253108 -114423 306692 -166489 -4123 -44978 44007 -9691 345854 263585 -146073
10328 25346 351733 284430 -77572 117422 319640 231666 178466 437375 101825 -82318 94874
10316 48637 559879 50230 -238576 -90437 63450 148353 223680 -404220 -86848 167019 342204
10305 342204 96084 310756 159284 110453 -51790 54212 9827 -7104 110761 -69290 -162675
10294 -162675 265944 219124 -25740 12658 -227745 108424 -241907 -508420 222001 -213667
$$ packed form
10370B80876n2335I4807J17154r9008M42278j30345j66252K93487A3490M45692
10360D59182A72277B2190J96737a42362I1051K73230J4906A69964Q8126N8015
10350C16105J76384J1037k23492D2191N7367K01642J21495j46024q1949R8377
10340B93099l9991a14423C06692a66489d123m0855D4007i691C45854q2269a46073
10328B5346L26387o7303g7572A17422K02218q7974n3200K58909A01825h2318I4874
10316D8637N11242E0230b38576i0437F3450Q4903P5327d04220h6848A67019J75185
10305C42204I6084K14672j51472m8831e1790E4212I827g104A10761f9290r3385
10294a62675B65944m6820b5740A2658b27745A08424b41907k66513B22001b13667
$$ plain form
10283 -5503 -182951 -114846 -390418 266374 -29106 190463 -231452 -102949 163665 240647
10273 240647 -171094 -49104 -50700 -174568 148904 -320103 405129 -110425 -60638 -169589
10263 -169589 245356 281049 311110 247150 287368 377174 542931 175169 85659 65240 75750
10252 75750 178374 136551 182419 295538 -149969 103661 -200858 95424 160003 71894 109345
10241 109345 -104050 394816 -309572 -252027 -148371 -269393 37916 -5874 -324791 -15662
10230 -39446 67017 50970 185043 101288 27132 106796 105997 -126939 -136634 -275050 146643
10218 -257635 -32799 -160982 -188578 -97055 -56655 -10571 -373830 41976 117828 119037 -95616
10206 -326947 -502070 -197206 -143897 -261750 -374936 -216934 -79063 -357947 68669 -48682
$$ packed form
10283e503j77448O8105k75572B66374b9106A90463b31452a02949A63665P6982
10273B40647a71094d9104j596j23868A48904c20103D05129a10425M9787j08951
10263a69589B45356L5693L0061o3960M0218Q9806J65757A75169H5659k0419J0510
10252G5750J02624m1823M5868J13119a49969A03661b00858I5424O4579G1894L7451
10241A09345a04050C94816c09572N7545J03656j21022C7916e874l18917a5662
10230c9446F7017j6047J34073q3755B7132P9664p99a26939r695j38416A46643
10218b57635c2799j28183k7596R1523M0400a0571l63259D1976P5852J209i5616
10206c26947j75123a97206N3309j17853j13186J58002g9063k78884F8669d8682
$$ plain form
10195 -39886 -161661 -255244 -586274 -221245 -210510 -354320 187895 -55410 -364739 24586
10184 270214 -126114 267094 -176192 200083 158327 -288167 128789 109480 -162276 -286075
10174 -286075 -263672 -65430 -148541 144591 18367 -111065 -166981 -294270 -231149 -47274 18905
10162 -87705 111386 317205 -91845 -25759 86639 51366 -419871 122322 -38528 -254261 23774
10150 -4530 -126190 171599 -174321 12626 -144746 -98721 -110369 -62264 -30439 -251310 42461
10138 164489 245502 14338 -289455 183752 71714 2373 -28511 -262282 214128 -36713 -230233
10127 -230233 329824 370229 15580 120561 119585 -10295 173897 -17913 -14475 -78959 55864
10115 -136000 99983 127273 183305 99682 -86077 86211 -34331 158279 -303253 -363638 32745
$$ packed form
10195c9886j21775r3583l31030b21245J0735j43810A87895e5410l09329B4586
10184B70214a26114B67094a76192B00083m1756b88167A28789j9309a62276j23799
10174b86075K2403f5430q3111A44591A8367a11065n5916j27289O3121d7274A8905
10162h7705A11386K05819i1845b5759H6639l5273d19871A22322c8528k15733B3774
10150d530j21660A71599a74321A2626a44746M6025j1648M8105c0439k20871D2461
10138A64489Q1013A4338b89455A83752G1714B373b8511k33771B14128c6713j93520
10127b30233C29824M0405A5580J04981r76a0295A73897a7913L438o4484E5864
10115a36000I9983K7290N6032q3623h6077H6211c4331A58279c03253o0385C2745
$$ plain form
10103 -21801 70100 -202170 -7444 141154 -166476 65507 250618 -164603 505362 -150346
10092 135347 -60932 -5619 76484 41650 88407 -81737 -304844 114561 -35059 -146643 -68721
10080 119800 -121891 -49154 102960 107888 85176 -202533 3522 -174411 -88653 153541 -29108
10068 61178 159326 6205 -411981 77341 -66500 152173 32287 12367 -147832 -146048 11597
10056 -176295 -225024 220209 305319 -105392 -18749 -98564 -335553 146480 -64761 314272
10045 -17615 177880 51862 68546 10546 11126 -197899 -89202 -142628 -20802 233735 47540
10033 6190 -196982 60036 -106953 -295146 -212064 -24494 182517 179102 -2787 -183551 157955
10021 -24463 -234250 87893 30833 -313301 -79000 -53697 -182764 -9057 11217 261517 -103545
$$ packed form
10103b1801G0100b02170g444A41154a66476F5507J85111a64603E05362a50346
10092A35347f0932e619G6484l4834M6757h1737k23107A14561c5059j11584f8721
10080A19800a21891d9154A02960M928k2712b02533C522a74411Q5758A53541b9108
10068F1178R8148F205d11981G7341f6500A52173C2287A2367a47832J784A1597
10056a76295m8729B20209Q5110a05392a8749p9815k36989A46480f4761C14272
10045a7615A77880E1862J6684A0546N80a97899h9202n3426b0802B33735D7540
10033F190a96982F0036a06953j88193Q3082b4494A82517l415b787j80764A57955
10021b4463k09787H7893C0833c13301g9000K5303j29067i057A1217K50300a03545
$$ plain form
10009 -130298 127470 -204615 -280459 -218539 231971 -341826 -384432 -115007 90006 -245647
9998 279425 -101091 -37136 -320385 61433 -6889 -109280 105603 -186019 -67303 -79785 37730
9986 -136423 -149186 -2503 -60173 -272217 -16258 118420 80932 -58724 88601 -396128 7906
9974 -261735 -239596 29630 -224900 -355700 -15929 189063 -210908 -122341 -262489 163512
9963 -169395 -115147 68457 -151712 151115 326231 -90869 153354 -67468 -142573 9796 -299780
9951 -3072 192720 -20712 21307 157488 -31474 -35195 -27663 -138029 118123 -117464 8650 162086
9939 162086 -326180 83984 -86764 -105975 -208332 64369 -288869 -210754 5857 253061 65044
9927 97197 -361807 -27702 185224 -82099 -152110 -172800 4038 -73427 -168137 22515 295137
$$ packed form
10009a30298A27470b04615p5844O1920B31971c41826m2606a15007I0006b45647
9998B79425a01091c7136k83249F1433f889j02391A05603a86019f7303j2482C7730
9986a36423j2763b503n7670k12044a6258A18420l7488e8724H8601c96128G906
9974b61735K2139B9630b24900j30800a5929A89063b10908Q8567j40148A63512
9963a69395N4248F8457a51712A51115J75116i0869A53354f7468p5105I796b99780
9951c072A92720b0712B1307J36181c1474l721P532j10366A18123a17464H650J53436
9939A62086c26180H3984h6764j9211j02357F4369b88869P8115E857K47204F5044
9927I7197c61807b7702A85224h2099p0011k0690D038g3427r4710B2515K72622
$$ plain form
9916 295137 125863 -219058 182829 -12706 -375191 -161488 -255570 -194215 -10405 134643
9905 -315925 31494 -50653 -15847 -341455 189314 -55669 -260142 136274 -50020 162277 217382
9894 217382 29708 -114316 -133056 -22886 -78127 65521 -290760 -187976 102698 9687 -161346
9882 -116857 -315746 1074 -231940 214597 18534 -304213 107599 -22923 -230423 -86630 236354
9870 -246968 235669 -76620 8281 -127049 -124686 21859 -80862 -32695 -113443 -165510 40393 -58051
9857 -138155 94129 -109346 305806 -2299 -85740 -29849 338955 18808 46442 31158 58269
9846 58269 -401314 118469 -96508 -135810 -164090 -252631 -263295 -71100 213183 324743 -40020
9834 24430 178858 134400 -158080 -45606 -92025 -126354 -140283 -165163 5657 -214764 -44600
$$ packed form
9916B95137A25863b19058A82829a2706l62485a61488r4082O1355a0405A34643
9905c15925C1494e0653a5847l25608A89314e5669k04473A36274e0020A62277N5105
9894B17382B9708a14316j8740b2886n5241F5521b90760J02784A02698I687a61346
9882a16857j98889A074b31940B14597A8534c04213A07599b2923k07500h6630B36354
9870b46968B35669g6620H281a27049K363B1859h0862c2695q0748n2067D0393e8051
9857a38155I4129a09346C05806b299q3441b9849C38955A8808K7634j5284K7111
9846E8269d01314A18469i6508l9302k8280q8541j0664g1100B13183J11560d0020
9834B4430J54428m4458a58080d5606m6419l4329j3929k4880E657b14764d4600
$$ plain form
9822 -56062 -205475 -237970 -86050 245732 -256018 -75532 112484 -41664 84188 256049 -149310
9810 -90238 -496814 -438203 -77918 59952 150969 45543 105721 22617 99880 -140621 192132
9798 132426 168223 -396759 330875 251562 -152543 -24717 -547 -74973 82006 -200342 86632
9786 280675 -197261 263675 -243658 -184892 -509002 91304 -93584 209632 -82163 -5415 400696
9774 -1590 -48051 -171438 -35533 -394285 -87763 -100314 81358 -345923 -23676 -60361 183809
9762 -53508 -171980 -190221 66601 14682 -209565 -87313 -262912 37870 -95708 322247 -415815
9750 -230493 58552 -89821 -73321 136701 -129839 -125977 66339 -215047 94470 25893 -185139
9738 114188 -76416 -309703 242679 57890 -50244 -80768 130553 486985 -125586 -59528 -105093
$$ packed form
9822e6062j49413l2495h6050B45732b56018g5532A12484d1664H4188J71861a49310
9810i0238m06576N8611g7918E9952R1017D5543O0178B2617P7263a40621A92132
9798A32426L5797c96759C30875p9313a52543b4717e47p4426H2006b00342H6632
9786B80675a97261B63675b43658N8766l24110I1304i3584B09632h2163e415D00696
9774a590m6461j23387c5533l58752h7763j2551H1358c45923b3676l6685A83809
9762e3508j18472j8241F6601A4682b09565h7313j75599C7870i5708C22247d15815
9750b30493E8552h9821J6500A36701a29839L862F6339b15047I4470B5893a85139
9738A14188g6416k33287B42679E7890e0244l0524A30553L56432a25586e9528m5565
$$ plain form
9727 -105093 -184891 -136188 43565 -64778 -320739 116636 -242888 -30750 305580 -225567 -190786
9716 -190786 47981 108502 -83224 -68736 -357510 -109027 -46632 -291927 -200418 3143 36970
9705 36970 320225 -162401 -212054 -453771 130894 3519 -173965 -24175 -116992 -253463 162960
9693 -57930 -73983 -53393 87629 45439 -202722 -128931 -227135 -152899 87323 -113886 -127010
9682 -127010 148279 -246255 -337602 46952 -177028 96730 119114 376252 -27628 -177403 -120287
9671 -120287 95772 -204656 -5025 31220 183428 12359 -75217 -127965 -11400 181813 -58445
9659 -95365 -67305 -292367 -56686 -255191 -37796 -122237 -507503 -93325 -15101 -116300 -191325
9648 -191325 -117762 -226650 -177216 -201349 -293159 -5962 -117885 -286865 -42231 -290820 3240
$$ packed form
9727a05093p9798M8703D3565f4778k55961A16636b42888c0750C05580b25567L4781
9716a90786D7981O0521h3224J4488k88774a09027d6632k45295R1509C143L3827
9705C6970K83255a62401m9653k41717A30894C519a73965b4175r2817j36471A62960
9693e7930j6053K0590H7629m2190b02722P3791r8204P4236H7323a13886j3124
9682a27010A48279b46255r1347D6952a77028I6730K2384K57138b7628j49775N7116
9671a20287I5772b04656e025C1220J52208A2359g5217n2748a1400A81813e8445
9659i5365K8060k25062e6686j98505c7796q4441l85266i3325a5101j01199p5025
9648a91325P3563j08888M9434k4133r1810e962j11923j68980d2231k48589C240
$$ plain form
9636 232191 82803 -15126 32454 35447 175389 -5873 -126746 -142602 -293191 4687 -306760
9624 21187 -142771 113314 26080 -149433 280841 -48373 -95830 -165379 148601 357482 230380
9613 230380 135720 -207540 -368948 -236422 -68141 21997 -65191 -221174 -302859 751 187300
9602 187300 31339 150895 212723 -341550 -87652 172440 17251 -456322 -21997 -340684 268693
9590 -23673 -165480 -456982 285706 -7758 -189073 -81740 -395657 -66434 -78596 -110397 -26379
9578 281144 -370984 48561 -346614 -231870 -4766 -69335 -182975 -6429 -84489 -357294 -42577
9566 160243 -152264 49508 -69699 137677 -65503 59736 -204818 -64790 -184646 -25191 -88508
9555 -88508 -126607 -182415 -147804 -119427 116279 -275151 -311579 -54785 -111258 -454806 -107923
$$ packed form
9636B32191H2803a5126C2454K993J39942e873j20873j5856j50589D687c06760
9624B1187a42771A13314B6080a49433B80841d8373m7457o9549A48601K08881j27102
9613B30380r4660b07540j61408J32526f8141B1997f5191j55983q1685G51J86549
9602A87300C1339J19556O1828c41550h7652A72440A7251d56322b1997l18687B68693
9590b3673j41807k91502B85706g758j81315h1740l13917f6434j2162l1801b6379
9578B81144c70984D8561c46614J14744d766o4569j13640f429p8060k72805d2577
9566A60243a52264D9508f9699A37677f5503E9736b04818f4790j19856b5191o3317
9555h8508l8099n5808L4611K8377A16279b75151l6428e4785n6473l43548a07923
$$ plain form
9543 -62663 186370 -216120 32303 -218925 17972 11669 142555 104653 -106256 -19940 -69917
9532 -69917 -325021 -130637 -110643 -16476 -188906 -167278 -106886 12028 -149971 -21558 -125330
9521 -125330 118453 -220423 -277586 -41325 -108856 209855 216531 -67762 -63635 -96370 282445
9509 -366966 222598 -20329 132818 -15468 119456 -29159 143947 -16650 151650 -112445
9498 -165754 -341838 -15723 180020 115629 50119 -38343 -341401 253934 -66844 -238167 -226454
9487 -226454 210597 177328 -56013 -152346 120387 -51631 -107058 298500 62867 107799 88173
9476 88173 127201 299720 154303 -4388 -102029 -211456 -122065 377977 -274199 54332 -312164
9464 -98501 -181983 -161725 -37761 40489 -203895 91610 128391 -281878 86255 113092 6145 -339089
$$ packed form
9543f2663A86370b16120C2303b18925A7972o303J30886l7902a06256a9940m9977
9532f9917k55104a30637J9994a6476j72430K1628O0392A2028a49971b1558j03772
9521a25330A18453b20423n7163d1325o7531B09855O676f7762M127l2735B82445
9509c66966B22598b0329A32818a5468A19456b9159A43947a6650A51650a12445
9498a65754j76084a5723A80020o4391E0119c8343l03058B53934f6844j71323J1713
9487b26454B10597l3269e6013r6333A20387e1631n5427B98500F2867M4932j9626
9476H8173L9028J72519j45417d388r7641j09427Q9391C77977b74199E4332c12164
9464i8501q3482K0258c7761D0489b03895I1610L6781b81878H6255K6837F145c39089
$$ plain form
9451 15572 -371197 -255850 -153754 -98573 212491 -12937 -152912 -84365 -225818 -244555 52313
9439 -150902 190558 -164680 -296779 -226175 -117013 -92708 -109423 -307549 132658 -8199 123052
9427 323046 -419573 6176 30676 -293402 168978 -135510 -259526 23524 10855 -399672 -219858
9416 -219858 43090 -22313 -245019 -270206 173324 60954 -100498 -346337 106987 64907 111624
9405 111624 -318511 59595 -204694 -96639 133648 -116400 -15685 152468 -282007 91898
9394 -187550 -25915 135482 -75149 -168237 306314 -191432 -210001 -220142 103163 -270089 65699
9382 233234 -92933 35167 145697 103912 -163266 -378762 -298272 -258019 -146968 -169484 -156130
9371 -156130 -284459 -5711 -227924 267992 31380 -206090 -36310 -146853 182287 20927 -476484
$$ packed form
9451A5572c71197J15347J02096N5181B12491a2937j39975O8547j41453j8737E2313
9439a50902A90558a64680j32099P0604J09162K4305j6715j98126A32658h199A23052
9427C23046d19573F176K4500b93402A68978a35510j24016B3524A0855c99672J79814
9416b19858D3090b2313k22706k5187A73324F0954a00498k45839A06987m2080M6717
9405A11624c18511E9595b04694i6639A33648a16400a5685A52468b82007I1898
9394a87550b5915A35482g5149r3088C06314a91432j8569j0141A03163b70089F5699
9382B33234i2933C5167J10530m1785a63266k15496Q0490M0253J11051k2516J3354
9371a56130j28329e711k22213B67992C1380b06090c6310j10543A82287B0927d76484
$$ plain form
9359 -413328 100113 31179 -90412 5438 234305 20664 15002 -163722 205450 -103556 85161
9347 -72859 -24019 23704 -159493 50123 -323714 200409 17542 -86538 -124400 209972 68493
9335 92167 -95900 -235429 -272507 -137038 -263589 -100946 83032 164728 -8368 -9102 132580
9323 -148309 -134607 198399 253975 -4376 -286991 90764 16011 -233381 -310395 -87063 -110901
9312 -110901 -15762 -182301 40561 66173 -311255 -276323 -424113 -53381 -465201 -188556 174937
9300 115273 102498 -62909 -51373 -73009 189840 -285833 170268 43786 -144023 -164844 -148055
9289 -148055 -229582 -266074 -321762 -167675 -123803 -149143 -554190 -348949 96134 -138451 5914
9277 34577 -37035 -118714 -89276 -66734 142121 -12179 67541 -299670 -148557 -127519 -173274
$$ packed form
9359d13328A00113C1179i0412E438K28867B0664n662a63722B05450a03556H5161
9347g2859b4019B3704a59493E0123c23714B00409A7542h6538l7862B09972F8493
9335I2167i5900j39529l7078J35469j26551a00946H3032Q1696h368p34A32580
9323a48309J3702A98399N5576d376k82615I0764A6011b33381p7014h7063k3838
9312a10901a5762j66539D0561K5612c11255L4932j47790e3381m11820a88556A74937
9300A15273j2775f2909J1536k1636A89840b85833A70268D3786a44023k0821J6789
9289a48055q1527l6492n5688J54087M3872k5340m05047K05241I6134a38451E914
9277C4577c7035q1679K9438K2542A42121a2179F7541b99670a48557K1038m5755
$$ plain form
9266 -173274 46768 -43478 -291917 31587 -205985 -371557 -189549 -188070 13376 -241260 -121060
9255 -121060 94180 -13191 -67248 -172413 268565 180477 94997 1173 -121515 -262088 -115063
9243 -37015 84228 -123620 18275 -214118 -225991 -437761 -186303 -112889 58070 46616 -191474
9231 13059 -94009 116176 -2422 17228 -494889 184616 -194687 149531 -31124 48737 -165166
9219 -69067 158038 44518 75977 736 -115939 -141410 -414589 288179 91912 -34228 -232177
9208 -232177 -327643 -4235 -345963 -44810 -74734 -50873 -190976 89745 -106193 318544 -86178
9196 -184007 -189402 -103231 -136640 -180583 -129398 387945 -126793 -317021 -125925 -47323 -295267
9185 -295267 -22511 -264016 -55306 -160390 -83380 153695 257167 -166641 -16011 -269488
$$ packed form
9266a73274D6768d3478k48439C1587b05985j65572J82008J479A3376b41260J20200
9255a21060I4180a3191n4057j05165B68565q8088q5480A173a21515j40573a15063
9243c7015H4228a23620A8275b14118j1873k11770a86303P3414E8070j1454a91474
9231A3059i4009A16176b422A7228d94889A84616a94687A49531c1124D8737a65166
9219f9067A58038D4518L1459G36a15939k5471k73179B88179I1912c4228j97949
9208b32177r5466d235l41728d4810k9924K3861j40103H9745a06193C18544h6178
9196a84007n395Q6171l3409m3943N1185C87945a26793j90228a25925d7323k47944
9185b95267b2511k41505e5306j05084P7010A53695J03472a66641a6011k53477
$$ plain form
9175 -269488 -363735 329463 -203678 79862 -143205 -97347 221725 -55647 193098 -29452 -115357
9164 -115357 -16714 -252218 -147875 -211831 58072 308089 -30756 61760 -34607 63640 -21064
9152 -235193 -51150 78935 -384568 20482 2142 -170 -54882 -83041 136557 -149652 61089 -54291
9139 45813 -16800 -547425 24492 135709 -49777 -51032 78284 32018 105286 -71686 -67929 347021
9126 -57751 175545 -128498 81968 -282058 -173694 27984 -164808 -145853 37717 347147 -38837
9114 -199991 -14549 276441 -179910 29709 318357 -193224 -74816 -144011 -441287 155348
9103 -34581 116843 -361938 -67086 162683 187915 -47204 -118070 164859 51566 155149 90221
9092 90221 -167711 105636 -250761 202666 -165423 49382 -127537 -163178 -205220 107782
$$ packed form
9175b69488r4247C29463b03678G9862a43205M5858B21725e5647A93098b9452q5905
9164a15357a6714k35504J04343o3956E8072K50017c0756F1760c4607F3640b1064
9152b35193e1150G8935c84568B0482B142a70n4712k8159A36557a49652F1089e4291
9139D5813a6800n30625B4492J11217d9777j255G8284C2018P3268g1686L757C47021
9126e7751A75545a28498H1968b82058J08364B7984a64808J8955C7717L09430c8837
9114a99991a4549B76441a79910B9709K88648a93224g4816o9195k97276A55348
9103c4581A16843c61938f7086A62683K5232d7204p0866A64859E1566J03583o4928
9092I0221a67711A05636b50761B02666a65423D9382a27537l5641m2042A07782
$$ plain form
9081 -209779 -41248 -370145 -196692 102724 -120974 149898 26225 299811 -15897 114601
9070 -155172 -226249 -65019 70873 -134299 -36773 -286932 -346067 -284012 -354511 264331 130082
9058 -105024 52281 -196430 82871 -126626 -22353 -186880 54755 246378 -224795 247293
9047 -97950 -161427 -346348 -56844 187898 78568 -54654 -12394 119779 -93463 -127922 -157536
9036 -157536 -84750 3708 -224913 -190340 225589 103819 208159 -165756 -153535 -148666 51919
9024 -37403 55232 -511821 135548 -30783 60357 11566 -117139 -330270 3222 87704 220655
9013 220655 69425 -86875 -217303 -340010 -100165 -97569 54690 -64581 -368829 -58876 186516
9001 155325 176707 -83066 -84009 293565 94266 111774 347718 24803 -268726 109394 -180291
$$ packed form
9081b09779d1248l28897J73453A02724a20974A49898B6225K73586a5897A14601
9070a55172p1077f5019G0873a34299c6773k50159n9135O2055p0499B64331A30082
9058a05024E2281a96430H2871a26626b2353j64527E4755J91623b24795B47293
9047i7950o3477j84921e6844A87898G8568e4654a2394A19779i3463l4459k9614
9036a57536P2786C708b24913L4573B25589A03819J04340a65756J2221M869E1919
9024c7403E5232e11821A35548c0783F0357A1566a17139k13131C222Q4482J32951
9013B20655F9425h6875j30428j22707a00165K596E4690f4581l04248e8876A86516
9001A55325K1382h3066r43B93565I4266J7508K35944B4803b68726A09394a80291
$$ plain form
8989 -102019 -8065 -248275 -175585 78655 173350 -187426 140160 -169012 -292225 -96923 85261
8977 -126709 63347 -51957 8778 -120829 101641 -33389 -158514 91530 463895 -127202 -67576
8966 -67576 -176716 -80403 -113020 -416532 -62797 -78845 -30802 -98960 16650 -182984 77521
8954 143895 18705 130710 -164787 92974 256561 232457 39944 73271 -64721 15282 -135801
8942 -143849 135579 161453 253265 55167 -6395 64749 108562 -118884 -130937 -506134 11174
8930 -185118 -219848 116158 -209829 -216504 37969 93222 -199637 -2969 45164 312974 -36559
8918 -138915 34527 -160782 298345 36698 23031 78867 222308 -54174 157975 -81487 -214464
8907 -214464 -487440 75124 -21480 -460803 -298814 -113832 -31196 30898 -120253 40533 91511
$$ packed form
8989a02019h065k40210P2690G8655R4695a87426A40160a69012j23213i6923H5261
8977a26709F3347e1957H778a20829A01641c3389j25125I1530L72365a27202N9626
8966f7576j09140h0403l2617l03512f2797j6048c0802o8158A6650a82984G7521
8954A43895A8705J12005a64787I2974J63587k4104C9944L3327f4721A5282a35801
8942a43849A35579K5874R1812E5167f395F4749M3813a18884j2053l75197A1174
8930a85118l4730A16158b09829o675C7969N5253a99637b969D5164K67810c6559
8918a38915C4527a60782B98345C6698j3667N5836J43441e4174A57975h1487j32977
8907b14464k72976G5124b1480m39323J61989a13832c1196C0898a20253D0533N0978
$$ plain form
8896 91511 244055 -239975 70939 -117982 -100261 -62738 -146718 -207825 170615 -335968 -286722
8885 -286722 8319 -208133 52132 -271111 -5847 -166820 99159 -93520 -350159 94242 189134
8874 189134 -50695 35520 -96809 -21653 -488823 -97345 -134298 -77389 -1692 41865 -69756 54035
8861 118520 6206 -124879 57632 -85497 -143319 148804 5960 -222850 -352494 -33727 -154396
8850 -154396 86408 -228723 193283 56754 -164754 60646 -169595 -332267 25666 -84934 29972
$$ packed form
8896I1511J52544b39975G0939a17982J7721L7523q3980o1107A70615c35968M9246
8885b86722H319b08133E2132b71111e847j60973I9159i3520k56639I4242R4892
8874A89134e0695C5520i6809b1653m67170i7345l6953N6909a692D1865f9756E4035
8861A18520F206a24879E7632h5497n7822A48804E960b22850j29644c3727j20669
8850a54396H6408b28723A93283E6754a64754F0646a69595j62672B5666h4934B9972
$$ [...]
##END NTUPLES=NMR SPECTRUM
##END=
